##TITLE=1H_SR138_oil
 CDCl3
 8 sc, 
 20.10.2022
##JCAMPDX= 6.0         $$ Bruker NMR JCAMP-DX V2.0
##DATA TYPE= NMR FID
##DATA CLASS= NTUPLES
##ORIGIN= UXNMR, Bruker Analytische Messtechnik GmbH
##OWNER= root
$$ XWIN-NMR		Version 3.5
$$ Thu Oct 20 15:26:01 2022 Russian Standard Time (UT+4h)  she@DPX200
##.OBSERVE FREQUENCY= 200.1313499994
##.OBSERVE NUCLEUS= ^1H
##.DELAY= (6, 6)
##.ACQUISITION MODE= SIMULTANEOUS
##.ACQUISITION SCHEME= undefined
##.AVERAGES= 8
##.DIGITISER RES= 18
##SPECTROMETER/DATA SYSTEM= spect
##.PULSE SEQUENCE= zg30
##.SOLVENT NAME= CDCl3
##.SHIFT REFERENCE= (INTERNAL, CDCl3, 0, 15.7039)
##AUDIT TRAIL= $$ (NUMBER, WHEN, WHO, WHERE, WHAT)
$$ ##TITLE= Audit trail, XWIN-NMR		Version 3.5
$$ ##JCAMPDX= 5.01
$$ ##ORIGIN= Bruker BioSpin GmbH
$$ ##OWNER= she
$$ F:/spectra/data/she/nmr/H-F/1/audita.txt
$$ ##AUDIT TRAIL=  $$ (NUMBER, WHEN, WHO, WHERE, WHAT)
(   1,<2022-10-20 15:19:58.34 +0400>,<she>,<DPX200>,
      <created by zg, POWCHK disabled, PULCHK disabled
       configuration hash MD5:
       00 E9 B6 7A A2 85 ED C7 34 08 36 98 17 FE 4E 26
       data hash MD5: 16K
       FE F7 73 D7 6C 82 38 D0 57 EC BE 33 ED 0B C1 D2>)
$$ ##END=
$$ 
$$ hash MD5
$$ 54 C6 81 AC F2 42 F7 83 00 4F D5 9E 3F F6 A5 3E
##$RELAX= 
##$RELAX= 
##$RELAX= 
##$RELAX= 
##$RELAX= 
##$RELAX= 
$$ Bruker specific parameters
$$ --------------------------
##$DU= <F:/spectra>
##$EXPNO= 1
##$NAME= <H-F>
##$PROCNO= 1
##$TYPE= <nmr>
##$USER= <she>
##$AMP= (0..31)
100 100 100 100 100 100 100 100 100 100 100 100 100 100 100 100 100 100 
100 100 100 100 100 100 100 100 100 100 100 100 100 100 
##$AQSEQ= 0
##$AQ_mod= 1
##$AUNM= <au_zg>
##$AUTOPOS= <>
##$BF1= 200.13
##$BF2= 200.13
##$BF3= 200.13
##$BF4= 200.13
##$BF5= 200.13
##$BF6= 200.13
##$BF7= 200.13
##$BF8= 200.13
##$BYTORDA= 1
##$CFDGTYP= 0
##$CFRGTYP= 5
##$CHEMSTR= <none>
##$CNST= (0..31)
1 1 145 1 1 1 1 1 1 1 1 1 1 1 1 1 1 1 1 1 1 1 1 1 1 1 1 1 1 1 1 1 
##$CPDPRG= <>
##$CPDPRG1= <>
##$CPDPRG2= <>
##$CPDPRG3= <>
##$CPDPRG4= <mlev>
##$CPDPRG5= <mlev>
##$CPDPRG6= <mlev>
##$CPDPRG7= <mlev>
##$CPDPRG8= <mlev>
##$CPDPRGB= <>
##$CPDPRGT= <>
##$D= (0..31)
0 1.2 0 0 0 0 0 0 0 0.06 0 0.03 0 0 0 0 0.0002 0 0 0 0 0 0 0 0 0 0 0 0 
0 0 0 
##$DATE= 1666264797
##$DBL= (0..7)
120 120 120 120 120 120 120 120 
##$DBP= (0..7)
150 150 150 150 150 150 150 150 
##$DBP07= 0
##$DBPNAM0= <>
##$DBPNAM1= <>
##$DBPNAM2= <>
##$DBPNAM3= <>
##$DBPNAM4= <>
##$DBPNAM5= <>
##$DBPNAM6= <>
##$DBPNAM7= <>
##$DBPOAL= (0..7)
0.5 0.5 0.5 0.5 0.5 0.5 0.5 0.5 
##$DBPOFFS= (0..7)
0 0 0 0 0 0 0 0 
##$DE= 6
##$DECBNUC= <off>
##$DECIM= 32
##$DECNUC= <off>
##$DECSTAT= 4
##$DIGMOD= 1
##$DIGTYP= 9
##$DL= (0..7)
0 120 120 120 120 120 120 120 
##$DP= (0..7)
150 150 150 150 150 150 150 150 
##$DP07= 0
##$DPNAME0= <>
##$DPNAME1= <>
##$DPNAME2= <>
##$DPNAME3= <>
##$DPNAME4= <>
##$DPNAME5= <>
##$DPNAME6= <>
##$DPNAME7= <>
##$DPOAL= (0..7)
0.5 0.5 0.5 0.5 0.5 0.5 0.5 0.5 
##$DPOFFS= (0..7)
0 0 0 0 0 0 0 0 
##$DQDMODE= 0
##$DR= 18
##$DS= 0
##$DSLIST= <SSSSSSSSSSSSSSS>
$$ [...]
##$SUBNAM2= <"">
##$SUBNAM3= <"">
##$SUBNAM4= <"">
##$SUBNAM5= <"">
##$SUBNAM6= <"">
##$SUBNAM7= <"">
##$SUBNAM8= <"">
##$SUBNAM9= <"">
##$SW= 18.0517283424941
##$SWIBOX= (0..15)
0 0 2 0 0 0 0 0 0 0 0 0 0 0 0 0 
##$SW_h= 3612.71676300578
##$TD= 16384
##$TD0= 1
##$TE= 0
##$TE2= 300
##$TE3= 300
##$TEG= 300
##$TL= (0..7)
0 120 120 120 120 120 120 120 
##$TP= (0..7)
150 150 150 150 150 150 150 150 
##$TP07= 0
##$TPNAME0= <>
##$TPNAME1= <>
##$TPNAME2= <>
##$TPNAME3= <>
##$TPNAME4= <>
##$TPNAME5= <>
##$TPNAME6= <>
##$TPNAME7= <>
##$TPOAL= (0..7)
0.5 0.5 0.5 0.5 0.5 0.5 0.5 0.5 
##$TPOFFS= (0..7)
0 0 0 0 0 0 0 0 
##$TUNHIN= 0
##$TUNHOUT= 0
##$TUNXOUT= 0
##$USERA1= <user>
##$USERA2= <user>
##$USERA3= <user>
##$USERA4= <user>
##$USERA5= <user>
##$V9= 5
##$VALIST= <valist>
##$VCLIST= <CCCCCCCCCCCCCCC>
##$VD= 0
##$VDLIST= <DDDDDDDDDDDDDDD>
##$VPLIST= <PPPPPPPPPPPPPPP>
##$VTLIST= <TTTTTTTTTTTTTTT>
##$WBST= 1024
##$WBSW= 4
##$XGAIN= (0..3)
0 0 0 0 
##$XL= 0
##$YL= 0
##$YMAX_a= 261343
##$YMIN_a= -210611
##$ZGOPTNS= <>
##$ZL1= 120
##$ZL2= 120
##$ZL3= 120
##$ZL4= 120
##$ABSF1= 10
##$ABSF2= 0
##$ABSG= 5
##$ABSL= 3
##$ALPHA= 0
##$AQORDER= 0
##$ASSFAC= 0
##$ASSFACI= 0
##$ASSFACX= 0
##$ASSWID= 0
##$AUNMP= <proc_1d>
##$AZFE= 0.1
##$AZFW= 0.1
##$BCFW= 1
##$BC_mod= 2
##$BYTORDP= 1
##$COROFFS= 0
##$CY= 11.3945322036743
##$DATMOD= 1
##$DC= 2
##$DFILT= <>
##$DTYPP= 0
##$F1P= 2.36226072786647
##$F2P= -0.459571619588291
##$FCOR= 0.5
##$FTSIZE= 0
##$FT_mod= 4
##$GAMMA= 1
##$GB= 0.15
##$INTBC= 1
##$INTSCL= 1
##$ISEN= 128
##$LB= 0.24
##$LEV0= 0
##$LPBIN= 0
##$MAXI= 10000
##$MC2= 0
##$MEAN= 0
##$ME_mod= 0
##$MI= 1.114404
##$NCOEF= 0
##$NC_proc= 0
##$NLEV= 6
##$NOISF1= 3.799351
##$NOISF2= 2.8
##$NSP= 1
##$NTH_PI= 0
##$NZP= 0
##$OFFSET= 15.70392
##$PC= 1
##$PHC0= -18035.48
##$PHC1= 14.4007
##$PH_mod= 1
##$PKNL= yes
##$PPARMOD= 0
##$PSCAL= 0
##$PSIGN= 0
##$REVERSE= no
##$SF= 200.130013532006
##$SI= 16384
##$SIGF1= 3
##$SIGF2= 2
##$SINO= 400
##$SIOLD= 16384
##$SREGLST= <1H.CDCl3>
##$SSB= 0
##$STSI= 0
##$STSR= 0
##$SW_p= 3612.71676300578
##$SYMM= 0
##$S_DEV= 0
##$TDeff= 0
##$TDoff= 0
##$TI= <>
##$TILT= no
##$TM1= 0
##$TM2= 0
##$TOPLEV= 0
##$USERP1= <user>
##$USERP2= <user>
##$USERP3= <user>
##$USERP4= <user>
##$USERP5= <user>
##$WDW= 1
##$XDIM= 8192
##$YMAX_p= 0
##$YMIN_p= 0
$$ End of Bruker specific parameters
$$ ---------------------------------
##NTUPLES= NMR FID
##VAR_NAME=  TIME,          FID/REAL,        FID/IMAG
##SYMBOL=    X,             R,               I
##VAR_TYPE=  INDEPENDENT,   DEPENDENT,       DEPENDENT
##VAR_FORM=  AFFN,          ASDF,            ASDF
##VAR_DIM=   8192,          8192,            8192
##UNITS=     SECONDS,       ARBITRARY UNITS, ARBITRARY UNITS
##FACTOR=    0.0002768,     1,               1
##FIRST=     0,             0,               0
##LAST=      2.2672688,     0,               0
##MIN=       0,             -210611,         0
##MAX=       2.2672688,     261343,          0
$$ Real data points
##PAGE= N=1
##DATA TABLE= (X++(R..R)), XYDATA
0@%%%%%%%%%%%Qj6J6j6K4l2L2m0M9n7P2q8J04j20J39j63J92k24K56k90L31l78
$$ 0 0 0 0 0 0 0 0 0 0 0 0 8 -8 8 -8 16 -16 16 -24 25 -32 40 -48 56 -64 75 -88 104 -120 136 -154 177 -201
33b01M28m84N46o12O86p67Q56r54J059j177J307j446J597j763J944k143K362k602
$$ -201 227 -257 289 -323 363 -404 452 -502 557 -620 687 -759 838 -925 1019 -1124 1238 -1364
51a364K867l158L482l847M257m721N251n864O583p442Q484r783J1461j3715J6923
$$ -1364 1503 -1655 1827 -2020 2237 -2484 2767 -3097 3486 -3956 4528 -5255 6206 -7509 9414
66I414k1900L0756n1329J92341J02061k57780r7781n4400R9977J37213J08790
$$ 9414 -12486 18270 -33059 159282 261343 3563 -94218 -148618 -48641 88572 197362
77A97362l3624j21076j66201o8522O1124J40572P0817m385p3763j14581p3800
$$ 197362 163738 42662 -123539 -192061 -130937 9635 80452 76067 2304 -112277 -186077
88a86077N6467J08107R1680L3751m0967j01412o9987K8954J12571J02515L1346
$$ -186077 -129610 -21503 70177 103928 62961 -38451 -108438 -79484 33087 135602 166948
99A66948o9461j20884o5328K8997Q0309R5482L5773q1627j39008q4252K2144J06469
$$ 166948 97487 -23397 -88725 -59728 20581 116063 151836 70209 -68799 -153051 -130907 -24438
111b4438J13954K7171j03712j37917m2145N6720J03053R7188J3631p2550q6581
$$ -24438 89516 116687 12975 -124942 -167087 -110367 -7314 89874 103505 30955 -55626
122e5626n0172K5646J06230J00872N902p4526p8440m1459O416O4125P1901J1141
$$ -55626 -105798 -80152 26078 126950 132852 58326 -20114 -61573 -55157 8968 80869 92010
134I2010m6194p1836o0565L745O2121O0335J8225l5747o9997n3791J1508P1761
$$ 92010 45816 -26020 -86585 -82840 -20719 39616 57841 22094 -47903 -101694 -90186 -18425
146a8425O8352K1705k6497o6851n8974J1923P1950P7023L2433m4218q8111n8976
$$ -18425 49927 71632 45135 -21716 -80690 -68767 3183 80206 112639 68421 -19690 -78666
158g8666J4189O9045O7601K0657m0657q1266n4098J0047N1438O0764K6645l7900
$$ -78666 -64477 4568 72169 92826 52169 -29097 -83195 -73148 -21710 39054 65699 27799
170B7799o6077l7844J1294M8409N3081K4267k3607n0733l4296J892L6206N3444
$$ 27799 -38278 -76122 -64828 -16419 36662 60929 37322 -13411 -47707 -45815 -9609 43835
182D3835K3535k3912m3905l6816p773L4194M8254J9668k4129m8023l6713o047
$$ 43835 67370 43458 -447 -37263 -45036 -10842 37412 57080 32951 -15072 -51785 -57832
194e7832L5130N2531K2087k2367m7852m4417Q49M8288N2906K1582j9874m8864
$$ -57832 -22702 29829 51916 29549 -18303 -62720 -61871 -13583 39323 60905 41031 -7833
206g833m2514r61M2695N0048J9826j7582m5029m1702k194L1825L7276J8944j5231
$$ -7833 -50347 -51308 -8613 41435 61261 43679 -1350 -43052 -45246 -13421 23855 42799 27568
219B7568l7271k7538j383K2298K8604J6803q066l0699k5915K072K3025L0213J9633
$$ 27568 -9703 -37241 -38624 -16326 12278 29081 21015 -9684 -35599 -33527 -10502 19711 39344
232C9344q729l0063k7344o420K1502L4343K1163q455l2818l1525r931J9063L8082
$$ 39344 30615 552 -26792 -33212 -11710 22633 43796 35341 2523 -29002 -38933 -19870 18212
245A8212K3758j2828l4147l1028q283K1286L4867K2235o307k9812k9962p195K2679
$$ 18212 41970 29142 -5005 -36033 -44316 -23030 11837 34072 27765 -2047 -32009 -39204 -16525
258a6525L4385J8065o944k3909k5572p653J7195K5173J5323k860j9697k2008q436
$$ -16525 17860 35925 28981 5072 -20500 -28153 -10958 14215 29538 26678 6981 -15027 -23463
271b3463J1168K0592J3293l643j8954k0619n383J2157J9786J6492j167k0309k3859
$$ -23463 -12295 8297 21590 17947 -1007 -21626 -27009 -14852 4934 21426 20259 -50 -23909
284b3909p678J4052K6883K1318l14k3207k7253j0001J2866K6600K1843n50k0559
$$ -23909 -31587 -17535 9348 30666 30352 7145 -20108 -30109 -17243 9357 31200 30650 10091
297A0091k4283j2376R222K3937J8277k786j9634j9093o242Q867J8049J2821l019
$$ 10091 -14192 -26568 -17346 6591 24868 22082 2448 -16645 -22887 -14020 4029 16850 13831
310A3831j3830j4449n422Q983J6070J0572q68j1578j3943o391O811J5240J0967
$$ 13831 1 -14448 -19870 -10887 5183 15755 14887 3309 -10634 -17025 -10214 5026 15993
323A5993J003q531j5535j0109M409J6123J4378K582j3333j9091j0935O097J7913
$$ 15993 16996 8465 -7070 -17179 -12770 3353 17731 20313 6980 -12111 -23046 -16949 964
336I64J7470M274j3736k1733j1789O497J7500J7589M267j2768j8820r688N934
$$ 964 18434 22708 8972 -12761 -24550 -18053 -553 17036 21303 8535 -10285 -19973 -14039
349a4039J5097J2680J378r828j2041n133M324J0398Q811j638r739q464k333M449
$$ -14039 1058 13738 15116 5288 -6753 -11886 -7562 2836 11647 10009 270 -8194 -10527 -6078
363f078R784Q410j20q957j0342n954K785J0273J0765L440n872j2205j1231j93
$$ -6078 3706 12116 11996 3039 -7303 -13257 -10472 -199 10566 14006 8134 -4071 -15302 -15495
377a5495J1646J3297N399m393j2872j2293j157J1472J3806N581n960j3002r804
$$ -15495 -3849 9448 14847 10454 -2418 -14711 -15868 -4396 9410 14991 9031 -3971 -13775
390a3775J944J0772J1911M260o831j3164p114L797Q795Q183J401n456r557m695
$$ -13775 -11831 -1059 10852 15112 8281 -4883 -11997 -8200 595 8778 10179 4723 -4834 -9529
404i529L403O976N536N03n525p098k760J958N725P367J931n507p731m332j57O205
$$ -9529 -6126 850 6386 6889 1364 -5734 -8494 -6536 -811 6556 8487 2980 -4751 -9083 -9240 -3035
420c035J0020O424k913j0018r211l712O299J1826O959j921q187j0000m325N805
$$ -3035 6985 13409 10496 478 -8733 -12445 -6146 5680 12639 10718 2531 -7469 -11794 -5989
434e989R709N275k108p085q157r84P269P431J231l771o960n001K340Q408O793
$$ -5989 3720 8995 6887 -198 -8355 -9339 -2070 5361 6592 2821 -4139 -9140 -6800 1608 8401
449H401M17m534q046m714K278O330M837K924k253p208n276J638M054L753L204
$$ 8401 8818 4284 -3762 -8476 -6198 132 4969 7893 5640 -1568 -6844 -5206 -1152 2601 5805
464E805m59n283n699j784K777O858N907j220o027m843k806J297O541O805o29n714
$$ 5805 5346 63 -5636 -7420 -4643 2215 8122 6902 875 -3968 -6774 -5477 1064 7869 7240 1526
480A526n604l315J513O635M878j641m138m370j370L638N458J585k540l442l213
$$ 1526 -4078 -7393 -5880 755 5633 3992 -146 -4516 -5886 -2248 3210 4795 2255 -1187 -4400
495d400n11N420O372J199l419n142m778q33M767N779J948j047m365o165k895J803
$$ -4400 -4911 509 6881 8080 4661 -481 -5259 -6092 -1325 4454 6402 5355 990 -5175 -8070 -6267
511f267L881M413K668l320n362j445J971K367K811K751j714m017j862J739M117
$$ -6267 -2386 2027 4695 1375 -3987 -5432 -3461 -1094 1717 4468 2754 -1263 -3125 -1386 2731
526B731M090j11m618l161k86M05L441L275k229n323k906l51Q50L106L518j084
$$ 2731 6821 6710 2092 -1069 -1355 -950 2491 5766 3537 -1786 -4692 -5043 -4193 -1087 2431 1347
542A347l913k669r48K778M682J628j342q90j432k272J078N392L951l44k025l990
$$ 1347 -2566 -5235 -6183 -3405 1277 2905 1563 673 -759 -3031 -1953 3439 7390 7046 5021 1031
558A031l753J58K895K215J699m10m059m323n47J959J376K184m69m047j355K960
$$ 1031 -2722 -2564 331 2546 4245 3835 -224 -4547 -5094 -3135 -1759 425 -44 -4091 -5446 -2486
574b486K886O14M94k155k515P56L798K652K166J29l765m388l17J991J970K735
$$ -2486 400 1014 1508 -647 -3162 -2406 1392 4044 6210 6339 2574 -1814 -2131 -140 1830 4565
590D565Ll729l139p67j139M30L412J574j263j983j076o96K077K273J39%L26j371
$$ 4565 4568 839 -2300 -3067 -4206 -3776 -364 1210 -53 -2036 -3112 -3808 -1731 542 681 681 1007 -364
608c64j164K232L029R76o91k090l247j188K456K274l92j183j690k255Q66K596
$$ -364 -1528 704 3733 4709 4018 1928 -1319 -2507 -51 2223 1831 648 -1042 -3297 -2431 165
624A65Q21m89j407k472r11K368L525Q43J48r76k862p09J722J692J401J038n94
$$ 165 986 497 -910 -3382 -4293 -1925 1600 2443 2591 1615 -1247 -1956 -234 1458 2859 3897 3303
641C303l300k017r76O20J852J949N1j131q93j394j284J568J799Qr1l69m27J295
$$ 3303 3 -2014 -2990 -2370 -518 1431 1482 351 -542 -1936 -3220 -1652 147 155 64 -305 -732 563
659E63K092K41j630j562p87J66K216K203l74j945j948k383k52K054K422j45j188
$$ 563 2655 2896 1266 -296 -1083 -917 1299 3502 3128 1183 -765 -3148 -3400 -1346 1076 931 -257
676b57j554j243L2K021J547M68J9p72j384P08Q38J271P98N99r76j721K0k46K99
$$ -257 -1811 -3054 -3022 -1001 546 1014 1033 261 -1123 -415 423 1694 2492 3091 2115 394 414 168 467
695D67P90P95j211k015r63q91O55J548J15r50j08K36M78J586L96j116j653J3J058
$$ 467 1257 2052 841 -1174 -2137 -3028 -2373 -825 -710 -1660 -1768 -1532 -1054 532 928 -188 -1841 -1828 -770
714g70K527K124Q45j489k599j656l5J587J519O19j145j095j392j421k4R59K15
$$ -770 1757 3881 4726 3237 638 -1018 -1053 534 2053 2672 1527 432 -960 -2381 -2405 -1446 -1231
731a231O11M97n69q59k18k5L98J140R31j95j67P82J96M38P00q80j251n52N52R46
$$ -1231 -620 -123 -692 -1551 -1769 -1794 -1396 -256 675 480 313 1095 1291 1729 2429 1549 298 -254 298 1244
751A244M32J36j349j549q47P45Q33J092k49j762j228L60J239J392O82l89j471
$$ 1244 1676 1812 463 -1086 -1933 -1188 -355 737 488 -1274 -2502 -2142 -903 489 1171 782 -689
768f89q62J78J097J312J092j70p07n92q77m01L97N95J15L85L23p87j082j58j31
$$ -689 -1551 -1373 -276 1036 2128 1958 1251 659 -218 -619 -222 373 488 873 1196 409 -673 -831 -962
787i62M07M48L26j82m4O4J79n03j22o59k08J247J186Q95kj640j996p67O55J489
$$ -962 -555 -107 219 37 -7 57 236 -267 -389 -1048 -1256 -9 1177 2072 2070 430 -1566 -2333 -1678 -189
807a89J005N88n47q91p33k10K35J113M92l54o73%K11k95M81M15q1l69J64m55J80
$$ -189 816 1404 857 -34 -767 -977 -742 371 863 509 -164 -164 47 -248 233 648 567 198 362 -93 87
828H7J18q3k31k62m29l90R6P10J14m36o7N24J79O44L0j63p41n30L4J231J047R22
$$ 87 205 122 -109 -371 -800 -1190 -1094 -384 -270 -706 -773 -249 -70 574 604 441 -300 -830 -796 435 1482 2404
850B404n41r34r71o99J59J032L60K27L07j139q79q65j32j7P69N85O22Jj99r77
$$ 2404 1863 929 -42 -741 -582 450 810 1037 1344 205 -674 -1539 -1671 -1688 -919 -334 288 289 90 -887
870h87o53K73J265j99O24P27m76M19R6O7n49o69L56K75R51K89r33j157j100l86
$$ -887 -1540 -1267 -2 -201 423 1150 674 1093 1189 1256 707 38 394 669 1620 1909 976 -181 -1281 -1667
890a667K74J521K77p05p66r1l37O77L58K24j86m00j61P48R73J79J64K22j44j06
$$ -1667 -1393 128 405 -300 -1066 -1157 -1494 -817 -459 -235 -421 -821 -982 -234 739 918 1082 1304 1160 1054
910A054n81l55L23k99M07N28J55o19p49n52p86P85Q5M9n7K9K5k39K74n08l89O62
$$ 1054 473 118 441 142 549 1077 1232 613 -136 -688 -1474 -689 -604 -555 -612 -583 -558 -797 -523 -1031 -1420 -758
932g58R30J001Q22n71r71j290K92L64R29R35j05o64r54m19M4K33J7P0l43N11J69
$$ -758 172 1173 1995 1424 453 -837 -545 -181 748 1683 1578 914 -40 -459 -415 -182 -165 -95 -438 73 242
953B42o06l88k76j89j59Q08R43M9q8o24J05M75K1j30m8M29l56J14N15l84m28k92
$$ 242 -364 -752 -1028 -1217 -1376 -568 375 424 336 -288 -183 292 313 183 135 564 208 322 837 453 25 -267
975b67O83J5J37m97l79o91M85O23L27K38o81q63m09P18O64R29O4q30o62j36K43
$$ -267 416 431 568 71 -308 -999 -514 109 436 674 -7 -870 -1279 -561 103 1032 1096 266 -396 -532 -289
996b89n13J85O01J50L08M40l96n71o61k92K11R25R72k98j89m0l52o57K93O07m54
$$ -289 -802 -617 -16 134 442 882 486 -85 -746 -1038 -827 98 1070 772 583 543 191 -466 -173 434 -20
1017b0K42L62M45m29j025r83j96O75O34O37K40m45j079n28P52J018J06j16m02
$$ -20 222 584 1029 600 -425 -1408 -1604 -929 -295 342 582 137 -942 -1470 -718 300 406 290 -112
1036a12K77m8Q46L7j46m01l64K57O88j5o57m50Q4k82o6M27m08p91j24K76L80P32
$$ -112 165 117 963 1000 854 453 89 346 1034 1019 362 -88 -4 -286 -352 75 -333 -1124 -1248 -972 -592 140
1058A40j63k6j84m69RM44k6K96L49Q11P30p07p44l33l46N5R63L49M8q31p49o11
$$ 140 -23 -49 -233 -702 -693 -249 -275 21 370 1181 1911 1204 460 127 -219 -164 799 1148 1196 365 -384 -995
1080i95QL77J39J78K73q8r3K62j36q30n41R23O42M29N42J06q72m66L63J74j77
$$ -995 -987 -610 -471 -293 -20 -108 -201 61 -75 -905 -1446 -523 119 548 1090 1196 324 -142 221 395 218
1101B18K76k76l03L91j92k94Ln15q0O02P18k80n74j6k89O9Q21K60l5p24k79N2
$$ 218 494 218 -85 306 114 -180 -177 -692 -772 -170 548 268 -306 -322 -611 -542 279 539 504 -220 -499 -447
1123d47P57N49k20p23K73p54k8K31N13j33n22J98P41j13l80n99j8N98L08N30J67
$$ -447 310 859 639 -84 189 -565 -593 -362 151 18 -504 -306 435 322 -58 -657 -675 -77 231 761 928
1144I28M4q12o31L17L78n0J9K76M8p3l80k65q36j46J7M18Q47K36p40m2j84p8O52
$$ 928 972 160 -471 -154 224 174 193 469 517 444 64 -201 -1037 -1183 -1166 -748 99 335 -405 -447 -631 -709 -57
1167e7L78N79o03L1L35K60j33l47k97J99J8J67J88j67r03n17K91L54k71q0j55
$$ -57 321 900 297 328 663 923 790 443 146 345 363 530 718 551 -352 -869 -578 -224 -495 -575 -730
1188g30k06J55J88P42J53l89k53j1L40M79k33L64M21J7p4J66o87l95m87M45L22
$$ -730 -936 -781 -593 149 302 -87 -340 -351 -11 468 235 599 1020 1037 963 1129 442 47 -440 5 327
1209C27Q8K09l29q71m62j91M15L34Q6k2L93K41j74l43M3k36J64P13Q36k4l25p16
$$ 327 415 624 295 -576 -1038 -1229 -814 -480 -394 -416 -23 218 44 -299 -256 -492 -328 385 1221 1197 872 156
1231A56j10J28Q1K16j3J34m33k03J28j48o64n36L25O83J2N66j87p46j30K13N26
$$ 156 46 174 255 471 458 592 159 -44 84 -64 -728 -1264 -939 -256 -244 322 135 -611 -741 -528 -2
1252bM11j94m17Q0K12J62L64J62k99n57n83P45L08j75l72M3J73j61K61P7j91n57
$$ -2 409 215 -202 -122 90 252 616 778 479 -78 -661 84 392 217 -155 -112 61 -100 161 238 47 -510
1274e10J25L72O59n3o48p8n01l5L95N44L94o82q0R1K10p64R0N5J45M10J99M70
$$ -510 -385 -13 646 593 -55 -133 -634 -669 -274 270 664 -18 -98 -7 203 -561 -471 -416 -271 139 338 808
1296H08rj073n21N49L49J54M43J86n33m39l1J01o6k45j86K59L66L31n17j05l60
$$ 808 799 -274 -795 -246 103 257 700 886 353 -86 -117 -16 -82 -327 -513 -254 112 443 -74 -179 -539
1317e39k03J17N94K69n58k65K31L98j18L85J31J6k18j60M76O0n3k19m68L64o8
$$ -539 -742 -625 -31 238 -320 -585 -354 44 -74 311 442 458 240 80 556 616 563 344 -124 240 172
1338A72j04J85m31j11R4J94J72m06n82k58O30j93K12N75J77l74k12L21K90m50
$$ 172 68 253 -178 -289 -195 -1 171 -235 -817 -1075 -445 -638 -426 149 326 -48 -260 61 351 -99
1358i9j04rM30N40j27kk66n99k4J37L01M00k57J16l63m74k53L78j89K55m7L63
$$ -99 -203 -212 218 758 631 629 363 -236 -260 -123 178 578 321 437 74 -400 -653 -275 -464 -209 -256 107
1380A07J25j65l66q9j91J33L48M65j93p8l83L78J94k82l8J74K29pj22K88N0p41
$$ 107 232 67 -299 -388 -579 -446 -98 367 174 96 -287 91 285 3 -35 139 368 361 239 527 577 -164
1402a64n1K22J7M4l8k05N3j71J05L84k79p40N8J55L26K68L66j15M4m70L14J25
$$ -164 -215 7 24 68 30 -175 -122 -293 -188 196 -83 -823 -765 -610 -284 -16 350 235 279 -191 123 248
1424B48L3m0j13J58O58j63o74n9l45j00qN70M63j29n51l81km62L6K80K62J17K69
$$ 248 281 241 128 286 944 781 107 48 -297 -397 -405 165 628 499 -52 -433 -435 -897 -861 -581 -319 -202 67
1447F7K92p8n82o9K41L2J20N36K20j96o27J41N9K54r2k48P8L36n74K68l03ql30
$$ 67 359 281 -301 -370 -129 -97 23 559 779 583 -44 97 156 410 318 70 148 484 -90 178 -125 -133 -463
1470d63j55L67K55M4k09Op2L8k05J39J22j94j58M73L63j00K05k55r8m1J49j19
$$ -463 -618 -251 4 48 -161 -155 -227 -189 -394 -255 -133 -327 -485 -12 351 251 456 201 103 62 211 92
1492I2K76Nl56L89L11l71m29k21J36j12L21M31j79k02n12r3L55j34J16q0K93L8
$$ 92 368 373 17 406 717 346 -83 -304 -168 -280 41 472 293 91 -421 -514 -159 -293 -177 -257 36 74
1514G4k0J91l86k07J84J06L94Mk64L08j99k84k66M64J29k05Q2k6J06n8k42k85
$$ 74 54 245 -141 -348 -164 -58 336 340 76 384 185 -99 -365 99 228 23 105 79 185 127 -115 -400
1536d00J97O6j18L09K60m55k27j31M69k53K73j89J29j35p9M77K01N4j75m5j45
$$ -400 -203 -137 -255 54 314 -141 -368 -499 -30 -283 -10 -199 -70 -205 -284 193 394 448 273 228 83
1557H3j77J7M54J10j95j77K14k56j55j99J56l38J69M30K7J20n12p54L69K46K67
$$ 83 -94 -77 377 487 292 115 329 73 -82 -281 -125 -463 -294 136 163 283 -229 -983 -614 -368 -101
1578a01N2J96J44J15o44L08O3l49j06M94L48j71j44r1j53k06K0K29K34N6k73o3
$$ -101 -49 147 291 406 -238 70 133 -216 -322 172 520 349 205 114 -39 -245 -225 4 238 294 21 -42
1600d2o4jl83J87J77j12K25K37r2j33l16N3K66J4k98K36K44J2j94J33K2n5j34
$$ -42 -106 -107 -490 -303 -126 -238 -13 224 132 -1 -317 -264 2 16 -282 -46 198 210 16 149 171 116 -18
1623a8J37J16n4K56o6k0k86m8K27l04k25l3L34nj9j75K7J5l55j67L45K48Q3J1
$$ -18 119 235 181 437 371 351 65 17 244 -60 -285 -318 16 11 -8 -183 -156 -141 -496 -663 -318 -70 13 24
1647B4M0L28k01j24k33M08rj4J75L20l74k62o7j1j17j15M31J92l46m35K29k29
$$ 24 64 392 191 67 -166 242 233 219 394 714 340 78 11 0 -117 -232 199 391 45 -390 -161 -390
1669c90Q4k34k8L90J52j90J72M1P5n83L38N27k8j83m7M64r2j70J96k42ql12J38
$$ -390 -306 -540 -568 -178 -26 -216 -44 -3 72 -511 -173 354 326 143 96 560 468 298 494 252 244 -68 70
1692G0k50O10m68j84K97j82l43J02m2R2onM13j82R3l1j8l01J63K41L30k37K00
$$ 70 -180 430 -38 -222 75 -107 -450 -348 -390 -298 -304 -309 104 -78 15 -16 -34 -335 -172 69 399 162 362
1715C62j70J30j47m23L93nk86M18j38k7r7o54J16J45P7J40K31K09k25k66K20k60
$$ 362 192 322 175 -248 145 140 -146 272 134 107 10 -644 -528 -383 -306 -166 65 274 49 -217 3 -257
1737b57Q2j04M02J31M3k84j98L69l13j05J28M91k77o8lo0p2J69R3M0k92Q3K77
$$ -257 -175 -279 123 254 297 13 -185 184 -129 -234 -106 385 108 40 37 -23 -95 74 167 207 -85 -2 275
1760B75j28j87L2R4k01Q7l02M20k15K13J04k74k2O9j40pK03l12K35J78K7J75m86
$$ 275 147 -40 -8 86 -115 -28 -330 90 -125 88 192 -82 -104 -35 -175 -182 21 -291 -56 122 149 324 -162
1783a62J84L2n4P4J86J10j48K49k42j06k69p7k19K97J35K22r5n2l28L1j86K47
$$ -162 22 54 0 74 260 370 222 471 229 123 -146 -223 -442 -145 -10 212 117 65 -263 -232 -418 -171
1805a71Q0o7k6O9J24o5J29R2J82O8k17K51k16k39J27n9J08j54o4J11o6p2j1j14
$$ -171 -91 -158 -184 -115 9 -56 73 165 347 415 198 449 233 -6 121 62 170 16 -48 63 -3 -75 -86 -200
1829b00p8j1J0j59J15L7K7L1J70K22r3L92m26nK30N0K27l49K34j82M0k54K92k42
$$ -200 -278 -289 -279 -438 -323 -286 -259 -228 -58 164 71 463 37 32 262 312 539 190 424 242 282 28 320 78
1853G8L5j69P2j47p9l2j22J82q7k38L07L87J3k19k27K23r9M8O0K53j84k6K77L5
$$ 78 113 -56 16 -131 -210 -242 -364 -182 -269 -507 -200 187 200 -19 -246 -23 -122 -74 -14 239 55 29 306 341
1877C41j74r3mn4k38N9O05R7o67jp2K32k43N02k58q1l9K00L2j42QM0k6k97L15
$$ 341 167 74 70 16 -222 -163 442 539 -128 -129 -201 31 -212 290 32 -49 -88 112 144 2 10 50 24 -273 42
1902D2j46K10K31l00j88K35J36m73R5O7K20J00j55p0j43Q5J9J9K03J09k35J98
$$ 42 -104 106 337 37 -151 84 220 -253 -158 -91 129 229 74 4 -139 -54 -35 -16 187 296 61 259
1924B59j07m42N8l2LM5J95l27J91J89l64K80RN2K8j66J56J9kM6K76q8j17r8J26
$$ 259 152 -290 -232 -264 -261 -216 -21 -348 -157 32 -332 -52 -43 9 37 -129 27 46 44 90 366 278 161 63 189
1949A89Lk00M92j43m05J39m13J48L2J25K3J0j84O3k49p1K21J91J86j41KQ4O1n1
$$ 189 192 -8 484 341 -64 75 -338 -190 -158 -33 -10 0 -184 -121 -370 -441 -220 -29 157 16 18 102 163 112
1973A12j5J47p2j83N33l13P7Oj64j29L8j27p7M2L09J66m08J56p7j99j34k3J59
$$ 112 97 244 172 -11 522 209 286 292 128 -1 37 -90 -167 -125 184 350 -58 98 21 -178 -312 -335 -176
1996a76J6K45P2k19J97j82J64j77N00k57j91J68N4j82J08Mk40J90k6k3n7K52k50
$$ -176 -160 85 157 -62 135 -47 117 -60 440 183 -8 160 214 32 140 144 -96 94 68 45 -12 240 -10
2019a0Rq0m4j37Q7L19k18J68k80R7j30j28K75P1L62m97m1L38J32l35K9j1J09k2
$$ -10 -1 -81 -125 -262 -175 144 -74 94 -186 -89 -219 -347 -72 -1 361 -136 -177 161 293 -42 -13 -24 85 63
2043F3L17P7k60j73Q1K9k48j0J58k88N0J75k14K25o6k65J96K0Q5j30k7K39K7o8
$$ 63 380 457 197 24 105 134 -114 -124 34 -254 -204 -29 -243 -18 -84 -349 -153 -133 -48 -178 -205 34 61 -7
2067gk02M77J7j19k56L74m2Q8L2m6n4k13J0l91M12M3r0o0M0O6k77j49lj25N97
$$ -7 -209 268 285 166 -90 284 242 330 362 316 262 49 59 -332 80 123 33 -27 13 79 -198 -347 -350 -475 122
2092A22k64K74m00O2J00J05J16j14J2K8O4q9L35k22o2q9m6p6L12j26J7K05k09
$$ 122 -142 132 -268 -206 -106 -1 115 1 13 41 105 16 351 129 67 -22 -68 -144 168 42 59 264 55
2115E5j44J65k65j0L2P6lJ14j91L0j9K92Kk12O3o3K37k8k68K90K8P7p0j36P8j51
$$ 55 -89 76 -189 -199 -167 -91 -94 20 -171 -141 -160 132 134 -78 -15 -78 159 131 -137 153 181 258 188 52 130 -21
2141b1O7J30j07J74l41J22P9r3R5r9J85n8k91p0m32M96k7K59j11L8k6J8k07O7
$$ -21 46 176 69 243 -98 24 103 10 105 6 191 133 -158 -228 -660 -164 -191 68 -43 -5 -31 -13 -220 -153
2165a53M41l10L10j36m2l7J69j21l1j62J00J86j0p1p3J7k63P9k8K80k02M9n10
$$ -153 288 -22 288 152 110 73 242 121 90 -72 28 214 204 133 60 77 -186 -107 -135 145 -57 -8 -518
2188e18L25K1O9K22k33R8N7J90j94J1J06j34K70k52M6M5p2J38j75o2M30k35j43
$$ -518 -193 -172 -103 119 -114 -16 41 231 37 48 154 20 290 38 84 129 57 195 20 -42 388 153 10
2211A0k20K7k04R9L85m6m5k17l4j32J97J1Q1M2P1oO7j19q1K21l19M08j37j68K53
$$ 10 -210 -183 -387 -288 97 51 6 -211 -245 -377 -180 -169 -88 -46 25 19 86 -33 -114 107 -212 196 59 -109 144
2236A44J12j83m1j25P6j04K52k8j28o7O4m6o2PL0K78k26J83k02J1j28J19K8J12
$$ 144 256 73 32 -93 -17 -121 131 103 -25 -92 -28 -74 -136 -129 -99 179 -47 136 -66 -55 -183 -64 -36 76
2260G6j32P8N8L9J08o3k45O7n4J46K7L9j69J27k83J98J64j64K0l48N7P1J20J11
$$ 76 -56 22 80 119 227 164 -81 -14 -68 78 105 144 -25 102 -181 17 181 17 37 -311 -254 -183 -63 48
2284D8o0l8j11j39J86k00J72o7J29Q2p8J74j7j96J50L82j92Q3r6J8k64o5k0L15
$$ 48 -12 -50 -161 -300 -114 -314 -142 -209 -80 2 -76 98 81 -115 35 417 225 308 212 230 -34 -99 -119 196
2308A96j65j33l7J4J72k31pJ0P0p9J24j2J28RJ90k20R6k43L18J43j53P8l4J75
$$ 196 31 -102 -139 -125 47 -184 -191 -181 -111 -190 -66 -78 50 59 249 29 125 -118 200 343 190 268 234 409
2332D09k34J26k75rm4oL1J70l71K02N3J51n24K88Oj1k85J45J13L80l92l30N28
$$ 409 175 301 26 17 -27 -33 -2 168 -203 -1 52 203 -321 -33 -27 -38 -323 -178 -65 315 -77 -407 121
2355A21j88K97k02j66J76k4K14m8l36J37J00j55p6J96J3Mj02k26K70j30L3J11
$$ 121 -67 230 28 -138 38 14 228 180 -156 -19 81 -74 -150 46 59 63 -39 -265 5 -125 -92 19
2377A9J43k01j13J42J06p6l31L51r1J83L39l94j02q2j8J31o5L9J18O8k18K98k50
$$ 19 162 -39 -152 -10 96 20 -311 40 -51 132 471 77 -25 -107 -125 6 -59 -20 98 166 -52 246 -4
2400dJR7k18J35K29m07K76J50k70j82J98j00qJ65j07l6j4j74K92k5n5j37j29M02
$$ -4 -3 94 -124 11 240 -167 109 259 -11 -193 5 -95 -103 62 -45 -81 -95 -269 23 -2 -57 -194 -323 79
2424G9K4k25L94r0m0K2k03K9j43J75P8j58J86q3K5j30Q6J81m92O6J7j41J67J92
$$ 79 103 -122 272 182 142 164 -39 -10 -153 22 100 -58 128 45 70 -60 26 207 -285 -219 -202 -343 -176 16
2448A6k70j58K88r8J68j88K29K49r2Nj7n6j56K48J21n3k30O6J89l67K78j98j83
$$ 16 -254 -412 -124 -222 -54 -242 -13 236 144 149 132 76 -80 168 289 236 6 72 261 -106 172 -26 -209
2471b09K9K11p6J16k77o5Q2m5K96j27J05k78L29J36j24J36l82J12j5L1j95M20
$$ -209 -180 31 -45 71 -206 -271 -189 -234 62 -65 40 -238 91 227 103 239 -143 -31 -46 -15 -210 210
2493B10j34J33l31j02N10j72j31J47j81K19j89P1j87J31l08J43O7K04j54N7Lk14
$$ 210 76 209 -122 -224 286 114 -17 130 -51 168 -21 50 -137 -6 -314 -171 -104 100 -54 3 6 -208
2515b08O3P4J6J49o7p3J52Pl00N6P3j88L27k13J90K21o4k55j71L81k09J8j46K52
$$ -208 -145 -71 -55 94 27 -46 106 113 -187 -131 -58 -246 81 -132 58 279 215 -40 -211 170 -39 -21 -167 85
2539H5kj79K20k67P5r2K60j23K4j09n2K99J56k44lj60J05M0R6k71K09k6K05n1
$$ 85 83 -96 124 -143 -68 -160 100 -23 1 -108 -160 139 295 51 48 -112 -7 33 129 -142 67 41 246 195
2563A95K0l48L15N9m70L64j78r4J71m5j59Q6L8Pq9J67M8k77j31K33K53Kj36j12
$$ 195 215 -133 182 241 -229 135 -43 -137 34 -11 -170 -84 -46 -39 -128 39 87 -190 -321 -88 165 167 31 -81
2587h1J52j21Q9L14m16J05J5J29R1j25k22J48k06J21m19M50j29J60j09qK52m25
$$ -81 71 -50 39 353 -63 42 57 186 277 152 -70 78 -128 -7 -426 24 -105 55 -54 -62 190 -235
2609b35J26K8K21J82k68n6K42l07m6L09k16K38j91P4J96j23k39J29l1k8N3N5m9
$$ -235 -109 -81 140 322 54 -2 240 -67 -113 196 -20 218 27 101 297 174 -65 64 33 5 58 113 64
2632F4p5p0J00q3l2J80j06K4j77J18O9q0L12k87MJ83Q9k3j60J5J03j51Q2J35l33
$$ 64 -11 -81 19 -64 -96 84 -22 2 -175 -57 12 -68 244 -43 -39 144 233 210 50 65 168 17 99 234 -99
2657i9pK13L5j97o1J70j6j80n2J84k73K47j68O47o16j8K30J47j23k59J43N8n9
$$ -99 -106 107 142 -55 -116 54 38 -142 -194 -10 -283 -36 -204 443 -173 -191 39 186 63 -196 -53 5 -54
2680e4m5Q8J68n2k09J32L19n5j75j10L4q6QQ0J9k03k32M28j99J56K4j49K26m27
$$ -54 -99 -11 157 105 -104 28 347 292 117 7 41 -45 -37 43 62 -141 -373 55 -144 12 36 -113 113 -314
2704c14Q0L0j10K20J80k4J6R7j29k4j58L02l34K93M86o91K52n35M35Jr4r7j03
$$ -314 -234 -204 -314 -94 86 62 78 175 46 22 -136 166 -168 125 611 -80 172 -363 72 73 -21 -118 -221
2727b21r2L82O0j75K03l29J98k63J97M6j59L41k21rlJ35k3q5k00P7N0Q1j54K87
$$ -221 -313 69 129 -46 157 -172 26 -237 -40 6 -153 188 -33 -42 -45 90 67 -18 -218 -141 -91 -10 -164 123
2751A23j89P4k9J70j39J62J9k17K15j84MM1o4J08j55J32k37J34m6l1l1j4K5R5
$$ 123 -66 8 -21 149 10 172 191 -26 189 5 9 50 -14 94 -61 71 -166 -32 -78 -109 -140 -154 -129 -34
2775c4n1K53k20K1j66O8L22j90p0L14j71J83k3Q5k53r6L24j55k59j6J88j72j35
$$ -34 -85 168 -52 -31 -197 -129 193 3 -67 247 76 259 236 321 68 -28 296 141 -118 -134 54 -118 -253
2798b53M45o20K7M07K6P4l70J31L34k68J05J12j2J63k33QJ1j09J15J4j45j17P6
$$ -253 192 -428 -401 6 32 106 -264 -133 201 -67 38 150 138 301 68 76 87 -22 93 107 -38 -155 -79
2821g9L01j71J8j23l6K21j99J00R2j97M6j57K09J01p7j92O7PN6M6K51k51oK9J20
$$ -79 222 51 69 -54 -90 131 -68 32 124 -73 -27 -184 25 126 49 -143 -76 -69 -13 33 284 33 27 56 176
2846A76j14o9K41k91J71q6j57K04M7l7ll96K36j89L89J00k76q3J41N5N6j17P4
$$ 176 62 -7 234 -57 114 28 -129 75 122 85 82 -314 -78 -267 122 222 -54 -137 4 59 115 -2 72
2869G2k60L9J03oM9r4j31J14j9j16L06P0j05r2m2K10J21k11J05r0J25j41l8J00
$$ 72 -188 -149 -46 -52 -3 -97 -228 -114 -133 -249 57 127 22 -70 -112 98 219 8 113 23 148 7 -31 69
2893F9J01j26O1N9p6L9k74J22o5P0L22l36J93l40N6M1L5j99L76k17J62L3Q6k31
$$ 69 170 44 105 164 88 127 -147 -25 -90 -20 302 -34 159 -181 -125 -84 -49 -248 128 -89 73 106 192 -39
2917c9n7J6L6J42o1N4j48L0j18J05k14K28M2j81NM2r2J19K49l54R0K9r7N5qK96
$$ -39 -96 -80 -44 98 37 91 -57 -27 -145 -40 -254 -26 16 -165 -160 -118 -210 -91 158 -196 -106 -77 -174 -119 -127 169
2943A69r9k96Q7L26k31K46j92P3j78J87j16J8qO9n8O7j62n6l5J15j98Q3J45r9
$$ 169 70 -226 -139 187 -44 202 10 83 -95 92 -24 -6 -14 55 -3 64 -98 -154 -189 -74 -272 -189 -44 -143
2967a43K91K0K0j85k81K86J5Qp0J77j82K99k92jJ62j45K68m39K20J27j09M0j15
$$ -143 148 168 188 3 -278 8 23 31 -39 138 -44 255 -37 -38 124 -21 247 -192 28 155 46 86 -29
2990b9pL8J2j66J74r0L2m22K97K83j55J48j80j9n1L56k15K42j78m4J19j25L7p1
$$ -29 -36 2 14 -152 22 -68 -36 -458 -161 122 -33 115 -65 -84 -135 221 6 248 70 26 145 20 57 -14
3014a4l5P3K22l28P5L0M9l15O1J43J22j49K37l01L94j86j94J2J95k27K29M6J2
$$ -14 -49 24 246 -82 -7 23 72 -243 -182 -39 83 -66 171 -130 264 78 -116 -104 91 -136 93 139 151
3037A51l06K29k26K33rl5O5J67j49l9k26L73j50j06l7J1JJ43p1O5K19l47m8P4
$$ 151 -155 74 -152 81 72 37 102 269 120 81 -145 228 78 -28 -65 -54 -53 90 19 84 303 -44 -92 -18
3061a8j19O7J64j37K4j27K06J98n37M35j77L06m52k6L63k49K76l59J29L62j95
$$ -18 -137 -70 94 -43 -19 -146 60 258 -279 156 -21 285 -167 -193 170 -79 197 -162 -33 329 134
3082A34l09P3Q5J60j7k45R4j60j21L76o4K4J6j75K8R1L2m9j8J66q3J18j89m6Q2
$$ 134 -175 -102 -17 143 126 -119 -25 -185 -306 70 6 30 46 -129 -101 -10 22 -27 -45 121 38 156 -33 -79 3
3107CJ88r8K11j24n7l05J47J42k10N0j24J00o7J93o7N6J37o06M27M9L4o6q7K43
$$ 3 191 93 304 180 123 -182 -35 107 -103 -53 -177 -77 -144 49 -18 38 175 -431 -4 45 79 13 -74 169
3131A69j77LPL06m22K15j27j5J77m4o9j7J49l73K43nK21k74J71j52N0r5j21K42
$$ 169 -8 -5 2 308 -114 101 -26 -41 136 92 23 6 155 -218 25 20 241 -33 138 -14 36 -59 -180 62
3155F2n0p5M1J94k73J96l94K91K4k95L46n9J3j08J90r5K29p1k41o8J94l0l54K92
$$ 62 12 -63 -22 172 -101 95 -299 -8 16 -279 67 8 21 -87 103 8 237 166 -75 -143 51 21 -333 -41
3179d1J22J20k13J7J70k52j32M9L4J36J1j12P4J3l4K4J84l04L68m51K71j34J40
$$ -41 81 201 -12 5 175 -77 -209 -160 -126 10 21 -91 -17 -4 -38 -14 170 -134 234 -217 54 -80 60
3202F0j26K16k6j1J86l21K52m03K19L9M1rj94K24o2l26L1J29Q8J9P1q9j38R2L05
$$ 60 -66 150 124 113 299 -22 230 -173 46 85 126 117 -77 147 85 -241 -210 -81 7 26 97 8 -130 -38 267
3227B67j92Om4J03k02J64k0p8R5l7k21K31Kj17J24j35N1n3j19M18j89j03J15k72
$$ 267 75 81 37 140 -62 102 82 4 99 62 -159 72 74 -43 81 -54 -3 -56 -175 243 54 -49 66 -206
3251b06L54j46o1j07K06J54l15p3Q4NK20k25K2K3Q5oo8l0J51M2p1oK6P9k29K8
$$ -206 148 2 -59 -166 40 194 -121 -194 -110 -105 115 -110 -88 -65 20 14 -54 -84 67 109 38 32 58 137 -92 -64
3277f4Q2k21K23k29Q8K31j30N0j45J12Qn0J62Rj05k79K83q7N5J14p8K9j77K5L95
$$ -64 18 -203 20 -209 -121 110 -20 30 -115 -3 5 -45 117 126 21 -258 25 -62 -7 107 29 58 -119 -94 301
3302C01m90J39K88j14N2j40Q2q6N9l8j81J55j24N4K03l77J41J23j27K72m26K43
$$ 301 -189 -50 238 124 176 36 118 32 91 53 -128 27 -97 -43 160 -217 -76 47 -80 192 -234 9
3324Ik2oJ7K28j31J18r2j05J30k91J94O2lp8k45L81l39K32M5k24J06j48L79j82
$$ 9 -13 -19 -2 226 95 213 121 16 146 -145 49 111 108 30 -215 166 -173 59 104 -120 -14 -162 217 35
3348C5l4k08J26O4rO5j99L68l47O7J27K52l07K00j44k39J56p4l5j27L33rJ27j53
$$ 35 1 -207 -81 -17 -26 39 -160 208 -139 -72 55 307 0 200 56 -183 -27 -101 -136 -263 70 61 188 35
3372C5J82j79O2P5k85k0K03K6m5j53J71n6k72J20K58j28l30K10L03k04Q2J06l24
$$ 35 217 38 100 175 -110 -130 73 99 54 -99 72 16 -256 -136 122 -6 -336 -126 177 -27 55 161 -163
3395a63K52N1j06O9j34l6J14l01K14r8L9Q5K9J40l26J37KL3j16K15k60N7p3K47
$$ -163 89 140 34 103 -31 -67 47 -254 -40 -138 -99 -14 15 155 -171 -34 -32 1 -115 100 -160 -103 -176 71
3419G1l12K77k37J95J24j74J99Kj72J54R0j46O8K04l07L04o2q3j20K06l07n5L46
$$ 71 -241 36 -201 -6 118 -56 143 145 -27 127 217 71 139 343 36 340 278 195 75 281 -26 -81 265
3442B65k33j5j55N4j82K30j44J77l01J85m6K43Q2j20M6k45K24k71K59p4J6l1Q8
$$ 265 32 17 -138 -84 -266 -36 -180 -3 -304 -119 -165 78 160 40 86 -159 65 -206 53 -21 -5 -36 52
3465E2JM4j68Q9q9Q9O9K00k84J56l39J90R0Kj01M6O7j04k04L73j96m1M3m7J72
$$ 52 53 97 -71 18 -71 18 87 287 3 159 -180 10 100 102 1 47 114 10 -194 179 -17 -58 -15 -62 110
3490A10l63K07k71M48j36J91Kj63n3J04j65L53j18J1r0lj71J31j20M7O4o7n3J09
$$ 110 -253 -46 -317 131 -5 186 188 25 -28 76 -89 264 146 157 67 64 -107 24 -96 -49 15 -52 -105 4
3514Dm4O9L24l16k12K52k1j52J82l9K03k04J1k36K21Q8o32L54%K05k34K29qJ3
$$ 4 -40 29 353 37 -175 77 56 -96 86 47 250 46 57 -179 42 130 -502 -148 -148 57 -177 52 44 57
3538E7j16l4m2K7K03kk80R9j05M13k97j8p9J22lnJ38j54R4j08J20K35m43K54q2
$$ 57 -59 -93 -135 -108 95 93 -187 -88 -193 220 -77 -95 -174 -52 -55 -60 78 -76 18 -90 30 265 -178 76 -6
3563fp3J34o2J07r3J26k92M0M9M4k03M8m0L05K2j31P0k53K13J48j58p4O1k22p0
$$ -6 -79 55 -7 100 7 133 -159 -119 -70 -26 -229 -181 -221 84 106 -25 45 -208 5 153 -5 -79 -18 -240 -310
3588c10L76j12o0L23k02o7J81j5j65J92j17J65l1n0J09q5j28j8j34J83J55k76
$$ -310 66 -46 -106 217 15 -52 129 114 -51 141 24 189 158 108 217 132 4 -14 -148 35 190 -86
3610h6P1J80k60j18L69k19jJ80j59JK91l25n5K26J7j48K42j86J36k82J51k32k8
$$ -86 -15 165 -95 -213 156 -63 -64 116 -43 -42 249 -76 -131 95 112 -36 206 20 156 -126 25 -207 -235
3633b35J02R0o3K07j62K0P4k51J15k76L30j15o3K80n8J13k05J27r6K37P6k90q7
$$ -235 -133 -43 -106 101 -61 -41 33 -218 -103 -379 -49 -164 -227 53 -5 108 -97 30 -66 171 247 -43 -130
3656a30KJ03O9j65J32j15L53k24j66L58k58J66J1m1K4j96j5J59K6j88R0k26R6
$$ -130 -128 -25 44 -121 11 -104 249 25 -141 217 -41 125 136 95 119 -77 -92 67 93 -95 -5 -231 -135
3679a35P8j03L40j84Q6J26k68L9n6n3Q7K74k01J4lL8m4n8L1J05J1m5l66J51J67
$$ -135 -57 -160 180 -4 82 208 -60 -21 -77 -130 -43 231 30 44 41 79 35 -23 8 113 124 79 -287 -136 31
3704C1l23L22j10J30j57J33K3p7k2M3K69k99J08k36K53j31M4K35l05K06l27J86
$$ 31 -292 30 -80 50 -107 26 49 -28 -50 -7 262 -37 71 -165 88 -43 1 236 -69 137 -190 -4
3726dk3J90p8jL5k24M26k81j9l03L98o3k04J15j65P7o0P3k0N3R6j25Q5N9k0j51
$$ -4 -27 163 85 84 119 -105 321 40 21 -282 116 53 -151 -36 -201 -124 -184 -111 -131 -78 18 -107 -22 37 17 -134
3752a34L92m14J67J14m6j17K91j22k93J80j53J5K70n2j20N7j77r0J69P0k72Q8
$$ -134 258 -156 11 125 79 -38 253 131 -162 18 -135 -120 150 98 -22 35 -142 -232 -63 7 -265 -177
3774a77L47k05J4L7r7k3O3L25m03K58j14j05J65k73L63k11n1K60K9m59J53J02
$$ -177 170 -35 -21 16 -81 -104 -41 284 -119 139 25 -80 85 -188 175 -36 -87 173 202 -257 -104 -2
3796bJ74k63K92k48j78L38j40j65N9n6L47k83K9K83l35K66j81l8K19l5j3j75M10
$$ -2 172 -91 201 -47 -225 113 -27 -192 -133 -189 158 -125 -96 187 -148 118 -63 -101 118 83 70 -105 305
3819C05l04j07L69k56j79J41L08l14r4K0o7n3L19l49P9k24M00R5J37k11P7m5k5
$$ 305 1 -106 263 7 -172 -31 277 -37 -131 -111 -178 -231 88 -261 -182 -406 -6 89 226 15 92 47 22
3842B2M3j65K85k70J01J9J51k53n1K61o6j6J80j19J7p1p2J49l71L19k35J97j5
$$ 22 65 -100 185 -85 16 35 186 -67 -118 143 77 61 241 122 139 68 -4 145 -226 93 -142 55 40
3865D0k82K99j13qN0Q4j99O5m9Q2J33j01J90l07mJ31r3J16Rk5K6p3J24L6j14k
$$ 40 -242 57 -56 -64 -14 70 -129 -64 -113 -31 102 1 191 -116 -120 11 -82 34 43 18 44 -29 95 131 17 15
3891A5r8j6J06m1k1k7j47J28lK19rk97J40j0p3K50j77j33N72m58j95N8L29Oq7
$$ 15 -83 -99 7 -34 -55 -82 -229 -101 -104 115 106 -191 -51 -61 -134 116 -61 -194 378 -80 -275 -217 112 118 31
3916C1K35j03l18K56J17j72r8K91j28j16k37L13k57K03j15j00K22j47k13K27J37
$$ 31 266 163 -155 101 218 46 -52 239 111 -5 -242 71 -186 17 -98 -198 24 -123 -336 -109 28
3937B8o2K90n3o5l5j80J66j82L2L15k45JJ00p2J17k41K70j02R7j07k20Lm7J17
$$ 28 -34 256 203 138 103 -77 89 -93 -61 254 9 10 110 38 155 -86 184 82 179 72 -148 -145 -192 -75
3961g5k2K26p8k93J66K19l63n1K69q6J69l36K04R2O8J30l73L81j63M2k51K79J02
$$ -75 -97 129 51 -242 -76 143 -220 -271 -2 -88 81 -255 -51 41 109 239 -134 247 84 126 -125 154 256
3984B56l14K06J59p41M25RL5m1r5M7J30k19J74Q3j79J67J15j56J8j34OK0j8M1
$$ 256 -58 148 307 -434 -9 0 35 -6 -101 -54 76 -143 31 114 -65 102 217 61 79 -55 -49 -29 -47 -6
4008fK34k89n7Q9K9J09k83J20Q4J7N3O8m81M50j56J89k07Q4o8k9K35l63K58j78
$$ -6 228 -61 -118 -29 0 109 -174 -54 30 47 100 168 -313 137 -19 170 -37 47 -21 -50 185 -178 80 -98
4032i8J68k29J46L1j28J85k35P9o7J03K06l12m7K99J14k26J4K26k59K4J87r2q1
$$ -98 70 -159 -13 18 -110 75 -160 -81 -148 -45 161 -151 -198 101 215 -11 3 229 -30 -6 181 89 8
4055Hj34N29l61p1j36J84m1k8m6l4Q0K16j64p2K52j28r4J12o5o1R1J58J1j83j38
$$ 8 -126 403 42 -29 -165 19 -22 -50 -96 -130 -50 166 2 -70 182 54 -40 72 7 -54 37 195 206 23 -115
4080a15K44n0Q5O1j90n2J02o5O7k67J19K07l65L97k10j46n5M41j29k96K67L0P9
$$ -115 129 79 164 225 35 -17 85 20 87 -180 -61 146 -219 178 -32 -178 -233 208 79 -217 50 80 159
4103A59l68M49p4k44J29K8Q6JJ55j71k59O3J86o5P3k58PJ65q3j2om2J5M4Nn5Q
$$ 159 -209 240 166 -78 51 79 165 166 321 150 -109 -46 140 75 148 -110 -103 62 -21 -33 -39 -81 -66 -22 -17 -72 -64
4130f4j4K16r4l8j03jJ33j85J22j7o9J34K45j31j29n6K1r1J18K39j93j61J42P7
$$ -64 -78 138 44 6 -97 -98 35 -150 -28 -45 -114 20 265 134 5 -51 -30 -121 -3 236 43 -118 24 101
4154A01j04j73O2J07k47J83NK41j22k49M38j98k8j36M0nK35j97Q6j09R1m4J67
$$ 101 -3 -176 -114 -7 -254 -71 -66 175 53 -196 242 44 16 -120 -80 -85 150 -47 39 -70 21 -23 144
4177A44k9j02j03J19j28L66j32k99J65Lk2m6J96j38r7K55j43K65j41k76L53k52
$$ 144 115 13 -90 29 -99 267 135 -164 1 4 -18 -64 132 -6 -103 152 9 274 133 -143 210 -42
4199d2n6n8M9N2J10j53J73k31K95J13k69K42l55K23J6k57J92J8n1K62l33N2r4
$$ -42 -98 -156 -107 -55 55 -98 75 -156 139 252 -17 225 -130 93 109 -148 44 62 11 273 -60 -8 -102
4222a02L5O5k87J72J95q9j92K26j62J31J36j5p6p9J3j10J19R6J1j51N4K45m08
$$ -102 -67 -2 -289 -117 78 -11 -203 23 -139 -8 128 113 37 -42 -29 -139 -20 76 87 -64 -10 235 -173
4245a73K82j67K39k47O7j61K09o1J54n14L22q1J7J88p7R5o9j62J03R9j29O7K2
$$ -173 109 -58 181 -66 1 -160 49 -12 142 -372 -50 -131 -114 74 -3 92 23 -139 -36 63 -66 1 23
4268B3J75r2l5j10J72l20L17r8k14K39l9Q5r6Q3K62l32j05j05p1L02PK26j88j14
$$ 23 198 106 71 -39 133 -187 130 32 -182 57 18 103 7 90 352 20 -85 -190 -261 41 48 274 86 -28
4292b8nj63M51k53j45M05l41J91j17J45l48L08q9J57k23m4%j0j0j31M22l16L38
$$ -28 -33 -196 255 2 -143 262 -79 112 -5 140 -208 100 11 168 -55 -99 -99 -109 -119 -250 172 -144 194
4315A94m5M7O8n01N0R7m9J43n6K9K83n64L88J5k48J56O8J12k83m1J25J3l6J73
$$ 194 149 196 264 -237 -187 -90 -139 4 -52 -23 260 -304 84 99 -149 7 75 187 -96 -137 -12 1 -35 138
4339A38l0k46J68J84k93K74j31k29k7J11m5n5K27p5R0J41J73n15K92n38M35j34
$$ 138 108 -138 30 214 -79 195 64 -165 -192 -81 -126 -181 46 -29 61 202 375 -140 152 -386 49 -85
4361h5O6j77J39J84J41k3l70L16j78j80J67m8K1J25j83J11n4J6j37M13m53M48
$$ -85 -19 -196 -57 127 268 245 -125 191 13 -167 0 -48 -27 98 -85 26 -28 -12 -149 264 -189 259
4383B59k91J0q7J35j84k01O7L56m1k80K38j83L16p4qk40M60j77nJ60j03k84K21
$$ 259 -32 -22 -109 26 -158 -359 -292 64 23 -257 -19 -202 114 40 32 -208 252 75 70 230 127 -157 64
4406F4mk41R7J96k50K1O9j28n4K04J40o1j87L8N8R5j35N5L4k20L33n8m6J64k27
$$ 64 60 -181 -84 112 -138 -117 -48 -176 -230 -26 114 53 -134 -96 -38 57 -78 -23 11 -209 124 66 20 184 -43
4431d3M3lP4m6k71K22J59p2j46J20J33j35K2j20l7J55m1OP6o2J27Nr1j87m6N4
$$ -43 0 -3 71 25 -246 -24 135 63 -83 37 170 35 57 -63 -100 55 14 20 96 34 161 166 75 -112 -158 -104
4457a04K36j75k8l4j6J0Q1L19j50j49J2J37k5l48K73Q7j27J2R3J28k49Q2k24J24
$$ -104 132 -43 -71 -105 -121 -111 -30 289 139 -10 2 139 114 -234 39 126 -1 11 104 232 -17 65 -159 -35
4481c5l6J36K41m03J47k13K55l02K37N1p8J26l4j53M1m4j37P3NJ27m0K83m33L00
$$ -35 -71 65 306 -97 50 -163 92 -210 27 78 0 126 92 -61 -20 -64 -201 -128 -123 4 -36 247 -186 114
4505A14k28J05K07k39l0P9L9k87K39j6q8N0J13q5j9L03j71j82J52l7N4k26K38
$$ 114 -114 -9 198 -41 -71 8 47 -240 -1 -17 -105 -55 58 -27 -46 257 86 -96 56 19 73 -153 85
4528H5R7j25J43k39r2K85j48J11k06j19K34j27J96Pq7l2J28m56L52K34o1o5j50
$$ 85 182 57 200 -39 -131 154 6 117 -89 -208 26 -101 95 102 15 -17 111 -345 7 241 180 115 -35
4551c5j56J36K73n1L9O7k63j65K20j16N3l64M18o6k6J98l57J23J15j30J71J03
$$ -35 -191 -55 218 167 206 273 10 -155 65 -51 2 -362 56 -10 -36 162 -195 -72 43 -87 84 187
4573A87j44J07j46n8K14M6l03J64K6j69L3K14k88j25L26j37O8J38m8K2j63K09
$$ 187 43 150 4 -54 160 206 -97 67 93 -76 -43 171 -117 -242 84 -53 15 153 105 127 -36 173
4595A73k01J28k26K86k16q0J69k08Q8J52o5k43L57k23P7K22j08j63K24j20j62
$$ 173 -28 100 -126 160 -56 -136 33 -175 -87 65 0 -243 114 -109 -32 190 82 -81 143 23 -139
4616a39j73K00J05m8J54m4k0O2k34K52K79l94jj69J67O5k1k9L00L0j51k13p1R9
$$ -139 -312 -112 -7 -55 99 55 35 97 -137 115 394 0 -1 -170 -3 62 41 12 312 342 191 -22 -93 6
4640Fj00J57J8l23K99k07J83k67J02N2K02j57K74j45j62J02j32L2O3RJ51j50j44
$$ 6 -94 63 81 -242 57 -150 33 -234 -132 -80 122 -35 239 94 -68 34 -98 -66 -3 6 157 7 -137
4663a37K39QJ29k26K11k32j5m8J88k20L14p7j68q3L54m42J89M8j25M6O5R7j07
$$ -137 102 110 239 13 224 -8 -23 -71 117 -103 211 134 -34 -117 237 -205 -16 32 -93 -47 18 115 8
4686HJ29r6k13J79l4o0N4KN4M7O6r1j80J48Q9P0j25l1j16k1O3mQ9pj89L80k88
$$ 8 137 41 -172 7 -27 -87 -33 -31 23 70 136 45 -135 13 102 172 47 16 -100 -121 -58 -62 27 20 -169 211 -77
4713g7L92k87k43K76M4k25L75l10K14p9Nj00K12j28J98k34j58K09j6j17L9K00
$$ -77 315 28 -215 61 105 -120 255 -55 159 80 85 -15 197 69 267 33 -125 84 68 -49 -10 190
4735A90k30j3M3j71R5J77j1rk24O3j26RK32j07N3j03K44O9k74Q1o2J34R0q6J42
$$ 190 -40 -53 -10 -181 -86 91 80 71 -153 -90 -216 -207 25 -82 -29 -132 112 181 -93 -12 -74 60 150 64 206
4760B06k74L7L29l65L02l21N4P4j64M5j31K48k61n3K91j84J5L06m23k1J48J02
$$ 206 -68 -31 298 -67 235 -86 -32 42 -122 -77 -208 40 -221 -274 17 -167 -152 154 -269 -290 -142 -40
4782d0r0L78k91K44k92J29Q1j95O3p6J14r9q2K25k28K84j38J54l6l33L54j73l0
$$ -40 -130 248 -43 201 -91 38 119 -76 -13 -89 25 -74 -156 69 -159 125 -13 141 105 -228 126 -47 -77
4805g7J3oK22k99N7M7Q1q5n4p0K37J06j74J38j13J05k79J86L2j66N7K90l3l09
$$ -77 -64 -70 152 -147 -90 -43 38 -47 -101 -171 66 172 -2 136 23 128 -151 35 67 -99 -42 248 215 -94
4829i4L98l64l9K4K16k15J07j45J14J46k71K21l39J12m3J72J20j35J81k19L4j48
$$ -94 304 -60 -99 -75 141 -74 33 -112 2 148 -123 98 -241 -129 -172 0 120 -15 166 -53 -19 -167
4851a67J97p2P8r7J17q8J33n8j0j00mJ62m1M7l4P1j20J1K4J35j8k93q2L90l61
$$ -167 30 -42 36 -61 56 -32 101 43 33 -67 -71 91 50 97 63 134 14 25 49 184 166 -127 -209 181 -180
4876a80K3J97m7k95L22o3L1j36K58K6n4J6QL6j5k99K37k0k79K61O0j73j93M41
$$ -180 -157 40 -7 -302 20 -43 -12 -148 110 136 82 98 106 142 127 -172 65 45 -234 27 87 -86 -279 162
4900A62j15Jj76J87K1j09QJ65j55O3L3k13J69o0r5K13mj52J07J67m73L59J68k75
$$ 162 47 48 -128 59 80 -29 -21 144 -11 52 85 -128 41 -19 -114 99 95 -57 50 217 -256 103 271 -4
4924dK52j12n7l04K02j18J49n8k50K73RN9j68K07M2Mk19KJ02k50K33Q5j11O6m0
$$ -4 248 136 79 -225 -23 -141 8 -50 -300 -27 -18 41 -127 80 122 126 -93 -91 11 -239 -6 79 -32 34 -6
4949fn6L8K9K4j64K20j3j59K89j1p9k71Q6J95j46N2k64J46P2o7J90k67K64j35
$$ -6 -62 -24 5 29 -135 85 72 -87 202 191 112 -159 -73 122 -24 28 -236 -90 -18 -85 105 -162 102 -33
4973c3QQ1j51J76R0j83j36M12o9j49j53N3R0Rj3j68J6P4L12l25k1J4J31J3k63
$$ -33 -25 56 -95 81 171 -12 -148 264 195 46 -107 -54 36 45 32 -136 -120 -46 266 -59 -80 -66 65 78 -185
4998a85J69J92l66K13k9nQ7O9l23J79k1K4q3J82k82L34l13J75o7J23j48J14k4
$$ -185 -16 176 -190 23 -6 -11 76 145 -178 1 -20 4 -79 103 -179 155 -158 17 -50 73 -75 39 15
5021A5K1j9J74k03m4M41o15K85J28L3j54j47O5J42m28L25j14kJ41Nn1n7J94r9
$$ 15 36 17 191 -12 -56 385 -230 55 183 216 62 -85 -20 122 -306 19 -95 -97 44 49 -2 -59 135 36
5045C6k28K25j41J73R0j71j03J52j44J34Q6q0o0J4K27l52J50j85K67k37J54J60
$$ 36 -192 33 -108 65 155 -16 -119 33 -111 23 109 29 -31 -17 210 -142 8 -177 90 -147 7 167
5067A67l60J90R4j54J40j85j65K13K42j73k26K50K92m40K06r9J46k5m0j00k6J65
$$ 167 -193 -3 91 -63 77 -108 -273 -60 182 9 -217 33 325 -115 91 -8 138 113 73 -27 -53 112
5089A12j38p4j07L01R0k96n0J40M0l6N1j4J15j69j09J05j45oL21q3R2k21K16J41
$$ 112 -26 -100 -207 94 184 -112 -162 -22 18 -18 33 19 134 -35 -144 -39 -184 -190 131 48 140 -81 135 276
5113B76n07N36l94J52M4k96L05P4l06J97j29J87q0l9j92K18p8k56K17K00k37J62
$$ 276 -231 305 -89 63 107 -189 116 190 -116 81 -48 139 59 20 -172 46 -32 -288 -71 129 -108 54
5135E4N4m6j32j02K17k22K74k59K49J02k34k2J70n0J86m35J89J93k88L91l21J89
$$ 54 108 62 -70 -172 45 -177 97 -162 87 189 -45 -67 103 53 239 -196 -7 186 -102 289 -32 157
5157A57j44L36k37m9l18J46K1J1O2k7K14m31P5K07l67L41j47J86J52m28J4K09
$$ 157 13 349 112 63 -255 -109 -88 -77 -15 -42 172 -259 -184 23 -344 -3 -150 36 188 -240 -226 -17
5179a7J06MQ8o2j05L59k95q8N3j20J20j7p3j01J53j13L35j38j45N9J40j18m9K7
$$ -17 89 93 181 119 14 373 78 -10 43 -77 43 26 -47 -148 5 -108 227 89 -56 3 143 25 -24 3
5203Cl24L32K06o9j99J6J54k63L1K03K5m7k7j39K74k00j41K10J72l37J43K74j84
$$ 3 -321 11 217 148 -51 -35 119 -144 -113 90 115 68 41 -98 176 -24 -165 45 217 -120 23 297 113
5226A13o0l65L57n2J89j4l40K45j31l6P2L20k26q2KL8j58N1M6r2K42r7j3P1k38
$$ 113 53 -312 45 -7 182 168 -172 73 -58 -94 -22 298 72 -10 -8 30 -128 -77 -31 -123 119 22 9 80 -158
5251a58J59m6j96J69Q4j03L32k29J61k18j08jJ50j36N6K14j15p9OK99p3j16m0
$$ -158 1 -45 -241 -72 12 -91 241 12 173 -45 -153 -154 -4 -140 -84 130 15 -64 -58 241 168 52 12
5274A2m3J32qn7m3j92J20PpR2Q6k36J2J47l4l7J48k35j53M56j62j16p0RK95j87
$$ 12 -31 101 93 36 -7 -199 -79 -72 -79 13 99 -137 -125 22 -12 -49 99 -136 -289 167 5 -111 -181 -172 123 -64
5300f4J39j05O3j00k5J11J51p6j67j20K64k14L44J35m40M41q0k89M3K6j53M19
$$ -64 75 -30 33 -67 -92 19 170 94 -73 -193 71 -143 201 336 -104 337 257 -32 11 37 -116 303
5322C03j75j3p3J29k11P8q0j09K44l89M45j82kJ75m33K22m0j02K08j56J12j38
$$ 303 128 115 42 171 -40 38 -42 -151 93 -296 149 -33 -35 140 -293 -71 -111 -213 -5 -161 -49 -187
5344a87J17J11oj77J97j51J00Q9j40J04j97J37K41k73Q2k36L1K40J22l57L39l8
$$ -187 -70 41 35 -142 55 -96 4 93 -47 57 -140 -3 238 -35 47 -189 -158 82 204 -153 186 148
5366A48p9j99K26j13L9n8j02K8K15j28j5J37j24L4m5J59k43K02m1j51r3O5J75
$$ 148 69 -130 96 -17 22 -36 -138 -110 105 -23 -38 99 -25 9 -36 123 -120 82 41 -110 -203 -138 37
5389C7k3L5j82n6K70k13j8j16L05j20J05Q3k00r9J36R1q5J58J4r1q3J06J19k08
$$ 37 14 49 -133 -189 81 -132 -150 -266 39 -81 24 107 -93 -192 -56 35 -50 108 122 31 -52 54 173 -35
5413c5j03K32O8j81J92k35j0Nj0P0k7K13j30j05j8O5K3j93J53N8j13M4L42m72
$$ -35 -138 94 162 -19 173 -62 -72 -67 -77 -7 -34 179 49 -56 -74 -9 14 -179 -26 32 -81 -37 305 -167
5437a67K43Q7J56j98k46K18p8n2J29j87L02j99J79j72L9j12K03k87K79l61J67
$$ -167 76 163 319 121 -125 93 15 -37 92 -95 207 8 187 15 54 -58 145 -142 137 -224 -57
5458e7j61K3N2R1K26k09K6l6j27J45N0M6k15L9J94r9k14J22K21M1k93o4J19J53
$$ -57 -218 -195 -143 -52 174 -35 -9 -45 -172 -27 23 69 -146 -107 87 -12 -226 -104 117 158 -135 -199 -80 73
5482G3N2J2Qk9l38J67J5LK18j25j65K18o9n8j41J50K31k65R2Nr2J20j59L6k22
$$ 73 125 137 145 116 -222 -55 -40 -37 181 56 -109 109 40 -18 -159 -9 222 -43 49 54 -38 82 -77 -41 -263
5507b63M81j25qJ3l50J3L21r7J30j40q5J6O8p9O3k8j06K20j06J56j53J3O4R9l5
$$ -263 218 93 85 98 -252 -239 82 -15 115 -25 -110 -94 -26 -105 -42 -70 -176 44 -62 94 -59 -46 18 117 82
5532H2j4j17J30J2q8J30j22q5R1p9q8L90l03L13k71QJ67k96N9j8J31j16J66r3
$$ 82 68 -49 81 93 5 135 13 -72 19 -60 -148 242 -61 252 -19 -11 156 -140 -81 -99 32 -84 82 -11
5556a1l1P2J97k77q1N4M7m4L02j72Q2k83R8p6J20j44J97l7m2n3J62k62K42j8j48
$$ -11 -42 30 227 -50 -131 -77 -30 -74 228 56 138 -145 -47 -123 -3 -147 50 13 -29 -82 80 -182 60 42 -106
5581a06K01l63J83j71J89J04m7j71RKK30k1J32K0j09k16J46J28l6j32O0q5J23
$$ -106 95 -268 -85 -256 -67 37 -10 -181 -172 -170 60 39 171 191 82 -134 12 140 104 -28 32 -53 70
5604G0l18L47m37K74j05j5L69k01J3J1R9k30q1L46L5j53J26m3j63J39k49M4J29
$$ 70 -248 99 -338 -64 -169 -184 185 -16 -3 8 107 -123 -204 142 177 24 150 107 -56 83 -166 -122 7
5627GJ64L7J31j60j70J91j67j26N4p0R0K15k47Q7o5o5Q6j65J69j73J1K50j97K64
$$ 7 171 208 339 179 9 200 33 -93 -39 -109 -19 196 -51 36 -29 -94 -8 -173 -4 -177 -166 84 -113 151
5651A51k28K7Q1j67L33k61K65l20Q1J07L9Lj9j98J41L04j17o3j6J08j89k25J25
$$ 151 -77 -50 31 -136 197 -64 201 -119 -38 69 108 111 92 -106 35 339 222 159 143 251 62 -163 -38
5674c8N5k48K27j3P3r1J94j91j14n0J06pK2K25j45p5J74k42O9n9J69j35M45k62
$$ -38 17 -231 -4 -17 56 -35 159 -32 -146 -196 -90 -97 -75 150 5 -70 104 -138 -69 -128 41 -94 351 89
5698H9o4J55M4k35l9N46m63j55J49J8Q7k31o9J34J10j66q2O7R0N0k4J12j96J49
$$ 89 25 180 224 -11 -50 496 33 -122 27 45 132 -99 -168 -34 76 -90 -172 -105 -15 35 11 123 -73 76
5722G6J3J77l03J47K00k43k1J7k48R3J08J81l03J61j08k53Q6M80l21J13l7M7k27
$$ 76 89 266 -37 110 310 67 46 63 -185 -92 16 197 -106 55 -53 -306 -220 260 -61 52 15 62 -165
5745a65K38l44J02L47l90J98r3J20j62K13k22J93J62j46k5q1l3R9J6j04Q8O4N2
$$ -165 73 -271 -169 178 -212 -14 -107 13 -149 64 -158 35 197 51 26 -55 -88 11 27 -77 11 75 127
5768A27M2j49k33j05K96J07k20J84j02J1l02K38j59K43J7J8M4J75k35j93L19j78
$$ 127 169 20 -213 -318 -22 85 -135 49 -53 -42 -344 -106 -265 -22 -5 13 57 232 -3 -196 123 -55
5790e5o6L66J8l04p1Q2K80k24Q7p0K03j76j45Q8M7l4J36k14k7J46p3O8j33Q2j8
$$ -55 -121 245 263 -41 -112 -30 250 26 113 43 246 70 -75 13 60 26 162 -52 -79 67 -6 62 -71 11 -7
5815gl1n4n8J12j01J60Q0j18J33k21O2j45K42M9k8j00L8j02l4M0J7J2Q6M7j6j18
$$ -7 -38 -92 -150 -38 -139 21 101 -17 116 -105 -43 -188 54 103 75 -25 13 -89 -123 -83 -66 -54 32 79 63 -55
5841e5L8J35j55J11o7M7j64r2k1lL10J27Pj54j66L34k47o8J10L5K5j73j8J40J99
$$ -55 -17 118 -37 74 7 54 -110 -202 -223 -226 84 211 218 64 -102 232 -15 -83 27 62 87 -86 -104 36 235
5866B35k94J15K2k0O2k73J76k96J87p1M6J75J20l90M38l71M0j08K99q6M5Pj25
$$ 235 -59 56 78 58 120 -153 23 -273 -86 -157 -111 64 184 -206 232 -139 -99 -207 92 6 51 58 -67
5889f7Q7j4j17K7j10K12K9M2j42k5J04j82L31m04J99o5k1K58j1j58o7J29k4j16
$$ -67 20 6 -111 -84 -194 18 47 89 -53 -78 26 -156 175 -229 -30 -95 -116 142 131 -27 -94 35 11 -105
5913a05K51j7j97Q0O4j15oP4j69J6M7n7K35j5m6L2l4J3J46l60O5q0K85J41j97
$$ -105 146 129 -68 12 76 -39 -45 29 -140 -124 -77 -134 101 86 40 72 38 51 197 -163 -98 -178 107 248 51
5938E1j26K38r1j99l4J51m7PQ3r8r4J18Q3k11Q3m8K53j54R7J16j09j36K17k50
$$ 51 -75 163 72 -127 -161 -10 -57 -50 33 -65 -159 -41 42 -169 -86 -134 119 -35 62 178 69 -67 150 -100
5962a00P4J53j10p0M8l5j3K9m7K30p0p6k24J2K85PK3j28O3l5N1j18O8K5n7j50
$$ -100 -26 127 17 -53 -5 -40 -53 -24 -71 159 89 13 -211 -199 86 93 116 -12 51 16 67 -51 17 42 -15 -165
5988a65J87r3J55o6j03J54k27mJ78M2n8p3Q9J26r4M7J4j99L3Q8p2K86k73L58l14
$$ -165 22 -71 84 18 -85 69 -158 -162 16 58 0 -73 16 142 48 95 109 -90 -57 31 -41 245 -28 330 16
6013A6Mj48J86p2p8J44R8l88L14M5k54K00j6k25K42J63m10R5J99P9l96J69K8n9
$$ 16 20 -128 58 -14 -92 52 150 -238 76 121 -133 67 51 -174 68 231 -179 -84 115 194 -202 -33 -5 -64
6037f4K30k99K32l20M7O6K13l89J49K25l5J1o4K05j39j11J7J49m8l9K17k51M6
$$ -64 166 -133 99 -221 -174 -108 105 -284 -135 90 55 66 2 207 68 -43 -26 123 75 36 253 2 48
6060D8L0j5m9k0J26j52Q5L4n6r8r9R7M9J32R9k47Q2K7k50J53n8K54k45K01J33
$$ 48 78 63 14 -6 120 -32 53 87 31 -67 -166 -69 -20 112 211 -36 46 73 -177 -24 -82 172 -73 128 261
6085B61j66k16j29J21K04N7j86J44k75K38K06l99K93rk04J26k01K66j46m9l7Q7
$$ 261 95 -121 -250 -129 75 132 -54 90 -185 53 259 -140 153 144 -60 66 -135 131 -15 -64 -101 -14
6107a4J12L2k52P4R5Pnj82j35K78K65j90J11j90j86L49j61j64L05k91j98L35%
$$ -14 98 130 -122 -48 47 54 49 -133 -268 10 275 85 196 6 -180 169 8 -156 149 -142 -340 -5 -5
6130ej73q3K73J67q2l46L65o8k58L37l3q1l4K3J37K3j27J83j15Q1j51O4j57L46
$$ -5 -178 -261 12 179 97 -249 116 48 -210 127 94 13 -21 2 139 162 35 218 103 184 33 97 -60 286
6154B86k84O0J78q4p5j71J68l19K55j37M10j41j43JJ3Q2l62K74o7J09j21k4j56
$$ 286 2 62 240 156 81 -90 78 -241 14 -123 287 146 3 4 17 99 -263 11 -56 53 -68 -92 -248
6177b48J28J28j02O0n8J52L6J3j89M8M2k99L21p0J13J10k17P2o8m8Q5p1P9L4j59
$$ -248 -120 8 -94 -34 -92 60 96 109 -80 -32 10 -289 32 -38 75 185 -32 40 -28 -76 9 -62 17 51 -108
6202a08J3J59j47K24k71J70Kj64L6l6P6r2L57k99k36K47K7J99k43K59l22L03o9
$$ -108 -95 64 -83 141 -130 40 42 -122 -86 -122 -46 -138 219 -80 -316 -69 -42 157 -86 173 -149 154 85
6225H5k35l9K73j68K02r8n1J53J17k02j04L9j89L50j65K48m13O7m7J1K1K15k09
$$ 85 -150 -189 84 -84 118 20 -31 122 239 37 -67 -28 -217 133 -32 216 -197 -130 -177 -166 -145 70 -139
6248a39L6K62j61j40j75L01J87k84Q8J18r3l51L22J56j45P7L8k05R0l4j07K94
$$ -139 -103 159 -2 -142 -317 -16 171 -113 -25 93 0 -351 -29 127 -18 59 97 -108 -18 -52 -159 135
6270A35k16K76m19L23P0j70P8K42k72j85M6J54K84l72p8J90J58l53O0q0P0N1J23
$$ 135 -81 195 -224 99 169 -1 77 319 47 -138 -92 62 346 -26 -104 86 244 -109 -49 -129 -59 -8 115
6293A15K2P8j07o0j17k4M9M4J5k09N10l32k8K25k97K41j25j8%K12m8r4K6R2j73
$$ 115 137 215 108 48 -69 -93 -44 0 15 -194 316 -16 -44 181 -116 125 0 -18 -18 194 146 52 78 170 -3
6318cnJ34Kl2j9k50J00J89k57q7J95j2J51q0q9mK2M4J51j63L4k25P2Q1n0K92m6
$$ -3 -8 126 128 96 77 -173 -73 116 -141 -228 -33 -45 106 26 -63 -67 -45 -1 150 -13 21 -204 -132 -51 -101 191 145
6345A45k09K02M6k62N6K26p5k14J34k91K89p5j89L61n8k06K22j13L7J55j8k62
$$ 145 -64 138 184 -78 -22 204 129 -85 49 -242 47 -28 -217 144 86 -120 102 -11 26 181 163 -99
6367i9K7K11n2j84m7l1K78j78J57j22l4M0q2j36M50m54L02j59l5J84P6l8m1J82
$$ -99 -72 139 87 -97 -144 -175 103 -75 82 -40 -74 -34 -116 -252 198 -256 46 -113 -148 36 112 74 33 215
6391B15k92P4j99K83J72l58L8R6j57N4K69k84J6j0K35n1n6j89J37J0K22l13O5
$$ 215 -77 -3 -202 81 253 -105 -67 29 -128 -74 195 -89 -73 -83 152 101 45 -144 -7 3 225 -88 -23
6414b3J83J2j05o1L1j63N3R4N0J13l8j11o0j88M21m08M46l03o0J88k91J55k5n6
$$ -23 160 172 67 6 37 -126 -73 21 71 184 146 35 -25 -213 208 -200 246 -57 -117 71 -220 -65 -90 -146
6438a46M3J10R1J15j41o1L9N4j2Q1l8oK9o8k57J44k9m4J37j4j29J06j57K69N4
$$ -146 -103 7 98 213 72 11 50 104 92 173 135 129 158 90 -167 -23 -52 -96 41 27 -102 4 -153 116 170
6463A70K19l24j6M9k13J80L4l2p6j58J49K2K4K3l75L32j01K10k03K70j17n5m8
$$ 170 389 65 49 98 -115 65 99 67 -9 -167 -18 4 28 51 -324 8 -93 117 -86 184 67 12 -36
6486c6K66j76RN9j62Pn6J49j48J09L9l7o7j3K14q9o7j81N06l22J7j67L29k92j74
$$ -36 230 54 63 122 -40 -33 -89 60 -88 21 60 23 -44 -57 157 68 1 -180 326 4 21 -146 183 -109 -283
6511b83J71N7J56j70K29k33J41M1m3m1J94l91J65j70J43m7l9J32l9m1J28k45L04
$$ -283 -112 -55 101 -69 160 -73 68 109 66 25 219 -172 -7 -177 -34 -81 -120 12 -27 -68 60 -185 119
6534A19l2k0J9j2o4J13j24j54K02j32L7K03j82Q8j93j23M74l0k34K67k69P4n4
$$ 119 87 67 86 74 10 123 -1 -155 47 -85 -48 155 -27 61 -132 -255 219 189 -45 222 -47 27 -27
6557b7Lo0R6J17l5j52j0Q3k14K56M8k2k71J70K3l57K91K33l66O5K46n8J15k33
$$ -27 -24 -84 12 129 94 -58 -68 15 -199 57 105 83 -188 -18 5 -352 -61 172 -194 -129 117 59 174 -59
6581e9n6n9J51q4k06M01p3mj54K42J05j56K1r4j36J30J50k44K06k69m3L49Q1k99
$$ -59 -115 -174 -23 -107 -313 88 15 11 -143 99 204 48 69 -25 -161 -31 119 -125 81 -188 -231 118 199 -100
6605a00J8l2n5J19J79j26O7j72K2J68L5n1k0O7k88L6K85OM9j30j36J38k47O5K68
$$ -100 -82 -114 -169 -50 129 3 70 -102 -80 88 123 72 52 119 -169 -133 152 158 207 77 -59 79 -168 -103 165
6630A65k92j07j6J33N5J25l6L55m92M4K0M0J15J33j98n0r2p0L27j69oN5K27k36
$$ 165 -127 -234 -250 -117 -62 63 27 382 -110 -66 -46 -6 109 242 44 -6 -98 -168 159 -10 -16 39 266 30
6654C0P9k73k3J12M6Lk4K44k4j43Q4j39K9k19K55j33J83q2n6m1M8L3Lk47J80K35
$$ 30 109 -164 -187 -75 -29 -26 -50 194 170 27 111 -28 1 -218 37 -96 87 5 -51 -92 -44 -11 -8 -255 -75 160
6680A60m9j23J59k31J78M3k67K87j07l67J12l9K37J37r1Q6o4r3O9j01J22P5q5
$$ 160 111 -12 147 -84 94 137 -130 157 50 -317 -205 -244 -7 130 39 125 61 -32 37 -64 58 133 48
6703D8o9J04j21j25L04mq3j24K44rl58K69j02J4k2q5K22K4l1k05K2K12k86o1K69
$$ 48 -21 83 -38 -163 141 137 54 -70 174 165 -193 76 -26 -12 -34 -119 103 127 96 -109 -87 125 -161 -222 47
6728D7q5J60k16J22N3j30N6qL75l56j06L39k41j37n0K09k8j18L37l44o8L29M5
$$ 47 -38 122 -94 28 81 -49 7 -1 374 18 -88 251 10 -127 -177 32 4 -114 223 -121 -189 140 185
6751A85p7J9m74K20QK60k45K69k1k34N7K3L36n08k9J95r2R8j02K63l59L48k49
$$ 185 108 127 -347 -127 -119 141 -104 165 144 -90 -33 -10 326 -182 -211 -16 -108 -10 -112 151 -208 140 -109
6774a09k2L8j04L40k49J63k95K42j04J2j21M01k01j70K58R5j97L35k73J42O7l42
$$ -109 -131 -93 -197 143 -106 57 -238 4 -100 -88 -209 192 -9 -179 79 174 -23 312 39 181 248 -94
6796i4L19k40j60K09q1p5J43j15J02k89L03j80K09j70J18O0m6Q7l32J35M6K04
$$ -94 225 -15 -175 34 -47 -122 21 -94 8 -281 22 -158 51 -119 -1 59 13 100 -232 -97 -51 153
6818A53j96j42o6K03JJ77j59J8j45rJ09q9J22PK9P5k84K03LN6J77j08l1r3J26
$$ 153 -43 -185 -251 -48 -47 130 -29 -11 -156 -165 -56 -145 -23 -16 13 88 -196 7 10 66 243 135 104 11 137
6843A37j29j00J01p1R4j81j9L03j61J15k74J67J7q5K7m6K47q5J6j24l3J64j49
$$ 137 8 -92 9 -62 32 -149 -168 135 -26 89 -185 -18 -1 -86 -59 -105 142 57 73 -51 -84 80 -69
6866f9K00J71n51L81l6K7r6r8n8K59N1n46M27K07l92J09n2J60j20K05m32L89j39
$$ -69 131 302 -249 132 96 123 27 -71 -129 130 181 -365 62 269 -123 -14 -66 94 -26 179 -253 136 -3
6889cQj2J58k44K32j32k9j55K01J1l87M24j50n0K40k24q3J86k0J1P8N9J68k34
$$ -3 5 -7 151 -93 139 7 -22 -177 24 35 -352 72 -78 -128 112 -112 -195 -9 -29 -18 60 119 287 53
6913E3j31L39p6l00j96O70k94j44j63L09k11K65o0R3k18J02qj74J83r5m0M7P5
$$ 53 -78 261 185 -115 -311 359 65 -79 -242 67 -144 121 61 154 -64 38 30 -144 39 -56 -96 -49 26
6936B6j2j79J57j7K0j62K0L22j90J05O1j35nJ40J21n2k01J51m52O71l33j21K08
$$ 26 14 -165 -8 -25 -5 -167 -147 175 -15 90 151 16 11 151 272 220 19 170 -282 389 56 -65 143
6959A43%R7l77P4L1q1Qj44k3J55J4L30k93J65j3N0r5k47K3JK03OM4k1j20J02L2
$$ 143 143 240 -137 -63 -32 -113 -105 -249 -272 -117 -103 227 -66 99 86 136 41 -206 -183 -182 21 27 71 50 -70 32 64
6986F4m9n3j6K04k44Pm5J73q6L22n0m25K16K00l98J12Mk9K23m38J70JL66p7k40
$$ 64 15 -38 -54 150 -94 -87 -132 41 -45 277 227 -198 18 218 -180 -68 -64 -93 130 -308 -138 -137 229 152 -88
7011h8p5R3N7l5K74q8mm0j97O9j47L2L75m35K62J59k69K17J8k42K12l74L93M1
$$ -88 -163 -70 -13 -48 226 138 134 94 -103 -34 -181 -149 226 -209 53 212 -57 160 178 -64 148 -226 167 208
7035B08j13k27K2L4m9J51k5J62p0N8j47N7J11j19k64K75j22J6J7J30j10J23j31
$$ 208 95 -132 -110 -76 -125 26 1 163 93 151 4 61 172 53 -211 64 -58 -42 -25 105 -5 118 -13
7058a3m6J43p3L1J89k53K63l81J38J03j85K66p3k90K00P1m23K07J93j33K29q8
$$ -13 -59 84 11 42 231 -22 241 -140 -2 101 -84 182 109 -181 19 90 -333 -126 67 -66 163 75
7080G5j32l5J46j5j90O9jj51M84j45k40M94k07l33N0O6J35J19j00Jk72N1J54p0
$$ 75 -57 -92 54 39 -151 -82 -83 -234 250 105 -135 359 152 -181 -131 -65 70 189 89 90 -182 -131 23 -47
7104d7K07j21k85L64J99l15l33J57L25k26K69n23J81m3J19j84J39J71j70K04N2
$$ -47 160 39 -246 118 317 2 -331 -174 151 -75 194 -329 -148 -191 -72 -256 -117 54 -116 88 140
7125A40l19J5J99j30j02K3N5K13n5q1N0o2K78j36J55j04p1J6k17nJ76r1j28j28
$$ 140 -179 -164 35 -95 -197 -174 -119 94 39 -42 8 -54 224 88 243 139 68 84 -133 -138 38 -53 -181 -309
7149c09K98j82M6L12o13K32K14j2N9K2j6M3j05r8K21p0j5k27M06k81N7o7L1k0
$$ -309 -11 -193 -147 165 -448 -216 -2 -14 45 67 51 94 -11 -109 112 42 27 -200 206 -75 -18 -85 -54 -74
7173g4K74m9r6j70L09o9l66M51k58J51j78J20k40J95p8l3J37p7M1O8j70n8nL8
$$ -74 200 151 55 -115 194 125 -241 210 -48 103 -75 45 -195 0 -78 -111 26 -51 -10 58 -112 -170 -175 -137
7197a37K8j21L31Jj14O4j54J97J60k40j77K86j09j64J54k29L36k97K43J90j74
$$ -137 -109 -230 101 102 -12 52 -102 95 255 15 -162 124 15 -149 5 -224 112 -185 58 248 74
7218G4j45K96j42j93P0M4Q6P8k00j58J4K64j51K48j86L5l53L69J41k46K06k45
$$ 74 -71 225 83 -110 -40 4 90 168 -32 -190 -176 88 -63 185 -1 34 -319 50 191 -55 151 -94
7240i4J19o8J11m3L4p4l9L53l23J89j23%l3J3M9J11k19OJ46Mj09j48K34Jj86L2
$$ -94 25 -43 68 25 59 -15 -54 299 -24 165 42 42 9 22 71 182 -37 -31 115 119 10 -138 96 97 -89 -57
7266e7N9k05L56k17J15J04j07k0n4J75l05L81k06K51m68P6K02j15L0k17K58N0
$$ -57 2 -203 153 -64 51 155 48 28 -26 149 -156 225 19 270 -198 -122 80 -35 -5 -222 36 86
7288H6q5J46j94j27K47k74N95m92L1Q9j93L06j41J2J16m48M64k77J68J01k49K13
$$ 86 1 147 -47 -174 73 -201 394 -98 -67 22 -171 135 -6 6 122 -326 138 -139 29 130 -119 94
7310I4j95O9J87j47J63k15L2N7j62O7j68J43J38r5M5M0l2Q4j82M4j5j53j09K14
$$ 94 -101 -32 155 8 171 -44 -12 45 -117 -50 -218 -75 63 -32 13 53 21 105 -77 -33 -48 -201 -310 -96
7334i6J39j28oK24l29J8R3k42N32k43J02j7j2k27j01j58L65k3J21J33Q0Nj53J54
$$ -96 43 -85 -91 133 -196 -178 -85 -327 205 -38 64 47 35 -192 -293 -451 -86 -109 12 145 225 230 77 231
7358B31j55j98L19k74L0R6j99L48l08K95l82Q7J51j77K74J52j94K20l15Q5j90
$$ 231 76 -122 197 -77 -47 49 -150 198 -110 185 -197 -110 41 -136 138 290 96 316 1 86 -104
7379a04kM2J16M5j70K61j7j28p1j54J50o5K70k10Q2k2JO8J36J40m06k9K7J70k63
$$ -104 -106 -64 52 97 -73 188 171 43 -28 -182 -32 -97 173 -37 45 23 24 92 228 368 -38 -67 -40 130 -133
7404a33R5O8k70j48M68k09O9k4J69r9Q4j53r1Q7k70L57k9j02J27k5J33k77L29
$$ -133 -38 30 -240 -388 80 -129 -60 -84 85 -14 70 -83 -174 -87 -357 0 -29 -131 -4 -29 104 -173 156
7427A56j59J79l29J47L52m43J40J23j91j20L28j8j64p7O5RL9O9q6M1k4j69J62
$$ 156 -3 176 -153 -6 346 -97 43 166 -25 -145 183 165 1 -76 -11 -2 37 106 20 61 37 -132 30
7450C0J7k05L67j63k20N9P8J01q5O2j52j36L55k6j05P0k6k67J81OQj9J23q1J53
$$ 30 47 -158 209 46 -174 -115 -37 64 -21 41 -111 -247 108 82 -23 47 21 -246 -65 -59 -51 -70 53 -28 125
7475A25K4j52r7J95N9m20J82j95K22K47k35O6j92J39K27k37l9O3J17j01J45j27
$$ 125 149 -3 -100 95 154 -266 -84 -279 -57 190 -45 21 -171 -32 195 -42 -81 -18 99 -2 143 16
7497A6n9L3o0J85o1r1l9R9l73K52M6K7J61k61J42k81J90O6J22k1k28J38J72L3
$$ 16 -43 -10 -70 115 54 -37 -76 23 -350 -98 -52 -25 136 -125 17 -264 -74 -8 114 93 -135 3 175 208
7521B08m34k9K45k5J82k77J96N6r8J81j54m9N1J31O1j73j17M47o76M50j43l2k
$$ 208 -226 -255 -10 -35 147 -130 66 122 24 205 51 2 53 184 245 72 -45 402 -274 176 33 1 -1
7544ak31M05k52J97j99P1j29R4J06M7j25m3j20J90o6J53k86j9J11p8K58K2j25
$$ -1 -232 173 -79 118 -81 -10 -139 -45 61 108 -17 -60 -180 10 -56 97 -189 -208 -97 -175 83 105 -20
7567b0O7K4j46j24L28p9o8R7k59J95O8M1k4R3j02l09L21j4j55j34M05j39K2k26
$$ -20 47 71 -75 -199 129 50 -18 79 -180 15 83 124 100 193 91 -218 103 89 -66 -200 205 66 88 -138
7591a38K24k88K04O5j86j93J94l2K03j96J60L21m38J97k65J47m8K87j93K27k09
$$ -138 86 -202 2 67 -119 -312 -118 -150 53 -143 17 338 -100 97 -168 -21 -69 218 25 252 43
7612D3Op5L3o6J40K2l07J51K76m7j14n7r7O9J15NJ28q2k24J85k67K25j97J73N7
$$ 43 49 -26 7 -59 81 103 -204 -53 223 176 62 5 -92 -23 92 97 225 143 -81 104 -163 62 -135 38 95
7637I5l12J88lQ4j10J13j88L71l77J20J22Q9l07K13j66k31K02K36p9n2P9n1r3
$$ 95 -217 -29 -32 52 -58 55 -133 238 -139 -19 103 192 -115 98 -68 -299 -97 139 60 8 87 36 -57
7660e7Pj56J90J12j92J65M3j69j64J59M4p7J49o3Kj91J08j17J19j14M7K37j01
$$ -57 -50 -206 -16 96 -96 69 112 -57 -221 -62 -18 -95 54 -9 -7 -198 -90 -207 -88 -202 -155 82 -19
7683a9K33k10jL07k00rm0M2j12O8K0k0o8n7o9J41QJ56j14J96k88K41j45Pp1N7
$$ -19 214 4 3 310 110 101 61 103 -9 59 79 59 -9 -66 -135 6 14 170 56 252 -36 205 60 67 -4 53
7709E3J07m7o4j94M66m32n4R3L03j90N5m18M27j90N9J90k0j17j33N7N6Q8l39J32
$$ 53 160 113 49 -145 321 -111 -165 -72 231 41 96 -322 105 -85 -26 164 144 27 -106 -49 7 95 -244 -112
7733a12K37P8m55M08k02J93j64P1j48Q9P0k78Q6L34m3k45n1M5J98k51K36j71o1
$$ -112 125 203 -252 156 -46 147 -17 54 -94 -5 65 -213 -127 207 164 -81 -132 -87 111 -140 96 -75 -136
7756a36J83pO1k01J73R2o1j62k0j2N0j8R2Jk6J26o2j76J28J74m22J61L2P0j8j44
$$ -136 47 40 101 -100 73 165 104 -58 -78 -90 -40 -58 34 35 9 135 73 -103 25 199 -223 -62 -30 40 22 -122
7782a22J76l19K34o6J75j8P4q3j35K72k97PK81k68m3J5J66j58K38K1j44j53J78
$$ -122 54 -265 -31 -97 78 60 134 51 -84 188 -109 -102 179 -89 -132 -117 49 -109 129 150 6 -147 31
7805C1j74J85k02K36k69L33j67K01j05j15L12l5j75m3M2K0j46l06M85m8n6O0r9
$$ 31 -143 42 -160 76 -193 140 -27 174 69 -46 266 231 56 13 55 75 -71 -377 108 60 4 64 -35
7828c5o9L1p0K18k32L75k20J84n0j47O0Q8K1p4m9k61L26O1j93K5j31J31m6j1P7
$$ -35 -104 -73 -143 75 -157 218 -2 182 132 -15 45 133 154 80 31 -230 96 157 -36 -11 -142 -11 -57 -68 9
7853IM7Q8k54K70p8k03L11J12l28j10K37mj46Q5l5J18J20o7l11J92r7M9k9L6k9
$$ 9 56 144 -110 160 82 -121 190 302 -26 -136 101 97 -49 36 1 119 239 172 -139 53 -44 5 -24 12 -17
7878a7k04K87k2p0L13j18p2k14J08k3qL6J60q3Nj17N9n2M9R8k44K72j33Q4k89
$$ -17 -221 66 44 -26 287 169 97 -117 -9 -32 -40 -4 156 73 78 -39 20 -32 17 115 -129 143 10 94 -195
7903a95J84J30k08L0P9o9p2M2o0N5N5p5R8mJ66n3l6J35l73K1J62m4j6J85n4J29
$$ -195 -11 119 -89 -59 20 -49 -121 -79 -139 -84 -29 -104 -6 -10 156 103 67 202 -171 -150 12 -32 -48 137 83 212
7929B12k26K81l71J09M6k97N03k71l2J81j53J05k8j5pj87J07K01ok2j04K78m24
$$ 212 -14 267 -104 5 51 -246 257 -14 -46 135 -18 87 59 44 37 -150 -43 158 152 130 26 304 -120
7952a20J50m9K4j94K24p1L3J33r5P2l6k0q6p7R6ok85M20k73R5J29k40K41j03k5
$$ -120 30 -19 5 -189 35 -36 -3 130 35 107 71 51 -35 -112 -16 -22 -307 113 -160 -65 64 -176 65 -38 -63
7977f3LQ6j25J61l1n5K3J7r3J01j03J27j01k05N7K70M7j10MR8J7p1rl5J17o7k89
$$ -63 -60 26 -99 62 31 -24 -1 16 -77 24 -79 48 -53 -258 -201 69 116 6 10 108 125 54 45 10 127 60 -229
8004b29K02r3L87j54k05j8K16P4m3k9m1k25K30p3j09M0m7j0J76j35J28l3J51Q1
$$ -229 -27 -120 267 113 -92 -110 106 180 137 108 67 -158 72 -1 -110 -70 -117 -127 49 -86 42 9 160 241
8028B41l89L75l09J40L6l56K89j02K2J58M5k58p3J04N9JR5m9N9k25J58l00L36
$$ 241 -148 227 -82 58 94 -262 27 -75 -53 105 150 -108 -181 -77 -18 -17 78 29 88 -137 21 -279 57
8051E7j28l2L74j45M6j94K6l3J95j87j2Q0j43N4J93r0K06j18k26N3p2J93j80k28
$$ 57 -71 -103 271 126 172 -22 4 -29 166 -21 -33 47 -96 -42 151 61 267 149 -77 -24 -96 97 -83 -311
8075c11j1J88K7n2K01j44J81R1l23K1L70k09j16L10k68K42k67L51j76k60N9J57
$$ -311 -322 -134 -107 -159 42 -102 79 170 -153 -132 238 29 -87 223 -45 197 -70 281 105 -155 -96 61
8097F1j05p5J60q0Q9qr8K41Ol7l66J33K00l29P5L08m11M08r0j66j3J76o6m9q7
$$ 61 -44 -119 41 -39 50 42 -56 185 191 154 -212 -79 121 -208 -133 175 -236 172 82 -84 -97 79 13 -36 -123
8122a23J51J11Ko0Q4j61L3j03J00M7L2p5J75J1j23j65K49k33j21L0K4r1N7K33
$$ -123 28 139 141 81 165 4 37 -66 34 81 113 38 213 224 101 -64 185 -48 -169 -139 -115 -206 -149 84
8146H4J62j65k50J78J18k62M0J10K30l12J69j8j22J5m7J08q5j36K57N4j44P8J69
$$ 84 246 81 -169 9 127 -135 -95 15 245 -67 102 84 -38 -23 -70 38 -47 -183 74 128 -16 62 231
8169B31O5o3o2k73N4Q7j07K6K9j47J23j18J82m0M3k35J73j63n3K83r0r8
$$ 231 296 233 171 -102 -48 39 -68 -42 -13 -160 -37 -155 27 -13 30 -205 -32 -195 -248 35 -55 -153
8191a53
$$ Imaginary data points
##PAGE= N=2
##DATA TABLE= (X++(I..I)), XYDATA
0@%%%%%%%%%%%%%oJ4j6J6j6K0k8L2l8M6n3O1p2Q6r6J06j25J47j66J90k14K38k68
$$ 0 0 0 0 0 0 0 0 0 0 0 0 0 0 -6 8 -8 8 -8 12 -16 16 -22 24 -29 32 -40 46 -50 56 -69 78 -88 102 -112 126 -142
36a42L03l43L87m30M76n31N88o51P22p98Q81r72J071j180J301j433J578j739J921
$$ -142 161 -182 205 -225 251 -280 308 -343 379 -419 462 -510 561 -619 682 -751 827 -912 1009
55A009k126K358k625K933l291L720m245M900n743O874q490J0999j5452K5717r2633
$$ 1009 -1117 1241 -1384 1549 -1742 1978 -2267 2633 -3110 3764 -4726 6273 -9179 16538 -76095
70g6095j0014K17368M4059r9855j48634n3086O3174J56666J04491j1022j18070
$$ -76095 -86109 131259 175318 75463 -73171 -126257 -63083 93583 198074 187052 68982
81F8982j34448q0186O2230J64155J04400n2304j34536j46660o2244Q9023J65725
$$ 68982 -65466 -145652 -83422 80733 185133 132829 -1707 -148367 -210611 -121588 44137
92D4137Q8946m5067j29899j14736k7248Q9239J43385Q7273j2617r2926j17828
$$ 44137 133083 88016 -41883 -156619 -183867 -94628 48757 136030 123413 30487 -87341
103h7341k8924R1267J14902N7591j9349q4550r1597k9168M7556O7816M4787J1343
$$ -87341 -116265 -24998 89904 147495 128146 43596 -48001 -77169 -29613 38203 82990 94333
115I4333n8407j09821n6026L3239Q1896Q0243O447p8923q1431k5810L1039Q0287
$$ 94333 35926 -73895 -129921 -96682 -14786 65457 71904 -7019 -88450 -114260 -83221 -2934
127b934R0287K1308p8974r6656k8475M6880R6796Q1993p355q2858q8701m3159
$$ -2934 87353 108661 29687 -66969 -95444 -48564 48232 130225 122870 40012 -48689 -91848
139i1848L5292Q9108O6351r610p2435q0510m1240K4364Q1135O4969r022n5777
$$ -91848 -56556 32552 98903 89293 16858 -63652 -104892 -80528 607 65576 56554 777
151G77o0033k8929L0105O2617M6368P730l1693n0475l1343J8879N7817M7074M956
$$ 777 -59256 -88185 -58080 4537 50905 58635 26942 -23533 -54876 -35997 21820 68894 73850
164G3850l6144o2030l8060K1070N1939M4523J1904l9240o7153m1516J7387N9430
$$ 73850 37706 -24324 -62384 -41314 10625 55148 67052 27812 -39341 -80857 -63470 -4040
176d040N2992J1246m2007o5724l0622K4250N5685N6544J3896m4005n8064k8015
$$ -4040 48952 60198 18191 -47533 -78155 -53905 1780 58324 72220 28215 -29849 -57864
188e7864J7140M9750M8951J2178l7635n5243k7931J0432L7840M0964P035k8127
$$ -57864 -40724 9026 57977 70155 32520 -22723 -50654 -40222 -2382 38582 45617 17490
200A7490l7131k7464J157L4831L7587J0313k0987l3468k3011L406L4334L8976
$$ 17490 -19641 -47105 -45948 -11117 26470 36783 15796 -17672 -40683 -37277 -2943 36033
212C6033R722k0112l6037k9777N372L7232L9074J4651k3734m8390l6618M398M0926
$$ 36033 45755 25643 -10394 -40171 -34799 2433 41507 56158 32424 -15966 -52584 -48186 -7260
225g260M1303J3019j9850m3800l5011M424L5136L7659J5258j9198l6820k4216
$$ -7260 34043 47062 27212 -16588 -51599 -47175 -12039 25620 40878 21680 -15140 -39356
237c9356N772L0167L2087J2600j5962l2055k0108M902J9572K4984J2962j3592
$$ -39356 -33584 -3417 28670 41270 25308 -6747 -26855 -21953 -2381 22603 35565 21973
249B1973k8875k1494j82K0584K5455J0265j2217k4979k0758l615J9112K9891J5135
$$ 21973 -6902 -28396 -28578 -7994 17461 27726 15509 -9470 -30228 -33843 -14731 15160 30295
262C0295j1808k6160k3052j554K4736L2155J4851j2278l0192k5099k136K2142
$$ 30295 18487 -7673 -30725 -32279 -7543 24612 39463 27185 -3007 -28106 -30242 -8100
274h100L0959J5110j0201k7825k7248l856K0280K4019J1537p632k1053j8572k880
$$ -8100 22859 37969 27768 -57 -27305 -31161 -10881 13138 24675 17043 -4010 -22582 -25462
287b5462J4399J8709Q826m545j5715j4704k21J3488J7624J0362o161j7817j4539
$$ -25462 -11063 7646 16472 11927 -3788 -18492 -18713 -5225 12399 22761 16600 -1217 -15756
300a5756j642J1306J7936J3607l060j9763k0938o704J2076K2129J6395m013k0881
$$ -15756 -17398 -6092 11844 25451 22391 2628 -18310 -25014 -12938 9191 25586 21573 692
313F92k1528p580J2409K3442J5395l683j9172j9156n891J2900K2927J3747o644
$$ 692 -20836 -28416 -16007 7435 22830 19147 -25 -19181 -25072 -12172 10755 24502 17858
326A7858j7225j5747l680J0787J6478R383k909j2718j2866l237Q433J1823N734
$$ 17858 633 -15114 -18794 -8007 8471 17854 14945 2227 -10639 -13876 -5443 6380 12114
339A2114k365r257j0823l725P709J1458P007j350r334j2706n237O592J4557J2737
$$ 12114 9749 492 -10331 -14056 -6347 5111 12118 10768 1434 -11272 -16509 -9917 4640 17377
353A7377N80j3013j7421q202N944J5676J6276L914j3014j8239q899N369J4471
$$ 17377 17957 4944 -12477 -20679 -14735 941 17217 21131 8117 -10122 -19021 -13652 819
366H19J3526K408j1274j4370o066O021J3323R383k612j0468r180k761O190J0908
$$ 819 14345 16753 5479 -8891 -14957 -8936 4387 13770 11158 690 -8490 -11251 -5061 5847
380E847O897l872r940q250k226M878R349O948j059o725q691m698L771Q250P602
$$ 5847 12744 8872 -1068 -9318 -11544 -6666 2683 9631 8572 1847 -6844 -11542 -7771 479 8081
395H081J921m630r976p956K928J0744R944L531o035j2406r551K070J0762J1742
$$ 8081 10002 5372 -4604 -12560 -9632 1112 11056 14587 8552 -3854 -13405 -11335 -573 11169
409A1169L938p184j3096q032K019Q571R651L876o880j0453m062M264P028N479
$$ 11169 15107 7923 -5173 -13205 -11186 -2615 7036 10912 4032 -6421 -10483 -6219 809 6288
423F288m56o503o207l54M661O992N092j577p505o089j461L041O704O313P6n475
$$ 6288 5832 -671 -6878 -7232 -2571 4421 9513 7936 431 -5658 -7119 -4078 2626 8939 9015 3540
439C540o634n293q98N994Q498L512k340o555p351k722M902Q016M401p11o373p048
$$ 3540 -3094 -8387 -9285 -3291 5207 8719 6379 -176 -7527 -10249 -5347 2669 7070 6359 -14 -7062
455g062o73O656O442K776j587p265p436L79P304O611J388l864p072l994K878M862
$$ -7062 -7735 -1079 5363 8139 6552 -713 -8149 -7770 -466 6145 7533 3669 -3403 -7397 -4519 343
471C43M344K239m064p700k432M026M900L643J412l673o205k810J756L974N005
$$ 343 4687 6926 2862 -4838 -7270 -3244 1656 5299 6711 3038 -3167 -5977 -4221 -247 4758
486D758K450l193n923m974j354L013P242M544j834m522l957l171J393O478M893
$$ 4758 7208 4015 -1908 -6882 -8236 -5223 2019 6563 4729 207 -3750 -6921 -5528 950 5843
501E843q42k730l677j824K558M592J748k442l744l586M06N144L816q57k790m378
$$ 5843 5001 2271 -1406 -3230 -672 3920 5668 3226 -518 -4104 -3698 1446 5262 4405 1615 -2763
517b763n470l75N798N629J020k588l776l122L86L275L716L238J089m219m288O4
$$ -2763 -8233 -8608 -2810 2819 3839 1251 -2525 -5647 -5261 -1986 1730 4968 6057 1838 -2450 -2386
533b386J921L022L729J142m371n032q60J296K608K329l70l866l904k318L83N281
$$ -2386 -465 2557 6286 7428 3057 -1975 -2835 -1539 1069 3398 3028 -838 -4742 -7060 -6677 -1396
549a396M196j773l521j385P01P27L085K835j384k302j300N95L149M596O57l120
$$ -1396 2800 1027 -2494 -3879 -3178 -2451 634 3469 2085 -217 -1517 -922 2227 6823 7480 4360
565D360l860k697j123K968M091K39j860j695m061l873J146L927K809J029k73l617
$$ 4360 500 -2197 -3320 -352 3739 3978 2118 423 -3638 -7511 -6365 -2438 371 1400 1127 -2490
581b490k524J296K097K228K728mk609j062J123J389J996J018k872m017R1K569
$$ -2490 -5014 -3718 -1621 607 3335 3331 722 -340 783 2172 4168 5186 2314 -1703 -1612 957
597I57R76J189n79l926k947j090R59L129L764l28l830j983M61J532K413K159o69
$$ 957 1933 3122 2543 -1383 -4330 -5420 -4461 -1332 2432 2104 -1726 -3709 -3248 -1716 697 2856 2187
614B187j934q47k67N30K438K307m20j469k214k591q87J959K294K29K35j856k877
$$ 2187 253 -594 -861 -331 2107 4414 3994 2525 311 -2280 -3167 -1208 1086 1315 1550 -306 -3183
631c183q90K053J794J152P66j734j990P59J912R78O4q40j656j77K093J556P45
$$ -3183 -4073 -2020 -226 926 1692 -42 -2032 -1273 639 1617 1681 841 -815 -992 1101 2657 3402
648C402o4k883m402n41K206K353J675N79k208k426q49K47J075K116J747j52o51
$$ 3402 3338 455 -3947 -4488 -2282 71 1746 2325 117 -2309 -3158 -2911 -1836 280 2027 1875 1224
665A224q84j087M56J629J098o58m85l92j347l5J340K56q20j027j532j221J412
$$ 1224 340 -747 -291 1338 2436 1778 1293 901 -446 -481 859 1115 295 -732 -2264 -3485 -2073
682b073J719M29p36r41j219M80K406J442K71m74j202r43J003K402J175l25j884
$$ -2073 -354 75 -661 -1602 -2821 -2341 65 1507 1778 1304 102 -841 162 2564 3739 3414 1530
699A530j760p81R13J029O94K77o73k656j617o55L01J019J799J155l72o60p93p00
$$ 1530 -230 -1011 -98 931 1625 1902 1229 -1427 -3044 -3699 -3398 -2379 -580 575 203 -457 -1250 -1950
717a950K07J690R22M97j04R0k64P26R02p13j659l60j86J038J609m34k004k089
$$ -1950 -1743 -53 869 1366 1262 1352 1088 1814 2716 2003 344 -16 -202 836 2445 2011 7 -2082
735b082j440k53K011K304P28j150j454j065j06J549J513J62m5m49M2K87M05N80
$$ -2082 -3522 -3775 -1764 540 1268 118 -1336 -2401 -2507 -958 555 717 672 223 265 552 957 1537
753A537q5m9j86o92j22l5m10L75P06n69q98p56n45OQ11P33L46l24l68K4M86L17
$$ 1537 1452 1403 1217 525 403 368 -42 333 1039 470 -428 -1184 -1729 -1723 -912 -179 167 -157 -525 -501 -15 302
775C02J8r77l91M73P38J824R23j132j850j443k59R80J819R12m15j235j237j117
$$ 302 320 -657 -1048 -575 163 1987 2910 1778 -72 -1515 -1774 -794 1025 1937 1522 287 -950 -2067
793b067N19R84J090O54o4l88o74n91n6l26L14O84O45p0k88N33q17l52k58n61K05
$$ -2067 -1548 -564 526 1180 1116 728 54 -537 -593 -919 -605 79 724 654 366 899 82 -270 -528 -1089 -884
814h84N25N72J58J40m23j153L5M75J018P19K06m54j136m14O80M50P50J80j315
$$ -884 -359 213 371 511 88 -1065 -1030 -555 463 1182 1388 934 -202 -616 64 514 1264 1444 129
833A29l43m85j8M12J037o2m43j106n11l52K35O85J061J02L7p40n10k5N57M06N73
$$ 129 -214 -699 -717 -305 732 670 227 -879 -1390 -1742 -1507 -822 239 341 378 -362 -872 -897 -340 66 639
854F39M27ok27K39J57p14n05l99K16M55J187L37q77j256j421j073R28J202J135
$$ 639 1066 1060 833 1072 1229 515 10 -389 -173 282 1469 1806 929 -327 -1748 -2821 -1893 -691 444
873D44m6j87j302l66O7O77Q16K5N46o2K14Qk03l10N28j90M54K19J14o45n01J8
$$ 444 398 211 -1091 -1457 -1390 -713 103 128 674 612 826 834 631 321 849 659 1113 1332 1446 801 300 318
895C18k92k32l24m26j04j02M44K58k87m82pL73P48K12k05k74n9L28J075J033J34
$$ 318 26 -206 -530 -956 -1060 -1162 -718 -460 -747 -1229 -1236 -863 -115 97 -108 -382 -441 -113 962 1995 2129
916B129q98j063l85o3J260P77j25p77o68j285q7K36P8J08N41L96l61N3n79j058
$$ 2129 1231 168 -217 -280 980 1757 1632 855 187 -1098 -1185 -949 -871 -763 -222 174 -187 -134 -713 -1771
936a771k90J167P57P13N39l47n95k31O9j59P04J23r1M44M99k76j430r10J48k1
$$ -1771 -2061 -894 -137 576 1115 768 173 -58 11 -148 556 679 588 1032 1531 1255 -175 -1085 -937 -958
956i58R24J204j10r04j244m07K89P94N06j59k97l2j33L65Q81k56l61o9L49J6n8
$$ -958 -34 1170 1060 156 -1088 -1495 -1206 -412 94 -65 -362 -394 -527 -162 719 463 102 33 382 398 340
977C40m4k65j89K24P00m52j58k93p40M67R07m6Kj79j91n46J60K06l51j32Q41L70
$$ 340 296 31 -158 66 766 314 156 -137 -877 -410 497 451 453 274 83 -463 -303 -97 -448 -580 261 631
999F31J49j49p50p61p33K16J197J064J84q87p29J0l5q4O60J052m31l82M52K53
$$ 631 780 631 -119 -880 -1613 -1397 -200 864 1048 161 -568 -558 -593 -677 -17 1035 604 222 674 927
1019I27m23n69k39l7R44K71j27j34n26j151oO06J63j37l64L69J7kL86k3l63n7
$$ 927 504 -65 -304 -341 603 874 747 613 87 -1064 -1070 -464 -301 -438 -802 -433 -416 -418 -32 -55 -418 -475
1041d75K64N03N64l33j71j82M54K54j08J00l83r20J58P85J12K44r55n90m68J3
$$ -475 -211 292 856 523 352 170 624 878 770 870 487 -433 -275 510 622 866 -89 -679 -1147 -1134
1061a134J02J19M04j66M34N60Q6p19l66J46K93J58J064L61k58o15n96L4L53J83
$$ -1134 -1032 -913 -509 -675 -241 319 405 -314 -680 -534 -241 -83 981 1342 1084 469 -127 -93 260 443
1081D43J50J97L4k17q19j76m96n55J97J015P10j09m00o07l54n4P76L26K57j62
$$ 443 593 790 824 607 -212 -388 -884 -1439 -1242 -227 483 374 -26 -633 -987 -1041 -265 61 318 156
1101A56j35J6L26K27k47j57o3l26M94N66l82p99l19K59P6M29R4j98m32j24J34
$$ 156 21 37 363 590 343 186 123 -203 291 857 475 -324 -643 -384 -308 121 215 17 -415 -539 -405
1122d05J011M0m42l12J6N0j6j13N03J16k81J52L1m89q75N6K60O45N09K14l05p45
$$ -405 606 646 204 -108 -92 -42 -58 -171 332 448 167 319 350 -139 -1014 -958 -698 -53 456 670 365 -380
1144c80p08N9R00R65j07R3J17k09k53j56m42o6l01O73N42M33o19j231n5n8j69
$$ -380 -1088 -1029 -129 836 729 822 939 730 477 321 -121 -187 -488 185 727 1160 541 -690 -745 -803 -972
1165i72K92O19j01n53o6L81J12p3J5L02L07L63M97p2m49l79l44P14M27n74k61
$$ -972 -680 -61 -162 -715 -781 -400 -288 -361 -346 -44 263 626 1123 1051 602 223 -121 593 1020 446 185
1186A85L5k98L5J6n8k89r79r9J94N27K18j28K24J45J33N6L24Nk74N6R02M43j10
$$ 185 220 -78 -43 -27 -85 -374 -1353 -1452 -1258 -731 -513 -641 -417 -272 -139 -83 241 246 -28 28 930 1373 1263
1209A263k73l58n79N4j42L61L93l42l86k23j08l27o56K92K8L16O03M24r1q39k51
$$ 1263 990 632 53 107 -35 326 719 377 -9 -232 -340 -667 -1323 -1031 -1003 -687 -84 340 249 -590 -841
1230h41R0O92L61L97L62l94k93k19K93km92j5M25J67J24n31k07n20l58M17L65
$$ -841 -751 -59 302 699 1061 667 374 155 448 446 -46 -61 364 531 655 124 -83 -603 -961 -544 -179
1251a79J28Q1l51j05J19J81K92r0j13l30q1O38L08l35j82J4K82j2N6k09j3k43
$$ -179 -51 30 -321 -426 -307 -126 166 76 -37 -367 -448 190 498 163 -19 -5 277 265 321 112 99 -144
1273a44j60P49K40l53r23K00n4K68L34P46l40o23Q0k01P1k80j73L40j3P18j22
$$ -144 -304 445 685 332 -591 -391 -445 -177 157 903 563 -60 20 -181 -110 -390 -563 -223 -236 482 360
1294C60rj57j015k24N26N97K31O2K2m43k85L50J04J62n5N2K49L3j27k48m41Q7
$$ 360 351 194 -821 -1045 -519 78 309 371 393 -50 -335 15 119 281 226 278 527 560 433 185 -256 -169
1316a69l72L42P26p3q37k32Q7J86J75j47j5K8j69J39M29J10k15k64M5N52K31k16
$$ -169 -541 -199 527 454 -383 -615 -528 -342 -167 -314 -329 -301 -470 -331 98 208 -7 -271 -226 326 557 341
1338C41L1j53J2N1N77m13m35l91p8K72L22j93M82j67o09l63J85N9k40J61J54O61
$$ 341 372 219 231 282 859 446 11 -380 -458 -186 136 -57 425 258 -351 -714 -529 -470 -710 -549 -395 266
1360B66m9K6k03j50m36K18L55J041l59l65l75J96k40J6M2L40j12J83J37l3o14
$$ 266 217 243 40 -110 -546 -328 27 1068 709 344 -31 165 -75 -59 -17 323 211 394 531 498 -116
1381a16m41j58J54M78K08R3l17m9n72K50L03P4j22J21K10j9J63j49j2j74q6M64
$$ -116 -557 -715 -561 -83 125 218 -99 -148 -720 -470 -167 -93 -215 -94 116 97 260 111 99 -75 -161 303
1403C03N7J00J42m96J04n7j96L37l03l14j94O0P02J36j99m08j66j65k17M71J86
$$ 303 360 460 602 106 210 153 -43 294 -9 -323 -517 -457 245 381 182 -226 -392 -557 -774 -303 -117
1424a17l96K84L77J95j0m20k80M06K32L59M10nk31p46m7j19L4o2L51J86k31J35
$$ -117 -513 -229 148 343 333 -87 -367 39 271 630 1040 1035 804 58 11 -108 -74 -136 215 401 170 305
1446C05j23m43l35k75L8K41N31pJ85P5q40K77K61N27j53o1p3K69l14K16Lr0k64
$$ 305 182 -261 -596 -871 -833 -592 -61 -68 117 192 -648 -371 -110 417 264 203 130 399 85 301 304 214 -50
1469e0o5O24K93n89k44j41L5L7j12j9J14k21l82O41K74q1m05n0Q5j06l0L53M14
$$ -50 -115 509 802 213 -31 -172 -137 -100 -212 -231 -117 -338 -720 -79 195 114 -291 -341 -256 -362 -392 -39 375
1492C75j78Qj10J74J86p17K77M06j08m1N02l29o97j6J6M0J24n6L18l6j00j77J
$$ 375 197 205 95 269 455 -262 15 421 313 272 774 445 -252 -268 -252 -212 -88 -144 174 138 38 -139 -138
1515a38j5k12j41K46N67J61p27O3Lm83N19M35j80J61r2J43r8j26n3O5O0k4j67
$$ -138 -153 -365 -506 -260 307 468 -259 -196 -193 -676 -157 278 98 259 167 310 212 86 33 98 158 134 -33
1538c3L02K23m78k28J4K80k18r0j6J10l26K99N5K61j95n35L81n8P0R6J74M48m31
$$ -33 269 492 14 -214 -200 80 -138 -228 -244 -134 -460 -161 -106 155 -40 -575 -194 -252 -182 -86 88 536 105
1561A05l35M91P4m05K5M04K8l3J53k86o8p40R2J65L04K13m66N7J72k76k99K91
$$ 105 -230 261 335 -70 -45 359 387 354 507 221 153 -587 -495 -330 -26 187 -279 -222 -50 -326 -625 -334
1583c34L0l7L05K49L67l52j92j53j97K38k5L48Q5J89k81J69l36N6j74j62K91%
$$ -334 -304 -341 -36 213 580 228 36 -117 -314 -76 -101 247 332 521 240 409 73 129 -45 -207 84 84
1605H4L8L18j54o41J84O7O8j72q9K68J08k84MrL67m65K6L55K99k92M26l63k13
$$ 84 122 440 286 -355 -171 -104 -36 -208 -297 -29 79 -205 -201 -210 157 -308 -282 73 372 80 506 143 -70
1628g0ok18M56J9J31o34N80J62Q9l46r8j18j40QK50N2O0l39K31k7l53k62J47K31
$$ -70 -76 -294 162 181 312 -322 258 420 509 163 65 -53 -193 -185 65 117 177 -162 69 42 -311 -573 -426 -195
1652a95J58m0K44K49k85m68mL20M29k5R0p9j30q3j51O8M0R6j17J1q7k19N7Q0m41
$$ -195 -37 -77 167 416 131 -337 -341 -21 408 383 473 394 264 181 30 98 138 234 117 128 41 -178 -121 -41 -482
1677d82J79k29N79k60R7m3N1p7J24J88k05J83J19J29J25q8k37K79j77k9p3o3K16
$$ -482 -303 -532 47 -213 -116 -159 -108 -185 -61 127 -78 105 224 353 478 390 153 432 255 226 153 90 306
1700C06n18J61q0J77j62j83R2m86K48q7L23K23k38J27k60L70M8P9j2K66k10m4
$$ 306 -212 -51 -131 46 -116 -299 -207 -693 -445 -532 -209 14 -224 -97 -357 13 61 140 128 394 184 140
1722A40M53m37j87j28J58L42k29Q1l7N7j37n67L43J02k97K27p3N3o0k14J68JJ86
$$ 140 593 156 -31 -159 -1 341 112 193 156 213 76 -491 -148 -46 -343 -116 -189 -136 -196 -410 -242 -241 -55
1745e5N3p9L35L3k56j70L69k18j86K93j87K33m2k31K89k48j5j33L07P7l13J37
$$ -55 -2 -81 254 287 31 -139 230 12 -174 119 -68 165 123 -108 181 -67 -82 -215 92 169 -144 -7
1767gL35o6k47J40k05j44j28L98j98J08j3NJ3j90k09K33K16J19n75L37N09k44
$$ -7 328 262 15 155 -50 -194 -322 76 -122 -14 -27 -22 -9 -199 -408 -175 41 160 -415 -78 431 187
1789A87k63Q3N6j36J15K66L79j88l52j36J08j59l02J37J90J50l24p4p9L91m78
$$ 187 -76 7 63 -73 42 308 687 499 147 11 119 -40 -342 -205 -15 135 -189 -263 -342 49 -429
1810d29o8L04k91L44m7L97k52kj05L28J87j76J93R9j99j75K52K1k33j57nJ1J93
$$ -429 -497 -193 -484 -140 -187 210 -42 -44 -149 179 366 190 383 482 283 108 360 381 148 -9 -14 -3 190
1833A90n48K70j47K44n92L59j32O1j82L08J65j20P1J64k08K23o1p0K31L0J21r7
$$ 190 -358 -88 -235 9 -583 -224 -356 -295 -477 -169 -4 -124 -53 111 -97 126 65 -5 226 256 377 280
1855B80o8K5j33j3q8l39M06N7L7m9l70j74M41j56k29J12J32N5j95K39p2P8q8q3
$$ 280 212 237 104 91 3 -336 70 127 164 115 -255 -429 12 -144 -373 -261 -129 -74 -269 -30 -102 -24 -112 -195
1879a95J23K34n4o3K14j17l37K7K79J6r5K23k25K57k69j34J16J4k11K40O7J5k24
$$ -195 -72 162 108 45 259 142 -195 -168 111 127 32 255 30 287 18 -116 0 14 -197 43 110 125 -99
1902i9O4J1jj85L39j06J16k36J15l48M45j14o5J24j87l0J92L12j87KJ6J8j96L41
$$ -99 -35 -24 -25 -210 129 23 139 -97 18 -330 115 1 -64 60 -127 -157 35 347 160 162 178 196 0 341
1926C41j12k68K97o1k55J81kk90R0J23k35j57J46L18L9k64j50M5PQL04J45K19
$$ 341 229 -39 258 197 -58 123 121 -169 -79 44 -191 -348 -202 116 155 -109 -259 -214 -207 -199 105 250 469
1949D69k38l5qq8k45J49J97J44j01j51j51j44P8j14J84P2l73L05j58J40j50m5
$$ 469 231 196 188 100 -145 4 201 345 244 93 -58 -202 -124 -238 -54 18 -355 -50 -208 -68 -218 -263
1971b63k9r7J67M8K00N4O8mk20K01j68J47L47m73L98j36L6l5l54J94k34Rj70L04
$$ -263 -292 -389 -222 -174 26 80 148 144 -76 125 -43 104 451 -22 376 240 276 241 -113 81 -153 -144 -314 -10
1995a0q1J68q6j45j5R7m0M0p5K00q4j1K44k53j65L25J70m26J34J52K3N8j77p5
$$ -10 -91 77 -9 -154 -169 -72 -112 -72 -147 53 -31 -42 202 -51 -216 109 279 -147 -13 139 162 220 43 -32
2019c2J07j37O2J93N0J51j26n03K65j13j75J64n5o8K11R2r2j34K6j31O7K38K3
$$ -32 75 -62 0 193 243 394 268 -235 30 -83 -258 -94 -149 -217 -6 86 -6 -140 -114 -245 -178 60 83
2042H3j40L1K23k26l0K50p2Q5lj11L7Q0j0j96jm4r5R1J45k43J07J9n7k89J61J8
$$ 83 -57 -26 197 -29 -59 191 119 204 201 90 127 207 197 1 0 -44 -139 -48 97 -146 -39 -20 -77 -366 -205 -187
2068a87N6k22N25m44K48N6OK0j86J59J76J07m0l3o9K9j30K08k26m1j25N4J72J11
$$ -187 -131 -353 172 -272 -24 32 38 58 -128 31 207 314 274 241 172 201 71 279 53 12 -113 -59 113 224
2092B24k96q3p3J59k40L22k14Q5R6l79K28M0J2j5L03r6%K71j16k98K73j22l1m
$$ 224 -72 -155 -228 -69 -309 13 -201 -116 -20 -399 -171 -131 -119 -134 169 73 73 344 228 -70 203 81 50 46
2116D6K43l26KJ55j47j38J89r6pn1j90M73m80N65l73j5M2J85j21o4n7K58O2j57
$$ 46 289 -37 -35 120 -27 -165 24 -72 -79 -130 -320 153 -327 238 -135 -150 -108 77 -44 -108 -165 93 155 -2
2140bK21q7j0q3j23L26j01J7J96k27k1j76J34k0P7m37J07K41k05K86j29m05K52
$$ -2 219 132 122 39 -84 242 141 158 354 127 106 -70 64 44 121 -316 -209 32 -173 113 -16 -421 -169
2163a69M6K1K79l05o2K8J91l3j43J73j23K5j66L61N4L8l2r3k09M11l63J25Q5k00
$$ -169 -123 -102 177 -128 -190 -162 29 -4 -147 26 -97 -72 -238 123 177 215 183 90 -119 292 -71 54 139 -61
2187f1j15Q9K18j37j01j91k11M29k0K72k49j13L2K92j54J89j11k38M10j37J99
$$ -61 -176 -87 131 -6 -107 -298 -509 -80 -100 172 -77 -190 -158 134 -20 169 58 -180 230 93 292
2208B92k64K1k6j59J86J5kk0nnm93L55J2L7p0j6j20M22p1k96K3l6j6K26RJ43L7
$$ 292 28 49 23 -136 50 65 63 43 38 33 -460 -105 -93 -56 -126 -142 -262 160 89 -207 -184 -220 -236 -10 -1 142 179
2235A79l78J22K41nj92J80P2m4l9L9j97j7O8J35l70K30K77o6l03J04r7K05j84
$$ 179 -199 -77 164 159 -33 147 219 175 136 175 -22 -39 29 164 -206 24 301 235 -68 36 -61 144 -40
2258d0P6q5M4Pj2j26K5J93j89k57M34J1J84k38J7o6K41l77K48J08j65J36n6K63
$$ -40 36 -49 -5 2 -10 -136 -111 82 -107 -364 70 81 265 27 44 -22 219 -158 90 198 33 169 113 376
2282C76Q3l52k01j21K78q1j61M81l42j92K83j30O8k60Q8K62l8K47n06L49m38O9
$$ 376 459 107 -94 -215 63 -18 -179 302 -40 -232 51 -79 -11 -271 -183 79 41 288 -218 131 -307 -238
2304b38L26M4J14j82R3j09K18K4k98J46M9k14k19M57q0P1j87m35J00J92k23L39
$$ -238 88 132 246 64 157 48 266 290 -8 138 187 -27 -246 211 131 202 15 -420 -320 -128 -351 -12
2326a2p2j81J08M98k81J38p6j42K13l16L71j11m0J06k26M8J5J93l56J45P4p6j11
$$ -12 -84 -265 -157 341 60 198 122 -20 193 -123 248 137 97 203 -23 25 40 233 -123 22 96 20 -91
2349i1J04L6j72n7j9L35k95l1%o8K0L19j09K28l51N9oL54k27P9j9l1l44N06j45
$$ -91 13 49 -123 -180 -199 136 -159 -190 -190 -258 -238 81 -28 200 -151 -92 -98 256 29 108 89 58 -286 220 75
2374G5K07k38p9j2J35p3j7O8j37N5K00l13J97k13o4J62K7j18J44j12PN3j72L87
$$ 75 282 44 -35 -47 88 15 -2 66 -71 -16 184 -129 68 -145 -209 -47 -20 -138 6 -106 -99 -46 -218 169
2398A69q1J1j93Q6K28k73K52j74J4J10j16N5rN8l01K2J86rJ22k28j18m9mJ48N4
$$ 169 88 99 -94 -8 220 -53 199 25 39 149 33 88 79 137 -164 -142 44 35 157 -71 -189 -238 -242 -94 -40
2423d0j07j36L23Pj4l03M22j02j10J49M5j24J5K35k74K39m58N46k98J31rk70L7
$$ -40 -147 -283 40 47 33 -270 152 50 -60 89 134 10 25 260 -14 225 -233 313 15 146 137 -133 -96
2446i6J65J27j84l8j63j1L56k71K01ml30J67LK11r9M3m8j24M6J75k4K88m11J42
$$ -96 69 196 12 -26 -189 -200 156 -115 86 82 -248 -81 -78 133 34 77 29 -95 -49 126 102 390 -21 121
2470A21J18M4k50L0k29M67l01K6k12J18J06mJ27k62J3k91K59l8K71J10k25p0K19
$$ 121 239 283 33 63 -166 301 0 26 -186 -68 38 34 161 -101 -88 -379 -120 -158 113 223 -2 -72 147
2493A47k81L34l51J8J71J23q6K8n9l2j46J15p5R6R3Rp3lrj44K78j95p1J4J26N0
$$ 147 -134 200 -151 -133 38 161 75 103 44 12 -134 -19 -94 2 95 104 31 28 19 -125 153 -42 -113 -99 27 77
2519G7k16N1qm7j1j28K56J47o4k48J74j03L01q6Mj44l4R1O6J55k49l9j14J24J41
$$ 77 -139 -88 -96 -143 -154 -282 -26 121 57 -191 -17 -120 181 95 99 -45 -79 12 78 233 -16 -55 -169 -45 96
2544I6l63M51q7r6n0k86J06J47J41L4k30m81N99j4L15j73m09K80J05j49K14j72
$$ 96 -267 184 97 1 -49 -335 -229 -82 59 93 -137 -618 -19 -33 282 109 -300 -20 85 -64 150 -22
2566b2lK9P5j66J52k19K11k09K00j5p6J45j96k10k9L45k05p6J58j14M1J49j56
$$ -22 -25 4 79 -87 65 -154 57 -152 48 33 -43 102 -94 -304 -333 12 -193 -269 -111 -225 -184 -35 -191
2589a91j0L12r9J49K62k16j22j5J6J10n9J7P5l9j44j09P2M5L0%j71K07R0l18o4
$$ -191 -201 111 12 161 423 207 85 70 86 196 137 154 229 190 46 -63 9 54 84 84 -87 120 210 -108 -172
2614a72Q7j14J74m4N5L4L3j38R7q3K65r0p3k02K67MK12q1r2j30J26j64j64K95
$$ -172 -85 -199 -25 -69 -14 20 53 -85 12 -71 194 104 31 -171 96 100 312 231 139 9 135 -29 -193 102
2638A02J35k65k2J92l75J00J95j21l27K95j17K06p4j17L3K4J37k83K11J68K9J14
$$ 102 237 -28 -50 142 -233 -133 62 -59 -386 -91 -208 -2 -76 -193 -160 -136 1 -282 -71 97 126 240
2660B40p8L0r7R4l14L23o5j55%J84k70P3r9J14O6k47M7J89J71l22J81J22n1q1
$$ 240 162 192 95 189 -125 198 133 -22 -22 162 -108 -35 -134 -20 46 -201 -154 35 206 -116 65 187 136 55
2684E5q4k2QJ4j05J42L49l63J01j71lL4J53L5J7l96K40j36J51j60J04q3J54k17
$$ 55 -29 -51 -43 -29 -134 8 357 -6 95 -76 -79 -45 108 143 160 -236 4 -132 19 -141 -37 -120 34 -183
2708a83J20j88K89m5k79J82K03j12L7l3P8j57K44j85j20K9J47Q0j75L03l39K18
$$ -183 -63 -251 38 -7 -286 -104 99 -13 24 -9 69 -88 156 -29 -149 -120 27 107 -68 235 -104 114
2730A14J1Kj62K12j85J78k15K17l69J18J04j88J44J85o75K32L41j31O1k36J87
$$ 114 125 127 -35 177 -8 170 -45 172 -197 -79 25 -163 -19 166 -509 -277 64 -67 -6 -242 -55
2751e5J69k10j47N0J29J28k96J51r0K90k74K97m04L78J3j7K04k59j40j25J72R2
$$ -55 114 -96 -243 -193 -64 64 -232 -81 -171 119 -155 142 -262 116 129 112 316 57 -83 -208 -36 56
2773E6k55M02k38j33K86k24K18j02k34K00k00P7J91j66P9j20L82k17k7J49Nn1
$$ 56 -199 203 -35 -168 118 -106 112 10 -224 -24 -224 -147 44 -122 -43 -163 219 2 -25 124 129 78
2795G8K05k61K16j10p7n6p1J04O5q0k3k92Q4K31ol37K92m3n2J71j07K45k80K58
$$ 78 283 22 238 128 51 -5 -76 28 93 13 -10 -302 -218 13 7 -330 -38 -81 -133 38 -69 176 -104 154
2819A54k23M1J61k66M39l83Q4K29j84q3J64J20k83j77J57qJ54k53J40K40k98O
$$ 154 -69 -28 133 -133 306 -77 7 236 52 -31 133 253 -30 -207 -50 -58 96 -157 -17 223 -75 -69
2841f9P6O8R8k42j62J81K37k17k02L87j98PJ29l14L68N6k13J88j87j52J94o1J25
$$ -69 7 75 173 -69 -231 -50 187 -30 -232 155 -43 -36 93 -221 147 203 -10 178 -9 -161 33 -28 97
2864I7k71K83k50K4O2Q4j74J27q0J97j68o4Mr3M56k54K43Pm80K81r0k45L46J39
$$ 97 -174 109 -141 -117 -55 29 -145 -18 -98 99 -69 -133 -129 -222 234 -20 223 230 -250 31 -59 -304 42 181
2888A81j39j7q5N3K04l9k47L06k00j04n4L51n9k41R0L07n09Q1L22j39l22K64k27
$$ 181 42 25 -60 -7 197 158 -89 217 17 -87 -141 210 151 -90 0 307 -202 -121 201 62 -260 4 -223
2911b23J02J26k97N38p5n8l13K20J17J07l40K5R8J67N1n1k54K14J4Q9j83j07J35
$$ -223 -121 5 -292 246 171 113 -200 20 137 244 -96 -71 27 194 245 194 -60 154 168 257 74 -33 102
2934A02j23O3J60l90J52pp5N36n32N8J8l06K84q3K55j02j24n6Q9J07K18p1l23
$$ 102 -21 42 202 -188 -36 -43 -118 418 -114 -56 -38 -344 -60 -143 112 10 -114 -170 -81 26 244 173 -150
2957a50L72k46R1L7j02k6L4j75K40j40N1j79J77j02J32nk22J58J70k50K00q8J52
$$ -150 222 -24 67 104 2 -24 10 -165 75 -65 -14 -193 -16 -118 14 9 -213 -55 115 -135 65 -23 129
2980A29k1o0N1M4j47M2Qk80J44L73j86k06J26J27j7Mk65P4j69o6L28j55P5j9o5
$$ 129 108 48 99 143 -4 38 46 -234 -90 283 97 -109 17 144 127 131 -134 -60 -229 -295 33 -122 -47 -66 -131
3005a31J80o3j4q3K12q4j69K09l9j40K39m6kj74q9J04J11l5Nj42Q4j45J45P4J96
$$ -131 49 -14 -28 -111 101 17 -152 57 18 -122 117 71 69 -105 -194 -90 21 -14 -9 -151 -67 -212 -67 7 203
3030B03j16l07L70N2j62R2k86J2mL06j70n2q2po3J82O4J4k2k4j01M06l06j37M7
$$ 203 87 -220 150 202 40 132 -154 -142 -146 160 -10 -62 -144 -151 -214 -32 32 46 24 0 -101 305 -1 -138 -91
3055i1q8L29p6k50L42j50J51j96n6q1M4J45j75K05J3l4k11M5M1N8N1qlj27k7K20
$$ -91 -179 150 74 -176 166 16 167 -29 -85 -166 -122 23 -152 53 66 32 -179 -134 -93 -35 16 8 5 -122 -149 71
3081G1O5K5j60%J9j02J82m6l0p6P4j32K22K0k30j18K84q4l6k68K48q6J27K12m11
$$ 71 136 161 1 1 20 -82 100 54 24 -52 22 -110 112 132 -98 -216 68 -16 -52 -320 -72 -158 -31 181 -230
3106b30N8Nr4L17j62J53j15rK37o1J43k02J45n8j26M9K11m88J21K02J28k24K3
$$ -230 -172 -167 -261 56 -106 47 -68 -77 160 99 242 40 185 127 1 50 261 -227 -106 96 224 0 23
3129B3J14k50L0J00J59o0l03J34m8J04nJ23k36M23j73p5j8K8j89J13K70J8l54
$$ 23 137 -113 -83 17 176 116 -187 -53 -101 3 -2 121 -115 308 135 60 42 70 -119 -6 264 282 -72
3152g2n8K30j82l9o4K40j0j09p7N9J4J77r9j63n0P3P3L9K23L4l60J61K5l3m2q8
$$ -72 -130 100 -82 -121 -185 55 45 -64 -141 -82 -68 109 10 -153 -203 -130 -57 -18 205 239 -121 40 65 32 -10 -98
3178i8L63j56j27K38j88j62J59N7J02k89j2J60J18j79n7p3J10N5j24R8OK6J3L0
$$ -98 265 109 -18 220 32 -130 29 86 188 -101 -113 47 165 -14 -71 -144 -34 21 -103 -5 1 27 40 70
3202G0j87J97Lj42q6K67n3J21k10N2j70J79K07j51q0J19RN2l11j05J40M1R0m4
$$ 70 -117 80 83 -59 -145 122 69 190 -20 32 -138 41 248 97 17 136 145 197 -114 -219 -79 -38 52 8
3226Hlj28qj14L22j04J02r8O7P3k09N7P1l0PR8j87L0J28p2R2P3j57M6r4K16k24
$$ 8 5 -123 -131 -245 77 -27 75 -23 44 117 -92 -35 36 6 13 111 -76 -46 82 10 102 175 18 64 -30 186 -38
3253c8j31j99M26k73J17L36k13j02J68r1P1O9j03l1%N8m8J08o8l61K61P3j50J51
$$ -38 -169 -368 58 -215 -98 238 25 -77 91 0 71 140 37 6 6 64 16 124 56 -305 -44 29 -121 30
3277C0m1K0k6L5J30k50N7J31q4l6K40q8k76L2J58R1k66L70l50K60l20R2L1j81
$$ 30 -11 9 -17 18 148 -102 -45 86 2 -34 206 118 -158 -126 32 123 -143 227 -123 137 -183 -91 -60 -241
3301b41M70k34QK78l64J15R4p8n3J53q6r8J63o7J1l99K99l6j42K65k06L42l81
$$ -241 229 -5 3 281 -83 32 126 48 -5 148 62 -36 127 60 71 -328 -29 -65 -207 58 -148 194 -187
3324a87j02L30k4j69J83o8qm0P1k41L31p4K83m15J50q1m5J90K4j58K54m68K55
$$ -187 -289 41 17 -152 31 -37 -45 -85 -14 -255 76 2 285 -130 20 -61 -106 84 108 -50 204 -264 -9
3347ij06K53l21j43N78l86R3K16k69J75m7p9J46k47J68j20K32m28J73K30j79j5
$$ -9 -115 138 -183 -326 252 -134 -41 175 -94 81 34 -45 101 -146 22 -98 134 -294 -121 109 -70 -85
3369h5j2K04O8k58J04M5p4Po8j34K87K1l41J50N0j13J95J20l7p4k14N3J48M7j60
$$ -85 -97 107 175 -83 21 66 -8 -1 -69 -203 84 105 -236 -86 -36 -149 46 166 129 55 -159 -106 42 89 -71
3394g1j05r4J94j1J12k9J42l3M3Q3M6p7k68L63m57K50j15J37J07j61J77k89R4
$$ -71 -176 -270 -76 -87 25 -4 138 105 148 231 277 200 -68 295 -162 88 -27 110 217 56 233 -56 38
3417C8jj55L4K1J12j06j50L10n8j8j05K14k35J99k27K29Lj80O6j99J78R9K2j87
$$ 38 37 -118 -84 -63 49 -57 -207 103 45 27 -78 136 -99 100 -127 102 105 -75 -9 -208 -30 69 91 -96
3441i6R5J31j51m3nJ12M3k24J11l6j36J47K55m23Q5K90j00k1k6P4j9l18L99j37
$$ -96 -1 130 -21 -64 -69 43 86 -138 -27 -63 -199 -52 203 -220 -135 155 55 34 8 82 63 -255 144 7
3465Gro5j27L64k17k3K57O0l52K04n5q9L0o8J28k14J87j22j0K8R6r3J12J48k7
$$ 7 -2 -67 -194 170 -47 -70 187 247 -105 99 44 -45 -15 -83 45 -169 18 -104 -114 -86 10 -83 29 177 150
3490A50k09Pk8M1j18J90M6J6k9O1PO1K0k39K8Q2N6j62o7J89j35K3J0R6k32K57
$$ 150 -59 -52 -80 -39 -157 33 79 95 66 127 134 195 215 -24 4 86 142 -20 -87 102 -33 -10 0 96 -136 121
3516A21l16J86P0j06Q2m7O3N1q0j12j9K86j30j29J46N2J47lj46jj54k42M52n37
$$ 121 -195 -9 61 -45 37 -10 53 104 24 -88 -107 179 49 -80 66 118 265 262 116 115 -39 -281 171 -366
3540c66M23q2j03L39p8Rk03J14M3l32J15R7o8q6M19l37J21j29n8N3K12j90J93
$$ -366 57 -25 -128 211 133 142 -61 53 96 -236 -121 -24 -92 -178 241 -96 25 -104 -162 -109 103 -87 106
3563A06k52K77k7l24K52J91j56j03J14j48R0R0j25o9J09l2J24k3L3j12j0mk46
$$ 106 -146 131 104 -220 32 223 67 -36 78 -70 20 110 -15 -84 25 -7 117 94 127 15 5 1 -245
3586b45K58q7ql6J72J7l0k00L17j59J85J76l09J6mo9J41l11L13k55J94r0n2J56
$$ -245 13 -74 -82 -118 54 71 41 -159 158 -1 184 360 51 67 63 -6 135 -176 137 -118 76 -14 -66 90
3610I0m6j12J45k03L37l44J16J38k46R0j24L48k76J31j17J69J10k39J47k29J10
$$ 90 44 -68 77 -126 211 -133 -17 121 -125 -35 -159 189 -87 44 -73 96 206 -33 114 -115 -5
3631eK27j60K8j72J64N3j8R8k87J18J91l71R6m8J10R5j39j09P2J56K4k29J62l3
$$ -5 222 62 90 -82 82 135 117 215 -72 46 237 -134 -38 -86 24 119 -20 -129 -57 99 123 -106 56 23
3655B3J54l49J0J85L4J58k62M58m28j92L90j26R3j36L5mj15n6K11j19k4J91n7
$$ 23 177 -172 -162 23 57 215 -47 411 -17 -209 181 55 148 12 47 43 -72 -128 83 -36 -60 131 74
3678G4j92o9J92MQ2k36L11j38k41o4R5J2M5J08j03M9q6j13P8K46J51l2j90Q1m
$$ 74 -118 -187 5 9 91 -145 166 28 -213 -277 -182 -170 -125 -17 -120 -71 -157 -270 -192 54 205 173 -17 64 60
3703F0N0j70K15Qk21L5M8Rn3K61k85M4K24j27l9O1j68J91j16k36J41K21p0j28
$$ 60 110 -60 155 163 -58 -23 25 34 -19 242 -43 1 225 98 59 120 -48 143 27 -209 -68 153 83 -45
3727d5l8K00k41P1J2l8L36l69J32j0K1k3N3K44l44j44p6K46j62J34L05m05N9o7
$$ -45 -83 117 -124 -53 -41 -79 257 -112 20 10 31 8 61 305 -39 -183 -259 -13 -175 -41 264 -141 -82 -149
3751a49K05j03j55K18J22m7p7j40L16k11KJ25j54K27l93L19o6J56k90K68j62m5
$$ -149 56 -47 -202 16 138 91 14 -126 190 -21 -19 106 -48 179 -214 105 39 195 -95 173 11 -34
3773c4K68k26L0r0K4L0j15N7Q2k45L01k20P7J37j2K3k05M4J10K2j9j24K51n9l33
$$ -34 234 8 38 -52 -28 2 -113 -56 26 -219 82 -138 -61 76 64 87 -118 -74 36 58 39 -85 166 107 -226
3798b26J40J45j12K35l41L27k03N4j04r4M3q2J97j19j61P4L19k09L20j75J7j05
$$ -226 -86 59 -53 182 -159 168 -35 19 -85 -179 -136 -218 -21 -140 -301 -227 92 -117 203 28 45 -60
3820f0M6l5L11j10q1o5m3J15j21K67j16j30K83l02K25J05j73m9MJ52j29j41j44
$$ -60 -14 -49 262 152 71 6 -37 78 -43 224 108 -22 261 -41 184 289 116 67 71 223 94 -47 -191
3843a91J50J61k22J89j41J29Q6r6Q4k10m8Q9N7m8J31l8PQR9j36j59N2m8J70p1
$$ -191 -41 120 -102 87 -54 75 161 65 149 -61 -109 -20 37 -11 120 82 89 97 196 60 -99 -47 -95 75 4
3868Dj48K00Q3j83K8M2m0K02m12J15K62k52J7J41J1j69J2J81j01R7n8K05j44j14
$$ 4 -144 56 139 -44 -16 26 -14 188 -224 -109 153 -99 -82 59 70 -99 -87 94 -7 90 32 237 93 -21
3892b1J0ko6L21l17K08J19N3k90o1r3K80p5j59J19k7p4k88K56J91j4r2o0J8k52
$$ -21 -11 -13 -79 242 -75 133 252 305 15 -46 -139 141 66 -93 26 -1 -75 -363 -107 84 70 -22 -82 -64 -316
$$ [...]
8191A45
##END NTUPLES=NMR FID
##END=
