##TITLE=1H_SR134_k
 DMSO-d6
 8 sc, 
 25.08.2022
##JCAMPDX= 6.0         $$ Bruker NMR JCAMP-DX V2.0
##DATA TYPE= NMR FID
##DATA CLASS= NTUPLES
##ORIGIN= UXNMR, Bruker Analytische Messtechnik GmbH
##OWNER= root
$$ XWIN-NMR		Version 3.5
$$ Thu Aug 25 15:04:28 2022 Russian Standard Time (UT+4h)  she@DPX200
##.OBSERVE FREQUENCY= 200.1313499994
##.OBSERVE NUCLEUS= ^1H
##.DELAY= (6, 6)
##.ACQUISITION MODE= SIMULTANEOUS
##.ACQUISITION SCHEME= undefined
##.AVERAGES= 8
##.DIGITISER RES= 18
##SPECTROMETER/DATA SYSTEM= spect
##.PULSE SEQUENCE= zg30
##.SOLVENT NAME= DMSO
##.SHIFT REFERENCE= (INTERNAL, DMSO, 0, 15.7039)
##AUDIT TRAIL= $$ (NUMBER, WHEN, WHO, WHERE, WHAT)
$$ ##TITLE= Audit trail, XWIN-NMR		Version 3.5
$$ ##JCAMPDX= 5.01
$$ ##ORIGIN= Bruker BioSpin GmbH
$$ ##OWNER= she
$$ F:/spectra/data/she/nmr/H-F/1/audita.txt
$$ ##AUDIT TRAIL=  $$ (NUMBER, WHEN, WHO, WHERE, WHAT)
(   1,<2022-08-25 15:03:33.18 +0400>,<she>,<DPX200>,
      <created by zg, POWCHK disabled, PULCHK disabled
       configuration hash MD5:
       00 E9 B6 7A A2 85 ED C7 34 08 36 98 17 FE 4E 26
       data hash MD5: 16K
       20 F4 50 D9 E9 53 85 A1 08 EE 7B 39 1F 7F 8D 68>)
$$ ##END=
$$ 
$$ hash MD5
$$ 16 0D 89 EE 4B 55 30 04 FC 13 E1 EA 63 F9 F4 2B
##$RELAX= 
##$RELAX= 
##$RELAX= 
##$RELAX= 
##$RELAX= 
##$RELAX= 
$$ Bruker specific parameters
$$ --------------------------
##$DU= <F:/spectra>
##$EXPNO= 1
##$NAME= <H-F>
##$PROCNO= 1
##$TYPE= <nmr>
##$USER= <she>
##$AMP= (0..31)
100 100 100 100 100 100 100 100 100 100 100 100 100 100 100 100 100 100 
100 100 100 100 100 100 100 100 100 100 100 100 100 100 
##$AQSEQ= 0
##$AQ_mod= 1
##$AUNM= <au_zg>
##$AUTOPOS= <>
##$BF1= 200.13
##$BF2= 200.13
##$BF3= 200.13
##$BF4= 200.13
##$BF5= 200.13
##$BF6= 200.13
##$BF7= 200.13
##$BF8= 200.13
##$BYTORDA= 1
##$CFDGTYP= 0
##$CFRGTYP= 5
##$CHEMSTR= <none>
##$CNST= (0..31)
1 1 145 1 1 1 1 1 1 1 1 1 1 1 1 1 1 1 1 1 1 1 1 1 1 1 1 1 1 1 1 1 
##$CPDPRG= <>
##$CPDPRG1= <>
##$CPDPRG2= <>
##$CPDPRG3= <>
##$CPDPRG4= <mlev>
##$CPDPRG5= <mlev>
##$CPDPRG6= <mlev>
##$CPDPRG7= <mlev>
##$CPDPRG8= <mlev>
##$CPDPRGB= <>
##$CPDPRGT= <>
##$D= (0..31)
0 1.2 0 0 0 0 0 0 0 0.06 0 0.03 0 0 0 0 0.0002 0 0 0 0 0 0 0 0 0 0 0 0 
0 0 0 
##$DATE= 1661425412
##$DBL= (0..7)
120 120 120 120 120 120 120 120 
##$DBP= (0..7)
150 150 150 150 150 150 150 150 
##$DBP07= 0
##$DBPNAM0= <>
##$DBPNAM1= <>
##$DBPNAM2= <>
##$DBPNAM3= <>
##$DBPNAM4= <>
##$DBPNAM5= <>
##$DBPNAM6= <>
##$DBPNAM7= <>
##$DBPOAL= (0..7)
0.5 0.5 0.5 0.5 0.5 0.5 0.5 0.5 
##$DBPOFFS= (0..7)
0 0 0 0 0 0 0 0 
##$DE= 6
##$DECBNUC= <off>
##$DECIM= 32
##$DECNUC= <off>
##$DECSTAT= 4
##$DIGMOD= 1
##$DIGTYP= 9
##$DL= (0..7)
0 120 120 120 120 120 120 120 
##$DP= (0..7)
150 150 150 150 150 150 150 150 
##$DP07= 0
##$DPNAME0= <>
##$DPNAME1= <>
##$DPNAME2= <>
##$DPNAME3= <>
##$DPNAME4= <>
##$DPNAME5= <>
##$DPNAME6= <>
##$DPNAME7= <>
##$DPOAL= (0..7)
0.5 0.5 0.5 0.5 0.5 0.5 0.5 0.5 
##$DPOFFS= (0..7)
0 0 0 0 0 0 0 0 
##$DQDMODE= 0
##$DR= 18
##$DS= 0
##$DSLIST= <SSSSSSSSSSSSSSS>
$$ [...]
##$SUBNAM2= <"">
##$SUBNAM3= <"">
##$SUBNAM4= <"">
##$SUBNAM5= <"">
##$SUBNAM6= <"">
##$SUBNAM7= <"">
##$SUBNAM8= <"">
##$SUBNAM9= <"">
##$SW= 18.0517283424941
##$SWIBOX= (0..15)
0 0 2 0 0 0 0 0 0 0 0 0 0 0 0 0 
##$SW_h= 3612.71676300578
##$TD= 16384
##$TD0= 1
##$TE= 0
##$TE2= 300
##$TE3= 300
##$TEG= 300
##$TL= (0..7)
0 120 120 120 120 120 120 120 
##$TP= (0..7)
150 150 150 150 150 150 150 150 
##$TP07= 0
##$TPNAME0= <>
##$TPNAME1= <>
##$TPNAME2= <>
##$TPNAME3= <>
##$TPNAME4= <>
##$TPNAME5= <>
##$TPNAME6= <>
##$TPNAME7= <>
##$TPOAL= (0..7)
0.5 0.5 0.5 0.5 0.5 0.5 0.5 0.5 
##$TPOFFS= (0..7)
0 0 0 0 0 0 0 0 
##$TUNHIN= 0
##$TUNHOUT= 0
##$TUNXOUT= 0
##$USERA1= <user>
##$USERA2= <user>
##$USERA3= <user>
##$USERA4= <user>
##$USERA5= <user>
##$V9= 5
##$VALIST= <valist>
##$VCLIST= <CCCCCCCCCCCCCCC>
##$VD= 0
##$VDLIST= <DDDDDDDDDDDDDDD>
##$VPLIST= <PPPPPPPPPPPPPPP>
##$VTLIST= <TTTTTTTTTTTTTTT>
##$WBST= 1024
##$WBSW= 4
##$XGAIN= (0..3)
0 0 0 0 
##$XL= 0
##$YL= 0
##$YMAX_a= 124505
##$YMIN_a= -189638
##$ZGOPTNS= <>
##$ZL1= 120
##$ZL2= 120
##$ZL3= 120
##$ZL4= 120
##$ABSF1= 10
##$ABSF2= 0
##$ABSG= 5
##$ABSL= 3
##$ALPHA= 0
##$AQORDER= 0
##$ASSFAC= 0
##$ASSFACI= 0
##$ASSFACX= 0
##$ASSWID= 0
##$AUNMP= <proc_1d>
##$AZFE= 0.1
##$AZFW= 0.1
##$BCFW= 1
##$BC_mod= 2
##$BYTORDP= 1
##$COROFFS= 0
##$CY= 11.3945322036743
##$DATMOD= 1
##$DC= 2
##$DFILT= <>
##$DTYPP= 0
##$F1P= 2.36226072786647
##$F2P= -0.459571619588291
##$FCOR= 0.5
##$FTSIZE= 0
##$FT_mod= 4
##$GAMMA= 1
##$GB= 0.15
##$INTBC= 1
##$INTSCL= 1
##$ISEN= 128
##$LB= 0.24
##$LEV0= 0
##$LPBIN= 0
##$MAXI= 10000
##$MC2= 0
##$MEAN= 0
##$ME_mod= 0
##$MI= 1.114404
##$NCOEF= 0
##$NC_proc= 0
##$NLEV= 6
##$NOISF1= 3.799351
##$NOISF2= 2.8
##$NSP= 1
##$NTH_PI= 0
##$NZP= 0
##$OFFSET= 15.70392
##$PC= 1
##$PHC0= -18044.04
##$PHC1= 12.20069
##$PH_mod= 1
##$PKNL= yes
##$PPARMOD= 0
##$PSCAL= 0
##$PSIGN= 0
##$REVERSE= no
##$SF= 200.130013532006
##$SI= 16384
##$SIGF1= 3
##$SIGF2= 2
##$SINO= 400
##$SIOLD= 16384
##$SREGLST= <1H.CDCl3>
##$SSB= 0
##$STSI= 0
##$STSR= 0
##$SW_p= 3612.71676300578
##$SYMM= 0
##$S_DEV= 0
##$TDeff= 0
##$TDoff= 0
##$TI= <>
##$TILT= no
##$TM1= 0
##$TM2= 0
##$TOPLEV= 0
##$USERP1= <user>
##$USERP2= <user>
##$USERP3= <user>
##$USERP4= <user>
##$USERP5= <user>
##$WDW= 1
##$XDIM= 8192
##$YMAX_p= 0
##$YMIN_p= 0
$$ End of Bruker specific parameters
$$ ---------------------------------
##NTUPLES= NMR FID
##VAR_NAME=  TIME,          FID/REAL,        FID/IMAG
##SYMBOL=    X,             R,               I
##VAR_TYPE=  INDEPENDENT,   DEPENDENT,       DEPENDENT
##VAR_FORM=  AFFN,          ASDF,            ASDF
##VAR_DIM=   8192,          8192,            8192
##UNITS=     SECONDS,       ARBITRARY UNITS, ARBITRARY UNITS
##FACTOR=    0.0002768,     1,               1
##FIRST=     0,             0,               0
##LAST=      2.2672688,     0,               0
##MIN=       0,             -189638,         0
##MAX=       2.2672688,     124505,          0
$$ Real data points
##PAGE= N=1
##DATA TABLE= (X++(R..R)), XYDATA
$$ [...]
1780c94R72l53l32k61L53K48j65l7j9K09n7o16Q0O78J05m59k73N65P1n87n09O82
$$ -394 578 225 -107 -368 -15 233 68 31 12 221 164 -452 -372 306 411 -48 -321 244 315 -272 -781 -99
1802i9N94n59m48K61N81j13n43j72N04L33m50j75N51R4l01m58O89K77q0q63L25
$$ -99 495 -64 -512 -251 330 217 -326 -498 6 339 -111 -286 265 359 58 -400 289 566 486 -377 -52
1823e2J28L00m59l23P62J99l40p04K64P79k14q14m8R43k54o29O0N46O7l01m65
$$ -52 76 376 -83 -406 356 555 215 -489 -225 554 340 -474 -522 421 167 -462 -402 144 211 -90 -555
1844e55M95O95o67m57J83Q07j77m80P1R3M72l80n74O80M72q26k27L80O50l92o94
$$ -555 -60 635 -32 -489 -306 501 324 -156 -85 8 480 100 -474 206 678 -148 -375 5 655 263 -431
1865d31J3R40k67o01m05J059N8q33j22N81L23l61l91L37O28k96o24O8O34K63q67
$$ -431 -418 522 255 -346 -751 308 366 -467 -589 -8 315 -46 -437 -100 528 232 -392 -324 310 573 -294
1886b94k78P78N07o61n69N31N72m90p22L10Q34O3j062j14R48J95o54m14N22O64
$$ -294 -572 206 713 52 -517 14 586 96 -626 -316 518 581 -481 -595 353 548 -106 -520 2 666
1906F66p54l17K59N14k73o28n1O63M49n67m73P17M98o21p12N96O07k08q29L09
$$ 666 -88 -405 -146 368 95 -533 -584 79 528 -39 -512 205 703 82 -630 -34 573 365 -464 -155
1926a55O29M4r32j01P50K85o16m11L70O31n39n04M07M08L9l42l42M93K61o18k68
$$ -155 474 518 -414 -515 235 520 -96 -507 -137 494 -45 -549 -142 266 305 -37 -379 114 375 -243 -511
1947e11N75L68l11o33M19M68Kn78RO57r4n17k3K53M90o28l67L27O51l89p60M04
$$ -511 64 432 121 -512 -93 375 377 -201 -192 465 371 -146 -169 84 574 -54 -421 -94 557 168 -592 -188
1969a88M38O4o34J0M34L22p22R9kM98m24l96M17O04m95m33K94N83L2j003K18M58
$$ -188 250 314 -320 -310 124 446 -276 -177 -179 319 -105 -501 -84 520 25 -408 -114 469 501 -502 -284 174
1991A74K34o28k32M15M11j37o55J77O47l47m20M6M39K92o18l89Q42j9n91j13J11
$$ 174 408 -220 -452 -37 374 237 -418 -241 406 59 -361 -315 124 416 -202 -591 251 232 -359 -472 -361
2012c61P42l07p39M88O64j51n91j09Q10J47p40l96P33Q4o7n97L73L63j20q41J90
$$ -361 381 74 -665 -177 487 336 -255 -364 446 593 -147 -543 190 274 207 -390 -17 346 226 -615 -425
2033d25P11J06n22j32L60L2j22k70P4N60j61o43K63M82j62m04R1L95P6m51l66
$$ -425 286 392 -130 -262 98 130 8 -262 -188 372 211 -432 -169 313 151 -253 -162 233 309 -142 -508
2054e08N66O07o01l99K68L52j68k95L9K04L70m47l30L8O31k08o79M16L19k37j52
$$ -508 58 665 64 -335 -67 285 117 -178 -139 65 435 -12 -342 -304 327 119 -560 -144 175 -62 -214
2075b14L1N68m35k31K1K84K96m73k19L65L18l84k14P5N62l72q7K8K15K43p09J82
$$ -214 -183 385 -50 -281 -260 24 320 -153 -372 -7 311 -73 -287 -212 350 -22 -109 -81 134 377 -332 -150
2097a50K41K88n46j76K19P07o63l78R2O94k15m45m3O04K0k11m09K86K83o3l38
$$ -150 91 379 -167 -343 -124 583 -80 -458 -366 328 113 -332 -375 229 249 38 -371 -85 198 135 -203
2118b03L58k20L27k40r3J31J28k40j63M98O3m93j14K48K51k99p9J36K13k02k03
$$ -203 155 -65 262 22 -71 60 188 -52 -215 283 346 -147 -261 -13 238 -61 -140 -4 209 7 -196
2139a96O3L06J07n13r4N47O2j61l30K49J14j53k56K22J47l26K84l32L69j54m5
$$ -196 -133 173 280 -233 -327 220 282 121 -209 40 154 1 -255 -33 114 -212 72 -260 109 -45 -90
2160i0r0J95K36k44l69K74L70N7o53K97L54k43l87K01L52j52l49j5J63J59k41
$$ -90 -180 15 251 7 -362 -88 282 339 -314 -17 337 94 -293 -92 260 108 -241 -256 -93 66 -175
2181a75rL43K98k75k22P0L75n3o12Q7L44m2J4l71O5N43l59k75R1L16j65l94K53
$$ -175 -184 159 457 182 -40 30 405 352 -260 -173 171 129 143 -228 -163 380 21 -254 -163 153 -12 -406 -153
2204a53R0L48k85k60K45L12j89k07K31k2k77Q2n3L42j35j54J59k1J13k32r3K89
$$ -153 -63 285 0 -260 -15 297 108 -99 132 110 -167 -85 -138 204 69 -85 74 53 166 -66 -159 130
2226A30K00l80j85Q2M39l33l63K80M38J15o23J77L8o0k8J29qJ39k24k18K92L8
$$ 130 330 -50 -235 -153 286 -47 -410 -130 308 423 -200 -23 15 -45 -73 56 48 187 -37 -255 37 75
2248G5K58n16J01M5N5N9k38K83K1l0m72M55j22N1k52q6O40k28k67l7K24P5j01
$$ 75 333 -183 -82 -37 18 77 -161 122 143 113 -359 96 -26 25 -227 -313 327 99 -168 -205 19 94 -7
2271gj56J98J29l6n1k99M88J22n49J1J77K31o49J88J57K78l46o0R9J94J1l33J03
$$ -7 -163 35 164 128 77 -222 266 388 -161 -150 27 258 -391 -203 -46 232 -114 -174 -75 119 130 -203 -100
2294a00K45k41J54j92K90j05j38j0J54J03r0q1K1K5j19n4j17M58k52p1j55M60
$$ -100 145 -96 58 -134 156 51 -87 -97 57 160 70 -11 10 35 -84 -138 -255 203 -49 -120 -275 185
2316A85n3k05k17N6L81p4k43p2L93Rk60k82K13L32j42pp8K60k98j2K38O5l22j23
$$ 185 132 -73 -290 -234 147 73 -170 -242 151 160 -100 -382 -169 163 21 14 -64 196 -102 -114 124 189 -133 -256
2340b56J62M8k2J11k16L31J16k65l2K00j8k0q3k28K53J9j55l3kJ87k59q8N40j38
$$ -256 -94 -46 -68 43 -173 158 274 9 -23 177 159 139 56 -172 81 100 -55 -88 -90 97 -162 -250 290 152
2364A52k48k3J32J85k48k95K43k0L86l80k49N96o6J6k71m7J83J66j83j96M68k11
$$ 152 -96 -119 13 198 -50 -345 -102 -122 264 -116 -365 231 165 181 -90 -137 46 212 29 -167 301 90
2386I0J6k28K36R4k24q9K19m8k37N8j01K52J18j10k48L25n1K63o65M66J87j58
$$ 90 106 -122 114 208 -16 -105 114 66 -171 -113 -214 38 156 46 -202 123 72 335 -330 136 323 165
2408A65l84J32J50L19m06k11N23m65K20j16oJ16k89K78j31J18J88q0k41J01n7
$$ 165 -219 -87 63 382 -24 -235 288 -177 43 -73 -79 37 -252 26 -105 13 201 121 -120 -19 -76
2429g6j67K26kJ42j14j33j04L91j92l0J22n2J28j44K5P9k63K79n43L85k9j17j18
$$ -76 -243 -17 -19 123 9 -124 -228 163 -29 -59 63 11 139 -5 20 99 -164 115 -428 -43 -72 -189 -307
2452c07M2K85J21R6k29J45q2l73r0L19J66j08Lm7J37J54k75L2J50R2k25J36p2
$$ -307 -265 20 141 237 8 153 71 -302 -392 -73 93 -15 -12 -59 78 232 -43 -11 139 231 6 142 70
2475G0Pj81K16r2j50K70l4q3p2L4j04K53k96L09n0r5N1K6R8l26J22K18j3j79m0
$$ 70 77 -104 112 20 -130 140 106 23 -49 -15 -119 134 -162 147 97 2 53 79 177 -149 -27 191 178 -1 -41
2500d1J41J88m78L7J40K71m12lK30j3j07Q7l8N1J31k19q4P3J98k58J61p5q7L30
$$ -41 100 288 -190 -153 -13 258 -154 -157 73 60 -47 40 2 53 184 -35 -119 -46 152 -106 55 -20 -107 223
2524B23l94K18k08j15K31k4L4J68k22K79l64J10k1K77k30Q0k48N6J29j28J88j10
$$ 223 -171 47 -161 -276 -45 -69 -35 133 -89 190 -174 -64 -85 192 -38 42 -206 -150 -21 -149 39 -71
2546g1J93k02K75j81J06j89o7N7j55R5j1L53j33r8J96j50K28m58J20n3J10K35
$$ -71 122 -80 195 14 120 -69 -136 -79 -234 -139 -150 203 70 -28 168 18 246 -212 -92 -145 -35 200
2568B00Pl18R1J21j24l4M0K07r4j18k70M8K86l66L3N43j22k26q7L22J34n30M00
$$ 200 207 -111 -20 101 -23 -57 -17 190 96 -22 -292 -244 42 -324 -291 252 130 -96 -183 139 273 -257 143
2591A43j01j52nJ20L6M7j32L8j26J61J97j04m85J85J44n1K23j20K59m24J57k0
$$ 143 42 -110 -115 5 41 88 -44 -6 -132 29 226 122 -363 -178 -34 -85 138 18 277 -147 10 -10
2613a0J02r0k7j06J6PO6k17J77J2m1K15k35J48J56k87n2K19q4k55M51R8l7m12
$$ -10 92 2 -25 -131 -115 -108 -42 -259 -82 -70 -111 104 -131 17 173 -114 -166 53 -31 -286 165 263 226 -186
2637a86K00J92j21O6l43M5J35J48k36J18k00K68N7p9j83J22P8j85J3R4j43J65
$$ -186 14 206 85 151 -192 -147 -12 136 -100 18 -182 86 143 64 -119 3 81 -104 -91 3 -140 25
2659B5J16j33m7J11J11k60J29j70L1j95L89j27n3r0K08j79jJ15q4K8J14pKj66
$$ 25 141 8 -39 72 183 -77 52 -118 -87 -282 107 -20 -73 -163 45 -134 -135 -20 -104 -76 38 31 33 -133
2683a33J74L8l59K05M22m9m28N2J08j05p4K8L03N8l31K01j73J67Q6n17K17J82
$$ -133 41 79 -280 -75 347 298 -130 -78 30 -75 -149 -121 182 240 -91 110 -63 104 190 -327 -110 72
2705G2o8J99k82K39oJ0j34j90L74j49m1j03K31k8l12M2pR0j30L25j17j50J22O6
$$ 72 4 203 -79 160 154 164 30 -160 214 65 24 -79 152 124 -188 -146 -153 -63 -193 132 15 -135 -13 53
2729E3k6K3P0q5k5j45N8J25q2L42j56ol60q8K23k8mL0Q3J37J91m80J6K20Lj03
$$ 53 27 50 120 35 10 -135 -77 48 -34 308 152 146 -214 -302 -79 -107 -111 -81 2 139 330 -150 -134 86 89 -14
2755a4q1L5J66k42J85q5J43j16p6KJ88l20K06j15J77r0p9j66M40J68k32j44q1
$$ -14 -95 -60 106 -136 49 -36 107 -9 -85 -83 105 -215 -9 -124 53 -37 -116 -282 158 326 94 -50 -131
2778a31K10m02K38o9K48j37J68j55O0o0K00r0k30K19r2j08J07K44l55J63m6J76
$$ -131 79 -323 -85 -154 94 -43 125 -30 30 -30 170 80 -150 69 -23 -131 -24 220 -135 28 -18 158
2800A58K4l16R5J8o5K04m04K34l6J82j16m9L76k67k06J76o3K62j56K2J2J55r2
$$ 158 182 -134 -39 -21 -86 118 -286 -52 -88 94 -22 -71 305 38 -168 8 -55 207 51 73 85 240 148
2823A48j28Nk91M28p3J5l48L37q5J56j09p8j44K7P2K39m17K85r5J7k30K72jr4
$$ 148 20 25 -266 162 89 104 -244 93 8 164 55 -23 -167 -140 -68 171 -246 39 -56 -39 -269 3 2 -92
2847i2L35j98j76J77J67l51j84J84L40k80J00j22Q4o2J78l09K87J06k38P0n0L
$$ -92 243 45 -131 46 213 -138 -322 -138 202 -78 22 -100 -16 -78 100 -209 78 184 -54 16 -34 -31
2869c1R8j49j99J52K26j54p5K13J10j41MK37j18p4j29P3j33QL41l63J36kl6j00
$$ -31 67 -82 -281 -129 97 -57 -132 81 191 50 54 291 173 99 -30 43 -90 -82 259 -104 32 30 -6 -106
2893a06K11J10j92l10J33L47j07j78j10p9L77o2l3r7m2q6O2K44j31j00J36L3K67
$$ -106 105 215 23 -287 -154 193 86 -92 -202 -281 96 34 1 -96 -138 -224 -162 82 -49 -149 -13 20 287
2916B87j24j99M5J5O1J25k03j33K33N1O4j44Nj35N3j36J73J01l77K81J35R9k36
$$ 287 163 -36 9 24 85 210 7 -126 107 158 222 78 83 -52 1 -135 38 139 -238 43 178 277 41
2939D1j87R7L1L3j04O7N7j9L1j47J68j9n3nK2J27l8m5j20k8K66l90K46Q6M8J10
$$ 41 -146 -49 -18 15 -89 -22 35 16 47 -100 68 49 -4 -9 13 140 102 57 -63 -91 175 -215 31 117 165 275
2965B75l57J44J37j46N0J1j75j67L44J09j97O3q0o5J2m6J66j89k30M32J6j97k7
$$ 275 -82 62 199 53 103 114 -61 -228 116 225 28 91 11 -54 -42 -88 78 -111 -341 91 107 -90 -117
2988a17L40j12m9okJ6k48K49K62k72q4K50l92K22j19Q9n1j60Q3J19N4ok22M27
$$ -117 223 111 62 56 54 70 -178 71 333 61 -23 227 -165 57 -62 27 -24 -184 -101 18 72 66 -156 271
3012B71m41J26N7l4O3o0J24r7j11J07j03J15O9k60J19L2l1K88n86J4O07j80j41
$$ 271 -170 -44 13 -21 42 -18 106 9 -102 5 -98 17 86 -174 -55 -23 -54 234 -352 -338 269 89 -52
3035e2Q6j39J39J45k93J94p7J01r8j36n6P3j5J68k4J11k34J63k51J66K01k07l3
$$ -52 34 -105 34 179 -114 80 3 104 6 -130 -186 -113 -128 40 16 127 -107 56 -195 -29 172 -35 -68
3058f8N4p3K74l17K51J03j94j1q9J40m1j32K83q7o5q7J3r6K20k77M2lJ55J35j69
$$ -68 -14 -87 187 -130 121 224 30 19 -70 70 29 -103 180 93 28 -59 -46 -142 78 -199 -157 -160 -5 130 -39
3083c9o7O7L5J79Pl98K82o5r7R5K1q8k23M01J7k04O4LJ51j66L6K05m09q5L22l7
$$ -39 -106 -39 -4 175 182 -216 66 1 -96 -1 20 -68 -291 110 127 -77 -13 -10 141 -25 11 216 -193 -278 44 7
3109G%J59m1j93J43PJ90l75M6J32j81J45P8j92j2J11j3q0J23L66l09l38K16J37
$$ 7 7 166 125 -68 75 82 272 -103 -57 75 -106 39 117 -75 -87 24 11 -69 54 420 111 -227 -11 126
3133A26P6Jk79j88L81r9j52R2J44L6j66r1m1J15o2r3K07L7n4q6Q2J59q5J99l18
$$ 126 202 203 -76 -264 117 18 -134 -42 102 138 -28 -119 -160 -45 -107 -200 7 44 -10 -96 -14 145 60 259 -59
3158e9Q5q2K31k99K33n0m0j61K17N4j3j10kK8P0m82L87m1o1N0N9K3l01J5K27K57
$$ -59 26 -56 175 -124 109 59 19 -142 75 129 116 6 4 32 102 -380 7 -34 -95 -45 14 37 -264 -249 -22 235
3184B35k72J80k18J34Rq4M3q2k8q2L11k37J53l95M40p5k7L8J14l7k19J57k55K21
$$ 235 -37 143 -75 59 68 -16 27 -55 -83 -165 146 -91 62 -333 107 32 5 43 157 120 -99 58 -197 24
3208B4o1RJ56k01K36l69M29j47K5j07q9K08j00J06l07K07l8J12r8j35K29k95j9
$$ 24 -37 -28 128 -73 163 -206 223 76 101 -6 -95 113 13 119 -188 19 -19 93 -5 -140 89 -206 -225
3231b25P6J99r2J93o9j34J73j29o8J30q4j26Q1J71n7q5l04N65j70j63n9J06OJ63
$$ -225 -149 50 -42 151 82 -52 121 -8 -76 54 -30 -156 -75 96 39 -46 -350 215 45 -118 -177 -71 -65 98
3255I8O8j46Q0J43l36J61k6p2L63n03K84j87J26o5J5p0K30k09L2J53K5k35J02
$$ 98 166 20 100 243 -93 68 42 -30 333 -170 114 -73 53 -12 3 -67 163 -46 -14 139 164 -71 31
3278C1O3j17J3o5r7L01J29n8k03j45J49j89j70J53K63JN0k11j82Q0J87j1J39j69
$$ 31 94 -23 -10 -75 -172 129 258 200 -3 -148 1 -188 -358 -205 58 59 109 -102 -284 -204 -17 -28 111 -58
3302e8P1o9O2j99K96o8O3Ol4L2k09jP0j55J18P3j95J88J57k60J26L18n03L0L10
$$ -58 13 -56 6 -193 103 35 98 104 70 102 -107 -108 -38 -193 -75 -2 -197 -9 148 -112 14 332 -171 -141 169
3327A69j84l5J48j87K93l94K67m6m2n4j05J21K77j41l95L62m9J3j21J96O0m1m7
$$ 169 -15 -50 98 -89 204 -190 77 31 -11 -65 -170 -49 228 87 -308 54 5 18 -103 93 153 112 65
3350F5L7j83j09K61j70K34j96K5N0m7k6k19L46k02J46j20K53o1K08j1j00k58O0
$$ 65 102 -81 -190 71 -99 135 -61 -36 14 -33 -59 -278 68 -134 12 -108 145 84 292 281 181 -77 -17
3373a7j95L12O0q9n4M0k4q9J96J05k88K7k5J0q5J97L9l70K93M9K7k38N4N5N7l4
$$ -17 -212 100 160 71 17 57 33 -56 140 245 -43 -16 -41 -31 -116 81 120 -250 43 92 119 -119 -65 -10 47 13
3399A3j20K06pl49J57m5J59J5o6J94k33J63k34J76L8r7L8k33J49L9r9K18q4J61
$$ 13 -107 99 92 -257 -100 -145 14 29 -37 157 -76 87 -147 29 67 -30 8 -225 -76 -37 -136 82 -2 159
3423A59j76Q0j4R3J72l80O7Q2Nr6L8j69J76k09K50m5p1L84n98L99l90K29n8J40
$$ 159 -17 63 49 142 314 -66 1 83 88 -8 30 -139 37 -172 78 33 -38 346 -252 147 -243 -14 -72 68
3447F8k41J33L7r4oL34k40j85L59l56k9L03q5J49j67J41j04pQ3j15J74j54J03
$$ 68 -173 -40 -3 -97 -103 231 -9 -194 165 -191 -220 83 -2 147 -20 121 17 10 93 -22 152 -2 101
3470A01M0k18j6K02k63J10m9j09k6M1n5K31m7P1l19N28j39R1l26K63j22lJ78j00
$$ 101 141 -77 -93 109 -154 -44 -93 -202 -228 -187 -242 -11 -58 13 -306 222 83 174 -152 111 -11 -14 164 64
3494F4p0J64j89l04L41j29J97j26N7K20k75K3L21k67mP3l19J52k12M09K7j62j03
$$ 64 -6 158 -31 -335 6 -123 74 -52 5 225 -50 -27 294 27 23 96 -223 -71 -283 126 153 -9 -112
3517a12l8J01m9P4m5J06p4R2j0K4j58O7M7L9q1J67m9J58j21n5J60n84K43J51j89
$$ -112 -150 -49 -98 -24 -69 37 -37 55 45 69 -89 -22 25 64 -17 150 101 259 138 83 243 -341 -98 53 -136
3542a36R7J90k13k4P8K59k63J20mk40J89N5j18M2n1J1m0J62m6q5N4k33P3L94r8
$$ -136 -39 151 -62 -86 -8 251 -12 108 104 -136 53 108 -10 32 -19 -8 -48 114 68 -17 37 -196 -123 271 173
3567A73o9p5O7p1P5k21J5m2k9J56o4j52J86J33K37j51k24J15j14L42O5n50K37
$$ 173 104 29 96 25 100 -121 -106 -148 -177 -21 -85 -237 -51 82 319 168 -56 59 -55 287 352 -198 39
3590C9j93L34j26j79L1N6oj4j7K38j05L5k81K89L6k18J25K02l61N7K8j26N7l4
$$ 39 -154 180 54 -125 -94 -38 -44 -58 -75 163 58 93 -188 101 137 -81 44 246 -115 -58 -30 -156 -99 -133
3614a33L07o2k24K94k80K24j1O5j50j6q9K9J49m6L5j13P6k27j5M28l04K16j76
$$ -133 174 112 -112 182 -98 126 115 180 30 14 -75 -46 103 57 92 -21 55 -172 -187 241 -63 153 -23
3637b3j1o6J43o9l27L32L15m81J36R6J01k35q2K9K54J32k10NK6l3r7J36k79K6
$$ -23 -34 -100 43 -26 -353 -21 294 -187 -51 45 146 -89 -171 -142 112 244 34 39 65 32 -65 71 -208 -182
3661a82L92l64Q5m9j4KM9L01l38M0n1J41l2o2Q0nj6q4j41K42J41J5m0r9m5K03
$$ -182 210 -154 -69 -118 -132 -130 -81 220 -118 -78 -129 12 -20 -82 -2 -7 -23 -107 -248 -6 135 150 110 11 -34 169
3687A69k99K38k04N9K91l29N2J52k02N7J85k61J68r0J3J5ok33K07n7J22j7l2K05
$$ 169 -130 108 -96 -37 254 -75 -23 129 -73 -16 169 -92 76 -14 -1 14 8 -225 -18 -75 47 30 -2 203
3711B03l76K11P0k54K13l50K17p6K49k5k60K00j51N3J3J26p7K3J40j00k14K05
$$ 203 -173 38 108 -146 67 -283 -66 -142 107 82 -178 22 -129 -76 -63 63 -14 9 149 49 -165 40
3733D0K7P3l65J56R8l82M70r6j08N8Q0k62K13K82m17nJ53J91k25k53J36J93j22
$$ 40 67 140 -225 -69 29 -353 117 21 -87 -29 51 -211 2 284 -133 -138 15 206 -19 -272 -136 57 -65
3756f5J11p9R0l75J63K97l0J26n70M94j91o2o3K52k83K36kJ2k76K78k2%lq7J96
$$ -65 46 -33 57 -318 -155 142 112 238 -332 162 -29 -91 -154 98 -185 51 49 61 -215 63 41 41 38 -49 147
3781A47k63j1K75k58j7Q6n6kK53j47N9j79l6K84j79M5l1K04j76n8P7k64M90k66
$$ 147 -116 -127 148 -110 -127 -41 -97 -99 154 7 66 -113 -149 135 -44 1 -30 174 -2 -60 17 -247 243 -23
3805b3N0J74j29J45k98J86J01j94k38K43M5r7L5R6J17j94k19K18k3J26j79L1M5
$$ -23 27 201 72 217 -81 105 206 12 -226 17 62 -35 0 96 213 19 -200 18 -5 121 -58 -27 18
3828A8M2n1k54K80q6k45K20J52Mk76K02pJ34k84J97J1j06j04k9J08O7m8kJ10j67
$$ 18 60 9 -245 35 -51 -296 -76 76 80 -196 6 -1 133 -151 46 57 -49 -153 -182 -74 -7 -55 -57 53 -114
3853a14l8L11j43k5J1j69L28j73Q2K2j37L2N6M8k62L01k90oL19k66r2O1N9L29
$$ -114 -152 159 16 -9 2 -167 161 -12 70 92 -45 -13 43 91 -171 130 -160 -166 153 -113 -205 -144 -85 244
3877B44k45o7R7J0j42l6K38r5q2J12k69L31j90K06j3m8j0k88J38J50P0m0L9J02
$$ 244 -1 -68 29 39 -103 -139 99 4 -78 34 -235 96 -94 112 99 51 41 -247 -109 41 111 71 110 212
3901B12p9q7l03R8j33K50q9l1J44L7J07k69K79m46K57l3K70k18l1m2R0M8O3j88
$$ 212 133 46 -257 -159 -292 -42 -131 -162 -18 19 126 -143 136 -310 -53 -86 184 -34 -65 -107 -17 31 94 -94
3925i4p6K30O8r9jL8J39l39J4o0R8K6J47Q2l48O6K7K30j22q3K22p0l89K45r4K10
$$ -94 -170 60 128 29 28 66 205 -134 -120 -180 -82 -56 91 173 -175 -109 -82 148 26 -57 165 95 -294 -49 -143 67
3951F7j50J20j64J3K8O3j23K17R2k79O8J42n2j78R3R5j91M87j68k28n4L51o81
$$ 67 -83 37 -127 -114 -86 -23 -146 71 163 -116 -48 94 42 -136 -43 52 -139 348 180 -48 -102 249 -432
3974d32J51L09oK45j78k80L70j46j54M23l14p2J02j79J03J74k3l9K46m16j21J62
$$ -432 -281 28 22 267 89 -191 179 33 -121 302 -12 -84 18 -161 -58 116 93 54 300 -116 -237 -75
3996g5o4J73j3k52K62q4J77j52k00J22J14k1O8j65j42M97k98L6O4R2j16k56M91
$$ -75 -139 34 21 -231 31 -53 124 -28 -228 -106 8 -13 55 -110 -252 245 -53 -17 47 139 23 -233 258
4019B58j22k93K46j11oK21k63oJ52rj39m6QL58j73r4J67j16R6l04K30Mj03p4K19
$$ 258 136 -157 89 -22 -28 193 -70 -76 76 67 -72 -118 -110 248 75 -19 148 32 128 -176 54 58 -45 -119 100
4044A00r6r5J26p7J94M7k98L1p9OL14j01k08P9K05K2P4k25K15l22q4K29j65J69
$$ 100 4 -91 35 -42 152 199 -99 -68 -147 -141 173 72 -136 -57 148 170 244 19 234 -88 -172 57 -108 61
4068F1m7P0M3J9J46l61q7L4K73jk14N0j70J26k5M0J39R8L22m98q4O8j8Q7k30J17
$$ 61 14 84 127 146 292 -69 -156 -122 151 150 -64 -14 -184 -58 -83 -43 96 194 516 18 -66 2 -16 71 -159 -42
4094d2L4j00L79l91R3q8J38L8j02m7J43M3l04J32M6k36K74j40J55r4o1K09j57
$$ -42 -8 -108 271 -120 -27 -115 23 61 -41 -88 55 98 -206 -74 -28 -264 10 -130 25 -69 -130 79 -78
4117g8K47k07L0J82l7j64j76Q7OJ42NK1m58M39q3n4L13j77q9j63N06m22L25k42
$$ -78 169 -38 -8 174 137 -27 -203 -116 -110 32 37 58 -400 39 -44 -98 215 38 -51 -214 292 -130 195 -47
4141d7K00l62K75QJ04j76m5J74k87J86j80L37q1J82k38j50j22J40JQ5J21l00K45
$$ -47 153 -209 66 74 178 2 -43 131 -156 30 -150 187 106 288 50 -100 -222 -82 -81 4 125 -175 70
4164G0n9J54q3l07J94j72L06j49n0N3J65o1M3j15LP5j38p7J15J53k71O8J67o6
$$ 70 11 165 82 -225 -31 -203 103 -46 -96 -43 122 61 104 -11 -8 67 -71 -148 -33 120 -151 -83 84 18
4188A8N4l7j81J78r0K62j56J50l11J25n4J63k34R9p9J13R5k1j20J59l00L98k24
$$ 18 72 35 -146 32 -58 204 48 198 -113 12 -42 121 -113 -14 -93 20 115 94 -26 133 -167 231 7
4211Gj8r7K12j79o8K28j88J98k44K63q1M4rj51j01K35%o6J65j50j04N1L37k50
$$ 7 -11 -108 104 -75 -143 85 -103 95 -149 114 33 77 68 -83 -184 51 51 -15 150 0 -104 -53 284 34
4235C4j05J03K3j14K43l72J33J65j80k57K71J91Q4j25k01L24l3k34L18k1j4o4
$$ 34 -71 32 55 -59 184 -188 -55 110 -70 -327 -56 135 219 94 -107 217 184 -50 268 247 233 169
4257A69n77M13q0M6q4J10J12o6o1l0J54l52K90J27j90J22j09L6l9l9J31P3n7k71
$$ 169 -408 5 -75 -29 -113 -3 109 43 -18 -48 106 -246 44 171 -19 103 -6 30 -9 -48 83 156 99 -172
4281a72M63k77j54o6K05R7k52K08J7l1l31K86J23k2o9k79JPL58j65K8K7j46R9
$$ -172 291 14 -140 -206 -1 96 -156 52 69 38 -293 -7 116 94 25 -254 -253 -246 112 -53 -25 2 -144 -45
4305d5l2l7J34r0J93j42J01j9k34N1O7K31j38j37K12Oqj23L03k38K71k55Poj11
$$ -45 -77 -114 20 -70 123 -19 82 63 -171 -120 -53 178 40 -97 115 121 113 -10 293 55 326 71 78 72 -39
4330c9k5K60o5r5j65J39j72J56q9kj8K6j26J71q3O1j45L62k87r8J55K4jq3k6J55
$$ -39 -64 196 131 36 -129 10 -162 -6 -95 -97 -115 -89 -215 -44 -127 -66 -211 151 -136 -234 -79 -55 -56 -139 -165 -10
4356a0L16l34K50k27P7m2J26j62n2J0J48O2k09q4J43p9L9m4J87k44K08p8J17M6
$$ -10 306 -28 222 -5 72 30 156 -6 -58 -48 100 162 -47 -131 12 -67 -28 -72 115 -129 79 1 118 164
4380A64j31j87%J51R8l6Nj69M8%l4l6J14j60J65k32M02l44M22m14K81nj63K40
$$ 164 33 -154 -154 -3 95 59 64 -105 -57 -57 -91 -127 -13 -173 -8 -240 162 -182 240 -174 107 102 -61 179
4404A79k6p4K6L5j10P2n3J49l01J08O0j8K68l01k63K01Q9j61L8K33j7J84m62L7
$$ 179 153 79 105 140 30 102 49 198 -103 5 65 47 315 14 -249 -48 41 -120 -82 151 134 318 -144 -107
4428a07j6L20l37J89r7J07k5K62k06J35k8l44M09l88R2o5K32q8j16L6p0j03J96
$$ -107 -123 197 -140 49 -48 59 34 296 90 225 197 -147 262 -126 -34 -99 133 45 -71 -35 -105 -208 -12
4451a2k0k5K14j27j2k24q6L58n1k37J66K15q4K36k19j86Q4q5J08JJ54j37J43j68
$$ -12 -32 -57 157 30 18 -206 -292 66 15 -222 -56 159 75 311 92 -94 -10 -95 13 14 168 31 174 6
4475Fp0n6L70k41m4o6J48J01l54K28j89K22R5J6M4m97P8J59Q4K25k60q4m2K37
$$ 6 -64 -120 250 9 -35 -101 47 148 -206 22 -167 55 150 166 210 -287 -209 -50 34 259 -1 -85 -127 110
4499A10n4j4j35R5J27j38J20j45p9J2J30J78j59j25j26J40K87l42K99k63K53n5
$$ 110 56 42 -93 2 129 -9 111 -34 -113 -101 29 207 48 -77 -203 -63 224 -118 181 -82 171 116
4521A16k06oK8P3n1J13k33J83O3k22K65j12J3Kj54l6J43Q6Q9j81J03k44K03J32
$$ 116 -90 -96 -68 5 -46 67 -166 17 80 -142 123 11 24 26 -128 -164 -21 65 154 -27 76 -168 35 167
4545A67q7j49k6J33j69Q5n6N4K4R6O4M0r2k17J44J51j15J07k52N5j74K28J49L
$$ 167 80 -69 -95 38 -131 -46 -102 -48 -24 72 136 176 84 -133 11 162 47 154 -98 -43 -217 11 160 163
4569A63k75kK34j60K20j11k2p8j15m2J76o6q3P9K71k03O4m8k45L06k37J28J17
$$ 163 -112 -114 120 -40 180 69 47 -31 -146 -188 -12 -78 -161 -82 189 -14 50 2 -243 63 -174 -46 71
4592G1j94K99L7o7p4l55N48j47j49K39l20qJ0J08K9J31k71J6L8j6j22L20n0J63
$$ 71 -123 176 213 146 72 -283 265 118 -31 208 -112 -120 -110 -2 27 158 -113 -97 -59 -75 -197 123 73 236
4616B36l04J30j58J48j6l84K79P2M3r0j8%J15p9rPJ51j20L9k08K20J14l28L74
$$ 236 -68 62 -96 52 36 -348 -69 3 46 -44 -62 -62 53 -26 -35 -28 123 3 42 -166 54 168 -160 214
4640B14k41K36k47j45J47J66j81j03J07K8L3k26J49j61K83l40K07j05K5J17m0
$$ 214 -27 209 -38 -183 -36 130 -51 -154 -47 -19 14 -212 -63 -224 59 -281 -74 -179 -154 -37 -77
4661g7K91P1n30L48J47l75J95k75P0R6K32j69J36j02%j07J47j25N5Q7k68K53R2
$$ -77 214 285 -245 103 250 -125 70 -205 -135 -39 193 24 160 58 58 -49 98 -27 28 115 -153 100 192
4684A92p6L1j34K1M0r5K36l75lJ32M7L6k6o3j38N2K58j54j84L12k86J73jk24K2
$$ 192 116 147 13 34 74 -21 215 -160 -163 -31 16 52 26 -37 -175 -123 135 -19 -203 109 -177 -4 -5 -229 -207
4709b07M79l16N7lr6J23j32K58j05J60r9k54J30k2J80j84m9j07Q6j58K94k13K56
$$ -207 272 -44 13 10 -86 37 -95 163 58 218 119 -135 -5 -27 153 -31 -80 -187 -101 -259 35 -178 78
4732G8l27K07j4p3K13j7p6k31K16K00k53P1K4LJ18J9n0j00J89j74p6j0J22j99
$$ 78 -249 -42 -56 -129 84 67 -9 -240 -24 176 -77 -6 18 21 139 158 108 8 197 23 -53 -63 59 -140
4756a40K0L08o0m4j87N3N7M2J90l16K1J50j4K6j25J39k10L42n2j53N9k32L09k04
$$ -140 -120 188 128 84 -103 -50 7 49 239 -77 -56 94 80 106 -19 120 -90 252 200 47 106 -126 183 -21
4780b1j26K17M7L7o8K91k27J0l1j16P1R3k27K58j65j52Q9j10J85o9N4J24k34J45
$$ -21 -147 70 117 154 86 377 150 160 129 13 84 177 -50 208 43 -109 -20 -130 55 -14 40 164 -70 75
4804G5qj42J8p6R6J82J67j25Nj42L7j18j05J19j63l6J67P9j96Q9q1L2J1J34j52
$$ 75 67 -75 -57 -133 -37 145 312 187 192 50 87 -31 -136 -17 -180 -216 -49 30 -166 -77 -158 -126 -115 19 -133
4829a33J09Q8k2j52O2m0K14k64J25K0L0k06L1j24R0L14k14J46q5k54K82k44J78
$$ -133 -24 64 42 -110 -48 -88 126 -138 -13 7 37 -169 -138 -262 -172 142 -72 74 -11 -265 17 -227 -49
4852d9J97l00J65n6K07J4j71n9j15QJ55l6J67j24j18K32j8k19p4J44J48p8J7p6
$$ -49 148 -152 13 -43 164 178 7 -52 -167 -159 -4 -40 127 3 -115 117 99 -120 -194 -50 98 20 37 -39
4876c9LJ80o1k70K35k2K87j93l28K81K65k90j15J24K03n07R5K01J34k27K1J48
$$ -39 -36 144 83 -187 48 26 313 120 -208 73 338 48 -67 57 260 -247 -152 49 183 -44 -23 125
4898A25j18J20j36J34j27M9jl4m6R0L0j25j7j79K77j0nn3k07L26k62Kl4J66J21
$$ 125 7 127 -9 125 -2 47 46 12 -34 56 86 -39 -56 -235 42 32 27 -26 -233 93 -169 -167 -201 -35 86
4923H6K6O0l63M05k11j18J63j16J70m7k93N12m42K01j26L3O5k70J82L2L4m4O2
$$ 86 112 172 -191 214 3 -115 48 -68 102 55 -238 274 -168 33 -93 -60 5 -265 -83 -51 -17 -61 1
4946Aj80K24k1j71K60k24L9rK74k28l9O3pl2K2rO5n9K20L9Q2k44k4k49L20j29
$$ 1 -179 45 24 -147 113 -111 -72 -81 193 -35 -74 -11 -18 -50 -28 -37 28 -31 189 228 310 66 42 -207 113 -16
4972a6K2J4P9n9j01K18j53J88l98M00k57N5o9r4P3J5k2J19p6J46K10k11j16R2
$$ -16 6 20 99 40 -61 157 4 192 -206 194 -63 -8 -77 -171 -98 -83 -105 14 -62 84 294 83 -33 59
4996E9j94K23r8j20K05M1k25N5K03k75N0L9oR8j17O2J15q4K09j50R1k44M2l7j49
$$ 59 -135 88 -10 -130 75 116 -109 -54 149 -126 -76 -37 -43 55 -62 0 115 31 240 90 181 -63 -21 -58 -207
5021b07K52L1J64k21J05K4J64k94j23K6K13k48K36M9k49j19L43j29j04K4j25Q1
$$ -207 45 76 240 19 124 148 312 18 -105 -79 134 -114 122 171 -78 -197 146 17 -87 -63 -188 -107
5043a07L30j30k44K44m3k13K08L6rj39J31J74j32Ok37j4L66l32J24O0j5k38J71
$$ -107 223 93 -151 93 50 -163 45 81 72 -67 64 238 106 112 -125 -139 227 -105 19 79 64 -174 -3
5066cK69m71J88L04l42j16O9K0r4L86l95K00N3k5j26k45J97R6L1L01l01j3m3J72
$$ -3 266 -205 -17 287 -55 -171 -102 -82 -176 210 -185 15 68 43 -83 -328 -131 -35 -4 297 -4 -17 -60 112
5090A12r6j07K8n4L49j61r4m8L97k41k80J04L6n4R6jJ10k51M00k91Q9Ln8K4k8
$$ 112 16 -91 -63 -117 232 71 -23 -71 326 85 -195 -91 -55 -109 -13 -14 96 -155 245 -46 43 46 -12 12 -16
5115a6p8R7j83L64j06k46M0J26j05J83l3J70j89o7R0j81J67j40K2n6J13J65k17
$$ -16 -94 3 -180 184 78 -168 -128 -2 -107 76 43 213 24 -43 47 -134 33 -107 -85 -141 -28 137 -80
5138h0O1j69J26L3K23j34o8J69k52M6j2Q5O0Q9j29k29M16k71l6J19q5N6j62J41
$$ -80 -19 -188 -62 -29 194 60 -8 161 -91 -45 -57 28 88 177 48 -181 235 -36 -72 47 -38 18 -144 -3
5162cP6k10P3J10j07J60K74l96r4j2K15k84J12K1J2O5r0o1J23O7m7K2n3J58k4
$$ -3 73 -137 -64 46 -61 99 373 -23 -117 -129 86 -198 -86 -65 -53 12 -78 -139 -16 51 4 26 -27 131 107
5187A07j2J76l97P8J65j69J53Q7k6k86J53M1n7l92M42n2Ko3r6K35k02J0N1L43
$$ 107 95 271 -126 -48 117 -52 101 188 162 -124 29 70 13 -379 63 11 13 -50 -146 89 -113 -103 -52 291
5211B91l03n6NJ64l57K25K25l56J43K21n8l20l4K16J6j9N3j47J87k0M9r7m6k5
$$ 291 -12 -68 -63 101 -256 -31 194 -162 -19 202 144 -176 -210 6 22 3 56 -91 96 76 125 28 -18 -43
5235d3L49j96k13L32j79J14p4n0J13p4j32j75J96j94K71o9l8K50q7j35o8J44n9
$$ -43 306 110 -103 229 50 164 90 40 153 79 -53 -228 -32 -226 45 -24 -62 188 101 -34 -102 42 -17
5258a7N6p2O5k34L0R1k5o4O2k22M26r0R8n2L36m21j27L67j93R4k62L29j48K7o4
$$ -17 39 -33 32 -202 -172 -81 -106 -170 -108 -330 96 6 104 52 388 -33 -160 207 14 108 -154 175 27 54 -10
5283a0L1N9j81k5J14j27J86K5l9q2L8lk63N53l56Moj40L78r5Q4j77J08K4p4pn1
$$ -10 21 80 -101 -126 -12 -139 47 72 33 -49 -11 -14 -277 276 -80 -76 -82 -222 156 61 145 -32 76 100 26 19 -32
5310c2j35j6M87j42k54J22j22M2P0j94r6L75J7J58k40k7M6m0j52L57l09Q7k15
$$ -32 -167 -183 304 162 -92 30 -92 -50 20 -174 -270 105 122 280 40 13 59 19 -133 224 -85 2 -213
5333b13m1K81j30K09m23J62L09K04n67J83m9K5K42k23N1j06M25n03J70p5j08J73
$$ -213 -254 27 -103 106 -317 -155 154 358 -209 -26 -75 -50 192 -31 20 -86 339 -164 6 -69 -177 -4
5355dJ21n9K9KJ40k63L5O7L2Q0k58kk7l5J53Rj3j66K21j94J4J57K58k00j14J5
$$ -4 117 58 87 89 229 -34 1 68 100 180 -78 -80 -107 -142 11 20 7 -159 62 -132 -118 39 297 97 -17 -2
5381bJ25j27qK87m38J69j26J71l6K4K5j46J46l08K63J35l01J52r3J25J4Pq7J96
$$ -2 123 -4 -12 275 -163 6 -120 51 15 39 64 -82 64 -244 19 154 -147 5 -88 37 51 58 -29 167
5405A67j08M3k35K43J8k03J59l0j45j21K57K0j09J31l07L67j00o0j65L94j91k95
$$ 167 59 102 -133 110 128 -75 84 54 -91 -212 45 65 -44 87 -220 147 47 -13 -178 216 25 -270
5427b70K75k10K1K00j79J30J20j87j73L30k14K62R4j14r9j71L41k26J51o8J85
$$ -270 5 -205 -184 16 -163 -33 87 -100 -273 57 -157 105 199 85 -14 -185 156 -70 81 13 198
5448A98j68J49l14K16k10O7J86r3j83O7l9n1K51pJ46l27n2J20K88k84pJ69k42
$$ 198 30 179 -135 81 -129 -62 124 31 -152 -85 -124 -175 76 69 215 -112 -164 -44 244 -40 -47 122 -120
5471a20J27n6L13j58j76l7J01K1j03K59k04K03k8j80L2j01K5n8L26n6k3k32J87
$$ -120 7 -49 264 106 -70 -107 -6 15 -88 171 -33 170 142 -38 -6 -107 -82 -140 186 130 107 -125 62
5494F2K7j21K30j98Pk4jj40J98K2J08j07p9Q0j37J95j85r4J55m7J18j14K77j18
$$ 62 89 -32 198 0 7 -17 -18 -158 40 62 170 63 -16 64 -73 122 -63 -157 -2 -49 69 -45 232 114
5518A14J25k20j8J34J14k92j92L73q8j14J57j3j30J28k77n5M91J2k42N8q5o5L9
$$ 114 239 19 1 135 249 -43 -235 138 50 -64 93 80 -50 78 -199 -254 237 249 7 65 -20 -85 -46
5541d6J39k11J40k19K24m0j47J84J7l2J56J13k78k35K02K6Q8N5k35J99j62m9J73
$$ -46 93 -118 22 -197 27 -13 -160 24 41 9 165 278 0 -235 -33 -7 81 136 -99 100 -62 -111 62
5564F2L4m3ql73N64k39OJ04K24j13k21p7o5K07j2m01J81J58J53p2p8J19j65m7
$$ 62 96 53 45 -328 236 -3 3 107 331 218 -3 -80 -145 62 50 -351 -170 -12 141 69 -9 110 -55 -102
5588a02J10j08k19L65L7p1j28k5l8L24l22J55j53K43R2l29J50O9r5J40J39k16
$$ -102 8 -100 -319 46 83 12 -116 -141 -179 145 -177 -22 -175 68 160 -169 -19 50 -45 95 234 18
5610A8O5O0k94Q9L74j94k12J57j08N0J21J26j90M1j24o0JL3k40K54j35J59L8l7
$$ 18 83 143 -151 -62 312 118 -94 63 -45 5 126 252 62 103 -21 -81 -80 -47 -287 -33 -168 -9 29 -8
5634hm3l20L94Q2l03K45L7j03K04o7kj95K49k42qK36j02m5L0k8l1K49l59J85q4
$$ -8 -51 -371 23 105 -198 47 84 -19 185 118 116 -79 170 -72 -80 156 54 9 39 11 -20 229 -130 55 -29
5659b9J20p1j76O5O3q4L16k78J74k01J78k99Q6J89k26L11j8l18J48K20j22k40
$$ -29 91 20 -156 -91 -28 -112 204 -74 100 -101 77 -222 -136 53 -173 138 120 -198 -50 170 48 -192
5681a92RJ41K58p8k17L02m32K92M6j72L8R8k6J27j92nR7j26j19K16j7m9o3j32
$$ -192 -183 -42 216 138 -79 223 -209 83 129 -43 -5 93 67 194 2 -3 94 -32 -151 65 48 -1 -64 -196
5705a96J04l1l0n4K42r4KJ7L51l16J79j85p0K07l25R3J55n0K11k98m9J37j28K80
$$ -196 -92 -123 -153 -207 35 -59 -57 -40 311 -5 174 -11 -81 126 -199 -106 49 -1 210 -88 -137 0 -128 152
5729A52k71K6J27J16p8lo9l5O7J91l78K03j12P7k2Q8j21PK3j5K09o3m04J50K45
$$ 152 -119 -93 34 150 72 69 0 -35 32 223 -155 48 -64 13 -9 79 -42 -35 -12 -27 182 119 -285 -135 110
5754A10l34M67r6k49J24j44J15J89J02l99K8l5J10O2j98O0O8L0J7Nj0k22N52k85
$$ 110 -224 243 147 -102 22 -122 -7 182 284 -115 -87 -122 -12 50 -148 -88 -20 10 27 32 22 -200 352 67
5778F7j06J47l35J71J65j09P6k46K8K82k44K98j58k6R8J8m3LJ95k08p5n9J20m9
$$ 67 -39 108 -227 -56 109 0 76 -170 -142 140 -104 194 36 10 108 126 83 86 281 73 -2 -61 59 10
5802A0j07Q2k66L48k12J80l1l2L36l37j26L11j74l55L68k92L48o2R1j47k10N46
$$ 10 -97 -15 -281 67 -145 35 4 -28 308 -29 -155 156 -18 -373 -5 -297 51 -11 80 -67 -277 269
5824B69m57K67j57r5K91k08J23J02k12M71k20j29p9p1J18K76j52n4m04J69J7K43
$$ 269 -188 79 -78 -173 118 -90 33 135 -77 394 174 45 -34 -105 13 289 137 83 -321 -152 -135 108
5846A08r6o0R1m6r5j85O3P8L37j81r6K20j34j21j12L50m8j64l3J29j2j5l2J27
$$ 108 12 -48 43 -3 -98 -283 -220 -142 195 14 -82 138 4 -117 -229 121 73 -91 -124 5 -7 -22 -54 73
5870G3k35k8J33P4l90K78J58j76K52k35L46l64K03J7L6l63K20O9J0r2j37m1M2
$$ 73 -162 -190 -57 17 -373 -95 63 -113 139 -96 250 -114 89 106 142 -221 -1 68 78 -14 -151 -192 -150
5893a50K17j35J37P6k23L29k44J36k59J70k48m8J23Q4K31k68m8J44K2j16K07l5
$$ -150 67 -68 69 145 -78 251 7 143 -116 54 -194 -242 -119 -35 196 -72 -120 24 46 -70 137 102
5915A02j0k65J51o7M3j30J63m5J80j65P3L5M2k12J92pj69J03J06l0r4m3j25J68
$$ 102 92 -173 -22 -89 -46 -176 -13 -58 122 -43 30 65 107 -105 87 80 -89 14 120 90 -4 -47 -172 -4
5939dJ06R8k69j61J03K36k29K4J43L09k57k07R3J26k69K33p5L2J29j28K25k46
$$ -4 102 200 -69 -230 -127 109 -120 -96 47 356 99 -108 -15 111 -158 75 0 32 161 33 258 12
5961A2j91K91J13k07j58L6M2P2J65j56r9M1J54k12R6Mk2J95kj57q8J35j48J30
$$ 12 -179 112 225 18 -140 -104 -62 10 175 19 -80 -39 115 -97 -1 3 -19 176 174 17 -71 64 -84 46
5985D6k12M08j67J65j78r4k08J4K40p5L3r0RJ16j00J83J38p6j09J41l16n6K26
$$ 46 -166 242 75 240 62 -32 -240 -226 14 -61 -28 -118 -109 7 -93 90 228 152 43 184 -132 -188 38
6008C8r8J13ql06L61K6j62j41J35J68j40K9k4J24j23N4r5R5M0r1k3O1m4K22P0
$$ 38 -60 53 45 -261 100 126 -36 -177 -42 126 -14 15 -9 115 -8 46 -49 46 86 -5 -28 33 -11 211 281
6033B81l26L9Qj12K2PR8K76j91q7j92N1k0K5J60k25K63l37M82k99K72l97J01K6
$$ 281 -45 -6 2 -110 -88 -81 17 293 102 15 -177 -126 -146 -121 39 -186 77 -260 222 -77 195 -202 -101 -75
6057g5K83q5j62J41m3j03K88m37K16J00k86K23j51J15j72K25op9P9o2j23K33J24
$$ -75 208 123 -39 102 59 -44 244 -193 23 123 -163 60 -91 24 -148 77 71 -8 71 9 -114 119 243
6080B43k09o9J05j22J9J98k69J2K21j90N2K01l59K89Nj15k37K84J51k81K20l9
$$ 243 34 -35 70 -52 -33 165 -104 -92 129 -61 -9 192 -167 122 127 12 -225 59 210 -71 149 110
6102A10j60j4K7K41j12oJ22k83M2r4j5L28j73K7r4o4l6K67o5R2j35J8j55J7O1
$$ 110 -50 -64 -37 204 92 86 208 -75 -33 -127 -142 186 13 40 -54 -118 -154 113 48 140 5 23 -132 -115 -54
6127e4J36R1m7K4k49j01P3L62k37J94j54j10L17k84O2Q8j76J10q0K16k60K01j05
$$ -54 82 173 126 150 -99 -200 -127 235 -2 192 38 -72 245 -39 23 111 -65 45 -35 181 -79 122 17
6150A7k44J89K57j55p3L17k91j33J52k0j12K34j63P0P6j11q1L8q1j29J46M4N0
$$ 17 -227 -38 219 64 -9 308 17 -116 36 16 -96 138 -25 45 121 10 -71 -33 -114 -243 -97 -53 -3
6173cJ44m36N56k17k30J11L30j41j0j93k29N68j37j63J6m3m2R9k57M87k75J06
$$ -3 141 -295 261 44 -186 -75 255 114 104 -89 -318 250 113 -50 -34 -77 -119 -20 -277 210 -65 41
6195D1J19KQ2o15K37J43mj5q0J84J9k82J10J37j39J10K3j1p9l3N8m0l7L37J4j78
$$ 41 160 162 244 -371 -134 9 5 -10 -90 94 113 -169 -59 78 -61 49 72 61 -18 -51 7 -33 -70 267 281 103
6221A03j11M6o6K5K15j22j37L7J93k60K59o1l78K97p0k46M00j96j31L21k02K17
$$ 103 -8 38 -28 -3 212 90 -47 -10 183 -77 182 121 -257 40 -30 -276 124 -72 -203 118 -84 133
6243A33k42j20J38J51m9O2j86j34K90K54l5k92k41K48O3k08K05J00j07m6r8J03
$$ 133 -109 -229 -91 60 11 73 -113 -247 43 297 262 -30 -271 -23 40 -168 37 137 30 -16 -114 -11
6265a1k7Q5Q9j60q3N9L9q7J49j15P2m8n0K45k00k3J78L1j70k66L68j75K50j66
$$ -11 -38 47 136 -24 -107 -48 -9 -96 53 -62 10 -38 -88 157 -43 -66 112 143 -27 -293 75 -100 150 -16
6289a6J6m8j07M4J62R3j86j88M90l48k9K48j43N6K4J8j12J62j72J43k31J1P4Q7
$$ -16 0 -48 -155 -111 51 144 -42 -230 260 -88 -117 131 -12 44 68 86 -26 136 -36 107 -124 -113 -39 48
6313D8k7P7r1n7K9N1j5r4R7m4j21k0Q1J4M2k50J48K38l53P6K08l69L66Q6m8j39
$$ 48 21 98 7 -50 -21 30 15 -79 18 -26 -147 -167 -86 -72 -30 -280 -132 106 -247 -171 37 -332 34 120 72 -67
6339f7o4K31k08O9R2r0J05j99R5j4R1mJ26j09l63L75k38J80K6J47J01l57K6J5
$$ -67 -131 100 -108 -39 53 -37 68 -131 -36 -50 41 37 163 54 -309 66 -172 8 34 181 282 -75 -49 -34
6363c4n1P7O0K4j82L54k51K01l07r0N7j12K89j15M4Lj33J01N9j81r6M06k4O3l03
$$ -34 -85 -8 52 76 -106 248 -3 198 -109 -199 -142 -254 35 -80 -36 -33 -166 -65 -6 -187 -283 123 99 162 -141
6388a41R2o0J32k5J88k59L8M27k03l21L2L51j01l68R7m4J52J40j69K13k40l8J95
$$ -141 -49 -109 23 -2 186 -73 -35 392 189 -132 -100 251 150 -218 -121 -165 -13 127 -42 171 -69 -107 88
6411H8qJ04k73r8J08r7P4M62l25k61M43j33j17R5k05L79j93O3k20J99q1j06K03
$$ 88 80 184 -89 -187 -79 -176 -102 360 35 -226 217 84 -33 62 -143 236 43 106 -114 85 4 -102 101
6434A01j42J31p1j5R7k90K52q1j27J12k08L15q7J51r8Q3k30R9J4N7Q9j62o6P7
$$ 101 -41 90 19 4 101 -189 63 -18 -145 -33 -241 74 -13 138 40 123 -107 -8 6 63 152 -10 -76 1
6458Aj8jm0Q0j60P1J93l59L33j99K61j76m3p0J12M5j49J68r7K08k1j03n1O4l4
$$ 1 -17 -18 -58 22 -138 -67 126 -233 100 -99 162 -14 -57 -127 -15 30 -119 49 -48 160 139 36 -15 49 15
6483A5l94L70M6l9k8L9J15k33kL01j50J57n4k48J75k12L9J09K50n71K53J21Q0
$$ 15 -379 -9 37 -2 -30 9 124 -109 -111 190 40 197 143 -105 70 -142 -103 6 256 -315 -62 59 139
6506A39K0n2j28m6j52M62k26J4r2J90pk11J39k08K48Q9o0K31l57k95J84K02n3
$$ 139 159 107 -21 -67 -219 243 17 31 -61 129 122 -89 50 -158 90 179 119 350 -7 -302 -118 84 31
6529C1M4Jr6J24pr5K64l60J06O6J4J21l23r3l1K3J67J53l41L34j30j84J52M9J51
$$ 31 75 76 -20 104 97 2 266 -94 12 78 92 213 -110 -203 -234 -211 -44 109 -232 102 -28 -212 -60 -11 140
6554A40j44JK12j15J24n14L79n2J06j59J08n3r1J28J76l41n7n4J2J88L2N6Q0j26
$$ 140 -4 -3 209 94 218 -296 83 31 137 -22 86 33 -58 70 246 -95 -152 -206 -194 -6 26 82 162 36
6578C6l8L26l83qK81k46J08m5o9J8J69k01K16j94O3mK88k63q3J32j71J34O4j14
$$ 36 -2 324 -59 -67 214 -32 76 31 -38 -20 149 -52 164 -30 33 29 317 54 -29 103 -68 66 130 16
6602A6q5J79L4N9j80j42k3J93q4L3j50K33k94L04R3k02J54j16q7R8p4L04k60k2
$$ 16 -69 110 144 203 23 -119 -142 51 -33 0 -150 83 -211 93 186 -16 138 22 -65 33 -41 263 3 -19
6626a9O6K2O4j02p7j98K32J31j99J4j6K65n3j51o9L8k01K79r5lj38K08pL91o37
$$ -19 47 69 133 31 -46 -244 -12 119 -80 -66 -82 183 130 -21 -90 -52 -253 26 -69 -72 -210 -2 -9 382 -255
6651b55J03P5R4n3P0L0n6P0J37p8k61K55j91j65J87J35k10Q0R7J21P8p2j13j95
$$ -255 -152 -77 17 -36 34 64 8 78 215 137 -124 131 -60 -225 -38 97 -113 -33 64 185 263 191 78 -117
6675a17K67l29R9P4K9k26P2J54j53J01Jj6R0K28k82J99j84J7K34k30j58K85m34
$$ -117 150 -179 -80 -6 23 -203 -131 23 -130 -29 -28 -44 46 274 -8 191 7 24 258 28 -130 155 -279
6698b79L66j36O2J05R8k6k15J22Qj71J7J28k56K72k00k6j06K88J23l76L42j54
$$ -279 87 -49 13 118 216 190 -25 97 105 -66 -49 79 -177 95 -105 -131 -237 51 174 -202 140 -14
6720a4J46j76L87o5k32q7J71J90k90k61R8J31M3n0L5l0j6J34j01K4R5l20O5MJ1
$$ -14 132 -44 343 278 46 -41 130 320 30 -231 -133 -2 41 -9 26 -4 -20 114 13 37 132 -188 -123 -119 -108
6745a08K47k60N9J91k24L5j65J56K48m8o2J68m20M3K12Q1j75L3l7M2Q7O0k81K
$$ -108 139 -121 -62 129 -95 -60 -225 -69 179 131 69 237 -183 -140 72 153 -22 11 -26 16 103 163 -118 -116
6769a16M67l69m5J5J40j19K4J34p1n1Q0j47K00J77m92K43o0O7l74L18K23k54o0
$$ -116 351 -18 -63 -48 92 -27 -3 131 60 9 89 -58 142 319 -173 70 10 77 -297 21 244 -10 -70
6792g0L6k6K69j78J07n8k56L97l45j71J80J81j24L76m08J47j11J19k32K10j97
$$ -70 -34 -60 209 31 138 80 -176 221 -124 -295 -115 66 -58 318 -90 57 -54 65 -167 43 -154
6813a54K26p2j0L41n05K49K4l70J79j43K9Q1J78m4j65l6K74k31K51j28j11L02
$$ -154 72 0 -10 331 -174 75 99 -271 -92 -235 -206 -125 53 9 -156 -192 82 -149 102 -26 -137 165
6835A65k45k4J79j09P9J12k51p8R3J91q2lr7K8j4K47k90j26L5K25p9J18l37K57
$$ 165 -80 -104 75 -34 45 157 -94 -172 -79 112 30 27 -70 -42 -56 191 -99 -225 -190 35 -44 74 -263 -6
6859fl4K2N0P3o9j03K7p5L2L8M8j44K18l04J40q1J94J9q6K9J38l32K86l3L3k64
$$ -6 -40 -18 32 105 36 -67 -40 -115 -83 -45 3 -141 77 -227 -87 -168 26 45 -41 -12 126 -206 80 47 80 -184
6885a84K01J4k52J06J70r9J20N0l64J25K64l3k55J32N4J24j27O1O9k06j84J04
$$ -184 17 31 -221 -115 55 -44 76 126 -238 -113 151 118 -137 -5 49 173 46 107 176 -30 -214 -110
6907a10j05J83K95l58O5R4j81J95K1o7j03l8O7j03K34J21k40Jpr8j96J41K99O7
$$ -110 -215 -32 263 -95 -30 64 -117 78 99 32 -71 -109 -42 -145 89 210 -30 -29 -36 -134 -330 -189 110 177
6931A77q1j90o2K58l7k17L13J9L1k25j1nj21R9j02K16J9P8j35k16M97k71j21L5
$$ 177 96 -94 -156 102 65 -152 161 180 211 -14 -25 -30 -151 -52 -154 62 81 159 24 -192 305 34 -87 -52
6955e2N2Q0k1kM5j21j38J56j8m0p6K11j72R0M2j1n0J36q6r1O8n9q1pJ33J16k32
$$ -52 0 80 59 57 102 -19 -157 -1 -19 -59 -135 76 -96 -6 36 25 -25 111 25 -66 2 -57 -138 -145 -12 104 -128
6982a28J71l0j78J78J28j08J25j67LO5r0K06j30k9j26J92j41pP5J63l74L6K07
$$ -128 43 13 -165 13 141 33 158 -9 -6 59 -31 175 45 16 -110 82 -59 -66 9 172 -202 -166 41
7005D1r1j16R6K60m40J21M00l16J72k1q9J21l07K47k78K76J4o5q2K1l4OR2j77
$$ 41 -50 -166 -70 190 -250 -129 271 -45 127 106 17 138 -169 78 -200 76 90 25 -57 -36 -70 -64 28 -149
7029a49K52k02J59p5J46j68J35k24M7J76q3OJ82l11J47Rj72L13R6l41Q2k13M79
$$ -149 103 -99 60 -15 131 -37 98 -126 -79 97 14 20 202 -109 38 47 -125 188 284 -57 25 -188 291
7052B91l32p9K92m26M03j13P5j10p5K35j09j27kKO9k19M82k05K03l40J73j55j39
$$ 291 -41 -120 172 -254 149 36 111 1 -74 161 52 -75 -77 -75 -6 -225 257 52 255 -85 88 -67 -206
7075b06L81L9%l66J30J45k8j81J92k8M1j38M1J04r0qpJ21j61j2J95r4k63k4J63
$$ -206 175 214 214 -152 -22 123 95 -86 106 78 119 -19 22 126 36 28 21 142 -19 -31 164 70 -193 -217 -54
7100e4l7J44J54j83q2Q9L4k42m3N5J57j62J28Q2Jj39l9K48mj45l9j41J35J31J98
$$ -54 -91 53 207 24 -58 31 65 -177 -220 -165 -8 -170 -42 40 41 -98 -137 111 107 -38 -77 -218 -83 48 246
7125B46l39J58L4l04L45r9j67J2M02k72k67J92n7J71j89J85Mj8J5m7J28O3l69
$$ 246 -93 65 99 -205 140 41 -126 -114 288 16 -251 -59 -116 55 -134 51 55 37 52 5 133 196 -173
7148a73J06K29k40K58j32J09j86K6J07p2J25j56L94n16Q7p7N4L7M9L0k84J74M4
$$ -173 -67 162 -78 180 48 157 -29 -3 104 32 157 1 395 -121 -34 -111 -57 -20 29 59 -225 -51 -7
7171gJ32O1l20P6J79j00NL6q5J0r2K05J20j39j12j80M07j42Q2j24k4J23p1J72
$$ -7 125 186 -134 -58 121 21 26 62 -23 -13 -105 100 220 81 -31 -211 196 54 136 12 -12 111 40 212
7195B12l70M81j22j76J73m86L03J51j42O7k08K42k43OJ24K7q8nM31n11L56q6k09
$$ 212 -158 323 201 25 198 -288 15 166 24 91 -117 125 -118 -112 12 39 -49 -54 377 -134 222 136 -73
7218g3K86l34K75K8k93K47J93l19n0M2K3n1q2L05j82j40K58k1K8Q0l16K15k1J55
$$ -73 213 -121 154 182 -111 136 329 10 -40 2 25 -26 -108 197 15 -125 133 112 140 220 -96 119 98 253
7242B53k9j87J0j95J29l3J87l79j7K84q1J03P0k1j71j12J59J70k90L53m98K74
$$ 253 224 37 47 -148 -19 -52 135 -244 -261 23 -58 45 115 94 -77 -189 -30 140 -150 203 -295 -21
7264b1R2n0L5j28l3K38J4m23Q4J54Lk1J42o7j5J90l1k14o3J95M4l77L73j32K20
$$ -21 71 21 56 -72 -105 133 147 -276 -192 -38 -35 -56 86 19 4 194 163 -51 -114 81 125 -252 121 -11 209
7289B09k84J67N8k19J35R9j19k11K29j57K90m94K88j7l77J49N2M04l60k6J51K83
$$ 209 -75 92 150 -69 66 165 46 -165 64 -93 197 -297 -9 -26 -403 -254 -202 202 -158 -184 -33 250
7311B50k97J93j52K49j97j63K11P1n7j58j24M4P6K22l03O2m2L1J02mR5j60k30
$$ 250 -47 146 -6 243 46 -117 94 165 108 -50 -174 -130 -54 168 -135 -73 -115 -84 18 14 109 -51 -281
7334b81j66M46N6l2K69l83oJ57Kl2k6J09J52l21R9r5J82k53K9K05l4J09j89N7
$$ -281 -447 -1 55 23 292 -91 -97 60 62 30 4 113 265 -56 43 -52 130 -123 -94 111 77 186 -3 54
7358E4J03k97J4P8J3j57K56j45K29j22j29K73p3qk40J72m37N10j19n4K12j26L
$$ 54 157 -140 -126 -48 -35 -192 64 -81 148 26 -103 170 97 89 -151 21 -416 94 -25 -79 133 7 10
7381A0L33j21j19k12J89j10j49K21KJ23J70m81J04J97Jj55N3l3o5N8j99P1n0K19
$$ 10 343 222 103 -109 80 -30 -179 42 44 167 337 -144 -40 157 158 3 56 23 -42 16 -183 -112 -162 57
7405E7j66K38q4p1J07k9K66k57q6K21l40J35M8p2nM8m3p5JR9j01K42k36K39k02
$$ 57 -109 129 45 -26 81 52 318 61 -25 196 -144 -9 39 -33 -38 10 -33 -108 -107 -8 -109 133 -103 136 -66
7430f6J28l9n8L4j21l7K25R4o1j16Q7m40K93K15j69q1J20j9k1p6J96P2J6j22j31
$$ -66 62 23 -35 -1 -122 -159 66 160 99 -17 70 -370 -77 138 -31 -112 8 -11 -32 -108 88 160 176 54 -77
7455g7K95l31L42j90j27K7J38k21J76P2P5l53m0L89j46pK01j48k5J00Km2j60q5
$$ -77 218 -113 229 39 -88 -61 77 -144 32 104 179 -174 -214 175 29 22 223 75 50 150 152 110 -50 -135
7479a35K21j58n9N2J93k86J76r2q4K6J94M3J95j22k7ok46J93L7Lj68O5J41L3j49
$$ -135 86 -72 -131 -79 114 -172 4 -88 -172 -146 48 91 286 164 137 131 -115 78 115 118 -50 15 156 189 40
7504D0M3l38J89r3K00L0N7l85L38m2m1moL1J09oj06p4J70J8j20k2o5J68j98J40
$$ 40 83 -255 -66 -159 41 71 128 -257 81 39 -2 -6 -12 19 128 122 16 -58 112 130 10 -12 -77 91 -107 33
7530C3j40K92k82jK84l59j74J65P8K64m15L05M6j13J21j88J49l44K50m2J05R6
$$ 33 -107 185 -97 -98 186 -173 -347 -182 -104 160 -255 50 96 -17 104 -84 65 -279 -29 -71 34 130
7552A30q0j28j37L68j62K08j57k00m9L92k72j32L6L8j0ML75r4j46j4l7L5K73l15
$$ 130 50 -78 -215 153 -9 199 42 -158 -207 185 -87 -219 -183 -145 -155 -151 224 130 -16 -30 -67 -32 241 -74
7576g4k5N0J16k60L78j06j41J07J27l2nk05K3m8R7l1k37L45j21J73R1k26m1N3
$$ -74 -99 -49 67 -193 185 79 -62 45 172 140 135 -70 -47 -95 2 -29 -266 79 -42 131 222 -4 -45 8
7600HP9mJ46n2P7k79P5L4j77J14j89Q5Q3L0J7j75O7j24P0J1M0J62j24K54j22j63
$$ 8 87 83 229 177 254 -25 50 84 -93 21 -168 -83 0 30 47 -128 -61 -185 -115 -104 -64 98 -26 228 106 -57
7626e7M7M7mk06M22m83M39l10J60j43K9K28K6j69J50j50J8k98J65Jn9Q3O7Q8L
$$ -57 -10 37 33 -173 249 -234 205 -105 55 -88 -59 169 195 26 176 26 44 -254 -89 -88 -147 -64 3 91 94
7651I4k34J24O5P6k36N2M2J95j55j04N5N8j15J74j46j97L43o3l4J07k92K25m9
$$ 94 -140 -16 49 125 -111 -59 -17 178 23 -81 -26 32 -83 91 -55 -252 91 28 -6 101 -191 34 -15
7674a5j41J79m9K6k7M9k91L40j1R6j71J73j10k9N6j98l6J20k4J21j4M6j91o1L11
$$ -15 -156 23 -26 0 -27 22 -269 71 60 156 -15 158 48 19 75 -123 -159 -39 -63 58 44 90 -101 -162 149
7699A49J6kM2m31L41p4P7k26J59j4l6J27K36j52rl10J33p2q7R9L6Q8n1J94j66
$$ 149 165 163 205 -226 115 41 118 -108 51 37 1 128 364 212 203 -107 26 -46 -133 -34 2 90 39 233 67
7724F7K51l28j2j38J33r4J69k46J59m0O5L8J0p3j17L99k53M2K25j61j52M16m76
$$ 67 318 -10 -22 -160 -27 -121 48 -198 -39 -79 -14 24 34 -39 -156 243 -10 32 257 96 -56 360 -116
7747a16J04O9Q6j1O3j54O0l05K06k78N60p1j18l08J89j82K99j45J5Q8j40J75K04
$$ -116 -12 57 143 132 195 41 101 -204 2 -276 284 213 95 -213 -24 -206 93 -52 -37 51 -89 86 290
7770B90l43o7O2J00j07k3RJ2k59R8L30j04J05l23L54l02L24k68J49O1N6L3l12
$$ 290 -53 -120 -58 42 -65 -88 -79 -67 -326 -228 102 -2 103 -220 134 -168 156 -112 37 98 154 187 -125
7793a25K60l88K5J65j57L9J95j47J35m5K63k08nK1%j19l0n9K41k6K05j39o9R9
$$ -125 135 -253 -228 -63 -220 -181 14 -133 2 -43 220 12 7 28 28 -91 -121 -180 61 35 240 101 32 131
7817A31J36j19k12K60l45J12J5K3j4j72J46J15k01J52J33j49q7Q5p3K1p6j2%P
$$ 131 267 148 -64 196 -149 -37 -22 1 -13 -185 -39 76 -125 27 160 11 -76 9 -64 -43 -119 -131 -131 -124
7841a24J32j66j21J57J90k6k80M33k04k3l4R7J96k27r2j03M20k57P9q0R5Rr1K60
$$ -124 8 -158 -279 -122 68 42 -238 195 -9 -32 -66 31 227 0 -92 -195 225 -32 47 -33 62 71 -20 240
7865B40k77J87k27N6r0J81o4Rj1o0KL33m02L86j97p4k20K16p6n2K28j38Q9j58
$$ 240 -37 150 -77 -21 -111 70 6 15 4 -56 -54 279 -123 263 66 -8 -228 -12 -88 -140 88 -50 39 -119
7889a19O3J63o1MLj54K09p8o0j0j01J39j0j77K08K63k04P4j96J69j12k22L47l52
$$ -119 -56 107 46 50 53 -101 108 30 -30 -40 -141 -2 -12 -189 19 282 78 152 -44 125 13 -209 138 -214
7913b14L6J71j29Q8p4L13m45J97L38k99l2l5J15l9r2J13L2L9j80nj0j27O5K16
$$ -214 -178 -7 -136 -48 -122 191 -254 -57 281 -18 -50 -85 30 -9 -101 12 44 83 -97 -102 -112 -239 -174 42
7937D2j14J71k92l0J16K25l3k49K48j65O4k8l2J44J1R6k35K37r8J32j72J09K02
$$ 42 -72 99 -193 -223 -107 118 85 -164 84 -81 -17 -45 -77 67 78 174 -61 176 78 210 38 147 349
7960C49l60km9j32q0J16k8K2Q2J16J20j99N6j32L3R3J85k16N1j08N0J36O5m47
$$ 349 -11 -13 -62 -194 -274 -158 -186 -164 -82 34 154 -45 11 -121 -88 5 190 -26 25 -83 -33 103 168 -279
7984b79J70K20j80j50J62r9J96J0j9r7l6K3N2J01q6j35L10k06l21L38j35J81J20
$$ -279 -109 111 -69 -219 -57 -156 40 50 31 -66 -102 -79 -27 74 -12 -147 163 -43 -364 -26 -161 20 140
8007A40j91L03k71rJ45m25L95j20J26l80M27J03m08J03j1O4J15j06q2J74j88j04
$$ 140 -51 252 -19 -28 117 -308 87 -33 93 -287 140 243 -165 -62 -73 -9 106 0 -82 92 -96 -200
8029b00Q8J82q0k33J80K9J93m03N02k67k22K55n4J62l25K51k52N28m14J36k3j21
$$ -200 -112 70 -10 -243 -63 -34 159 -244 258 -9 -231 24 -30 132 -193 58 -194 334 -80 56 33 -88
8051h8j25J96j40P3L15k74Q1j14K45m16M51l69J9K39j12J14j61K45Jk82j10J49
$$ -88 -213 -17 -157 -84 231 -43 38 -76 169 -247 204 -165 -146 93 -19 95 -66 179 180 -102 -212 -63
8073f3J12k0J3k87L48o9K5l7L26k98k24K51O1k46N8o0K24J39j88j59K71m10J35
$$ -63 49 29 42 -245 103 34 59 22 348 50 -174 77 138 -108 -50 -110 114 253 65 -94 177 -233 -98
8096i8J13R9k70L3J12j7K11j51o4J00Qj80Q9L1J4k18L37l29J53J34q7J47j85P6
$$ -98 15 114 -156 -123 -11 -28 183 32 -32 68 76 -104 -15 16 30 -188 149 -180 -27 107 20 167 -18 58
8120E8Kl02J80j51K01K47j71j49o8J84n0j93J52l3J50M0K70j84j64J0l73L22J28
$$ 58 60 -242 -62 -213 -12 235 64 -85 -153 31 -19 -212 -60 -93 57 97 367 183 19 29 -344 -22 106
8143A06l4J08j14K1M0k99J72j06K92k23K15j50j15J33J13k51J20K83l27L2J3j74
$$ 106 72 180 66 87 127 -172 0 -106 186 -37 178 28 -87 46 159 -92 28 311 -16 16 29 -145
8165a45L8M4P6O8K35l72LK30j37Q3j99J20r3M1j47P4Q4M9k74L42k50K55O3m22
$$ -145 -107 -63 13 81 316 -56 -53 177 40 123 -76 44 -49 -8 -155 -81 3 52 -222 120 -130 125 188 -234
8189b34K35J13
$$ -234 1 114
8191A14
$$ Imaginary data points
##PAGE= N=2
##DATA TABLE= (X++(I..I)), XYDATA
0@%%%%%%%%%%%%%%%qJ6j6J6j6K3l1L2m0M8n4O2p2Q3r1J04j20J36j55J78k00K24
$$ 0 0 0 0 0 0 0 0 0 0 0 0 0 0 0 0 -8 8 -8 8 -8 15 -16 16 -24 24 -30 32 -40 43 -48 56 -64 72 -83 95 -105 119
37A19k53K81l13L50l87M30m78N29n84O43p08P82q63R50j046J153j272J406j558
$$ 119 -134 147 -166 184 -203 227 -251 278 -306 337 -371 411 -452 498 -548 605 -667 739 -819
56h19J728j922K151k423K744l138L635m281N164o445Q479j2219K1345q5806j17831
$$ -819 909 -1013 1138 -1285 1459 -1679 1956 -2325 2839 -3606 4873 -7346 13999 -71807 -189638
71a89638J51958J33152N950r0398n0294J7559O7936L5775j0263m1729m2838j4827
$$ -189638 -37680 95472 101422 11024 -39270 -21711 46225 82000 71737 30008 -12830 -27657
83b7657N3271N5680k0928p3801l0368L3980M9708n180n7128l7375K5504L5016
$$ -27657 25614 81294 60366 -13435 -43803 -9823 39885 34705 -22423 -59798 -34294 722
95G22J82j2538n742j4539q895K2271L1388l612l2452j5401K9945M3036N17l7675
$$ 722 904 -11634 -17376 -31915 -40810 -18539 12849 9237 -23215 -38616 -8671 34365 34882 -2793
109b793j4429K3461J5527q252l875M589l947p982Q70J0797M704j7640k0150J1988
$$ -2793 -17222 6239 21766 13514 9639 14228 10281 2299 3169 13966 18670 1030 -19120 -7132
123g132K4428q665k4744J401J7030J527j2047o334P904Q157p743p439J5434J4099
$$ -7132 17296 8631 -16113 -14712 2318 3845 -8202 -14536 -6632 1525 -6218 -13657 1777 15876
137A5876j3979j5892J1261J7732m158j6098k020J4750P967j1511r868R574Q978
$$ 15876 1897 -13995 -2734 14998 10840 -5258 -7278 7472 15439 3928 -5940 3634 12612
150A2612j1583j3279Q635J3563o292j3507L141J3255j044j6347n537J4483R292
$$ 12612 1029 -12250 -3615 9948 3656 -9851 -6710 6545 5501 -10846 -16383 -1900 7392
163G392j1975j0678J2335J3979p758j2164N949J1304k315j1097R5J3140N436j1731
$$ 7392 -4583 -15261 -2926 11053 3295 -8869 -2920 8384 6069 -5028 -4933 8207 13643 1912
177A912p667J1246Q552j1045j0859P381J0932l685j1677J232J2019N31j5130n488
$$ 1912 -5755 5491 14043 2998 -7861 -480 10452 6767 -4910 -3678 8341 8872 -6258 -11746
191a1746J0893M878j1185o503J0354Q648o372j0524M108J0741k079j0600P42J2628
$$ -11746 -853 4025 -7160 -13663 -3309 5339 -1033 -11557 -7449 3292 1213 -9387 -8645 3983
205C983L782q702l575R220O174p924q884N960J0438l313r931J216J1278N96j2266
$$ 3983 7765 -937 -4512 4708 10882 2958 -5926 34 10472 7159 -2772 -1556 9722 10318 -1948
220a948l683R263K733r622n917P837O838n377q324L636Q686l356j0237J293R869
$$ -1948 -5631 3632 6365 -3257 -9174 -1337 5501 124 -8200 -4564 4122 766 -9471 -8178 1691
235A691J544p427k777P546N786o140p030N074Q585k721q390K992R416n57r168
$$ 1691 3235 -4192 -6969 577 6363 223 -6807 -1733 6852 4131 -4259 -1267 8149 7592 -1576
250a576k104Q175L219p662n111O869N714n931p135L275O034l214p033J118P201
$$ -1576 -3680 4495 7714 52 -5059 1810 7524 1593 -5542 -2267 3767 553 -6480 -5362 1839
265A839R30p003k091O856K938o300n075M966O642k681n539K783P472n02p230j331
$$ 1839 2769 -4234 -6325 531 3469 -2831 -7906 -2940 3702 1021 -4518 -1735 5737 5235 -1995 -3326
281c326P029K128o844k764O772M721n199n224L374M044l554n996J141O105m5o091
$$ -3326 3703 5831 -1013 -3777 2995 7716 2517 -2707 667 4711 1157 -4839 -3698 2407 2362 -3729
297c729o03N849J676o051l797M340M670l149m368K863O379p40o115K25N961R41
$$ -3729 -4332 1517 3193 -2858 -6655 -2315 2355 -794 -5162 -2299 4080 3340 -2775 -2550 3411 4352
313D352o149j352N739L029m349l998L822M170l496n397J542N004o69n107k37M804
$$ 4352 -1797 -3149 2590 5619 1270 -2728 1094 5264 1768 -3629 -2087 2917 2248 -2859 -3096 1708
329A708J324n104k956M338K959l196l720K738N340j532n670Q57M998K02n053n12
$$ 1708 3032 -2072 -5028 -690 2269 -927 -4647 -1909 3431 1899 -3771 -2914 2084 2286 -2767 -3279
345c279N570K067m597k899M038L203l322l980K251M236o63l912m4L556Q69l816
$$ -3279 2291 4358 -239 -3138 900 4103 781 -3199 -948 3288 2625 -1287 -1331 2225 3094 -722
361g22k118K995K432k722k928K363L996k074m502P04M036m86m358j73M512J436
$$ -722 -2840 155 2587 -135 -3063 -700 3296 1222 -3280 -2576 1460 974 -3384 -3557 955 2391
377B391l515j718L526K492k951k790K087L502j100l578J003L619m6l421j524K729
$$ 2391 -1124 -2842 684 3176 225 -2565 -478 3024 1924 -1654 -651 2968 2922 -499 -2023 706
393G06K110k391k597K517K980k308m144J230L823q36m013m06L591J495l446j528
$$ 706 2816 425 -2172 345 3325 1017 -3127 -1897 1926 1090 -2923 -3329 262 1757 -1689 -3217
409c217L365J750k903k324K937L053j825k399J098L304K5l048j383K825J244k491
$$ -3217 148 1898 -1005 -3329 -392 2661 836 -1563 -465 2839 2864 -184 -1567 1258 2502 11
425A1j588K501K206j901k806O90L081j377l654l33L740P82l691j066L265J538
$$ 11 -1577 924 3130 1229 -1577 -887 2194 817 -2837 -3170 570 1352 -2339 -3405 -140 1398
441A398k473j589K036K257j358k221J150L241J01l407q39K819J794k417j757J813
$$ 1398 -1075 -2664 -628 1629 271 -1950 -800 2441 2542 -865 -1704 1115 2909 492 -1265 548
457E48K087j244k579J057K467q24l427O5L239N54l472r04K271J540k191j571J232
$$ 548 2635 1391 -1188 -131 2336 1512 -1915 -1850 1389 1943 -1529 -2433 -162 1378 -813 -2384 -1152
474a152J725n47j832Q58K395m17k741j82K144J004j538j099J317K027o14j684
$$ -1152 573 26 -1806 -948 1447 1030 -1711 -1893 251 1255 -283 -1382 -65 1962 1348 -336
490c36O72J796n23k403L05K515q2k142j135J637J432j980k038J250J603j031j592
$$ -336 336 2132 1609 -794 -489 2026 1944 -198 -1333 304 1736 -244 -2282 -1032 571 -460 -2052
507b052J020J654l87j711M54J073O42j240j259J629J927j191j564Q57K086p29
$$ -2052 -1032 622 235 -1476 -1022 51 693 -547 -1806 -177 1750 559 -1005 -148 1938 1209
523A209j605J34J777j7j597r19K054Q99k336j537J596J339j009j009M35J235m30
$$ 1209 -396 -262 1515 1498 -99 -1018 1036 1935 -401 -1938 -342 997 -12 -1021 -586 649 219
540B19j055m94J105O16r40j504J667J304j081j429Q88J664k06j092k18K018P55
$$ 219 -836 -1330 -225 391 -549 -2053 -386 918 -163 -1592 -704 960 754 -338 -556 1462 2217
557B217j672o89J732M38j775q21P51M97n58r13J09Q39L68j175q84J052N12q74
$$ 2217 545 -144 1588 2026 251 -570 181 678 120 -793 -684 155 523 -652 -1536 -484 28 -846
575h46q62Q92Q65P0j143j65J303P45j544l34J916L21r64n83R93Q80n15r05j24
$$ -846 -1708 -816 49 119 -1024 -1189 114 859 -685 -1019 897 1218 254 -329 664 1544 1029 124 0
594@Q39j04p10k97R95J28j017k09J43N29N5j082q7Q47k10n88r1N39K69j032j41
$$ 0 839 735 25 -272 723 851 -166 -375 -232 297 352 -730 -817 30 -180 -768 -859 -320 -51 -1083 -1224
615a224Q43P08qn85P34L16j77n81R4M64J74j82k06L70k44j70K79k89k64K29o64
$$ -1224 -381 327 319 -266 468 784 607 26 120 584 758 576 370 740 496 326 605 316 52 281 -383
636c83l41R13K74j143n22R05R4m30n56P84M40l85j45L14P94k10k95M38Qm3o3l20
$$ -383 -724 189 463 -680 -1202 -297 -203 -633 -1189 -405 35 -350 -495 -181 613 403 108 546 554 511 448 128
658A28L5M96K20p50k61M82N11r05n97O58L35l27p98M18N50l14l93l82P44m9m69
$$ 128 163 659 879 129 -132 350 861 -44 -641 17 352 25 -773 -355 195 -119 -512 -894 -150 -199 -668
679f68J2M61N9j62L29J98K12N1l24l27O30L57m98m13L67M53l33m45JL92q3n64
$$ -668 -656 -195 -136 -298 31 229 441 492 168 -159 471 828 330 -83 284 737 404 -41 -40 352 269 -295
701b95p1O18o22n68j90O04L23k80k30l0L77P07l68k62K16L46j94q3L06k5P9p71
$$ -295 -366 252 -370 -938 -1128 -524 -201 -481 -711 -741 -364 343 -25 -287 -71 275 81 -2 304 279 358 -413
723d13N05O80l91o28o2Q83k66j72k10L18J79o25m8n3J76j63k10j33K24M21l65
$$ -413 92 772 381 -247 -309 574 308 136 -74 244 423 -202 -250 -303 -127 -290 -500 -633 -409 12 -353
744c53n0J42N92n8n62J49L09K42m94j17Q82j49q78J84O06K00m41n43M28K92k80
$$ -353 -403 -261 331 273 -289 -140 169 411 -83 -200 682 533 -345 -161 445 645 204 -339 89 381 101
765A01l85m6L31p9k98M3k5M66j91k40j81P52J07n65j55R14j13n65j89P81J3m19
$$ 101 -284 -330 1 -78 -376 -333 -358 108 -83 -323 -504 248 355 -210 -365 549 436 -129 -318 463 476 57
787E7k44M71N05n59n80L05N80k86m95o2j24L75K9n33M67J57K19o52n0O35Q1n32
$$ 57 -187 284 789 230 -350 -45 535 249 -246 -308 -432 -57 -28 -561 -94 63 282 -370 -420 215 296 -236
809b36j75Q31J31l18p00O75O09o32o36K27M50j35k95K03K20j71j80l17K80J79
$$ -236 -411 420 551 233 -467 208 817 185 -451 -224 226 91 -204 -1 219 48 -132 -449 -169 10
829A0j13n39L52K05K56k77k61K07M97l36k22K23M62m36m48O18L60l24n45K9N56
$$ 10 -103 -642 -290 -85 171 -106 -367 -160 337 1 -221 2 464 28 -420 198 558 234 -311 -282 274
850B74N3k54l62Q6L29r4k2k60J03L33n07J96j44N89l43k85J00K43L7k65J31L57
$$ 274 327 73 -289 -203 126 32 10 -250 -147 186 -321 -125 -269 320 -23 -308 -208 35 72 -193 -62 295
872B95l1k90j31N53k30o55M68J22J46o90K99M0L55J25n37j48M04J07m42j83N20
$$ 295 264 -26 -157 396 166 -489 -21 101 247 -443 -144 -104 251 376 -161 -309 95 202 -240 -423 97
893I7K13m44l95L30O68k15q37M01N46k79j43j59K07J98k91%j0K60J53o21K09O18
$$ 97 310 -134 -529 -199 469 254 -583 -182 364 85 -58 -217 -10 188 -103 -103 -113 147 300 -321 -112 506
915E06J54o55l62J02M46J4p38J48R69k85p88J70O04L8r10%P42J04k20m18K95L12
$$ 506 660 5 -357 -255 191 205 -533 -385 584 299 -489 -319 285 323 -587 -587 155 259 39 -379 -84 228
937B28j26k44J83l4K72m25m3L44L79m45p63M35Q50n40l08Q2O47k09o02N5L21o4
$$ 228 102 -142 41 7 279 -146 -189 155 534 89 -674 -239 611 71 -237 -155 492 283 -319 -264 57 -7
959gk79k81K96O75n31l72N04L07n7o98K32M39Ok31K8K6M88k22r94N77N51k91n19
$$ -7 -286 -567 -271 404 -127 -499 5 312 255 -443 -211 228 234 3 31 57 545 323 -671 -94 457 166 -353
982c53o9P79O8j108L38L13M82n02l21N76L31m02m12K86J37K2k88j99R1O11l45
$$ -353 -422 357 425 -683 -345 -32 450 -52 -373 203 534 132 -280 6 143 165 -123 -322 -231 380 35
1003C5m59K81O22j28n51o2M33K50p75O5P41J79r87J03N19L02p77k35M30K31j04
$$ 35 -424 -143 479 351 -200 -262 171 421 -354 -289 452 631 -356 -253 266 568 -209 -444 -14 217 113
1024A13l0m51K49L3k62k48K27O11n18k59N36J72J19n50m30N47P07m83k72N73K39
$$ 113 83 -368 -119 -86 -348 -596 -369 242 -276 -535 1 173 292 -258 -688 -141 566 83 -189 384 623
1045F23p22Q8L56K30o19m62N12K00K17m49k86L98K75j45m38l7L93l85k9l11Q82
$$ 623 -99 -11 345 575 -44 -506 6 206 423 -26 -312 86 361 216 -222 -259 134 -251 -280 -591 291
1066B91O6o27m85O49L80k80n81P80J71l74J09K71k49J50k81K10K08J96n20k16
$$ 291 357 -270 -755 -106 274 -6 -587 193 364 -10 99 370 121 271 -10 200 408 604 84 -132
1086a32L79J34l23k10k39K95J33k99k07L56M68r40j68P03m5l63j47J26N92L2j21
$$ -132 247 381 58 -152 -391 -96 37 -262 -469 -113 355 -585 -753 -50 -95 -458 -605 -479 113 145 24
1107B4l3M01k07J9j74L66P6k15k87J46l0M67m73m64J34N88o24j70M90o1j55j06
$$ 24 -9 392 185 204 30 396 472 257 -30 116 86 553 80 -384 -250 338 -286 -456 34 -27 -182 -288
1129b88M56J3j36m62K85L50J57k18l81M35m17p4M47k47J27p3j57J26J22M20m01
$$ -288 168 181 45 -417 -132 218 375 157 -224 211 -206 -280 167 -80 47 -26 -183 -57 65 485 84
1150H4n07M46N25n12j20J47O9rm40L07Q6j08k71J34K37j17j93j24K78J23l6J29
$$ 84 -423 23 548 36 -84 63 132 123 -317 -10 76 -32 -303 -169 68 -49 -242 -366 -88 35 -1 128
1172A28m05J06N39m71K24J42R8k88J3j34J10L27k05l88L78J33m08k4L53k48q0
$$ 128 -277 -171 368 -103 121 263 361 73 86 -48 62 389 184 -204 174 307 -101 -125 228 -20 -100
1193a00kJ14M7j66r2j98J72M51n25l7J44M31j49r9k41K87K90m80J90K62r9j79
$$ -100 -102 12 59 -107 -199 -397 -225 226 -299 -336 -192 239 90 -9 -250 37 327 -153 37 299 200 21
1215B1mL77k14rn3m3K74k71P4q3j2P9k10p6J75k67k4Jk00O30j92j25k73N69p3
$$ 21 17 394 180 171 118 75 349 78 152 69 57 136 -74 -150 25 -242 -266 -265 -465 165 -27 -152 -425 144 71
1240G1m55J3L58J20l4j71J20M22l23r1k54M88k55K67k97K28L4j2m46Q0K25j59
$$ 71 -384 -371 -13 107 73 -98 22 444 121 30 -224 264 9 276 -21 207 241 229 -217 -137 88 -71
1262g1n5j90M69j84l76p4K77N8K8j99M38k40J2k00Q0M83l4j88NL72J90m05J71
$$ -71 -126 -316 153 -31 -407 -481 -204 -146 -118 -317 121 -119 -107 -307 -227 256 222 34 39 411 601 196 367
1285C67m98M56n9l62j37M65L31n99l60M68L03m95m84N84J06j90j53q1Q45o19N2
$$ 367 -131 325 266 -96 -233 232 563 -36 -396 72 375 -120 -604 -20 86 -104 -257 -338 507 -112 -60
1306f0k72K15Q3L4j62L37p1k1m0L10j89K39m03k30K42K96j01l25K32K63m03k42
$$ -60 -332 -117 -34 0 -162 175 104 83 43 353 164 403 0 -230 12 308 207 -118 114 377 -26 -268
1328b68L05j7j92k79K18L60p2m72M30j72M21l19o1J27K6j41K09j61K87Lk23j55
$$ -268 37 20 -172 -451 -233 127 55 -417 13 -159 262 -57 -118 9 35 -106 103 -58 229 232 9 -146
1350a46L33K71k33k70M4M30l59l09jO32j40l84K2J1J69k64K15O8k3J90l48j06
$$ -146 187 458 225 -45 -1 429 70 -239 -240 392 252 -132 -110 -99 70 -194 21 89 66 256 -92 -198
1372a98L00J06j82l08O9N77n42J26n9K97k19k93L86L54m26J51p3J34L25o31K01
$$ -198 102 208 26 -282 -213 364 -178 -52 -111 186 -33 -326 60 414 -12 139 66 200 525 -106 95
1393I5m3J03M8l67J49k02K13j93k95K90J70m5k85O4M41j19l26l9Q05m86l1J71
$$ 95 52 155 203 -164 -15 -217 -4 -197 -492 -202 -32 -77 -362 -298 143 24 -302 -341 464 -22 -53 118
1415A18K38j96m00R6L24M26n09j76K10J10J75o70L56o1K97m75j06K70L94k79k17
$$ 118 356 160 -240 -144 180 606 97 -79 131 241 416 -254 102 41 338 -137 -243 27 421 142 -75
1436g5j06L30j17m27K74j21L95l54k5L94k22J9r8M60j47j2l07L13J21J59k35k52
$$ -75 -181 149 32 -395 -121 -242 153 -201 -226 168 -54 -35 -133 327 180 168 -139 174 295 454 219 -33
1458c3j20M13j57l61K22L58k34j84p2L93o6n62j47N37K06m30j37K40K08j04j92
$$ -33 -153 260 103 -258 -36 322 88 -96 -168 225 159 -403 -550 -13 193 -237 -374 -134 74 -30 -222
1479b22P2J42K01l43L11P0k21L19l18J6J45qj80J01M20m53j40r5M58r5l41j25
$$ -222 -150 -8 193 -150 161 231 10 329 11 27 172 164 -16 85 505 52 -88 -183 275 180 -161 -286
1501b86J16M01n69J17J66K91l01j32J23j09J76j32q7K14Q7nq6j69N61j23l47J27
$$ -286 -170 231 -338 -221 -55 236 -65 -197 -74 -183 -7 -139 -226 -12 75 70 -16 -185 376 253 -94 33
1523C3L74l5l11l33M51o8j28k78M00jl30j75L40L03k85j30O1k1J13j16k60L70
$$ 33 407 372 61 -272 179 111 -17 -295 105 104 -226 -401 -61 242 -43 -173 -112 -133 -20 -136 -396 -26
1545b6L00q2l61M6M54j95k87J90J05k9l71P9K47j3rm11N37M3k11j71O8J49k01
$$ -26 274 192 -169 -123 331 136 -151 39 144 115 -256 -177 70 57 48 -363 174 217 6 -165 -97 52 -149
1568a49j16J69K11j80r7J65o2M31k65k49K24J78j20l21Q0J28K87m99J26K67P3
$$ -149 -265 -96 115 -65 -162 3 -59 372 107 -142 82 260 140 -181 -101 27 314 -185 -59 208 281
1589B81k78K31m3P2l40o2P9K51m0l79K25M0J28l68J45J83k43M28o52M9L72l06
$$ 281 3 234 191 263 -77 -139 -60 191 151 -228 -3 37 165 -203 -58 125 -118 310 -342 -293 79 -227
1611b27j9o7L07L5j30J07L63j29l17J3J53K38l31j37J15K31k10M1R5J9j32Q6j36
$$ -227 -246 -313 -6 29 -101 6 369 240 -77 -64 89 327 -4 -141 -26 205 -5 36 131 150 18 104 -32
1634c2J38l3J94l42J68P8l2l99J16J22k64Q6J03J63l9K2m65O22R3m82J93K24j30
$$ -32 106 73 267 -75 93 171 139 -260 -144 -22 -286 -200 -97 66 27 49 -416 206 299 -183 10 234 104
1657A04O9j75n3K05J48j21j34J34q9o0k00K53j67j41J93k74L88j52j72L87l0Q7
$$ 104 173 -2 -55 150 298 177 43 177 88 28 -172 81 -86 -227 -34 -308 80 -72 -244 143 113 200
1679B00l74K4L46n8k65Q5K01j2j26j79N3K94l95J34K92k69K13k41M1KJ61o3j89
$$ 200 -174 -150 196 138 -127 -42 159 147 21 -158 -105 189 -206 -72 220 -49 164 -77 -36 -34 127 64 -125
1702a25L43l02J03m13L79N1k43j08j26M56j02j97k76Q24m76j13K28L00L8l17j15
$$ -125 218 -84 19 -394 -15 36 -207 -315 -441 15 -87 -284 -560 264 -212 -325 -97 203 241 -76 -191
1723a91K62J82l40K6p1L43j91k20P1M12m20K0l5J58J42k37l21L86M84n69k28L15
$$ -191 71 253 -87 -61 -132 211 20 -200 -129 283 -137 -117 -152 6 148 -89 -410 -24 460 -109 -337 -22
1745b2M06j76o79J18M63p6n13L39K21L38n06j98L52L14p0j38k56L14K88o80k6
$$ -22 384 208 -471 -353 110 34 -479 -140 81 419 -87 -285 67 381 311 173 -83 231 519 -161 -187
1766a87M19J91k15o79J76N61j64o38M69M31k95o11L22P7L97o94J65L69L9J29q64
$$ -187 232 423 208 -471 -295 266 102 -536 -67 364 69 -542 -220 -143 254 -440 -275 94 133 262 -602
1787f02Q01L02j97m32j39M00L4l27n1K56K77k45o67O15M42l68p72L05O95l4m77
$$ -602 199 501 304 -128 -267 133 167 -160 -211 45 322 77 -590 25 467 99 -673 -368 327 293 -184
1808a84q0N84l42m89n8N55K70k60n35L51M67r9m98J84M03M39q79j18O72k00k92
$$ -184 -264 320 -22 -511 -569 -14 256 -4 -539 -188 279 180 -318 -134 269 708 -171 -289 383 183 -109
1829a09m12Q97L8k52m79J87M56L9o85J54K40L86p97p4O65jj71q40O97M69j20p15
$$ -109 -521 376 414 162 -317 -130 326 365 -320 -166 74 460 -337 -411 254 253 82 -758 -61 408 288 -427
1851d27M6P65J89n03m98O49L04p43n05O54O48n53m71L0Q66j06o68j07P14L50o93
$$ -427 -381 384 573 70 -428 221 525 -218 -723 -69 579 26 -445 -415 451 345 -323 -430 284 634 -59
1872e9l44N31M57o64l68L52N35j29o92j30P73J62p30j87M42N99q17l57L68Q98
$$ -59 -403 128 585 -79 -447 -95 440 311 -381 -511 262 424 -306 -493 -51 548 -269 -626 -258 640
1892F40m57o26K24N56m1o16J92L71L25o96k09L39M12n87n67P14M53k58o15J49
$$ 640 183 -443 -219 337 296 -320 -128 243 568 -128 -337 2 414 -173 -740 -26 427 169 -446 -297
1912b97N57Q9p52N4L23N00m61r54O78P35k54p04j02Q95J20j021K83M93K72o14
$$ -297 260 349 -403 -349 -26 474 13 -941 -263 472 218 -486 -588 307 427 -594 -311 182 454 -160
1932a60k48L35M00j90n74L67O21j44q80J81N37K15o71k72N47M06n77o07O48M96
$$ -160 -408 -73 327 137 -437 -70 551 407 -473 -292 245 460 -211 -483 64 470 -107 -714 -66 430
1952D30k97r63M23R41k09p53L6O51P3n12k00O02L70n81o29M72P11k45o08J21M50
$$ 430 133 -830 -407 534 325 -428 -392 259 332 -180 -380 222 592 11 -618 -146 565 320 -288 -167 283
1973B83J41m41k63J47Q27o90m74J62O03j96n10L21O56m38m87n4P41O7l20n75N25
$$ 283 424 -17 -280 -133 694 4 -470 -308 295 99 -411 -90 566 128 -359 -413 328 395 75 -500 25
1994B5N02m92m89N28K39J10n77r0P89k52j94n78L45L24j35n90L64O59l84l75K05
$$ 25 527 35 -454 74 313 423 -154 -244 545 293 99 -479 -134 190 55 -535 -171 488 104 -271 -66
2015f6M03j11n50j31N59L58n93k81M27K37m33j72M40K02l1m08lM64L8o67O1N60
$$ -66 337 226 -324 -455 104 462 -131 -412 15 252 -181 -353 87 289 258 -150 -153 311 349 -318 -257 303
2037C03M25r56j87K50N40l11n52M55R2M25p91P4N71m1l79n98Q47J59l82l98K51
$$ 303 728 -228 -415 -165 375 64 -488 -33 59 484 -307 -233 338 297 -82 -680 167 326 -56 -454 -203
2058b03M76k07k67J33K43J86m46N9J73K59j94p04N85J78j45m49j00M44L11k96
$$ -203 273 66 -201 -68 175 361 -85 -26 147 406 212 -492 93 271 126 -323 -423 21 332 36
2078C6j88L62j88j83k81P78j25l57p4K29J01j48j91K22J89J14m77J4M02J20q6
$$ 36 -152 210 22 -161 -442 336 211 -146 -220 9 110 -38 -229 -7 182 296 -181 -167 235 355 269
2099B69m58M70J35m59l40J19L84j74j75j1K06m3k35j22O61l0m34k34L99M48j66
$$ 269 -189 281 416 -43 -383 -264 120 -54 -229 -240 -34 -77 -312 -434 227 197 -237 -471 -72 376 210
2120B10l71K70j07Ml07K3L75Nn2l15L20J31k44j66O9N37k54n38L28M38l45l62
$$ 210 -161 109 2 6 -301 -278 97 102 50 -265 55 186 -58 -224 -155 382 128 -410 -82 356 11 -351
2142c51M16R2K04m74k83L52K63l69j80K75P7R3k84O2J64j24m5R9r5L55m41k41
$$ -351 65 157 361 -113 -396 -44 219 -150 -330 -55 22 115 -169 -107 57 -67 -112 -13 -108 247 -194 -435
2164d35L86M09k01l15N9N33j50m74k88P76R9m44j95R9R0n4M2k9K17k72q1K17L2
$$ -435 -49 360 159 -156 -97 436 286 -188 -476 300 399 -45 -240 -141 -51 -105 -63 -92 125 -147 -228 -11 21
2187B1L84k78n86P54k2l91l7M06j51n05K77M0L33J4m56L45J7J12l86R5k1J35k11
$$ 21 405 127 -459 295 273 -118 -155 251 100 -405 -128 -88 245 259 -197 148 165 277 -109 -14 -35 100 -111
2210a11O5MO9l8JnK55n1m11P7L23Q0m25M5J5N06n61J2M9J19J72m65L8N91l4n40
$$ -111 -46 -42 27 -11 -10 -15 240 189 -222 -145 178 258 -167 -122 -107 399 -162 -150 -101 18 190 -275 -237 354 320 -220
2236b20O9J95J08l09r9M24N2k08j04J12J92k02q5M1J56j47k5j55J37J05n7k52
$$ -220 -151 44 152 -157 -256 168 220 12 -92 20 212 10 -75 -34 122 -25 -50 -205 -68 37 -20 -272
2258b72J03L14M8m16L03K2L2k46m9M01j54j44k83Q09j66j57l76K09O3L31o28j7
$$ -272 -169 145 193 -223 80 102 134 -112 -161 240 86 -58 -341 468 302 145 -231 -22 41 372 -256 -273
2280b73M97k19j21k5K64j04K9k12J07M45l46k67j83P09j70l08K7M60j91j33j60
$$ -273 224 5 -116 -141 123 19 48 -164 -57 388 42 -225 -408 301 131 -177 -150 310 119 -14 -174
2301a74O3J66J30m74K84J39r9m2j73L54j22k06j71O52M6l14l39K3O06m9l61K30
$$ -174 -111 55 185 -289 -5 134 35 -7 -180 174 52 -154 -325 327 373 59 -280 -257 349 300 -61 169
2323A69J09l3l43Q1P0J3k24J6O7J12L0k44P1K56k05l59L82Pmp8j48J35K35rl60
$$ 169 278 245 -98 -17 53 66 -158 -142 -75 37 67 -177 -106 150 -55 -414 -32 -25 -29 -107 -255 -120 115 106 -254
2348b54R4K59L1j96J23k43L86k72o4L21j87j47P3K93k28M9l80J09M23k25j3M4
$$ -254 -160 99 130 -66 57 -186 200 -72 -136 185 -2 -149 -76 217 -11 38 -342 -233 190 -35 -48 -4
2370dL0K13m36l0L59K1m6l37K53J16M3j30j55J98j4k89J44J00J81k76k10J77j78
$$ -4 26 239 -197 -227 132 153 107 -230 23 139 182 52 -103 95 81 -208 -64 36 217 -59 -269 -92 -270
2393b70L14Qr3k1J64k92J75MK78l20j84K46J77m1k99J56O8N8q9m5J5M1ok66L25
$$ -270 44 52 -41 -62 102 -190 -15 -11 267 -53 -237 9 186 145 -154 2 70 128 39 -6 9 50 44 -222 103
2418A03J46j16m38L95J75l61k3L1K69l09P9j7J31j5k13J65p6K26k21noJ04P3k56
$$ 103 249 133 -305 90 265 -96 -119 -88 181 -128 -49 -66 65 50 -163 2 -74 152 -69 -74 -80 24 97 -159
2442a59J66J03J53k97k35L29r8j1K11k63L67j98l6p6K17l74K54k12J95M8j24l26
$$ -159 7 110 263 -34 -269 60 -38 -49 162 -101 266 68 32 -44 173 -201 53 -159 36 84 -40 -366
2464c66J93L86j78j81R9j29M8j5P1K12J76l06O3M5j43J24k01O5M5J38j51k72K77
$$ -366 -173 213 35 -146 -47 -176 -128 -143 -72 140 316 10 73 118 -25 99 -102 -37 8 146 -5 -277 0
2487@J01j12m3j38J66k2J38Qk15K00m29J66L60k8l51K93j63J72l3n3O7j2L6J2
$$ 0 101 -11 -54 -192 -26 -48 90 98 -117 83 -346 -180 180 152 -199 94 -69 103 70 17 84 72 108 120
2511A20k66J8K01K34m66P9K38k86J70j44J19R8j40j23J87J8j69J06j0M2L02k64
$$ 120 -146 -128 73 307 -159 -80 158 -128 42 -102 17 115 -25 -148 39 57 -112 -6 -16 26 328 64
2533F4j09j80Q8J97j33R5J7m2N8J31j19j54Q2m13M57j23oK33l84O4J77j25R1j37
$$ 64 -45 -225 -137 60 -73 22 39 -3 55 186 67 -87 -5 -418 39 -84 -90 143 -241 -177 0 -125 -34 -171
2557a71K90j12l8K9n8K18m37L20q3J57k96J06k7K85k16l0R2k1J00oP7j04J1J42
$$ -171 119 7 -31 -2 -60 158 -279 41 -42 115 -181 -75 -102 183 -33 -63 29 8 108 102 179 75 86 228
2581B28j82K20l49L4j42J12j16K21K51j72j14K1j33K65l34k9n9J97j69J43L9n6
$$ 228 46 266 -83 -49 -191 -79 -195 26 277 105 -9 12 -121 144 -190 -219 -278 -81 -250 -107 -68 -124
2603a24K07J31j49k70K34J06j06K47k93k45L51k21J18k3o1K10k06OM9J46l47K88
$$ -124 83 214 65 -205 29 135 29 276 -17 -262 89 -132 -14 -37 -98 112 -94 -88 -39 107 -240 48
2625D8q2RJ94l04K61r0N7k93K79j56P5K1j5J10k26j62L02J65j40L1k50J48J71
$$ 48 -34 -25 169 -135 126 36 93 -200 79 -77 -2 19 4 114 -112 -274 28 193 53 84 -166 -18 153
2648A53m08J67L7Q1KL5J51j03l3k62K16l03L12n3P7j67J15K5k83J86K05j1k21
$$ 153 -255 -88 -51 30 32 67 218 115 82 -180 36 -267 45 -8 69 -98 17 42 -241 -55 150 139 -82
2671h2J32J06m6k89J88j9N3k00j7o7K78k30J07K01k29L09J25m92K71J20j36m1
$$ -82 50 156 110 -179 9 -10 43 -157 -174 -241 37 -193 -86 115 -114 195 320 -172 99 219 83 42
2693D2o5O8l7K55m50J04J68n2j4Kp3J75p0n0o1K07P5l14Q5J94k3m0j69o4K01k12
$$ 42 -23 45 8 263 -187 -83 85 33 19 21 -52 123 53 3 -58 149 224 -90 -5 189 166 126 -43 -107 94 -118
2719a18k1M02j06n2j59J8K5J6j33L50k26JJ91j43J54k85L21l30n2J63J64j86j67
$$ -118 -139 263 157 105 -54 -36 -11 5 -128 222 -4 -3 188 45 199 -86 235 -95 -147 16 180 -6 -173
2742a73M26j94j17N4J24q4k19N6K73r3O7j35L6o8Q9q8K8P5k2P7k31J65j98KL40
$$ -173 253 59 -58 -4 120 36 -183 -127 146 53 120 -15 21 -47 42 -46 -18 57 35 112 -119 46 -152 -150 190
2767A90r8nq4oj21m4L35k07pJ81j51K78m49L05j82J58q8j20Q6m2K00m69K61R8
$$ 190 92 87 3 -3 -124 -168 167 -40 -47 134 -17 261 -188 117 -65 93 5 -115 -29 -71 129 -340 -79 19
2791A9q8J53j0j55l1J7K18m6l3J23j05K18m24J47N8j09l3K6q5J3J0K26lm5J66
$$ 19 -69 84 74 -81 -112 -95 123 77 44 167 62 280 -144 3 61 -48 -81 -55 -140 -127 -117 109 106 61 227
2816B27p5j89R9p0O7J10j31j3j8K4o8q8J20N8o5l7K58l3j08j46K43l00K95l55
$$ 227 152 -37 62 -8 59 169 38 25 7 31 -37 -125 -5 53 -12 -49 209 176 68 -78 165 -135 160 -195
2840a95m1L48k69K25L7L7N8j9l05k1L04j50kr7R8O6K25m44n9K24J27k96K37j85
$$ -195 -236 112 -157 68 105 142 200 181 -124 -145 159 9 7 -90 8 74 299 -145 -204 20 147 -149 88 -97
2864i7j24O6M0O6Q8q1m4K03j0k14j0K21j5j40oM3J63k24j40R5l8P3L04l48kN4
$$ -97 -221 -155 -115 -49 39 -42 -86 117 107 -107 -117 104 89 -51 -57 -14 149 -75 -215 -120 -158 -85 219 -129 -131 -77
2890g7k4K80j95nL00n04L45L4l17K72m7K42k48r7jJ04j79N3r5J65O1mQ6k52L1
$$ -77 -101 179 -16 -21 279 -225 120 154 -163 109 62 304 56 -41 -42 62 -117 -64 -159 6 67 63 149 -103 -72
2915g2K83k61Q6Q4j19J83j98O7o0Jn9R0n6n6J26k17K72q9k2Q0r7J65q4K7r3P8
$$ -72 211 -50 36 120 1 184 -14 53 -7 -6 -65 25 -31 -87 39 -178 94 5 -17 63 -34 131 47 74 -19 59
2941E9n3P6r4j4J43k84k7L56p3k61q3J42O9K6J35J4k25J71R8l35K48Jj21n8j42
$$ 59 6 82 -12 -26 117 -167 -194 162 89 -172 -255 -113 -44 -18 117 131 -94 77 175 -160 88 89 -32 -90 -232
2966b32K75O3P5j64j56p2L26K35n77L54k39j30J21J79J21k93l7K05J2n5J84l59
$$ -232 43 106 181 17 -139 -211 115 350 -227 127 -112 -242 -121 58 179 -114 -151 54 66 11 195 -164
2988a64M09k98j62J62r5J10k13L20N4J5J18j73k29K35n2pj21K82j97k2k63L32
$$ -164 245 -53 -215 -53 -148 -38 -251 69 123 138 256 83 -146 89 37 30 -91 191 -6 -28 -291 41
3010D1j96J37j73K16K11l2j52M8k43K04k40j30K02K7J41j40o3J05J21L2m83N94
$$ 41 -155 -18 -191 25 236 204 52 100 -143 61 -179 -309 -107 -80 61 -79 -142 -37 84 116 -367 227
3032B27j12l32L36oO1j45l51R1j21N69o9l34m8K42k20J91N8j47o5J31k4J05P3
$$ 227 115 -217 119 113 174 29 -322 -231 -352 217 148 -186 -234 8 -212 -21 37 -110 -175 -44 -68 37 110
3055A10j66L3J42j22P9Rj06K26l47L5Q4m7j61J16Q1k00L62k63j76J04K6l8K30
$$ 110 -56 -23 119 -3 76 85 -21 205 -142 -107 -23 -70 -231 -115 -34 -234 128 -135 -311 -207 -181 -219 11
3078A1j45K96l60Q0J2L44l63K14R3k25l3L19k70qJ3o6J47m5j12J04o5N8J54k13
$$ 11 -134 162 -198 -118 -106 238 -125 89 182 -43 -76 243 -27 -35 -22 -88 59 14 -98 6 -59 -1 153 -60
3102f0J93j86K58L0o1Q5k39k12K65j36KM3m8p9K88q2p2J10q3l14N18q9J04j05
$$ -60 133 -53 205 235 174 259 20 -192 73 -63 -61 -18 -66 -145 143 61 -11 99 16 -298 220 131 235 130
3126A30r0Pj97j42J95K04l65Q4J69Nn1Q7J04l34m4M22l01J37J30j98k6J1O2K9
$$ 130 40 47 -150 -292 -97 107 -258 -174 -5 0 -51 36 140 -194 -238 184 -117 20 150 -48 -74 -63 -1 28
3150B8l0NL26o6k57j68K14j5k52P9L60k69j28J9p3K20o2RP0j38K33j26K1J95J08
$$ 28 -2 3 329 263 6 -162 52 37 -215 -136 224 -45 -173 -154 -227 -7 -69 -60 10 -128 105 -21 0 195 303
3175C03l25K19j63j28L22j43j0q3k28M22l08l4MR2j17K41j8N5l21K78l5MJ08j67
$$ 303 -22 197 34 -94 228 85 75 -8 -236 186 -122 -156 -152 -60 -177 64 46 101 -220 58 23 27 135 -32
3199c2J6n6J06O9l6k65O9J64J0J26k79J77%J8N1j51k9k8R5J16l69L11j09J52L0
$$ -32 -16 -72 34 103 67 -198 -129 35 45 171 -108 69 69 87 138 -13 -42 -70 25 141 -228 83 -26 126 156
3224A56l53K19J46n5j13M7p8K81l78K50j02n1K64l33K93k63J26m3k38L62k93J78
$$ 156 -197 22 168 113 0 47 -31 250 -128 122 20 -31 233 -100 193 -70 56 13 -225 137 -156 22
3246B2j82J22J47P8k52J60J2j93M1p2k1K05j18J20j22R6k12L9K58o8J6j52OJ56
$$ 22 -160 -38 109 187 -65 95 107 -86 -45 -117 -138 67 -51 69 -53 43 -169 -130 128 60 76 -76 -70 86
3270H6R5l29Q7J13j31L18k61L8P3j44J7J60L6j47k2o7J48j55J28j57J43J05k56
$$ 86 181 -148 -61 52 -79 239 -22 16 89 -55 -38 122 158 11 -11 -78 70 -85 43 -114 29 134 -122
3293a22jM5N3K22j43mJ03k32J9j2J58n9K03l90J35L9M4k0n7k9J40j31k8J08j74
$$ -122 -123 -78 -25 197 54 50 153 -79 -60 -72 86 27 230 -160 -25 14 58 38 -19 -48 92 -39 -67 41 -133
3318a33oK44P2L5j45q9J77k99J80j74r7M33j26j9k55J05K20r7L4k41K57k13J19
$$ -133 -139 105 177 212 67 -22 155 -144 36 -138 -235 198 72 53 -202 -97 123 26 60 -181 76 -137 -18
3341a8P7j0j31j82J39M1J44j7j63K55J4o4o1j02L3j86L72o7j8j30J62k81J84M
$$ -18 59 49 -82 -264 -125 -84 60 43 -120 135 149 85 24 -78 -45 -231 141 74 56 -74 88 -193 -9 -5
3365ep5J18l5N2j4J8l4k08J38L33k74J78k45J41M9j04j0j35J11Q2j14M0J17l10
$$ -5 -80 38 3 55 41 59 25 -183 -45 288 14 192 -53 88 137 33 23 -112 -1 81 -33 7 124 -186
3389a86K27k03L31k70Q4j2k2J63q6j78K33k61J16Q5P4J37k08j5k04L92k32O3n6
$$ -186 41 -162 169 -101 -17 -29 -51 112 26 -152 81 -180 -64 21 95 232 24 9 -195 197 -35 28 -28
3412b8L6O5j20j05J54K7j46K08k22j93L14P8L5p0R2k44L5J11k98L28l9J46j26
$$ -28 8 73 -47 -152 2 29 -117 91 -131 -324 -10 68 103 33 125 -119 -84 27 -271 57 18 164 38
3435C8n8o7M8K13j27k7q8j45L27k88%K50j57J68j79K23m30J24Q3J7J08j08K10
$$ 38 -20 -87 -39 174 47 20 -68 -213 114 -174 -174 76 -81 87 -92 131 -299 -175 -92 -75 33 -75 135
3458A35pk83J03qjK04j09M0k18L36j80j93M1R1LK32n0j58j8j71J56r1M0n5K89
$$ 135 128 -155 -52 -60 -61 143 34 74 -144 192 12 -181 -140 -49 -46 186 136 -22 -40 -211 -55 -146 -106 -161 128
3483A28j04j80N9M3k1Q4O5o8NJ7L1m6K92n09L33L31k66k05J49l60L83j32J34Q5
$$ 128 24 -156 -97 -54 -75 9 74 6 11 28 59 13 305 -204 129 460 194 -11 138 -222 161 29 163 248
3507B48k76l39N50L8l39j00L11M7k60L23q7j22L89l59j46J34k99K98J32q0j11
$$ 248 -28 -367 183 221 -118 -218 93 140 -120 203 116 -6 383 24 -122 12 -287 11 143 63 -48
3528d8M5J45l55K60l1n8q5J01M4k52K74p1j49K16j29lQ8J26J75l68K2J39l25L28
$$ -48 -3 142 -213 47 16 -42 -127 -26 18 -234 40 -31 -180 36 -93 -96 -8 118 293 -75 -53 86 -239 89
3552H9J4k35K05j54K5K5K15o1j25L5j73K74j33J0m2J7q5J99O2o9j32K04j45J97
$$ 89 103 -132 73 -81 -56 -31 184 123 -2 33 -140 134 1 11 -31 -14 -99 100 162 93 -39 165 20 217
3576B17j27q1J07L6j90j74j5K12L0q5J93j20J49k29K13j0K8j8l79J97j27K14o3
$$ 217 90 9 116 152 -38 -212 -227 -15 15 -70 123 3 152 -77 136 126 154 136 -243 -46 -173 41 -22
3599b2j43P1J90j08M7m2l88N66o1j43K12l41K32o8j11J76j1j76J27K2r4J7J07
$$ -22 -165 -94 96 -12 35 -7 -395 171 110 -33 179 -162 70 2 -109 67 56 -120 7 29 -65 -48 59
3622E9j72J94j00P4N3q2k92M48l1k54J8L59p26M35n3q9J25j03J20k77L48J31k16
$$ 59 -113 81 -19 55 108 26 -266 182 151 -103 -85 274 -452 -17 -70 -159 -34 -137 -17 -294 54 185 -31
3645c1P6p2N4k93K04PQ2j43J93J2m9p9J22k69J70L5k5m3%J19k02K61k87J00M8
$$ -31 45 -27 27 -266 -62 -55 27 -116 77 89 40 -39 83 -186 -16 19 -6 -49 -49 70 -132 129 -158 -58 -10
3670a0K03l2j29n7k06L21J1r4k03j23N18j59Ml8K44j98j41J74m3L7m2j41ml3K66
$$ -10 193 161 32 -25 -231 90 101 7 -196 -319 199 40 44 6 250 52 -89 85 42 79 37 -104 -108 -141 125
3695A25k01J19k83L21m4j05K34r9q9j69L58j06l9j01J17N8o3Q0j78n7K62j91j50
$$ 125 -76 43 -240 81 37 -68 166 67 -22 -191 167 61 22 -79 38 96 33 113 -65 -122 140 -51 -201
3718b01M77j12r4k96J12J19L9R6k28O5Q1j42J13M3j14K05l25k24O86k62l0O2J0
$$ -201 276 164 70 -226 -114 5 44 140 -88 -23 58 -84 29 72 -42 163 -162 -386 300 38 8 70 80
3741H0O4j56k2J74J01k47r8k5J23N2k07K5J90Q9m10J52J12k72L52j54L98m10J55
$$ 80 144 -12 -34 140 241 -6 -104 -129 -6 46 -161 -136 54 143 -267 -115 -3 -275 77 -77 321 -89 66
3764F6k36N14l25R9m7J29j56J13k74N0K36k06K4j56K00p1L6O2K3k47K11j37J66
$$ 66 -170 344 19 118 71 200 44 157 -117 -67 169 -37 -13 -169 31 -40 -4 58 81 -166 45 -92 74
3787G4J76k78j33Q4J01J79j38j52K13K5j54q8nO5P1nj63L05j50k7j92K27O6p7
$$ 74 250 -28 -161 -77 24 203 65 -87 126 151 -3 -91 -96 -31 40 35 -128 177 27 0 -192 35 101 24
3811B4J77j59k51N38l94j7K55n98M95Ok4N9p4j9K00l04l2q6Q4J78M0k62K43p2
$$ 24 201 42 -209 329 -65 -82 173 -425 70 76 52 111 37 18 218 -86 -118 -204 -120 58 98 -164 79 7
3835Gj49K24j18J80l11L26k25K66k54J86k08j75J01J17N3j6p1J80j32k0L45l47
$$ 7 -142 82 -36 144 -167 159 -66 200 -54 132 -76 -251 -150 -33 20 4 -67 113 -19 -39 306 -41
3857d1M0J96k61J67j54Q9k02N6J64J41k46Pl7P3J5MM3j7r8J2J15j23J46j38J4
$$ -41 -1 195 -66 101 -53 36 -166 -110 54 195 -51 -44 -81 -8 7 11 54 37 -61 -49 66 -57 89 -49 -35
3882c5Q0j64J32l9j34K98j62j06P6j46J90mJ29r2k42O0K98k7j21p1L9o2L2N1j04
$$ -35 45 -119 13 -26 -160 138 -24 -130 -54 -200 -10 -14 115 23 -219 -159 139 112 -9 -80 -41 -103 -71 -20 -124
3907a24P8NJ0j6J23l14J11L27j82N5j82Q2K01j57n5l8K08r7j0KK1L6L6p1p0p9
$$ -124 -46 -41 -31 -47 76 -238 -127 200 18 73 -109 -27 174 17 -38 -76 132 35 25 27 48 84 120 49 -21 -100
3933a00N08m28n7o3M06j11o6O9j11OK06m13J39q8k04N56k93J42N9j33O9j3n1j52
$$ -100 408 -20 -77 -140 266 155 89 158 47 53 259 -154 -15 -103 -307 249 -44 98 157 24 93 80 29 -123
3957a23k9O2k08L41Q8k05N2%J00qj70o2R5R9o7O4K2kJ42j10j49k11J16J00P5k8
$$ -123 -152 -90 -298 43 131 -74 -22 -22 78 70 -100 -162 -67 32 -35 29 51 49 191 81 -68 -279 -163 -63 12 -16
3983a6J42k25R4j03J18O8j21L3J14n8K8j56j71M48l23n6N8K8q2J18r6L4K56k04
$$ -16 126 -99 -5 -108 10 78 -43 -10 104 46 74 -82 -253 195 -128 -184 -126 -98 -180 -62 -158 -124 132 -72
4007g2o0K29k35L00j63O3L4J03k3j31N0o8q0O7Rk06J31J6K06m18L42k00J10k09
$$ -72 -132 97 -138 162 -1 62 96 199 176 45 95 27 -53 14 23 -183 -52 -36 170 -248 94 -106 4 -205
4031b05K50o9k8l1J21m0j47K73n5R5j36j53Q6o3k2L55l03K46j44k08J65R6k36
$$ -205 45 -24 -52 -83 38 -2 -149 124 69 164 28 -125 -39 -102 -124 231 -72 174 30 -178 -13 83 -153
4054a53O4J49j43P2J00J42j90J94J6k52oP7n8j04O0J53J2k80J65j05K21K4l01
$$ -153 -89 60 -83 -11 89 231 41 235 251 -1 -7 70 12 -92 -32 121 133 -147 18 -87 134 158 -143
4077a43J33k5Kl6N5K48j43j30Q2O0k16J88j04oM1Q5k5j39J11j81Q8J74k07J26
$$ -143 -10 -35 -33 -69 -14 234 91 -39 43 103 -113 75 -29 -35 6 91 66 -73 38 -143 -55 119 -88 38
4101C8k2r1J68Q4j23j32o9K01j72J05k1q7L4L5j3L41k16j60QJ10j30k34M48l55
$$ 38 16 -75 93 177 54 -78 -147 54 -118 -13 -34 -121 -87 -52 -65 276 60 -100 -92 18 -112 -346 102 -253
4125b53J71o6J3O9j17j03M31k53QP7k2N5k78o7K40J95m9o2J83k25o7K0L20l76
$$ -253 -82 -148 -135 -66 -183 -286 145 -108 -100 -23 -45 10 -268 -335 -95 100 51 -11 172 -53 -120 -100 220 -156
4149a56q9L77Pm1Kj84K06j30o9L8N4K03l81L12k99J88k45J29M1r9l7r2K47J13
$$ -156 -245 132 139 98 100 -84 122 -8 -77 -39 15 218 -163 149 -150 38 -207 -78 -37 -136 -173 -265 -18 95
4173I5q4N7j64J12R4o1n1p7J31l8j52R4M1J67n9l40J67J30j73J90J9j91L09j64
$$ 95 11 68 -96 16 110 49 -2 -79 52 14 -138 -44 -3 164 105 -235 -68 62 -111 79 98 -93 216 52
4197E2Mj39L8J16l42M01J6P7k02n9J1j15q6J31K37k88K38j37M1R8k89J89l03K67
$$ 52 56 -83 -45 71 -271 130 146 223 21 -38 -27 -142 -228 -97 140 -148 90 -47 -6 92 -197 -8 -311 -44
4221d4K03q3k51K80l62K09j1k05J96K5n2L36k15j50J55L5j79L52j23l36K40k80
$$ -44 159 76 -175 105 -257 -48 -59 -264 -68 -43 -95 241 26 -124 31 66 -113 239 116 -220 20 -260
4243b60L21r3O3k74K17M5r5J26J6j67k5L8j18J87r8R6J67j39N2mJ0r8j12l1J31
$$ -260 61 -32 31 -243 -26 19 -76 50 66 -101 -126 -88 -206 -19 -117 -21 146 7 59 55 65 -33 -145 -176 -45
4268d5J02R1l7k7j27L14k51l0O1p1j36K74J63m56K51k57K14J62l40J13J22q5Q1
$$ -45 57 148 111 84 -43 271 20 -10 51 -20 -156 118 281 -175 76 -181 33 195 -145 -32 90 5 86
4291H6j94J36j0K15j49l04K88l3o7Q0O1j73j8K0K2K24k13n8O2J02j67q8j43J07
$$ 86 -108 28 18 233 84 -220 68 35 -32 48 109 -64 -82 -62 -40 184 -29 -87 -25 77 -90 -178 -321 -214
4315b14J83Jk4J58J37l60J48jRj19j74O4K51P2k5L5Oj90KN5l8Nj00L9J01k11R5
$$ -214 -31 -30 -54 104 241 -119 29 28 37 -82 -256 -192 59 131 106 141 147 -43 -41 14 -24 -19 -119 -80 21 -190 -95
4342i5J20jk0M4k01Q9K50j65N3j97J3o0K96Rk57K45k38R4r9K15j37P8Nk78L03
$$ -95 25 24 4 48 -153 -64 186 21 74 -123 -110 -170 126 135 -122 123 -115 -21 -120 95 -42 36 41 -237 66
4367F6J9j45k07K84M0k07%J42K8J9j21J14q1J39j52k19K60K9Pj08k4M25n31K96
$$ 66 85 -60 -267 17 57 -150 -150 -8 20 39 -82 32 -49 90 -62 -281 -21 8 15 -93 -117 308 -223 73
4391G3Qk59J89j96L62l88J88M7P0L5j42K5j26J53mJ58m39R1L77k63k27J08J81
$$ 73 81 -178 11 -185 177 -211 -23 24 94 129 -13 12 -114 39 35 193 -246 -155 222 -41 -268 -160 21
4414B1l04p9M17J05J44l12N9o1qK82k78P7p9j3nR4o5K20k09k60L55J32l08K36
$$ 21 -283 -362 55 160 304 -8 51 -10 -18 264 -14 63 -16 -29 -34 60 -5 215 6 -254 101 233 -75 161
4438A61k6k09K33j74k19J22K6K16Mk48L22j7j83M6j07O1J32l54L19k1p7L6j92
$$ 161 135 -74 159 -15 -234 -112 -86 130 134 -114 208 191 8 54 -53 8 140 -214 105 84 7 43 -149
4461a49J95n1K78n14J32J74j6l0PO5K08j36k50J87l31J11K4J37j37M0J99j92J53
$$ -149 46 -5 273 -241 -109 65 49 19 26 91 299 163 -87 100 -231 -120 -96 41 -96 -56 143 -49 104
4484A04j32J06R2j4k09P4j03Q3K46n28K17K79l16O5J46j79O4J2N9r4k3K76m38
$$ 104 -28 78 170 156 -53 21 -82 1 247 -281 -64 215 -101 -36 110 -69 -5 7 66 -28 -51 225 -213
4507b13N04l09JL71l07k30J69J4J36j46k99L25P9m8P6j43K83k76j40l8J0R4Q2
$$ -213 291 -18 -17 354 47 -183 -14 0 136 -10 -309 16 95 47 123 -20 263 -13 -153 -191 -181 -87 -5
4530eJ66j65k41J38J4R5QJ14m67L36L1J67j30k32K36o2k45K09l9j2J66j61P9j01
$$ -5 161 -4 -245 -107 -93 2 10 124 -343 -7 24 191 61 -171 65 3 -242 -33 -72 -84 82 -79 0 -101
4554a01J15L0Kl23L13p5mJ51j87j87L79p5j89O7Q5k2o1J29j8NK1P6k51MR3K22
$$ -101 14 44 46 -277 36 -39 -43 108 -79 -266 113 38 -151 -84 1 -21 -82 47 29 34 55 131 -120 -116 -23 199
4580A99J66k85j60P1J80k57o6J73R0r4j13K87k29p8M02m19N4O9j32K4K05R6m12
$$ 199 365 80 -80 -9 171 -86 -152 21 111 17 -96 191 -38 -116 286 -133 -79 -10 -142 -118 87 183 -229
4603b29J05J75Q3j04r2J98k07K81j99j34L3K26j37M0K12j81P0j58k9K39j24M6
$$ -229 -124 51 134 30 -62 136 -71 210 11 -123 -90 136 -1 39 251 70 140 -18 -47 192 68 114
4625A14k88J74n2r1J21j00j04P1J41q5J50J41j86l8K77k45q4O4j84J21J18J9k
$$ 114 -174 0 -52 -143 -22 -122 -226 -155 -14 -99 51 192 6 -32 245 0 -84 -20 -204 -83 35 54 52
4648E2kk72J43J46J04N1k54L5k77K07Q3m7J21j33j3k6Q5P0pL6J02r4k59oL72j54
$$ 52 50 -222 -79 67 171 222 -32 3 -274 -67 16 -31 90 -43 -56 -82 3 73 66 102 204 110 -149 -155 217 63
4674F3o9m2j70M51k76J1j22J01m6K18k72J59K5O5k04j36O8J77J64j85j03P7J89
$$ 63 -6 -48 -218 233 -43 -32 -154 -53 -99 119 -153 6 31 96 -108 -244 -176 1 165 -20 -123 -46 143
4697A43k02m2Q8o3L04j57k49K67K6o3k62Q8K89k17K65m63N8K09k16J68J0j14K7
$$ 143 -59 -101 -13 -76 228 71 -178 89 115 52 -210 -122 167 -50 215 -248 -190 19 -197 -29 -19 -133 -106
4720a06J78Q2j46K17p5k41L59k49o6j17J81ok34K3L12J01j27k62K74n4j69K57
$$ -106 72 154 8 225 150 -91 268 19 -47 -164 17 11 -223 -200 112 213 86 -176 98 44 -125 132
4742A32k76K39j99K40k62j12L53k91j10L26j39L8K22J1j57r5K03l59L15J96k00
$$ 132 -144 95 -104 136 -126 -238 115 -176 -286 40 -99 -61 161 172 15 -80 123 -236 79 275 75
4763G5l46K07J09j09K51j25l4l0j23J54j24L25j96K4J74k45r5o9K17L4J5Q7q4
$$ 75 -271 -64 45 -64 187 62 28 -2 -125 29 -95 230 34 58 232 -13 -108 -177 40 74 89 176 92
4786I2j72J15j29j36J03K14l35J86M4j71L71k82K75N3k42k51K80J53m3j12j16
$$ 92 -80 35 -94 -230 -127 87 -248 -62 -18 -189 182 -100 175 228 -14 -265 15 168 125 13 -103
4807a03N2O4j27j41K93l47L10J04j13J81k14K0K6n0K49k94O1QK3k90K62Q7J46
$$ -103 -51 13 -114 -255 38 -309 1 105 -8 173 -41 -21 5 -45 204 -90 -29 -21 2 -288 -26 61 207
4830B07k31L0J15j06QrJ26mj26M7J29j69J2M7l82L56J27N1l74k8J13J38J7j92
$$ 207 -24 6 121 15 23 14 140 136 10 57 186 17 29 76 -306 50 177 228 -146 -174 -61 77 94 -98
4854i8L75j14j08L2r6N9J64j67j42j41J17J65J52l45j47M14p7Pk5j32J70J53j93
$$ -98 277 163 55 87 -9 50 214 47 -95 -236 -119 46 198 -147 -294 120 43 50 25 -107 63 216 23
4877B3P5j26K12j66j90L75k31m2k78K15J17K8k0j31L37j38k0r7j35K55p5J88l73
$$ 23 98 -28 184 18 -172 203 -28 -70 -348 -133 -16 12 -8 -139 198 60 40 -57 -192 63 -12 176 -197
4900a97K72J7k2p9j58L04n7o7j44J95j18o7P9j73K63R2j31J4RK46k69j83J69J52
$$ -197 75 92 70 -9 -167 137 80 13 -131 64 -54 -121 -42 -215 48 140 9 23 32 278 9 -174 -5 147
4924A47k58J91j08p1J59q8J58k38K39r2k02L87k5j67k2q6N2j95O2J79j04l6J26
$$ 147 -111 80 -28 -99 60 -28 130 -108 131 39 -163 224 199 32 10 -76 -24 -219 -157 22 -82 -118 8
4947HJ08N1k79R9p9m0O2%K73k15o2LJ97n6j02j02J62L9k09l9L95l6j04P1k09k7
$$ 8 116 167 -112 -13 -92 -132 -70 -70 203 -12 -74 -71 126 70 -32 -134 28 67 -142 -181 214 178 74 145 -64 -91
4973i1O8j89K65q9k49L21j08L7J35J49n23M15P1k44j63K01J67j33J6j76m2J89
$$ -91 -23 -212 53 -36 -285 36 -72 -35 100 249 -274 141 212 -32 -195 6 173 40 56 -120 -162 27
4995B7L5k7m4j22J35Oj95L07k75j83N40l26J6J87J0l0Lk29j23L23J22l71R4M67
$$ 27 62 35 -9 -131 4 10 -185 122 -153 -336 204 -122 -106 81 91 61 64 -165 -288 35 157 -214 -120 347
5019C47l05q6j2Q1O5J90j29k97J02J16n0l26L05r2J65n3k67M15k86K24p1K2M0
$$ 347 42 -44 -56 25 90 280 151 -146 -44 72 22 -304 1 -91 74 21 -246 169 -117 107 36 58 98
5042I8j0p3j2q2K01k36K19M5j79J51j25P7l6j12K51j69K17n7k88M8qJ2j14J94
$$ 98 88 15 3 -79 122 -114 105 150 -29 122 -3 74 38 -74 177 8 225 168 -120 -72 -80 -68 -182 12
5066A2j65J14p5R5Qj59j7J83J0N6N8J6k61J13%M4L8P6l91K42O4R8k78P4L0K18
$$ 12 -153 -39 -114 -19 -11 -170 -187 -4 6 62 120 136 -125 -12 -12 32 70 146 -245 -3 61 159 -119 -45 -15 203
5092B03k27K19j68kk98L91j83J30J6j63J35n2j01J53Rk18pJ27OM3Q0j14L1o3N1
$$ 203 -24 195 27 25 -273 118 -65 65 81 -82 53 1 -100 53 62 -156 -163 -36 -30 13 93 -21 10 -53 -2
5117bJ5nJ82j51k42J38J65j78J20k44Q7J98j83J75J8j33j38L8K13j46N4M2p2R7
$$ -2 13 8 190 39 -203 -65 100 -78 42 -202 -115 83 -100 75 93 -40 -178 -140 73 -73 -19 23 -49 48
5141D8k67J55J84k88J59Mk6J86k84q1J08L01k43K8o7Q5j48L28k69N7Pk17J63J19
$$ 48 -219 -64 120 -168 -9 -5 -31 155 -129 -210 -102 199 -44 -16 -83 2 -146 182 -87 -30 -23 -240 -77 42
5165D2m1J12k26J76k4l8K6kj35R6J77j82%J75q6P3k5k30K2L05j49q2O8j26R8K7
$$ 42 1 113 -113 63 39 1 27 25 -110 -14 163 -19 -19 156 70 143 118 -112 -90 215 66 -16 52 -74 24 51
5191E1J8j17J30j52J8J95K20k64p8j76J22Nn2r8J46k35J49J1K71k21q4p2K85k22
$$ 51 69 -48 82 -70 -52 143 363 99 21 -155 -33 -28 -80 -178 -32 -267 -118 -107 164 -57 -141 -213 72 -150
5215a50K98k76K6L7P6o8R6J50j83J82l05J67K41k35o9j22NK80j49K4J19k8j75
$$ -150 148 -128 -102 -65 11 -57 39 189 6 188 -117 50 291 56 -13 -135 -130 150 1 25 144 116 -59
5238e9n4O6j30J37j10K22J01o6l22M8L56k14N0k1L5k08K76K8k28J62k54J82J50
$$ -59 -113 -47 -177 -40 -150 72 173 107 -215 -167 189 -25 25 4 39 -169 107 135 -93 69 -185 -3 147
5261A47K6J11k05n9O7k65M0J50m1J91K15l75j22K67j27j98J33K82j88p7jJ69P1
$$ 147 173 284 79 20 87 -178 -138 12 -29 162 377 2 -120 147 20 -178 -45 237 49 -28 -29 140 211
5284B11j01k37J61l64J81J96j04l4J51J6o0j06J53q2q1J95L1q2j40L4j68J86R
$$ 211 110 -127 34 -330 -149 47 -57 -91 60 76 16 -90 63 -19 -100 95 126 44 -96 -62 -230 -44 -35
5307c5R5l48K48J45Q8l88M66q9q0J4K0j71L1K4r6J68j86O7j36K65J26k37q1L2
$$ -35 60 -288 -40 105 193 -195 271 182 102 116 136 -35 -4 20 -76 92 -94 -27 -163 102 228 -9 -90 -58
5331e8p3R4Q9L2l80K76k9K82k98J18l12M05O3k35q4L21n2j23O6j94M65m53M85
$$ -58 -131 -37 52 84 -296 -20 -49 233 -65 53 -259 146 209 -26 -110 211 159 36 102 -92 373 -80 405
5354D05n39R1j81J56O0K1J1o8q3L6K13M1k85M3P7j49J35k16P1J49K15J93o04Q9
$$ 405 -134 -43 -224 -68 -8 13 24 -44 -127 -91 122 163 -122 -79 -2 -151 -16 -232 -161 -12 203 396 -208 -119
5378a19P2L8k8M65n13J24J83j39J35m4k48K00j09n0J3Q2J9J8j81L08k66J4J21
$$ -119 -47 -9 -37 428 -85 39 222 83 218 174 -74 126 17 -33 -20 62 81 99 -82 226 -40 -26 95
5401I5o3j6k32M26m49J62j9j9K13j08n1M3J81j50j09q1K69O4k1q8N4j0q1P2j02
$$ 95 32 16 -216 210 -239 -77 -96 -115 98 -10 -61 -18 163 13 -96 -177 92 156 135 47 101 91 10 82 -20
5426b0L0J42l39j38M66j2j11j48J27q4K82r8n2PL5j47P9k86K14N4j05K25q1j41
$$ -20 10 152 -187 -325 141 129 18 -130 -3 -87 195 97 45 52 87 -60 19 -267 -53 1 -104 121 40 -101
5450a01K04q7J7k1q4K06N3l85K77j36N4L5p6O7K09j96k77O5K72j09K8l2m6J7K5
$$ -101 103 16 33 12 -72 134 187 -198 79 -57 -3 32 -44 23 232 36 -241 -176 96 -13 15 -17 -63 -46 -21
5475b1J49l1j01l2J49k57L05j92N0k17M13l56K1L4pO2q6R0k57L04l3Lm3J81m0
$$ -21 128 97 -4 -36 113 -144 161 -31 19 -198 215 -141 -120 -86 -93 -31 -117 -27 -284 20 -13 -10 -53 128 88
5500H8j36j59L8K24p7j1j90K11R3k03J62j61J73k11K56k29Pj20n4L93Pk1j31J4
$$ 88 -48 -207 -169 55 -22 -33 -223 -12 81 -122 40 -121 52 -159 97 -132 -125 -245 -299 94 101 80 -51 -37
5524c7J14J13j42kj9j25N3p7J5J78j44L7j02L2J51M8j70n9J74R0j32J34l8k07
$$ -37 77 190 48 46 27 -98 -45 -122 -107 71 -73 -36 -138 -106 45 93 -77 -136 38 128 -4 130 92 -115
5548a15j4K33j47J76p7L1m5q5J89k53Q9m3lL67n29L27j18j24L92l89J26j66K6
$$ -115 -129 104 -43 133 56 87 42 -43 146 -107 -18 -61 -64 303 -226 101 -17 -141 251 -138 -12 -178 -152
5571a52N3J72j99J10k9J33k8l1q0J53o8j25J92k36J47k61Q7J26k40K81q4J85j16
$$ -152 -99 73 -126 -16 -45 88 60 29 -51 102 34 -91 101 -135 12 -249 -162 -36 -276 5 -79 106 -10
5594a0J91k30j41J46n7l5J00L91l75q8J91j93J51r7J60l4n5j3j25K67l03K24j32
$$ -10 181 -49 -190 -44 -101 -136 -36 355 -20 -108 83 -110 41 -56 104 70 15 2 -123 144 -159 65 -67
5617f7M28l42J29k06l9j03L00j3m6m9%K22k86Nj73J73L2o5j06L69m92M12j9r9
$$ -67 361 19 148 -58 -97 -200 100 87 41 -8 -8 214 -72 -67 -240 -67 -35 -100 -206 163 -329 83 64 -35
5641c5j21J15k3J33m8j7r1J4L05l63K39Qk25J57K80m87K9K33J25k50Q0j67p3l
$$ -35 -156 -41 -64 69 21 4 -87 -73 232 -131 108 116 -109 48 328 -159 -130 103 228 -22 58 -109 -182 -185
5665a85K40l50M89j92m0J7J19r2N3k19K02j02P5p5k5J15j15P2l9K52l23J22J25
$$ -185 55 -295 194 2 -38 -21 98 6 59 -160 42 -60 15 -60 -85 30 -85 -13 -52 200 -123 -1 124
5688A24l23K98M0k13j56K02J32j32N9M8j04j4J37j2%J15l32J40l39K18p1O5p8
$$ 124 -199 99 139 -74 -230 -28 104 -28 31 79 -25 -39 98 86 86 201 -131 9 -330 -112 -183 -118 -196
5711a96K04J23j43J26k2J69l20Q7m5J03r3M2rn6K17m18J31L05j68l47K68J9j02
$$ -196 8 131 -12 114 92 261 -59 28 -17 86 -7 35 26 -30 187 -231 -100 205 37 -310 -42 -23 -125
5734a25K5j02m3J59J55r5P7j66L14k97J73r7J4J03p7k2j17K55j31j58M1L14l54
$$ -125 -100 -202 -245 -86 69 -26 51 -115 199 -98 75 -22 -8 95 18 -4 -121 134 3 -155 -114 200 -154
5757a54J01J60m19L08K94j51o1J64m33L01q2k56K73qN9k69J54l12K35O7j46J30
$$ -154 -53 107 -312 -4 290 139 78 242 -191 110 28 -228 45 37 96 -173 -19 -331 -96 -29 -175 -45
5779d5k72Q4J16NJ93L0O3k27j5P1j01K0J15q9J1J08k56K46p1l0k53M38l71O8K97
$$ -45 -317 -233 -117 -112 81 111 174 -53 -68 3 -98 -78 37 -52 -41 67 -189 57 -14 -44 -297 141 -230 -162 135
5804A35q0N2J29n78J39K24m2N8o8o9K7L7o0K68J70k27k56P4J7J88K5j96K71k16
$$ 135 55 107 236 -342 -203 21 -21 37 -31 -100 -73 -36 -96 172 342 115 -141 -67 -50 138 163 -33 238 22
5828B2o5J81j47N0m3Q7k59J03o4L2J11p4N3L1Lq0J51Jj38p9j10J29N9p8K04n5
$$ 22 -43 138 -9 41 -2 85 -174 -71 -135 -103 8 -66 -13 18 21 -59 92 93 -45 -124 -234 -105 -46 -124 80 25
5854B5M1j15J01r3M3j22J06o0l6K4M2J85j00J31n2m11L44j19J00m8K21k10k4q1
$$ 25 66 -49 52 -41 2 -120 -14 -74 -110 -86 -44 141 41 172 120 -291 53 -66 34 -14 207 -3 -27 -108
5878a08K2J94k33L39j96l1r8L97m81M48j05j56J54K2m02l0L36l38M45j97J21J7
$$ -108 -86 108 -125 214 18 -13 -111 286 -195 253 148 -8 146 168 -234 -264 72 -266 179 -18 103 120
5900A20j17l9M6j87P7K05m4J35j57M8PJ20l74Q9J50k13K62o4J10k43L63m80L4
$$ 120 3 -36 10 -177 -100 105 61 196 39 87 94 214 -160 -71 79 -134 128 64 174 -69 294 -186 -152
5923a52R6j8j40L9j05K89o7J35p3j29J20Oj15K23j18l5J97P1l00mR3L9K4j77j6
$$ -152 -56 -74 -214 -175 -280 9 -58 77 4 -125 -5 1 -114 109 -9 -44 153 224 -76 -80 13 52 76 -101 -117
5948a17M4q5J63r1l1J47p6J51k26K11j24K78j67j17m5K62l20J98k8o3j31J06R9
$$ -117 -73 -158 5 -86 -117 30 -46 105 -121 90 -34 244 77 -40 -85 177 -143 55 27 -36 -167 -61 38
5971C8rp4j01J09K12m16M5M04k13M1k5J70K7k34J47j03J17m3LJ92m16j7K15oL1
$$ 38 29 -45 -146 -37 175 -241 -196 208 -5 36 11 181 208 -26 121 18 135 92 95 287 -129 -146 69 63 94
5996I4K72o28J65L59k61j27P7K8J97k24p7P0J27j29K75k37N8J98k17j51J62N0
$$ 94 366 -262 -97 262 1 -126 -49 -21 176 -48 -125 -55 72 -57 218 -19 39 237 20 -131 31 81
6018H1j71J7o1K50j13J28j25M2j7k16K53m1J22k34N3q1Q9J52q0k78L36j78l8K4
$$ 81 -90 -73 -134 116 3 131 6 48 31 -185 68 27 149 -85 -32 -113 -24 128 48 -230 106 -72 -110 -86
6042h6K56l8j09L0mn3J55r6m2J07j47l22L04P9j66J60k46J39O3K5K5k82M96l45
$$ -86 170 132 23 53 49 -4 151 55 13 120 -27 -349 -45 34 -132 28 -218 -79 -16 9 34 -248 248 -97
6066i7J27j4j42K18O1k43L9m9j04L65k6j47j64K39o2P2l03J18J85j82K25q9R3
$$ -97 30 16 -126 92 153 -90 -51 -100 -204 161 135 -12 -176 63 1 73 -230 -112 73 -109 116 27 120
6089A20M7k38R3Q2j67J30K8J96l85K79m92J21O3m8J45M4J43q0j91K56j45P9O9
$$ 120 167 -71 22 104 -63 67 95 291 -94 185 -307 -186 -123 -171 -26 18 161 81 -110 146 1 80 149
6112A49k47L12n6l35K52k55K51j31L7J02k21J50Q7p4J14l5j42k06K71l6j80K32
$$ 149 -98 214 158 -177 75 -180 71 -60 -23 79 -142 8 95 21 135 100 -42 -248 23 -13 -193 39
6134C9K03k31L32m54m5L00j17M2q3p0o6J96r7Q4k35K70m5J50o6j6j99O5j01K39
$$ 39 242 11 343 -111 -156 144 27 69 -14 -84 -150 46 -51 33 -202 68 23 173 107 91 -108 -43 -144 95
6158I5k3j84Q8J3Qj6j02K76o4R5j77KJ52l71K20o0M1J32k27M51j77k64O7K95j06
$$ 95 72 -112 -24 -11 -3 -19 -121 155 91 186 9 11 163 -208 12 -48 -7 125 -102 349 172 -92 -25 270 164
6183A64r8KK1l16L38r4j78R3j48J82k4M3J19k10K00n4jL03m57R8P5j40m8R1K91
$$ 164 66 68 89 -227 111 17 -161 -68 -216 -34 -58 -15 104 -106 94 40 39 342 -115 -17 58 -82 -130 -39 252
6208B52k04k3R9l01J41P8j6L1j60K04k25J10o4J3k12m3L34P0n1J23l34J38o0J17
$$ 252 48 25 124 -177 -36 42 26 57 -103 101 -124 -14 -78 -65 -277 -320 14 84 33 156 -178 -40 -100 17
6232A7J4j02K63k98n1N8J25l7L4mr6J51q5j28K98k74L70k96Pj34J55L9j32L57
$$ 17 31 -71 192 -106 -157 -99 26 -11 23 19 -77 74 -11 -139 159 -115 255 -41 -34 -168 -13 26 -106 251
6256B51m67J09K59p4j61Q5J06nj49J75j80m6J07r9M67m72P3p5J43J43l76J21j4
$$ 251 -216 -107 152 78 -83 2 108 103 -46 129 -51 -97 10 -89 378 -94 -21 -96 47 190 -186 -65 -79
6279g9J0JJ77j25pk38J47R3j47L02%j31P4Oj87M27m60J80q3J47j01O1j92K79P4
$$ -79 -69 -68 109 -16 -23 -261 -114 -21 -168 134 134 3 77 83 -104 323 -137 43 -40 107 6 67 -125 154 228
$$ [...]
8191c2
##END NTUPLES=NMR FID
##END=
