##TITLE=1H_SR133_k
 CDCl3+DMSO
 8 sc, 
 25.08.2022
##JCAMPDX= 6.0         $$ Bruker NMR JCAMP-DX V2.0
##DATA TYPE= NMR FID
##DATA CLASS= NTUPLES
##ORIGIN= UXNMR, Bruker Analytische Messtechnik GmbH
##OWNER= root
$$ XWIN-NMR		Version 3.5
$$ Thu Aug 25 14:48:28 2022 Russian Standard Time (UT+4h)  she@DPX200
##.OBSERVE FREQUENCY= 200.1313499994
##.OBSERVE NUCLEUS= ^1H
##.DELAY= (6, 6)
##.ACQUISITION MODE= SIMULTANEOUS
##.ACQUISITION SCHEME= undefined
##.AVERAGES= 8
##.DIGITISER RES= 18
##SPECTROMETER/DATA SYSTEM= spect
##.PULSE SEQUENCE= zg30
##.SOLVENT NAME= DMSO
##.SHIFT REFERENCE= (INTERNAL, DMSO, 0, 15.7039)
##AUDIT TRAIL= $$ (NUMBER, WHEN, WHO, WHERE, WHAT)
$$ ##TITLE= Audit trail, XWIN-NMR		Version 3.5
$$ ##JCAMPDX= 5.01
$$ ##ORIGIN= Bruker BioSpin GmbH
$$ ##OWNER= she
$$ F:/spectra/data/she/nmr/H-F/1/audita.txt
$$ ##AUDIT TRAIL=  $$ (NUMBER, WHEN, WHO, WHERE, WHAT)
(   1,<2022-08-25 14:47:36.98 +0400>,<she>,<DPX200>,
      <created by zg, POWCHK disabled, PULCHK disabled
       configuration hash MD5:
       00 E9 B6 7A A2 85 ED C7 34 08 36 98 17 FE 4E 26
       data hash MD5: 16K
       F2 29 C2 47 DB 0A 63 B9 3A 98 16 7E B7 90 B7 33>)
$$ ##END=
$$ 
$$ hash MD5
$$ 6B 90 B8 91 7B 8B C5 C7 ED 57 D3 C2 B3 D1 84 1E
##$RELAX= 
##$RELAX= 
##$RELAX= 
##$RELAX= 
##$RELAX= 
##$RELAX= 
$$ Bruker specific parameters
$$ --------------------------
##$DU= <F:/spectra>
##$EXPNO= 1
##$NAME= <H-F>
##$PROCNO= 1
##$TYPE= <nmr>
##$USER= <she>
##$AMP= (0..31)
100 100 100 100 100 100 100 100 100 100 100 100 100 100 100 100 100 100 
100 100 100 100 100 100 100 100 100 100 100 100 100 100 
##$AQSEQ= 0
##$AQ_mod= 1
##$AUNM= <au_zg>
##$AUTOPOS= <>
##$BF1= 200.13
##$BF2= 200.13
##$BF3= 200.13
##$BF4= 200.13
##$BF5= 200.13
##$BF6= 200.13
##$BF7= 200.13
##$BF8= 200.13
##$BYTORDA= 1
##$CFDGTYP= 0
##$CFRGTYP= 5
##$CHEMSTR= <none>
##$CNST= (0..31)
1 1 145 1 1 1 1 1 1 1 1 1 1 1 1 1 1 1 1 1 1 1 1 1 1 1 1 1 1 1 1 1 
##$CPDPRG= <>
##$CPDPRG1= <>
##$CPDPRG2= <>
##$CPDPRG3= <>
##$CPDPRG4= <mlev>
##$CPDPRG5= <mlev>
##$CPDPRG6= <mlev>
##$CPDPRG7= <mlev>
##$CPDPRG8= <mlev>
##$CPDPRGB= <>
##$CPDPRGT= <>
##$D= (0..31)
0 1.2 0 0 0 0 0 0 0 0.06 0 0.03 0 0 0 0 0.0002 0 0 0 0 0 0 0 0 0 0 0 0 
0 0 0 
##$DATE= 1661424456
##$DBL= (0..7)
120 120 120 120 120 120 120 120 
##$DBP= (0..7)
150 150 150 150 150 150 150 150 
##$DBP07= 0
##$DBPNAM0= <>
##$DBPNAM1= <>
##$DBPNAM2= <>
##$DBPNAM3= <>
##$DBPNAM4= <>
##$DBPNAM5= <>
##$DBPNAM6= <>
##$DBPNAM7= <>
##$DBPOAL= (0..7)
0.5 0.5 0.5 0.5 0.5 0.5 0.5 0.5 
##$DBPOFFS= (0..7)
0 0 0 0 0 0 0 0 
##$DE= 6
##$DECBNUC= <off>
##$DECIM= 32
##$DECNUC= <off>
##$DECSTAT= 4
##$DIGMOD= 1
##$DIGTYP= 9
##$DL= (0..7)
0 120 120 120 120 120 120 120 
##$DP= (0..7)
150 150 150 150 150 150 150 150 
##$DP07= 0
##$DPNAME0= <>
##$DPNAME1= <>
##$DPNAME2= <>
##$DPNAME3= <>
##$DPNAME4= <>
##$DPNAME5= <>
##$DPNAME6= <>
##$DPNAME7= <>
##$DPOAL= (0..7)
0.5 0.5 0.5 0.5 0.5 0.5 0.5 0.5 
##$DPOFFS= (0..7)
0 0 0 0 0 0 0 0 
##$DQDMODE= 0
##$DR= 18
##$DS= 0
##$DSLIST= <SSSSSSSSSSSSSSS>
$$ [...]
##$SUBNAM2= <"">
##$SUBNAM3= <"">
##$SUBNAM4= <"">
##$SUBNAM5= <"">
##$SUBNAM6= <"">
##$SUBNAM7= <"">
##$SUBNAM8= <"">
##$SUBNAM9= <"">
##$SW= 18.0517283424941
##$SWIBOX= (0..15)
0 0 2 0 0 0 0 0 0 0 0 0 0 0 0 0 
##$SW_h= 3612.71676300578
##$TD= 16384
##$TD0= 1
##$TE= 0
##$TE2= 300
##$TE3= 300
##$TEG= 300
##$TL= (0..7)
0 120 120 120 120 120 120 120 
##$TP= (0..7)
150 150 150 150 150 150 150 150 
##$TP07= 0
##$TPNAME0= <>
##$TPNAME1= <>
##$TPNAME2= <>
##$TPNAME3= <>
##$TPNAME4= <>
##$TPNAME5= <>
##$TPNAME6= <>
##$TPNAME7= <>
##$TPOAL= (0..7)
0.5 0.5 0.5 0.5 0.5 0.5 0.5 0.5 
##$TPOFFS= (0..7)
0 0 0 0 0 0 0 0 
##$TUNHIN= 0
##$TUNHOUT= 0
##$TUNXOUT= 0
##$USERA1= <user>
##$USERA2= <user>
##$USERA3= <user>
##$USERA4= <user>
##$USERA5= <user>
##$V9= 5
##$VALIST= <valist>
##$VCLIST= <CCCCCCCCCCCCCCC>
##$VD= 0
##$VDLIST= <DDDDDDDDDDDDDDD>
##$VPLIST= <PPPPPPPPPPPPPPP>
##$VTLIST= <TTTTTTTTTTTTTTT>
##$WBST= 1024
##$WBSW= 4
##$XGAIN= (0..3)
0 0 0 0 
##$XL= 0
##$YL= 0
##$YMAX_a= 192778
##$YMIN_a= -241888
##$ZGOPTNS= <>
##$ZL1= 120
##$ZL2= 120
##$ZL3= 120
##$ZL4= 120
##$ABSF1= 10
##$ABSF2= 0
##$ABSG= 5
##$ABSL= 3
##$ALPHA= 0
##$AQORDER= 0
##$ASSFAC= 0
##$ASSFACI= 0
##$ASSFACX= 0
##$ASSWID= 0
##$AUNMP= <proc_1d>
##$AZFE= 0.1
##$AZFW= 0.1
##$BCFW= 1
##$BC_mod= 2
##$BYTORDP= 1
##$COROFFS= 0
##$CY= 11.3945322036743
##$DATMOD= 1
##$DC= 2
##$DFILT= <>
##$DTYPP= 0
##$F1P= 2.36226072786647
##$F2P= -0.459571619588291
##$FCOR= 0.5
##$FTSIZE= 0
##$FT_mod= 4
##$GAMMA= 1
##$GB= 0.15
##$INTBC= 1
##$INTSCL= 1
##$ISEN= 128
##$LB= 0.24
##$LEV0= 0
##$LPBIN= 0
##$MAXI= 10000
##$MC2= 0
##$MEAN= 0
##$ME_mod= 0
##$MI= 1.114404
##$NCOEF= 0
##$NC_proc= 0
##$NLEV= 6
##$NOISF1= 3.799351
##$NOISF2= 2.8
##$NSP= 1
##$NTH_PI= 0
##$NZP= 0
##$OFFSET= 15.70392
##$PC= 1
##$PHC0= -18039.61
##$PHC1= 14.20069
##$PH_mod= 1
##$PKNL= yes
##$PPARMOD= 0
##$PSCAL= 0
##$PSIGN= 0
##$REVERSE= no
##$SF= 200.130013532006
##$SI= 16384
##$SIGF1= 3
##$SIGF2= 2
##$SINO= 400
##$SIOLD= 16384
##$SREGLST= <1H.CDCl3>
##$SSB= 0
##$STSI= 0
##$STSR= 0
##$SW_p= 3612.71676300578
##$SYMM= 0
##$S_DEV= 0
##$TDeff= 0
##$TDoff= 0
##$TI= <>
##$TILT= no
##$TM1= 0
##$TM2= 0
##$TOPLEV= 0
##$USERP1= <user>
##$USERP2= <user>
##$USERP3= <user>
##$USERP4= <user>
##$USERP5= <user>
##$WDW= 1
##$XDIM= 8192
##$YMAX_p= 0
##$YMIN_p= 0
$$ End of Bruker specific parameters
$$ ---------------------------------
##NTUPLES= NMR FID
##VAR_NAME=  TIME,          FID/REAL,        FID/IMAG
##SYMBOL=    X,             R,               I
##VAR_TYPE=  INDEPENDENT,   DEPENDENT,       DEPENDENT
##VAR_FORM=  AFFN,          ASDF,            ASDF
##VAR_DIM=   8192,          8192,            8192
##UNITS=     SECONDS,       ARBITRARY UNITS, ARBITRARY UNITS
##FACTOR=    0.0002768,     1,               1
##FIRST=     0,             0,               0
##LAST=      2.2672688,     0,               0
##MIN=       0,             -241888,         0
##MAX=       2.2672688,     192778,          0
$$ Real data points
##PAGE= N=1
##DATA TABLE= (X++(R..R)), XYDATA
$$ [...]
1787e30M47j58l6L73k45l03L81J91J08q9L8j90N56k0n18mK58n16O96k93m83M7
1809b90O8J35L11q2o39J26N07J65k2j6n28LM32M1k67M17o27J46N46j12l95K64
1831A83l76m2N72j6n37JJ06K97k4P2o14J36K52Q0l9J81j58j15K63P8k65ml51K63
1855e7L08l15J86k87k82L05K39l76K10p5o0J45J66L2r6J4J04R1J98j41j20j57
1877C2O8l04K07M7n25N32k59j6J96j9l79K54L35l54L8L13k54N83j04m32l01N80
1899B38m6k19L3j46j92L81M8K7K75n58k55P97j66l64RN5k7M75j1l42K7k57RK05
1923dK80m58J51k66K73M21j79n10O3L31k45M15j31l18K7J86p0L41j70n58L23L21
1945B23j16q9R0l28K64L84q0m97PL11k25K18j06o35L37K23m37N20K47m42j53P44
$$ y = [-530, -83, -241, -277, 96, -149, -452, -71, 120, 228, 139, 177, -13, 543, 523, 5, 1, 259, -257, 439, 146, -337, -290, -222, -87, 224, 142, -497, -371, 136, 301, 279, 263, -265, -262, 170, 211, -56, 361, -266, -120, 426, 314, -81, 183, -193, -235, 337, 321, -216, -215, -109, 188, 164, 236, -378, -242, 10, 90, 51, 232, 74, -41, 222, 300, 35, 31, -320, -57, 251, -64, 122, -165, -447, -142, 97, -279, -69, -144, -204, -59, 107, 139, 43, 57, 161, 252, 450, 309, 189, 32, 100, -204, 3, 50, -475, 57, -202, -218, -22, -41, -420, -166, 169, -185, -147, 166, -88, 495, 391, -41, -342, 238, 192, -27, 6, -140, -332, 49, 97, 124, 399, -159, -414, 383, 217, -147, -138, -83, -110, 365, 354, 12, 39, -218, -209, -4, 276, -182, -31, -297, -24, 397, 218, -292, -229, 102, -143, 272, 141, -177, -150, 36, -34, 307, 137, -421, -98, 223, 107, 18, 108, -220, 44, 428, 348, -149, -142, 169, -56, 162, 56, -579, -242, -19, -456, 64, 311, -131, -284, 460]
1967D60n06RK36k76n8O13j17n65L18O5n16P70k55k10j1J01l45K31M34o72n5N43
1989A94j34k56P8J98l47K17N68o59j68M17n70N30L30k96o33N95o1k08M60O2n86
2010b69J71M78k69o78P34m02n02P17O20p91K21J84p34O43N92q87m62R80k53j11
2030a8N11q1j220N11Q05n64j2J30q55N40Q43p14l44J99K90k90N02r7o77J9Q95
2051C73j75q9L77p44l05J107j83n15j56K88l65K93L72l12n41P16R6n4J62n96j05
2072c56P24L25q56j2J43l79N93M71j005j5M27J3j75N23m75n79Q52J39k79L13n43
2093a51k09N39P67r21l55J28k19P0N77k41o80L35N21j23J16j17n53N1R64j07p12
2114c20K30M40n02L50N20j058m3P11k74l55M76j36n72R06L5q98K86P36q13j4P80
$$ y = [460, -46, -37, 199, -77, -135, 478, 361, -204, 114, 179, -337, 433, 178, -32, -43, 58, -287, -56, 378, -294, -349, 194, 60, -196, -118, 80, -267, -50, 518, -141, -309, 108, -462, 68, 398, 102, -531, 64, 3, -205, 255, 317, -269, -98, 380, 111, -567, 167, -235, -737, -20, 600, -191, 30, 214, -520, 123, 715, -172, -634, 346, 93, -18, 493, 412, -808, -297, 508, -56, -68, 62, -793, -253, 590, -124, -468, -269, 21, -269, 233, 136, -541, -522, 373, 198, 109, 486, -258, -563, 544, 361, -154, -310, -22, -387, -94, 278, -34, -575, 141, 237, 183, 345, -251, -356, 368, 693, -163, -175, -32, -411, 182, 653, -352, -367, 60, 73, -102, 421, -54, -633, 219, 358, 79, 392, -151, -360, 179, 946, 25, -330, -202, -421, -351, 226, -15, -695, -360, 161, 38, 154, 37, -516, -465, 499, 392, -320, -90, 350, -152, 198, 718, -340, -383, 328, 54, -301, 175, 39, -533, 373, 408, -490, -204, 532, -281, -295, 485]
2135D85o08l02P84Q7o72M96k16o01P29J93q00K51M90o71J66Q64r09l06Q71j79
2155A52k64P6j24l81O12J76m34j91P73k60lM7k19k27N52M6k49j70K52nl07K46
2177I8m6n95K38O41l26m37K43O0q7P67m07l40J39M36l58K26K3n49O0M24j85j52
2199a27J35n53R6Q53l06l90J29K85Q1J86k47o54M26M21n23N36l77k39M12Q0n2
2220A72k49l0j58K49J46L3k51l94N58J98j69j28k17oR5L04%l91k4J15M6N41n31
2243i1m00N14M30l52j72M18p06m8R99l85p45N82l04l25P84L9r72M15O04l83L30
2264B32R7n14j14Q98p74J19K84k15m54O74k96k41L42j95J08J78P9m58M49Mj90
2285A3R9K32p15M42J39m59K03K65l58J74ll32L11p0O8J70rj40j86O44o37K91J67
$$ y = [485, -123, -425, 359, 446, -226, 270, 54, -547, 182, 375, -425, -174, 316, -355, -189, 675, -234, -540, 331, 152, -112, -36, -160, -541, 71, 247, -187, -378, 395, 135, 132, 179, -40, -267, 285, 331, 82, -88, 164, 159, -148, 98, 52, -543, -305, 336, 10, -427, -184, -124, -211, 556, 149, -191, -52, 384, 26, 252, 275, -274, -214, 210, 25, -127, 8, -545, -449, 404, 98, -292, -163, 122, 203, 389, 142, -512, -86, 335, -188, 348, -29, -268, 144, 224, 172, -77, -107, -265, -16, 130, 163, -88, -482, 76, 274, 105, -23, -240, -246, -151, 153, 153, -238, -262, -147, -101, 440, -91, -491, 23, 453, 101, -71, 347, -359, -407, 592, 207, -538, 44, -260, -585, 199, 238, -734, -319, 285, -98, 232, 329, -185, -299, 599, -175, -56, 228, 13, -441, 233, -63, -304, 38, -157, -49, 129, 208, -250, 199, 203, 13, 112, 344, -371, 71, 210, -249, -46, 219, -139, 35, 32, -300, 11, -59, 9, 179, 170, 30, -156, 488, -149, 142, 309]
2308C09m88q9N25o16j4N55k51j81M31J21m57O22m51k06O48m0m82j03M04l42q3
2329a88K84m24K36O5l44K29M04k55l12O62k38j06P6j58j56M36j92k16M26q5l31
2350a87j0Q8K10j45J37k13R6L26l31J7Q1k10j18M9k7K82K89n21j75M49p2K49l95
2373a31j93J18K84Q8j34k2q7K19p8o6P5pl02n6M53J7l45J97n1k47M80r0l16L21
2397A27k22j2L33J15n51N42m12j57K32J43m28p4K58p6J00N34n97q4K93q8O6J10
2419A52j04l33N60k76o6L02q8l01K08J05k25K04J94m10K09r3j52J60m6n1K32q7
2441I4n28L60N07k84l78N6J03j27O85p50L03K08j80l2L11m80k66O31k56j01J79
2462E5l60o9P98j29m05j52M43m57L53L24o51p3N12j87m3M94j62n06N70j23n02
$$ y = [309, -179, -268, 257, -359, -373, 182, -69, -250, 181, 302, -155, 467, 16, -190, 458, 418, -64, -167, 237, -105, -188, 96, -328, -92, -27, -371, -142, 262, 7, -305, 357, 119, 13, 89, -69, -225, 211, 19, -197, 229, 144, -187, -197, -109, 101, -44, 93, -120, -24, 302, -29, -12, 69, -141, -259, -210, -237, 45, 334, -187, -362, 87, 15, 264, -131, -324, -206, 78, 166, 32, 10, -77, 142, 64, -2, 73, 66, -236, -292, 161, 178, -167, 30, -21, -268, 212, 122, -194, 127, -95, -107, 226, 341, -210, 332, -80, -237, -5, 138, -290, -364, -106, -182, -82, 452, -145, -229, 64, -24, 42, 152, 48, -285, 275, -1, -67, 235, 147, -154, 54, 159, -66, 138, 332, -78, 131, 38, -114, 46, 0, -51, 181, 94, -434, -74, 433, 149, -229, -173, -70, -197, 488, -262, 41, 249, 69, 37, 348, -132, -398, 233, -23, -124, 55, -305, -374, 424, 295, -110, -262, 181, -276, 77, 401, -250, -323, 189, 2, -41, 453, 291, -215, 355, 232, -270]
2483b70K35K3j35m8L66r5j78K99k16l87N52j20M4o3L6k21M91j75k93M7J99k85
2505a94J64M5k99J33K35kk73L39k27j88K29J25k89J50J57j70r2J48K47r3rK08
2527C44l35j57M23k62n0J60lj45K01j70j31j29L92l44n3M39l59J50K80l88j5K24
2549G2M0k51M35k8m78L51K65n25K94J32m47J05K93j06k48J46k85o1M51J18m95
2570b22l03O73J24k99K08k69j88L72J77k00l46L56k48J67M26l82n74N55L45l76
2590dJ72j79n18M31N46l90m55M26k65K26M05j46q01N47P6k67M23r0p92M44L98
2611A87k93k08L79k61ON86k45m25j14M95l4O3L1k44n37O16O15o31j46Nl16Q08
2633C37J07l53j39N2M7M8K35n13n9L68k09Q7J41l05k13K73L15m30j74O03P5j15
$$ y = [-270, -35, -12, -147, -195, 171, 76, -102, 197, -19, -406, 146, 26, 70, 7, 43, -178, 313, 138, -155, -108, 91, -194, -30, 15, -284, -151, 84, 82, -191, 148, -79, -267, -38, 87, -202, -52, 105, -65, -157, -9, 238, 145, 136, 344, 9, -148, 275, 13, -37, 123, 120, -25, 176, 6, -125, -254, 138, -206, -259, 180, -179, -29, 251, -137, -152, 72, 112, -139, 296, 268, -210, 141, 406, -119, 175, 307, -140, -35, 258, 152, -96, 50, -235, -296, 155, 273, -222, -525, 148, 272, -27, 181, -88, -276, 96, 273, 73, -273, 83, -165, 2, 428, 46, -528, 27, 372, -4, 168, -11, -529, -98, 448, 58, -397, 29, -236, -10, 395, 249, -552, -5, 71, -196, 227, 137, -655, -211, 187, -106, -314, 65, -196, -190, 396, 151, -274, -388, 107, 73, 136, 167, -77, -614, 2, 617, -14, -160, -155, -471, 337, 444, 91, -48, 4, 51, 99, 334, -179, -238, 130, -79, 8, 149, -156, -369, -96, 219, -211, -385, 218, 293, 178]
2655A78J34l01j30R7m4K24J90o86Q4K31K83Q4k96n7J33Oj25l2J67j50L3L24l41
2678Fk41L6K46rQ8k65j34M27k81L5L16k61j36N80j76l25MK46j32K3K01l94J77
2701C1O9k74m5P13o77j50N68l87j74J87K37k9o6K07m51L05J26k64n7m6p9Q0K66
2724I0J64m22o6J4L64j70J74N9n20O19q8l36J34k68K22J15J06k76j52P7L71k76
2746f5K75j39l44L74L14k34m59N25m67J58N00n83l02M19k36k1N17l03j50J86L51
2767C16m32L91j4n24L3M57J00n37N02o51L39K92m61r7K01K86j94J97j5l08%K45
2789A26m8J5k76L2L26J74k18k08J75m4J68j56j26J42k28J42N5l58K7J76J66m18
2811c56O29k27n42K78N66m89o5L41j67k62M49J10p42M20J4k38L80l16J4K45J60
$$ y = [178, 312, 11, -119, -22, -66, 158, 348, -338, -254, -23, 260, 344, 48, -9, 124, 130, 5, -27, 140, -10, 23, 347, 6, -235, -199, 47, 38, 126, -139, -273, 154, -127, -92, 224, -37, -173, 407, 231, -94, -90, 156, 24, 47, 248, -146, 31, 100, -174, -219, 494, -183, -333, 235, -152, -326, -139, 98, 69, 3, 210, -241, 64, 190, -74, -131, -177, -256, -176, 90, 254, -168, -234, -220, 144, -26, 148, 207, -313, 306, 218, -118, 16, -252, -30, 85, 191, -85, -237, -160, 211, -65, 210, 71, -273, 101, 415, 181, -278, 247, -220, -62, 438, -145, -447, -28, -264, -285, 232, -71, -221, -35, 316, -116, 275, 261, -263, -230, 227, 327, -210, 292, -359, -20, 272, -189, -286, -85, 201, 7, 204, 189, -119, -119, 126, 78, 93, -183, -151, 175, 349, 131, -77, 98, 54, 222, 66, -60, 82, -146, -4, 51, -307, -280, -104, 62, -356, 273, 46, -496, -218, 348, -141, -206, 135, -32, -294, 155, 265, -477, -57, -43, -281, 99, -217, -203, 42, 202]
2832B02m50L94l3m01L12K8k64M1M64m02j15L51l87J73K95q9k28L04j00m65M41
2853G1j0kM6j95r7m3M0L39j87q3k7o8L09Q6Q0j33k19N8M4j9j5O7j28K39p3N5j85
2880e0J29k02J68J58k45j19J64j49r9J78K25m52L01j38N77m83r2J03J53m7k65
2901a85L86l07J35J23k78l1K36k10J6L55j1k56J34r7l10M17J08j30nL0j21q2R5
2924A2l42M77j21J52k52J14l70J12r1O3J62K52k15j95N54m23j46K08J26q9J40
2945A28J19j13j56R1J72j48o2j69K37K43l34j1k9j19L01m8k27K13J52k94m1K30
2967A35j71j51K84l34j4J67J34l11K68j6j68J6J38j18J92J8j35j0L87l50J28K36
2989C25l72m7J93k90Q5K6P8j97K76j6r8J68j65L3m0L71m96J63j57J67n0J09J24
$$ y = [202, -248, 146, 113, -288, 24, 52, -212, -171, 293, -109, -224, 127, -260, -87, 208, 119, -109, 195, 95, -370, 71, 61, 59, 105, -90, -187, -230, -190, 149, -38, -121, -148, -216, 93, 179, 259, 126, -93, -35, 9, -10, -25, 42, -86, 153, 80, 135, -50, 79, -123, 45, 203, -42, -161, 3, -146, -245, -67, 158, -294, 7, -131, 446, -37, -129, -26, 127, 80, -185, 201, -106, 29, 152, -126, -157, 79, -131, -115, 240, 229, -27, 107, 10, -300, 117, 225, 95, 90, 120, -1, -83, 12, -330, 147, 26, 178, -74, 40, -330, -218, -309, -246, -84, 168, -47, -242, 312, -111, -257, -49, 77, -12, 128, 247, 134, -22, 69, 241, 93, 31, -138, 99, 342, 8, -3, -32, -151, 150, 102, -125, 88, 240, -54, -95, 135, -36, -187, 97, -237, -251, -84, 50, -261, 7, -9, -177, -161, -23, -141, 51, 69, -66, -76, 311, -39, 89, 325, -47, -94, 99, -191, -106, -80, -2, -199, 77, 61, -37, 131, -34, -1, -41, 330, -166, -3, -160, 7, -43, 66, 190]
3012A90k27q3N7J42K5j71PnK65Q4l19n6K92j45j45N8Q2L6N7J25o43K48J52k86
3036b60Q7M4l3j09K44J47k12J39J24l46J36L48j91j15J00m3p9R9k35M8L08j40
3058F1k52K86k4o2K5K62k64k90K86K22n86K43J04j92J66L4k7j42K00rJ04j68M9
3081B6k06L58pk34j52J55m5J86k8M0k5j51N4k6j92L8j43L39J34k47K07O7k66J21
3105CK87m6n14L78J0m3J9o4l15L77J32J13l79J30l19O9J35M2j37J30M6M2m9K0
3129F7j83k10M68L6l35J8J98j34m4L86n75L76O8m5L1N8j20j39K92O7j76q6j71
3152a53Q0K15j0j35m43M74j14R4K54k48M4J54k42J9q6J54n1j3K15k86k35J57J06
3175e0J9J9P9k47K07O8Oj89J95q9L0l4J53k05j55K10K2j36L14j60o6M8L14l08
$$ y = [190, -37, -120, -63, 79, 104, -67, -60, -65, 200, 284, -35, -91, 201, 56, -89, -31, 51, 87, 144, 269, -374, -126, 26, -260, -173, -129, -162, -271, -27, 120, -92, 47, 171, -175, -39, 309, 118, 3, 103, 60, -19, 80, -155, -107, 201, 61, -191, 95, 71, 9, 34, 296, 32, -258, 28, 250, -336, -93, 11, -181, -15, 19, -8, -150, 50, 41, 145, -23, 26, -180, 178, 171, -63, -215, -60, -105, 81, 53, 93, 68, -83, -29, -55, -247, -209, -352, -13, 121, -126, 81, 148, -118, 3, 290, 244, -270, 108, 118, 75, 94, 30, -285, 92, 224, 337, -42, 88, -231, -162, -27, 15, -122, 8, 54, 96, 47, 67, -116, -326, 142, 178, -157, -139, 59, -75, -119, 267, -308, 68, 136, 91, 122, 180, 60, -79, 213, 280, 104, 18, -153, -73, 142, 132, -3, -446, 28, -86, 8, 262, 14, 58, 212, -30, -11, -97, 57, 6, -7, 208, -78, -313, -156, -50, -31, -12, 67, -180, 27, 95, 101, -88, 107, 18, 48, 14, 167, -38, -193, 17, 39, -97, 217, 57, -9, 39, 353, 45]
3199D5p4l7q3J16M74o04L83J81m42P8L28k29k71J23J74l06J74P8l9J45J35k96
3221E3k0L8k81J31N4k2K8L04j85k7j71J99r3l28M51j31k04K33J74k41L1k4O6J94
3245B29q9p6j08j03K0J7K72l19k67P38k3m96K03R2k34L6K92k09K95l54J43k38
3267a79L48j22k20N00j15m1m8j67q7M7O2n0k85K40O4NL41k90Mj96kK06j74M43
3291B84l50mL03j39NK9rQ2j82J45j05q0l47M61k25K86j76j45J13K80l80J74J11
3314A31Nk62L0L0j16J16j18K25M0KN9j72K1m8k61L02K9p5L48k36k34L30j58j60
3338a72Q7K5j2j58L09q7l2K83k22R3l2m9n4J10j60k28M91n5l67K99k65K24l9K6
3362A5kJ77o0l05J80k63K04l28M32j03J61j21j56P1J4K73j98J73l00K53j14J14
$$ y = [45, -29, -66, -149, -33, 441, -163, 220, 401, -41, 37, 365, 136, -135, -12, 162, -144, 30, 108, 69, 214, 349, 53, 33, 71, -210, -79, -25, -47, -19, 285, 100, 73, -98, 101, 8, -320, 131, 0, -204, 29, 203, -38, -7, -31, 35, 229, 140, 64, -44, -147, -127, -110, 162, -157, -424, 314, 291, -205, -2, 90, -144, -108, 184, -25, 270, -84, 59, -179, 169, 47, -173, 327, 212, 171, 123, -44, -131, -84, -22, -72, -357, -117, -53, -48, 293, 3, 7, -189, -191, 15, -159, 284, -66, -70, 233, 94, 99, 128, 119, 201, 19, 164, 59, -21, -368, 93, -132, 154, -22, -167, -54, 226, -154, 20, 131, 136, -126, -96, -66, -182, -66, -184, 41, 81, 83, 142, -30, -9, -57, -318, -16, 13, -62, 286, 50, -184, 146, -12, -172, -85, -60, -72, -230, 79, -8, -40, 243, 21, 114, 82, 33, -21, 89, -71, -299, 192, 137, -230, 69, -196, 28, -11, 15, 13, 190, 130, -175, 5, -258, -54, -382, 50, -53, 108, -13, -169, -98, -84, 189, -9, 164, -136, 117, 3, 117]
3384A17jJ1o0j09RJ41k82K85j02N2j25J96j16J83Q0n19L05j51J31o7l0L9l2O7
3408B2j53K20R2l24k3J80l34N50l24nk4M53k32K3k10J12m4PK4K82j04k21K13o0
3432A20J72p6j83j23O6J90k96m0Q8J90R1p0nk47N1k4J92j05J27k18J69j41O0K4
3456A2j69p6K21J73j70k6k0J2q6K49k52J60k61L65k07R9j17o1J86j02Q2oj18q0
3480a92L14p0l25K22K85k45j30L35q1k13K34k05K41%K2k25l7J4PK42o2k96Q9P7
3504Ap7N9K12j99K98k05l4L1K2m49N55j29K9n2j24m8Q1J5o0L74m52J35L3K18k20
3529A4J20j03l40K89p7qq9K98N5l48L57j54p2P7k5r4J04k06n2K02J38k51J65q2
3553h2N1J23P2k53j46L41p0j41K35j11p0J6K7jn2J53o4j68K87j7j8k5L0k41oL50
$$ y = [117, 116, 127, 67, -42, -33, 108, -174, 111, 9, 61, -64, 132, 16, 199, 279, -240, 65, -86, 45, -22, -52, -13, -45, 22, -131, 89, 181, -143, -166, 14, -320, 230, -94, -99, -123, 330, 98, 121, -89, 23, -21, -14, 10, 292, 188, -33, 180, 120, 292, 216, 33, -90, -24, 166, -130, -170, -82, 108, 199, 129, 124, -123, -72, -96, 96, -9, 118, -100, 69, -72, -12, 12, -157, -233, -12, 161, -9, -35, -55, -43, -129, 120, -132, 28, -233, 132, -75, 24, -93, -154, 32, -70, 12, 6, -112, -192, 122, 52, -273, -51, 234, -11, -141, 194, 113, -100, 134, -71, 170, 170, 192, -33, -70, -56, -49, 193, 131, -165, -76, 1, -76, -17, 195, -4, 294, 89, 55, 86, 108, -341, 214, 85, 114, 62, -62, -110, -29, -14, -74, 300, -152, -17, 16, 234, 14, 134, 31, -309, -20, -97, -105, -194, 104, 159, -189, 168, 14, -58, 19, -6, -100, 4, -202, -254, -52, 86, -165, 0, -82, -31, 92, 164, -89, -235, 106, 36, -105, 130, 19, -51, -35, -8, -9, -61, 92, 28, -140, 147, 130, 112, 87, 117, -124, -130, 220]
3579B20k40L7m5J87k33jJ84M2j07o6LpJ75k94K70j4k88O1p3J74k56O55j42m34
3603a92K26K07o4k57K32k4j47L7J97k02JN5k15L54j24j07q0J4J28p7m9K25NO4
3627B07j4k87J19m9R5J41j57j85k07J46M22j74l77J91L45j2j49l04P4M54k22J26
3649A83k42N3L6R3J21l12J74k57P3m93O38Pj76j0J73j93L96m44r2K55n7K67k87
3672i4J89j38J01q3M7n0J53k41j14L52J1k24J76ok07M7J43k21J76K44l13K0M6
3695A4j7J7p6L8r3K07j23Q5l91M12k12l1K40Qr3P8J68l51R4L69n77j92P25j72
3719A27j45or5j00L76L67n93j89N48l67l6L22k40j11j12N52m88K52l2k15O9K50
3741A34j3k91L20l07Q7K57n4l69J25L68m78J22K80n4L5o7l5j99J78j65O1N5j48
$$ y = [220, -20, 17, -28, 159, -74, -75, 109, 151, 44, -22, -19, -26, 149, -145, 125, 111, -177, -116, -189, -15, -271, 384, 242, -192, 34, 241, 177, -80, 152, 128, -19, 18, 215, 13, 14, 69, -146, 208, 84, -23, -103, -89, 39, -38, -87, 138, 143, 207, 193, -94, 25, -24, 71, 212, 55, -130, -337, -191, 231, 57, -320, -129, 216, 204, 55, -249, -175, 279, 57, 183, -59, -6, 30, 123, 244, -68, 106, -151, -78, -571, 67, 74, -102, -112, 61, -132, 264, -180, -272, -17, -74, 193, -94, 95, -43, 58, -25, 22, -28, 125, -116, -230, 122, 133, -91, 85, 79, -128, -81, 62, -159, 17, 261, -52, -32, 14, -3, 14, -62, -24, -117, 90, -33, 52, -339, 73, -139, -170, 70, 78, -15, 63, 231, -120, -26, 343, -234, -426, 299, 127, -18, -24, -119, -219, 157, 524, -69, -258, 290, -77, -113, 209, -31, -142, -254, 298, -190, 62, 30, -185, -116, 134, 121, -170, 150, -157, -70, 187, 133, -236, -111, 257, -221, -99, 181, 127, 162, 95, 60, -139, 39, -126, -65, -10, -158]
3764a58J5m5J37J75k38n5N1OJ34k34K0M22K9m41L08J45j47j52K0J98p1k95Q0P1
3788b5J26Q4j50j3q3J87k60K40k28J10j96K65q0j8n2J6K09R9k67K7K47j18R9k90
3812g1q7j07L71j02j46j33L18O1l64K65J21j93m0J04j05L9j23R0J10K65k84N7
3834D6M13m51k80K84j19q3J82L3J21j48J0j12J6J11Q5j37l8j32O2K40q3n5O6O5
3858I6p7K13Q8l68l1P4n5K6Q5O0q5N8O3J3j24k20K0K64k96K03O8N1j68K6J80j52
3884A2K2j85P2J26j19J47j56J67j14nj76K40p4J73k72J04j4J3J51l7o8p4kNJ62
3909I8j04l27K80k6jN0J61pk9k41j81J89O7J32j56O3O3j13J12j7r0J88j43N1P4
3934I3m43M77k7J57k56L22l36r5J83o1Nj66L6J4J61k31J72O2O9r1M0k6l17K81
$$ y = [-158, -143, -188, -51, 124, -114, -169, -118, -112, 22, -212, -192, 230, 259, -182, 126, 271, 124, -28, -8, 190, 119, -176, -96, -25, 101, 185, 35, 22, -61, 126, -134, 106, -122, -12, -208, 57, -23, -41, -93, -77, 132, 231, -36, -9, 238, 120, 219, -71, -158, -265, 106, 4, -142, -275, 43, 104, -260, 5, 126, -67, -107, -3, -108, -69, -192, -102, 8, 273, -11, 46, 459, 8, -272, 12, -107, -190, -8, 25, 146, -2, 8, -104, -88, 23, 108, -29, -67, -199, -137, 103, 20, -35, 31, 96, 19, 232, 320, -48, -79, -5, -60, -34, 51, 111, 26, 84, 147, 160, 36, -184, -164, 100, -196, 7, 75, 126, -42, -16, 164, 12, 34, -151, -79, 47, -72, 75, -81, 86, -28, -33, -209, 31, -43, 130, -142, -38, -52, -39, 112, 75, 7, -67, -69, -64, 98, -6, -333, -53, -79, -80, -30, 131, 124, 95, -146, -327, -138, -71, 61, -95, -32, 31, -82, 30, 13, -77, 111, -32, 19, 93, -350, 127, 100, 257, 1, 323, -13, -108, 75, 14, 19, -147, -111, -97, 64, -167, 5, 67, 136, 45, 85, 59, -258, 23]
3958B3k85K27jK57m5Nj62l30J04L66j92r0K12k35J90o9j7J34o9o6J72l8o0L3N3
3983A17k20K24k09rl9K14J21j49P1m9k52K62M7k93L93n7k99jO0K3j67J64P1Q6
4007A09j67J27r6L22l9m10J31P6L9k09J75L4j19p1J13K2k76L9L57J0r4K6o5J5
4031D9Q3j19%j72p1K18j10J97j58l10O27j57p0j8j06J91O7L4j10j54J23j12k3
4054a01J43j70K15J95j44l46N8p0M34j81l77J75J47K57k56J7k2P0K42l05j31J81
4076C1k3O0K0p8j42K53k97o6J77Q5q4K31k27Q0qK77l11J36n9R1p0L8oo2Q1j28
4102aM0k3J80l27q3M56j24k12M9K2n4j33L67j8j93K76p6m1k12j81J60K54j34L17
4126C09k91K86m21K27l38L21j85%j28%M37k56J70j71j73J64J34k4n9P8m7J34k53
$$ y = [23, -262, -35, -36, 221, 176, 181, 19, -311, -207, 159, -33, -123, 89, -146, 44, -25, -42, 92, 23, -43, 129, 91, 31, 64, 117, -103, 121, -88, -97, -136, 78, 199, 50, 121, 72, -180, 82, 129, -164, 229, 172, -127, -128, -68, -45, -212, -48, 23, 109, -58, 69, -27, 295, 256, -154, -23, 53, 92, -117, 58, 92, -27, -98, 15, 37, -239, -200, 157, 167, 73, 99, 34, 49, 132, 13, 13, -159, -230, -12, -122, 75, -83, -393, 234, 77, 7, -11, -117, 74, 141, 175, 65, -89, 34, -78, -101, 42, -128, 87, 282, 138, -208, -150, -220, 214, 33, -344, -169, -22, 235, -21, -4, -26, 44, 286, -19, -150, 31, 8, 68, 88, 10, -132, 121, -176, -242, -65, 20, -64, 167, -60, 20, 12, 289, -22, 114, 55, 146, 76, 114, 108, 46, 127, -1, 39, 16, 196, -131, -214, 242, 118, -94, -45, -23, -77, -210, 157, 139, -54, 222, 146, 105, -107, -288, -128, 126, -8, 309, 18, 304, -117, 110, -228, 93, -92, -92, -220, -220, 217, -39, 131, -40, -213, -49, 85, 61, 2, 80, 33, 167, -86]
4149h6R3q6o9L76k93l40N93k33K48j64j8j10K25k47K26K2j71j74J04P7k43L69
4171I9O3r6L3J69k99j16K08k2m3J77k20l42K04J96j33K10q8n9O7J56j28n9j97
4194b20K20R5j61L8j83L00j50j74M03k49j43j20K57J83j93J38k56q5M64j10k14
4215a60J01K22k76J30P6j78n0L43Ol86j18L47k46K98Q2l18K23k91p7K68J72L4
4237B02l43K42K1j82M3n7J17K57k30k36l7P3K0K33J9m3l05L93Jj81r0p1J09kM10
4262C63k97l57K33K11k07j24J37q0K5L48j55n6o2J09q5M6lk97K31k3LJ26l3k3
4286C0j12J12rL0k3q4l3J87r4j10L22n3j38l0r0K04n0K81q9l25R4%M2Q5k67R5
4312b5J47l40L78k07J79k05J15R3J8j66J19j23m8j51L53k51Q0K38l64j51K79J15
$$ y = [-86, 7, -79, -148, 228, -65, -405, 188, -45, 203, 39, 21, -89, 136, -111, 115, 137, -34, -208, -104, -27, -270, 99, 162, 66, 99, 268, -31, -147, 61, 39, -4, 173, -47, -389, -185, 11, -122, 88, 0, -59, 8, 164, 36, -23, -220, 0, 95, -66, -28, -211, 89, -61, -235, 168, -81, -224, -344, -87, 96, -97, 41, -215, -300, 164, 54, -160, -59, 163, -113, 17, 93, -85, -135, 208, 214, -172, -290, 57, -189, 109, 191, -127, 96, -195, -272, -4, 168, 202, -141, 101, 122, -60, -17, -74, 43, 300, 70, -166, -203, -130, -110, 123, 142, 99, -206, 187, 188, 7, -83, -154, -45, -47, 363, 66, -291, -58, 153, -54, -178, -41, -121, -96, 252, 97, 41, -21, 88, 3, 49, 46, -251, -20, -43, -40, 86, 53, 30, -82, 30, 21, 51, 28, -56, -89, 98, 4, -106, 216, 163, 25, -5, -95, 109, 59, 340, 251, -74, 20, 20, 62, 147, -120, -25, 122, -218, 160, -47, 132, -73, 42, 135, 153, -13, 106, -17, -65, -216, 137, -114, -34, 204, -160, -311, -32, 83]
4334H3k01O6J28k29J32J07K1k33J27J41k37J83j88K51p0j89J27j43O4j48J45J49
4356H6j09m4J79k04J91j69J0j77L13o9j2j68r7L10J17p8q1m8K90j50k21Q8J09
4379F6j22P7K0K11m16J36j89J81O5j10J91j7mQ8j99J74q5j89J49j12K33k77K02
4402G3N8K3j20J19j92M8p2j18L59k99l7L3M44k97q1K25k95L14r4n3jL3L35j78
4426B27k26j04K03m2QJ85k17j59K42l19K9Q3L9J29J3J12m13K19k56J01K52j60
4448e4k6K01M0j73l0m5l4P5j61N82m99j2K56j97Q9l33O56k58j33O4R1j38l5Mk4
4473i4O5K96J12l12N0Q5j49N1l0l98L15N1k15K09K58j84K9j55K0r0J54m9J5M9
4497H3j8J0j44J41J34k20m1J42J11n9p4k12J16P8k08o0M60j97l02K92k07K80l23
$$ y = [83, -118, -52, 76, -153, -21, 86, 107, -126, 1, 142, -95, 88, -100, 151, 81, -108, 19, -124, -60, -208, -63, 86, -23, -67, 112, -92, 99, -70, -60, -237, 76, 7, -5, -173, -270, 40, 157, 79, -2, -50, 240, 90, -131, -43, 66, -56, 21, 41, 252, -164, -28, -217, -36, 29, -81, 110, 93, 89, 177, -22, 152, 67, -122, 27, -85, 148, -129, 73, 131, 154, 34, 153, -39, 9, -63, -181, 178, -121, -158, -125, 319, 22, -59, 166, -129, 185, 91, 38, 37, 70, 405, 227, 1, -103, 100, 58, 66, 251, 34, -125, 117, -202, -173, -90, -51, 78, 91, 203, -210, 9, -247, -146, 106, -54, -80, 121, 161, -12, -42, -87, -121, -46, -207, 375, -124, -136, 120, -77, 12, -321, 335, 77, -56, 8, 99, -39, -74, -70, -94, -29, 267, 379, 67, 117, 202, 53, 104, 74, -324, -9, 42, -173, 36, 294, 110, 139, -16, 4, -86, 68, 19, 34, 83, 65, 75, -69, 72, 206, -14, -55, 87, 198, 139, 65, -147, -31, 47, -161, -221, 239, 42, -260, 32, -175, 105, -218]
4520b18L06j23J95k46J68k52K43r2p3L3J05j23L47k65J45L21k14j45k15J36n7
4541b4j09J97j32M0J33k58L55j93J69r7l8K68j37l13L68k28P3j7j04MR0q9q7K88
4565A59j95j48J54l0O1J09j34L00j83j62J79J74q5l55K75k82m2J51J43j13J53
4586A29k49L49l7k15r7J21L28k41J92m26J73K08j65l8R9l24k7L1J75p9j63L31
4608G5M3j06K8m4N6m15K04J77K4J54l22m8J54K1J76l04O9lK8J28j96M3J25J04
4632A71j04q4K94k90j6j27J53K47k83O2j30K48k2n57L66K27m6l80P8o1M62o8j82
4655d2K1J0nJ90k27M5M8m0J3j2M7J72j66K0Lo0O5j84J62l1j7j52J86j6J58o2n9
4682F7q1j1L4J8l5Q0J4J1j95J0O5k0J1JJ49l58K84L18l37J97l16K8o4K53l1L2
$$ y = [-218, 88, -35, 160, -86, 82, -170, 73, -19, -92, -59, 46, -77, 270, 5, 150, 471, 257, 112, -103, 33, -24, -133, 64, -68, -28, 105, -153, 202, 9, 178, 81, 43, 311, 174, -139, 229, 1, 74, 57, -47, -43, 47, -42, -129, 159, -36, -184, -30, -60, 1, 110, -24, 276, 93, -69, 110, 284, 199, -156, 119, -163, -205, -54, 89, -24, 129, -120, 229, 192, -23, -120, 1, 329, 88, 280, -146, 27, 235, 70, 32, 131, -193, -220, -189, -14, -93, -256, 75, 118, 12, 40, -4, 52, -363, -159, 18, 42, 196, -126, -174, -20, 1, 177, -127, -58, -61, -33, 95, -101, -58, 67, 171, 67, -17, 277, -13, -29, -156, -3, 244, -39, 23, -107, 141, 119, -438, -72, 155, 109, -271, -193, -254, 208, 140, -42, -21, -11, -16, 174, -53, -8, 40, 0, 13, 1, 48, 220, 54, 74, 77, 17, 82, -102, 60, 29, 12, -140, 46, 30, 188, 126, 67, -14, -25, 9, 27, -8, 72, 86, 97, -98, -88, -23, -43, -32, -31, 118, -240, 44, 362, 25, 222, -94, -66, -130, 123, 92, 124]
4708A24k67K55k38K16j08l05L55Q9j15J32J12l69L71j92Nm9L7k05j13L59n3k6
4730A5J26O0k24k15N04K5j75j67J4J76L5j86k92K48j08J06Q7k88L22J32k01j42
4752a48N7J13L2q5Q4o2j64J55Q9j5nJ45j40o3L9j28l6J49j85K1J41R9l87J34J12
4777d8Q1Q9k33P5j87R6J27r2j45K53j75L47j87L1k3L7R4j93j60K7P0l9K65j89
4801g9K38l18J03k21L71j22J86k40K19J23j12j35j48J70pkl35N37k15m16L33M05
4823C35k24O0qr0k07K82l1j91J80j97J07Pj26R2O8j57K23j43q1N4J08j53NJ96
4847A09l2J6J1j5k23r6K64R4p5J08LN5k83L1r1K07j70j03j6K98J2j34J42m1k45
4872a74J63M3p7J0P1r5K5K81o4o1k8o5o1p3Q2mj79K54l50M18j17L3j9j56j78L65
$$ y = [124, -143, 112, -126, 90, -18, -323, 32, 121, 6, 138, 250, -119, 252, 60, 65, 16, 53, -152, -265, 94, 41, 15, 141, 201, -23, -238, 266, 291, 116, -51, -37, 139, 174, -12, -304, -56, -164, -58, 29, -259, 63, 195, -6, -148, -91, 22, 54, -31, 53, -9, -173, -18, 71, 56, 51, 196, 56, -7, 32, -96, -132, 17, -168, -147, -6, 93, -294, -160, -48, 33, 122, -111, -36, -223, -127, 0, -92, -237, 16, -159, 188, 1, 32, 9, 46, 140, -53, -213, -186, -116, -155, 110, -79, 159, -159, -56, -277, 94, -28, 158, -82, 137, 260, 148, 13, -135, 35, 28, 26, -309, 228, 13, -403, -70, 335, 111, 171, 163, 73, -134, 148, 117, -74, 106, -91, 16, 23, -103, -11, 57, -100, 123, -20, -101, -47, 61, -92, -87, 109, 77, 93, 104, 89, -134, -230, 34, 128, 53, 161, 164, 219, -64, -33, -124, 83, -87, -190, -206, 92, 104, -30, 112, 71, -174, -11, 32, -45, -35, 36, -59, -34, 247, 183, 122, 94, 29, -32, -105, -23, -27, -206, 48, -302, 116, -1, 32, 13, -143, -321, 44]
4898D4N5j1k6l7q8p4Q8J3j85R0Q7K18l80K88R9k07K68l18K18k61J8J26j11p8J25
4923c9J72r1k6j77J38p9J83N5rk61kM09k37j41K12j08K57j95J38j05j36r4K31
4946I5N7K7j58l0O6J11Qj13k46M38N4k88m3k10L25l05Q3K34j0L8j41M4K20o2l21
4971a27K60j24m3J78k66J35Q1l27K20j05K40J6k80L38k71K65l22K21p0j57K76
4992A38k49J29M5p2P3k44L99m46K54r2K4l8j18J53K40n06K87Q0R5j05j15P4j80
5015a74O3O4R5j9J18j13R3p8k43K36N2j26J34j36P5k6j09J49K2J17l13L38Q2l88
5039h7R0o6M14r9k41Q4k53J44l28J83o4J66K30l33J09R1j69j8J04J10p2q5K52
5062A62j8k04J37p8J69j01r2l1O9p7JQ6q6J69J24l30L3j45M01k74j1J57q6J06
$$ y = [44, 99, 88, 62, 25, -63, -137, -49, -36, -221, -131, -44, 174, -206, 82, 181, -26, 242, -76, 142, -119, -101, 25, -86, -164, -39, 133, 42, 16, -161, -23, -102, 81, 136, 127, -134, -136, 273, 36, -105, 107, -1, 256, 61, 199, 94, -42, -136, 95, 152, 179, 21, -9, 57, 168, 176, 63, -183, 255, 309, 21, -22, -232, 93, -212, -129, 105, 95, 133, -8, 36, 256, 194, -127, 133, 9, -34, 144, -122, 13, 94, -233, -13, -118, 122, 138, -142, 196, -75, 190, -132, 89, 19, -138, 138, -111, 18, 63, -9, 64, -180, 219, -227, 27, -65, -41, -79, -197, -44, 196, -310, -23, 57, 152, 47, -68, 6, -174, -111, -47, 48, 29, 147, 34, 127, 49, -194, 42, 94, -32, 102, -34, 41, 15, -94, 55, 77, 194, -119, 219, 301, -87, 3, -63, 351, 252, 11, 95, -158, -14, -342, -159, -223, -57, 173, -160, -51, 40, -129, -147, -43, 67, -5, -90, 162, 144, -60, 77, -1, 168, 67, -25, -56, 13, -64, -63, 23, -63, 106, 230, -100, -67, -212, 189, -85, -96, 61, -25, 81]
5086H1j94M3J85l17M70j43o5N5j82Q7N9k15J01J52k72K64l30N7mJ42P2M4l24M60
5110B26m92L80p5k19J12q3K22L4l08J26j38K90J2qm4K41n10M0J08K75n8k96J35
5133c0J23M1j14k49K60n0L9Q5j22J18j21j30j19L43j31Q9J18k70J49O3j29q7N5
5156f9q3P4J52n0j26L2m1J91Q1J0k51J48j18j13M8M6K3q7L54k96j04L86k94J96
5180A09P9j77n4q7J73l5QJ54r3j33j14J78J36k70J41J81j82k3L0N8n8mJ65j24
5204E8o0q3L0J55l5l3J30m08K68J04J43m56L31l41K51k20R3N6J77j68K5L8K13
5227B68j98k10J15j74K78l5j24l5J6mK09q7J36j31M9k8k11J3L42l35J85o6k11
5250b38K60q0rk10M30k03N4M8j42J47j55k20L56j7OJ91j41J97l75K26o4k44K42
$$ y = [81, -113, -70, 115, -202, 268, 125, 60, 115, -67, 20, 79, -136, -35, 117, -155, 109, -221, -164, -168, -26, 46, 90, -234, 226, -266, 114, 39, -180, -68, -151, 71, 105, -203, -77, -215, 75, 87, 79, 35, 276, -234, -194, -86, 189, 131, -165, -30, 93, 134, 20, -229, 31, -19, 20, 105, -17, 101, -20, -150, -269, 74, -57, 32, 150, -120, 29, 92, -37, -124, -69, -152, -78, 74, 24, -102, -70, -111, 80, 161, 171, -80, 68, -50, -163, -115, -69, -46, -133, 221, -75, -179, 207, -87, 109, 188, 11, -43, -130, 43, 8, 16, 170, 77, -56, -170, 8, 144, -126, 15, 196, 14, -9, 21, 79, 21, 17, 182, 58, -2, -85, -55, 100, 65, 32, 162, -246, 22, 126, 269, -187, 144, -197, 54, -166, -73, -17, 160, -8, 17, 55, 268, 70, -140, -25, -199, 79, 44, -80, -115, -99, -103, 106, 19, 155, 24, 73, 45, -166, -153, 189, -146, 39, -27, -238, 22, -58, -67, -277, 153, -50, 4, 52, -90, 57, -98, -318, 38, 21, 27, 218, 77, 274, -101, 125, 61, -183, 59]
5273E9M5O9j59j28M8L0m3L08q8j22j85K1L1o4J10J04k54J67J01K13j97K5j96L4
5297g1K10r0j4q0L9r1K04j33o4R9k18J13P8N8j5LJ63k0m3j26J27l10M0Q6J05r
5323D1O6j69JJ68j07J86l02k60L13Q3rk50N57m69Q8J92j93K33n48L84P2l38L16
5346E5l15K60j21L73k52k02r4L81Q4l13K45k00J38q6j60J32k7o1j60K27M00k14
5368I0j43J18k7r6J35k16J62k5j7j58J95Q3j89J22K44j36j48j44K47j38m8J02
5390A3J1J45k42R0Mq6L0L9j68L04k09oj0R6J53k09j92J50R5n1Q9j00N1Pj39J30
5416ej41j4K52m9m16L29kR7l6P4q5L7O6k59J09J1M0j11M4J5p6K46j64OO5J13l65
5443b19J72K77j95k6j8P4j64J4QQr3L2K81j98k42J03K47P2j28k27J26P8k44L75
$$ y = [59, 104, 173, 14, -114, -66, -36, -79, 229, 141, 19, -166, -145, -114, -178, -68, 36, -218, -51, 50, 263, 66, 91, -105, -71, 139, 49, 35, -45, -6, -97, 107, -26, -90, 9, -209, -96, -18, 40, 25, 28, 191, 171, 128, 2, 129, -181, -141, -55, 50, 41, 107, -62, -61, 107, 0, 186, -116, -376, -63, 20, 11, -239, 318, -151, -63, 129, -64, 169, -379, 5, 77, -261, 55, -260, 0, -121, 252, 0, -202, -296, 85, 169, -144, 101, -99, 39, -47, -207, -75, -102, -163, -323, -96, 304, 90, -53, 65, 38, -58, 77, -139, 23, -2, -19, -177, 18, 101, -88, 34, 278, 142, -6, -150, 97, -41, -89, 13, 24, 169, -73, 17, 21, -65, -35, 4, -164, 140, -69, -75, -85, 11, 164, -45, -237, -87, 8, -43, 46, -54, -3, 4, -135, -5, -146, -160, 92, 43, -373, -44, -46, 51, 15, 89, 4, 41, 107, -152, -43, -32, 8, -103, -59, -44, -120, 126, -38, -32, 33, 146, -219, -47, 230, 35, 9, -9, 65, -99, -85, -77, -69, -162, -130, 151, -47, -289, -186, 61, 133, 5, -222, -96, -18, -262, 113]
5467A13J8m5q8l9J04j8Q0k36P5j32j20L86j91L3J1J34j34k3J77l97L76rq6P2n4
5492GM3j95K42M1j45kqq1J38K38k88K0J15j43J55j14L28m20k6K9R3J6m7l5Op4
5518a07K10n4k08K75k95J64J18k5l87K02J90k13N8J91m74N63p4k82K89l85K22
5539b2J08j73N9r0L07k61K20k37K6j49J27J65O2l20m7N73k21j6oj43J32j35L9
5562bQ8N9p8j42j38L1j20K34J95j59k47J76K06o1j96Q8J26M8n6n6N0k63L04jj11
5587b5K09J1k57J7j05L5nlL13k43m0j02K69j15J44P7j81J12r2j95L22j2R7k95
5611f4J46p9k4J36k20l2K11j40J73q6q0N1K3J72o3j40l6K18l54L42q1J0rn3O0
5636H1m3k3l38K10K14j04m4j03Q5J61Q1k31N3p6K95l58L33k78J36k50P6J63J35
$$ y = [113, 131, 86, -2, -41, 63, 45, 125, -111, -36, -168, -288, 98, -93, -60, -49, 85, -49, -72, 105, -292, 84, 75, -11, 61, 7, 50, -145, 97, 138, -7, -9, -17, -98, 40, 278, -10, 10, 125, -18, 137, 23, 351, -69, -95, -66, 27, 43, -4, -39, -33, -107, 103, 49, -159, 116, -179, -15, 103, 78, -309, -107, 83, -130, -72, 119, -355, 208, 134, -148, 141, -244, -22, 86, -87, -28, -118, 189, -72, 148, -89, -63, -212, -85, 80, 142, -178, -225, 348, 127, 111, 105, -38, 94, -41, -2, 86, 145, 67, -75, -213, -182, -302, -68, 127, -32, -279, -103, 103, 42, -154, -66, 60, 108, 52, -4, 46, -217, 87, 86, -25, 184, 195, -62, -45, -150, -115, -120, -123, 190, -53, -93, -195, 74, -41, 103, 180, -1, 111, 19, -176, 146, 134, 231, -64, 82, 3, -21, 115, -105, -137, 74, -66, 107, 21, -59, -8, 15, 187, 124, -16, -52, 166, -188, 154, 73, 83, 74, 21, 81, 38, 15, -323, -113, 101, -3, -47, -150, -65, 96, 177, -54, -1, -77, 218, -140, 193, -85, 51, -199, -123, 40, 175]
5659A75j99j4j09J67p1J49l64O75m59P1K7j32j5K27p5j65J61o0J16o2K2J3j23
5682d5J15j03p4K25k26pJ0J64M0l00R6j0K93j09L1L7k04P2k79K18J56J41j12k14
5706h5J49j54R8j77K87k16J17j04K19p5o2R3p1j83j31L42R8o8J62j11j14j08R7
5729Cm9q8J19N7l5J0N2N1j32Q7m8k55P8K2J65P1k30L0j25J15K41j51q0p3L75o4
5755A46k11J33N1Qq7O7p9J38n8j98R0m6p6r1L17M3m54J65n7N0j06J71j41K55q7
5780e7J80l01R1p7Q2J48l4K5m27J82N2J99j88k9J72J7j11OJ36j03rnK23l74K69
5805F7k5m04L80N9k57K37j01O3j10K6ok12L49n9O9o1k24J26K99J14k14m4p3J54
5829A53p0q7j10J39k40L67l40J45q4L62j60O1Ql5Ll11q4O3K39j83J56J49K47l41
$$ y = [175, -24, -38, -147, 20, -51, 98, -266, 409, -50, 21, 48, -84, -99, 128, 53, -112, 49, -11, 105, 43, 65, 78, -45, 70, -33, -107, 118, -108, -115, -105, 59, 99, -201, -105, -115, 178, 69, 100, 137, -67, 5, -274, -56, 100, 241, 129, -85, 64, -90, 8, -169, 118, -98, 19, -85, 134, 59, -3, 90, 19, -164, -295, 47, 145, 77, 239, 128, 14, -94, 3, -46, -134, -15, 42, 7, 17, 69, 120, -12, 75, 27, -228, -150, -128, 37, 108, -122, -92, -217, -102, 139, -12, -92, -165, 210, 146, -65, 68, 119, 127, 40, 107, 28, 166, 108, -90, 0, -46, -122, -213, 104, 147, -307, -142, -199, -149, -255, -84, -225, 30, -57, 123, -178, -87, -164, -82, 66, 32, 57, -370, -188, -136, 63, -125, -154, 18, 35, -76, -70, 66, -37, -46, -51, 172, -202, 67, 42, -362, 18, 77, -180, 57, -44, 19, -91, -65, -71, -283, 66, 7, 76, 15, -209, -83, 216, 330, 116, 72, -1, 153, 83, -4, -114, 25, -215, 152, -188, -43, -127, 235, 75, 136, 144, 109, 112, -199, -283, -220, 19, -164, -8, 141, 388, 47]
5853D7R5l07K15M7k33O6P7j52M4M7L8J74k50j93L94O0j76M6J98k02o4k8M3j96
5877b10K99P3l24J17j14K61l9K2j81l0j83J49K85k74K10j30J12j15N6J3k52L24
5899F9o6k4J88j37K1m17L50l9k76K98J36r5J10j91n3nK09Qr1O4o9l8k9JN0j5q
5926d9L4J91m40k5J39K08L7n9J49k10J21J90l17J9Q2j17L0k81Q7k5M06j28l5k52
5950b45L07k59j58L11p5J79J1k08K0J41J34p8K1l49J76J27r4k02K71K44n53K50
5972b9r7mK18j70N4J35p9m3l5J13j67q2j71K84o1L77l72k02M03O0r3m0O6j34Q9
5997B0j84j2J48rN3j66K49j12M4o9J37p3J56k27QP6k52K44J23k8l00J17L16m13
6021a54K80j82K20j2j46J83j38N2j32j96M31j25j14K99k35j46J04l7j05J53K03
$$ y = [47, 142, -165, 50, 97, -136, -70, 7, -145, -101, -54, -16, 158, -92, -285, 109, 169, -7, 39, 237, 35, -29, -57, -14, -210, 89, 162, -162, -45, -159, 102, 63, 85, -96, -126, -309, -160, 125, -149, 61, -69, 43, -72, -16, -3, -255, 69, 3, -21, 167, 30, 51, -366, -16, -55, -331, -33, 103, 8, 118, -73, -126, -131, 78, 86, -5, 59, -10, -48, -77, -76, -26, -41, -49, -15, 176, -264, -289, -150, 58, 95, 36, 185, -25, 96, 286, -31, -12, 70, -47, -17, -298, -211, -236, 170, 42, 7, -245, 62, -197, -355, -44, -119, 60, 71, -137, -117, 24, 158, 80, 101, -248, -72, 55, -39, -241, 30, 274, -279, -29, -126, -130, 88, -82, -28, 107, 28, -15, -50, 63, -104, -186, -357, -73, -134, 243, -129, -331, 72, 132, 39, -1, 65, -69, 20, -164, -176, -28, -37, 16, -150, 99, -13, 31, -38, 99, 26, 182, -45, -37, 39, -213, 31, 154, 126, -174, -57, 259, -154, 126, -56, 164, 152, 6, 189, 51, 103, -29, -225, 206, 81, -33, 266, 31, -115, -11, -48, -153, 0, 203]
6042B03l54L23j40K17k49N8qR5j06q3J93l46J45K9j6K13j07j06M7m3J1r2M6O1
6066iN0J13j39k22J14L34j80j31K33j1j45j51Q4P5J09k02L58k56L8o5NJ63j91
6089b6K89k46J47j13j40J98k68J87j11J91j31L65j97p9L83o32J71j04K18m6R7
6110A53j5j9q6P5j64J7R3Q8n8k84J43q0J8J8J44n2K4rJ57k20J73l06J39M8j24
6135a27Q7l9N5j27K67k92J67j56N7K21l03K99k11L30j22jj68J67k29P4k2J59O3
6158A49k00k30J93K16q2j15o8Q9J22k1j61J83r9K50j27lo6j18K30kj39j13L44
6181B32j65j95n1k6L39k22J86j65pK27l71K74N3o0l43L26K4o8J95l17J08L6j04
6204i4K16J36k16j26K05p1j57J42Q6o6l11J02L57k90J97l2k85J33J87k45K47p5
$$ y = [203, -151, 172, 32, 249, 0, 58, 50, 145, 39, -44, 149, -197, -52, -23, -39, 174, 67, -39, 8, -35, -24, -116, -70, -9, 41, 154, 15, -207, -93, 241, 61, -70, 163, 152, 7, -144, -60, 15, 124, -78, 280, 24, 62, -3, 2, 165, -26, 263, 17, 164, 51, -89, 109, -159, 28, -83, 108, -23, 342, 145, 66, 449, -183, -12, -116, 102, 56, 153, 138, 119, 33, 108, -56, -39, 54, 142, 84, -200, -57, -137, -119, -101, 43, -9, 15, 6, 163, -57, 116, -190, -51, -3, -127, -40, -79, -24, -151, 116, -176, -9, -165, -108, 113, -190, 109, -102, 228, 106, 105, -63, 104, -125, -51, -73, 86, 149, -51, -281, -88, 128, 46, -69, -137, -48, 74, 53, -108, 75, -24, 226, 99, 96, 30, -88, 142, 140, 1, -112, 232, 67, -128, -179, -205, 134, -88, 98, -67, -74, 153, -218, 56, 109, 49, -294, 32, 56, -12, 183, -134, -26, 10, -94, 122, 258, 42, -84, 121, 50, -107, 35, 121, 55, -256, -154, 203, -87, 110, 78, -207, -74, 113, -132, 115, 40]
6226D0k41L77j60m5l39K68m6K51q7J3K04k23j2Oj89L31n2%k83M43m62M4J37J69
6250A44k21mM2m3N0M2m2p7j34K2K88P0j20J35k9j79K15j42j97N43j71j42n5q2
6274h7R3%j84Q4K05l03K26KKr2L10k22k91L77jj78K45j16k9o6j50P7j03j56K35
6299a22j55L34j14Q5K98m26j82K40J00P5j32k09K74j07q0K16k08P8Q4j0k8n6K14
6322A69O3j84j60K70k7j1l78N59k69j71K11j38k04N01j19j55n5L13m43K38qJ01
6344A03n9J51k03p4P5M3J17l21K45j16J99j49Q3o1r4j1K64k34J98j96P3L3j88
6367a22P4R6l51K78L8k82M10m05J22M08j91q0M41o45R9Q1L0J6L6r1P1r7K17r2
6391F1K91m30Q6J53l29K87j14J8PM8m3p4M6j82R9J17%j77J65O0N7j28J10K35n40
$$ y = [40, -201, 176, 16, -29, -368, -100, -146, 105, 18, 31, 235, 12, 0, 6, -183, 148, 96, 96, -187, 256, -206, -162, -25, 144, -77, -81, -39, -82, -32, 10, -32, -109, -243, -221, 67, 137, 17, 152, 123, -56, 159, 17, -180, 363, 192, 50, -5, -87, 6, 6, -178, -94, 111, -192, 34, 36, 38, -54, 256, 34, -257, 120, 119, -59, 186, 70, 41, -25, -175, -98, -201, -357, -122, -277, 57, -57, 28, 326, -100, -282, -42, 58, 133, 1, -208, 66, -41, -121, 95, -113, -35, 49, 39, 11, -45, 169, 232, 48, -112, 158, 131, 120, -258, 301, 32, -139, 72, -66, -270, 231, 112, -43, -98, 215, -228, 10, 2, 103, 44, 195, -8, -82, -7, 36, 153, -168, 77, -39, 160, 11, 94, 33, -61, -72, 192, -42, 156, -40, 33, 66, -122, -48, 48, -303, -25, 13, -269, 141, -264, -142, 266, 75, -5, 436, -209, -110, -29, 1, 17, 53, -38, 33, -64, 153, 61, 352, -78, 8, 161, -168, 119, 5, 23, 30, 78, 35, -39, 7, -175, -76, 41, 41, -136, 29, 89, 146, 18, 128, 363, -177]
6416a77M10j77k10L08k86K11q9M6R6r2j66J00o4J95k2o6R4K0kk62l7K2M12k48
6440A6P6p9K40k37j06k7K18L2j88J78j37J70k96J41m4J2o5Q0n5r0K05lj34R8k33
6465b28J0K11m51M58p2O1r2j2j05K5K21j53m0L36l62J97Q2l3K6p7j14L15k49M0
6489fq0J15j29RK31K0k26k01K52n7J89m1j87j36M44j66J27j42j91JQ5m0L13j84
6513@m0j24K03j05J52j79L32j47o3J79J67k72q2J25k4k02R0o2l6m5J3J91J91j38
6537A24j3k83K3K33k28K74j10p3L06q5k8j05M7K44J4l87Q9j00j4m0Q5j96J92l7
6561f8r8K03k1K4J15k14K55j93J41j64J85j84M3o2J64k43j0P5J41k26O7J97j44
6584a7%J36k50K76J4l01j3JL10j77pJ07O0k0j1o1J06j47J88m56OK47K57m83R2
$$ y = [-177, 233, 56, -154, 154, -132, 79, -10, 36, 132, 40, -126, -26, -90, 105, 83, 17, 111, 131, 129, -133, -170, -148, 264, 16, 92, 13, 253, 16, -90, -117, 101, 133, -55, 123, -14, 156, -140, 1, -43, -31, -96, -16, -71, -161, 44, 41, -93, 5, -228, -218, -7, -458, 0, -72, -11, -103, -115, -220, -195, 26, -127, -167, 169, -193, 4, 86, 53, 79, 2, -112, 203, -46, -6, -86, 29, -100, -91, 140, 160, -66, -267, -15, -72, 117, 76, -111, -247, 197, 31, 158, 16, -175, -174, -89, -129, 184, 0, -40, -164, 39, -66, 86, -93, 239, 92, 29, 208, 375, 103, 21, 146, 122, -80, 10, -52, -88, -133, -120, 71, 262, 124, 111, -172, -149, 84, -144, 130, 20, -53, 253, 168, 140, 35, 82, 326, 340, -47, 42, -58, -72, -112, -27, -223, -31, -68, -166, 37, 16, 40, 155, -59, 196, 3, 144, -20, 165, -19, 24, -38, 126, -117, -127, -52, 89, -137, -70, 127, -17, -17, 119, -131, 145, 159, -142, -155, -154, 156, -21, -28, 79, 139, 119, 108, 47, 153, 6, 194, -262, -256, -9, 248, -235, -143]
6609a43K4K26j76L9P4J56N7k81Q7l9J55k13j37J68O2l02J49J89K8k09j8p6J25
6632e5R9k47J79J9l7k6N6R0j97O8J69%j70J27j54j0Q3m4O4l3l8j4j38L50o5p5
6658AL0k19N0L08n3r0j21J09l1J01n8J63k72N0q7L00l86L73j07n6J28l59L20N4
6682A48o5n7k4Q1o2j24L23k59L1j21P8o4K22J52l48K50j59n3M9k44P3j4J13L08
6706B34k84P9J52j67j63K43k8m0R1J6l40J32R9j70K37M7o3r4J49k41OO9K3j9P8
6731D6j06K00j65j38K01n6rJ8q8K27P2j78q9Pr5K01r2K03m9N0l02K92k85J52j13
6756i6L9m6J86%J0L3k23K34O9k32j37J11q9L46k67k5J9J45j32Q3J40k82J22J54
6780A62LPM0O8k37K31l11l3K69j87k6j72K49k83J74L9J85k93J13N4K3j82L81m17
$$ y = [-143, -119, 107, -69, -30, 44, 200, 257, -24, 63, 24, 179, -34, -171, -3, 59, -243, -94, 95, 123, -86, -104, -180, -55, 44, -203, -24, -5, -42, -68, -12, 78, -119, -51, 118, 118, -52, 75, -79, -89, -6, -50, 14, -19, -57, -71, -209, 141, 76, 1, 31, -188, -138, 170, 117, 27, -94, 15, -16, 85, 27, 190, -82, -32, -119, 181, -205, 168, 61, 5, 133, -226, 94, 148, 83, 26, 2, 83, 21, -103, 220, -39, -8, -129, -51, -115, 107, 259, -89, 161, 2, -51, -2, -246, -173, -187, -74, 234, -50, 29, 181, 14, -149, 94, 66, 26, 117, 133, -207, -75, 24, -146, 91, 138, 75, -19, 130, -111, -105, -36, -13, -32, 46, -60, 140, -25, -163, 38, -18, -27, -9, -97, 130, 202, 24, -65, -58, -153, 48, -44, 159, 110, 160, -142, 150, -135, 17, -96, -57, -103, 83, 83, 93, 126, -97, 137, 206, -26, -163, -52, -141, 205, -62, -87, -68, 77, -55, 28, 168, -114, 8, 162, 165, 172, 212, 280, 43, 274, -37, -70, 199, 12, -14, -186, 63, -220, -46, -7, 178, -115, -2, 52, 75, -107, 274, -143]
6804a43j5L8O0j4J51j84k2J37P8j9O2j64R7m8j08K91j28j2r1r0J33j04j57L73
6828A21r7j69J19K1O7J01j84L6j17J64K58l93M5oj29J5L9l6K34j08j21k0J56j55
6852a59P2K3J9k01K61P0j8n3k0J35r2k15J04K42k43Mqj13L13k40R7L29j34l85
6876b12J82M6m2M0Q0j17j13N1K2L64l81j31L28k8m5j04J31j54K34j95P1n3l2n7
6900a15K5Q2J9L32j33k7k59J14p5L4J83r5M7q8j65J19jP7rr0l65L94j8l51N64
6925A99l72J32l3Q5J23l73L54j24nK37j95K91k63K08k60p6j09J60p1j65K3O3L14
6948A43l19J20J02K45l64J55j78L94m42n2K73k18J6K65l6k23K56J0r1R5k67J27
6970A1j35J59j05J67j50P8m4j51K28L2J16k24p5j10L25r4K65j77r0J88n5l2q4
$$ y = [-143, -158, -120, -60, -74, 77, -107, -129, 8, 86, 67, 129, -35, 62, 14, -94, 197, 69, 57, -34, -124, 9, -95, -252, 121, 24, -145, -26, -5, 62, 163, -21, 15, -102, 62, 320, -73, -28, -34, -163, -148, -109, -145, 89, -19, -140, -160, -4, -159, -87, -64, -45, -246, 15, 85, 67, 14, -6, 129, 37, -178, -74, 168, -75, -71, -79, -192, 121, -119, -22, 307, 173, -212, -30, 16, -26, 14, 94, -23, -136, -85, -63, 301, -80, -211, 117, 89, 44, -60, 71, -83, 151, -44, 27, -26, -58, -115, -90, -8, 11, 343, 210, 183, -76, 38, -37, -3, 180, 85, 132, 44, -121, -2, -3, 74, 65, -25, -390, 4, -14, -365, 199, -173, -41, -74, 11, 134, -239, 115, -9, -14, 223, 28, 319, 56, 264, 4, -72, -181, -21, -92, -257, -234, -171, 143, -176, -56, 46, 291, -73, 82, -96, 298, -144, -196, 77, -141, -125, 140, 104, -119, 137, 147, 56, 151, -116, 11, -124, 35, -70, 97, -53, 25, -19, -170, 58, 90, 206, -18, -93, -203, 122, 28, 293, 116, 26, 214, 159, 127, 43]
6993D3J1L9k08R4k1N4p8L93m53J51J79k92J77n7Q1Qj01p0L2K96n25L2J08p2K43
7018F4k51K20j62J39J8r0m1K0J56K7p5J94j68j10j15L08j05M6J71l8k85R0Q7k61
7042a61L23Nj23j48J67j15j78K36M8j60J88j5K64l10N3j49rJ77n7K1k49M2Q3p0
7066a37J00m2J88m41N05k14QM6Q7r7o6n5R7J97j03k98L11J83m00K10n4j0N0Q2
7090A47j13K8m5o1PJ53j33k0k2j39N8K12Q6j44n1j81J05j76K86k22J47jm3K15
7114I3o8R5J15k20n1J09P6k7o9J06j86Q3L2j26n9J40l6P3k12K52j11R6j85M8j77
7139b09J92k44K79p0j27J34n6J52n5k22K24l2jK86l75K77r6n3K55m00J69j22K94
7162B00k05J71k73J56k51K47m7J9M9o4R0j38N2j49n4O1J98J34j55j21J33k51J78
$$ y = [43, 54, 93, -115, -21, -42, 12, -66, 327, -126, 25, 204, -88, 89, 32, 113, 121, 20, -50, -18, 278, -247, -215, -107, -179, 64, -187, 33, -129, 10, 28, -62, -103, -83, 73, 100, 25, 219, 51, -59, -174, 134, 29, 75, 246, 208, -77, 13, 100, -161, 162, 167, 44, -104, 63, -52, -230, 6, 54, -106, 82, 67, 331, 21, 74, -75, -84, 93, 36, 57, -192, -150, -67, -137, -37, -79, 109, -332, 173, -41, -33, 13, 100, 3, -63, -118, -21, 176, 73, -225, 86, 269, -131, 79, 25, 15, 65, 147, 34, 62, 17, -44, -37, 116, -17, -37, -59, -198, -140, 72, 158, 14, -37, -218, -113, -289, -3, -225, -78, -79, -122, 93, 25, 120, 235, 15, -36, 73, 149, 122, 53, 159, -27, 56, 88, -38, -97, 43, 7, 80, -132, 120, 9, 105, -80, -32, -209, -17, -261, 18, -52, -179, -45, -101, 51, -4, -226, -2, -34, -35, 251, -124, 153, 57, 4, 259, -141, 28, -94, 200, -5, 166, -107, 49, -202, 45, -2, 17, 66, 2, 92, -46, 6, -143, -197, -136, 62, 196, 41, -80, 53, -198, -20]
7185b0k58J45L26j77O8l15M39k01J2O1j82L21k61q4K6j28J85R7j64P8K1K51j86
7208E4j10KJ33j41L5J56k0j30n7qJ77r9l4N7O9J26n6m10K48j07P3n6J88k9J19
7233A80l48o2J84j1n5J02j32j1J38R7r5K11j17n6j43R7L3j95L02m8n9J51l79K28
7257A2L5k75J57o8nL87l93L07j99J39J8p0j00P5l3P1m0k85L25j60o6L51k44n3
7281a14J52q4M9M0J19k02K16k40m8J30j70K26R2j43n0J39P3j03oj75J67j80M1
7304g1Qj8J00J9j23j02M72k43M6j31Q5l5k05M23k28k96M90j90j04P8O9j94M3j77
7328b84J79J39j6p7J00k57L41j91j31P9p4P0J79j30P0J33j31Np6j31J05J48o9
7351a9n3J64m38j2K62L20j62m16M09n6q2M4l5K28m37L63j8k47J54k7J54k13L08
$$ y = [-20, -278, -133, 193, 16, 84, -231, 208, 7, 19, 80, -102, 219, -42, -126, -100, -228, -43, 54, -110, -32, -11, 240, 54, -56, -54, 79, -62, -27, 129, 109, -21, -78, -86, 91, -8, -42, 15, 84, 210, 154, -256, -8, -115, -42, -98, 90, 61, 180, -168, -230, -46, -57, -112, -10, -142, -153, -15, 82, -13, 198, 81, 25, -118, -21, 12, -183, 119, 71, 12, 163, -216, 12, 47, -228, -71, -139, -144, 243, -150, 157, -42, 97, 115, 45, -55, 20, -13, 58, 18, -267, 58, -102, -168, 183, -61, -114, 38, -46, 3, 43, 162, -40, 176, -64, -112, 18, -152, 74, 166, 23, -27, 112, 185, 82, 76, -99, 68, -112, -71, -63, -81, 19, 38, -85, -187, 285, 42, 88, -43, 42, 7, -198, 225, -3, -299, 191, 1, -103, -25, 44, -150, -107, -284, -105, 34, 18, -59, 41, -216, 125, -66, -197, -118, -192, -122, 57, -73, -3, 130, -1, 4, -72, -203, -98, 50, -19, -72, 92, -346, -358, -96, 224, 62, -354, 55, -1, -83, -39, -74, 154, -283, 80, 62, -185, -31, -58, 96, -117, 191]
7374A91l52J30pj78K32pj90L25Oj99J12O6q3N7q8j60OL33k53O8J29k51O4L5j10
7399a24K56j72j9M0j59J68J19j7Qk44K32m05L80l4k19p2J5K86j45j18M19M5o0
7422A80j41j83K7K5j51O8O1j11J72j47K33N4j66J72J45m13L74k12q6MO7K34k17
7445a1Q2l6K3j50O2j2q7J02q9K33l86L25l5j06j03Q0K84p9j49J51m6j45J55m1
7469B2k4p7O2K01j78j1K59n20K42J16qj21P6j64J41R2j70O0J6j06J08k51J25Q8
7493b2O0p7j00J18K33m55J70j17J96Q1k60J03J91q1k5N0j9N2q8n2L1J42j45R9
7517H5j50K66k15O1J85j84O0j16j71P0K88j43M6Q0l40L13K9l75p6N14k61J80l28
7540a82K86k20J22J26j64K12k34O1j42l3K44J11k45J54m22M59o1j50O2J60J68
$$ y = [191, -161, -31, -38, -216, 16, 9, -181, 144, 150, -49, 63, 129, 46, 103, 15, -145, -139, 194, -59, 9, 138, -113, -49, -14, -124, 132, -40, -59, -19, -178, -10, 109, 92, 100, -144, 88, -317, 63, 29, -190, -262, -247, 39, -106, -224, 195, 240, 180, 39, -144, -117, -92, -243, -175, -114, -225, -53, -200, 33, 87, -79, 93, 238, -175, 199, -13, -99, -95, -28, 206, -11, 71, 35, 58, -92, -30, -42, -129, -27, -116, 117, -269, 56, 21, -85, -188, -108, 176, 97, -52, 99, 53, -92, 63, 22, -2, -79, -17, 184, 6, -5, 254, -266, -24, 92, 84, -37, 39, -125, 16, 108, -62, -2, 14, -92, 16, -235, -110, -22, 38, -39, -139, -21, 212, -243, -73, -190, 6, 87, -173, -70, 121, 40, 15, 65, 46, 98, 10, -42, -11, 131, -14, 85, -65, 201, -14, 47, 232, 48, 108, -8, -179, -109, 179, 36, 82, 162, -178, 135, 164, -211, -287, 227, -34, 146, -182, 104, -116, 6, 132, -32, 180, -54, 7, -135, -168, 76, 187, -58, 96, -326, 133, 72, -78, -16, 144, 312]
7561C12k98o3q6Q7J30j34Q0k75J58q0K98r9O2M3j81M3K62k2l81R4j9P5R4k87J74
7586a3K1K3J11j62j32J09K58k81J87P5l05k9J68p0L00j26j91Pn5P2r8J56N3k43
7610a65PJ41l7J19j31j52N2N0P8O3O3R3j18j59O7J96k57K2J42K04m10J71j43O1
7634d3J31j73K96j28j35L3Nk62K70M9o8J98j28j02J71l03L04k74K45l3MM4K23
7657C24k27q6p2K78j47j22Lj8J27J85j60j29M6J20j58J18K8q1L03j41j41J7J7
7680H4k74L62o8J68j85p8j73K17l3j26J83k5O9k85K00l7lk33K65J69k64L1L10
7703B74l06l26M31q2L2j03o9o8K63P8j76l7jK68j76k13J86m0K71j25o2J8k59K22
7727@l29M41r9J82K5R3j50k26Q7o0J01J02j36j5J4j28N39j26n35J91K53k60n1
$$ y = [312, 14, -49, -135, -48, 82, -52, 28, -247, -89, -169, 129, 30, 92, 135, -46, -3, 259, 237, -144, -50, -69, 6, 100, -187, -13, 8, 31, 142, -20, -152, -43, 215, -66, 121, 196, -109, -138, 30, -40, 260, 134, -57, -50, -105, -33, -131, 25, 78, -165, -158, -17, -54, 65, -66, -218, -166, -116, -38, 25, 88, 181, 63, -96, -29, 167, -90, -68, 74, 278, -132, 39, -104, -43, 88, -85, 211, 83, -52, -19, -14, -276, -6, 43, -25, 173, 45, -57, 114, -189, 115, -159, 86, 53, 57, 101, 324, 97, 11, -61, 217, 70, -52, -49, -67, 60, 245, 85, -44, 2, 122, -36, 82, 110, 29, 332, 191, 50, 67, 84, -190, 172, 104, 272, 87, 9, -164, 53, 20, -106, 77, 52, 121, -164, 36, -1, -4, -237, 28, 197, -67, -36, 274, -32, -358, 73, -9, 23, -80, -149, -217, 46, 124, -52, -89, -90, 178, 2, -211, -25, -65, 206, 81, 19, 37, -222, 0, -329, 112, 13, 195, 220, 313, 163, -63, 24, -36, 65, 167, 31, 16, 30, -98, 441, 315, -220, -29, 224, -36, -87]
7750h7N0l2k0K7J35k09J09K51j06M4k29Mo4jM21k84j01P5K06l9j12l8k2J6j41
7775a47O8J94k3Q2k98J93j15o9L09j09J59l89P6r9L0J11O7l4J36p7o9l3K25j72
7799A6R8J64p3l34j42J91K16j52m9Q8R6j67j44M97k57j85N1R5J7r9q5J21J2Q9
7823F4k04L08j32k38K02mJ71q3n7M20n18r8p1O6n8M83l86J92q1J82Kj47j24OJ23
7848A8J01o4J53r5j70M8L2k09M78j32k94j0jK69k34K68k61J1L2J28L1K10k68M3
7872H4J41k00k81J99J79Q1l32RJ73J45l56n4K43r3k04M89l05P5j35J28n4K08j07
7895C3J2J42l37J83n5q1K56o4lj29l8J12K9J81j15l46J22K14q0P6j86K71p1k73
7919a47J12J06j78J41L36m64J05J16K1j29Jl9j40K13j64J65j33J81q4m0j16L1
$$ y = [-87, -37, -69, -89, -62, 73, -136, -27, 224, 118, 162, -67, -63, -127, -128, 293, 9, -92, -17, 189, 150, 38, 0, -22, -6, -147, -79, 115, 92, 174, -124, 69, -46, -115, 194, 85, 244, -145, -69, -168, -138, -27, 40, 6, 142, 65, -4, -37, 188, 16, 114, 278, 205, -129, -271, -80, 136, -16, -65, 23, 119, -48, -192, 305, 48, -137, -86, 9, 26, -73, -158, -37, -25, 64, -140, 168, 36, -202, 0, -4, 167, 84, 27, 447, -71, -169, -240, -174, -232, 251, -135, 57, -24, 158, 160, 13, -111, -105, 18, 119, 55, 208, 113, -57, -9, 23, -186, 292, 160, -134, -144, -145, 124, -110, 158, -103, -92, -60, 68, 99, 309, 41, 84, 225, 25, -256, -57, 122, 203, -129, -120, 53, 198, -158, -212, 31, -62, -266, 223, -82, -7, -142, -14, -68, 140, 33, 45, 187, -150, 33, -22, -103, 153, 89, 86, -43, -81, 31, 60, 241, 126, -220, -98, 116, 36, 112, -74, 197, 126, -147, -35, 71, -107, 34, 370, -94, 11, 127, 148, 19, 20, -19, -159, 54, -110, 55, -78, 103, 19, -21, -137, -106]
7941a06P9j56O8Rn6K79j00j61K03l30K53k61J73j09L88m12M16k30N0j07r9L20
7963A11j3j49J09j55k26M54o5j76j98L54M1l77J78J89k91M61k33j9R2k6q2O1k69
7986b29K39n8Lj2j14J28j92K8J50J53k29J51k66J88R8j37j18K90p2P2K39l19J44
8009A37j88L0QK1O9r8r1K44j69R7J7j96K9J0J17r0Q5k15L23k13pj46QJ75k35L46
8035F8J54l84k7K75k52m2R8J46K10j36M0k54j25J17K53j37k19K39k0j8Q3N4j33
8058a0qj03J55Q2q7j91P6r9L79j22j01J2p1O8O0j25K84k81L3j27J76R1n5o0R0
8083F6r6K23j07j21o9r2K50P3j95j40K4LJ3K06Mj48K56o5j33j35L19p6Kj71P6
8108c3j27K31jj54K28l04K98o3j66Q4j56Q5RN7N7J7n2J55l5j33J35j11J97k97
$$ y = [-106, -27, -183, -115, -106, -162, 117, 17, -144, 59, -271, -18, -279, -106, -215, 173, -239, 177, -53, -3, -110, -209, 111, 98, -51, 58, -97, -323, 131, 66, -110, -308, 46, 87, -290, -112, 77, -214, 247, 14, -5, 87, 61, -21, 40, -229, 10, -48, -45, -57, -171, -43, -235, -207, -57, 96, -133, 18, -248, -60, 38, -99, -217, 73, 1, 73, 312, -7, 137, -51, -21, -13, 8, 77, -21, -112, 132, -37, 60, 77, -119, -90, -80, 37, -53, 32, -183, 140, -73, -80, -226, -218, -43, -278, 68, 222, -162, -189, 86, -166, -208, -110, 36, 246, 110, 150, -104, -229, -112, 141, 4, -215, 24, 4, -14, 69, 123, -10, -18, -121, 34, 116, 29, -162, -86, -185, 194, 72, -29, -17, -88, -20, 40, -85, 199, -82, -49, -176, 0, 91, 36, -24, 66, -30, 193, 86, -35, -104, -196, 54, 127, -68, -208, -184, -181, -168, 38, 42, -106, 150, 85, -48, -183, 136, 60, 62, -109, -33, -160, 71, 70, -84, 144, -160, 138, 75, -91, -7, -163, -78, -69, -12, 45, 62, 10, 165, 130, -3, 132, 21, 218, -79]
8132g9l23K35J97J49l3j92j18L14k34q6K05q0P6r4l0J12r5M7N9Qk8J05j42K32
8156B05l35j59M73%k38q6O0O2l9l6J72j20q9j7L93j45k06N2J8o2M1j38R5K02j56
8181e3j53L26o5J90k12r1K28k15p0K48
$$ y = [-79, -402, -167, 30, 179, 146, -46, -164, 150, -84, -170, 35, -45, 31, -63, -93, 19, -76, -29, 30, 38, 10, 115, -27, 205, -130, -289, 184, 184, -54, -140, -80, -18, -57, -93, 79, -41, -130, -147, 246, 101, -105, -53, -35, -97, -56, -194, -99, 103, -53, -206, 120, 55, 245, 33, -58, 170, -45, -115, 133]
8191A33
$$ Imaginary data points
##PAGE= N=2
##DATA TABLE= (X++(I..I)), XYDATA
0@%%%%%%%%%%%%JrJ6j6J6j7K5l2L3m1N1n9P2q5R6j10J28j49J69j91K17k44K76
35A47l12L50l92M38m89N44o04O71p44Q24r09J003j106J218j342J475j625J794
53I41j982K189k422K692k999L357l782M291m917N707o741Q159j0225J3515j9567
68a1784L4189j31208j33085L22506R948j05998J12523j4366j42489J42445R2610
79A75291j33219J0777Q7668j00660j7572R4916n2899p8548N3681K262n0101J6854
91H450J890o1665q22N8837K662n9503j6665K0307k457J7033L4758n0356m3314
104i0845P0444K0217n5928N5735M6490r2455L277J02081l7636l8294P3719k4110
116C2695n4074Q1646R817r5560K8127N5934m6700N53K8345n6640q614O8428q796
$$ y = [0, 0, 0, 0, 0, 0, 0, 0, 0, 0, 0, 0, 0, 1, -8, 8, -8, 8, -9, 16, -16, 17, -24, 27, -32, 40, -45, 51, -59, 69, -80, 89, -102, 115, -129, 147, -165, 185, -207, 231, -258, 286, -318, 353, -391, 433, -476, 527, -579, 639, -703, 772, -853, 941, -1041, 1148, -1274, 1418, -1581, 1776, -2006, 2285, -2632, 3075, -3666, 4493, -5732, 7783, -11784, 22405, -108803, -241888, 80618, 90566, -15432, 97091, 82725, -59764, 82681, 175291, 42072, 52849, 140517, 39857, 22285, 117201, 64302, -14246, 39435, 41697, -8404, 8450, 10340, -51325, -52147, 6690, 9352, -50151, -66816, -46509, -48966, -31933, 2825, -47531, -90845, -20401, -184, -56112, -377, 46113, -46342, -43065, 59016, 21380, -16914, 56805, 32695, -21379, 60267, 70084, -25476, 2651, 58585, 11885, 12438, 40783, -15857, -24471, 43957, 35161]
129C5161n2065K427Q670p803N444L537q438j5502n802J7086M459j0106J4698o390
143a4624k7300L6899L1912m4321Q54M4906k6228k939N5514l1041m5807N3969P000
156C8794n0831L3562J4850o6731J2251N1843l7559j7699L4126k7457k1543M9745
168A3351K509m1896J3164J6408j9828R919K0820k2137j6841K3402J2660j4364
180b833P28R981j4675l067L2250q82l3244J2450J9753k3460P321K8123l3880k1329
194b2764L9468m209k8468K3324n867l8280K9907K6775m0575k755K9511k0110j725
207a5768L4929j8386k6930K8166Q580j7053J4416L831k4807R123K4965q402j1661
220A003N347m28o38Q561R81j2702n970Q232M060o292j015p47j1429J728J5895
$$ y = [35161, -16904, -14477, -5807, -13610, -8166, -4629, -13067, -28569, -34371, -17285, -12826, -22932, -8234, -14624, -41924, -5025, 26887, -17434, -16580, 28326, 2098, -841, 54673, 23632, -22175, 31794, 38794, -12037, 21525, 36375, -30356, -18105, 33738, -3821, -21520, 12606, -14851, -36394, 13351, 15860, -26036, -12872, 3536, -16292, -6373, 14447, -7690, -24531, -1129, 11531, -2833, -2105, 7876, -6799, -9866, 22384, 21502, -11742, 708, 20461, -2999, 4322, 32445, -1435, -22764, 16704, 12495, -15973, 7351, 1484, -36796, -6889, 19886, -20689, -23444, 6067, -14043, -15768, 19161, 775, -26155, 2011, 10591, -6462, 7954, 11785, -13022, -3899, 21066, 12664, 1003, 6350, 5922, 5284, 13845, 14826, 2124, -3846, 4386, 8446, 2154, 1139, 392, -11037, -9309, 6586]
235F586q796j5654Q752J280p745J4442L871k1114M910J9091q253k82J3509j2268
249a671q126K0204L443j3894M671J269q221J0682Q738j4694m129R437k025k017
263C667M829n552r750M766O500m800m223j10l153o57O761J974q664l250O515J093
279d054j727M275r31m467O468N741l155K031K882o483K037J1045m266r777L379
294B998K949k813L484j64r900J37P663j515m174Q3l864l245O462K686o366l140
310h719L165J469J605K191m031l756N508M512k493j20J476k954J836P046l52m119
326B264J516P96q25L879R15n681k920K168J86r3J31l245k817J107J527k41j027
343b360k877j746L096L104k147l061J091K847J611R50n48j619R42L269O67j248
$$ y = [6586, -2210, -17864, -9112, -7832, -15577, -1135, 2736, -18378, -13468, 5623, -2630, -2912, 10597, -1671, -9797, 10407, 13850, -44, 4627, 5896, -2325, 8357, 17095, 2401, -1728, 7709, 5684, 3667, 8496, 2944, -6806, -2040, 4460, -340, -4563, -4673, -7826, -8483, -1722, 252, -8412, -11662, -5147, -4054, -5781, -1506, -2437, -6904, -436, 5305, 2150, 4181, 7063, 580, 2617, 13662, 9396, -381, 2998, 5947, 3134, 6618, 6454, -3446, -3309, 4354, 2839, -1335, -1252, -5116, -8361, -1899, 787, -5579, -8719, -5554, -4085, -2480, -289, -4320, -8076, -2568, 1944, -549, -669, 807, -2147, -311, 6735, 6383, 2264, 3780, 4576, 3751, 7630, 8545, 2864, -56, 2112, 2298, 2205, 2336, -909, -3726, -2619, -1092, -1333, -2360, -5237, -6983, -3887, -783, -2930, -5991, -4900, -2053, -442, 508, -40, -1659, -717, 2552, 3219, 1971]
359A971p51m58K2L452O49k126o8R60j089R51J434m206j744K635k206k706J964
376a316p80l025J616J632j821M88J214j222J113L094j872j464K889J030n96J499
392B479j45k437N73K241r89j544J105j201k041K604K768k949j905L625M89j595
408A078J558J4l529J062J265m261P07K809m242j267N221k611l194N399J33m726
424d584M198K529m857K181M427m741o78N726k389k802M334j325l234L850K59m170
440a276J860J619k512J567J713l489k315L772N10k213l27j306j216P35K331j93
456g40k923j96L311R53l19J835J7k667J963L287k088j947Q88p77k59J863j688
473E13l842J466K400j748k79J029j079m02L391J666k519o98L044q07j217K750
$$ y = [1971, 1220, 762, 784, 4236, 4885, 2759, 2691, 3651, 2562, 3513, 4947, 741, -1003, 1632, -574, -3280, -1316, -2096, -5121, -3505, -1873, -3694, -3206, -1992, -3214, -2101, 993, -879, -2343, 546, 1576, 980, 2479, 2334, -103, 470, 2711, 1722, 178, 1283, 82, -1959, 645, 3413, 464, -1441, 2184, 2673, 1078, 2636, 2650, -879, 183, 1448, -2813, -2106, 703, -3539, -4806, 415, -2196, -5390, 9, 142, -4584, -386, 2143, -2714, -533, 3894, -847, -1525, 4201, 1812, -990, 3344, 2019, -1215, 2635, 2894, -1276, 584, 2203, -309, 1258, 2971, -518, -2833, 939, 1449, -764, -1091, -2397, -3613, -2878, -547, -740, -3663, -3859, -548, 405, 86, 1921, 1938, -729, 1234, 4521, 2433, 486, 1374, 597, 338, 2201, 513, -3329, -1863, 537, -1211, -1490, -461, -1540, -1942, 1449, 3115, 596, -102, 2942, 2135, 918, 3668]
489C668j293n577K104L812n634j280N043m024l426P889k52o803O076L073p685
504d309M339O663r316n38J0172o358n330J0483k615r766R212L666j1358M634P378
519F957j0131m73J0743n593n814Q313j577p404O883L492r221P25O166n321j531
534c786O436k632o458O152L876n365R07L306n412o47Q587k485q023M473K070n258
550d259M931M759r044j353R440k544k503O482n506o393J1710K172j0708K634L337
565C155p645M730P349j0376n067P690q08q45M401n765m296P975K606k370K020
580B754m424k844Q985J502o516O01j431k916Q965J150j1786J483N887l184M271
595B497M000j1732j493J1773j212l683L794n437m620J0553K423q869k59J453l466
$$ y = [3668, 2375, -3202, -1098, 2714, -2920, -4200, 843, -3181, -6607, 1282, 1030, -5773, 303, 3376, -4309, 30, 6693, -2623, -3161, 7011, 653, -4677, 5806, 3191, -6575, 2637, 6303, -5055, -421, 6957, -3174, -3647, 7096, 1503, -4311, 4002, 2425, -4979, 1904, 5396, -3825, -3100, 3066, -2255, -3786, 2650, 18, -6440, -288, 3588, -1777, -870, 2436, -2976, -3623, 4964, 2479, -5544, -1071, 999, -4259, 672, 5431, -3613, -4966, 4474, 1930, -573, 5909, 403, -5990, 5720, 7892, -2816, -182, 3155, -4490, 240, 7589, -2787, -7854, -164, -972, -1817, 2584, -3181, -7477, 498, 3104, 734, 2754, -1670, -4514, 4471, 5973, -543, 58, -1373, -4289, 4676, 5826, -5960, -4477, 1410, -1774, 2497, 6497, -5235, -6728, 5045, 3833, 150, 3944, -1493, -6113, 4440, 6863, -2006, -2265, -812, -4278]
610d278M719L904o770m697M529K752Q90K1l219k275L598N478r95n358q9L064p88
627D86K183L548p292m033R005J733o394M221p75q760O944P718j1278k443P425
642B288o448o44J0182p387q338J0688J448p669P051J337r757O180Q390p740n67
657i86N774o093k11Q696l620n865L265J82j525L161j393l989J845J528m09O88
673A048q72j894R60J208L54k12k623k64K545j083k95J623k880j823M586P97k656
690a481J325m88k079L694J710l002R48R55k232K587K596l765o93Q94j100J327
706A196K040l507j424J583l42J113J264m160j153L424m17k98J606m091j790O026
722A070j72l184K666j189l129N267L063n126L47J775j716K832K620n225j826M350
$$ y = [-4278, 441, 4345, -2425, -7122, -2593, 159, 1049, 1070, -2149, -4424, -826, 4652, 3657, -1701, -1790, 1274, 486, 2669, 6217, -1075, -5108, 3897, 5630, -764, 3457, 2682, -6078, 866, 8584, -2694, -5137, 2288, -4160, -4804, 5378, -2009, -10347, 341, 1789, -5880, 1171, 2508, -7249, -1069, 7321, -419, -986, 4788, -1305, -1516, 7180, 3560, -2305, 960, 1142, -383, 2778, 1385, -2604, -759, 769, 360, 1048, 176, -1718, -758, 450, 804, 592, -2031, -2295, 250, -833, -1128, 495, -2385, -4208, 378, 1175, -1481, -156, -644, -2723, 971, 2681, -321, 627, 1582, -650, 1937, 4533, 768, 75, 969, -131, 1196, 3236, -271, -1695, -112, -454, 659, 1923, -2237, -3390, 34, -383, -681, 925, -3166, -4956, 1070, 898, -2286, 380, -809, -3938, 1329, 4392, -734, -387, 1388, -328, 2504, 5124, -101, -1927, 2423]
738B423m71j005J476k785k606L266J216j498r39j575J90K519j75l63r80j379O34
755b052L681j356j788P69m37L68L421j412l875K790J370j467K810k40m841K344
771H5L829l006L56R28m037L39M894j897l160J314p19r40L337o46l700N59Q50%
789a614K114j02l553M99K948K60L68k78k169P89K172O21l35j141j878K075K214
806B990r40j319n3j759J316K364j438k325P01q5J33J802j540k375J044R18l21
823h87R75j152k168J407K057q02m9M05j196M42K554J42j194m48M27O73J004l33
841A857j233l09MR73K98j214j243N01P46O62o57j899k09J225N07l97q4j071r30
860b473J716J786j401j144M15P7Q45J856q63j738P70J495M03N4n64j440M19J424
$$ y = [2423, 1952, 947, 2423, -362, -2968, 298, 1514, 16, -923, -2498, -2308, 211, 36, -327, -1307, -2686, -2052, 1629, 273, -1515, -746, -1183, -815, 2606, 1194, -2681, 109, 1479, 12, 2822, 2582, -2259, 85, 3914, 908, 1264, 2192, -1845, -1506, 3388, 1491, -1669, -355, -1074, -2014, 1323, 677, -3023, -2464, -1614, -1614, 500, 398, -3155, -2656, 292, 552, 920, 642, -1527, -738, 1434, 2055, 1720, 579, -1299, 776, 2990, 2050, 731, 678, -1081, 235, 2599, 1161, -1164, -463, -548, -415, 1387, -153, -2528, -1484, -566, -887, 88, -1064, -3232, -1825, 232, -570, -619, -214, -1410, -968, 1586, 1728, 534, 86, 513, 1186, 2190, 1857, 624, 315, 319, 1292, 1590, 376, -867, -366, 380, 1042, 385, -1514, -1723, -498, 9, -388, -472, -1543, -2473, -757, 1029, -372, -1516, -1101, -1024, -179, 1677, 814, -924, -154, 1341, 1744, 1798, 1234, -206, 213, 1637]
878A637K18q36j022n38O8J274J53j740r44P78N35M64k96l49j635P40J874j38j533
897a290M72K99l26J338L82j275m53J207K26L71K81j049k13J516M73j125O44m97
915I81r98Q24Q86j578q44Q25o71l57Q11j123q21J024j05L43J19q71o9J503O91
934E70q92M55j58o02J225Q15j020l49N68j6N35O03j463k34Q50m31R8M12q19r80
954h33J379J71j465J3N89n45k17J007m58j032Q00L29j95M89K76r04j83J423n15
973A29p62J244l60j177J138J001j613L29J839k166l30K627q51j978K578p2k962
990a386K415J098l430Q61K148k704m81K705k538j525L702p51k854K817J42l296
1006c077K730K898l642j42K977j439o25K769j306k404K412R22k425J127N04k708
$$ y = [1637, 1855, 1019, -3, -541, -473, 801, 954, -786, -1730, -952, -417, 47, -249, -598, -2233, -1493, 381, 243, -1290, -818, -519, -845, 493, 875, -400, -853, 354, 580, 951, 1232, 183, -30, 1486, 1959, 834, 1478, 981, -17, 807, 1693, 115, -729, 96, -575, -932, -121, -1244, -2065, -1041, -1146, -803, -684, -1555, -1624, -121, 570, -322, 133, -25, -627, 598, 1413, 393, 44, 612, 596, 1131, 1734, 271, 37, 887, 456, 554, 966, 147, -833, 546, 717, -748, -735, -146, -691, -908, 99, -359, -1391, -591, -262, -457, 32, 308, -596, -779, 644, 129, -633, 611, 251, -926, 212, 1213, -400, -71, 1768, -398, -728, 1899, 1048, -930, 1648, 1576, -1386, 1029, 2127, -1303, -442, 1706, -998, -1479, 1226, -1312, -2837, 865, 114, -2740, 77, 219, -3077, -347, 2551, -1091, -1233, 1744, 305, -320, 2449, 1143, -1261, 1151, 2073, -352, 775, 1279, -1429]
1022a429Q73K363k013j422J530j00r74J543Q4k092N07K037r23n86J202j391n42
1039a333K495J0k451J169J045j565J511J037k972L09K763j652r56K348k135j687
1055b064L708Q1l608J623R87k559K031J885l762l04L505k080j79K596k830j803
1071b773M728p78l377K635P7l102L351K060m521K59L202k035M26K494l120j804
1087b278M392j49k646J700n30k298K456J652l366q15K194o05k70J845j567k360
1103b645J968J888j323p56Q64j049M93K443r03k551J246J451q68O80M02k602j69
1120a431L628o31k886J778p0j984K928R60l733p0L109j698k70K064k921j087L688
1137A374l39k837K008m67k086K916J503l203j64K293j475N08K096k628j345L276
$$ y = [-1429, -556, 1807, -206, -1628, -98, -198, -1172, 371, 455, -1637, -1130, 907, -16, -602, 600, -791, -1333, 1162, 1172, -1279, -110, 935, -630, 881, 1918, -1054, -745, 2018, 366, -590, 1758, -377, -2064, 1644, 1725, -1883, -260, 727, -1832, 199, 2084, -1678, -1982, 1523, -557, -736, 1860, -970, -2773, 1955, 1177, -2200, 435, 512, -2590, 761, 2821, -1700, -1441, 1761, -274, 152, 2646, -474, -2278, 2114, 1965, -681, 1019, 489, -1809, 647, 2299, -1067, -1882, 312, -293, -563, 1282, -285, -2645, -677, 1211, -112, -868, -4, -1053, -560, 1883, 980, -1571, -325, 1126, 258, 938, 1340, -1262, -1431, 2197, 1566, -1320, 458, 388, -1596, 1332, 2292, -1441, -1511, 1598, -100, -370, 1694, -1227, -2314, 1374, 1035, -1802, 206, -261, -2347, 569, 2072, -1131, -1295, 998, -477, 31, 2127, -501, -1846, 1430]
1153A430k6j357Q90r76j101J981M95j805K11L07q15R57J383k292r21J888l98n45
1171f94P01j08j372N46J450l99n82J13J90O4J236m21q66K17Q22o72Q4Q89j119
1190G9j064J692m1j508Q32L22j351O67Q82j009k09J254p45m53J234o67n26J345
1208G34m78r29J126J8q62P34K07j534J129Q56j296o1N83m01L04M54q20K8N32l10
1228A4M03P4p82k74J069l12k19R0p28K31P40l23m48J4l82N33J148j152m73P07
1248g0j55N0J172n86j277J013N36n88K95J2j608R54J313j051M7L11j188M68J317
1267I65j026o25N38J72m67J075n35j244P12O51o66P83j42j265R74P13q11J71K05
1286A78j092Q18R27n88k59L57n78J85Q89m46q36O55m61J87O02k39o60K62L58l31
$$ y = [1430, 1404, 47, 937, -39, -1140, 841, 1336, -469, -258, 49, -766, 191, 1574, -718, -1639, 249, -149, -694, 7, -101, -1473, -927, 523, 124, -458, -345, -155, -91, 1145, 724, -142, 75, 897, 225, 309, 1198, 79, -985, 707, 666, -842, -10, 312, -1039, -372, 510, -499, -708, 546, -199, -652, 582, -85, -611, 734, 256, -673, 453, 471, -391, 343, 550, -984, 145, 1001, -295, -356, 227, -174, 130, 584, -236, -208, 324, 14, 417, 491, -291, -565, 504, 192, -27, 63, -665, -434, 306, -17, -465, -451, -833, -300, 848, -304, -777, -70, -225, -175, 997, 411, -866, 147, 683, 95, 390, 402, -1206, -252, 1061, 10, 57, 368, -820, -352, 965, -61, -686, -148, 24, -443, 632, 97, -1147, -435, 216, -450, 333, 191, -1074, -100, 613, -198, -27, 178, -914, -96, 831, 243, -16, 341, -237, -52, 837, 391, -445, 210, -251, -64, 538, 299, -361, -99, 259, -72]
1306g2L37m15o41L49N51N3j03l80j66M83L75n66L77k52n36Q25N87o22m48M78J46
1327C60K07k23k41n02O32j85k63M08o37l54N51L14k96k10M20l29K73M16j76j57
1347Hk54J43N75qq0o29j20J52K35J93o08j82o3M85N34l07k08k78M73O3K02l5m13
1370a22K51K09O9j73m97l2L19q2L05k63r5m43O31j55j19J07J02r6j0K01J41l98
1392a50j36M92L36j76l08j10N17k29nJ58l00l85J66N94o61j11j6k4L04J50m89
1413c83l18L82R7j67M68j03m05L70O89n95Q9K94m39j03O01k0o02o9N71k05j57
1434eL2j19m40K83M42l73k06N50m44J51O24n58j30K07L3l00O69j41o71J86N96
1455C86m61j69J08j05j27N76l14J34L19k56l18O69q5p27O35k0o06J95K98k16k51
$$ y = [-72, 265, -150, -791, -442, 109, 162, 59, -321, -487, -4, 371, -195, 182, -70, -606, 219, 806, 184, -264, 214, 360, 567, 344, 103, -399, 233, 48, -215, 193, -444, -798, -247, 67, -229, -439, -19, -348, -75, 341, 165, 8, -246, -103, 472, 464, 384, -245, -365, -213, 22, 215, -393, -575, -638, -153, 381, 74, -134, -412, 61, 124, 326, 291, -122, 129, 338, 407, 234, -263, -295, 24, -58, 247, -16, -111, -554, 77, -78, -197, -90, 12, -84, -94, 107, 248, -150, -286, 206, 542, 366, 58, -52, 465, 236, 231, 389, 89, -296, -130, 464, -197, -308, -324, -348, -44, 106, -383, -701, -319, -222, -389, 79, -24, -429, -59, 630, 35, 124, 418, -21, -124, 477, 457, -145, -214, 357, 152, -5, 27, -92, -532, -249, 193, -180, -386, 164, -280, -129, 495, -63, -193, 14, 47, -253, 416, 275, -396, -210, 386, -75, -244, -136, -241, -368, 208, -106, 28, 347, 91, -227, 442, 357, -370, 265, 245, -361, -166, 132, -84, -335]
1476c35N37J15o41L33L55q94J75Q37o16j09Q38q70l15R17j49p09Q09l4q63Q26
1496B07P12j664K93J300j163R7J042r81o11J193k37o67P65j61j036Q71R50j655
1514g45N79L91q57L67J717j620j228J619J32q50J146j79j562Q46J285j481k90
1531g30J270j007j67J468l40j320O28O66o38R97q5j607MK264p91j418J100l12
1549a8j201J587Q47k159p4J536j175J48J398j065j410K485K0j735J509r6j976
1566a379J655J547k209l18J492r49r7J446j290j328K062M8j389J190l63j259R78
1583a63R10j542L01Q56q51L06J004r32m96J121J90o21K36l72k26O01L32m97k17
1602f0k9Q8m19P85m97p72M63O90m05k08N94o19J63J111l08j240N48R33q20mN41
$$ y = [-335, 202, 317, -324, 9, 364, -530, -355, 482, -134, -243, 595, -275, -590, 327, 178, -531, 278, 244, -619, 207, 919, -745, -452, 848, -315, -218, 824, -157, -768, 425, 188, -479, 286, 125, -911, -40, 910, -745, -166, 225, -632, -265, 1452, -168, -1396, 223, 355, -495, 651, 472, -1090, -244, 1041, -440, -730, 540, -467, -634, 834, 494, -826, -198, 468, -170, 827, 742, -865, -861, 1403, 612, -806, 294, -18, -1219, 368, 1215, -944, -1018, 518, -657, -509, 889, -176, -1586, 899, 919, -816, 693, 597, -1379, 276, 1823, -386, -704, 788, -161, -258, 1188, -102, -1430, 632, 680, -709, 481, 118, -1141, -163, 747, -795, -494, 362, -489, -183, 821, -111, -607, 514, 704, 83, 319, -53, -279, 322, 654, 157, -60, -89, -1, -420, 365, -132, -904, -441, 249, -156, -364, 230, -389, -226, 885, 577, -663, -115, 818, -2, -6, 535]
1623E35j212K4J479o82q12J216q26o34J970l37j969J051Q50j370J157Q29k193
1640i24o0K129o31j083R22o61l47J635q4j793J90J107q66Q98N12j820r4J661l24
1659C67j189J102n82o25J526L29j122j97M60rJ78N58q11n10N97O84n96m9q5n45
1679e19J48J110n13r94L59O42q02O80K88q83J75Q82l07n94N99n35j09N50L05q82
1699d00O52j66k53N71K76j038L50M63l37j67M13m54j44Q41k63o27Q9j9j20L68
1719C5Q0m38K65j76m3J52J32k13K42J64k20J93m60M22N5k38k00M15k41l10Q23
1740D39l69m57M96N0j96K70kp29O53L02r18M72K13r20O31R53j095l92R82k66l99
1761b82R59o41j006J283K26q86K72M84j341P99P01j199M14K18m78J62R47m84n09
$$ y = [535, -677, -653, 826, 144, -668, 548, -278, -912, 1058, 721, -1248, -197, 653, -717, 440, 1269, -924, -984, 1145, 514, -569, 353, -308, -655, 980, 896, -897, -707, 400, -466, 432, 944, -876, -970, 691, 367, -822, 280, -302, -927, 599, 928, -194, -391, 69, 60, 238, 796, -15, -525, 72, 756, 160, 111, 26, -519, -371, 739, 226, -768, -409, 233, -569, 111, 399, -484, -309, 573, 266, -328, 271, -264, -373, 177, 482, -400, 252, 86, -167, 404, 680, -358, -8, 455, 118, -49, 364, -90, -234, 607, 344, -283, -194, -213, -333, 35, 115, -323, -58, -234, -277, -125, 7, -206, 36, 200, -20, 173, -287, 135, 190, -48, -248, 167, -74, -384, 439, 70, -387, 109, 159, -37, 233, 231, -498, 155, 457, -461, 11, 224, -696, -65, 888, -207, -599, 383, 117, -282, 677, 36, -970, 313, 539, -347, -75, 409, -932, -133, 568, -631, -217, 1, -477, -315, 632, 148, -361]
1780c61Q59J11k19r2k5o84P92k03j48K11m38o00M63N33m39j13l2K40K50M10n08
1801GP6J20k75N51j85o31K12J23l25O90R5j013J37P18m15L74l13k90j4O30j50
1822A22k46L28k61j18L91J92p47K62J34j37M4K50l57rJ34L35k3j46j71j15P7K58
1844A97k68J66k05l36O16J14l56J48k53L61K58j44l25k02K81K50j02m36j85L17
1864a04k5j35L08k02l80J74K06L77j01n34J55N03j05n6J0J64j35L09m3m06l13
1885c33M08q1J25P2m71j62M53j59J14K99m59M0K27j29j14L30j96k83L52J0qP3
1907A08m43l16J074k58l82L69l45J85M0J98j40j70j81J94J37K05n1m76M8M88N5
1928C39l61l64Q0L11M3L2o5l93M76J59l98L45k03m01J40O25l06l65M66J09j97
$$ y = [-361, 498, 609, 390, 298, 273, -411, 381, 178, 30, 241, -197, -797, -334, 199, -240, -353, -385, -145, 105, 515, 7, 83, 203, -72, 479, 294, -337, -125, -2, -327, 363, 458, -555, -418, 300, -115, 259, -54, -344, -358, 272, 122, -124, 204, -57, -175, 216, 408, -339, -77, 57, -80, -36, 214, -143, -152, -18, 317, 294, 148, -23, -138, -61, 197, -71, 95, -110, -446, 170, 284, -72, 76, -177, 184, 442, 298, -27, -229, 52, 302, 200, -236, -421, -104, -129, -264, 44, -158, -538, -364, -158, 219, 118, -416, -261, 242, 137, 81, 91, 255, 120, 429, 386, -20, -333, 75, -6, 119, 191, -280, -442, 11, -148, -34, 265, -194, -154, 73, -56, -170, 160, -36, -319, 33, 43, 35, 108, -335, -651, 423, 165, -217, 152, -193, -8, 32, 230, 90, -80, -261, -67, 70, 275, 224, -252, -204, 284, 339, -22, -386, -306, 5, 48, 80, 15, -378, 98, 257, -141, 204, 1, -400, -260, 365, 59, -306, 160, 269, 72]
1949G2M31l72l44J24K31k54M32p9n80N08M9m28J83J89o59M87M85n03q3j1kq3K95
1972H8J38m98k1J00j08N64k20m13J78L80k15J32J17m89j66O85K02m66j5J24l49
1993b52j1O02m43k20M19l02L0L68j8o17M14K69r5k27M80o71k38J075k42n55K97
2014F3J5m64M86K75n82k72P53o20J69O86o70o79J012K00p39N86J69j061N69Q61
2034G57p85m70M82k93P0R59m86r86O79M37l93L30l9j028N38N28J0l63j04j07j77
2055d41J034j5j075J23N48k49L41J77q80j28J138l01k78j1l31j63P84M34p01l86
2075c80M00N3J24M60r31k81L95M53k99J54k98o14P13Q27r25L5J56m85N17N93n88
2096G9o08O09K73k54K22k9q32K38P18m77q2J58J5m54O74L76r86q0M85p7K13J47
$$ y = [72, 503, 131, -213, -89, 142, -112, 320, 241, -339, 169, 218, -210, -27, 162, -497, -10, 475, -28, -111, -122, -124, -207, 88, 226, -272, -293, -193, -301, 263, 43, -370, -192, 188, -27, 105, 222, -267, -433, 252, 454, -12, -27, 97, -252, -263, 339, -104, -324, 95, -207, -177, 191, 173, -444, -30, 239, 144, -83, 397, -274, -512, 563, 321, -234, 63, 78, -386, 100, 375, -207, -479, 274, -346, -177, 509, -161, -840, 172, 372, -367, 219, 388, -673, -104, 757, -28, -498, -16, -309, -239, 720, 234, -752, -73, 364, -29, 301, 262, -766, -228, 300, 310, -53, -157, -264, -441, 593, 578, -497, -374, 174, -75, 266, 443, -437, -565, 573, 272, -6, -17, -348, -511, 273, 707, 6, -380, 20, 73, 197, 657, -274, -555, -160, 293, -6, 148, -150, -764, -51, 776, -149, -114, 42, -443, 74, 667, 79, -529, 80, 353, 99, 321, 292, -540, -302, 416, -61, -143, 15, 30, -424, 250, 626, -360, -440, 45, -32, 181, 328]
2118C28p39J72O34m4n31M48r4m42M26N14r10j12N89k08n76J124m40q03Q49L43
2138E28p94K05K29m73L08N07q92KN96l54j06N84j89k45K61K15o27J69L3l06L09
2159d0K95l87l18N16j54j1m1M5j3M53k51k30N7l0L48o3N5j4o1j56N89l15m22k63
2183d11M28m32N53Ln37MM93k28L86l28j59J72N89k86m56K76n8j70M87m49k94K13
2205b04M02k35J78k75k56K33N00j88l46L57n83N52Qm2k70K37k66K37J45Mn16L02
2227b6J65J80j75j82J40J95m14O50n00m62L02K64l22J95K8m57N21M76n67k95K83
2248aR2j83N83K8r04L24L75n29K67J24m32J51N86n77k11K35j60j50P31l37k56
2269b44M99j34l51M84J7n83K9N63n68j4M12k35l6M64n96K35L02m5j23J75j68j19
$$ y = [328, -411, -239, 395, 351, -180, 268, 174, -268, 158, 672, -238, -350, 239, 31, -545, 579, 139, -664, 185, 528, -266, -61, 168, -305, 3, 510, -382, -380, 216, -138, -244, 340, 151, -94, 167, 382, -245, -76, -43, -349, -40, 255, -132, -450, 66, -88, -99, -140, -95, -108, 345, 94, -136, -79, -109, 239, 176, 231, 217, 156, 0, 589, 274, -148, -411, 17, -415, 138, 141, -396, -392, 101, -127, 259, -69, -228, -56, 533, 247, -209, 67, 9, -161, 326, -123, -417, -204, 198, -37, 141, -134, -390, -157, 343, 155, -191, 166, -417, 135, 143, 101, -169, 68, -198, 39, 184, 188, -328, -26, 139, 319, 144, -38, 102, 297, -117, 533, 33, -429, -127, 137, -185, 10, 38, -419, 102, 578, 11, -284, -1, 91, -92, 491, 519, -385, -61, 314, -215, 52, 176, -256, -105, 481, -96, -307, -72, -232, -382, 349, 12, -244, 255, 121, -230, 254, 271, -312, -283, 280, -288, -302, 110, -125, -161, 303, -293, -58, 244, 199, 76, 251, 83, -36]
2291c6J77q9k06K82O4j87J50k32k21L56k6L7K33k52j68J98K10m24L37o0k18J86
2313A11j62j31K39j94k58K27M48o88K59K53o93O35L89m24k12N60j84M4O2m60P4
2334a05M43j91m90M41O7o33O56l09j34J47J32o7K45L7k21r9M27m38J51q2j64J32
2356e5K06k57J73P4j88r9J20P8P1j58j5j37l0K60k06J35k87J70M88P8j86Q4m49
2379a30J1K81O6k11m7N7o8J34O5m22L29L0r1p3R3M9J9j88j0J7M04m59J36J76l28
2404a60J51J72j94k28L76n6k12J48l4j82J58R1r6q1L16m80L01J20l27O35m18k40
2426b40L54r6o1N3K46j15k82K3N3n7L47j9j00P6l97J5L65k43j84L40R0m49N88
2449C07m71R1J83j73j85M34K7k90K15K31j33n3j91k28K11K37k04m1j8j97pM70
$$ y = [-36, 141, 52, -154, 128, 192, 5, 155, -77, -298, 58, 32, 69, 302, 50, -118, 80, 290, -134, 203, 143, -75, 111, -51, -182, 57, -137, -395, -168, 280, -408, -149, 104, -589, 46, 435, 11, -201, 359, 175, 219, 281, -179, -105, 338, 147, -343, 98, 165, -468, 188, -121, -255, -108, 24, -43, 202, 239, 18, -81, 346, -92, 59, -23, -187, -55, 151, -106, 67, 141, -47, -146, -26, 52, 123, -35, -50, -187, -217, 43, -163, -28, -315, -145, 343, 421, 235, 319, -130, -119, 162, 228, 17, -30, 27, -41, 93, 158, -264, 65, 95, 4, -69, 24, 73, 92, -96, -106, -89, 315, -144, -8, 168, -160, -9, 163, -31, -259, 117, 61, -151, -3, -37, -219, -61, 30, -66, -147, 169, -311, -10, 110, -217, 418, 0, -240, 114, 18, -43, 10, 256, 141, -141, -118, -65, -122, 225, 206, 106, 182, -215, -200, 165, -78, -262, 78, 168, -281, 307, -164, -73, 110, -63, -248, 186, 213, -77, 138, 369, 236, 183, -8, -236, -25, 212, 8, -33, -51, -248, -255, 215]
2471B15l80K4J05j31l1N08k3l33K14J09k72L0L39o11K26L09k78nP5j25j46O1L08
2494A88l28Q2L7j53K0M42p38L76P6j83K66J39o4l26q4N04N1l89K24j22l34L05
2516a1J40r9j95K23j64J57j49M0j40K37k17l7K71m58K17K85Q0j57k22K55q5O9
2538D0M44l93J9K83m07J15J96n11N0M77n0n36M65k64k74P8O94m35j77J99k5j1
2560b3J20Q3l20K33J20k25M36n84K8N5J27K39m67K73k66k57N46L06o02P1L26n14
2582b95N09o2k28j90P98j9p42L29j09l67M87M19p56k12P62k30k37M87m69k93L26
2603i2M17j58j78J83m00Q9N63k56m04L09q0r9M21j31o23L87M50k91r2k4j34k22
2625c65N01L24n27k60K78j4J07o4jm91N00J56j44J45l92j51N74J18k39r3J82m82
$$ y = [215, -165, -141, -36, -167, -198, 310, 287, -46, 168, 277, 5, 35, 374, -237, -11, 298, 20, 15, 90, -35, -181, -120, 188, -140, -58, -21, -174, -154, 288, -450, -74, 2, -181, 85, 224, 160, -166, -250, 254, 305, -84, 140, 18, -316, -11, 129, 30, -165, 58, -106, 51, -98, -58, -198, 39, -178, -215, 56, -402, -185, 100, 180, 23, -199, 56, -29, 40, 484, 91, 110, 393, -14, 101, 297, -214, -164, 313, 263, -273, 192, -72, -346, -268, 426, -9, -186, 13, -12, -23, 97, 180, -140, 93, 213, -12, 424, -160, -132, -77, 50, 289, -178, 95, -171, -428, 118, 424, -178, -107, 219, -295, 214, 152, -76, -266, 532, 513, -229, 100, -9, -376, 111, 530, -226, -438, 324, 94, -143, 344, -125, -418, -92, 325, 167, -11, 172, -228, -139, 424, 168, -236, 73, -7, -106, 315, 184, -439, -52, 398, 107, 15, -9, -143, -365, 136, 460, -67, -327, -49, -63, 44, -20, -21, -512, -12, 144, 0, 145, -247, -398, 176, 294, 55, -38, 144, -338]
2647c38L48M49l58n44K63k9K84P4q4p9j28K27j61M4p5j2K21K64n87J07M4q6Q9
2670f7L8r7Q0J9K31n4j89J6K15l59J16J55o4l09M55o4k99j4J81l33L59K33j99
2693E0p2K17k77j26M16l21L6J95n6j50K25k58k7L54M6n45p7K37Q4J36j9l45r7
2716c74O31o6m06K94j64o5K15j76o1K49M0M4j90Rj20P2K80j42m5j18K18O6j24
2739F7L08m14m11K03O68m00J11j01p97O91N02o13O9J50k32J82L85k91n32N20K14
2760B79m74J05K36k88JL32j12l68N17l29j68M94m5l24J01r1J43K65l02j45J33
2781d0K72m93K69Ol28K03K47o8j52K63j80J80r0j83q2j37J14K41J85j72J54k09
2803@o6J80O7k39J27j10N8R1N8l83M0M57k72j31K75k43j84M97j57l07K69K03m42
$$ y = [-338, 10, 459, 101, -443, -180, -209, 75, 149, 65, -14, -142, 85, -76, -32, -107, -119, 102, 366, -221, -114, -70, -156, -67, -29, -126, -46, -27, 204, 150, -39, -23, 192, -167, -51, 104, 40, -269, 186, 122, -177, -191, -10, -343, 16, 249, 50, -22, 195, -82, -208, 208, -113, -77, 118, 62, -88, 137, -121, -148, 206, 252, -293, -370, -133, -49, 87, 68, -277, -374, 257, 191, -215, 79, -85, -150, 65, -111, -172, 77, 117, 161, -29, -20, -140, -68, 212, 70, 25, -93, 125, 191, 67, 375, -39, -450, -247, 421, 21, 132, 31, -766, -75, 427, -186, -117, 33, -199, -17, 368, 77, -455, 65, 279, -195, -90, 146, -142, -141, 191, 79, -289, 228, -101, -269, 225, 180, -144, -43, -134, 9, 274, -28, -173, -40, 232, -261, 8, 14, -314, -111, 136, 68, -84, 179, -1, 179, 89, -94, -176, -313, -199, 42, 227, 55, 209, 0, -66, 114, 181, -58, 69, -41, 17, 108, 166, -217, -177, 280, 8, -123, 152, -91, -275, 222, 65, -242, 27, 230, -212]
2826b12M06j58m45k6P02n02M14J46m41j92M12j51K3K34n15J44K61k56mL83n23
2847c00J01K82L5m01M88n8k78J09K2j02k61L20J41j79J29l43K11J21j51l7M86
2868C35n11K11J00k47O5O5Q4k00J46j26q1N7J60K44k09n5j01K03p2j33J6j50K30
2891C1q1j4J60R2l55j01M02Rj16j06K01j74L36j29p4j53K41K1j86P0j06J83j32
2914A9r1o0J35J5j93K55l9l13L28P4j27j53Q2n7p4L21q7J75l43R2J39J63l87J59
2938C3N8l12J89O1k19J37J99j14j05R0k18K68J21j58l0O3j35o0N39n18j25L54
2960A18j27j63J65J24j33K53l01N8O1j55O0J04J71l22P7J49l86J23J74j11k1L87
2982C05k15Q8Jj99j67J61n9K7K49L1k37j54M05q6l97K28l5j7O5q5K0P2j86m6N24
$$ y = [-212, 194, 36, -409, -435, 267, -235, 179, 325, -116, -308, 104, -47, -24, 210, -305, -161, 100, -156, -160, 223, -300, -199, 83, 118, -283, 205, 147, -131, -22, 0, -102, -363, -43, 98, -81, 48, -295, -84, 37, -114, -151, 335, -176, 35, 135, -112, -47, 18, 102, -98, 48, -78, -159, -102, 58, 302, 93, 38, -63, 140, 68, -65, -49, -199, 31, -50, -64, 96, 188, -167, -268, 134, 143, 27, -79, 122, -52, 284, 155, 81, -72, 169, 190, 4, 74, -32, 151, 19, -72, -132, 3, 18, -175, 80, 41, -272, 56, 130, 3, -150, -68, -125, -199, 122, 35, 210, -133, -41, 98, 261, -126, 33, 91, -221, -32, 29, -190, -53, 146, 32, -73, 17, -201, 67, 188, 30, 0, 63, -72, -132, 407, -111, -236, 118, -9, -172, -7, 117, -16, 237, -64, -6, 55, -100, -40, 64, 235, -87, -10, 139, -247, -124, 50, -61, -82, 305, 90, 178, 179, -20, -187, -26, -85, -58, 191, 222, -15, -169, 236, 150, -247, -19, -54, -71, -6, -91, -71, 1, -185, -231, 293]
3007B93j88l39J30j44L27J04j66L0L03j76k62L01l78J33j94K29L0j21J60m15L75
3028C2k30oO49o17J26J47m00M44j32n7j54J34K16Q9l37J73l28P6K72j92l95P64
3050B74j64k66M10j94k65L44k05o2K35qJ64m42M11l84j04L92q5q5Q3L7r8n7K73
3073B04k77q3J53m0J06J15p3k46K56K0m43K21J70k3Nq7K8OJ39J30k83j92J7J20
3097e7N1N2k06K51o5L0M4k46L6k87M30L97l99J7jj65J95J91k4m41J64R3j28L82
3121C14m49k03K05L88q9j19J70m85J26J15L44m69L21m3j88L63r7l95j4J90J31
3142A16P8l54j59L28M24m71L6r4L6l0J23J55k44q5J86j08J98k36k1J7R3k4K06
3165A70k22J57k33L56M7j31j25k13K84r1p7N0j81L00J8M8m40J2J34j11M38n0j14
$$ y = [293, 105, -234, -104, -248, 79, 183, 17, 47, 350, 174, -88, 213, -165, -32, -226, 3, 33, -88, 72, -343, 32, -198, -204, 445, -172, -46, 101, -299, 145, 13, -44, -198, -64, 152, 241, -96, 77, -251, -175, 97, -95, -490, 274, 110, -156, 254, 60, -205, 139, -66, -128, 107, 99, 263, -179, 232, -152, -256, 136, 51, -34, 49, 86, -12, -69, 204, -73, -156, -3, -43, 63, 178, 105, -141, 115, 135, -308, -87, 83, 60, 65, -22, 6, 12, 151, 281, -2, -194, -177, -57, -6, 46, -160, 91, 26, 56, 100, -146, -110, -397, 33, 430, 31, 48, 47, -118, 77, 268, 244, -197, -33, 60, -68, 314, -135, -338, -133, 255, 166, 47, 217, -268, -142, -27, 317, -152, 169, 126, -62, 301, 204, -191, -205, -15, 116, 194, -160, -319, 9, 433, -38, -2, -96, -60, -90, 33, 188, -56, -141, 45, -63, 135, -101, -122, -105, -12, -36, 170, -52, 105, -128, 228, 275, 144, 19, -194, 90, -1, -78, -28, -209, 91, 109, 157, -283, -271, -137, -248, 190, 140, 26]
3188B6m3K27l1k90M42m23j42M16j01p4J05J8l43L48O3j81j40L1J85l99K53J54
3210A01j86K52j57j79K70K30m13L11q0j07m93M08K75l95P7J32k37M5M15m88J37
3231h2P0P4j20p7K30k59J51Q7j37k13K11K78k39Q4l95K25K83j75k45L15K6j65
3253g3L4Q0k30L54k37K48n7N8k21o8M13j52k10J6M1k49K07O9L0N1M1k01OK45k50
3278e5K8L38l28M0O1k05N2j14M44k43R2J52l63K09k16J33p3K20j30k1p0J08j47
3301h8j6J7K01j39J05J47l28j9J61q5K5R8o3O6P5j88N7m6K7j21J38j06j99J04
3325a77M06k99k4j41J11J73J2J10j81N1r0j71L72j58Jn6R1j41q4K69j74o6M59
3348B93j04n03K25m2Q6J81j78r3J87j26J34j90M04m35K44J61j88M7l1j15K74l06
$$ y = [26, -17, 210, 179, -111, 331, -92, -234, 182, 81, 7, 112, 130, -213, 135, 198, 17, -123, -92, 93, -306, -53, 101, -85, 167, 10, -169, 101, 331, -82, 229, 149, 42, -451, -43, 232, -163, -86, 46, -191, -146, 269, -219, -82, -12, 62, -58, -135, 95, -164, -13, 74, -63, -276, -65, 213, -26, 58, -337, -112, 171, -4, -249, 66, 92, -73, -39, 41, -189, 165, -72, 176, 119, 177, -44, -112, 301, 149, -61, -45, -4, -253, -46, 23, 53, 104, 145, -56, -50, 195, -55, -27, 311, -17, 23, 84, -121, -69, -183, 261, 18, 110, 262, -101, 108, -108, 25, -48, 172, 42, 21, -49, 59, -88, -104, -87, 114, -25, 80, 227, -101, -120, 41, -44, -19, 79, 16, 82, 157, -31, 26, -20, 7, -114, 24, -82, -281, -177, 229, -70, -94, -235, -124, 49, 61, 171, -10, 41, -49, -220, 152, -6, -5, -61, 30, -111, -195, 74, -100, -166, 293, 189, -314, -89, -131, -45, 136, -42, -135, 52, -74, 60, -130, 274, -161, 83, 244, 56, 103, 72, -43, 231, -75]
3370g5K11n1l19J48J06J09j99l5J84j56J66j34n2qL65k70o4k5L39m82L54p9p1
3393c8Q2j70K00j24J98k97J43r3j37Q0L18q3j63k58K73O9K58o43P98o40K37L1
3415D1j8k7j05J47j31l6N0O1J32J49r0j9j73k12R7K08P7k34K10J27r7j71P5n1
3439A0J3J59j08j9k0J45m44M31j86R3q7o0j19K06o9J19k14k4N3J02j13K09P2j10
3463C9j10j0r4K29m1J20j75J83o8r7j17J98k50P9K89m01K43R7l00J58K17k89K57
3486A57N2j67m8Q3J10l35L71j89K46r3j58j0K72k49L9j13O2M1j52J40n8J70j58
3509A3k29mL84l43L78l64L10q2k42K89M4l51M0J31J98lJ09k23p8l7J39jl29N06
3533B55m91J87L3J57L3q4J10j80l3mK72k81o5Q5l7J37j28j64L78k88J41J65j45
$$ y = [-75, 136, 85, -234, -86, 20, 129, -70, -105, 79, -77, 89, -45, -97, -105, 260, -10, -74, -99, 240, -242, 112, 33, -38, 44, -126, 74, -50, 148, -149, -6, -99, -236, -156, 162, 79, -84, -342, -69, 0, 258, -385, 413, -227, 10, 41, 23, -4, -109, 38, -93, -129, -79, -18, 114, 263, 173, 154, -19, -231, -134, 74, 151, -83, 127, 254, 157, -14, 61, 10, 23, 182, 74, 55, 35, 180, -264, 167, -19, 74, -13, -73, -192, 14, -55, 64, -150, -174, -121, -19, -132, 77, 149, 39, -71, -81, -175, 54, 13, 133, -42, 141, 73, -24, -141, 57, -193, -114, 175, -226, 17, 114, -186, -28, 189, -100, 157, 209, 42, -6, 77, 187, -148, 223, 34, 280, 187, 29, 19, 291, 42, 81, -32, 30, 71, -81, 59, 1, 171, 13, -216, -220, 164, -179, 199, -165, 145, 63, -179, 110, 154, -197, -157, -26, 172, 169, 278, 55, -23, -60, 79, 78, -251, 255, -236, -49, -16, 141, 174, 90, 200, 20, -13, -17, 255, -26, -91, -6, -43, 94, -34, -198, 180, -108, 33, 198, 53]
3556E3k31R4J23k23K88j46j03J04J81k23K53k85J79J82r7M1l54K14r8R2j15J67
3578I6q6q1M3lk96M93j50N2J08M8j83J08k80J06J52Q4j45r7K29j28k20K19l6j49
3602a16J27N1J65m60K84m3k4Q6l5k48J90K44n15M49j41J15k23J61J66l52j14J33
3624a00J93k77L02l05L26n4nk09J74M0j99N1J60k3k32L58l29J23K58l04j3Q1J8
3647C4O5k41K6j18J50K18p6l27L48j01O2j1M0l73J22J84l9n0J20k17m8K40K63
3670B71k27m4L62l17Oj51m9K70J79k47k44LJJ06K17k8l6l0o7k78L00J00j26m7
3694g6K98J3j7j82o1J55j45K15j75j81J91r4R1j47j58J84LJ50j89K91m74m1M97
3717A48k45J15K8l0o0O8J0l5j58J66K4j9j20R8O9o3J60q4r1K24m01L44j59m5j5
$$ y = [53, -178, -84, 39, -184, 104, -42, -145, -41, 140, -83, 170, -115, 64, 246, 149, 190, -164, 50, -48, 44, -71, 96, 10, -71, -28, -31, -327, 166, 16, 68, 176, 224, 41, 149, -131, -25, 127, 211, 66, -31, 198, 70, -150, 69, 33, -116, 11, 62, 227, -233, 51, 8, -16, 70, 35, -213, -23, 221, -294, 155, 14, 129, -94, 67, 233, -119, -233, -100, 93, -184, 118, -187, 139, 85, 80, -129, 45, 85, -114, -63, 97, 74, -158, 200, -129, -6, 252, -52, -65, 16, 34, 99, -142, -116, -234, -84, 134, 58, -269, 79, -22, 40, 29, 69, -304, -182, 2, -37, -87, 33, -184, -232, 8, 271, 44, 0, 362, 45, 51, -100, -149, 121, 300, 53, -191, -188, -187, -81, 136, 108, 72, 42, -25, -303, -3, 97, -29, -76, 222, 235, 218, 36, -25, 130, -15, 200, 25, -156, 35, -59, 32, -115, -273, -89, -86, 64, -125, 166, -308, -349, 148, -97, 18, 46, 16, -44, 24, 34, -1, -159, 7, 31, 12, -108, -10, 59, -4, 156, 72, -19, 205, -196, 148, -11, -56, -71]
3742g1j5M30l59%k8j42l8M13k68L03q2p0m8PO6j23j65J42L29l52K01l65K40MO8
3767G7o3J2Np2j24P3o5K64k1j26J7M7K42l69J43k86K98R6P1k24R4L2m09K75L5
3792B2J36j30k14L20k63J16lJ33O2J41n99L13q7r6O2K16m16L38M8J41l9l11J21
3815A1L0l78L74J2m0k25J78j30O6K25k66P7K29l89L17J56k42j17K86j83k14J81
3837d2J43l16M42l19J96j34J8J50j51K54k33M3m8K7n8O6J4k17K32L7j21Q6k53
3860a84K98k93K06j05J22Q9l03J23o4K9O2q7J51QM4j3K19j36j02k40R2J96j3j72
3884g3l1R4J36k81M3Q1J43k34K33j49J22j93k1N6J24L6r9J22M5j02r1K16k71K96
3908B02m7k67L4OJ9j22k9K79k51J32k70K57J23M1m00K38k34L54K19l44k06K78
$$ y = [-71, -86, 344, -15, -15, -43, -185, -223, 190, -78, 225, 143, 73, 25, 32, 98, -25, -190, -48, 281, -71, 130, -235, 5, 9, 77, 14, 26, 31, -41, -165, -92, -157, 107, 86, -40, -23, 24, 266, -103, 40, -246, 52, 148, 219, -5, 89, 121, -288, -13, 22, 158, 28, -186, 134, -129, -13, -16, 117, 179, 320, -279, 34, -53, -149, -87, 129, -287, 51, 99, 240, 201, -110, 11, 41, -337, 37, 49, 9, -216, -38, -168, -102, 123, -143, -66, 163, -226, 91, 247, 5, -112, 174, -9, -223, -42, 101, -215, 227, -92, 104, -30, -12, 138, -13, 241, 8, 51, 3, 30, -28, 38, 52, -165, 67, 104, -17, 69, -184, 114, -179, 27, -78, 44, 133, -170, -47, -111, -82, -20, -107, 44, 52, 96, 83, 302, 166, 64, -176, -84, 112, 99, -73, -104, -10, 126, -155, -112, -31, 112, -122, 111, -38, 84, -109, -130, -74, 50, 86, -13, 109, 154, 52, -39, 177, -94, 202, 155, -112, -78, -72, -53, -175, -204, 75, -176, -44, -314, -57, 66, 107, -293, -55, -289, 65, 284, -60, -266, 12]
3930A2J8k0J88l3j02k19L82n9k71K11l46J90K90j84q1L5p7N8Nk53K87p5%R9K15
3955B70k94K9M2j39R1J97k05R2J17k83P9j97J17j21K09q9p0R5L6p6J69J34l22
3978a19L36j96J48k28r7m2J32J01q8J32J68Q4l57j06K31J6j32J59k13J0J32k91
4000b20J15K45l60M84k48L4M6%k30K07k06o0K87K12r2l70J71R0k55L03k31J39
4022F1K03p7r9l12Q4K65Q6j49n9J99l14Q1M2o0J29j88J62k03L9p0L9M10j09l15
4046a55J39M1K48l91J90k17J50J24o9j61K13j92J75p2j38J34M4k0r5Q5j11J79
4068A01L78o66L22Nl42J92N8Kk28K9K07P5k12R5J92l40jK70j06n3N1o0j86J31
4092h6J81r8j25J81L7k6J78k87o9J69k64P0J02r8M7k09M43m6k85J41O8J8lm0p6
$$ y = [12, 30, 10, 198, 165, 63, -156, 226, 167, -104, 107, -239, -49, 241, 57, -24, 11, -66, -8, -3, -256, 31, -44, -44, 55, 270, -24, 5, 47, -92, -1, 196, -9, 83, 200, -83, -4, -201, -84, -205, 4, -85, -155, -60, -24, -100, 69, 203, -119, 217, 21, 169, -59, -156, -198, -66, 35, -53, 79, 247, 331, -26, -132, 99, 115, -17, 142, -71, -61, 71, -220, -105, 140, -220, 264, 16, 50, 96, 96, -134, 73, -133, -193, 94, 306, 214, -156, 15, 105, -150, 153, -78, 61, 264, 187, 88, -224, -140, 125, 211, 62, 3, 202, -112, -31, 11, -49, 80, -108, 54, -149, -110, -180, -141, 269, 160, -155, -16, 25, 273, -118, 72, -145, 5, 129, 60, -101, 112, -80, 95, 23, -115, 19, 63, 43, -52, 33, -78, 101, 479, -187, 135, 140, -202, -10, 48, 50, -178, -149, 58, 133, -79, 16, 208, -132, -133, 137, 31, -22, 29, -31, -217, -86, 95, -3, -128, 53, 90, 64, 242, -45, -114, 55, -209, -139, -37, -135, -88, -297, 146, 100, -185, -44, 24, 42, 39, -1, -77]
4117g7N9L4O6l12J78K2L9Pj06r3N5K20r7L6L32o44J66j43J41R3k0j54K90j17l
4142b8J73j90J0j65J57J0R3j74pJ13L5J22k56J57j25m2J31M3J7k08O8M86n68O3
4166h5N7K74l95J30Mj85J32N15n14k15L20R6k31K00j21j57o3J69n0O5J0NL2K03
4190A96j32j03Lj23rK12R3j63n3K5J91r1J06k01J21j24J00j79k5j13L22k44M74
4213B83m19M0K06k22J12K48l14k42L27k7l60K77J89j00J24l0j75k5J13k4j52M37
4235B66k84k35K39J44k39J39J17l82M81n5k24J29k08J5M3j15K37J6k59M06k41
4256a0r9L17o8j69O7k71J66%K05m22L97J40o4k87K97k14J50P1O5j72l4J04j85
4279a6j8L02n28J95K69o6j81j16K47j54K95j59l7J44N9m15J07K0K24k58q2L0n7
$$ y = [-77, -18, 16, 82, -230, -52, -30, 9, 16, -90, -183, -128, 92, -5, 31, 363, -281, -115, -258, -117, -24, -44, -198, 92, -25, -28, 145, -45, -35, -200, -43, -33, 60, -114, -121, -8, 27, 149, -107, 50, -75, -117, 14, 57, 74, -134, -66, 420, -148, -85, -28, 246, -149, -19, -15, -200, -68, 447, -67, -282, 38, 134, -97, 103, -18, -175, -238, -69, -119, -54, -44, -39, -7, 196, 64, -39, -36, -159, -168, 44, 137, -26, -79, -54, 137, 46, 152, -49, 72, -52, 48, -131, -156, -269, 53, -191, 283, -136, -96, 110, -112, 0, 248, -66, -308, 19, -8, -368, -91, 98, -2, 122, 92, -83, -108, 5, -19, -171, 266, -18, -253, -14, 130, -109, 30, 147, -235, 246, 191, -33, 96, -112, -97, -54, -169, 68, 84, -175, 231, -10, -109, 208, 140, -29, 38, -233, -67, -67, 138, -284, 113, 253, 189, -98, 199, -15, 135, 206, 271, 99, 65, 169, -16, -34, 268, -260, -65, 204, 138, -43, -159, 88, -66, 229, 70, 33, 177, 236, -179, -72, -52, 172, -86, -168, -138, -195]
4302a95L08k17K6J39R5j28Q1N2j23J8k46J23k49M18j28mj9qR8q8P4q7r0L10o8
4327I2lQ0j08J43k88K14m35L63J6n3j56L82k30j03J77j43k7K51k10p7K01j41j14
4350a69K93j89J15k52K25Q5q7K4j26r4J91k1m2L0J46K3j68K6o1P7J1J60k21K89
4374B65n48K98n5NN3J61k39o1J45j17k22L37K07k33p7P6J77k87Q5O2K32l89L8
4397h7K07m7j89L2K39J1k62j2J35mj34K12j57j2K52l0j25J07o7%Lj39J10qK00
4422B35J2k33k15J96K02k70k18J90L1J22j00J62k01K89K7k10J94l29K04l78K74
4443a6k4N5R0k10%K11k46K90j73J21j50j4J48p8m5j36J25j86J79p2O5R0k48L43
4467A19O6L3k57M9j69J51j70J20Q4Pj8J86j46k00L56l49J41J34j30j81J76p0O6
$$ y = [-195, 113, -104, -78, 61, 156, 28, 109, 161, 38, 56, -190, -67, -316, 102, -26, -30, -49, -57, 41, -47, 27, -60, -150, 160, 92, 89, 169, 61, 204, -84, 130, -305, 58, 74, 21, -135, 247, 17, -86, 91, -52, -79, 172, -38, -115, 86, -55, -169, 124, -65, 50, -202, 23, 108, 21, 45, -81, -175, 16, -5, -47, -17, 129, 152, -16, 10, -51, 26, 37, 197, -24, 265, -283, 15, -40, -35, 18, 179, -60, -121, 24, -93, -315, 22, 229, -4, -81, -5, 172, -115, -30, 32, 264, -125, -87, 120, 73, -116, -84, 155, 166, -96, -108, 27, 23, -111, 101, -56, -68, 184, 154, 29, 136, 69, 69, 72, -67, 43, 35, 235, 247, 14, -201, -5, 197, -73, -291, -101, -70, 52, -48, 114, -87, 202, 229, 19, 213, -116, 88, -290, -16, -40, 15, 105, -105, -105, 106, -140, 150, -23, 98, -52, -66, 82, 4, -41, -177, -52, -238, -59, -131, -66, 24, -224, 119, 185, 218, -39, 10, -159, -8, -178, -58, 26, 33, 15, 201, 55, -145, 211, -138, 3, 137, 7, -174, 2, -68, -2]
4490bK07n75Q9J64K28k7j15q1J02m2K56j92l03K75m3j7K80m40J84Pk7J80n5j44
4514i1J90J72k76L7j78K58l68L61j19M7k35J62M26m34J01J30k55J31q3Q7p8mj05
4537a24j19K02L34l60J08P6q5J81j12k21J46J07j51Oj92K34j52P6M6J38k25K84
4559A97j65n8M7J75J27m25J54l2K25k41p1p4L03m38K80J19L7j25J58k78K13j7
4581A11k5j9O9l41K43j16j5J96k52J39J31j60k9j49M57r5m9J07m02K31p5P0j22
4604i5j55L58Kk83J42pn6K48j69n4J66k11J46j77N36n43L17l19R4k11L84p8j03
4627f8M4K6O7L8L6K12l12n4J19j23j67j06L11J59k89L84j95k43Q5Q6o5K21j62
4650Dr0j94N2J37r5K32j68l9K03L4r1k21M02M2l67j29M43l41J20M34l51R3k11
$$ y = [-2, 205, -370, -281, -117, 111, 84, -31, -112, -10, -52, 204, 12, -291, -16, -59, -76, 204, -236, -52, -45, -72, 108, 53, -91, 99, 271, -5, 32, -146, 112, -256, 105, -14, 33, -202, -40, 386, -48, 53, 183, -72, 59, -24, 63, -15, -19, -124, -243, -41, 293, -67, 41, 117, 32, 213, 101, -120, 26, 133, -18, -12, -204, 30, -122, -46, 0, 138, -87, 197, 32, -26, 21, 196, 323, -102, 52, 20, 245, 4, -67, -141, 162, -276, 4, 123, 160, 35, 193, -85, 128, 111, 86, 67, 136, -205, 38, -78, -93, 103, -149, -10, 121, -39, -68, -217, 240, 145, 96, 203, -199, 32, -43, 27, -95, -250, 108, 110, -173, -31, -38, -94, 154, -15, -69, 97, -114, 32, -145, 391, -152, 165, -154, -60, -271, 113, 35, -68, -24, 2, 69, 107, 143, 355, 43, -11, 108, -15, -182, -288, 23, 182, -107, 277, 82, -161, -76, 10, -55, 166, 4, -86, -280, -228, -91, -186, 46, -122, -161, 42, 76, -15, -236, 166, 208, -159, -288, 155, -186, -66, 368, 17, 110, -101]
4673a01r2L70j88j18R2O7p7q4K61P4n0j49J05j86O4l6J69n9K3j27l9K8J74O6Q9
4698B76m86J76R8j22O0k4R3L4m7q2J06L5J0j01J56k87J19k34K99O9k88L3l0o6
4722b03J15L17k04n7M7O8K5p2K2j10j81L18k12J8J50r0j61L11j38K33m05J72L2
4745eR7R6k30k2K32j68r0P8j79J18k00J22J7J13J63k5j70m7J05k57K10L39l39
4768d2K83l2j14n4K2k10o4L51j55J35n8Q7l69K70o1j92K23q4N2K42j5l36k8K21
4792G2J03j53n7j7j33M13j46l07K48j95jM73k42q3o9J13k40M22q4k65J08J55j40
4815b5J15k48J26k7K3j6K55j72J03q1j27J77P0j87k3j29P3P6m0j26N3J70oP3l4
4840G3K6k54J52L2P4j99Q6J13j73pP5j10K05J67m31K07j67M3K56m05J12J70j35
$$ y = [-101, -193, 177, -11, -129, -37, 30, -47, -131, 130, 204, 154, 5, 110, -76, -12, -48, 121, 62, 85, -42, -81, -53, 121, 187, 276, -210, -34, 64, -58, 2, -22, 71, 105, 58, -24, 82, 117, 127, 26, 182, -105, 14, -220, 79, 148, -140, -107, -137, -203, -88, 229, 25, -32, 15, 83, 108, 36, 58, -52, -233, 85, -127, -109, 41, -49, -210, 101, -37, 196, -209, -37, -5, 92, 188, -42, -64, 168, 0, -90, -12, -191, -73, -273, -151, -134, -21, 142, 117, -53, -100, 5, -252, -42, 297, -42, 241, 209, 95, 41, 63, -147, -211, 140, -15, 120, 62, 149, -220, 50, -11, -203, 20, -64, -12, 230, 215, -121, -149, 72, 175, 22, -35, -52, -185, 228, 82, -225, 23, -172, -173, 300, 58, -25, -94, 19, -221, 201, 117, -148, -40, 115, -25, 90, -158, -32, -59, -36, -52, 203, 31, 134, 53, -74, 103, 173, -14, -37, -166, -93, -17, -57, -183, -130, 40, 34, 107, 73, 99, -155, -3, 29, 103, -96, -10, 103, -70, -77, -2, -112, 93, 260, -171, 36, -131, -88, 168, -237, -125, 45, -90]
4863i0j66K33k08K39J35j49m8j40K46N0j02j52M6k31N58j66j1n5J01n8j61N5P7
4886Co3J67k65J34R7n9j47J1m8J96L7mJ24l06K77l30K82j77M2j35K07qj2k4K16
4911B15J14k60j18m1k50N1M12n9R7k16J35K32m20K38l54oK96j06j02Q9l9R5k75
4934b72K67j43K84k6jj42j40K6K25k16L5P7j0J24Mp9K6j41J31p3j27J82l8N8J69
4959B00k84l0J63k96K71K4j67J80k51J5N2K12j31j20j96N11j84J28j91j14K26
4980A8M8j50J86J23k89P0K13k94M4j61K49j35J48o8N7O8j42K38k54L8j68J22J18
5003G9j63K76k14P0m4M1J83j10p8j33K78j22K9q1q0n7p2K7K21k86L08k6j37mP2
5028b3K68l09J15k4j39n9O8J07j18k1K20j46J79J04l70J78k11K83j62QR1l63K91
$$ y = [-90, -256, -23, -231, 8, 143, -6, -54, -194, 52, 102, 0, -152, -106, -337, 221, 55, 44, -11, 90, 32, -129, -74, 3, -60, 107, -158, -24, 73, 14, -133, -122, -170, 26, 63, 59, 183, -123, 154, -176, 106, -71, -29, -164, 43, 35, 23, -1, 215, 329, 69, -49, -90, -340, -289, 123, 64, 161, -55, 80, 312, -108, 130, -224, -230, 66, -40, -142, -53, -92, 3, -272, -5, -148, 136, 110, 109, -33, -173, -147, 78, -138, -103, -26, -36, 88, 92, 13, 39, -102, 29, -44, -171, 11, -27, 31, 200, -84, -114, 49, -247, 24, 48, -119, 61, -190, -175, -123, 89, -42, -162, -358, 153, -31, 97, -94, -208, 18, 66, -84, 102, 225, -64, 6, 219, -75, -31, -192, 57, -78, 70, 2, 59, 127, -15, 223, -31, 7, -161, -39, 79, -84, 192, -22, 48, 4, 45, 228, 118, 40, -93, 185, 63, 92, 11, -69, -126, -198, -171, 50, -236, 72, 46, -91, -95, -23, 245, -64, 51, 27, -112, -171, -103, 4, -114, -135, 85, -61, 118, 222, -148, 30, -181, 102, -60, -52, 39, -324, -33]
5051c3k81K98n2m3k23K70j3o7l5K95l28L40l08M0J06r9J59l6R2j18j43K82j83
5074h0J03m2j87J99N7J12M1j86j69J32j05J96r5J70j49k71L94m5l09R7P3N4N0
5097D0J75k97J36mK4q5j93K95r5J50q3r4K07j50j27K63l00K15l09K12P5j49L8
5120e6j70J90QR7N2j17J80j79N6j27J02k70M78k32QJ09k44j94M37m5m4L3k89L20
5144A03K4l15J25r4J06J92j95L0l9J43j85J28j59K01q7j96K47O4j59Q5r8J2J90
5167A23k83J63K0m4O9l8M6j2P9lj15L9l2k6k82L85K33k06o7R8j38QM1K6m0qJ17
5194A53mj03M1j21j4L27m34L63l26J74J8l32L04j76J73n2j07K07j47j06J40J82
5216A60l6l62J97J54k66J76n6K4j24K26N7l15K42j02j47J44J79l7p0mNj30J0n8
$$ y = [-33, -314, -16, -68, -111, -334, -64, -77, -144, -179, 116, -212, 128, -180, -140, -34, -133, 26, -10, 82, -36, -179, 103, -80, 23, -19, -206, -7, 50, 162, 203, 17, -152, -20, -125, 71, -24, 146, -3, -274, 120, 75, -234, -137, -64, -10, 40, 215, -82, 54, 50, 74, -11, -204, 91, -4, 146, 63, -31, 176, 26, -101, 162, -138, 77, -232, -20, 55, -94, -56, -226, -36, -28, 69, 121, 4, 184, 5, 61, -66, 36, -234, 244, 12, 20, 129, -115, -309, 128, 83, 39, 72, -217, 103, 127, -188, -63, -157, -51, 141, -54, -24, -63, 80, -105, 23, -136, 65, -22, -218, 29, 93, -66, 19, -79, -67, 123, -160, 3, 23, -21, 48, 10, 56, 44, 123, 120, 5, 44, 12, -14, -296, 89, 322, 116, 49, 147, 9, 17, 58, 84, 44, 36, 153, 149, 46, 87, -34, -48, 279, -155, 208, -118, 56, 74, -258, 46, -130, 43, -9, -116, 91, -56, -162, -22, 160, 124, -238, -41, 113, -153, 23, -33, -9, -133, 93, 150, -165, 77, -25, -172, -28, 151, 114, 44, 40, 45, -85, -75, -133]
5240a33J93j53K8J41o6j56L10l10J14L14o2o2k04K37j92j76N0K33j10o2K26j58
5262Bo9J74j02j22K40l29J42K87j57j18qM2n3n5O0K10L7l92R3J8J15k23K2K29
5286D3j11K82l19J88Q1r3J70r9k45K63j56r6J88r1J82j43J24p8j11J44l37L57
5308A43l23J36j03O2K64k40m6l2M6r2L12J33R6k74K3P6j58o0j8K9k3N8O8k28K15
5333F4l96L65n5J3R5r6j58K47J8j91P1j40Q3K65o5j47L1J87l62R2L41k41J34K8
5357A83j8j94M42m67L6P3j63J7J35Rq2J4k73L37j17J29l58M46j23k28L15o6j72
5380a25O4K49j31RJ6j69jJ02k0j45M4J99k11LJK34m32L93j33J36l2k07K61l60
5404b55L01jj95J63j70M09k68n5j52L43k52n6J87K8r8J4l4j2J57l1K27j95O6k46
$$ y = [-133, 60, -93, -65, 76, 10, -146, 164, -146, -32, 282, 220, 158, -46, 191, -1, -177, -127, 106, -4, -66, 160, 2, -67, 107, 5, -117, 123, -206, -64, 223, 66, -52, -60, -18, -71, -126, -66, 144, 181, -211, -118, -100, 15, -208, -186, 43, -68, 214, -105, 83, 164, 71, 241, 142, -103, 160, 4, -92, 96, 5, 187, 44, 168, 90, -21, 123, -214, 143, -180, -44, -147, -85, 179, -61, -107, -139, -93, -185, 127, 260, 356, 82, 105, 181, 23, -37, -55, -26, -49, 9, 77, -151, 64, -332, 33, -22, -9, 86, -10, -168, 79, 97, -94, -23, -163, -80, 185, 120, -27, 4, 191, -171, -79, 262, 21, 155, 183, 165, -29, 413, -54, -18, 55, -108, -91, 44, 53, -29, -15, -288, 49, -68, 61, -297, 149, 26, -202, 113, 47, -125, -61, 188, 57, 66, 82, -87, -88, 14, -6, -151, -107, 92, -119, -116, -115, 119, -313, 80, -53, 83, 51, -156, 105, -255, 46, 45, -150, 13, -157, 252, -16, -71, -223, 120, -132, -188, -1, 27, -71, -57, -91, -103, 54, 23, 250, 55, 121, -125]
5428a25m7K68k85K86k40K3M47k75j57J87k74K90Lk14R7J04j36j13K32j75r6J89
5450a1J92r2l76N60J6j63j26n4k0pJ05Q3o3R4k31M3N9JR2j01p9R7J08M6j75J60
5476A58Q7k96K93j0l96L47k72K97l04P1k2k48M55l04L47j08j54o7p5J43O4mJ01
5499A03q5J15l02K6NP2N8Q8l23O17n93rL51o3R5l62K71p3j87K42k40N46k44j87
5523g9K49R9j39o5N5p5k32J20Q1J0k18o3K15K4q7L4M5K7j50K59L4j66k3K38j91
5548BkJ77n9Oko4j11Op7K09j63J18j01J24r9M0J93j06k68R0P2l6K23j97%J13j24
5575c6N9N6j11o7L40j89p0k53N7L24j19q3J71J19k49P2Qj50L61j57l38J55K1p4
5599a53P2J61j18m9O8j63K43J00o9J95k14l44K89P6j42K92l74j6L15j79o9K04
$$ y = [-125, -172, 96, -189, 97, -143, -120, 327, 52, -105, 82, -192, 98, 101, -113, -16, 88, -48, -161, 71, -104, -200, -11, 181, 89, -287, 273, 289, 126, 0, -54, -74, -81, 24, 107, 44, 138, -93, -50, 9, 10, 102, 1, -78, 19, 127, 173, -2, 158, 245, -51, 242, 232, -164, 183, -89, 208, -96, -25, -47, -295, 160, -144, 203, 95, -59, -126, -201, -58, 6, 2, 103, 18, 133, -169, -143, -138, -66, -8, 80, -243, 374, -219, -228, 123, 60, 155, -207, 64, -9, -196, 46, -194, 352, 108, -79, 170, 269, 130, 65, 120, 45, -187, -67, 14, 24, -194, -257, -42, -18, -105, -71, -26, 1, -149, 110, 144, -22, -45, 193, 2, 0, 177, 118, 124, 122, 58, -53, -47, -124, 85, -78, 40, -61, 63, -36, 4, 197, 91, -177, -87, -15, -51, 172, -25, -25, 88, -36, 23, 79, -32, -99, 241, 52, -18, -271, -214, 110, -9, -92, 79, 198, -51, 21, 29, -121, 240, 83, -255, -100, -79, -153, -81, 80, -38, -87, -19, -182, 61, 161, 92, 287, 73, -271, 18, 94, -48, 244, -130, -146, 169, -10, -79, 125]
5621A25o1q2J01k23J87j20k94N03l20J73N2Q6J0k98L7K48k73R2j87P7j8K61j44
5644f8J65j8l14R1K18j33j07M9p7J62J01j73L5J22N4J07k22J22j92j13j26N44
5666B27k34J81j45J04l74K30j32n7J55Q2j01N5Mj71J36q6r7M61j35j08j33O0Q9
5689A1k2N1q3R4M5k6O8j26j11J21J56j72J08q1L5j66J37K6PK78l18M5j05J23j90
5714i5J57j88J9K44l05K38J18k28J40k37K5J59j66Q7j42L26j37K02L3r4j40J79
5736A95l00K99j57M9P2k63k6J37lj68J83o9Q0j69J53R4j62K54k10k21L97l29M64
5759C00l00L5j58Q2K87k51J36l52K28mO6l10L18K1l1j58Q5J0q7P9J51k0j58J39
5783A08n3p4J29k9k62k9K71K98k66l1qk71L45L1l1q8j50q1J24O1j14K40r7o4R3
$$ y = [125, 64, -18, 83, -140, 47, -73, -367, 136, -184, -11, 41, 127, 137, -161, -124, 124, -149, -57, -244, -167, -185, 76, -68, 97, 79, -235, -144, 74, -59, -166, -117, -194, -32, 69, -104, -69, 53, 107, 214, -8, 114, -78, -191, -317, 227, -7, 174, 29, 133, -241, -11, -143, -200, -45, 37, -64, -9, -5, -176, -40, -126, -223, 238, 103, -5, -138, -78, 11, -11, 40, -43, 51, 96, 70, 138, 12, -99, 22, 178, 6, 114, 33, 68, -98, 39, 65, 72, 350, 32, 77, -28, 95, -95, 62, -126, -107, 137, -168, 70, 188, -40, 100, -137, -112, 47, -119, -32, -174, 152, 15, 217, 250, 156, 16, 195, -105, 194, 37, 86, 158, -105, -131, 6, 3, -165, 18, -51, 29, -140, 13, 107, -55, 199, -11, -232, 165, -164, 300, 0, 35, -123, -41, 246, -5, 131, -221, 7, 3, 69, -241, 77, 98, 67, -91, -6, 4, -83, -4, 147, 127, -31, 108, 55, -19, 110, 81, -181, -210, 61, 359, 93, 62, 54, -217, 128, 159, 128, 40, -110, -191, -67, -6, -120, 120, 23, -41, 52]
5808E2r9J59k34M5M9L04j85j62j08K31J25l51N1K20k22J46J22j49k7J10N6j66
5830c3J9J58k40M2j31J06J0K4O7Q8n2n0N1j95q8j6J78Q2m6j35K35m4k02Q3J92
5855A03j55J04l2l5k07J65k45N10j19r2J29q1j03Q5r3j31M14k59mj9J18M5j53
5878e5r8N8J94l9K2J26j53J9k40L3O0K81j72j18P2K50j87k29J86q8J35k0j5J66
5902A88l0j68J33j94P0J66l95L74j87K37k13J62j72J42L3q3m77J44L04O2L5k59
5924a28K27k04J03J08l50M35r6k4K11m37j7N2J38J33m8m1j35J06J8q0R9k35J84
5947A9L08l19p6K37j27J3Q6j07J40p3N0l22J07K70j38l0M0R0l83J5K35rl2n2J47
5972H9l7j51nj3J31O0r4K41j56j1k1J56l21K52k43K10p0P6J62j33J8k74O3o4M83
$$ y = [52, -47, 112, -122, -77, -28, 276, 91, -71, -179, 52, 177, -174, -123, 97, -125, 21, 143, -6, -33, 77, 133, -33, -14, 144, -96, -54, -185, -79, -69, -45, 22, 110, 58, 8, 59, -136, -224, -240, -62, 20, -26, -161, 74, 30, -172, -89, 103, -52, 52, 20, -15, -222, -57, -302, 208, 89, -3, 126, 45, -58, 27, -66, -197, 217, -42, -46, -65, 53, 98, -55, -153, -95, 99, 60, 82, 208, 55, 74, -166, -133, -73, 208, 36, -82, -10, 240, 53, -176, 10, -78, 57, 37, 22, 188, 158, -10, 123, -71, -1, 165, -230, 144, -43, 194, -19, 143, -29, 113, 146, 63, -414, -270, 34, 96, 131, -128, 99, -105, -2, 106, -244, 191, 95, 71, 282, -155, -172, -120, 18, 151, 103, 62, -73, 33, 51, -29, 70, -165, 19, 327, 8, -68, 169, 42, 55, 141, 34, 174, 101, 151, -171, -64, 206, 68, 38, 78, 168, -215, -200, 35, 26, -6, -58, 89, 52, -99, -104, -117, 14, 74, -20, 221, 65, 54, 33, 189, -132, 120, -123, 87, 17, 93, 255, 122, 140, -134, -71, -135, 348]
$$ [...]
8191G7
##END NTUPLES=NMR FID
##END=
