##TITLE=1H_SR129_k2
 DMSO-d6
 8 sc, 
 7.07.2022
##JCAMPDX= 6.0         $$ Bruker NMR JCAMP-DX V2.0
##DATA TYPE= NMR FID
##DATA CLASS= NTUPLES
##ORIGIN= UXNMR, Bruker Analytische Messtechnik GmbH
##OWNER= root
$$ XWIN-NMR		Version 3.5
$$ Thu Jul  7 15:02:16 2022 Russian Standard Time (UT+4h)  she@DPX200
##.OBSERVE FREQUENCY= 200.1313499994
##.OBSERVE NUCLEUS= ^1H
##.DELAY= (6, 6)
##.ACQUISITION MODE= SIMULTANEOUS
##.ACQUISITION SCHEME= undefined
##.AVERAGES= 8
##.DIGITISER RES= 18
##SPECTROMETER/DATA SYSTEM= spect
##.PULSE SEQUENCE= zg30
##.SOLVENT NAME= DMSO
##.SHIFT REFERENCE= (INTERNAL, DMSO, 0, 15.7039)
##AUDIT TRAIL= $$ (NUMBER, WHEN, WHO, WHERE, WHAT)
$$ ##TITLE= Audit trail, XWIN-NMR		Version 3.5
$$ ##JCAMPDX= 5.01
$$ ##ORIGIN= Bruker BioSpin GmbH
$$ ##OWNER= she
$$ F:/spectra/data/she/nmr/H-F/1/audita.txt
$$ ##AUDIT TRAIL=  $$ (NUMBER, WHEN, WHO, WHERE, WHAT)
(   1,<2022-07-07 15:01:24.25 +0400>,<she>,<DPX200>,
      <created by zg, POWCHK disabled, PULCHK disabled
       configuration hash MD5:
       00 E9 B6 7A A2 85 ED C7 34 08 36 98 17 FE 4E 26
       data hash MD5: 16K
       3B D9 B6 B4 B8 FD 5C EB D5 C8 31 B5 90 FD 42 FF>)
$$ ##END=
$$ 
$$ hash MD5
$$ CB F0 55 8D 39 55 D8 0B DA 74 FD A6 8C 27 4B 94
##$RELAX= 
##$RELAX= 
##$RELAX= 
##$RELAX= 
##$RELAX= 
##$RELAX= 
$$ Bruker specific parameters
$$ --------------------------
##$DU= <F:/spectra>
##$EXPNO= 1
##$NAME= <H-F>
##$PROCNO= 1
##$TYPE= <nmr>
##$USER= <she>
##$AMP= (0..31)
100 100 100 100 100 100 100 100 100 100 100 100 100 100 100 100 100 100 
100 100 100 100 100 100 100 100 100 100 100 100 100 100 
##$AQSEQ= 0
##$AQ_mod= 1
##$AUNM= <au_zg>
##$AUTOPOS= <>
##$BF1= 200.13
##$BF2= 200.13
##$BF3= 200.13
##$BF4= 200.13
##$BF5= 200.13
##$BF6= 200.13
##$BF7= 200.13
##$BF8= 200.13
##$BYTORDA= 1
##$CFDGTYP= 0
##$CFRGTYP= 5
##$CHEMSTR= <none>
##$CNST= (0..31)
1 1 145 1 1 1 1 1 1 1 1 1 1 1 1 1 1 1 1 1 1 1 1 1 1 1 1 1 1 1 1 1 
##$CPDPRG= <>
##$CPDPRG1= <>
##$CPDPRG2= <>
##$CPDPRG3= <>
##$CPDPRG4= <mlev>
##$CPDPRG5= <mlev>
##$CPDPRG6= <mlev>
##$CPDPRG7= <mlev>
##$CPDPRG8= <mlev>
##$CPDPRGB= <>
##$CPDPRGT= <>
##$D= (0..31)
0 1.2 0 0 0 0 0 0 0 0.06 0 0.03 0 0 0 0 0.0002 0 0 0 0 0 0 0 0 0 0 0 0 
0 0 0 
##$DATE= 1657191683
##$DBL= (0..7)
120 120 120 120 120 120 120 120 
##$DBP= (0..7)
150 150 150 150 150 150 150 150 
##$DBP07= 0
##$DBPNAM0= <>
##$DBPNAM1= <>
##$DBPNAM2= <>
##$DBPNAM3= <>
##$DBPNAM4= <>
##$DBPNAM5= <>
##$DBPNAM6= <>
##$DBPNAM7= <>
##$DBPOAL= (0..7)
0.5 0.5 0.5 0.5 0.5 0.5 0.5 0.5 
##$DBPOFFS= (0..7)
0 0 0 0 0 0 0 0 
##$DE= 6
##$DECBNUC= <off>
##$DECIM= 32
##$DECNUC= <off>
##$DECSTAT= 4
##$DIGMOD= 1
##$DIGTYP= 9
##$DL= (0..7)
0 120 120 120 120 120 120 120 
##$DP= (0..7)
150 150 150 150 150 150 150 150 
##$DP07= 0
##$DPNAME0= <>
##$DPNAME1= <>
##$DPNAME2= <>
##$DPNAME3= <>
##$DPNAME4= <>
##$DPNAME5= <>
##$DPNAME6= <>
##$DPNAME7= <>
##$DPOAL= (0..7)
0.5 0.5 0.5 0.5 0.5 0.5 0.5 0.5 
##$DPOFFS= (0..7)
0 0 0 0 0 0 0 0 
##$DQDMODE= 0
##$DR= 18
##$DS= 0
##$DSLIST= <SSSSSSSSSSSSSSS>
$$ [...]
##$SUBNAM2= <"">
##$SUBNAM3= <"">
##$SUBNAM4= <"">
##$SUBNAM5= <"">
##$SUBNAM6= <"">
##$SUBNAM7= <"">
##$SUBNAM8= <"">
##$SUBNAM9= <"">
##$SW= 18.0517283424941
##$SWIBOX= (0..15)
0 0 2 0 0 0 0 0 0 0 0 0 0 0 0 0 
##$SW_h= 3612.71676300578
##$TD= 16384
##$TD0= 1
##$TE= 0
##$TE2= 300
##$TE3= 300
##$TEG= 300
##$TL= (0..7)
0 120 120 120 120 120 120 120 
##$TP= (0..7)
150 150 150 150 150 150 150 150 
##$TP07= 0
##$TPNAME0= <>
##$TPNAME1= <>
##$TPNAME2= <>
##$TPNAME3= <>
##$TPNAME4= <>
##$TPNAME5= <>
##$TPNAME6= <>
##$TPNAME7= <>
##$TPOAL= (0..7)
0.5 0.5 0.5 0.5 0.5 0.5 0.5 0.5 
##$TPOFFS= (0..7)
0 0 0 0 0 0 0 0 
##$TUNHIN= 0
##$TUNHOUT= 0
##$TUNXOUT= 0
##$USERA1= <user>
##$USERA2= <user>
##$USERA3= <user>
##$USERA4= <user>
##$USERA5= <user>
##$V9= 5
##$VALIST= <valist>
##$VCLIST= <CCCCCCCCCCCCCCC>
##$VD= 0
##$VDLIST= <DDDDDDDDDDDDDDD>
##$VPLIST= <PPPPPPPPPPPPPPP>
##$VTLIST= <TTTTTTTTTTTTTTT>
##$WBST= 1024
##$WBSW= 4
##$XGAIN= (0..3)
0 0 0 0 
##$XL= 0
##$YL= 0
##$YMAX_a= 293772
##$YMIN_a= -191629
##$ZGOPTNS= <>
##$ZL1= 120
##$ZL2= 120
##$ZL3= 120
##$ZL4= 120
##$ABSF1= 10
##$ABSF2= 0
##$ABSG= 5
##$ABSL= 3
##$ALPHA= 0
##$AQORDER= 0
##$ASSFAC= 0
##$ASSFACI= 0
##$ASSFACX= 0
##$ASSWID= 0
##$AUNMP= <proc_1d>
##$AZFE= 0.1
##$AZFW= 0.1
##$BCFW= 1
##$BC_mod= 2
##$BYTORDP= 1
##$COROFFS= 0
##$CY= 11.3945322036743
##$DATMOD= 1
##$DC= 2
##$DFILT= <>
##$DTYPP= 0
##$F1P= 2.36226072786647
##$F2P= -0.459571619588291
##$FCOR= 0.5
##$FTSIZE= 0
##$FT_mod= 4
##$GAMMA= 1
##$GB= 0.15
##$INTBC= 1
##$INTSCL= 1
##$ISEN= 128
##$LB= 0.24
##$LEV0= 0
##$LPBIN= 0
##$MAXI= 10000
##$MC2= 0
##$MEAN= 0
##$ME_mod= 0
##$MI= 1.114404
##$NCOEF= 0
##$NC_proc= 0
##$NLEV= 6
##$NOISF1= 3.799351
##$NOISF2= 2.8
##$NSP= 1
##$NTH_PI= 0
##$NZP= 0
##$OFFSET= 15.70392
##$PC= 1
##$PHC0= -18062.26
##$PHC1= 8.60068
##$PH_mod= 1
##$PKNL= yes
##$PPARMOD= 0
##$PSCAL= 0
##$PSIGN= 0
##$REVERSE= no
##$SF= 200.130013532006
##$SI= 16384
##$SIGF1= 3
##$SIGF2= 2
##$SINO= 400
##$SIOLD= 16384
##$SREGLST= <1H.CDCl3>
##$SSB= 0
##$STSI= 0
##$STSR= 0
##$SW_p= 3612.71676300578
##$SYMM= 0
##$S_DEV= 0
##$TDeff= 0
##$TDoff= 0
##$TI= <>
##$TILT= no
##$TM1= 0
##$TM2= 0
##$TOPLEV= 0
##$USERP1= <user>
##$USERP2= <user>
##$USERP3= <user>
##$USERP4= <user>
##$USERP5= <user>
##$WDW= 1
##$XDIM= 8192
##$YMAX_p= 0
##$YMIN_p= 0
$$ End of Bruker specific parameters
$$ ---------------------------------
##NTUPLES= NMR FID
##VAR_NAME=  TIME,          FID/REAL,        FID/IMAG
##SYMBOL=    X,             R,               I
##VAR_TYPE=  INDEPENDENT,   DEPENDENT,       DEPENDENT
##VAR_FORM=  AFFN,          ASDF,            ASDF
##VAR_DIM=   8192,          8192,            8192
##UNITS=     SECONDS,       ARBITRARY UNITS, ARBITRARY UNITS
##FACTOR=    0.0002768,     1,               1
##FIRST=     0,             0,               0
##LAST=      2.2672688,     0,               0
##MIN=       0,             -191629,         0
##MAX=       2.2672688,     293772,          0
$$ Real data points
##PAGE= N=1
##DATA TABLE= (X++(R..R)), XYDATA
$$ plain form
0 0 0 0 0 0 0 0 0 0 0 0 0 8 -8 8 -8 8 -16 16 -16 24 -24 32 -37 40 -48 56 -68 80 -88 104 -118 134 -152 172
34 172 -195 219 -244 273 -305 341 -378 420 -466 517 -572 630 -695 765 -843 931 -1025 1130
52 1130 -1244 1374 -1519 1685 -1870 2089 -2342 2641 -3004 3450 -4020 4774 -5817 7362 -9883
67 -9883 14689 -27016 124092 184508 -161987 40218 293772 29505 -139387 181555 195962
78 195962 -102950 -19378 189153 -26826 -138603 91913 64750 -167349 -26946 124396
88 124396 -99812 -155897 99135 36410 -191629 -33023 130186 -80936 -132844 94351 58120
99 58120 -113648 20016 118386 -57407 -61873 111549 22274 -105581 55069 116803 -72181
110 -72181 -52833 124693 33141 -98452 38870 97677 -60630 -54117 73051 -4144 -85668
$$ packed form
0@%%%%%%%%%%%Qj6J6j6J6k4L2l2M0m8N6o9P7q8J04j24J48j68J92k22K52k86L24
34A72l67M14m63N17n78O46p19P98q86R83j089J202j325J460j608J774j956K155
52A130k374K618k893L204l555L959m431M983n645O454p470Q794j0591J3179j7245
67i883K4572m1705J51108O0416l46495K02205K53554k64267j68892L20942J4407
78A95962k98912Q3572K08531k15979j11777K30516k7163k32099J40403J51342
88A24396k24208n6085K55032o2725k28039J58606J63209k11122n1908K27195l6231
99E8120j71768J33664R8370j75793m466J73422q9275j27855J60650O1734j88984
110g2181J9348J77526r1552j31593J37322N8807j58307O513J27168p7195q1524
$$ plain form
121 -85668 29596 44285 -82603 -29315 79187 -24581 -83338 56549 62185 -76910 -26508
132 -26508 85373 -5240 -66744 43255 48552 -52663 -4720 62394 -25248 -45947 54006 21006
144 21006 -70988 2896 62567 -38186 -56847 47722 25222 -60965 -5144 50001 -18169 -27829
156 -27829 40599 11527 -38052 19351 35665 -40621 -24058 48177 -1328 -56472 14852 43358
168 43358 -32440 -26871 41426 9813 -35417 11723 25183 -25118 -5190 35876 -8428 -27898
180 -27898 30098 21748 -38182 -5830 42381 -7034 -36062 17042 19743 -28996 -11533 20845
192 20845 -10393 -19439 16643 3019 -26712 8309 27316 -17431 -18259 27650 8901 -33200 -2656
205 -2656 25859 -9768 -19444 14905 8257 -16000 4406 13340 -12198 -2273 23071 -3263 -21611
$$ packed form
121h5668J15264J4689j26888N3288J08502j03768n8757J39887N636j39095N0402
132b6508J11881r0613o1504J09999N297j01215M7943O7114q7642k0699R9953l3000
144B1006r1994P3884N9671j00753j8661J04569k2500q6187N5821N5145o8170r660
156b7829O8428k9072m9579N7403J6314p6286J6563P2235m9505n5144P1324K8506
168D3358p5798N569O8297l1613m5230M7140J3460n0301J9928M1066m4304j9470
180b7898N7996q350n9930L2352M8211m9415k9028N3104K701m8739J7463L2378
192B0845l1238r046L6082j3624k9731L5021J9007m4747q28M5909j8749m2101L0544
205b656K8515l5627r676L4349o648k4257K0406Q934k5538R925K5344k6334j8348
$$ plain form
218 -21611 14325 20241 -18187 -9853 24193 4484 -20149 4072 13751 -9956 -5834 10886 -5252
231 -5252 -12496 7833 1107 -19624 183 18264 -7912 -16715 12605 12524 -13067 -4273 14973 639
245 639 -8841 5606 3177 -7851 3864 8871 -8339 -4392 13835 1242 -14408 5230 15552
258 15552 -6841 -10462 9139 4893 -10890 -2403 5795 -3971 -2976 4871 -3825 -7757 5833 3217
272 3217 -12511 -4031 10498 -1800 -11751 4296 10023 -3445 -3358 7569 3402 -1763 4478 3146
286 3146 -2776 4329 7450 -5304 -5097 7984 2889 -10847 -3282 7382 -2135 -8536 907 3102
300 3102 -3672 -1865 490 -3681 -877 4017 -2067 -4906 5266 6004 -5264 -3248 7925 3242 -5668
315 -5668 -22 5438 -329 -2497 1852 871 -495 2399 1 -4410 1009 4923 -2255 -4645 3961
$$ packed form
218b1611L5936N916l8428Q334L4046j9709k4633K4221R679k3707M122J6720j6138
231e252p244K0329o726k0731J9807J8081k6176q803K9320q1k5591Q794J9246j4334
245F39r480J4447k429j1028J1715N007j7210L947J8227j2593j5650J9638J0322
258A5552k2393l621J9601m246j5783Q487Q198r766R95P847q696l932J3590k616
272C217j5728Q480J4529j2298r951J6047N727j3468Q7J0927m167n165O241j332
286C146n922P105L121j2754K07J3081n095j3736P565J0664r517o401R443K195
300C102o774J807K355m171K804M894o084k839J0172P38j1268K016J1173m683q910
315e668N646N460n767k168M349r81j366K894k398m411N419L914p178k390Q606
$$ plain form
330 3961 3690 -5420 -4271 2782 410 -3501 -673 1307 -1073 277 588 -2457 178 4420 -258 -4297
346 -4297 2023 5102 -1371 -2695 4442 3950 -2451 -1938 1076 -229 -776 382 -496 -716 1661 -464
362 -464 -4349 -659 3267 -962 -3787 993 3000 -1512 -2113 2207 2604 272 -248 -146 -767 864 530
379 530 -2310 -1016 2593 395 -3884 -883 3246 435 -2614 344 2142 -197 -1494 -335 200 1094
395 1094 754 -1319 -1008 2008 813 -2640 -1035 2601 770 -2430 -479 2138 183 -1481 -173 730
411 730 362 -123 -735 -543 1431 1909 -711 -842 1998 963 -2289 -1916 1213 677 -1581 -657 901 1133
429 1133 360 -34 -174 672 1504 -1175 -1604 1009 1502 -1330 -1418 1191 1273 -803 -1314 -175 294 -984
447 -984 -1569 -879 268 21 -903 -1067 439 1367 -122 -759 1424 2475 91 -576 1180 1507 182 -131
$$ packed form
330C961k71r110J149P053k372l911K828J980k380J350L11l045K635M242m678m039
346d297O320L079o473j324P137m92o401N13L014j305n47J158q78k20K377k125
362d64l885L690L926m229k825M780K007m512o01M320L97k332n20J02o21J631l34
379E30k840J294L609k198m279L001M129k811l049K958J798k339j297J159N35Q94
395A094l40k073L11L016j195l453J605L636j831l200J951K617j955j664J308R03
411G30l68m85o12J92J974M78k620j31K840j035l252L73L129n36k258R24J558K32
429A133p73l94j40Q46Q32k679m29K613M93k832q8K609Q2k076n11J139M69j278
447i84n85O90J147k47r24j64J506R28j489o37K183J051k384o67J756L27j325l13
$$ plain form
465 -131 165 317 160 -211 -1101 204 1452 372 -1158 181 1430 -803 -1645 -533 699 -249 -1248
482 -1248 -936 236 663 -122 -773 328 808 -357 -1427 -474 580 205 -922 332 1657 1002 -396
499 -396 550 1638 1411 236 -60 -68 506 427 -1197 -912 673 110 -1457 -786 616 2 -358 -9 436
518 436 547 -19 -786 -238 1136 758 -673 -458 935 726 -320 -717 341 471 -466 -1128 -560 365 -574
537 -574 -1218 134 879 472 -189 -240 645 1237 -1 -990 263 755 -904 -802 92 29 -329 11 -52 -237
557 -237 434 127 -390 676 1104 -12 -357 140 513 36 -354 -339 353 525 -345 -759 57 -54 -302 -355
577 -355 23 -198 -164 -222 -92 952 539 -214 253 1096 710 -524 -174 -251 -114 -299 -395 -810 232 53 -380
598 -380 -105 633 -11 -248 276 277 165 267 134 259 820 227 -276 -195 319 62 -124 -441 -62 136 -168
$$ packed form
465a31K96J52j57l71q90J305J248j080j530J339J249k233q42J112J232r48r99
482a248L12J172M27p85o51J101M80j165j070R53J054l75j127J254J325o55j398
499c96R46J088k27j175k96qN74p9j624K85J585n63j567O71J402o14l60L49M45
518D36J11n66p67N48J374l78j431K15J393k09j046l97J058J30r37o62N68R25r39
537e74o44J352P45m07o61n1Q85N92j238r89J253M92j659J02Q94o3l58L40o3j85
557b37O71l07n17J066M28j116l45M97L73m77l90J5O92J72q70m14Q16j11k48n3
577c55L78k21L4n8J30J044m13p53M67Q43l86j234L50p7J37j85r6m15J042j79m33
598c80K75P38o44k37N24Jj12J02j33J25N61n93n03Q1N14k57j86l17L79J98l04
$$ plain form
619 -168 -651 -258 348 -90 -597 196 485 128 95 -5 405 706 6 -612 -208 84 -447 -317 -61 111 -73
640 -73 213 394 153 448 417 68 132 479 145 -108 160 425 119 -294 -389 -390 -114 -396 -705 -329 -59 -403
662 -403 -312 -154 -201 224 396 173 481 360 285 65 429 559 96 80 18 -54 -149 -321 -539 -253 27 -200 -429
685 -429 112 -129 -414 -165 -71 -48 52 -306 -362 112 164 -49 -322 -111 -238 -345 -151 -141 43 335 330 204 517
708 517 382 214 293 650 355 219 100 57 217 103 -305 -312 -186 -184 -506 -307 -319 -132 -257 -230 -268 38 103 29
732 29 -199 57 311 -158 129 204 163 221 42 -13 177 528 -61 97 269 187 -196 -146 284 112 67 -238 51
755 51 226 -72 -142 -188 -72 -153 -126 -28 -55 -190 -292 -17 -59 14 -15 95 4 412 581 390 306 530 214 -16
779 -16 124 -77 248 -220 -128 -248 81 -38 -104 -11 260 -245 -215 -83 59 -7 -128 -151 -50 225 1 84 -6
$$ packed form
619a68m83L93O06m38n07P93K89l57l3j00M10L01p00o18M04K92n31J30K56J72j84
640g3K86J81k41K95l1l49O4L47l34k53K68K65l06m13r5jK76k82l09L76K70l44
662d03R1J58m7M25J72k23L08j21p5k20L64J30m63j6o2p2r5j72k18K86K80k27k29
685d29N41k41k85K49R4K3J00l58n6M74N2k13k73K11j27j07J94J0J84K92nj26L13
708E17j35j68P9L57k95j36j19m3J60j14m08pJ26Kl22J99j2J87j25K7l8L06O5p4
732B9k28K56K54m69K87P5m1N8j79n5J90L51n89J58J72q2l83N0M30j72m5l05K89
755E1J75k98p0m6J16q1K7R8k7j35j02K75m2P3k9J10r1M08J69j91q4K24l16k30
779a6J40k01L25m68R2j20L29j19o6R3K71n05L0J32J42o6j21k3J01K75k24Q3r0
$$ plain form
802 -6 297 7 -157 -41 82 195 43 -240 63 73 25 155 -175 89 47 14 -67 64 -59 37 -244 153 -9
825 -9 7 -28 8 -90 7 -112 31 71 217 227 -102 -92 283 -44 -171 68 -58 110 -61 -108 -39 92 11 -20 70
850 70 -196 -193 -183 -23 156 293 1 79 26 8 -4 -17 45 134 191 -59 -63 149 -43 -193 -241 -55 196 150 -46 -64
876 -64 115 31 -167 -62 235 73 -238 -37 176 106 358 216 0 52 -111 -94 36 -113 -64 -159 -105 -200 -25
899 -25 -168 -47 -230 13 -348 12 -175 -140 -184 -168 12 2 430 22 176 282 146 55 43 59 218 71 -29
922 -29 133 115 112 -246 -133 0 192 -142 -96 153 -119 -45 -116 -186 -147 57 -259 -125 -84 -71 -271 -178 59 -73
946 -73 167 62 -281 189 147 -76 -268 377 138 -7 -32 357 177 10 -263 -247 26 191 -139 -40 213 220 -252
969 -252 -199 4 14 170 -34 37 239 74 -184 -23 -149 49 12 -184 -240 154 43 -67 -196 195 166 108 -52
$$ packed form
802fL03k90j64J16J23J13j52k83L03J0m8J30l30K64m2l3q1J31j23R6k81L97j62
825iJ6l5L6r8R7j19J43M0J46J0l29J0L75l27j27K39j26J68j71m7O9J31q1l1R0
850G0k66LJ0J60J79J37k92P8n3j8j2j3O2Q9N7k50mK12j92j50m8J86K51m6j96j8
876f4J79q4j98J05K97j62l11K01K13p0K52j42k16N2j63J7J30j49M9r5N4r5J75
899b5j43J21j83K43l61L60j87L5m4J6J80j0M28m08J54J06j36r1j2J6J59j47j00
922b9J62j8ll58J13J33J92l34M6K49k72P4p1p0L9K04l16J34M1J3k00R3K37j32
946g3K40j05l43M70m2k23j92O45k39j45k5L89j80j67k73J6K73J65l30R9K53Pm72
969b52N3K03J0J56k04P1K02j65k58J61j26J98l7j96n6L94j11j10j29L91k9n8j60
$$ plain form
992 -52 258 100 -206 -66 -100 236 42 -120 -200 56 -29 -309 -35 -136 -48 -22 -152 70 137 31 -32 13 126
1015 126 -167 18 130 47 -127 -43 -124 -66 -32 58 -170 -186 141 -138 -120 -53 65 85 210 -241 59 95 101 -329
1039 -329 -135 298 -39 -156 -95 -52 29 -219 -149 -180 66 42 -166 59 97 -67 -32 -67 30 110 -14 -255 392 121
1063 121 -178 -174 -50 267 -221 37 74 5 79 66 -87 -195 246 -179 44 128 145 -99 -16 -75 -10 25 -111 -222
1087 -222 149 229 -101 -228 84 -56 -12 -57 -69 77 -113 80 -139 151 171 -119 -101 -56 276 181 -33 -65 -70 98
1111 98 -156 -125 -93 -24 -215 50 49 143 -67 2 -148 190 49 -293 -220 438 178 -339 -48 -93 -61 32 85 -41
1135 -41 -49 68 -56 193 -3 -254 -90 -86 -87 353 -26 -154 -393 198 -126 -91 -75 -37 91 -157 -22 -16 308 139
1159 139 -89 61 -24 -170 -45 278 -34 -92 110 -90 153 133 -11 87 -88 -10 -205 -10 -174 -90 -66 19 -102
$$ packed form
992e2L10j58l06J40l4L36j94j62q0K56q5k80K74j01Q8K6j30K22O7j06o3M5J13
1015A26k93J85J12q3j74Q4q1N8L4R0k28j6L27k79J8O7J18K0J25m51L00L6Om30
1039c29J94M33l37j17O1M3Q1k48P0l1K46k4k08K25L8j64L5l5R7Q0j24k41O47k71
1063A21k99MJ24L17m88K58L7o9P4j3j53j08M41m25K23Q4J7k44Q3n9O5L5j36j11
1087b22L71Q0l30j27L12j40M4m5j2J46j90J93k19K90K0k90J8M5L32r5k14l2nJ68
1111I8k54L1L2O9j91K65jR4k10O9j50L38j41l42P3O58k60n17K91m5L2R3N3j26
1135d1qJ17j24K49j96k51J64MjM40l79j28k39N91l24L5J6L8J28k48J35OL24j69
1159A39k28J50q5j46J25L23l12n8K02k00K43k0j44R8j75P8j95J95j64Q4K4Q5j21
$$ plain form
1182 -102 -139 -5 -28 45 55 266 -191 -86 147 92 -127 -113 -92 -6 219 222 -62 14 -5 -121 -79 199 69 56 168
1207 168 -123 -125 41 -176 -122 43 19 -190 -27 298 -46 -65 -167 23 -31 15 18 -81 252 97 -16 149 104 111
1231 111 -126 8 -191 -100 49 44 -39 -202 -166 19 82 -22 -51 -148 1 -42 150 118 -29 -15 -48 318 -39 111
1255 111 -177 191 124 -134 178 178 -80 52 216 -84 -244 -62 -9 -105 76 131 -45 126 -33 -169 -107 12
1277 12 -108 -37 40 -87 67 101 -43 -118 -176 41 -25 -117 -74 -168 -62 25 16 -19 8 55 -70 27 -246 -40 169 -38
1303 -38 -131 96 -117 -4 83 58 5 117 250 68 -80 140 -45 -124 -32 54 21 -43 -28 -136 -6 44 238 -24
1327 -24 -32 -125 38 -37 136 71 237 -69 -3 -51 -153 -64 149 65 -139 -20 -59 -142 -107 69 -128 41 -6 200 -48
1352 -48 -51 -151 0 -38 96 4 26 -154 -13 200 -135 -84 -128 -61 -73 -17 -180 311 36 54 -11 43 -72 116 129
$$ packed form
1182a02l7J34k3P3J0K11m57J05K33n5k19J4K1Q6K25Lk84P6j9j16M2K78j30j3J12
1207A68k91kJ66k17N4J65k4k09J63L25l44j9j02J90n4M6Lr9L33j55j13J65m5P
1231A11k37J34j99R1J49nq3j63L6J85O3j04k9r7J49m3J92l2j47J4l3L66l57J50
1255A11k88L68o7k58L12%k58J32J64l00j60J82N3r6J81N5j76J71j59j36O2J19
1277A2j20P1P7j27J54L4j44p5n8K17o6r2M3r4J06Q7rl5K7M7j25R7k73K06K09k07
1303c8r3K27k13J13Q7k5n3J12J33j82j48K20j85p9R2Q6l3o4J5j08J30N0J94k62
1327b4qr3J63p5J73o5J66l06O6m8j02Q9K13q4k04J19l9q3L5J76j97J69m7K06k48
1352d8lj00J51l8J34r2K2j80J41K13l35N1m4O7j2N6j63M91k75J8o5N4j15J88J3
$$ plain form
1377 129 59 53 -56 -61 40 42 -203 -28 -123 15 15 -25 -160 -14 9 -204 109 31 -51 -70 -183 42 89 -16 -8 16
1403 16 149 -8 124 5 -1 105 -119 -34 -38 -262 -64 -190 61 254 100 -80 -115 138 133 178 -83 -28 -44 70
1427 70 23 92 99 28 -138 -48 -81 -10 -110 -35 -216 85 -289 -157 34 238 -90 270 62 -37 133 -39 86 27
1451 27 0 122 -32 -234 -104 52 -51 -244 -43 147 -100 28 204 115 195 -120 -313 29 225 -118 -154 152
1473 152 1 -82 -140 4 54 203 14 71 112 118 -7 96 153 135 137 228 121 73 166 -67 86 26 -27 -162 -7
1498 -7 10 11 18 -143 21 79 -156 -156 95 23 -15 91 -53 -89 26 170 -137 52 21 14 243 -17 -121 143 3
1523 3 -123 -246 -72 -110 248 -151 20 -31 -30 218 -160 -120 58 -11 105 120 -36 -67 131 42 -186 6 -86 -52
1547 -52 -27 115 159 13 -4 48 213 118 128 -154 58 -88 -73 164 -261 37 222 59 -165 23 -86 -153 -48
$$ packed form
1377A29p0oj09nJ01Kk45J75r5J38%m0j35J46K3k13L13p8q2j9j13K25M7j05QK4
1403A6J33j57J32j19oJ06k24Q5mk24J98j26K51J93j54j80l5K53nM5k61N5j6J14
1427G0m7O9Pp1j66R0l3P1j00P5j81L01l74J32J91K04l28L60k08r9J70j72J25n9
1451B7k7J22j54k02J30J56j03j93K01J90k47J28J76q9Q0l15j93L42J96l43l6L06
1473A52j51q3n8J44N0J49j89N7M1Oj25J03N7j8KR1j07m8R3k33J53o0n3j35J55
1498gJ7JPj61J64N8k35%K51p2l8J06j44l6J15J44l07J89l1pK29k60j04K64j40
1523Cj26j23J74l8L58l99J71n1JK48l78M0J78o9J16J5j56l1J98q9k28J92r2L4
1547e2K5J42M4j46j7N2J65r5J0k82K12j46J5K37m25K98J85j63k24J88j09o7J05
$$ plain form
1570 -48 14 -59 -21 13 51 154 -71 -5 -71 -4 32 -71 -9 -150 -27 48 78 76 32 -161 216 -42 123 -54 -287
1595 -287 -146 -56 116 33 -153 -190 -72 239 -3 91 116 -174 -255 -49 193 -62 -149 129 -59 160 108 -64 62
1618 62 42 -63 -86 -47 97 37 -15 87 116 -105 2 54 68 -94 -61 6 47 -31 -157 -24 -9 8 -104 -75 -94 34
1644 34 274 206 -134 124 -206 274 -216 158 -57 -70 83 -115 -16 115 -32 34 -60 -89 39 130 -52 -56 -69 -77
1668 -77 -260 70 -220 22 -85 -139 288 -17 12 63 32 -136 -42 -119 134 34 -46 -171 86 -1 -57 24 106 4
1692 4 84 12 154 -36 -36 -51 -9 7 -101 -48 -58 111 144 -374 -5 -73 -89 57 -21 134 195 180 -24 -81 -63 245
1718 245 -50 -130 28 66 136 -39 -174 91 150 -34 81 18 16 23 -6 36 -97 -46 -22 77 -139 -13 127 147 128
1743 128 -135 -3 189 39 -13 4 39 -124 -54 106 -74 179 -171 -202 -21 50 -46 80 -69 56 89 37 -51
$$ packed form
1570d8O2p3L8L4L8J03k25O6o6O7L6j03O2j41J23P5L0km4j93L77k58J65j77k33
1595b87J41R0J72q3j86l7J18L11k42R4K5k90q1K06K42k55q7K78j88K19n2j72J26
1618F2k0j05k3L9J44o0n2J02K9k21J07N2J4j62L3O7M1p8j26J33J5J7j12K9j9J28
1644C4K40o8l40K58l30M80m90L74k15j3J53j98R9J31j47O6r4k9J28R1j82mj3q
1668g7j83L30k90K42j07n4M27l05K9N1l1j68R4p7K53j00q0j25K57q7n6Q1Q2j02
1692DQ0p2J42j90%j5M2J6j08N3j0J69L3n18L69o8j6J46p8J55O1j5k04n7J8L08
1718B45k95q0J58L8P0j75j35K65N9j84J15o3kPk9M2j33N1K4R9k16J26J40K0j9
1743A28k63J32J92j50n2J7L5j63P0J60j80K53l50l1J81P1r6J26j49J25L3n2q8
$$ plain form
1766 -51 -74 -36 35 -153 -43 -63 -95 117 -89 -6 87 42 -11 -186 -107 -55 -237 165 65 8 114 76 -26 18 73
1791 73 -17 9 -92 -102 81 91 9 104 6 1 134 266 -273 4 -132 199 166 -51 7 -185 37 -187 108 76
1815 76 -160 83 -97 -26 84 106 -74 -50 59 -76 158 103 -75 -48 -155 -91 -131 -150 -23 -63 172 76 -152 -147
1839 -147 -134 -181 46 -9 -57 68 63 -142 -153 88 18 -203 -6 -205 235 -85 -157 15 -68 197 -295 86 138 117
1863 117 182 77 -35 80 -89 -172 91 -169 23 -79 148 -43 240 19 -145 1 132 -206 -162 27 50
1884 50 30 -121 138 12 -57 -125 38 -137 -69 2 -106 -6 -52 -125 -70 289 -66 28 51 -31 -58 -7 71 -113 5
1909 5 93 21 4 115 55 -9 -194 -161 45 50 199 -168 -45 -36 99 -197 -77 56 -196 -144 63 -66 139 204 -80
1934 -80 -174 -61 -11 87 -22 40 48 -22 -50 47 -115 -33 174 140 41 -65 113 24 -57 -1 -90 -8 -27 13 91 6 111
$$ packed form
1766e1k3L8P1j88J10k0l2K12k06Q3R3m5n3j75P9N2j82M02j00n7J06l8j02M4N5
1791G3r0K6j01j0J83J0q2R5r8nJ33J32n39K77j36L31l3k17N8j92K22k24K95l2
1815G6k36K43j80P1J10K2j80K4J09j35K34n5j78K7j07O4m0j9J27m0K35r6k28N
1839a47J3m7K27n5m8J25nk05j1K41p0k21J97j99M40l20p2J72q3K65m92L81N2k1
1863A17O5j05j12J15j69q3K63k60J92j02K27j91K83k21j64J46J31l38M4J89K3
1884E0k0j51K59j26o9o8J63j75O8P1j08J00m6p3N5L59l55R4K3q2k7N1P8j84J18
1909EQ8p2j7J11o0o4j85L3K06NJ49l67J23RJ35k96J20J33k52N2K07j29K05O5k84
1934h0r4J13N0R8j09O2Qp0k8R7j62Q2K07l4r9j06J78q9q1N6q9Q2j9M0P8q5J05
$$ plain form
1961 111 -100 5 -56 55 136 20 -76 -141 -118 56 55 -24 100 -10 -53 44 67 -187 17 -135 -4 134 69 -173
1985 -173 -21 -125 132 166 -34 -21 -7 -76 70 180 -222 -74 -8 -6 -9 -101 -73 -58 -132 -9 27 -101 52 -24 245
2010 245 61 119 -54 123 315 13 100 73 25 -106 92 54 -92 52 21 100 55 -68 181 -61 141 -187 -56
2033 -56 45 -193 -28 44 18 -84 -230 51 51 105 51 97 149 49 -147 -258 -212 -199 42 128 -13 -41 -8 -193 -95
2058 -95 -178 -61 -61 -114 -161 -150 62 102 84 -47 -152 60 -124 -82 -155 -129 16 -2 -8 -44 -147 92 49 183 -241 -113
2084 -113 126 -9 80 -48 -65 -41 93 51 71 -47 -89 -172 -4 99 27 -152 75 -63 32 8 -131 81 -45
2107 -45 -4 -239 58 -23 113 -99 41 18 -97 64 -278 -79 -109 -23 13 -42 70 -20 -154 0 -55 -73 99 150
2131 150 -42 170 -154 -52 -174 131 15 -45 -170 -13 192 -208 -110 42 -43 -88 54 -66 -130 -142 225 -9
$$ packed form
1961A11k11J05o1J11Q1j16r6o5K3J74jp9J24j10m3R7K3k54K04j52J31J38o5k42
1985a73J52j04K57L4k00J3J4o9J46J10m02J48O6Klr2K8J5p4J23L6j28J53p6K69
2010B45j84N8j73J77J92l02Q7k7m8j31J98l8j46J44l1P9m5j23K49k42K02l28J31
2033e6J01k38J65P2k6j02j46K81%N4n4M6N2j00j96j11M6J3K41Q6j41k8L3j85R8
2058i5q3J17%n3m7J1K12M0j8j31j05K12j84M2p3K6J45j8ol6j03K39m3J34m24J28
2084a13K39j35Q9j28j7K4J34m2K0j18m2q3J68J03p2j79K27j38R5k4j39K12j26
2107d5M1k35K97q1J36k12J40k3j15J61l42J99l0Q6L6n5J12r0j34J54n5j8J72N1
2131A50j92K12l24J02j22L05j16o0j25J57K05m00R8J52q5m5J42j20o4j2L67k34
$$ plain form
2153 -9 21 -32 -118 257 -43 184 -20 -19 35 -100 -68 -121 -71 91 -22 32 118 99 237 -23 -73 -180 12 59 25 131
2179 131 -43 -88 -91 -36 -13 -188 -138 -66 -45 -280 80 158 -46 -127 -307 197 -247 65 26 -151 -63 -72 -177 -72 -36
2204 -36 243 186 -72 -64 257 131 -88 11 8 -247 219 17 -121 -260 98 175 16 69 55 46 -119 58 -45 -35
2228 -35 97 108 62 78 -144 -89 -214 -42 -69 -14 -60 231 26 -23 -211 -127 52 115 61 20 -112 -1 79 -155 113
2253 113 -64 110 -310 -30 58 156 147 78 12 170 39 -116 -140 -93 -167 49 105 -26 163 15 48 98 -88 -41
2277 -41 -9 140 83 -23 56 -29 70 93 85 -232 -23 70 -2 -80 157 162 -15 -35 -324 142 127 163 81 31 -60 128 134
2304 134 41 104 127 21 -141 -84 -26 63 159 155 40 -7 15 -168 -66 -24 -69 7 107 -178 -7 89 63 11 -143 84
2330 84 96 -188 -161 52 171 -69 -13 -119 172 110 -157 -135 24 53 -187 -44 -337 -153 -196 -139 -206 25 -229
$$ packed form
2153iL0n3q6L75l00K27k04JN4j35L2n3N0J62j13N4Q6j9J38k60n0j07J92M7l4J06
2179A31j74m5lN5K3j75N0P2K1k35L60P8k04q1j80N04m44L12l9j77Q8rj05J05L6
2204c6K79n7k58QL21j26k19R9lk55M66k02j38j39L58P7j59N3j4rj65J77j03J0
2228c5J32J1m6J6k22N5j25J72k7N5m6K91k05m9j88Q4J79O3n4m1j32J11Q0k34K68
2253A13j77J74m20K80Q8R8ro9o6J58j31j55k4M7p4K16N6j31J89j48L3N0j86M7
2277d1L2J49n7j06P9q5R9K3ql17K09R3p2p8K37Nj77k0k89M66j5L6q2n0r1J88O
2304A34r3O3K3j06j62N7N8Q9R6mj15m7K2j83J02M2m5P6J00k85J71R6k6n2j54K27
2330H4J2k84K7K13J19k40N6j06K91o2k67K2J59K9k40J43k93J84m3N7o7K31k54
$$ plain form
2353 -229 -59 124 -123 -64 20 87 109 -164 89 -81 41 -114 -69 172 -97 -228 142 -90 51 -34 5 135
2375 135 45 135 -229 -18 112 -85 -164 -211 -33 77 -34 -149 49 13 -56 -282 25 -108 19 219 57 84
2397 84 126 189 13 145 -89 -58 -124 13 -13 166 234 -33 -31 1 -94 -129 -109 25 -224 147 135 -32 -32 -208 102
2422 102 50 73 -135 4 76 102 -74 115 -196 161 -31 -1 -128 -95 -48 -209 -146 63 103 -53 -134 -83 105 -276
2446 -276 -92 -18 -36 -124 -85 -34 10 196 -69 -130 -167 34 -217 -183 -23 78 121 -14 -19 22 4 -26 108 103 -29 -153
2472 -153 -31 -100 -138 95 -24 187 126 -149 -24 200 -17 60 -14 -39 -67 -43 272 55 -66 -139 -145 -237 -121 -52
2496 -52 214 149 -81 104 -26 -80 -17 196 -6 193 37 -36 -2 -102 -128 -6 57 -54 21 -9 120 -216 128
2519 128 43 -78 144 -100 87 -75 -154 60 -18 214 -9 209 121 57 -127 -49 -152 -164 23 132 -43 91
$$ packed form
2353b29J70J83k47N9Q4O7K2k73K53j70J22j55M5K41k69j31L70k32J41q5L9J30
2375A35r0R0l64K11J30j97p9m7J78J10j11j15J98l6o9k26L07j33J27K00j62K7
2397H4M2O3j76J32k34L1o6J37k6J79O8k67KL2r5l5K0J34k49L71j2j67%j76L10
2422A02n2K3k08J39P2K6j76J89l11L57j92L0j27L3M7j61O3K09M0j56q1N1J88l81
2446b76J84P4j8q8L9N1M4J86k65o1l7K01k51L4J60J01M3j35nM1j8l0J34nj32j24
2472a53J22o9l8K33j19K11o1k75J25K24k17P7p4k5k8K4L15k17j21p3or2J16O9
2496e2K66o5k30J85j30n4O3K13k02J99j56p3L4j00k6J22O3j11P5l0J29l36L44
2519A28q5j21K22k44J87j62p9K14p8K32k23K18q8o4j84P8j03j2J87J09j75J34
$$ plain form
2541 91 11 52 -30 206 -83 71 -63 -85 -100 -17 55 -112 71 -40 -56 -30 164 -69 203 42 -99 -102 -59 14 -111
2566 -111 121 53 106 -201 113 -223 186 -92 96 37 88 72 23 24 -78 -63 39 85 132 -192 -17 -160 130 -42
2590 -42 -61 138 127 23 -359 49 253 89 4 123 -242 134 79 -63 -116 -52 -43 -106 200 259 -40 -114 12 27
2614 27 88 -34 139 -38 -23 85 -65 -120 -80 201 -59 247 47 182 -187 -24 -16 91 -20 12 114 -98 103
2637 103 148 -123 35 100 -86 71 -20 120 -21 -81 206 -46 -158 -1 168 105 18 31 -101 49 -109 -26 233
2660 233 -141 52 183 30 33 -136 -307 -72 -50 -89 -79 -23 -233 -133 62 -125 -49 216 10 19 -45 162 -259
2683 -259 -3 -51 321 15 89 54 168 -125 92 47 -22 -55 -14 -67 -90 -1 92 5 -130 -85 115 109 -313 81 168
2708 168 -61 -219 97 -43 178 -58 67 60 6 45 -88 151 -33 -6 -35 -204 89 -274 -135 5 -132 193
$$ packed form
2541I1q0M1q2K36k89J54j34k2j5Q3P2j67J83j11j6K6J94k33K72j61j41lM3P3j25
2566a11K32o8N3l07L14l36M09k78J88n9N1j6m9Jj02J5J02M6M7l24J75j43K90j72
2590d2j9J99j1j04l82M08K04j64q5J19l65L76n5j42n3O4Ro3L06N9k99p4J26J5
2614B7O1j22J73j77J5J08j50n5M0K81k60L06k00J35l69J63QJ07j11L2J02k12K01
2637A03M5k71J58O5j86J57r1J40j41o0K87k52j12J57J69o3q7J3j32J50j58Q3K59
2660B33l74J93J31j53Lj69j71K35K2l9J0N6k10J00J95j87P6K65k06Ro4K07m21
2683b59K56m8L72l06P4l5J14k93K17m5o9l3M1n3k3Q9R3q7j35M5K00om22L94Q7
2708A68k29j58L16j40K21k36J25pn4L9j33K39j84K7k9j69K93l63J39J40j37L25
$$ plain form
2730 193 117 -7 -105 18 -16 29 -201 -48 106 50 -49 10 18 116 66 62 -78 -99 -96 -84 -251 -51 186 187 -40 9 -110
2757 -110 -60 -144 -79 -19 -121 -53 42 -38 -197 -125 62 -173 124 -8 102 -157 -37 -24 -16 -25 94 -18 -33 301 -10
2782 -10 60 42 -41 -18 -11 -96 36 23 76 95 -51 89 -59 121 217 -66 -29 124 39 -20 -80 41 43 208 141 16
2808 16 56 -56 227 51 -61 -18 -8 21 -3 -21 -100 -124 77 82 -62 -71 132 -181 81 37 18 27 -122 91 -71 -8
2834 -8 39 -5 57 -186 116 -46 35 276 -94 49 -21 15 133 26 -183 39 110 96 153 50 73 -185 -172 -98 51
2859 51 103 94 103 92 89 -27 16 -101 -10 -195 97 194 75 81 216 237 -101 64 -9 138 18 -19 -91 -242 -122 -5
2885 -5 117 103 -191 39 -68 16 52 139 26 90 138 -66 47 241 -13 148 -92 -173 11 -66 160 -209 -121 -34
2909 -34 6 -170 -113 22 116 130 -60 -120 -84 -88 -158 -274 -112 -52 70 46 -138 21 126 88 -63 122 144 -141 18
$$ packed form
2730A93p6j24r8J23l4M5k30J53J54n6r9N9QR8n0mj40k1LJ2j67K00K37Jk27M9j19
2757a10N0q4O5O0j02O8R5q0j59P2J87k35K97j32J10k59J20J3QrJ19j12j5L34l11
2782a0P0j8q3K3Pq5J32j3N3J9j46J40j48J80R6k83L7J53q5n9o0J21KJ65o7j25
2808A6M0j12K83j76j12M3J0K9k4j8p9k4K01Nj44rK03l13K62m4j9Rj49K13j62O3
2834hM7m4O2k43L02j62Q1K41l70J43p0L6J18j07k09K22P1j4N7j03K3k58J3P4J49
2859E1N2rRj1lj16M3j17R1j85K92R7j19OJ35K1l38J65p3J47j20l7p2j51J20J17
2885eJ22j4k94K30j07Q4L6Q7j13O4M8k04J13J94k54J61k40q1J84p7K26l69Q8Q7
2909c4M0j76N7J35R4J4j90o0L6mp0j16J62O0J22k4j84J59J05l8j51J85K2k85J59
$$ plain form
2934 18 -52 -166 30 -35 94 -96 -160 90 -187 145 -7 -88 80 -122 -289 157 -9 -79 222 -87 202 -15
2956 -15 83 50 -141 -193 47 149 59 260 -54 -121 -317 -38 64 -46 157 140 138 -81 -108 6 -7 201 -36 37
2980 37 -113 -67 -53 -92 245 -6 166 91 -43 -100 118 124 107 55 69 -88 -22 138 -73 -90 -175 131 -307 47 191
3005 191 82 -39 -36 -38 132 55 35 -27 -40 54 -60 51 -178 43 188 -106 31 10 -172 -109 -13 52 83 191 -48
3030 -48 91 -36 144 -172 164 2 0 100 -83 -343 -93 93 170 -17 14 130 94 45 -160 -40 -146 34
3052 34 -197 -49 143 83 -164 -170 3 56 61 122 195 -149 103 84 2 -233 111 -279 -107 129 -100 -104 92 -7 -87
3077 -87 82 28 132 11 -24 -137 -11 -15 -129 47 -116 -136 -192 168 186 -38 121 -3 82 63 29 -24 -11 -23 184
3102 184 -167 33 -103 57 15 160 145 -221 167 7 100 126 30 -3 -77 -16 4 0 60 -1 129 69 -149 184 -111
$$ packed form
2934A8p0j14J96o5J29j90o4K50k77L32j52q1J68k02j67M46j66p0L01l09K89k17
2956a5R8l3j91n2K40J02r0K01l14o7j96K79J02j10K03j7kk19k7J14j3K08k37P3
2980C7j50M6J4l9L37k51J72p5j34n7K18Oj7n2J4j57O6J60k11j7q5L06m38L54J44
3005A91j09j21LkJ70p7k0o2j3R4j14J11k29K21J45k94J37k1j82O3R6O5L1J08k39
3030d8J39j27J80l16L36j62kJ00j83k60K50J86P7j87L1J16l6m9k05J20j06J80
3052C4k31J48J92o0k47oJ73N3NO1P3l44K52j9q2k35L44l90J72K36k29mJ96r9q0
3077h7J69n4J04j21l5j13J26mj14J76j63k0n6L60J8k24J59j24Q5j9l4n3J3j2K07
3102A84l51K00j36J60m2J45j5l66L88j60R3K6r6l3p4O1K0mO0o1J30o0k18L33k95
$$ plain form
3127 -111 118 23 -13 -119 67 185 87 -249 66 14 42 64 79 -36 -131 18 -41 155 93 -115 199 -18 43 -92
3151 -92 -215 -3 32 -201 126 87 19 -82 128 -94 -44 91 -73 -189 -90 22 -149 155 -185 163 187 53
3173 53 -33 65 5 -101 -114 136 -34 -89 -73 -38 -65 206 -115 -214 149 148 99 -161 -13 -101 -104 59 -17 30 29 -185 114
3200 114 -87 37 237 85 -19 -219 -4 -170 11 216 -106 -215 180 166 74 295 -131 -114 -191 -62 54
3221 54 -95 109 9 -36 -96 140 -215 70 -206 161 63 79 -191 -8 56 8 -50 -96 167 57 -23 109 135 -5
3245 -5 70 -204 121 40 -264 202 -31 -82 21 -68 96 -112 -100 -203 -156 106 221 -67 43 -4 285 138 3
3268 3 149 -264 -5 -130 -48 -289 -108 -102 -23 146 120 -74 -121 -156 -66 -96 92 136 254 98 38 171 -19 2 92
3293 92 99 109 202 -104 -122 1 -33 -98 -200 106 -78 -14 -31 -85 13 -167 199 -83 26 -185 174 -72 64 11
$$ packed form
3127a11K29r5l6j06J86J18r8l36L15n2K8K2J5j15r5J49n9J96o2k08L14k17O1j35
3151i2j23K12L5k33L27l9o8j01K10k22N0J35j64j16R9J12j71L04l40L48K4j34
3173E3q6R8o0j06j3K50j70n5J6L5k7K71l21r9L63jm9k60J48q8lJ63p6M7jk14K99
3200A14k01J24K00j52j04k00K15j66J81K05l22j09L95j4r2K21m26J7p7J29J16
3221E4j49K04j00m5o0K36l55K85k76L67r8J6k70J83O4m8n8m6K63j10q0J32K6j40
3245eP5k74L25q1l04M66k33n1J03q9J64k08J2j03M7K62J15k88J10m7K89j47j35
3268CJ46m13K59j25Q2k41J81OP9J69k6j94m7l5R0l0J88M4J18j56o0J33j90K1R0
3293I2PJ0R3l06j8J23l4o5j02L06j84O4j7n4R8j80L66k82J09k11L59k46J36n3
$$ plain form
3317 11 -31 -30 -166 25 -140 -166 -97 95 -105 81 -170 97 68 -64 -214 -57 -69 -35 4 -185 -61 -172 -11
3340 -11 -22 -205 26 -110 99 -77 158 -22 50 51 72 124 8 0 55 -131 30 90 -28 -91 26 -6 14 74 135
3365 135 -32 -213 -83 -95 64 72 -172 -113 -208 -127 133 68 -186 139 -26 -84 -89 -45 64 107 -25 135 -119 -6
3389 -6 -113 246 228 -27 183 78 -33 108 28 42 62 -26 -52 -58 -10 -172 -103 169 -13 73 -112 -167 84 -25 152
3414 152 50 81 -47 126 24 14 96 -116 217 14 103 -50 8 -89 2 295 -18 -276 60 308 323 99 102
3437 102 -110 -6 -32 55 32 -71 63 124 -171 -76 -50 28 -132 -213 11 233 192 -144 -130 49 154 -172 -52
3460 -52 14 -43 32 63 119 250 -21 -36 177 3 -277 51 117 -30 75 145 -126 72 66 -70 -110 -28 41 66 65 50
3486 50 -81 24 -120 107 -12 -217 38 -103 55 -33 -49 -23 47 221 -32 -38 -207 198 146 154 7 248 1
$$ packed form
3317A1m2Jj36J91j65k6O9J92k00J86k51K67k9j32j50J57j2L4L9j89J24j11J61
3340a1j1j83K31j36K09j76K35j80P2JK1N2j16qN5j86J61O0j18o3J17l2K0O0O1
3365A35j67j81J30j2J59Qk44N9r5Q1K60o5k54L25j65n8nM4J09M3j32J60k54J13
3389fj07L59j8k55K10j05j11J41q0J4K0q8k6oM8j62O9K72j82Q6j85n5K51j09J77
3414A52j02L1j28J73j02j0Q2k12L33k03Q9j53N8r7R1K93l13k58L36K48J5k24L
3437A02k12J04k6Q7k3j03J34O1k95R5K6P8j60q1K24K22m1l36J4J79J05l26J20
3460e2O6n7P5L1N6J31k71j5K13j74k80L28O6j47J05P0k71J98oj36m0Q2O9K5jj5
3486E0j31J05j44K27j19k05K55j41J58q8j6K6P0J74k53oj69M05n2Qj47K41k47
$$ plain form
3509 1 28 -27 33 9 219 11 -15 140 -29 157 -77 49 -6 125 -25 32 -7 107 -14 4 323 -18 -188 79
3533 79 138 -10 -23 7 -173 24 37 125 -27 44 88 71 29 20 -256 -68 -108 -133 -35 -38 10 167 -54 -43 161 -126
3559 -126 -222 -104 82 55 263 59 142 -75 84 -5 -139 -96 48 -75 68 -66 176 4 144 166 88 -165
3581 -165 -72 -4 62 -66 162 34 -57 180 -97 20 -28 -145 -18 48 39 90 135 91 127 59 96 47 -203 7 -90
3606 -90 47 -230 -15 260 -186 138 15 90 19 57 50 -22 -90 138 -53 -66 -35 197 -136 -43 58 -19 -23 183 -67
3631 -67 -213 -48 -99 -44 275 31 -147 -149 -102 56 -114 -118 57 -5 -85 50 22 183 87 -23 175 33 37 38 44 164
3657 164 80 -13 -285 -19 -39 80 -35 -146 4 -141 -168 -66 -12 -60 -9 220 -199 -22 -49 97 172 40 -45
3680 -45 33 137 -39 -28 -50 -31 -246 -47 16 -74 58 -24 51 111 -11 -15 -40 40 111 -8 26 88 246 103 123 -7
$$ packed form
3509AK7n5O0k4K10k08k6J55j69J86k34J26n5J31j50N7l9J14j21J8L19l41j70K67
3533G9N9j48j3L0j80J97J3Q8j52P1M4j7m2rk76J88m0k5R8lM8J57k21J1K04k87
3559a26r6J18J86k7K08k04Q3k17J59q9j34M3J44j23J43j34K42j72J40K2p8k53
3581a65R3O8O6j28K28j28r1K37k77J17m8j17J27O6rN1M5m4L6o8L7m9k50K10r7
3606i0J37k77K15K75m46L24j23P5p1L8pp2o8K28j91j3L1K32l33R3J01p7mK06k50
3631f7j46J65n1N5L19k44j78kM7J58j70mJ75o2q0J35k8J61r6j10J98j42MJOJ20
3657A64q4r3k72K66k0J19j15j11J50j45k7J02N4m8N1K29m19J77k7J46P5j32q5
3680d5P8J04j76J1k2J9k15J99O3r0J32q2P5O0j22mk5Q0P1j19L4O2J58j43K0j30
$$ plain form
3706 -7 115 -199 -61 -193 -47 83 9 47 8 -21 -18 55 -142 -59 -233 -151 -107 81 -161 -33 155 -51 -58 248 5
3731 5 -208 -33 -48 -98 47 128 -83 348 12 192 71 -84 -35 -90 19 161 -29 245 -9 -103 -240 161 237
3754 237 313 -169 -145 -123 178 13 -65 20 -41 -19 14 41 93 -135 195 -235 29 -29 -108 194 -60 168 -61 123
3778 123 17 -175 -122 -63 -36 -18 173 194 -104 -223 -21 145 28 -147 -152 -34 -235 92 222 110 160 216 -141
3801 -141 54 -206 36 109 53 235 -174 98 160 66 -210 67 72 -45 -4 -242 125 -138 53 -37 -7 63 -133
3824 -133 139 15 -137 141 -70 121 -105 -53 -98 17 -33 32 311 24 59 -68 290 -32 -14 153 -59 -85
3846 -85 10 125 -218 -102 -74 162 15 24 120 202 63 -82 -72 161 -147 -154 -266 118 -164 -97 -4 33 178 -6
3870 -6 -70 -28 145 -78 101 24 66 -17 -154 -2 337 -309 143 -122 -110 82 27 -107 242 105 -1 32 122 -54
$$ packed form
3706gJ22l14J38j32J46J30p4L8l9k9LP3j97Q3j74Q2M4J88k42J28J88k06pL06k43
3731Ek13J75j5n0J45Q1k11M31l36J80j21j55M9n5J09J42j90K74k54r4j37M01P6
3754B37P6m82K4K2L01j65p8Q5o1K2L3K7N2k28L30m30K64n8p9L02k54K28k29J84
3778A23j06j92N3N9K7J8J91K1k98j19K02J66j17j75nJ18k01L27J30j12N0N6l57
3801a41J95k60K42P3n6J82m09K72O2r4k76K77Nj17M1k38L67k63J91r0L0P0j96
3824a33K72j24j52K78k11J91k26N2m5J15n0O5K79k87L5j27L58l22J8J67k12k6
3846h5R5J15l43J16K8K36j47RR6Q2j39j45J0K33l08pj12L84k82O7R3L7J45j84
3870fo4M2J73k23J79p7M2q3j37J52L39o46M52k65J2J92n5j34L49j37j06L3R0j76
$$ plain form
3894 -54 -25 195 -206 15 -4 -178 75 -28 217 -159 6 109 214 -4 -200 -96 -12 -180 37 170 -38
3915 -38 -70 6 -108 149 -3 -168 -8 -262 86 -34 -10 -172 211 138 -121 -70 -80 70 28 -75 -54 250 -135
3938 -135 -88 130 14 97 -33 -176 115 20 8 -280 -286 9 91 106 65 52 -23 64 -16 50 25 -230 -9 -127 -69
3963 -69 -48 -163 -86 97 -26 8 128 -42 47 202 124 -42 -46 12 -134 300 81 11 -88 -75 -60 -254 -43 58
3987 58 110 35 36 104 19 -176 74 -77 -192 -23 107 47 12 51 -34 -11 37 47 -48 -33 13 4 215 45 -33 97 12
4014 12 106 -2 28 -7 -41 -99 -134 203 18 103 248 29 143 255 45 -104 98 20 79 -34 51 18 -110 -79
4038 -79 5 -55 8 -39 -110 -260 57 22 20 -37 35 29 34 -75 -41 -204 52 -245 4 157 69 101 -115 -41 -43 93 198
4065 198 -75 143 -60 -67 -56 -2 -54 -35 18 -91 40 -98 -35 87 -94 8 -253 61 39 -37 -115 -141 49 29
$$ packed form
3894e4K9K20m01K21j9j74K53j03K45l76J65J03J05k18j96J04Q4j68K17J33k08
3915c8l2P6j14K57j52j65J60k54L48j20K4j62L83p3k59N1j0J50m2j03K1L04l85
3938a35M7K18j16Q3j30j43K91r5j2k88oK95Q2J5m1j3p5Q7q0O6k5k55K21j18N8
3963f9K1j15P7J83j23L4J20j70Q9J55p8j66mN8j46M34k19p0r9J3J5j94K11J01
3987E8N2p5JO8q5j95K50j51j15J69J30o0l5L9q5K3M8J0r5J5M6rK11j70p8J30q5
4014A2R4j08L0l5l4n8l5L37j85Q5J45k19J14J12k10j49K02p8N9j13Q5l3j28L1
4038g9Q4o0O3m7p1j50L17l5kn7P2oNj09L4j63K56k97K49J53q8L2k16P4kJ36J05
4065A98k73K18k03pJ1N4n2J9N3j09J31j38O3J22j81J02k61L14k2p6p8k6J90k0
$$ plain form
4089 29 104 29 80 65 -13 67 -98 -98 -183 18 79 -78 -113 -30 31 -138 -115 -157 -248 65 -105 15 116 -112 -31 87
4115 87 18 120 -88 -149 -14 55 99 90 97 73 58 -101 -68 101 270 82 18 75 2 151 -48 -129 179 -38 -236
4140 -236 38 -72 -118 71 113 -94 -116 -73 15 79 -190 187 -155 17 -98 31 150 72 32 102 -72 -19 160
4163 160 327 -225 -264 16 -2 8 -17 121 -142 -135 -71 -73 -20 109 -38 -26 -209 87 65 -137 -62 35 -155 -36 -30
4188 -30 -116 -177 82 70 -76 -105 -23 -263 -51 -80 69 16 51 24 -133 -29 138 6 -285 110 162 -54 -171 -81
4212 -81 110 -5 42 -27 77 -22 -59 -87 -282 -184 23 -118 266 117 -46 157 -352 75 33 4 69 2 -138 -154
4236 -154 46 -128 108 3 -193 75 -117 -121 176 -162 123 -212 90 -65 -102 -101 6 123 -71 5 -225 116
4258 116 193 -110 -141 -144 49 30 195 169 -107 -104 259 58 117 86 -94 -88 141 -93 35 -11 -45 -215 -23 67 -96
$$ packed form
4089B9P5p5N1j5p8Q0j65%q5K01O1j57l5Q3O1j69K3m2r1L13j70J20J01k28Q1J18
4115H7o9J02k08o1J35O9M4rPk4j5j59L3J69J69j88o4N7p3J49j99q1L08k17j98
4140b36K74j10m6J89M2k07k2M3Q8O4k69L77l42J72j15J29J19p8m0P0j74N3J79
4163A60J67n52l9K80j8J0k5J38k63PO4kN3J29j47J2j83K96k2k02P5R7j90J19O
4188c0q6o1K59j2j46k9Q2k40K12k9J49n3L5k7j57J04J67j32k91L95N2k16j17R0
4212h1J91j15M7o9J04r9l7k8j95R8K07j41L84j49j63K03n09M27m2k9O5o7j40j6
4236a54K00j74K36j05j96K68j92mK97l38K85l35L02j55l7JJ07J17j94P6k30L41
4258A16P7l03l1lJ93j9J65k6k76LL63k01N9l1j80OK29k34J28m6l4j70J92R0j63
$$ plain form
4283 -96 132 26 136 3 57 22 89 263 -69 32 207 182 51 -21 153 -9 31 -244 2 40 -105 34 182
4306 182 -149 49 8 -84 60 2 149 33 -110 26 153 186 -100 -27 -175 252 109 -75 -64 -52 -16 101 -72
4329 -72 -211 -35 -44 -25 184 -39 182 -50 108 -21 142 50 0 -129 231 -116 -133 31 14 -116 1 16 -98
4352 -98 61 48 -206 12 -113 -66 108 -261 66 -101 173 147 93 -317 129 106 -202 47 72 122 -195 135 50
4375 50 -69 -66 158 106 -57 -59 -93 84 -85 -42 -11 -64 109 46 -97 -113 170 -74 130 -5 13 110 155 2 80
4400 80 243 -50 -72 28 113 180 41 -4 96 -90 -34 154 -71 8 -28 -38 -105 -176 -126 -66 130 29 210 -42
4424 -42 75 89 -111 10 131 -97 80 -92 -170 -241 60 83 12 -167 17 -54 131 22 -78 74 57 -85 -183
4447 -183 78 51 -108 -104 71 -102 58 -188 30 27 71 -187 105 -117 70 -222 10 194 -81 -95 225 72
$$ packed form
4283i6K28j06J10j33N4l5O7J74l32J01J75k5j31p2J74j62M0k75K46L8j45J39J48
4306A82l31J98m1r2J44n8J47j16j43J36J27L3k86P3j48M27j43j84J1J2L6J17j73
4329g2j39J76rJ9K09k23K21k32J58j29J63r2n0j29L60l47j7J64j7j30J17J5j14
4352i8J59j3k54K18j25M7J74l69L27j67K74k6n4m10M46k3l08K49K5N0l17L30q5
4375E0j19LK24n2j63kl4J77j69M3L1n3J73o3j43j6K83k44K04j35J8R7M5j53P8
4400H0J63k93k2J00Q5O7j39m5J00j86N6J88k25P9l6j0o7p1N0O0J96j01J81k52
4424d2J17J4k00J21J21k28J77j72p8p1L01K3p1j79J84p1J85j09j00J52j7j42r8
4447a83K61k7j59MJ75j73J60k46K18lM4k58K92k22J87k92K32J84k75j4L20j53
$$ plain form
4469 72 40 79 15 -107 39 94 74 -107 49 93 -42 104 152 72 -69 83 -74 61 52 -42 -137 32 -11 110 -24
4494 -24 -123 -183 -142 -42 -38 117 62 -241 111 162 58 -40 17 249 -12 -121 129 10 150 115 -21 -109 -132 11
4518 11 -39 138 -54 121 147 16 -51 81 243 199 -298 -91 -85 -47 160 15 57 120 7 -102 -114 -29 -94 -139 86
4543 86 59 51 -41 -70 79 -213 -168 -69 -23 -90 110 74 -117 -9 143 176 -112 -86 -112 -170 -32 167 -93 141 195
4568 195 -149 -107 -81 141 67 -164 3 -319 -63 -102 -92 60 284 40 62 -193 -8 95 116 -37 -81 37 -162
4591 -162 -27 76 1 -76 -102 -81 106 -184 -122 -142 -134 73 -31 262 -125 -54 81 -235 -266 106 -150 -108 -136 -100
4615 -100 76 -64 -29 -122 -31 17 18 168 76 34 203 -148 -24 -112 42 -130 -51 66 -149 -23 -6 85 -87 82
4639 82 -124 -84 -87 -95 -265 -13 43 -12 117 113 78 125 -71 -93 -44 24 64 -23 139 13 7 75 -229 -154 78 -214 -217 227
$$ packed form
4469G2l2L9o4j22J46N5k0j81J56M4j35J46M8q0j41J52j57J35rr4r5J69m3J21j34
4494b4r9o0M1J00MJ55n5l03L52N1j04r8N7K32k61j09K50j19J40l5j36q8k3J43
4518A1n0J77j92J75K6j31o7J32J62m4m97K07OL8K07j45M2O3j13j09j2Q5o5m5K25
4543H6k7qr2k9J49k92M5R9M6o7K00l6j91J08J52L3k88K6k6n8J38J99k60K34N4
4568A95l44M2K6K22p4k31J67l22K56l9J0J52K24k44K2k55J85J03K1j53m4J18j99
4591a62J35J03p5p7k6K1J87k90O2k0QK07j04K93l87P1J35l16l1L72k56M2k8L6
4615a00J76j40L5r3R1M8JJ50r2m2J69l51J24q8J54j72P9J17k15J26J7R1j72J69
4639H2k06M0lqj70K52N6n5J29ml5M7j96k2M9O8M0q7J62j26oO8l04P5K32k92lM44
$$ plain form
4667 227 77 -111 64 -86 207 175 10 13 43 -4 1 -84 -8 71 7 31 -93 -55 34 -55 37 -185 148 -37 -144
4692 -144 -183 134 42 -201 171 96 106 85 -95 82 -176 -13 117 147 -122 56 17 -121 22 -35 -40 299 -4
4715 -4 -77 40 102 29 -77 -17 129 -11 -330 267 67 -30 -151 74 85 -115 64 -110 -111 78 200 33 -132
4738 -132 132 115 -62 165 122 -17 39 -142 -76 55 140 243 -138 59 44 231 129 -135 -106 -110 140 60 142 -135
4762 -135 68 6 -132 25 -91 -90 -225 -52 -4 -60 61 20 19 34 67 -28 3 -101 -59 -8 -140 -28 -62 50 38
4787 38 98 198 29 145 80 52 -1 12 -5 -13 -106 38 125 -44 50 105 23 -2 -32 -25 206 -166 191 -110 -5 -32
4813 -32 88 -125 40 76 -30 -116 -33 61 -113 69 -36 167 1 80 -98 94 -143 -231 203 -155 61 79 225
4836 225 69 64 120 68 -53 69 -14 55 -61 1 96 60 220 64 13 -139 -254 35 113 83 149 81 22 -277 173
$$ packed form
4667B27j50j88J75j50K93l2j65LL0m7Nq5P6P9o4K4j24L8Q9q9R2k22L33j85j07
4692a44l9L17r2k43L72p5J0k1j80J77k58J63J30L0k69J78l9j38J43n7nL39l03
4715dp3J17O2p3j06O0J46j40l19N97k00r7j21K25J1k00J79j74jJ89J22j67j65
4738a32K64j7j77K27m3j39N6j81O6J31Q5J03l81J97j5J87j02k64K9mK50q0Q2k77
4762a35K03o2j38J57j16Jj35J73M8n6J21m1jJ5L3r5L1j04M2N1j32J12l4J12j2
4787C8O0J00j69J16o5k8n3J3j7qr3J44Q7j69R4N5q2k5l0PK31l72L57l01J05k7
4813c2J20k13J65L6j06q6Q3R4j74J82j05K03j66P9j78J92k37q8M34l58K16J8J46
4836B25j56nN6n2j21J22q3O9j16O2R5l6J60j56n1j52j15K89P8l0O6o8n9k99M50
$$ plain form
4861 173 247 -66 -91 169 102 -86 17 -60 -7 -181 -27 0 -69 -22 -47 9 -55 43 -81 -17 132 33 154 221 -61
4886 -61 15 -6 90 24 60 124 126 -123 15 166 82 55 28 8 163 4 46 342 -30 1 81 16 298 -67 -46 18
4912 18 143 -49 -12 217 32 4 36 -36 -181 257 -53 -19 0 0 -60 183 -44 70 112 -54 53 -210 40 138
4936 138 -50 -105 4 76 48 92 -44 -4 -30 -31 -46 -262 -82 -94 133 -265 -6 107 -273 13 -181 -13 48 -23
4960 -23 -111 150 10 138 104 -7 216 -44 99 47 52 -150 -316 92 -186 2 -17 127 23 -110 81 -123
4982 -123 -4 -136 239 -54 102 115 -22 176 -41 -91 114 132 -68 126 -94 138 58 -109 82 66 39 9
5004 9 -135 67 103 -127 48 -164 17 55 169 -217 64 4 158 37 -204 -36 43 -22 -89 -71 17 269 -117
5027 -117 104 77 -129 -1 -102 -154 -33 126 20 144 50 70 150 82 104 -4 -28 -111 -23 78 -63 -145 179 -15
$$ packed form
4861A73P4l13k5K60o7j88J03p7N3j74J54K7o9M7k5N6o4R8j24O4J49r9J21O7k82
4886f1P6k1R6o6L6O4Kk49J38J51q4k7k7k0J55j59M2K96l72L1Q0o5K82l65K1O4
4912A8J25j92L7K29j85k8L2p2j45M38l10L4J9%o0K43k27J14M2j66J07k63K50R8
4936A38j88n5J09P2k8M4j36M0k6jj5k16J80j2K27l98K59J13l80K86j94J68O1p1
4960b3q8K61j40J28l4j11K23k60J43n2Nk02j66M08k78J88j9J44j04j33J91k04
4982a23J19j32L75k93J56J3j37J98k17n0K05J8k00J94k20K32q0j67J91j6k7l0
5004Ij44K02L6k30J75k12J81L8J14l86K81o0J54j21k41J68P9o5o7J8Q8K52l86
5027a17K21k7k06J28j01n2J21J59j06J24r4K0Q0o8K2j08k4q3Q8J01j41q2L24j94
$$ plain form
5051 -15 -28 245 -188 -67 5 -56 121 27 -18 -13 30 -40 84 183 87 154 -50 -34 86 40 325 37 24 68 -20 -47
5077 -47 -244 35 -12 195 136 -235 54 -67 -12 -34 -117 85 4 -104 -17 -133 191 117 134 114 12 8 94 -131 -54
5102 -54 -113 -151 40 -169 -90 84 153 -104 125 224 -176 213 2 -43 167 -54 67 -122 -91 47 -26 129 -19
5125 -19 136 -198 -12 51 28 -102 116 119 -5 208 88 6 -114 -23 -71 29 -2 -145 151 180 -205 -180 38 -130
5149 -130 233 -46 -1 -46 116 -239 -92 -48 -82 83 83 -118 16 85 83 -59 22 164 -167 51 -122 42 -127
5172 -127 -102 -200 -335 -110 -257 66 -52 222 66 -22 5 103 163 -196 -56 77 -113 183 85 -116 199 148 -104
5195 -104 -32 223 13 -120 -36 -227 -18 55 78 7 172 74 -167 -132 -140 -72 96 104 -48 11 -4 -85 -33 22 138 120
5221 120 114 -103 -11 -91 38 -20 -119 29 -128 -217 249 -111 -93 2 19 155 -177 73 27 -70 -206 -35 119 112 70
$$ packed form
5051a5j3K73m33J21P2o1J77r4m5NM3p0J24R9r6O7k04J6J20m6K85k88j3M4q8k7
5077d7j97K79m7K07n9l71K89j21N5k2q3K02q1j08Q7j16L24p4J7k0j02mQ6k25P7
5102e4n9l8J91k09P9J74O9k57K29R9m00L89k11m5K10k21J21j89L1J38p3J55j48
5125a9J55l34J86O3k3j30K18Lj24K13j20q2j20R1m8J00l1j43K96K9l85K5K18j68
5149a30L63k79M5m5J62l55J47M4l4J65%k01J34O9kj42Q1J42l31K18j73J64j69
5172a27K5r8j35K25j47L23j18K74j56q8K7R8O0l59J40J33j90K96r8k01L15n1k52
5195a04P2K55k10j33Q4j91K09P3K3p1J65r8k41L5qO8J68Qj52N9j5q1N2N5J16j8
5221A20ok17R2q0J29n8r9J48j57q9M66l60J8R5J7J36l32K50m6r7j36J71J54pm2
$$ plain form
5246 70 41 185 55 -19 81 2 147 89 -198 72 3 192 -5 -206 -67 9 -39 -39 56 90 -111 125 -99 -290
5270 -290 90 146 -14 74 -51 139 97 31 33 -49 31 131 54 -222 27 39 -180 -54 -35 118 -198 148 -70 -86
5294 -86 -2 125 -165 -31 66 -65 52 252 -27 -95 1 73 73 170 142 -193 97 119 -73 194 116 147 234 -102 48
5319 48 -273 -23 0 -75 116 -119 281 138 63 -138 -224 68 6 62 5 -13 -202 77 18 -47 138 -79 -30 -99
5343 -99 127 -53 47 -234 -90 11 -217 90 -43 26 -195 -144 32 68 -305 133 14 6 30 -56 112 -23 -140
5366 -140 -84 42 61 -25 50 116 -71 117 35 -112 -150 4 -117 -171 189 -47 31 175 -85 20 65 70 116 29 -256
5391 -256 187 -125 106 -125 111 -117 -150 112 -98 22 -79 95 -198 2 -66 -113 104 11 -82 18 93 170
5413 170 -39 -205 -35 -18 -11 117 -61 -50 -57 77 26 16 226 72 78 65 31 -201 -33 134 150 115 126 -54 -188
$$ packed form
5246G0k9J44j30p4J00p9J45n8k87K70o9J89j97k01J39P6m8%R5L4k01K36k24j91
5270b90L80N6j60Q8j25J90m2o6Kq2Q0J00p7k76K49J2k19J26J9J53l16L46k18j6
5294h6Q4J27k90J34R7j31J17K00k79o8R6P2%R7k8l35K90K2j92K67p8L1Q7l36J50
5319D8l21K50K3p5J91k35M00j43p5k01q6K92o2N6n7j8j89K79n9o5J85k17M9o9
5343i9K26j80J00k81J44J01k28L07j33O9k21N1J76L6l73M38j19qK4q6J68j35j17
5366a40N6J26J9q6P5O6j87J88q2j47l8J54j21n4L60k36P8J44k60J05M5NM6q7k85
5391b56M43l12K31k31K36k28l3K62k10J20j01J74k93K00o8m7K17r3r3J00P5P7
5413A70k09j66J70J7PJ28j78J1pJ34n1j0K10j54Oj3l4k32J68J67J6l5J1j80j34
$$ plain form
5438 -188 82 10 149 -67 -117 92 -159 109 66 -85 -292 -135 94 80 -151 -13 -18 128 107 -102 -83 -92 23
5461 23 110 -1 -9 55 98 -28 -251 -64 -56 11 -256 83 -131 168 -27 1 140 -26 -86 -51 -236 48 -100 -131
5485 -131 -37 -234 -52 -121 -6 98 196 -110 -8 -16 6 154 -19 -25 3 37 -48 17 128 135 153 111 281 41 -295
5510 -295 -49 18 104 73 169 -79 -105 -60 -28 -75 -17 -18 -194 138 134 50 3 209 -51 146 87 -19 -53 96 -196 -111
5536 -111 130 -200 191 94 -80 135 122 10 194 5 112 -24 128 171 -10 -86 64 -64 -25 54 -254 66
5558 66 27 -55 -90 -24 59 19 97 -93 -111 -86 -146 37 85 -141 -70 9 143 -24 93 -67 19 142 206 -213 293
5583 293 1 -136 -73 -40 -33 -16 -189 -239 -55 169 261 -54 -180 -138 -15 -310 -119 -189 118 131 -141 95 -53
5606 -53 -168 312 -45 -121 -102 125 99 -7 89 114 43 -24 -14 4 -199 105 -215 -190 124 -111 93 51 -43 -188
$$ packed form
5438a88K70p2J39k16n0K09k51K68m3j51k07J57K29j4k31J38nJ46k1k09J9rJ15
5461B3Q7j11qO4M3j26k23J87QO7k67L39k14K99j95K8J39j66o0L5j85K84j48l1
5485a31R4j97J82o9J15J04R8l06J02qK2J48j73oK8L4q5O5J11PJ8m2J70k40l36
5510b95K46O7Q6l1R6k48k6M5L2m7N8jj76L32mq4m7K06k60J97n9j06l4J49k92Q5
5536a11K41l30L91r7j74K15j3j12J84j89J07j36J52M3j81p6J50j28L9P9l08L20
5558F6l9q2l5O6Q3m0P8j90j8K5o0J83M8k26P1P9J34j67J17j60Q6J23O4m19N06
5583B93k92j37O3L3PJ7j73n0J84K24R2l15j26M2J23k95J91p0L07J3k72K36j48
5606e3j15M80l57p6J9K27k6j06R6K5p1o7J0J8k03L04l20K5L14k35K04m2r4j45
$$ plain form
5630 -188 40 -110 64 84 8 -214 -15 200 55 -110 -18 52 -110 -142 77 50 -227 328 -67 -11 143 7
5652 7 47 -27 -108 -56 -91 11 21 8 41 -16 163 101 13 -13 91 -6 -189 -70 -220 95 1 62 -34 112 105 -8 213
5679 213 -195 160 -191 115 60 -55 -54 -58 105 3 -129 -4 -22 -12 41 -10 -37 -1 16 -124 115 -24 -66 -85 -24
5704 -24 -107 -9 95 89 47 -177 -29 112 -137 200 158 -88 84 -5 19 -75 -11 27 133 90 -8 73 -68 68 -169
5729 -169 -112 127 -19 -60 42 -23 -78 15 -95 124 -118 -42 24 -20 -87 -204 -153 -85 -96 -119 197 -167 134 -52
5753 -52 -225 -39 217 -34 -50 -38 127 -83 -134 -173 35 48 60 39 -70 -106 64 95 248 5 84 -31 56 -62
5777 -62 96 -21 -134 104 -58 195 -114 59 -198 137 -119 -13 -22 37 93 -48 28 -108 -170 -7 -236 -166 181
5800 181 143 -236 216 -26 -103 -39 101 -51 -24 113 -26 -59 -142 46 -14 -72 -9 171 111 60 65 42 107 -16 29
$$ packed form
5630a88K28j50J74K0p6k22J99K15j45j65R2P0j62l2K19k7k77N55l95N6J54j36
5652GM0p4q1N2l5J02J0j3L3n7J79o2q8k6J04r7j83J19j50L15r4O1r6J46pj13K21
5679B13m08L55l51L06n5j15JmJ63j02j32J25j8J0N3n1k7L6J7j40K39j39m2j9O1
5704b4q3R8J04om2k24J48J41k49L37m2k46J72q9K4r4O4L8J06m3r8Q1j41J36k37
5729a69N7K39j46m1J02o5n5R3j10K19k42P6O6m4o7j17N1O8j1k3L16l64L01j86
5753e2j73J86K56k51j6J2J65k10n1l9K08J3J2k1j09l6J70L1J53k43P9j15Q7j18
5777f2J58j17j13K38j62K53l09J73k57L35k56J06rN9N6j41P6j36o2J63k29P0L47
5800A81l8l79M52k42p7O4J40j52K7J37j39l3q3J88o0n8O3J80o0n1Nk3O5j23M5
$$ plain form
5825 29 -95 -229 -2 -156 221 29 34 52 -124 -92 -9 233 -298 -35 87 -16 101 7 11 295 115 -2 -91
5848 -91 -19 9 -288 -40 -52 67 23 -155 -73 116 100 29 -15 -85 21 22 57 79 -6 273 252 -107 166 -110 -44 13
5874 13 -206 -217 110 -120 -91 102 211 -8 -34 81 73 -224 -64 -275 -128 -195 -48 -140 -34 150 139 -87 7
5897 7 -33 75 113 117 158 -166 -25 16 226 125 -42 11 -38 -69 9 28 78 61 90 -30 255 230 31 -10 -19 -227 -248
5924 -248 -85 -95 -123 -16 -245 264 192 29 -38 128 -139 -174 -181 92 56 -28 -88 103 38 4 25 -12 -194 34 110
5949 110 21 120 148 -18 -66 -31 -29 -154 -139 -14 40 -79 -190 65 113 -77 -64 114 67 -33 75 264 -143 -72
5973 -72 -22 -127 57 125 -144 158 16 17 -50 -4 298 -98 -72 -104 -51 89 57 52 -168 -130 -41 268 90 130 19
5998 19 13 -212 135 99 46 -283 195 241 21 -32 -44 -105 102 -71 -154 170 310 -172 9 54 -93 140 135 25
$$ packed form
5825B9j24j34K27j54L77j92NJ8j76L2Q3K42n31K63J22j03J17r4MK84j80j17q9
5848i1P2K8k97K48j2J19m4j78Q2J89j6p1m4p0J06JL5K2q5K79k1l59K73k76O6N7
5874A3k19j1L27k30K9J93J09k19k6J15qk97J60k11J47o7J47r2J06J84j1k26R4
5897Gm0J08L8MM1l24J41M1K10j01j67N3m9l1P8J9N0j7K9j20K85k5j99m1rk08k1
5924b48J63j0k8J07k29N09p2j63o7J66k67l5pK73l6q4o0J91o5l4K1l7j82K28P6
5949A10q9R9K8j66m8L5Kj25J5J25N4j19j11K55M8j90J3J78m7j00J08J89m07P1
5973g2N0j05J84O8k69L02j42Jo7M6L02l96K6l2N3J40l2nk20L8Q9L09j78M0j11
5998A9ok25L47l6n3l29M78M6k20n3j2o1K07j73q3L24J40m82J81M5j47K33nj10
$$ plain form
6022 25 74 -31 -116 6 -230 -33 23 28 28 -50 22 -46 83 -244 -21 -71 81 -105 128 8 -10 -149 -91 350 -10
6047 -10 30 -85 -217 83 101 357 60 -13 62 3 123 0 -240 -60 -82 61 -101 -146 64 61 -40 75 34 169
6071 169 -7 -107 63 63 128 -284 13 -99 28 -12 153 -63 261 -16 58 -10 -93 124 -26 -68 8 77 183
6094 183 7 -67 22 43 -240 190 79 -46 -157 141 69 25 31 27 -57 -175 -53 -32 -59 -86 100 -44 -151 139
6118 139 27 -16 -38 12 128 -17 14 -21 -8 35 249 -200 101 -75 -142 -68 251 20 34 42 -67 5 158 55
6142 55 -80 -227 108 97 -4 -80 -1 -150 211 193 151 94 -128 149 136 58 75 68 -26 32 93 -37 -136 -68 9 -60
6168 -60 26 -4 171 117 147 -172 -52 143 -22 -56 82 29 137 110 -7 42 2 -77 67 0 81 114 80 -51 214
6193 214 -7 97 77 -136 -72 23 68 -20 -77 165 30 -96 64 -51 -103 62 64 237 -70 199 326 -4 -147
$$ packed form
6022B5M9j05q5J22k36J97N6N%p8P2o8J29l27K23n0J52j86K33j20j8j39N8M41l60
6047a0M0j15j32L00J8K56k97p3P5n9J20j23k40J80k2J43j62m5K10lj01J15m1J35
6071A69j76j00J70%O5m12K97j12J27m0J65k16L24k77P4o8q3K17j50m2P6O9J06
6094A83j76p4Q9K1k83M30j11j25j11K98p2m4Omq4j18J22K1k7k7J86j44j07K90
6118A39j12m3k2N0J16j45L1l5J3M3K14m49L01j76o7P4L19k31J4Qj09P2J53j03
6142E5j35j47L35j1j01p6P9j49L61j8m2n7k22K77j3p8J7pr4N8O1j30r9O8P7o9
6168f0Q6l0J75n4L0l19J20J95j65l4J38n3J08k7j17M9m0p9J44o7Q1L3l4j31K65
6193B14k21J04k0k13O4R5M5q8n7K42j35j26J60j15n2J65KJ73l07K69J27l30j43
$$ plain form
6216 -147 12 24 3 70 135 64 -79 -21 -202 30 66 -13 50 227 -21 -54 -38 35 -143 105 -38 43 -152 23
6240 23 -17 -96 16 135 124 8 -46 -218 -15 -56 248 -30 -57 -154 19 292 -25 63 25 -74 123 -59 -19 -134
6264 -134 95 27 92 -30 -106 -67 -16 165 133 -436 137 12 122 -85 -15 68 -179 119 -3 -94 68 78 112 11
6288 11 -186 -52 -172 155 91 139 31 37 212 30 82 -83 15 -41 -15 -109 303 -127 -109 57 133 27 65 16 -112
6313 -112 108 18 -260 143 -47 -10 -43 1 -7 137 -84 122 91 215 -12 -52 220 229 145 81 -17 -123 127 28 -63
6338 -63 -148 -38 49 -109 61 -34 64 -65 -169 66 -62 -14 83 -113 153 57 22 94 104 84 215 -186 57 -100
6362 -100 -166 99 -97 103 93 -97 317 124 -31 63 -106 101 59 85 6 -271 -144 -91 -229 204 133 -32 206
6385 206 -4 -179 11 -157 13 37 0 63 25 -173 -13 273 267 -168 -53 -163 -169 -32 24 101 -92 -136 -67 108
$$ packed form
6216a47J59J2k1O7O5p1j43N8j81K32L6p9O3J77k48l3J6P3j78K48j43Q1j95J75
6240B3m0p9J12J19j1j16n4j72K03m1L04k78k7r7J73K73l17Q8l8r9J97j82M0j15
6264a34K29o8O5j22p6L9N1J81l2n69N73j25J10k07P0Q3k47K98j22r1J62J0L4j01
6288A1j97J34j20L27o4M8j08OJ75j82N2j65R8n6K6r4M12m30J8J66P6j06L8m9j28
6313a12K20r0k78M03j90L7l3M4qJ44k21K06l1J24k27m0K72Rq4o4r8j06K50r9r1
6338f3q5J10Q7j58J70r5R8j29j04K35j28M8R7j96K66r6l5P2J0k0J31m01K43j57
6362a00o6K65j96K00j0j90M14j93j55R4j69K07m2K6p9k77J27N3j38M33p1j65K38
6385B06k10j75J90j68J70K4l7O3l8j98J60K86om35J15j10oJ37N6P7j93m4O9J75
$$ plain form
6409 108 254 7 -147 23 -108 50 -221 -45 -45 -23 -29 178 -89 112 -2 44 -56 14 277 -192 -81 -255
6431 -255 -120 13 99 161 -170 4 110 260 58 -158 27 80 33 -34 84 -276 2 48 -133 158 111 4
6453 4 102 12 -222 276 79 183 33 90 -229 71 -159 -39 142 -145 50 198 -194 280 -75 59 102 48
6475 48 119 -44 99 -5 -117 -125 81 -204 63 -98 -85 25 -33 183 18 -129 188 -29 75 114 186 -79 -7
6498 -7 96 55 223 82 -138 44 -139 93 -24 56 103 85 -151 163 -30 -387 -140 36 146 182 58 -100
6520 -100 209 -27 -224 -41 41 -237 11 175 76 37 46 74 -81 -169 158 -197 -75 -20 132 91 97 85 -53 -34
6544 -34 146 19 82 -268 -106 -156 -15 -48 -64 181 117 129 31 118 45 -37 -212 -14 -114 -121 33 41 -90 16 32
6569 32 34 23 289 204 13 146 85 -185 18 7 70 -95 -39 41 -145 -228 -34 1 -12 -66 -220 243 -158 -57 -55
$$ packed form
6409A08J46k47j54J70j31J58k71J76%K2oK07k67K01j14M6j00P0K63m69J11j74
6431b55J35J33Q6O2l31J74J06J50k02k16J85N3m7o7J18l60K78M6j81K91m7j07
6453DR8r0k34M98j97J04j50N7l19L00k30J20J81k87J95J48l92M74l55J34M3n4
6475D8P1j63J43j04j12qK06k85K67j61J3J10n8K16j65j47L17k17J04L9P2k65P2
6498gJ03m1J68j41k20J82j83K32j17Q0M7j8k36L14j93l57K47J76J10L6j24j58
6520a00L09k36j97J83Q2k78K48J64r9l9RK8j55q8L27l55J22N5J52m1Oj2j38J9
6544c4J80j27O3l50J62n0J41l3j6K45o4J2r8Q7p3q2j75J98j00pJ54Qj31J06J6
6569C2Kj1K66q5j91J33o1k70K03j1O3j65N6Q0j86q3J94L5j3n4j54M63m01J01K
$$ plain form
6594 -55 -16 74 -47 -16 -124 4 186 -205 -97 65 -70 89 49 68 154 138 23 -179 -31 124 -68 98 -134
6617 -134 -241 124 -11 -89 -71 -33 11 -43 167 0 53 190 -43 102 -163 -96 -35 2 7 -286 -42 59 -65 232
6641 232 256 117 14 86 45 36 90 -123 -126 -47 291 -5 60 -4 -44 -136 65 -202 119 61 -30 -54 -18 34 3 -41 147
6668 147 -26 -61 -79 -95 -1 20 16 -49 11 104 151 -8 113 -63 38 1 37 -36 20 152 161 -95 61 -96 231 49
6694 49 50 -29 131 188 -243 -70 49 -75 -83 161 220 128 15 12 -146 36 -59 -24 -60 107 -9 -56 -64 -53 -197 113
6720 113 -74 88 280 181 -56 -41 59 92 55 -88 199 10 -174 -8 215 259 87 65 -61 -113 -149 -55 105
6743 105 -7 64 232 76 -96 -26 0 194 2 -144 246 -155 -203 -14 96 4 -11 99 55 45 246 -49 63
6766 63 262 -273 135 24 -77 69 50 48 -86 129 165 -173 -19 -50 182 80 10 -187 -81 -130 54 -7 -228
$$ packed form
6594e5L9R0j21L1j08J28J82l91J08J62j35J59m0J9Q6j6j15k02J48J55j92J66k32
6617a34j07L65j35p8J8L8M4n4K10j67N3J37k33J45k65O7O1L7Nk93K44J01j24K97
6641B32K4j39j03P2m1rN4k13lP9L38k96O5o4m0r2K01k67L21n8r1k4L6N2l1m4J88
6668A47j73l5j8j6R4K1mo5O0R3M7j59J21j76J01l7L6p3N6J32Rk56J56j57L27j82
6694D9Jp9J60N7m31J73J19j24qK44N9r2j13lj58J82r5L5l6J67j16m7qJ1j44L10
6720A13j87J62J92r9k37J5J00L3l7j43K87j89j84J66K23M4j72k2j26n2l6R4J60
6743A05j12P1J68j56j72P0K6J94j92j46L90m01m8J89J10r2j5J10m4j0K01k95J12
6766F3J99n35M08j11j01J46j9kj34K15L6l38J54l1K32j02p0j97J06m9J84o1k21
$$ plain form
6789 -228 33 -207 95 98 22 -51 18 -46 25 -5 -22 -270 62 -18 84 70 -132 210 -52 -53 -69 -137 35 -54 -22 -89
6815 -89 -41 -64 -60 -224 -4 139 139 -134 154 3 -16 175 -55 -40 123 63 -128 -29 57 195 -4 -2 232 -68 200
6840 200 -88 -13 20 4 89 11 -157 -43 17 134 27 86 -80 -8 -185 53 102 77 67 -135 182 38 17 -227
6864 -227 -26 -146 -80 -140 42 -134 -126 12 249 -69 -234 93 -32 109 120 -75 -125 -26 202 192 71 93 -9
6887 -9 116 -97 -19 111 -131 67 -50 -32 -45 -165 -20 -138 134 -287 172 -35 -139 -254 -46 21 133 -98
6909 -98 -34 31 -107 -238 118 -137 -155 -116 115 -79 -53 207 -236 -62 -106 -155 -217 107 219 177 33 -91 -111 -11
6933 -11 -259 141 92 -185 -214 -13 96 -38 -118 155 58 207 -76 -119 -41 -14 7 -164 66 17 -94 94 -101
6956 -101 -121 231 155 154 4 52 12 -24 -336 -217 -95 -53 -2 45 118 -159 -87 124 -27 -23 -28 71 16 173 209 -8
$$ packed form
6789b28K61k40L02Lp6p3O9o4P1l0j7k48L32q0J02j4k02L42k62jj6o8J72q9L2o7
6815h9M8k3Mj64K20J43%k73K88j51j9J91k30J5J63o0j91R9Q6J38j99KK34l00K68
6840B00k88P5L3j6Q5p8j68J14O0J17j07N9j66P2j77K38M9k5j0k02L17j44k1k44
6864b27K01j20O6o0J82j76QJ38K37l18j65L27j25J41J1j95n0R9K28j0j21K2j02
6887iJ25k13P8J30k42J98j17J8j3j20J45j18K72m21M59k07j04j15K08O7J12k31
6909i8O4O5j38j31L56k55j8L9K31j94K6K60m43J74m4m9o2L24J12m2j44j24k0J00
6933a1k48M00m9k77k9K01J09j34q0K73r7J49k83m3P8K7K1j71K30m9j11J88j95
6956a01k0L52p6jj50M8m0l6l12J19J22M2N1M7P3k77P2K11j51MnR9n5J57L6k17
$$ plain form
6982 -8 -26 75 206 -103 65 -48 -31 -194 106 -94 13 19 -83 36 32 -69 -138 -112 17 127 137 40 23 43 -192
7007 -192 -3 -122 -60 -43 49 141 33 2 415 113 5 230 -89 82 -121 56 214 121 122 120 -77 -97 -187 -4
7031 -4 -15 -49 83 -154 216 -43 -41 163 -134 63 75 111 39 122 142 -326 -30 150 -174 222 -110 -128 -46 31 -126
7056 -126 -136 -20 -62 -4 19 -254 -21 63 -168 -12 45 100 47 119 -71 -4 68 137 -111 3 24 233 32 -100
7080 -100 -88 228 204 -21 47 -66 193 148 -108 -70 25 8 273 -49 29 -16 102 -65 8 -163 -57 44 -47 -161
7104 -161 -29 42 -268 104 211 -175 52 139 -95 -88 62 -165 76 362 -122 146 62 61 -113 -155 -199 -114 -10
7127 -10 -223 -272 -31 44 92 -72 266 -29 -99 -218 160 -132 19 -150 127 -14 141 -33 166 67 -28 88
7149 88 15 60 -107 -23 -210 19 -210 91 25 178 308 33 -22 74 154 5 116 -74 120 27 99 -71 206
$$ packed form
6982hj8J01J31l09J68j13J7j63L00k00J07Oj02J19mj01o9K6J29J10J0r7j7K0k35
7007a92J89j19O2J7R2R2j08l1M13l02j08K25l19J71k03J77J58r3Jkj97k0r0J83
7031dj1l4J32k37L70k59KK04k97J97J2L6p2Q3K0m68K96J80l24L96l32j8Q2P7j57
7056a26j0J16m2N8K3k73K33Q4k31J56N7N5n3P2j90O7P2O9k48J14K1K09k01j32
7080a00J2L16k4k25O8j13K59m5k56L8R5j7K65l22P8m5J18j67P3j71J06J01r1j14
7104a61J32P1l10L72J07l86K27Q7k34PJ50k27K41K86m84K68q4jj74m2m4Q5J04
7127a0k13m9K41P5M8j64L38k95p0j19L78k92J51j69K77j41J55j74J99r9r5J16
7149H8p3M5j67Q4j87K29k29L01o6J53J30k75n5R6Q0j49J11j90J94r3P2j70K77
$$ plain form
7172 206 149 136 5 -151 109 159 38 -1 141 120 -87 192 203 -86 217 -122 -137 -256 34 -26 89 -19 75
7195 75 30 -136 59 19 -16 -161 -116 -41 -130 -7 109 -121 -121 29 -126 201 -33 101 -33 -132 -40 -65 32 27 82
7220 82 -22 87 -142 -109 78 -91 -127 -14 -299 -156 -181 -342 140 -27 -1 111 56 -103 103 96 -122 62 204
7243 204 -105 -44 26 49 17 -6 -75 -57 -152 230 129 161 -59 -86 161 42 12 33 -107 -1 -60 -61 43 -33 150
7268 150 -84 25 134 31 10 -14 -48 -223 -190 60 -38 -104 62 -64 73 -178 93 106 147 -98 -31 -223 -99
7291 -99 10 47 -62 89 -79 -85 0 104 -184 92 -122 20 257 96 68 -16 -11 46 -88 23 81 36 23 259
7315 259 137 10 242 -181 104 -25 65 -72 83 -229 188 46 -23 -87 180 -70 -71 147 -51 187 -159 -96
7337 -96 40 89 130 14 0 -43 91 -60 -176 159 -23 218 174 26 -37 -90 10 -33 -81 225 56 -21 -135 78
$$ packed form
7172B06n7j3j31j56K60N0j21l9J42k1k07K79J1k89L03l39j5j19K90o0J15j08R4
7195G5m5j66J95m0l5j45M5P5q9J23J16k30%J50j55L27k34J34j34r9R2k5R7nN5
7220H2j04J09k29L3J87j69l6J13k85J43k5j61M82j67K6J12n5j59K06pk18J84J42
7243B04l09O1P0K3l2k3o9J8r5L82j01L2k20k7K47j19l0K1j40J06n9jJ04p6J83
7268A50k34J09J09j03k1k4l4j75L3K50r8o6J66j26J37k51K71J3M1k45O7j92J24
7291i9J09L7j09J51j68oQ5J04k88K76k14J42K37j61k8q4NN7j34J11N8m5j3K36
7315B59j22j27K32m23K85j29R0j37J55l12M17j42o9o4K67k50jK18j98K38l46O3
7337i6J36M9M1j16j4m3J34j51j16L35j82K41m4j48o3n3J00m3m8L06j69p7j14K13
$$ plain form
7361 78 -66 77 59 -108 -141 54 104 40 177 -108 -4 -41 -235 93 1 28 18 67 7 -152 17 -92 230 -62
7385 -62 -253 13 -86 80 -67 178 158 177 24 -147 11 -21 56 -26 -180 -78 203 -181 114 -60 -227 -178 -173
7408 -173 196 6 175 -98 -63 184 108 -137 -103 203 -41 105 55 93 -85 44 -152 -257 -70 -42 -252 37
7430 37 45 -86 36 -117 226 -203 74 14 -195 -6 164 34 158 57 -93 -107 291 -23 105 110 -69 -73 50
7453 50 127 -31 -174 229 -126 79 -17 -76 115 1 174 28 -68 -129 -106 165 -20 49 -103 171 124 -57 32
7476 32 149 -154 -122 -98 -15 -66 -50 193 82 -152 -182 -302 -135 -5 70 27 -32 122 -11 56 -166 -232 190 33
7500 33 62 25 -264 -21 -36 -92 -232 -171 149 -92 159 50 160 -31 -9 -21 104 9 -57 -168 -9 153 129 -68
7524 -68 -156 -96 208 -17 48 -193 -125 122 7 49 -161 110 74 16 190 20 39 -58 -109 -97 -191 104 -38 -35 -46
$$ packed form
7361G8j44J43j8j67l3J95N0o4J37k85J04l7j94L28r2K7j0M9o0j59J69j09L22k92
7385f2j91K66r9J66j47K45k0J9j53j71J58l2P7q2j54J02K81l84K95j74j67M9N
7408a73L69j90J69k73L5K47p6k45L4L06k44J46n0L8j78J29j96j05J87K8k10K89
7430C7Qj31J22j53L43m29K77o0k09J89J70j30J24j01j50j4L98l14J28Nj79mJ23
7453E0P7j58j43M03l55K05r6n9J91j14J73j46r6o1K3K71j85O9j52K74m7j81Q9
7476C2J17l03L2K4Q3n1J6K43j11k34l0j20J67J30P5m3n9J54j33O7k22o6M22j57
7500C3K9l7k89K43j5n6j40O1L20k41K51j09J10j91K2j2J25r5o6j11J59J62k4j97
7524f8q8O0L04k25O5k41O8K47j15M2k10K71l6n8J74j70J9r7n1J2r4K95j42Lj1
$$ plain form
7549 -46 31 203 198 113 116 -142 122 45 7 96 -125 -6 -172 -63 185 -45 104 -12 -98 32 -171 -90 110 0
7573 0 -249 -55 15 -50 -59 -27 117 62 52 15 38 7 -66 90 -123 200 -10 -167 -153 304 -108 -63 2 99 12 -19
7599 -19 100 -129 177 -73 -137 117 69 -108 -217 102 34 146 64 86 -90 51 106 -127 68 -29 -67 -144 -18
7622 -18 -141 110 -91 181 -15 -49 66 -46 13 222 -100 104 6 0 43 -207 -19 66 39 -146 -16 -38 -48 -38
7646 -38 84 288 -58 144 101 9 82 -101 17 57 137 -79 -25 -233 -81 109 156 -30 -52 8 190 -305 150
7669 150 -240 -33 123 -132 224 90 -37 -11 24 -49 119 -83 -111 30 23 -247 -383 -9 -58 119 143 -26 145
7692 145 98 -38 7 -176 257 -8 -236 -29 -202 171 -28 302 -92 -14 -33 97 -25 -8 33 -54 -243 27
7714 27 157 46 -46 52 20 72 112 -45 5 -82 -82 -140 -11 39 50 -20 104 124 33 167 -97 -2 35 23 18 270 -94
$$ packed form
7549d6P7J72nq5Lk58K64p7l8Q9k21J19j66J09K48k30J49j16q6J30k03Q1K00j10
7573@k49J94P0o5rL2J44n5j0l7K3l1p3J56k13L23k10j57J4M57m12M5O5R7q7l1
7599a9J19k29L06k50o4K54m8j77j09L19o8J12q2K2j76J41N5k33J95r7l8p7J26
7622a8j23K51k01K72j96l4J15j12N9K09l22K04r8oM3k50J88Q5k7j85J30k2j0J0
7646c8J22K04l46K02m3r2P3j83J18M0Q0k16N4k08J52J90M7j86k2O0J82m95M55
7669A50l90K07J56k55L56j34j27K6L5p3J68k02k8J41pk70j36L74m9J77K4j69J71
7692A45m7j36M5j83M33k65k28K07j73L73j99L30l94P8j9J30j22J7M1q7j89K70
7714B7J30j11r2R8l2N2M0j57N0q7%n8J29N0J1p0J24K0r1J34k64R5L7j2nK52l64
$$ plain form
7741 -94 -23 32 33 92 -299 60 103 204 -134 -100 92 -64 -97 -107 -97 89 5 -15 71 109 -48 223 -137 -52 -4 170
7767 170 80 126 36 -79 -32 33 122 207 120 95 -47 -30 110 -122 151 -101 -21 16 -159 141 237 90 56 -86 -4
7792 -4 194 -123 -125 -3 -124 -149 -43 11 -123 114 78 16 -34 218 2 44 -106 -87 108 -134 88 -79 32 19
7816 19 -74 -7 127 36 -33 -28 99 115 115 114 189 -102 177 -47 159 104 -113 12 81 -20 -100 -74 133 79 41 86 71
7843 71 197 143 75 -39 -107 71 30 75 143 19 157 -49 -110 -62 -70 115 -163 -114 -53 34 124 -128 -174 150 -279
7868 -279 -54 16 -18 102 -197 70 250 -105 27 -122 227 45 -70 47 -43 8 -1 95 -51 -6 176 -161 22
7891 22 -31 141 -85 127 -39 15 -91 -152 143 -114 -3 199 101 100 -102 -119 -70 -1 -72 -245 -21 -25 63 14 -71
7916 -71 5 36 64 79 -39 -145 -33 -117 -93 44 -161 -49 -72 -111 126 -132 79 -276 -14 -6 -9 91 78 -83 -28
$$ packed form
7741i4P1N5JN9l91L59M3J01l38L4J92j56l3j0J0J86q4k0Q6L8j57K71l60Q5M8J74
7767A70r0M6r0j15M7O5Q9Q5q7k5j42J7J40k32K73k52Q0L7j75L00R6j47l4j42Q2
7792dJ98l17kJ22j21k5J06N4j34K37l6o2n0K52k16M2j50J9J95k42K22j67J11j3
7816A9r3O7J34r1o9NJ27J6%jP5k91K79k24K06n5k17J25O9j01q0K6K07n4l8M5j5
7843G1J26n4o8j14o8J78m1M5O8j24J38k06o1M8qJ85k78M9O1Q7R0k52m6L24m29
7868b79K25P0l4J20k99K67J80l55J32j49L49j82j15J17r0N1rR6j46M5J82l37J83
7891B2n3J72k26K12j66N4j06o1K95k57J11K02r8jk02j7M9O9p1j73K24mQ8m9q5
7916g1P6L1K8J5j18j06J12q4K4J37k05J12k3l9K37k58K11l55K62QlJ00j3j61N5
$$ plain form
7941 -28 86 -84 125 235 -50 212 -25 -27 51 9 -92 -229 140 252 -15 -140 8 -121 154 -128 15 -51
7963 -51 160 81 -83 -32 -115 113 70 70 -147 -97 -29 109 136 134 83 -208 -78 -34 -173 -147 92 -18 -131 36 105
7988 105 2 -40 52 -158 85 161 -26 178 -26 -12 -180 73 44 120 48 -132 -65 147 -233 -140 -23 -106 83
8011 83 -92 -183 320 -53 44 4 -20 328 -171 282 -38 82 79 -43 3 -67 90 -183 224 5 182 60 208
8034 208 170 -50 -101 63 172 35 83 30 16 278 -9 -14 232 -52 -27 151 191 51 -22 135 126 -93 -103 11
8058 11 149 222 136 75 -223 -1 0 31 113 -123 28 157 99 142 235 -8 142 211 -127 -30 -57 1 5 43 157 -48
8084 -48 59 27 137 -62 -55 128 -9 -81 60 82 -96 -3 82 218 183 -264 39 -132 -44 -143 141 -7 -9 55 -229
8109 -229 -304 -91 -66 86 -12 132 -66 -16 182 -14 63 156 114 108 163 -117 -121 -134 -115 181 -7 -52 -1 -88 20 -2
$$ packed form
7941b8J14j70K09J10k85K62k37kP8m2j01j37L69J12k67j25J48j29K75k82J43o6
7963e1K11p9j64N1q3K28m3%k17N0O8J38K7kn1k91J30M4j39K6K39j10j13J67O9
7988A05j03m2R2k10K43P6j87K04k04J4j68K53k9P6p2j80O7K12l80R3J17q3J89
8011H3j75r1N03l73R7m0k4L48m99M53l20J20lj22M6p0J57k73M07k19J77j22J48
8034B08l8k20n1J64J09j37M8n3j4K62k87nK46k84K5J78M0j40p3J57rk19j0J14
8058A1J38P3q6o1k98K22JL1Q2k36J51J29n8M3R3k43J50O9l38R7k7N8ML8J14k05
8084d8J07l2J10j99PJ83j37p2J41K2j78R3Q5J36l5m47L03j71Q8r9K84j48kO4k84
8109b29p5K13K5J52r8J44j98N0J98j96P7R3m2oN5k80mj3J9K96j88m5N1q7J08k2
$$ plain form
8135 -2 -62 23 154 31 71 -31 -55 46 -78 70 16 15 184 150 -106 -20 9 24 60 -217 183 85 -199 -42 -106
8160 -106 156 77 85 6 38 -137 3 -140 10 97 75 -13 84 -16 270 46 -211 30 200 -188 197 205 -12 -131
8184 -131 99 86 63 37 3 -72 70
$$ packed form
8135bo0Q5J31j23M0j02k4J01j24J48n4jJ69l4k56Q6K9J5L6k77M00r8k84J57o4
8160a06K62p9Qp9L2j75J40j43J50Q7k2q8R7j00K86k24k57K41J70l88L85Qk17j19
8184a31K30j3k3k6l4p5J42
8191G0
$$ Imaginary data points
##PAGE= N=2
##DATA TABLE= (X++(I..I)), XYDATA
$$ plain form
0 0 0 0 0 0 0 0 0 0 0 0 0 -8 8 -8 8 -16 16 -24 24 -32 32 -40 48 -62 72 -80 96 -112 128 -145 168 -192 217
33 217 -248 279 -315 355 -397 443 -495 551 -614 679 -753 833 -920 1016 -1120 1232 -1360
50 -1360 1498 -1651 1818 -2007 2218 -2454 2721 -3029 3387 -3808 4309 -4923 5693 -6690 8041
65 8041 -9979 13020 -18492 31473 -132013 -14891 109497 -189586 -27965 156416 -44049
76 -44049 -97760 194293 98058 -135192 67397 228919 -57822 -90173 190791 111236 -127409
87 -127409 47728 169427 -64234 -98484 109874 15283 -139734 25046 86475 -124892 -85450
98 -85450 111871 -13768 -155206 36730 98327 -109630 -81595 108039 8434 -113425 38655
109 38655 81624 -77388 -30856 100334 -11232 -76610 81814 76044 -83682 -5806 120040
$$ packed form
0@%%%%%%%%%%%qJ6j6J6k4L2m0M8n6O4p2Q8j10J34j52J76k08K40k73L13l60M09
33B17m65N27n94O70p52Q40r38J046j165J293j432J586j753J936k136K352k592
50a360K858l149L469l825M225m672N175n750O416p195Q117r232J0616j2383J4731
65H041j8020K2999l1512M9965j63486J17122J24388k99083J61621J84381k00465
76d4049n3711K92053r6235k33250K02589J61522k86741l2351K80964p9555k38645
87a27409J75137J21699k33661l4250K08358r4591j55017J64780O1429k11367L9442
98h5450J97321j25639j41438J91936O1597k07957K8035J89634r9605j21859J52080
109C8655M2969j59012M6532J31190j11566o5378J58424n770j59726P7876J25846
$$ plain form
120 120040 -16807 -90004 63229 62831 -84532 -27637 74221 -26671 -69622 44689 25609
131 25609 -70382 6724 65957 -44276 -50843 69056 25594 -76294 7788 74142 -28874
142 -28874 -46159 56946 29906 -48875 11835 46186 -35911 -27842 47080 -6977 -59685 25729
154 25729 43867 -51342 -28273 60956 7494 -54110 18376 43030 -31290 -19029 39327 -2855
166 -2855 -33695 22509 16135 -41228 -2960 41864 -18831 -37736 33947 26333 -40920 -9107 41669
179 41669 -5135 -30447 19512 17552 -23512 4203 28713 -12469 -11892 33106 5947 -35808 7733
192 7733 32430 -21404 -26484 26308 10611 -30414 -935 22080 -11453 -10725 19475 -1028 -19496
205 -19496 13087 12994 -24740 -6557 27072 -6535 -30988 9247 19826 -18001 -11770 20071 3581
$$ packed form
120A20040j36847p3197J53233l98j47363N6895J01858j00892m2951J14311j9080
131B5609r5991P7106N9233j10233o567J19899m3462j01888Q4082O6354j03016
142b8874j7285J03105k7040p8781O0710L4351q2097Q069P4922n4057n2708Q5414
154B5729J8138r5209K3069Q9229n3462o1604P2486K4654p4320J2261N8356m2182
166b855l0840N6204o374n7363L8268M4824o0695j8905P1683p614o7253L1813N0776
179D1669m6804k5312M9959j960m1064K7715K4510m1182N77M4998k7159m1755M3541
192G733K4697n3834n080N2792j5697m1025K9479K3015l3533P28L0200k0503j8468
205a9496L2583r3l7734J8183L3629l3607k4453M0235J0579l7827O231L1841j6490
$$ plain form
218 3581 -15256 5924 7900 -12583 2152 16910 -7645 -10606 18823 9612 -19096 1594 24012
231 24012 -4019 -17882 8684 9072 -14240 -5002 8520 -6412 -7282 8461 -2852 -14709 7257
244 7257 13157 -11981 -8300 16103 3498 -17377 354 13161 -4860 -7822 8228 3461 -6017
257 -6017 4073 4958 -6362 1763 11409 -4402 -9935 9907 9579 -10726 -4508 12143 1197 -10984
271 -10984 963 5410 -5253 -2763 3426 -4542 -5502 4240 -2178 -11328 1286 8473 -6161 -7482
285 -7482 9236 7797 -5874 -359 8688 1911 -2432 3279 1886 -1080 4724 3103 -5889 -697 8295
300 8295 -1679 -9548 1749 6282 -6055 -7628 3623 2326 -4944 -1431 1547 -2199 -466 2134
314 2134 -2418 -1549 5800 2278 -6089 -87 6780 -792 -5361 3210 5532 -1996 -2158 2421 887 -289
$$ packed form
218C581j8837K1180J976k0483J4735J4758k4555k961K9429r211k8708K0690K2418
231B4012k8031j3863K6566L88k3312R238J3522j4932q70J5743j1313j1857K1966
244G257N900k5138L681K4403j2605k0875J7731J2807j8021k962J6050m767r478
257f017J0090Q85j1320Q125R646j5811n533J9842l28k0305O218J6651j0946j2181
271a0984J1947M447j0663K490O189p968r60R742o418r150J2614P187j4634j321
285g482J6718j439j3671N515R047o777m343N711j393k966N804j621q992N192Q992
300H295r974p869J1297M533j2337j573J1251j297p270L513K978l746J733K600
314B134m552Q69P349l522q367O002O867p572m569Q571K322p528j62M579j534j176
$$ plain form
330 -289 1848 -358 -2207 2333 2098 -4239 -2133 5304 829 -6421 -1653 3474 -1969 -4302 755 2241
346 2241 -505 -391 -194 -1238 997 2375 -1523 -1697 4083 2953 -3445 -1092 4871 1770 -3149 -324
362 -324 1936 -752 -2010 -212 -64 -84 887 -1214 -2845 1224 2518 -2132 -2028 3116 2376 -2457 -1189
379 -1189 2543 1141 -873 -160 353 5 -108 -1104 -2068 764 2794 -968 -2833 1454 2602 -1600 -2342
396 -2342 2121 1788 -1778 -1465 534 706 236 241 -391 728 1765 -1034 -2586 319 2067 -1075 -2362
413 -2362 828 1965 -535 -622 987 1116 355 -345 -512 81 1246 170 -1625 -199 1689 -233 -2308
430 -2308 -244 1776 387 -1538 395 1875 789 -311 -10 507 735 158 -1372 -462 1621 872 -1549
447 -1549 -329 1977 -143 -1948 -391 396 -930 -1948 -1322 -405 463 102 -885 106 1413 861 -770
$$ packed form
330b89K137k206j849M540k35o337K106P437m475p250M768N127n443k333N057J486
346B241k746J14J97j044K235J378l898j74N780j130o398K353N963l101m919K825
362c24K260k688j258J798J48k0R71k101j631M069J294m650J04N144p40m833J268
379a189L732j402k014P13N13l48j13r96r64K832K030l762j865M287J148m202p42
396b342M463l33l566L13J999J72m70No32J119J037k799j552K905J748l142j287
413b362L190J137k500q7J609J29p61p00j67N93J165j076j795J426J888j922k075
430b308K064K020j389j925J933J480j086j100L01N17K28n77j530R10K083p49k421
447a549J220K306k120j805J557P87j326j018O26R17Q68l61r87R91J307n52j631
$$ plain form
464 -770 -341 1276 753 -654 -440 967 741 -390 -192 1059 1468 378 -431 -291 567 876 -585 -796
482 -796 1019 1092 -1244 -1418 633 785 -674 -672 285 -118 -765 -1097 -529 274 364 -1182 -1464 740 920 -399
502 -399 -220 1431 2045 912 -197 215 854 399 -760 -333 257 -113 -540 -643 74 797 39 -1142 -631
521 -631 941 10 -1318 -211 1233 709 -2 -276 31 704 589 -425 36 1187 -328 -1599 -211
538 -211 585 -627 -977 -427 389 596 -216 -363 606 1628 442 -290 47 87 -272 -525 -627 -173 -71 -605
558 -605 -624 514 608 -219 -450 267 140 99 -126 -470 303 1060 64 -439 483 694 -469 -485 448 -151 -444
579 -444 -395 -420 -200 -15 -758 -370 697 722 -219 220 779 443 295 -160 -251 -62 92 -575 -337 -261 -358 -280
601 -280 -116 177 100 -78 -228 -102 401 233 -418 -79 671 531 325 541 252 382 337 -152 -253 -79 -379
$$ packed form
464g70M29J617n23j407K14J407k26j131J98J251M09j090q09J40Q58L09j461k11
482g96J815P3k336j74K051J52j459KR57m03o47l32N68Q03R0j546k82K204J80j319
502c99J79J651O14j133j109M12O39m55j159M27N90l70m27j03P17P23p58j181N11
521f31J572r31j328J107J444n24p11k74L07O73j15j014M61J151j515j271J388
538b11P96j212l50N50Q16K07q12j47R69J022j186p32L37M0l59k53j02M54J02n34
558f05j9J138R4q27k31P17j27m1k25l44P73P57r96n03R22K11j163j6R33n99k93
579d44M9k5K20J85p43L88J067K5r41M39N59l36j48m55r1J89J54o67K38P6r7P8
601b80J64K93p7j78j50J26N03j68o51L39P50j40k06K16k89J30m5m89j01J74l00
$$ plain form
622 -379 -986 -118 635 71 -488 -49 406 319 46 -257 217 628 -139 -477 -174 -200 -430 10 -60 -360 -159
643 -159 -404 -95 12 420 80 -25 441 250 126 177 99 275 466 226 -274 -308 460 -160 -408 -91 -360
664 -360 -427 -414 -704 -339 -229 -309 -227 270 603 141 57 310 491 228 -45 19 261 156 193 24 159 -225 -287
687 -287 -34 87 -184 -190 299 -74 120 205 -298 -316 167 1 -132 -229 -157 -191 -76 -178 -325 -118 68 -307 -249
710 -249 131 112 348 66 626 332 588 93 303 591 351 -219 -119 108 -227 -23 -128 -406 -176 -42 -185
731 -185 -404 115 -184 -104 -197 -68 162 -170 -124 -83 -145 418 -342 -73 301 62 -29 -151 419 307 -54 170
753 170 6 294 129 -64 28 340 176 -161 -27 226 -30 -187 -619 -374 -161 -125 -323 -271 -268 -160 -176 45
775 45 -67 111 260 -59 38 231 172 78 159 103 186 -76 56 32 230 -233 -79 5 -222 -52 -118 -313 17 -63
$$ packed form
622c79o07Q68P53n64n59M39M55q7k73l03M74M11p67l38L03k6k30M40p0l00K01
643a59k45L09J07M08l40j05M66j91j24N1p8J76J91k40n00l4P68o20k48L17k69
664c60o7J3k90L65J10q0Q2M97L33m62q4K53J81k63k73O4K42j05L7j69J35l84o2
687b87K53J21k71oM89l73J94Q5n03j8M83j66j33r7P2l4J15j02j47K07J86l75N8
710b49L80j9K36k82N60k94K56m95K10K88k40n70J00K27l35K04j05k78K30J34j43
731a85k19N19k99Q0r3J29K30l32M6M1o2N63p60K69L74k39r1j22N70j12l61K24
753A70j64K88j65j93R2L12j64l37J34K53k56j57m32K45K13L6j98N2LJ08j6K21
775D5j12J78J49l19R7J93n9r4Q1n6Q3k62J32k4J98m63J54Q4k27J70o6j95L30q0
$$ plain form
799 -63 -326 -35 223 -35 -14 -67 109 120 -210 -9 -365 -29 -136 -90 40 128 -109 -73 -173 -17 251 173 23
822 23 120 17 -68 13 -80 -76 117 -47 -262 -77 -48 -99 24 3 107 15 -138 -44 132 135 161 -154 175 -17 -292
847 -292 -86 19 72 -115 -168 -58 -155 -84 -35 -298 -171 40 191 -30 42 47 290 15 -150 114 58 -17 -62 -118
871 -118 105 62 -218 -46 82 -50 -124 -221 -22 -193 -330 -209 -1 249 23 -49 116 132 97 293 139 331
893 331 2 102 57 -47 -81 53 -8 137 -92 158 -256 -147 37 -68 -124 -368 -188 39 -246 -61 -25 -26 23
916 23 -90 -148 51 -113 215 12 208 65 92 -253 85 90 -56 153 18 308 133 142 -72 -106 -43 -19 -39 -16
940 -16 -65 -293 -260 -39 -111 -95 -139 -297 -145 -66 -59 -101 19 251 178 -219 209 242 76 0 183 -28 -13 126 -87
965 -87 192 -66 7 -381 76 73 -113 62 -36 73 206 -56 -211 55 -93 -172 60 -182 114 204 -187 -98 -63
$$ packed form
799f3k63K91K58k58K1n3J76J1l30K01l56L36j07M6J30Q8k37L6j00J56K68p8j50
822B3R7j03q5Q1r3MJ93j64k15J85K9n1J23k1J04r2j53R4J76LK6l15L29j92k75
847b92K06J05N3j87n3J10r7P1M9k63J27K11J51k21P2NK43k75j65K64n6p5m5n6
871a18K23m3k80J72J28j32p4r7J99j71j37J21K08K50k26p2J65J6l5J96j54J92
893C31l29J00m5j04l4J34o1J45k29K50m14J09J84j05n6k44J80K27k85J85L6jM9
916B3j13n8J99j64L28k03J96j43K7l45L38Nj46K09j35K90j75Rk14l4O3K4k0K3
940a6m9k28L3K21p2J6m4j58J52P9Pm2J20K32p3l97M28L3j66p6J83k11J5J39k13
965h7K79k58P3l88M57lj86J75r8J09J33k62j55K66j48p9K32k42K96R0l91Q9L5
$$ plain form
988 -63 -128 -186 -141 57 -18 7 20 -231 58 159 -137 144 372 304 -69 -66 -90 -61 4 193 -62 111 -144 -240 -21
1013 -21 106 19 -222 -1 137 82 -80 170 125 36 38 -208 -142 63 135 -27 -73 48 61 -21 31 57 129 218 -328
1038 -328 144 157 89 -167 -37 148 166 155 -98 -51 105 -57 36 130 -99 -449 -117 93 -5 2 40 -107 203 215
1062 215 -160 18 379 497 60 15 -113 -266 -185 -37 -57 -146 54 -260 -175 205 -10 103 -99 6 230 128
1084 128 55 -44 1 39 -192 -212 -11 98 -214 167 -111 -36 24 3 40 41 146 175 26 96 5 -109 128 -231 40
1109 40 -96 -40 -66 40 -124 -148 121 56 -187 204 124 343 -87 112 -283 88 365 -121 -147 -110 6 -61 -52 59
1133 59 -104 211 -163 -89 99 156 -97 -13 284 84 49 -225 144 69 194 47 -30 -164 -98 126 45 -245 -159
1156 -159 166 134 -30 -78 -14 25 98 -109 140 -292 153 9 103 232 133 81 88 324 -38 203 204 108 -55 -218
$$ packed form
988f3o5n8M5J98p5K5J3k51K89J01k96K81K28o8l73Lk4K9O5J89k55J73k55r6K19
1013b1J27q7k41K21J38n5j62K50m5q9Kk46O6K05P2j62m6J21J3q2N2K6P2Q9n46
1038c28M72J3o8k56J30J85J8j1k53M7J56j62R3R4k29l50L32K10r8PL8j47L10J2
1062B15l75J78L61J18m37m5j28j53Q1J48k0q9K00l14Q5L80k15J13k02J05K24j02
1084A28p3r9M5L8k31k0K01J09l12L81k78P5O0k1L7JJ05K9j49P0r1j14K37l59K71
1109D0j36N6k6J06j64k4K69o5k43L91q0K19m30J99l95L71K77m86k6L7J16o7RJ11
1133E9j63L15l74P4J88N7k53Q4K97k00l5k74L69p5J25j47p7j34O6K24q1k90Q6
1156a59L25l2j64m8O4L9P3k07K49m32M45j44R4J29r9n2PK36l62K41Jr6j63j63
$$ plain form
1180 -218 46 -72 28 -64 -75 -102 -96 -87 53 81 15 161 86 59 57 319 -59 -90 -75 112 -5 111 126 -16 135
1205 135 17 12 -65 -1 142 -192 -5 -55 97 -14 13 -103 -132 72 -241 -130 -28 125 15 27 -40 16 126
1228 126 58 98 -55 128 -230 75 -39 -132 71 46 -30 37 -125 -79 83 -183 -97 -143 -131 -112 -41 -15 -38 -193 -136
1253 -136 -66 104 136 -82 -176 -160 275 38 -156 -21 64 75 -228 47 -133 2 -2 91 65 -48 67 29 10 188
1277 188 53 -16 115 -40 -148 -169 -151 -210 -115 142 61 -23 -9 40 58 -84 -53 -144 -3 -4 -6 -51 -7 -35 -38 -91 -103 -135
1305 -135 -24 12 -114 95 -287 -122 8 -24 -56 245 115 -193 33 -91 -62 24 93 186 90 -46 -16 27 43 53
1329 53 -43 -132 -111 94 33 -259 -112 99 100 -90 -64 -93 62 -42 238 -67 85 -129 26 -109 42 136 54 75
1353 75 183 233 85 105 -86 112 -39 74 -15 20 3 -123 7 139 48 -235 -190 15 173 -20 101 38 378
$$ packed form
1180b18K64j18J00r2j1k7ORJ40K8o6J46p5k7kK62l78l1J5J87j17J16J5j42J51
1205A35j18np7O4J43l34J87n0J52j11K7j16k9K04l13J11J02J53j10J2o7N6J10
1228A26o8M0j53J83l58L05j14r3K03k5p6O7j62M6J62k66Q6m6J2J9P1K6k3j55N7
1253a36P0J70L2k18r4J6M35k37j94J35Q5J1l03K75j80J35mR3k6j13J15l8j9J78
1277A88j35o9J31j55j08k1J8n9R5K57q1q4J4M9J8j42L1r1J41jkm5M4k8ln3j2l2
1305a35J11L6j26K09l82J65J30l2l2L01j30l08K26j24K9Q6O9R3r6j36L0M3J6J0
1329E3r6q9K1K05o1k92J47K11Jj90K6k9J55j04K80l05J52k14J55j35J51R4q2K1
1353G5J08N0j48K0j91J98j51J13q9L5j7j26J30J32r1k83M5K05J58j93J21o3L40
$$ plain form
1376 378 -94 59 -56 -356 171 -66 226 163 14 -7 -281 -98 -28 137 195 -94 43 -129 -128 30 -134 367
1398 367 -6 48 159 79 -279 -29 181 204 -71 69 -143 16 123 -78 -121 40 -179 -44 -38 -204 -147 -219 -11
1421 -11 -159 91 -33 135 31 -68 -2 -91 -316 39 239 6 129 -179 -45 28 -87 -80 -178 74 210 -66 -109
1444 -109 95 74 -126 74 -31 -264 -1 93 6 59 99 24 -26 164 127 132 -19 75 85 -99 -107 87 142 -20 25
1469 25 -47 106 -105 -68 -117 117 -58 43 130 10 52 29 -150 174 129 126 72 99 30 113 154 -45 101 -80 215
1494 215 -121 -224 381 50 149 -37 26 152 -113 96 60 62 61 5 -98 63 97 81 -11 -161 131 10 -59 -75
1518 -75 108 -228 -70 15 -161 43 43 124 -15 283 155 -135 -103 -113 -8 -150 149 204 191 -165 -118 -92 23 -73
1542 -73 -136 -137 108 -158 -137 -70 76 107 27 -166 -155 39 189 5 57 27 12 84 42 -157 125 25 -223 110 164
$$ packed form
1376C78m72J53j15l00N27k37K92o3j49k1k74J83P0J65N8k89J37j72JJ58j64N01
1398C67l73N4J11q0l58K50K10K3k75J40k12J59J07k01m3J61k19J35Oj66N7p2K08
1421a1j48K50j24J68j04r9O6q9k25L55K00k33J23l08J34P3j15Pr8K52J36k76m3
1444a09K04k1k00K00j05k33K63R4q7N3M0p5n0J90l7Nj51R4J0j84qJ94N5j62M5
1469B5p2J53k11L7m9K34j75J01Q7j20M2k3j79L24m5ln4K7o9Q3M1j99J46j81K95
1494B15l36j03O05l31R9j86O3J26k65K09l6Kjn6j03J61L4j6r2j50K92j21o9j6
1518g5J83l36J58Q5j76K04%Q1j39K98j28k90L2j0J05j42K99N5j3l56M7K6J15r6
1542g3o3jK45k66K1O7J46L1q0j93J1J94J50j84N2l0j5P2m2j99K82j00k48L33N4
$$ plain form
1567 164 90 141 -74 32 192 -13 -160 -67 -134 30 -41 -155 63 251 21 272 50 65 -71 118 -238 -1
1589 -1 43 -13 23 75 -97 -102 -33 39 88 -61 -104 157 30 -93 25 213 -167 19 190 -6 -79 -52 63 -249 -26
1614 -26 -102 -55 -169 187 115 -345 -110 128 -148 -58 -173 18 17 176 5 -28 107 -114 -220 -29 120 38 85
1637 85 -141 12 206 -78 0 16 56 -37 -34 -70 158 70 -126 -66 -71 -30 -73 30 152 -22 -22 -17 189 37 199 71
1663 71 -172 42 -49 -148 -226 111 111 38 91 110 -142 -30 -23 -1 83 43 60 61 21 -19 21 -247 282 -98 -79 54 25
1690 25 -99 79 -252 -20 166 171 13 -43 -192 85 17 67 81 141 32 -284 -59 -141 -130 152 -144 36 85 133
1714 133 31 161 -1 -108 -17 -162 170 44 9 -42 -40 -129 105 -169 -93 -169 59 61 -93 -293 29 26 -1 -60 172
1739 172 -35 43 5 -207 29 127 -188 -108 -30 -96 -39 104 228 140 183 -16 131 -141 -280 25 -125 -22 17
$$ packed form
1567A64p4N1k15J06J60k05j47R3o7J64p1j14K18J88k30K51k22J5j36J89l56K37
1589aM4n6L6N2j72nO9P2M9j49m3K61j27j23J18J88l80J86J71j96p3K7J15l12K23
1614b6p6M7j14L56p2m60K35K38k76R0j15J91jJ59j71l3J35k21j06J91J49q2M7
1637H5k26J53J94k84P8J6M0r3Ll6K28q8j96O0nM1m3J03J22j74%NK06j52J62j28
1663G1k43K14r1r9p8L37%p3N3J9k52J12PK2Q4m0J7Jm0m0M0k68N29l80J9J33k9
1690B5j24J78l31K32J86Nj58n6j49K77o8N0J4O0j09l16K25q2J1K82k96J80M9M8
1714A33j02J30j62j07R1j45L32j26l5n1Kq9K34k74P6p6K28Kj54k00L22lk7n9K32
1739A72k07P8l8k12K36R8l15Q0P8o6N7J43J24q8M3j99J47k72j39L05j50J03L9
$$ plain form
1762 17 267 -208 119 277 -26 297 91 32 -159 98 21 31 84 173 336 184 -64 5 103 -32 113 -339 13
1785 13 -106 183 -247 264 -16 61 171 55 134 -129 -56 -4 161 -111 173 62 -18 78 12 146 244 -84 -131
1808 -131 45 -194 38 14 -65 -226 -28 -35 -162 238 -8 -423 -40 38 80 24 -101 -141 152 -254 252 68 -68
1831 -68 8 -163 37 -94 211 -52 5 -40 102 -57 125 -60 93 45 193 -131 -49 82 -20 14 -28 10 77
1854 77 -41 -2 -156 82 -152 -81 -59 -91 5 -73 -144 85 -10 131 124 49 35 -139 126 24 91 117 -138 9 -22
1879 -22 -59 -197 -133 -16 164 0 -146 23 53 26 -118 -8 -150 55 -90 209 246 -171 -56 32 -194 -66
1901 -66 133 -65 -68 -3 12 -131 173 -121 101 -134 -117 -242 -121 -181 51 102 7 64 -51 232 127 59 -35 244
1925 244 7 55 -72 84 11 140 16 -209 26 -26 61 95 203 21 -91 95 11 -83 24 -18 38 36 96 -60
$$ packed form
1762A7K50m75L27J58l03L23k06n9j91K57p7J0N3Q9J63j52k48O9R8j35J45m52L52
1785A3j19K89m30N11k80P7J10j16P9k63P3N2J65k72K84j11q0R6o6J34R8l28m7
1808a31J76k39K32k4p9j61J98pj27M00k46m15L83P8M2n6j25m0K93m06N06j84j36
1831f8P6j71K00j31L05k63N7m5J42j59J82j85J53m8J48l24Q2J31j02L4m2L8O7
1854G7j18L9j54K38k34P1K2l2R6p8p1K29r5J41pp5j4j74K65j02O7K6k55J47l1
1879b2l7j38O4J17J80j64j46J69L0k7j44J10j42K05j45K99L7m17J15Q8k26J28
1901f6J99j98lO5J5j43L04k94K22k35J7j25J21o0K32N1r5N7j15K83j05o8r4K79
1925B44k37M8j27J56p3J29j24k25K35n2Q7L4J08j82j12J86q4r4J07m2N6kO0j56
$$ plain form
1949 -60 106 248 -135 -73 78 70 9 -59 -20 -104 121 -1 -134 -12 -163 -4 249 -54 -46 11 13 -219 -38 143
1973 143 63 -154 -98 -48 79 -30 -104 66 304 23 -47 50 132 53 128 154 -76 334 -17 91 67 50 258 -140
1997 -140 269 -92 41 214 -58 -86 38 15 -119 127 -90 -116 101 128 -19 -136 40 88 209 134 65 -150
2019 -150 -175 61 40 38 -78 -1 -51 70 71 228 -156 54 -37 115 -113 1 68 21 -319 95 56 -126 -60 -141 240
2044 240 70 -111 -4 67 -26 -56 214 -73 183 11 136 16 -189 -16 176 12 -89 -119 -67 -344 -117 90
2066 90 -60 12 101 -24 128 91 -137 -61 -231 80 98 -142 182 26 -115 156 -162 13 70 145 44 -70 43
2089 43 -60 34 -144 -198 -23 18 16 -47 63 18 -240 -120 -3 82 -128 50 -63 -69 148 -100 -51 -151 43 -207
2113 -207 -33 1 -22 106 28 138 -45 34 -197 49 43 -44 -44 22 251 66 -54 -176 -15 -202 -203 -95 142 -14
$$ packed form
1949f0J66J42l83O2J51qo1o8L9q4K25j22j33J22j51J59K53l03QN7Kk32J81J81
1973A43q0k17N6N0J27j09p4J70K38k81p0R7Q2p9P5K6k30M10l51J08k4j7K08l98
1997a40M09l61J33J73k72k8J24k3j34K46k17k6K17K7j47j17J76M8J21p5o9k15
2019a50k5K36k1kj16P7n0J21JJ57l84K10r1J52k28J14O7m7l40M14l9j82O6q1L81
2044B40j70j81J07P1r3l0K70k87K56j72J25j20k05J73J92j64j01l0N2k77K27K07
2066I0j50P2Q9j25J52l7k28P6j70L11J8k40L24j56j41K71l18J75N7P5j01j14J13
2089D3j03R4j78n4J75M1ko3J10m5k58J20J17Q5k10J78j13oK17k48M9j00J94k50
2113b07J74L4k3J28p8J10j83P9k31K46oq7%O6K29j85j20j22J61j87jJ08K37j56
$$ plain form
2137 -14 48 5 85 -161 121 103 -234 -65 -58 -42 -59 59 124 125 -156 103 18 102 49 -86 -2 140 135 49 154 -294
2163 -294 -162 109 128 117 -39 236 139 32 -40 17 32 185 -2 -126 1 -51 -161 137 -46 -42 -23 31 -244 -150
2187 -150 119 14 133 57 130 27 78 -306 15 -148 90 107 -136 -60 22 29 -142 -141 65 -1 -86 219 -119 115
2211 115 195 -19 -93 -149 -52 -97 -258 -3 159 -167 -15 213 53 -27 214 35 -143 87 -171 -274 88 -55
2233 -55 -59 -100 -101 79 -130 -22 135 -181 -135 -14 -131 77 127 -12 -215 -61 191 -28 -66 -7 -144 -63 244 -136
2257 -136 25 290 -6 -38 -101 64 244 170 59 -87 148 -8 6 236 53 -4 47 -74 30 -47 -144 -92 -144
2280 -144 -229 -145 37 124 8 38 28 78 -101 -165 -66 -256 -234 -177 109 -73 -45 160 188 189 -65 23 23 -80 -40 14
2306 14 52 -4 -93 -81 62 148 144 -254 -104 121 -96 11 -43 -69 -21 -96 -5 -50 15 -18 -17 188 -117 86 41 -46 5
$$ packed form
2137a4O2m3Q0k46K82j8l37J69PJ6j7J18O5Jk81K59q5Q4n3j35Q4J42nq6J05m48
2163b94J32K71J9j1j56K75r7j07p2N7J5J53j87j24J27n2j10K98j83MJ9N4k75R4
2187a50K69j05J19p6P3j03N1l84L21j63K38J7k43P6Q2Pj71JK06o6q5L05l38K34
2211A15Q0k14p4n6R7m5j61K55J62l26J52K28j60q0K41j79j78K30k58j03L62j43
2233e5mm1jJ80k09J08J57l16M6J21j17K08N0j39k03J54K52k19l8N9j37Q1L07l80
2257a36J61K65k96l2o3J65J80p4j11j46K35j56J4K30j83n7N1j21J04p7r7N2n2
2280a44q5Q4J82Q7j16L0j0N0j79o4R9j90K2N7K86j82K8K05K8Jk54Q8%j03M0N4
2306A4L8n6q9J2J43Q6ml98J50K25k17J07n4k6M8p5R1m5O5l3JK05l05K03m5q7N1
$$ plain form
2333 5 -214 -142 -196 -116 -161 2 -54 58 57 22 -75 -140 34 8 -37 42 -294 280 -45 134 244 -110 157 -153 35
2358 35 91 -32 -178 27 -164 81 -127 -83 -327 -53 -93 -27 -118 -145 124 -18 -73 91 -49 -111 -58 -23 -10 -122
2382 -122 182 -40 -33 152 97 121 -361 83 -78 138 7 19 257 -84 -104 -9 20 106 64 -135 115 -228 -33
2405 -33 -35 96 71 131 164 -150 -72 -59 118 59 -47 -19 10 194 -212 59 54 81 -161 38 -145 -48 6 18 -1 51
2431 51 -26 -94 -216 -36 107 173 -71 -118 200 29 -55 -167 14 -126 118 -123 -107 -79 131 120 -115 -25 -118 112
2455 112 -124 193 2 -4 -129 -194 14 -39 74 -266 -39 -56 66 -85 48 51 139 -12 198 200 -32 -51 28 -176
2479 -176 67 37 31 -62 -117 -152 -45 -54 103 -60 -94 113 -266 -16 -67 63 182 34 -32 -82 14 -112 51 187
2503 187 -60 166 -172 44 31 -89 -207 144 -115 120 -55 -75 72 5 -98 33 -60 -134 -37 122 -133 -114
$$ packed form
2333Ek19P2n4Q0m5J63n6J12jl5r7o5J74k6m5P9l36N74l25J79J10l54K67l10J88
2358C5N6j23j46K05j91K45k08M4k44K74m0O6r1k7K69j42n5J64j40o2N3L5J3j12
2382a22L04k22PJ85n5K4m82M44j61K16j31J2K38l41k0R5K9Q6m2j99K50l43J95
2405c3kJ31k5O0L3l14P8J3J77n9j06K8K9J84m06K71nK7k42J99j83R7N4J2j9N2
2431E1p7o8j22J80J43O6k44m7L18j71q4j12J81j40K44k41J6K8K10j1k35R0r3K30
2455A12k36L17j91oj25o5K08n3J13l40K27j7J22j51J33LQ8j51K10Kk32j9P9k04
2479a76K43l0or3n5l5J07rJ57j63l4K07l79K50n1J30J19j48o6n0R6j26J63J36
2503A87k47K26l38K16j3j20j18L51k59K35j75k0J47o7j03J31r3p4R7J59k55J9
$$ plain form
2525 -114 3 259 -73 156 152 9 26 -64 46 165 -27 -68 229 -81 -38 -133 189 -114 -81 -42 84 -106 52
2548 52 69 -11 -200 116 -9 18 -56 83 20 36 35 -12 78 -62 -7 -115 -13 -245 -87 347 20 107 -163 24
2572 24 77 146 194 65 -18 31 92 17 7 8 58 -173 195 161 97 79 5 89 143 -37 144 -59 228 -123 -37 14 -154
2599 -154 71 242 128 -84 -23 57 147 -188 -235 134 42 -32 25 39 -95 158 -4 -55 177 -130 -14 166 -163
2622 -163 30 -17 23 218 -43 50 83 115 12 -95 85 6 188 -101 127 61 -108 -52 45 -20 -120 48 -75
2645 -75 136 105 -91 1 154 -81 111 -58 63 177 53 21 -21 108 31 -44 50 -64 61 -178 -40 82 -7
2668 -7 95 160 164 14 -184 83 -114 -131 -165 -53 -4 60 -76 -186 -112 -109 119 254 112 51 -107 -60 27 -80 31
2693 31 -35 95 -51 -25 37 209 46 157 167 -142 -119 116 -147 -59 55 -230 -104 62 29 -125 224 -69 85
$$ packed form
2525a14J17K56l32K29mj43J7r0J10J19j92m1K97l10M3r5L22l03L3L9J26j90J58
2548E2J7q0j89L16j25K7p4J39o3J6jm7R0j40N5j08J02k32J58M34l27Q7k70J87
2572B4N3O9M8j29q3M9O1p5j0JN0k31L68l4o4j8p4Q4N4j80J81k03K87l51Q6N1j68
2599a54K25J71j14k12O1Q0R0l35m7L69r2p4N7J4j34K53j62n1K32l07J16J80l29
2622a63J93m7M0J95k61R3L3L2j03j07J80p9J82k89K28o6j69N6R7o5j00J68j23
2645g5K11l1j96R2J53k35J92j69J21J14j24l2m2J29p7p5R4j14J25k39J38J22q9
2668gJ02O5Mj50j98K67j97j7l4J12M9O4j36j10P4LK28J35j42o1j58M7Q7j07J11
2693C1o6J30j46K6O2J72j63J11J0l09K3K35k63Q8J14k85J26J66l3j54L49k93J54
$$ plain form
2716 85 14 -65 299 110 -45 -89 171 54 24 16 -167 -33 -236 31 56 -110 102 100 -92 42 105 17 83 -23
2740 -23 108 -22 59 133 135 169 -22 75 49 76 -48 143 -31 161 1 -3 -19 129 -43 96 105 41 -75 75 276
2765 276 280 -125 -16 -214 -15 98 36 -1 127 5 120 29 26 99 18 45 46 69 259 -47 4 91 229 121 302
2790 302 -53 -3 -29 -7 83 -145 -20 5 212 27 9 -14 175 -1 -166 -160 47 65 75 -33 -212 -26 28 -155
2814 -155 182 -131 21 -2 39 77 -82 104 186 -112 -48 -135 -16 97 -132 136 -18 -116 94 -36 -54 166 3
2837 3 107 141 -131 40 -11 -85 -200 -76 -148 96 -111 -48 250 40 57 -46 -42 -138 -1 -68 -85 87 -303 -8
2861 -8 -41 13 93 36 -13 -51 45 61 -82 50 44 160 -105 5 -67 96 118 140 27 -52 131 81 -36 2 11 10 -73 -172
2889 -172 137 -83 -104 -169 110 242 -58 -24 153 -95 136 -30 4 -36 -61 -32 182 -189 172 10 -232 91
$$ packed form
2716H5p1p9L64j89j55m4K60j17l0qj83J34k03K67K5j66K12kj92J34O3q8O6j06
2740b3J31j30Q1P4KL4j91R7k6K7j24J91j74J92j60mj6J48j72J39Ro4j16J50K01
2765B76Mm05J09j98J99J13o2l7J28j22J15r1lP3q1K7JK3J90l06N1Q7J38j08J81
2790C02l55N0k6K2R0k28J25K5K07j85j8k3J89j76j65OK07J8J0j08j79J86N4j83
2814a55L37l13J52k3M1L8j59J86Q2k98O4q7J19J13k29K68j54r8K10j30j8K20j63
2837CJ04L4k72J71n1p4j15J24p2K44k07O3K98k10J7j03Mr6J37o7j7J72l90K95
2861hl3N4Q0n7m9l8R6J6j43J32oJ16k65J10p2J63K2K2j13p9J83n0j17L8Rjq3r9
2889a72L09k20k1o5K79J32l00L4J77k48K31j66L4m0k5K9K14l71L61j62k42L23
$$ plain form
2911 91 -143 106 14 -10 -95 -111 67 181 155 -6 -138 -124 -146 -191 124 102 -6 69 -40 17 215 -132 -52 -113 42
2936 42 119 -305 114 -129 -51 -112 116 0 -38 100 -42 -155 -66 142 22 80 33 157 23 24 -66 -51 154 50
2960 50 -133 34 -138 92 3 184 40 -146 -189 0 -15 -15 -229 63 10 16 -156 161 203 16 185 67 -3 -118
2984 -118 -121 -22 33 -19 144 -315 -75 -35 88 -32 -59 -32 -57 -12 -107 120 -37 -73 -21 151 -62 127 -23 -119 -15
3009 -15 -148 59 -18 89 -132 108 -129 -143 82 -45 -1 17 -219 219 -38 -121 50 -56 181 -267 56 72
3031 72 2 15 -81 -169 1 -84 -59 57 -6 -105 -162 -74 102 -57 -65 66 21 48 24 -64 -233 -171 54 32 -126 69
3057 69 116 173 291 -48 72 -59 46 47 -171 116 23 -56 250 50 138 -131 -118 192 -75 124 245 105 217
3080 217 -12 133 -140 -73 155 127 -94 -290 109 183 148 -93 -166 -121 10 -28 -122 75 177 185 -66 49 -143
$$ packed form
2911I1k34K49r2k4q5j6J78J14k6j61j32J4k2m5L15k2j08P5j09N7J98l47Q0o1J55
2936D2P7m24M19k43P8o1K28j16l8J38j42j13Q9K08j20N8m7J24j34Jr0J5K05j04
2960E0j83J67j72K30q9J81j44j86m3J89j5%k14K92n3Oj72L17M2j87J69j18p0j15
2984a18lR9N5n2J63m59K40M0J23j20k7K7k5M5r5K27j57l6N2J72k13J89j50r6J04
3009a5j33K07p7J07k21K40k37j4K25j27M4J8k36M38k57q3J71j06K37m48L23J6
3031G2p0J3r6q8J70q5K5J16o3r9n7Q8J76j59qJ31m5K7k4q8j69O2K25k2j58J95
3057F9M7N7J18l39J20j31J05Jk18K87r3p9L06k00Q8k69J3L10k67J99J21j40J12
3080B17k29J45k73O7K28k8k21j96L99P4l5k41p3M5J31l8r4J97J02Qk51J15j92
$$ plain form
3103 -143 -157 17 -61 213 -69 -73 87 -66 105 4 -91 -90 16 77 139 -50 17 -23 -132 -30 114 -55 -1 26
3127 26 -137 -104 -52 168 -26 25 68 -157 204 -70 41 -160 168 -66 -162 47 35 50 -8 14 -85 91 64 144
3151 144 132 -45 -185 -1 -35 69 -9 128 115 185 -8 -241 21 81 -28 -62 -90 -2 2 140 28 33 -300 74
3175 74 151 77 0 27 176 -89 16 -58 189 -167 -211 -62 70 310 76 -112 -189 -157 -50 -16 248 -147 26
3198 26 168 -64 -8 -26 -178 -68 -24 122 191 83 28 -55 24 89 -175 -49 -196 -198 -121 -8 -74 78 94 87 -116
3223 -116 60 -189 174 -1 131 -74 -57 -183 -151 19 -88 192 -41 137 -171 -87 -137 220 -121 -69 -30 164
3245 164 196 -94 69 36 -59 -105 61 89 -108 -201 -283 48 78 -5 -51 -89 -135 -17 -24 67 -40 167 106 86 12 28
3271 28 54 60 76 133 0 -62 115 -24 -40 -80 17 -53 84 0 109 13 -97 98 -14 190 -38 52 -61 -101 121
$$ packed form
3103a43j4J74p8K74k82mJ60j53J71j01r5JJ06O1O2j89O7m0j09J02J44j69N4K7
3127B6j63L3N2K20j94N1M3k25L61k74J11k01L28k34r6K09j2J5n8K2r9J76k7Q0
3151A44j2j77j40J84l4J04p8J37j3P0j93k33K62O0j09l4k8Q8MJ38j12Nl33L74
3175G4P7p4p7K7J49k65J05p4K47l56m4J49J32K40k34j88p7L2J07L4K64l95J73
3198B6J42k32N6j8j52J10M4J46O9j08n5q3P9O5k64J26j47kP7J13o6J52J6pk03
3223a16J76k49L63j75J32k05J7j26L2J70j07K80k33J78l08Q4n0L57l41N2L9J94
3245A64L2k90J63l3r5m6J66K8j97r3q2L31L0q3m6l8m6J18pR1j07K07o1k0p4J6
3271B8K6OJ6N7j33o2J77j39j6m0R7p0J37q4J09r6j10J95j12K04k28R0j13m0K22
$$ plain form
3296 121 6 76 -111 -127 -114 -195 -37 -95 -129 2 -121 -10 -245 58 169 240 -86 186 -181 6 86 179 54
3319 54 -119 -54 22 -46 -131 -76 87 -72 120 -94 185 22 15 205 10 -164 -55 -5 -67 10 6 -110 10 -64 113
3344 113 -120 166 -9 -58 223 21 -63 -55 17 69 59 -63 21 56 -8 -109 196 25 -110 -268 -12 70 -73 -76
3368 -76 -202 358 79 -73 43 -43 -41 -54 -7 41 -169 -43 43 191 -142 134 -151 -44 17 -61 -19 74 193 -52
3392 -52 106 142 58 99 106 -194 167 76 -35 122 1 -170 28 -172 -312 -154 9 60 83 -150 69 79 5 -67
3416 -67 60 -58 -97 65 -1 355 15 37 75 140 14 -43 46 -13 -26 -14 -33 -40 -33 -150 -162 -87 27 -79 -72 126 28
3443 28 79 -127 -41 34 -156 -20 -18 67 -33 89 24 45 58 -51 20 -118 -49 219 -178 23 -143 88 61 -146
3467 -146 241 -43 -63 131 102 227 -14 156 -122 -22 -161 46 80 -58 55 -109 -15 230 62 -24 112 -145
$$ packed form
3296A21j15P0j87j6J3q1J58n8l4J31j23J11k35L03J11P1l26K72l67J87Q0R3j25
3319E4j73O5P6o8q5N5J63j59J92k14K79j63pJ90j95j74J09N0o2P7mj16J20p4J77
3344A13k33K86j75m9K81k02q4QP2N2j0j22Q4L5o4j01L05j71j35j58K56Q2j43l
3368g6j26N60k79j52J16q6Kj3M7M8k10J26Q6J48l33K76k85J07O1p8M2R3J19k45
3392e2J58L6q4M1Pl00L61r1j11J57j21j71J98k00j40J58J63N1K3k33K19J0p4p2
3416f7J27j18l9J62o6L56l40K2L8O5j26n7Q9n9j3J2j9pPj17j2P5J14j06PJ98r8
3443B8N1k06Q6P5j90J36KQ5j00J22o5K1J3j09P1j38O9K68l97K01j66K31k7k07
3467a46L87k84k0J94k9J25k41J70k78J00j39K07L4j38J13j64R4K45j68q6J36k57
$$ plain form
3489 -145 -144 40 -32 -11 -97 141 119 30 -15 -26 -134 148 -35 -100 71 54 -120 208 30 28 -40 -82 5 -195 -110 -244
3515 -244 -47 113 122 68 47 89 21 -51 67 -112 19 -279 59 -25 -39 -40 -23 -71 -88 -56 99 -95 221 -16 35
3540 35 150 15 40 137 -362 -8 98 137 -50 27 -201 -48 -240 -76 -119 -139 43 112 166 -77 39 -33 143
3563 143 -35 -36 -248 -11 -1 -64 42 58 -3 56 103 49 60 82 -124 -94 -34 17 -93 128 3 68 -20 -37 -48 175
3589 175 -79 20 37 -109 151 289 39 190 -169 209 58 -99 144 -80 47 70 -95 23 13 -118 116
3610 116 124 -85 221 32 -56 166 122 69 180 -20 -30 -132 -44 19 26 5 -194 68 -12 30 -102 50 61 50 61
3635 61 47 -28 -137 -134 -11 8 -169 77 56 20 -25 -141 107 -116 -12 40 -41 91 -148 131 47 103 93 74 51
3660 51 -37 -57 24 -49 23 245 22 -138 92 17 -58 -215 55 6 -49 19 -12 -99 11 -70 60 5 -19 78 91 -41
$$ packed form
3489a45JJ84p2K1q6K38k2q9m5j1j08K82j83o5J71j7j74L28j78ko8m2Q7k00Q5j34
3515b44J97J60Rn4k1M2o8p2J18j79J31k98L38q4j4jJ7m8j7L2J55j94L16k37N1
3540C5J15j35K5R7m99L54J06L9j87P7k28J53j92J64m3k0J82O9N4k43J16p2J76
3563A43j78jk12K37J0o3J06J6o1N9M7n4J1K2k06L0O0N1j10K21j25O5q8j7j1K23
3589A75k54R9J7j46K60J38k50J51l59L78j51j57K43k24J27K3j65J18j0j31K34
3610A16Qk09L06j89q8K22m4n3J11k00j0j02Q8O3Pk1j99K62q0M2j32J52J1j1J1
3635F1j4p5j09LJ23J9j77K46k1l6m5j16K48k23J04N2q1J32k39K79q4N6j0j9k3
3660E1q8k0Q1p3P2K22k23j60K30p5p5j57K70m9n5O8l1q7J10q1J30n5k4R7J3j32
$$ plain form
3686 -41 -105 16 -2 224 -27 -61 -175 248 -7 23 -130 158 34 239 -140 -87 54 -147 -71 26 7 -63 74
3709 74 -82 151 27 -87 119 -85 -10 -211 117 77 108 37 112 -132 -74 11 378 6 44 -24 157 -14 -73 140
3733 140 10 -188 75 -109 -85 -42 -203 99 -271 -193 -118 11 163 32 -116 -188 -142 239 -26 -40 147 -170
3755 -170 5 52 -101 -14 10 -88 71 12 90 -96 135 -212 85 -69 -7 66 -58 -89 163 -145 -253 -75 -93
3778 -93 -159 -24 45 36 -167 -100 32 12 126 -23 -93 153 -132 54 -190 -93 51 -123 56 -30 -70 -1 -1 251 -102
3803 -102 -93 63 -158 -167 403 29 -164 -4 -46 -27 -37 -75 13 -7 12 -92 -90 20 -45 -310 70 15 -8 24 38 120
3829 120 -85 223 74 26 17 -29 42 153 -15 117 70 245 -49 79 166 33 63 277 107 147 253 46 -66
3852 -66 178 -26 190 77 -4 154 -199 60 -25 -21 -71 -98 78 125 -142 -106 38 100 101 45 -97 -189 -139 205 -121
$$ packed form
3686d1o4J21j8K26k51l4j14M23k55L0j53K88j24K05l79N3J41k01P6R7j9p0J37
3709G4j56K33j24j14K06k04P5k01L28m0L1p1P5k44N8Q5L67l72L8o8J81j71n9K13
3733A40j30j98K63j84K4M3j61L02l70P8P5J29J52j31j48p2M6L81k65j4J87l17
3755a70J75M7j53Q7K4r8J59n9P8j86K31l47K97j54O2P3j24l1K52l08j08J78j8
3778i3o6J35O9rk03O7J32k0J14j49p0K46k85J86k44R7J44j74J79q6m0O9%K52l53
3803a02RJ56k21rN70l74j93J60m2J9j0l8Q8k0J9j04KJ10o5k65L80n5k3L2J4Q2
3829A20k05L08j49m8rm6P1J11j68J32m7J75k94J28Q7j33L0K14j70M0J06k07j12
3852f6K44k04K16j13q1J58l53K59q5Mn0k7J76M7k67L6J44O2Jn6j42r2N0L44l26
$$ plain form
3877 -121 -254 -41 102 177 12 4 -212 90 13 -63 -74 302 8 -123 86 59 17 27 -28 44 -193 -379 23 -77
3901 -77 178 -164 -210 -123 68 77 -96 -134 -45 157 312 79 -68 -210 -421 43 10 -54 -21 125 -38 -20 137 102
3925 102 8 -61 257 31 -14 48 -152 -71 -70 67 -40 -74 -47 -77 24 239 -79 105 -135 -2 163 -23 -82 -4
3949 -4 133 35 67 -144 -113 -65 64 -42 158 60 -105 -44 66 -5 15 128 30 -161 183 241 89 61 -124 35
3973 35 81 -155 -39 27 83 -24 -6 60 -47 121 79 216 53 -39 -92 140 81 74 -284 32 -70 83 127 -110
3997 -110 55 -116 162 -174 -103 -52 -40 108 95 -287 -140 -35 -158 -92 -129 110 89 124 108 181 -137 42 -137
4020 -137 299 -159 92 -44 0 18 -21 -50 -266 166 -87 -154 142 -144 -17 10 -70 105 -20 197 3 20 -77
4043 -77 78 30 109 -49 82 -118 -80 75 -22 -95 40 79 -64 103 -33 154 66 38 -193 -58 -87 -89 47 73
$$ packed form
3877a21j33K13J43P5j65qk16L02p7p6j1L76k94j31K09k7m2J0n5P2k37j86M02j00
3901g7K55l42m6Q7J91Rj73l8Q9K02J55k33j47j42k11M64l3o4L3J46j63J8J57l5
3925A02r4o9L18k26m5O2k00Q1JJ37j07l4K7l0J01K15l18J84k40J33J65j86n9P8
3949dJ37r8L2k11L1M8J29j06K00r8j65O1J10p1K0J13r8j91L44N8j52k8j85J59
3973C5M6k36J16O6N6j07J8O6j07J68m2J37j63r2n3K32n9pl58L16j02J53M4k37
3997a10J65j71K78l36P1N1J2J48j3l82J47J05j23O6l7K39k1L5j6P3l18J79j79
4020a37M36m58K51j36M4J8l9k9k16M32k53o7K96k86J27K7q0J75j25K17j94J7r7
4043g7J55m8P9j58J31k00L8J55r7p3J35L9j43J67j36J87q8k8k31J35k9kJ36K6
$$ plain form
4067 73 -100 43 111 -67 -191 -69 -73 -18 -3 -308 -134 -85 101 -120 -59 -196 -148 -119 -214 232 -54 -104 3 -135
4091 -135 -226 -227 -196 -114 51 -31 152 70 -303 -152 7 -83 -74 -96 -11 -144 32 141 -152 120 13 -17 92 53 -144
4116 -144 -78 136 27 -110 -66 49 -72 110 -50 -39 -121 -62 34 129 -47 92 121 153 -18 -62 -54 271 16 179
4140 179 -27 129 22 -176 -18 100 -89 9 -17 89 -43 35 135 278 -6 -219 107 -184 57 39 -67
4161 -67 -167 -72 6 159 50 -87 -156 -23 38 86 234 128 126 5 85 157 38 231 24 -44 39 -150 78 205
4185 205 152 43 132 22 112 247 -166 -121 -67 -80 18 -112 -18 -73 11 123 -136 -67 202 -37 113 -66 25 -54
4209 -54 139 -177 -159 22 82 -208 106 27 9 -47 86 180 -41 83 165 -19 9 -274 -24 -17 -73 219 -49 242
4233 242 -30 16 88 -66 21 -95 121 -182 -99 -159 80 82 111 -26 1 67 75 0 99 -33 67 65 -100 40 105 184
$$ packed form
4067G3j73J43O8j78j24J22mN5J5l05J74M9J86k21O1j37M8K9r5M46k86n0J07j38
4091a35r1jL1Q2J65q2J83q2l73J51J59r0Rk2Q5j33J76J09k93K72j07l0J09l9j97
4116a44O6K14j09j37M4J15j21J82j60J1q2N9R6R5j76J39K9L2j71m4QL25k55J63
4140A79k06J56j07j98J58J18j89R8k6J06j32P8J00J43k84k13L26k91K41j8j06
4161f7j00R5P8J53j09j37o9J33O1M8J48j06kj21Q0P2j19J93k07o8Q3j89K28J27
4185B05n3j09Q9j10R0J35m13M5N4j3R8j30R4n5Q4J12k59O9K69k39J50j79R1p9
4209e4J93l16J8J81O0k90L14p9j8n6J33R4k21J24Q2j84K8k83K50Pn6K92k68K91
4233B42k72M6P2j54Q7j16K16l03Q3o0K39KK9j37K7O6Qp5R9j32J00kj65J40O5P9
$$ plain form
4259 184 -221 -104 41 103 -26 -193 19 -22 -180 96 -8 -123 30 -55 85 217 -95 -33 50 -139 -187 -152
4281 -152 162 -88 16 -258 -48 -130 -70 -49 32 59 -63 128 -1 9 -75 -145 -104 24 -88 31 177 -89 -197
4304 -197 -180 -70 -172 -90 386 57 -155 75 154 -17 87 -122 104 -48 68 -30 234 67 213 -153 25
4325 25 93 -207 -73 75 26 156 -151 220 49 -22 -20 103 -55 -8 69 -113 -50 -68 10 93 -30 -260 68 216
4349 216 -32 -36 54 -195 311 -169 -47 -56 -12 79 -153 -22 29 15 -52 -105 208 105 -90 30 153 -199 59 -57
4373 -57 49 -28 -92 -173 25 59 -229 -110 -15 111 -15 42 370 -5 271 122 -75 35 37 152 -225 160 -126
4396 -126 -22 -86 -168 -91 -84 96 144 8 38 -94 -59 -154 197 49 55 -240 -146 4 -260 -210 10 -48 198 -198 -115
4421 -115 -283 -14 140 -10 -107 -19 75 -229 -40 100 102 -116 -57 -121 143 -117 -11 235 -217 29 -9 57 -244
$$ packed form
4259A84m05J17J45O2j29j67K12m1j58K76j04j15J53q5J40J32l12O2Q3j89m8L5
4281a52L14k50J04k74K10q2O0K1Q1K7j22J91j29J0q4p0M1J28j12J19J46k66j08
4304a97J7J10j02Q2M76l29k12K30P9j71J04k09K26j52J16r8K64j67J46l66J78
4325B5O8l00J34J48m9J30l07L71j71p1KJ23j58M7P7j82O3j8P8Q3j23k30L28J48
4349B16k48mR0k49N06m80J22rM4R1k32J31N1j4o7n3L13j03j95J20J23l52K58j16
4373e7J06p7o4q1J98L4k88J19R5J26j26N7L28l75K76j49j97J10KJ15l77L85k86
4396a26J04o4q2P7PJ80M8j36L0j32L5r5L51j48Ok95R4J50k64N0K20n8K46l96Q3
4421a15j68K69J54j50r7Q8R4l04J89J40Kk18N9o4K64k60J06K46m52K46l8O6l01
$$ plain form
4444 -244 -14 67 -174 -110 -70 73 -220 -42 -31 -39 -126 -88 100 -2 -265 109 147 189 -93 5 -112 111 29 -256
4468 -256 5 -92 -104 44 26 -244 -1 73 26 48 -24 -180 208 158 75 180 -75 212 -40 97 -57 54 -293
4491 -293 -190 -166 -85 190 -149 -31 79 172 80 -57 164 328 123 -132 -76 -102 110 -46 -126 286 -25 2 172
4514 172 107 128 -46 -19 -20 6 -85 34 -62 -177 107 162 30 103 -39 -103 131 55 41 -2 44 -69 -60 -10 219 -118
4540 -118 -251 -67 -112 181 111 136 223 153 -11 25 30 -139 -58 11 -34 26 29 -44 84 130 -60 38 199 75 81 87 132
$$ packed form
4444b44K30Q1k41O4M0J43k93J78J1qq7L8J88j02k63L74L8M2k82R8j17K23q2k85
4468b56K61r7j2J48j8k70K43P4m7K2p2j56L88n0q3J05k55K87k52J37j54J11l47
4491b93J03K4Q1K75l39J18J10R3r2j37K21J64k05k55N6k6K12j56q0M12l11K7J70
4514A72o5K1j74K7jK6r1J19r6j15K84N5j32P3j42o4K34p6j4m3M6j13RN0K29l37
4540a18j33J84m5K93p0K5Q7p0j64L6Nj69Q1O9m5O0Lp3J28M6j90R8J61j24OOM5
$$ [...]
8191A79
##END NTUPLES=NMR FID
##END=
