##TITLE=1H_SR129_k
 DMSO-d6
 8 sc, 
 4.07.2022
##JCAMPDX= 6.0         $$ Bruker NMR JCAMP-DX V2.0
##DATA TYPE= NMR FID
##DATA CLASS= NTUPLES
##ORIGIN= UXNMR, Bruker Analytische Messtechnik GmbH
##OWNER= root
$$ XWIN-NMR		Version 3.5
$$ Mon Jul  4 14:36:56 2022 Russian Standard Time (UT+4h)  she@DPX200
##.OBSERVE FREQUENCY= 200.1313499994
##.OBSERVE NUCLEUS= ^1H
##.DELAY= (6, 6)
##.ACQUISITION MODE= SIMULTANEOUS
##.ACQUISITION SCHEME= undefined
##.AVERAGES= 8
##.DIGITISER RES= 18
##SPECTROMETER/DATA SYSTEM= spect
##.PULSE SEQUENCE= zg30
##.SOLVENT NAME= CDCl3
##.SHIFT REFERENCE= (INTERNAL, CDCl3, 0, 15.7039)
##AUDIT TRAIL= $$ (NUMBER, WHEN, WHO, WHERE, WHAT)
$$ ##TITLE= Audit trail, XWIN-NMR		Version 3.5
$$ ##JCAMPDX= 5.01
$$ ##ORIGIN= Bruker BioSpin GmbH
$$ ##OWNER= she
$$ F:/spectra/data/she/nmr/H-F/1/audita.txt
$$ ##AUDIT TRAIL=  $$ (NUMBER, WHEN, WHO, WHERE, WHAT)
(   1,<2022-07-04 14:35:46.12 +0400>,<she>,<DPX200>,
      <created by zg, POWCHK disabled, PULCHK disabled
       configuration hash MD5:
       00 E9 B6 7A A2 85 ED C7 34 08 36 98 17 FE 4E 26
       data hash MD5: 16K
       E6 13 F3 30 9F 09 8E 5F 1A 29 62 59 14 F5 6B 0F>)
$$ ##END=
$$ 
$$ hash MD5
$$ 18 52 12 1C DF D8 44 E2 59 B7 C4 FB C5 D1 6D 4D
##$RELAX= 
##$RELAX= 
##$RELAX= 
##$RELAX= 
##$RELAX= 
##$RELAX= 
$$ Bruker specific parameters
$$ --------------------------
##$DU= <F:/spectra>
##$EXPNO= 1
##$NAME= <H-F>
##$PROCNO= 1
##$TYPE= <nmr>
##$USER= <she>
##$AMP= (0..31)
100 100 100 100 100 100 100 100 100 100 100 100 100 100 100 100 100 100 
100 100 100 100 100 100 100 100 100 100 100 100 100 100 
##$AQSEQ= 0
##$AQ_mod= 1
##$AUNM= <au_zg>
##$AUTOPOS= <>
##$BF1= 200.13
##$BF2= 200.13
##$BF3= 200.13
##$BF4= 200.13
##$BF5= 200.13
##$BF6= 200.13
##$BF7= 200.13
##$BF8= 200.13
##$BYTORDA= 1
##$CFDGTYP= 0
##$CFRGTYP= 5
##$CHEMSTR= <none>
##$CNST= (0..31)
1 1 145 1 1 1 1 1 1 1 1 1 1 1 1 1 1 1 1 1 1 1 1 1 1 1 1 1 1 1 1 1 
##$CPDPRG= <>
##$CPDPRG1= <>
##$CPDPRG2= <>
##$CPDPRG3= <>
##$CPDPRG4= <mlev>
##$CPDPRG5= <mlev>
##$CPDPRG6= <mlev>
##$CPDPRG7= <mlev>
##$CPDPRG8= <mlev>
##$CPDPRGB= <>
##$CPDPRGT= <>
##$D= (0..31)
0 1.2 0 0 0 0 0 0 0 0.06 0 0.03 0 0 0 0 0.0002 0 0 0 0 0 0 0 0 0 0 0 0 
0 0 0 
##$DATE= 1656930945
##$DBL= (0..7)
120 120 120 120 120 120 120 120 
##$DBP= (0..7)
150 150 150 150 150 150 150 150 
##$DBP07= 0
##$DBPNAM0= <>
##$DBPNAM1= <>
##$DBPNAM2= <>
##$DBPNAM3= <>
##$DBPNAM4= <>
##$DBPNAM5= <>
##$DBPNAM6= <>
##$DBPNAM7= <>
##$DBPOAL= (0..7)
0.5 0.5 0.5 0.5 0.5 0.5 0.5 0.5 
##$DBPOFFS= (0..7)
0 0 0 0 0 0 0 0 
##$DE= 6
##$DECBNUC= <off>
##$DECIM= 32
##$DECNUC= <off>
##$DECSTAT= 4
##$DIGMOD= 1
##$DIGTYP= 9
##$DL= (0..7)
0 120 120 120 120 120 120 120 
##$DP= (0..7)
150 150 150 150 150 150 150 150 
##$DP07= 0
##$DPNAME0= <>
##$DPNAME1= <>
##$DPNAME2= <>
##$DPNAME3= <>
##$DPNAME4= <>
##$DPNAME5= <>
##$DPNAME6= <>
##$DPNAME7= <>
##$DPOAL= (0..7)
0.5 0.5 0.5 0.5 0.5 0.5 0.5 0.5 
##$DPOFFS= (0..7)
0 0 0 0 0 0 0 0 
##$DQDMODE= 0
##$DR= 18
##$DS= 0
##$DSLIST= <SSSSSSSSSSSSSSS>
$$ [...]
##$SUBNAM2= <"">
##$SUBNAM3= <"">
##$SUBNAM4= <"">
##$SUBNAM5= <"">
##$SUBNAM6= <"">
##$SUBNAM7= <"">
##$SUBNAM8= <"">
##$SUBNAM9= <"">
##$SW= 18.0517283424941
##$SWIBOX= (0..15)
0 0 2 0 0 0 0 0 0 0 0 0 0 0 0 0 
##$SW_h= 3612.71676300578
##$TD= 16384
##$TD0= 1
##$TE= 0
##$TE2= 300
##$TE3= 300
##$TEG= 300
##$TL= (0..7)
0 120 120 120 120 120 120 120 
##$TP= (0..7)
150 150 150 150 150 150 150 150 
##$TP07= 0
##$TPNAME0= <>
##$TPNAME1= <>
##$TPNAME2= <>
##$TPNAME3= <>
##$TPNAME4= <>
##$TPNAME5= <>
##$TPNAME6= <>
##$TPNAME7= <>
##$TPOAL= (0..7)
0.5 0.5 0.5 0.5 0.5 0.5 0.5 0.5 
##$TPOFFS= (0..7)
0 0 0 0 0 0 0 0 
##$TUNHIN= 0
##$TUNHOUT= 0
##$TUNXOUT= 0
##$USERA1= <user>
##$USERA2= <user>
##$USERA3= <user>
##$USERA4= <user>
##$USERA5= <user>
##$V9= 5
##$VALIST= <valist>
##$VCLIST= <CCCCCCCCCCCCCCC>
##$VD= 0
##$VDLIST= <DDDDDDDDDDDDDDD>
##$VPLIST= <PPPPPPPPPPPPPPP>
##$VTLIST= <TTTTTTTTTTTTTTT>
##$WBST= 1024
##$WBSW= 4
##$XGAIN= (0..3)
0 0 0 0 
##$XL= 0
##$YL= 0
##$YMAX_a= 60985
##$YMIN_a= -77057
##$ZGOPTNS= <>
##$ZL1= 120
##$ZL2= 120
##$ZL3= 120
##$ZL4= 120
##$ABSF1= 10
##$ABSF2= 0
##$ABSG= 5
##$ABSL= 3
##$ALPHA= 0
##$AQORDER= 0
##$ASSFAC= 0
##$ASSFACI= 0
##$ASSFACX= 0
##$ASSWID= 0
##$AUNMP= <proc_1d>
##$AZFE= 0.1
##$AZFW= 0.1
##$BCFW= 1
##$BC_mod= 2
##$BYTORDP= 1
##$COROFFS= 0
##$CY= 11.3945322036743
##$DATMOD= 1
##$DC= 2
##$DFILT= <>
##$DTYPP= 0
##$F1P= 2.36226072786647
##$F2P= -0.459571619588291
##$FCOR= 0.5
##$FTSIZE= 0
##$FT_mod= 4
##$GAMMA= 1
##$GB= 0.15
##$INTBC= 1
##$INTSCL= 1
##$ISEN= 128
##$LB= 0.24
##$LEV0= 0
##$LPBIN= 0
##$MAXI= 10000
##$MC2= 0
##$MEAN= 0
##$ME_mod= 0
##$MI= 1.114404
##$NCOEF= 0
##$NC_proc= 0
##$NLEV= 6
##$NOISF1= 3.799351
##$NOISF2= 2.8
##$NSP= 1
##$NTH_PI= 0
##$NZP= 0
##$OFFSET= 15.70392
##$PC= 1
##$PHC0= -18050.77
##$PHC1= 2.40069
##$PH_mod= 1
##$PKNL= yes
##$PPARMOD= 0
##$PSCAL= 0
##$PSIGN= 0
##$REVERSE= no
##$SF= 200.130013532006
##$SI= 16384
##$SIGF1= 3
##$SIGF2= 2
##$SINO= 400
##$SIOLD= 16384
##$SREGLST= <1H.CDCl3>
##$SSB= 0
##$STSI= 0
##$STSR= 0
##$SW_p= 3612.71676300578
##$SYMM= 0
##$S_DEV= 0
##$TDeff= 0
##$TDoff= 0
##$TI= <>
##$TILT= no
##$TM1= 0
##$TM2= 0
##$TOPLEV= 0
##$USERP1= <user>
##$USERP2= <user>
##$USERP3= <user>
##$USERP4= <user>
##$USERP5= <user>
##$WDW= 1
##$XDIM= 8192
##$YMAX_p= 0
##$YMIN_p= 0
$$ End of Bruker specific parameters
$$ ---------------------------------
##NTUPLES= NMR FID
##VAR_NAME=  TIME,          FID/REAL,        FID/IMAG
##SYMBOL=    X,             R,               I
##VAR_TYPE=  INDEPENDENT,   DEPENDENT,       DEPENDENT
##VAR_FORM=  AFFN,          ASDF,            ASDF
##VAR_DIM=   8192,          8192,            8192
##UNITS=     SECONDS,       ARBITRARY UNITS, ARBITRARY UNITS
##FACTOR=    0.0002768,     1,               1
##FIRST=     0,             0,               0
##LAST=      2.2672688,     0,               0
##MIN=       0,             -77057,          0
##MAX=       2.2672688,     60985,           0
$$ Real data points
##PAGE= N=1
##DATA TABLE= (X++(R..R)), XYDATA
0@%%%%%%%%%%%%%%%%%Qj6J6j6J6j6K4l2L2l5M3m8N6o5P3q8R8j07J22j38J54j73
39i2J97k19K43k71K99l31L66m03M46m93N41n96O58p23P96q80R74j079J198j337
59g06J501j695J929k220K590l081L777m832O653j0688L8251k0337k9802O4180
73D5520J5465l1785k4465J8501J3830r446k6538O02J3906r678k9990K604K3190
86A716O05k4871o848K0341J3999j8912j9302J5829K6378r551k0925J0065K4446
99A2970j324j7058L45K0394O506j8048j2531J7244J4893j7214j9655J2140J9628
112A8290q365k0915R63J9340L527j9274p726J8169J0068j8462j3947J3957J4290
125I915j0560j4813O773J7664q76j8023k618J9763P286j6599p852J6360J0715
$$ y = [0, 0, 0, 0, 0, 0, 0, 0, 0, 0, 0, 0, 0, 0, 0, 0, 0, 0, 8, -8, 8, -8, 8, -8, 16, -16, 16, -19, 24, -24, 32, -33, 40, -48, 50, -57, 65, -73, 81, -92, 105, -114, 129, -142, 157, -174, 192, -211, 235, -258, 283, -313, 345, -378, 418, -462, 512, -567, 631, -706, 795, -900, 1029, -1191, 1399, -1682, 2095, -2737, 3916, -6772, 31479, 11142, -18660, 45520, 60985, 29200, 4735, 23236, 37066, 27620, 1082, 1684, 15590, 5912, -24078, -21474, 1716, 2321, -22550, -29398, -9057, 4942, -13970, -33272, -17443, 8935, -616, -21541, -11476, 12970, 11646, -5412, -5067, 15327, 21833, 3785, -8746, 8498, 23391, 6177, -13478, -1338, 18290, 9925, -10990, -10027, 9313, 12840, -6434, -14160, 4009, 14077, -4385, -18332, -4375, 9915, -645, -15458, -8685, 8979, 8103, -9920, -12538, 7225, 14511, -2088, -9940, 6420, 17135]
138A7135j2848j3694O735J3305m791j6612K078J6933R09j7337l889J5917O392
151A0233j3041r592J0692J2430p388j5352N068J6510j980j5370L47J5709L334
164A1600j3979o073J1707R451j0337j1832P166J2852o414j4700L058J3754L62
177F615j2422k931J1823O148j0700q729R899J0483p695j0955N590J1220l720j2740
191h114p00J2357M089j0774n199J0664Q009r232r192O468R570m697r941J930J0581
206E819N40j0999k270J0941M624j0193o472Q489P639o974q811M885R738k007j0742
221e793m13J0520R45j0513k667J0011N439p527o165N878P698n098r530K757R745
236E287o30r689j294Q946L255p754m417O990O611n190p587L916P755k379q623
$$ y = [17135, 4287, -9407, -2672, 10633, 5842, -10770, -8692, 8241, 9150, -8187, -12076, 3841, 10233, -2808, -12400, -1708, 10722, 3334, -12018, -6950, 9560, 7580, -7790, -7443, 8266, 11600, -2379, -8452, 3255, 12706, 2369, -9463, -2297, 10555, 4141, -10559, -7501, 6253, 6615, -5807, -8738, 3085, 9233, -1467, -10196, -297, 10186, 2491, -8464, -2874, 8346, 4626, -8114, -8814, 3543, 7632, -3142, -8341, 2323, 10332, 1100, -8092, -1624, 7946, 3249, -6692, -4762, 5819, 6359, -4640, -6910, 4031, 8655, -1538, -8010, 479, 8118, 1144, -7667, -2782, 6956, 4949, -5793, -6206, 4314, 5259, -5254, -7921, 2090, 7529, 2, -6163, -285, 7413, 2315, -7215, -4458, 5287, 4657, -5032, -6326, 2620, 5875, -1879, -6296, 694, 7305, 2115, -5472, -1556, 6199, 3820, -4803]
251d803J141Q478O07q078k650P163L792o997n273N683O694m347p241K783P317
266D269j437p936q1P836J627p085l445O695M967m987n177M757O203k741p162J026
282b671O536J18o467j183O596K613o117m025M501M201l959n361K852N946j118
297B462o192j43O145J069n886k061N469L192m614l949L848N564l038m856J846
312a144N266j035n824r32N716J542m974k341M630L155m321m224K898M928k058
327A282m917J294N324jn296j205M688K397m114k982L727L618k981m553K018M689
343B988p99m822K66M582R30m616j864M155K728l686l104K839L738k029m523J510
359a707M609l82m301o75M199J307m173k096L454K806k678l354J829L638j452l724
$$ y = [-4803, -3662, 4816, 5423, -2655, -5305, 1858, 5650, -1347, -6620, -937, 5757, 1410, -5831, -3048, 4269, 2832, -5104, -5185, 2651, 4278, -2807, -6252, 443, 5410, 423, -4754, 3, 6206, 3465, -3697, -2671, 3865, 3983, -2484, -3667, 2929, 5542, -575, -4600, -99, 4102, 143, -5218, -2366, 3580, 2462, -3730, -3873, 2272, 3341, -2545, -4606, 863, 4055, -559, -4508, -660, 4904, 1866, -2990, -1144, 4122, 3087, -2737, -3669, 2047, 3589, -1385, -3726, 904, 4059, -262, -4486, -1588, 3340, 1282, -3635, -2341, 2983, 2982, -2314, -3519, 1169, 3566, -548, -3530, 197, 3815, 834, -3719, -1701, 2988, 2189, -2633, -2367, 2215, 3145, -1471, -3335, 820, 3548, -138, -3242, -403, 3335, 1306, -3217, -1707, 2902, 2520, -1781, -2456, 1743, 3050, -1123, -3219, 235, 3041, 363, -2991, -1162, 2476, 1024, -2700]
375b700L48M614Q3l923q20L563J508l317k523K776L256k109l259J157L696q13
391A537l387l1L956Q16l312j656K946K114k661k706J641L095j652l476J005L240
407A469Q8l286p26L352J658l040k167K462K281j893k587J956K903j084k888k2
423a524K974R16l085j021L058J660k935k046J704K027j655k556P06K560J76k680
439a721o29L242J074k544j156K632J426j692k111P38K458n75k780K9K782M64k734
456a097r00K715R56j734j170J397J909j116k805Q20K778o11k861M10K434L11k074
473f38j288J864J369j037k049J129J897r84k409Q41K017q0j245n25J875J717j540
490I14k112J462K125j660j692M15J739p69j555m72J608O98j572j168K083J601
$$ y = [-2700, -2352, 2262, 2345, -1578, -2398, 1165, 2673, -644, -3167, -391, 2865, 756, -2503, -1346, 2350, 1537, -1850, -1881, 2075, 2891, -421, -2077, 869, 2983, 322, -2384, -743, 2352, 700, -2776, -1771, 1469, 1557, -1729, -2455, 897, 2555, -485, -2652, -190, 2091, 198, -2389, -433, 2470, 1386, -1502, -1524, 1450, 2366, -719, -1740, 1318, 2978, 43, -2003, -299, 1728, 73, -2483, -1777, 783, 959, -1721, -2350, 892, 1966, -578, -1734, 898, 2324, 632, -1479, -741, 1717, 1142, -1638, -1609, 1173, 1637, -1097, -1997, 718, 1674, -60, -1230, 167, 2076, 960, -1845, -1025, 1753, 1142, -1719, -1309, 1125, 1436, -638, -1926, -62, 1307, 270, -1779, -650, 1247, 263, -2146, -1305, 712, 632, -613, -1138, 737, 2454, 914, -1198, 264, 2389, 729, -963, -548, 1191, 422, -1133, -1605, 3, 701, -871, -2039, 44, 1645]
506A645k010j278J440J861o59j808j16J568O58j820j029J967J001j607p23J566
522F56K10o00r23J81J287M52k089m21J720O34j963j76J221J059q85o25j14R68
540E92R7j376k04J636k61j758K71Q27N35r11o12R19J420k22j445p3J801j27j406
559b97J91N54m08l70l11K25J112p17r85R94J204o45j354K79O37L55m42o89J68
578d99J311m66j305Q81P67n20m88O94Q1r4n22n72P27Q90p71j264J217P63r23n75
598f68L75M68J79R5o15L46O44j080n72Q38L79j199j9L48L19M3m16k70R59O36m64
619C26p28N09L89j15j78j25p0Q2J04k67K94K47o73j93Q37K1k95l91J67J90K83
640D14p59l18N33Q11r04j53P53l09l81L92P8l9R0n81j16O75Q7p99J95K87O18k12
$$ y = [1645, -365, -1643, -203, 1658, 999, -809, -925, 643, 1301, -519, -1548, 419, 1420, -187, -910, 656, 866, 266, -657, -476, 811, 1263, -826, -1247, 473, 1107, -856, -1032, 189, 1248, 363, -262, -376, 592, 689, -687, -891, 745, 484, -1274, -1003, -176, 359, -552, -1164, -245, 1175, 953, -492, -565, 1236, 1109, -297, -106, 448, 40, -330, -641, -416, 696, -21, -1006, -12, 1192, 547, -807, -528, 109, 464, 22, -667, -499, 812, 346, -959, -78, 689, 169, -319, 375, 456, 362, -160, -732, -5, 885, 114, -1150, 67, 830, -93, -668, -293, 175, 354, 449, -166, 180, 824, -256, -828, 10, 389, -810, -829, -481, -162, -119, -535, -805, 154, 790, 326, -402, 107, 496, 381, 203, 78, 8, 90, 194, -73, 221, 468, -205, -398, 439, 460, 165, -226, -59, 131, 414, -345, -663, -130, 681, -223, -376, 377, 68, -313, 79, 157, 118, 208, -373, -489, 186, 273, -526, -331, -44, 574, 362]
662C62J4n29M13N48n97r0K62L26q90J83k07J66k39k95j56N55K95o39k37P80J49
683A74j45j80J10J10K68k92l72O88R1m90o7Q12k82l72k82K35p9P9l57J54M50p4
705A79n71o0L42R7j21J09%N3K65n10j68O86j88m37P3L04p5n8j92K23L88J81n08
728A2k71Q00l55l42P1L70J3k46J19j16K06m06m17J17M26P8n97J62L27L45n27n9
750b90K54J11K83n04J44O06l98l22K45r3K17k7m29K00K46j48m58K41K82k49q3
771a72J09K67j47k06j79J51L47m5l18K81L50k22k53K6K62k93O4l48N02R4k26m12
793c68M11J58k05m52K40L42j48j27j23N39j43J1k07l5K26j0k61K60L29p0l41l0
815dL01K0l01j42J60n1n2j85j25K24K46j04j00J68Oj6L0J39J69k08j17j17P3K28
$$ y = [362, 376, -153, 260, 808, 211, 121, 383, 709, -181, 2, -205, -39, -278, -573, -729, -174, 121, -518, -755, 25, 174, 29, -151, -41, 69, 337, 45, -327, 361, 452, -38, -105, 707, 425, 53, -229, 6, -73, 6, -351, -197, 253, 179, -392, -452, -110, -13, -134, -25, -25, 28, 293, -217, -385, 301, 113, -324, -251, 53, -22, -80, -272, -49, 339, 520, 12, -259, 541, 186, -156, -85, 285, 298, 52, 171, 55, 261, -145, -562, -445, -19, 59, -538, -376, -49, 296, -231, -290, -36, 75, 358, -146, -2, 604, 206, -116, 129, 36, 253, 226, -203, -3, 243, 95, -363, -122, 160, -89, -172, -63, 204, 57, -149, -328, -177, 170, 125, -193, 88, 438, 216, -37, -11, 251, -42, 22, -326, 176, 270, 44, -368, 43, 201, -4, -456, -216, 126, -22, -149, -272, 267, 124, 135, -72, -107, 119, 109, -152, 108, 437, 367, 26, -4, 297, 317, 16, -126, 34, -17, -69, -254, -379, -155, 91, -13, -113, 55, 61, 45, 75, 214, 383, 175, 58, -59, 14, 242]
839B42k24k8J1M24l29j36o8J23O3k85J87J22l09J4J11K38k12p9k34M14J86j50
861H1l22O58j84n5K5n15L62J96j56oko1j12N2q0J89M5r7k71K82J33j4k76n8M93
886C07n24N1j28L67K31m79K8J82J87j25k50J22J72jl31q3O99r5l08J13K03j8k73
909D7k90L23J84k42k00R4K36j4n72K65J30J72k76j15K34L12l17k20J03M10K45
930E09l94k62J75K67l71j06rN16k64l32L82K49k50k30j46M45L5l47o5J48M08m17
952e9j84Q8K73p7j13n9q2P5J9R0O8J82k64k87P25k7l96m58M35J65J49k72k71J43
976a37L47j48m71K80L43l09j34J35J30L5j67J20ML79l06m67M45L20m57j83K69
997B8n4K23n1m78M81j8o01J7O54R1k45m07K89M07n2k70m00O13K33p55J31L39j75
$$ y = [242, 18, -10, 1, 425, 96, -40, -108, 15, 78, -207, -20, 102, -207, -193, -82, 156, -56, -135, -369, 45, 231, 81, -241, 417, 233, 178, 203, -312, 50, 246, 90, 84, 82, 21, -91, -39, -119, 70, 115, 18, -253, 29, 162, 148, -128, -186, 307, -217, -166, -294, 73, 304, -175, -147, 35, 222, 97, -153, -31, 141, 140, -191, -274, 425, 330, 22, 135, 338, 320, 47, -243, 80, 264, 22, -178, -84, 152, 138, -434, -169, -39, 133, -143, -258, -24, 288, -29, -249, -146, 264, 509, 115, -147, 28, 295, -76, -182, -191, 325, 61, -271, 111, 360, 110, -120, -266, 179, 214, -133, -198, -50, 358, -59, -243, -155, 118, 41, -72, -131, -213, -138, -119, -29, 39, 221, -43, -330, 395, 368, -28, -486, -51, 114, 263, -9, -280, -137, 210, 62, -409, -129, 214, -95, -229, -94, 36, 71, -96, 24, 28, 407, 101, -366, 79, 399, -58, -241, 28, -26, 197, 146, -332, 149, 131, -470, -453, 201, 292, 47, -360, -71, 336, 284, 14, -386, 227, 460, -295, -164, 175, 0]
1020@M6p0j78K83r0l67N1M37rm95J04L04K29m51k5K69K38n2k52k72P65l77O8k76
1044a20M90k77j13N8j49K27k0o16M63N49l67k16q0K18J74j19l43J21M03j4n43
1065b74N24j13l87J7L41L02o64K10J06P6P6P4o97P54m2k50l1k8R1K4j51J24l07
1088b25O51m04j74L06K5o72J75L79j71J80k27l8O8M64m70j82K47K61k15J35p1
1109D2O8j8j3k01J8K36k87j75N02R0m61j73M00n5M98n79k4J59l4r8q9M98l30r0
1133a16N9J78p9P0k42j01K98L43o67J9K88N8J04r2k23j10L12j41NM5K88l57K9
1156c2J73q6j27r2q3K40R4m63M51J29o4l29N1K76k83K38J28k12k07K76m56N54
1178A76k6j05j63K2K16L9l21P4j32L74K14n28r2J03p1J20K50m00K49J23l28J01
$$ y = [0, 46, -24, -202, 81, -9, -376, -325, 112, 103, -392, -288, 16, 245, -206, -231, 38, 276, 224, -28, -300, 465, 88, 156, -120, 370, 93, -20, 38, -111, 116, 96, -520, -57, 492, 125, -91, -171, 47, 221, 102, -241, -120, 283, 269, -274, 250, 137, -250, -233, 108, 410, -254, -44, 62, 138, 214, 288, -409, 345, 303, 53, 22, -6, 85, 109, -42, 82, -225, 426, 22, -152, 154, 179, -493, -318, 61, -110, 70, -157, -195, -127, 337, -133, -315, -68, 193, -22, 113, 42, 110, 92, 79, -122, -104, 132, -155, -330, 172, 262, -199, -372, 28, -27, 471, -108, -132, 27, -7, -105, -194, 304, -26, -116, -57, 121, 42, 112, -130, -231, 67, 410, -257, -238, 50, 108, 212, 120, -103, -213, 99, -42, -37, 8, 296, -61, -32, 141, 55, -72, -164, -247, -7, 87, -376, 75, 204, 140, -189, -138, 138, -145, 93, 221, 9, -198, 78, -378, 176, 150, 45, -118, -96, 120, 159, -162, -88, -220, 154, 368, -160, -252, -149, -220, -100, 150, -250, -1, 122, -206, -105]
1200a05K77ml76J08K71k09j2Q1n7k23L75l30J26J67J2q4j39K06l69M58m40N88
1222C21k94M0j82M7K15q4j65J53n8p4n3L58k77Q0m7j69Q3K11j28j45M3L70j81
1245F4j80J50j33L90k50k58K67L9J2q6j12K87j5j49k47L07q8J26l17K53M0l91
1267b91J33Q1K03l7k60j4M3J05J79k95k8K59j38p6J39K33Nj57k71N7J94o4j50
1290a50L54Kn5l46K09M0R8j45j86P9J06l7Q9O2o3k4j32J79r1l7j47N0J25Q0M5
1315A05j16J03J53k99j32K90j8K6j52P7j53j4K2j77J99J74j3l52J28J28O8j85
1337a38n5nL80k21m4J81M4N3l41M25n0k61k43K09N0K13Mk70k68M67o8m22K10J56
1361FM4m4L5K38l99R4k4J02L4k34j14J51k3L98m45R6l4L14l46J01n2j6J54k21
$$ y = [-105, 172, 168, -208, -100, 171, -38, -50, 31, -26, -249, 126, -204, -78, 89, 101, 17, -122, 84, -285, 173, -267, 321, 27, 67, -115, -68, 147, 63, -102, 51, -7, -81, -134, 224, -53, 27, -20, -189, -106, 105, -23, -168, -125, 245, 64, -116, 34, -99, 291, 41, -217, 50, 89, 101, 15, -97, 190, 175, 26, -221, 86, -2, 124, -193, 60, 100, -291, -158, -77, 126, 89, -171, -185, -142, -37, 142, -153, -181, 78, -60, -136, 3, 236, 241, 84, -187, -130, 64, 0, -150, 204, 206, 151, -195, 14, 54, 152, 7, -179, -100, 6, -31, 58, 120, 57, 33, -99, 80, -11, -48, -195, -145, -20, 60, 105, -11, 92, 245, -54, -186, 104, 86, 112, -40, 37, -116, -130, -108, -285, -86, 88, 75, -277, -149, -21, 47, -138, -193, -198, 182, -39, -83, 98, 142, 195, -146, 279, 229, -32, -275, -66, -16, 197, 201, -69, -337, 130, 62, -360, -150, 6, 50, 6, 41, 279, -120, -26, -50, 52, 86, -148, -262, -111, -134, 264, -181, -85, -119, 195, -151, -50, -102, -118, 36, -185]
1385a85J89K76n18J9M21m6j86j0p3J53j54jR8n7J10k3j67j8L64j98J7o6Q2J50
1409A77k22k51M6N99k82j02Q7L9r8J3j04J56Qq0j67O7K6J28k97K84J78k24l5L6
1433a8K22o1k66j11L78q2n8k83J80mP6l06R9L23j44K53n80M14K5j58J25J5M3M7
1457A29l48K08O5K85l80j62J82K75m33m1J65j70%K62r1J70L14n91L9J72J26k23
1479d7j1q4J39N9p1j60L18j5l56j09O36m93J61O0q4L8n4K1J09j12L46k58j92J80
1503B1p7lL4p7J16j19j20J26K19m11LJ68K36j18kj00J05K17j15r5k04M11j65J5
1527F5N9K52l77k59J64QJ57n9k87L38N9l95J74OK40k11J69J0j56l0j01J82K27
1550B35p8j3k46K90P9n01jL36k20nL6j8J13L12n29J92k39N15l27J13n4J20n6r
$$ y = [-185, 4, 280, -238, -219, 202, 156, -30, -40, -113, 40, -114, -115, -17, -74, 36, 13, -154, -172, 192, -6, 11, -55, 27, 177, -45, -296, -250, 349, 67, -35, 52, 91, -7, 6, -98, 58, 66, -14, -181, -114, -88, 40, -257, 27, 205, -19, -54, -18, 204, 143, -123, -234, 144, 62, 4, -279, -99, -103, -27, -333, -234, 89, -55, 198, -382, 32, 57, -101, 24, 39, 82, 129, -219, -11, 54, 339, -41, -203, -21, 254, -179, -220, -55, -225, -225, 37, -54, 116, 430, -161, -122, 50, 176, -47, -58, -142, -3, 56, -15, -175, 143, 128, -228, -337, 299, -194, -33, 27, -57, -19, -73, -52, 57, -55, 291, 33, -159, 21, -56, -59, -25, -102, 14, -105, -225, -99, 120, -291, -288, -120, 116, -2, -4, -104, 1, 218, 103, 8, -196, 215, 50, 65, 124, 376, -1, -260, -96, -88, 69, 10, -277, 61, 120, -275, -101, -95, 145, -66, 103, 113, -43, -73, -174, 8, 235, 157, 144, -102, 188, 267, -234, -235, 101, -119, -124, -88, -106, 7, 319, -210, -18, -257, 258, -69, 44, -10, 110, 54, 45]
1574D5j4K47j15l27J53Q0j82k7m8K50K31j83j30k9J00j7j52k5K07j01j6M3J00
1597I0r8j6k62J46J78J00m34J84K94o2j1Km4Pj1OJ8K17n26N6K87J00N4k45p0l
1623d3K18j11j30J67m7r5R3J2m8l17L55k9k87K63lp7L4N1Kj27M1K71m6r3r0K09
1649A73n25K59k12L41lj4n8O0j9J07j24O4M8k34R0j6J55K0k45P3J36o6k18K06
1673br5j18J41Mj1K73k92j33J06K16k51R1K82l9j40o7n8K05j6k96K34L9p5l0j88
1698b20J59K01lm6j21Q0N8k07j11K06J95m31L78n7j12J66k11j47K87l5j91L27
1720A65K0o6k35j30L41j63K31k92K05J12k24j72K39K06k60n7M6K51l14n0J99k63
1742b11N50j87l77K65K47k24k85K02K42j37j51r3K07N9m88J40K89J87k42k15K74
$$ y = [45, 31, 278, 163, -164, -11, 69, -113, -140, -188, 62, 293, 110, -20, -49, 51, 34, -118, -143, 64, -37, -53, -10, 90, -8, -24, -286, -140, 38, 138, -296, -112, 182, 120, 109, 111, 67, 74, 63, 69, 87, 304, -222, -166, 121, 221, 275, 30, -40, -43, 175, 64, -66, 101, 54, -41, 52, 64, 16, -301, 54, 25, -262, 1, -2, -79, -45, 6, 8, -119, -78, 193, 147, 54, -36, 173, -352, -93, -305, 36, 33, 19, -39, 21, 2, 109, -15, 49, 97, -137, -47, -63, 92, 112, -133, -60, 76, 10, -208, -2, -97, -215, -74, -70, -81, 192, -100, -233, -127, 89, -162, -71, 211, 172, 32, -35, -93, 112, 96, -200, 34, 73, -2, -32, -220, -61, 140, 137, 91, -30, 50, 108, -99, -210, -4, 191, -240, 138, 81, -31, 135, -76, -223, 64, 29, -162, 165, 185, 119, -116, -246, 95, -68, 163, -129, 76, 188, -36, -208, 31, 237, -23, -80, -34, 217, -97, -147, 52, -211, 339, 152, -225, 40, 287, 63, -222, -20, 222, 85, -66, -159, 48, 107, -381, -241, 48, 235, -7, -222, 52]
1763E2j54K61l84J03K64j8j15M4R1P0j89k87L23K23k70j09K8M50m15j53J17N4
1785a4J81k55j7J15K71k05n4P6K7k03j28K27K58k40j16j87K62L32m20k3J84jj19
1808d9j13K15J06n1o5N3j85K80m50J9M57q8j31j79K76K51l60k00K28O6J86l74
1830a08k7K34J34k95k59J56M55k56n08L58L76k61k32O8L07K18o33O8m8M48l43
1851a48j14K48L34l54j87L74J74j66l43J17P3L32m29j14K02M27n64l2K37L43l46
1872F4k96O3M05j9n73M39L9k7l05j02K92Q0j13j87N0L24n7k70J34L31j49n60J74
1895b63L56J64l66q0J53L09k28j08JJ69K08m18j46K85J39k27l21K40M29j07k32
1916d3j5N8Q1j72l05P60k62m79J24M48N9l75j03J44J59J08m89L38J86p7l31r6
$$ y = [52, -102, 159, -225, -122, 142, 124, 9, 53, 144, 214, 25, -262, 61, 284, 14, -95, -67, 383, -32, -185, -68, -14, 167, -88, -105, 10, 281, 76, 22, 98, 125, -78, -206, 21, 279, 39, -77, -264, -2, 330, -90, -113, 71, 70, -49, -162, 53, 159, 108, 43, 96, -89, 191, -259, -240, 217, 129, -2, -181, 95, 346, -14, -214, 14, 80, 266, -108, -135, 99, 233, -62, -321, -165, 290, 34, -474, -116, 260, -1, -233, -165, 142, 360, -273, -205, -253, 195, -148, -262, -14, 320, -34, -221, 153, 327, 161, -182, -65, 8, 340, -89, -203, -1, 426, -138, -170, 67, 410, 64, -232, -169, 236, 217, -356, 83, 122, 95, -210, -312, -20, 60, -53, -240, -190, 134, 77, -193, -59, 272, 123, -437, -263, 93, 257, -109, -189, -36, 273, 45, -63, -62, 107, 315, -103, -249, 36, 175, -52, -373, -133, 296, 189, -43, -58, 0, 81, -91, -396, 364, 102, -377, -253, 195, 254, -121, -224, -80, 79, 187, -302, 36, 222, 145, -186, -282]
1938b82K42K22l07m18M48N02k41j74o2J72J0j66j08M92l20j16l70M91K30l44k46
1959c45K98L99m38J82j00PK23m59J92K89j96j61J02J47k3R7p81N47L47k09l68
1980b50p0M24K5m32J79L11j6k42j03L63k42J54l49o1P72k97k58k78M40J31j62
2001C9k08L40P4k51j42J09o4L22n20K13J45J78l99j17M16J52k01k74j6K03J90
2022A89n69L60L09l01L6j49K38k01K16k96R4R1j37N2p9N31k33m76J07K24k0j19
2044a33l9J12J24j15r4M7K12Mj90r1O00m41k21O7K62J3j59k63Q8L63k06m8L84
2067B76k06l3o1J43j98Rj58J07J78P8q2k35K25J37jm09J19R8L38m02o5K8L53q6
2091A53k68K8RJ14k82K94k1p7j62Q2Q1K25j54n2K53j82m8l8J45j70M6J37m46M57
$$ y = [-282, -40, 182, -125, -543, -95, 407, 166, -8, -70, 102, 112, -54, -162, 330, 10, -106, -476, 15, 245, -99, -345, -47, 352, -86, 96, -4, 3, 226, -233, -41, 248, 52, -109, -7, 140, 117, 214, -567, -20, 327, 118, -250, -320, 104, 129, -303, -124, 187, 171, -71, -174, 189, -53, 101, -248, -309, 463, 166, -92, -370, 70, 201, 39, -169, 171, 245, -6, -148, -39, -103, 219, -301, -88, 57, 235, -164, -281, 135, 287, 86, -188, -204, -1, 189, -380, -20, 289, -12, 24, -125, 113, -88, 128, -168, -74, 17, -120, -68, -147, 384, 151, -325, -218, 6, -14, -133, -172, -60, 64, -51, -145, -98, 114, 118, -72, -163, 437, -4, -225, -158, 104, 117, -42, -305, -217, 146, -60, -108, 276, 70, 37, -24, 119, -79, -70, -228, -121, 57, 135, 53, -182, 43, 180, 179, -230, -111, -13, 325, -77, -142, -114, 239, 153, -115, -87, -78, 36, -246, 48, 27, -50, -212, -130, -49, 176, 22, -30, 223, 41, -7, -45, 100, -70, -24, 113, -333, 124]
2115A24j21pJ07j7k96K04M0Q9l0n8p0K9J47j09j65o7J61MR4l14L01j95m2J8n0
2140b23L05j0k85J03K36k66K84o2J37k31nj37M63k61k97K15j83M35M4m27K36J14
2162A85M4k10p2J84L4k41j56K76l1J6k33o8L75k48j15J74J45Mk95K30J03j39O6
2185B8j44J36L0j94m0r6N27l89J15l9K6L8j3j26M01j68k13Q2m2J64Jr1n1J18j25
2210f5q5M33j63N8k32m2P8Q8j2l41L82l2j00j58JJ20K71n6k10J82ql53K55pJ67
2235A71l17O9R8K23k70J70k09O5r3j30K32j81M17k17j59J74L2j13k41L00L33k67
2257H7k51K3K33j72QJ17j04R9n9J17j74L7J14j04j99K01oj18jJ49k3l3J34M2l4
2282H3l21P8J82J82l63J66n9J60p4j46P8O6P3Jk36O2J11j16k3j16J45Q9l5r5K37
$$ y = [124, 3, -4, 103, 86, -210, -6, 34, 123, 93, 35, -35, -6, 141, 32, -133, -200, -39, -35, 59, -255, 46, -149, -191, -173, -223, 82, 72, -213, -110, 126, -140, 144, 82, 219, -12, -17, -154, 309, 48, -249, -34, -217, 218, 262, -165, 71, 185, 229, 19, -53, 131, 165, -76, -232, 44, 13, 29, -204, -272, 103, -145, -260, -86, 59, 63, -232, -2, 101, -38, 28, -116, 20, 50, -144, -184, -280, 247, -142, -27, -66, -40, -2, -15, -141, 260, 92, -121, -39, -81, 83, 84, -7, -58, 60, -65, -150, 283, 120, 178, -54, -96, -18, 70, 58, -283, 99, 67, -33, -191, -190, -70, 201, 145, -65, 117, 109, -244, 11, 4, 171, -146, -77, 21, 244, -26, 144, -65, 0, -93, -223, 9, -172, 245, 28, -131, 43, 75, -38, -279, 21, 354, 87, -164, -141, 92, -80, -72, 45, -59, 40, -19, 98, -76, -39, 75, -29, -228, -27, -33, -151, -152, -3, -26, -59, 75, 117, 83, -238, -160, 22, 204, -159, 7, -52, 108, 34, -112, -34, 32, 105, 106, -130, -68, 43, -73, -96, -212, -67, 22, -13, -108, 129]
2307A29N2l62L43p2j82J14o8J50L9q7r2j8Q2J8n7n0J08o4K05j78J33%j52k9J74
2332A36K0N4k09m6M3Q2j52J01%j42J8j7J40k02J0LJ77J96j11k24N7J44Q9k81L21
2357B07k34P0L1r4m2J52j82j9P3L6R3q3p3O1n6o6J12j73L06K34l74OO1J74r8k
2383A20j7jj41k14L05j08P6l43J64J19j11J91K4j5J9k0K5k59K00l0k47K52J21
2406A10j81J56K6j90OM9R3o9J19k25pl8K64k09j68K31J10j65k2j9J62J46l24k3
2430a68r2K62l8j34J03R3j1K67l67J50J34k16nL2J26p7q5j22J99o4P0j43P1J46
2454A31rn7n5l1l3l1J92n6j39J8o8K55q0J08k00J63L5J38l68K76j67j41J0J86
2478G7L5O4j83p3j89K55pPJ5L0M6J65k13k8K5j28R5L19k85j91K72p1J68k92J59
$$ y = [129, 181, -181, 162, 90, -92, 22, -46, 104, 143, 56, -36, -54, 28, 46, -11, -61, 47, -17, 188, 10, 143, 143, -9, -38, 136, 156, 210, 1, -45, -2, 80, -72, 29, 29, -113, -95, -112, 28, -174, -164, -161, 16, 212, 101, -123, -66, 78, 167, -114, 207, -27, 43, 74, -20, -62, 90, -92, -111, -38, -2, 91, 8, -65, -4, -60, -126, -14, -187, 119, 353, -21, -15, 46, 220, 122, 120, 103, 102, -39, -253, 52, -56, 20, -323, -159, -40, -151, 40, 64, 49, 68, 48, 73, -186, 14, -16, -263, -11, 110, -71, 85, 111, -79, -73, -24, 69, 0, 119, -106, -113, -151, 113, -96, -264, -33, 77, -88, -110, -129, 33, 179, -145, -168, -260, 2, -36, -170, -67, 26, 15, 282, -85, 65, 199, -17, -22, 10, 136, 59, -26, -148, 51, -13, 57, -86, -15, 131, 122, 65, 10, -21, -54, -85, 107, 51, -88, -70, -138, 117, 37, 145, -55, 108, 143, 281, -87, 189, 22, -119, -109, 77, 112, 176, -7, -80, -269, -14, -21, -14, 1, 31, 77, 242, 29, 1, 26, -102, -7, 312, 27, -164, 108, 37, 205, -87, 72]
2503G2n4J91j97o7Q6j20J81j17P1n2M2j11J7O7l5M6r2M4O3L36l39J17k35n0O9
2528f7J32j2j00O6K3j03M1k58N26l60M4j26J14J16o4j46K88j19J91j9k53j2L6
2551f2J72m57L82k23J58J72m3K51l39P6Jj82k06N32j80q0K7m5P4O3k7o5n4l5J23
2576C3j74K53k9k06m5L59q3R0k13J5J30k91J76o1J20M8K21m31n8N8P8n6J74O4
2600A72l75J46J17m4%M8j43R6N4J80r0m51J57J00j12J02J81O1m21P1K07n8R0q8
2624@J28k87M0K83k1j35p3P1Kj07Q1J61j20q3K62k32K6Q7j07oK13p1J49j87j66
2649i2J27jp5J3Q6qm7k1J80k76Q1Q4J34j53n7J07l35K53j01K82k94N3j9J24l8
2674GJ25o3j03j5K32j62j20p0K57K02m45K74j85K0J07q9m1M1Q0N3n6j95J61j02
$$ y = [72, 18, 209, 12, -55, 31, -89, 92, -25, 46, -6, 36, -75, -58, 9, -26, 20, -72, -28, 35, 371, 32, 149, -86, -136, -67, 65, 53, -47, 19, 42, -61, -20, -278, 248, -112, -68, -194, -80, 36, -28, -174, 114, -5, 186, 167, -86, -98, -62, 110, -347, 35, -188, -30, 142, 99, 350, 11, 87, 88, -94, -300, 232, 52, -28, -1, -46, 28, 91, 64, -1, -55, -90, 33, -141, 112, 83, -123, -168, 191, 108, 198, -15, 0, 130, -161, 15, -46, 74, 122, 343, -88, -146, -88, -10, -66, 108, 172, -203, -57, 60, 16, 16, 64, -79, 17, 71, 251, 161, -290, -133, -33, -145, -43, 138, 199, -222, -151, 56, -2, 88, 0, 128, -159, -119, 164, 143, 8, -65, 6, 8, -99, -18, 143, 23, -60, 202, -30, -4, 83, -24, -30, 183, 112, 261, 74, -92, 35, 34, -41, -28, 58, 50, 3, -18, 162, -114, -33, 51, 185, 32, -25, 82, -253, 0, -101, 181, -113, -60, -79, 45, 7, 132, 69, -34, -49, 183, 21, -99, -169, 88, 290, -155, 119, -66, -46, 61, -28, -69, -28, 52, 105, 49, -146, 15, -87]
2698h7J08K32j58J02r2k17m0J58o4q1k5l5L16j78l2m1J5J67J40k19J36ok44k1
2722a66J56m3J38J1j29L1J1N4p0Nj67P4J11j5l0o7J48J9k57L56p0j36K26k42J39
2747H7j26P8jo4K4J6J73o3k41N4J52j72J76L9k04Q8L24m06K08l52K18J05j80l8
2771a05J69m97L48p9J61m4R3l7P1L8k50J66l2%J30j99L13j20k62J91k16Q8J02
2794B9n3j8nLJ8R0p6k3K32l37J92k17K56j07P1k11M8R1P4n1j28KJ92k27K55l22
2820b22K60M3k32J97k11J42K17j25O6l50K72K04l88Q9J62m8k89R0RJ1J83M6j05
2843B1rP4l35K98J27k16M6j20k9K63j1j79K17Mj30L31k93J27M8j62k0m6j24K04
2867H6k5m0%k5ro2K45j34q7J67O2j31K18p2k26Q5O2j79J17L8O4k09J66k12J69
$$ y = [-87, 21, 253, 95, 197, 105, -112, -152, 6, -58, -139, -164, -199, 117, -61, -93, -134, -119, 48, 188, -31, 105, 99, -145, -166, -10, -53, 85, 96, -33, -2, 9, 63, -7, -2, -169, -95, 16, 1, -29, -96, 52, 71, -186, 170, 100, -36, 190, -52, 87, -39, 39, 38, -26, -2, 14, 187, 124, -117, -63, 89, -83, 93, 132, -72, 16, 340, -66, 142, -210, 8, 113, -67, -105, 64, -433, -85, -164, -3, -47, 46, 9, 80, 118, -132, 34, 2, 2, 132, -67, 246, 126, -136, 55, -161, -73, 29, -24, -42, -47, -44, -26, 64, -12, -35, 197, -140, 52, -165, 91, -16, 55, -156, -108, -17, 57, 6, -122, -120, 72, -155, 100, -222, 38, 81, -151, 46, -165, -23, 194, 69, 135, -215, 57, 261, -127, -38, 124, 76, -213, -123, -114, -103, 80, 126, 21, 12, 86, -249, 49, 176, -40, 6, -114, -143, 120, 109, -70, 147, 151, 21, 352, 59, 186, 234, 72, 52, 6, -118, 86, 61, 21, 21, -4, -13, -75, 170, 36, -51, 116, 178, 47, 265, 193, -33, 52, 114, -65, 52, 90, 154, -55, 111, -101, 68]
2892F8r3N3n7J9J75J3j46rj67n0K38L1Q2J21m4j28l4r1J47o8lj00k2j31l7J26
2918a07M5J51p8q5J24k21J83K06l88J49k3K43j69K7n4L4q8J01K4n0J64j09k43
2941a64M09l24J54n9j46K85l11J86j25K39p9k22K91j40Q6p7J48j54l34K97J03
2962F3Q3p6QJ06j64QN8k7j34j77K57j08J07K13l59R7kJ31J12j11k43J77rj59K80
2987A31m8j9r9L6j12j6K55j76p1j2J03j00J55l7J42k45L14k54J43k45N5O8n5m9
3011a36P7l9L18j36m1L0j79K58j25J30m46N55o4j66J59l60J01K32k92J52j00j8
3033i0j35K68p4M4j84M29m40J30N7K8o2j79J66j83K07n9J1nJ48O3j05J83k64r1
3057a37P6J20m8j55M29l68r2jL26oQk2j08j71K66j94k0R2O6q0K73m26J8K02j01
$$ y = [68, -25, 28, -29, -10, 165, 178, 32, 23, -144, -194, 44, 75, 157, 278, 234, 106, 72, -19, 128, 60, 57, -43, -65, -196, -233, -107, -62, 89, 11, -74, 50, -171, 12, 218, -170, -21, -44, 199, 30, 57, 3, 37, -51, 50, 74, 24, 188, 79, -164, 245, -79, 75, 16, -130, 155, -156, 30, -95, 144, 65, -157, 134, -6, 80, 3, 151, -3, -337, -40, 63, 146, 70, 78, 184, 20, 28, 86, 59, -75, -252, 5, -103, 4, 217, -142, -45, -47, 84, 196, 85, -158, 19, 10, -149, 131, 83, 64, -35, 1, -111, -127, 128, -48, -119, -131, -28, -128, 27, -10, 132, -113, 201, -53, 90, -155, -100, -32, -87, -136, -59, -98, 220, 84, 43, 73, -106, 152, 27, 157, -289, 266, 202, 36, 195, -165, -64, 168, -124, 28, -72, -90, -225, 43, -31, 13, -171, 258, -182, -52, 5, 33, -29, -208, -42, -225, -18, -77, -66, -71, 77, 140, 35, 218, -46, -137, -61, 59, 11, -144, 285, -83, -175, -176, 150, 144, 152, 130, 22, -149, 117, -77, -97, -5, 61, -19, 254, -172, -154, 48, -53]
3082e3Q8K77l72k8K04j15j41j1J43J91l06J88o1k49L43j66Q6Q4j7j6j81k26M85
3105A47j11l4J91j64j04p3L09R8k20L9J25j99j32r1J05J77j90K17k0k74J87K4
3127GO8O6R7j55j46K64N5k03J23j57l21L06q1j04L17j33R2k31k2J37J27j60l7
3150i1q6L72j27k73J98j26p0L58J5j61J9r2J29j40M2J29Ok81K14N5j79j1j65J33
3174a32k2L02j99J23L0o2j52J45j17O7j99J04J04j9R6k14R4j12K36j46Q7J0j63
3197a39K35o5j84K13r3J51j34K7j34K21k86K29Q3j55J54m0J17l54j40M12l4o3
3219B1rl58M39J15j46j20J36k98J84kJ72j24k77M01p9j63L04l34K31n9r6J26k14
3242a50P1J38rJ33k52J43q3j10K23j39K44j96o8m0m2K12n7k8P0j79J45M2r6J19
$$ y = [-53, 35, 312, -60, -88, 116, 1, -140, -151, -8, 183, -123, 65, 4, -245, 98, -68, 18, 102, 85, 69, -112, -338, 147, 36, 2, 193, 29, -75, -148, 161, 259, 39, 78, 203, 4, -128, -219, -114, 63, -127, 90, 70, -204, -17, 7, 75, 141, 238, 83, -63, 201, 256, 53, 176, 19, -302, 4, -77, -181, 136, 3, 95, -136, -158, -21, 106, -54, -91, -177, 195, 68, -205, -7, -133, -203, 155, 170, 9, 28, -64, 65, -75, -33, 96, 102, -179, 35, 90, -89, -100, -265, -132, -154, 148, -51, 72, 102, 40, -112, 33, -84, -17, -216, -112, -8, -27, 69, -145, -51, -163, 73, -73, 14, 24, -139, 96, 31, -153, 60, -33, 118, -16, 11, -123, 98, -188, 41, 124, -31, 123, 83, 200, -154, -294, 118, 84, 21, 12, -346, 93, 208, 62, -58, 78, -220, -36, -38, 134, 10, -267, 134, 55, -108, 196, -138, 93, 34, -62, 64, -150, -79, 59, 50, 183, -69, 74, -9, -119, 104, -35, 209, 13, -55, -95, -137, 75, 18, -10, 60, -119, 26, 68, -28, 91]
3266I1j75j0J12l30K45K3K03n0Q7m29J75J92j52K4LR8j95O9M0o8MJ64k3j60j74
3291b36L05K7k09J40J61m12L39q8L0JR7k08R7R5n8l14K3Q1K96l14L04o7l28M50
3315B12p7k7O4p3Q6k47O0k9j22K58q7J26j72j12m0M08l23K39l0k02J37j4q0O1
3339A6L1m3j00MJ19N6j31L74k17j69j62J53K46j44j87K46P6k26J38j22J49J26
3361B33j63o9O9J08l37K23k20L87r8l3m62M55k4m1K8Q2J94p0j59j27M9K7j2m7
3385gJ41j74o7P0j28Jr5J45l7L49k60J4J95j63j24L1J1O3k52O8K97j15O5K71m65
3410a66J45j1n6L77k86j92J01L1J59l19P7L83l55n8K22p6J38k74K27K6k8m7q0
3433f2j40L57l5m45J29L4K30j37r4K57o2Km9qJ2P7M5k68J28Oj6Q9j20J59l1Q5
$$ y = [91, -84, -94, 18, -312, -67, -44, 159, 109, 196, -233, -58, 134, -18, 6, 9, 107, -88, -19, 21, -47, -43, 121, 98, -62, -236, 69, 96, -113, 27, 188, -224, 115, 27, 57, 58, 155, -53, 44, 139, 81, -233, -210, -129, 167, -147, 157, 90, -238, 212, 135, 108, 172, 99, 185, -62, -2, -31, -153, 105, 18, 144, -28, -140, -180, 228, -95, 144, 114, -88, 49, 35, -45, 16, 47, 4, -96, -92, 27, 83, -48, 326, 109, -60, -222, -69, 177, 33, -154, 92, 168, -58, 80, -42, 107, 233, 70, 1, 70, 178, -159, 64, -156, 231, 133, 100, -362, 93, 69, 28, 56, 138, 332, 262, 103, -24, 25, 52, 40, -7, 134, -40, -107, -37, -165, -164, -259, -114, -151, 198, -62, -48, 147, -16, -140, -109, -98, -35, -287, -219, 78, -37, 28, 299, -166, -21, -32, -88, 289, 3, -189, -88, -57, 102, -217, -140, 243, -112, -170, 52, -24, 114, -160, 67, 93, 65, 18, -62, -202, 155, 120, -325, -196, -162, 68, -69, -163, 94, 32, 34, -15, -23, -11, 66, 111, -157, -29, -23, -39, 50, -70, 89, 58, 143]
3459A43j10M2R3j40o0j78K87o3k10K23o6R4nm4k6P6J27j93M2P3j42J27jj02m42
3484d55N08q0o9J79k63M06k63r3K03J02k10k36J91K1J74j68J43r7K68k16Q8J24
3506B57k62O2M8p1j19K5J20J07j52J43r5j18J00j79J68J39j26j12K95o9k57M4
3528e2m0l6J89kn6O3n4L2O0L4o9m2j55J8M3j49J31r2O6p8K88k17L65j59M3k78
3554a47K47n4j18Jk7M4L4OR0k26J54k34L51l6j83j34L42j50R1j40P5N1k8j12k7
3579a30J89L4p3Jk2j57K56q0O7j63R0q3j24J06Q4O7j34J11KQ9Q6r6J22k18J16
3604A40j48J12j57j45J97J62q0j5l00L40j7j46J26l80L63p8J1k40J80K52k10K55
3626B22j39kk24J45J36j68O1J99k64O0l5M6j7j79R9K5J14k05K14l16r1L45k63
$$ y = [143, 33, 75, 168, 28, -32, -210, 77, 14, -196, 27, -39, 55, 50, 6, -20, 56, 183, -10, 32, 105, -37, 90, 89, -13, -455, 53, -27, -96, 83, -180, 226, -37, -130, 73, 175, -35, -271, -80, -59, 115, -53, 90, -7, 261, 45, 133, 257, -5, 57, 105, 34, -85, -60, 60, 167, 15, 158, 63, -55, 45, -134, 34, 173, 47, -65, 230, 161, -96, -52, -92, -128, 61, 59, 3, 66, 12, 44, 104, 138, 69, 27, -128, -110, -67, -216, -85, -177, -111, -189, 99, -118, 247, 88, 131, -147, 100, 46, -72, -71, -98, -54, -20, -14, 76, -150, 4, -230, 121, 85, -98, -232, 110, -40, 51, -89, -14, 37, 9, -103, -130, 59, 93, 20, 21, -1, -158, 98, 18, 85, -78, 12, -71, -195, -89, -5, 62, -72, 39, 41, 130, 216, 120, 242, 24, 140, -8, 104, -53, -198, -1, 161, 81, 66, -234, 106, 89, -57, 69, -311, 52, -26, -15, -255, -75, 177, -33, 222, 83, 81, -143, 2, 138, -30, 31, 230, -34, 26, -9, 37, 20, -159, -60, -35, 79, -126, 88, -228, -319, 26, -237]
3649b37K81k15K32o3l0J79r0j75K75n6k18P8Q8r5J33l4m4K6jk13K85mK10l77P5
3674A0k86L48j18k4L17l29J30K9kk3k68P4L52j29j5J51l7k42k71K19K2P6no2K26
3699A43k49m4K35j17K82p4l64jK28k62L01N7j51r8R4j83K96m8O7j17K72k33L5
3722F9M6j80lk27N36l20L58l14p0P0K09l40K08j40J59M3r3j49K50l16K89k67M
3745a78K59j9M8l03K85P4k27J32R3l98L82o3rPm07L82q8K08P4J1j80k08J22L2
3769B9k3o4M7k9lj02J82j39Q3R9J9p5j9O6j39j26K93l3j1k5Q4p0J39k86J72r4
3795b5R0j27P2J01K3K3m28K33n8J50j85l0J74J15j67K95j90J00k33n9J65R9k25
3818h7J59k58J5q5M28k04K67k28j48L8j30K72Oj15j45J37J51L3j62J02q3M7J11
$$ y = [-237, 44, -171, 61, -2, -32, 147, 57, -118, 157, 101, -117, -39, 49, -46, 87, 53, 9, 35, 34, -179, 106, 102, 312, -65, 10, -276, 72, -46, -70, 247, -82, 48, 77, 75, 52, -216, -142, 210, 81, 66, 217, 180, -62, -333, -114, -92, -16, -21, -83, 143, -106, -150, 85, -32, 250, 176, -188, -189, 39, -223, 78, 135, -16, -114, -20, -203, 93, 45, 112, -5, 267, 34, 69, 115, -65, -68, -295, 241, -79, 279, -35, -105, -35, 174, -166, 42, -98, 61, 104, 11, -138, 112, -204, 85, -182, -178, 81, 62, 110, -193, 92, 166, -61, 71, 164, -234, 148, 85, 76, 83, -324, 58, -30, 178, 252, 263, 83, -125, -3, 29, 6, -58, -11, -40, -43, -145, 37, -102, -19, 80, 99, 24, 5, 71, -68, -194, 99, 66, 55, 30, 114, 44, 183, -103, 69, -25, 65, -62, 10, 111, 134, 157, -271, -38, -96, 54, -131, -161, 13, 128, -39, 256, 66, 166, -67, -126, 39, 138, -87, 72, -186, -171, -256, 172, -32, 235, 7, -141, -103, -233, 39, 45, -70, -215, -78, 73, 106, -56, 46, -37, 10, 121]
3841A21q7M9k7k05K62J92m35K8P2jo1J83q1r6m3J66m2r3P5J67M2Rj30O1N4k46
3867f6%J94m36N05m21N1k2L01j79M1J0J8k1N9k8O7j09M9j89K70j99K12l8P3R2
3892B34j58J24l35j5J10j6J65J84j96j05J58j10L8q8l62K53r6K82q2Q9l6K8j11
3915d5J26Lj80K37n0p5j2j1J81j96K53j65o1KN4J74k30J61Rl83K94o6J06m4Mk3
3941F3j39J43j27m5q9J91k81J08M1J32k5j3J64k47lQ7J28j19k40K37j87K04Mk3
3965c6r7L02j27j96M1J57k24K76n6QJ32l83J35j4L68k44P3j00Q2Nn6j56L0O3J12
3990I5p2j53J78j85N0P0J35N7r3K3k43K79k15k19K21j04Q3J35j01J30j0K1q4J45
4014A43k82R0K04k7M0j57j60j20J66L66j50J31l04N7K18k86j47J01M7q5K55j08
$$ y = [121, 34, 83, 56, -149, 113, 305, -130, -102, -30, -31, -92, 91, 10, -86, -129, 37, -5, -98, -23, 144, 186, 195, 65, 126, 180, -66, -66, 128, -308, 197, -224, -173, -195, 106, -73, -32, -22, -4, -25, 34, 6, 73, -36, 13, -176, 94, -105, 107, 69, 142, 234, 76, 200, -135, -150, -40, -56, 109, 293, 97, -8, 150, 40, 78, -10, -372, -119, -215, 67, -15, 74, 38, 66, -45, 81, 84, -96, 141, 91, 16, 4, -7, 174, -22, 231, 66, 5, 7, 61, 235, 5, 166, 175, -208, 86, 20, 126, 82, 86, 63, -76, 67, -60, -105, -194, -3, -284, -176, -135, -3, -28, -41, 123, -124, -127, -40, 88, -31, -271, -34, -221, -17, -13, -36, -133, 169, 42, -154, -113, 44, -180, 96, 40, 48, 180, -203, -68, -82, 286, 42, 115, 15, 97, 102, 46, -110, -80, -17, 95, 23, -130, 48, -137, -87, -17, 118, 175, 82, 105, -138, 141, -74, -293, -72, -176, -93, 42, -59, 71, 61, 82, -2, 143, -139, -49, 155, 128, 168, 11, -149, -269, -103, 263, 113, 244, -60, -3, 215, -71, -218, -117, -70, -155, 100, -8]
4036hj16J23P5q5K24k04j56J99r7Q6Rp9L0J28k02J36r9J01j81J98j77j38L57j41
4060a7R2P7l27K14R6j19p5K55j76j2jj20R7J57j27J05j71j3p5M1m8J43o2J22j91
4085a35R5k00L70j36k57K37p0L71n23K06r6L07k42k4J10j59K37l07L26OOk6j18
4108b2R8L6p5J6J81l47J21O5j95J24m3M6k1J43j52K80k77o6J54k46J44J64p4j0
4132D4J3k5k7k37K22K83k52k0l04N76m74M10n66L03o3J74J93j26O5k30k5J94j00
4155B8j38K68j90K6j28l6K55j0k63L31j20K7j00K11j25q1J55p5J30k94J81n1j3
4178a2j26K19j20J6Q6j9M4m3R8L7j54J03q2N7o6j42J65PkM4j61p0n3J40j0K31
4204A87p5k9L2k51L95k94K1j56M3O6J83q0j03J78J39l17k2N6J79J2r8K0o3j53
$$ y = [-8, -124, -1, 74, -11, 213, 9, -147, 52, -45, 41, 50, -29, 1, 129, -73, 63, -36, 65, -116, 82, -95, -233, 124, -17, 75, 152, -175, 39, 135, 16, -59, 196, 20, 8, 7, -113, -16, 141, 14, 119, -52, -65, -140, -99, -147, -4, -66, 56, -135, -40, -240, 130, -6, -263, -26, -96, 275, -248, -42, -138, 169, -73, -97, 13, -146, 91, -216, 110, 116, 122, 96, -22, 76, 112, 37, 53, 234, -113, 8, 73, -122, 2, -41, 5, -16, 127, -25, 255, -22, -88, 66, -180, -36, 128, 54, 44, 57, 32, 5, -232, -10, 273, 21, 1, -303, 273, -201, 209, -357, -54, -117, 57, 250, 124, 189, -41, -66, 128, 28, -110, 158, -32, -6, -134, -170, 85, 75, -188, 143, 23, 50, -50, 161, 36, -45, 110, 35, 165, -129, 52, 1, -12, -138, 81, -39, -23, 63, 44, 88, 45, 143, 180, 26, 129, 47, 104, 38, -104, 61, 68, 66, 110, -51, -121, -174, -34, -44, 187, 112, 83, 115, -136, 259, -35, -14, -170, -127, -61, 122, 42, -61, 117, 256, -61, -83, -27, 152, 164, 66, 86, 23, -130]
4228a30J13L2j10J42K7l30J55O6J77j02O3j80o8L2K84o8j24j17M51k94m4N0j17
4251i2J77j29J22l58M49k71J34jR0o0k28J87Oj76J70p5O8K4K8o5%L3Q1j7j67Q1
4277A1j70J58p2J14J58k03J47l16P3J0k0R3J79j09k8K5j02J30n4r0j68K49N2j5
4301E2%kJ2k9l2J07j64J92j83J2k41J61J20K77l60K08J44k47J17j40J8J61p6j91
4325h4L72k43o5Q2nL7q7j90K14j11K3j88L75l43Q7J35j38N1K7M6K09p4k26j00
4349a96O5K22j83J22Q3k03k9L06l44J28k0J53q2j62K15q7l3r8K08Lk30J93M0J4
4373H5L3p9J17q6K41l82k0L4r2qJ45K6j9k8J28r6j18J71k96M57k27l2L13j45m6
4398G6j33kk6J15j0J11j12M1l00K63k09K29l5rM2J6m4p4J65j8m9p9k38L42KN9
$$ y = [-130, -17, 15, -95, 47, 74, -256, -101, -35, 142, 40, 103, -77, -145, -113, 171, 103, -21, -138, 313, 19, -25, 25, -92, 85, -44, 78, -280, 169, -102, 32, 31, 121, 61, -167, 20, 26, -150, 20, -55, 13, 37, 65, 0, 0, 33, 114, 97, -70, 11, -159, -1, -73, 41, 199, -4, 143, -173, -100, -90, -110, -17, 162, 53, 25, 50, -52, 78, 24, -66, -234, 15, 67, 52, 52, 50, 62, 33, 1, 108, -56, 136, -47, -35, -276, -115, 5, 282, -78, 130, 274, 27, 144, 4, 22, 183, 107, -84, 288, 45, -20, 62, 57, 94, 7, -183, 31, -80, -57, -245, 130, -213, -126, 9, -129, -78, -51, -5, 204, 130, -96, -196, -131, 91, -92, 30, 113, -90, -119, 187, -157, -29, -49, 104, 22, -140, 75, -12, -45, -143, 65, 68, -162, 31, 71, 85, 118, 39, 156, 70, 311, -71, -91, -57, -149, -157, -12, 14, -5, -33, 95, -1, -119, 52, -244, 213, -14, -46, 267, 122, 76, -57, -59, -85, 30, 20, 131, 19, 60, -240, 23, -186, 43, 8, -1, 41, 57, 13, -61, 104, 86, 37, -42, -280, 62, 64, 123]
4424A23M8k58O8k9m7L4j1j75P8J08M7L7no3j01P3J20rk96L11o2l6j38j7L65l45
4450a80K93j6j61R2k32K37k0p2J58l48K18j78J91k8j0K29l59K22p2j95R5K22j75
4473h9M2K30lj15j43L6k17L75k01K86rl78M4L59j13j62Q9j9o3m0J78k26K3kr0
4498b08L54j9m5m4o0j6J0L6n5N3P8j94L8N9P1k24K59k42K7L14n5j15O1k09R3K02
4524A69j0m1j73NQ1n5J11j00j0J42oj76O6J01jm8m5J4o6k13K32K3J84k61K75q5
4550A13M3k21L40k09K82l76P3M4l8o0R2Oj07l5J05k08QJ95k2j35R3K8Q4k22J15
4575a2pm2K68k58p6J33J97l16q6K38j0m1j16O2N2q1K19j57J12j30pRk62L71j6
4600D4j20K4J6P8l22K99k49J93J4k3k24J04P9J81j6J97j72j51j8L17o5l07P1o9
$$ y = [123, 171, -87, -19, -48, -95, -61, -72, -247, -169, -61, -14, 23, 18, -45, -146, -73, 47, 38, -258, 53, -9, -45, -183, -200, 165, -180, 113, 97, -64, 28, -204, 33, 13, -59, 99, -249, -31, -209, -18, -46, -56, 173, -186, 36, -36, -231, -136, 86, -89, -47, 183, 180, 65, -78, -42, -259, 116, -85, 201, 192, -186, -142, 217, 104, -58, 31, 12, -51, -91, 87, -139, -116, -118, -208, 146, 127, 82, 38, -22, -38, -28, 8, -47, 6, 84, -110, -72, -13, 58, -166, 93, -149, -122, 192, 137, 22, 83, -126, -33, 169, 159, 118, -55, -50, 31, -24, 87, -13, -23, 119, 113, -63, 3, 104, 103, 55, 10, 24, -42, -255, -23, 0, 184, -77, 198, 113, 156, -65, 275, 66, 348, -28, 45, 89, 51, -9, 83, 89, -18, -53, 52, -156, -148, 47, 25, -110, -17, 11, 95, -127, -12, -19, -61, 207, -51, -127, 6, 203, -113, -199, 39, 29, -12, -128, -66, -14, -95, 124, -33, 79, -51, -58, -49, -311, 60, 44, -76, -52, -36, 42, -280, 19, -230, -37, -23, -46, -270, -166, -87, 94, 78, 275, 103, -48, -66, 251, 186, -121, -50, -119]
4624a19J74L2%j65J40J5j52K67j54j37o0K28M2O5r0j93J33j65O0R8k72J72M9J24
4648I2q2J06j38L9j02P8J25k19K22j29M2q8j54J99R1o5j15J77M3L9j23K94j11
4671B21l0j48P8k12J35k9k43K89J46j57m26J75L30k2l47K39L9j12J12n8l3p8J23
4694ho8J29q9q7K88k92J16n0q6K36m5J8j93J59n0p3Q9j16R7O6J92k10m2P7J5j02
4720b9K03j81j67J33J07N8mk37J64j74K0J30rJ14j66P4J81l42J11P2j94K76M1
4743A81l56J23K29j05k3J14j32Q6r3oJ80k62J10n6NQ6k50L09k14P0p0n0J22j24
4767a26k7j14L07J5l35J3K22J23k46R1J28k01K45j79J03j24L1JJ84j55M5k2j47
4790a68K1J94J51j86np7O8o6K17k88K14M5p0j5L5k94J15J76k22J81n8R1j89p2
$$ y = [-119, 55, 87, 87, -78, 62, 77, -75, 192, 38, -99, -159, 69, 111, 176, 86, -107, 26, -139, -79, 19, -253, -81, -32, 92, 10, 116, -22, 17, -85, -7, 118, -101, 121, -8, 34, -54, -208, -9, 82, 17, -98, 79, 122, 161, 38, 332, 221, 191, 43, 121, -91, 44, 15, -228, 61, 207, 50, -376, -201, 129, 107, -240, -1, 38, -74, 38, -20, -53, -131, -8, -76, 53, -36, -123, 165, -127, -11, -61, -147, 89, 44, 62, -131, 28, -22, -95, -6, -122, -25, 41, 233, 23, -19, 58, 73, -29, 174, -7, -174, -41, 66, 124, 120, -117, 47, -127, -107, 23, 14, 128, -38, 36, 217, -125, -14, 58, -136, 140, 181, -175, -52, 177, 72, 49, 163, 31, 117, 24, 18, 198, -64, 46, -10, -5, 81, -169, 140, -74, -4, -74, -124, -2, -126, -153, -267, 40, 55, -280, -267, -45, 78, -168, -77, 51, -150, 95, -84, 19, -105, -74, -73, 111, -44, 1, -21, -168, -147, 47, 198, 12, 7, -70, -2, -68, 149, -139, 75, 120, 50, 35, 70, -224, -109, 67, -155, 26, -32, 59, -130, -202]
4814b02J95K27k99l7K74k78J30o0L2P6jo4J04j12J54j12J42l00J52Q0j71L0K95
4837B55j23j25J48j86L7m3p7J56R0P5k33j09j9J73j56J11j92J66R4j11j4k2J72
4860F7j19J80n7j04r0P3m1J22o6J78J1j09R7o9n8p7l8K46o2k34J80k5P6J83k47
4885A7Q7k84M14j53l7K8M8n7j03R8K0j00r0Q8J02P3k33J34j0L2P3k70R8qN4n5
4911c4Q2p8q6J33Rj26K52k55J01j64K12p6J06j04L3M7R6L9j43J75n04N09k51L31
4935C04l31J83j92j7K49k52N0K49k48J18J3k68J70r8q3J38L2m0J8k74L63o6j8
4958@J24j2J25l04M35n52R9J34j29N1K33l11O1l0R2P2L6j49J56J5k41J32L3k1
4982D9Q5N9k48k27L93j46J57k74J04Q3LN3l06K97j38K60k67K69j79J17k45J59
$$ y = [-202, -7, 220, -79, -116, 158, -120, 10, -50, -18, 58, 57, -7, 97, -15, 139, 27, 169, -131, 21, 101, -70, -40, 255, 132, 7, 155, -31, 6, -37, -114, 42, 132, 207, -26, -135, -154, 19, -137, -26, -218, -52, 42, -69, -83, -105, 67, -52, 128, 71, -33, -123, -50, -91, 31, -35, 143, 154, 45, 142, 73, 15, -62, -100, 146, 84, -150, 30, 5, 81, 264, 17, 104, -180, 234, 81, 44, 72, 120, 63, -40, 58, 78, -22, -112, -24, 78, 151, -82, 52, 42, 74, 147, -123, -25, -33, 21, -34, 48, -30, -116, 17, 26, -100, 152, -103, -2, -166, 46, -30, 76, -28, 5, 52, 148, 187, 44, 219, -285, 224, -27, 304, -27, 156, -36, -53, 196, -56, -6, 243, -5, 113, 126, -142, 28, -70, -153, -15, 17, -23, -5, -279, 84, 18, 0, 124, 112, 237, -67, 368, -184, -85, 49, -80, -29, 204, -107, -46, -76, 16, 88, 124, -25, 131, 146, -95, 37, 70, 49, 134, 193, -55, -282, 111, -35, 122, -152, -48, 35, 38, 91, -215, 82, -56, 204, -63, 206, 27, 144, -101, 58]
5004E8j44n9K17N3k36L62o6r3k4J07p6q5Q2j6o2j36m4L31l61L18J58k74K39l20
5028g1K40k96N3K12q3l07R9K68O8j0q7j03n7l0mK30k6k10J08q4lJ3J36k8j01J34
5054F1L1j0M5N8l02L9N8J47k07P5K21p8k66K54ll3k73L17r0nN5nQ7j16j04J81
5080A37n9j71K63j91K90l35L24k95LJ16rj95J87j10J93k45M19l06J76j20J13l81
5102a96K58J53l21L35k11J75l18K51l0l2j78J31j61J03J58k80K35Ol29J34Q3J2
5124b2j51J15R8l2rq1J16k10K27M5k46N6K23j96O2J12J6k25p4L38o5j81J75j34
5148d3n3J56l63L96j19J51j69r0K87m7O8p8j86J01mP0qm3q7N7j24Q1K6q9J52k60
5174b18J55J07L7r3O2l17K69j20J41k5j1n6k32K40J13j68K84l72L76k56J88j01
$$ y = [58, -86, -145, 72, 125, -111, 251, 185, 92, 68, 175, 99, 14, 96, 80, 18, -118, -162, 169, -192, 126, 284, 10, 249, -71, 169, -127, -74, 138, 55, -252, -153, 115, 183, 173, 86, -17, -74, -104, -108, 122, 96, -114, -6, -90, -93, -80, 56, 28, -73, 61, 92, 82, 127, 185, -117, -78, -20, 127, -80, -5, 216, 138, -128, 126, 123, 90, -183, 134, 44, 39, 94, 89, 176, 60, -44, 137, 78, -93, 170, -21, 269, -66, 258, -37, -34, 82, 73, -122, 65, -45, 148, -97, 322, 16, 192, 72, 185, -196, 62, 215, -106, 229, 18, 193, -125, 126, 96, 64, -114, 17, -144, -41, 117, -163, 72, 78, -251, -117, -34, -22, -173, -58, 40, 8, -1, -82, 34, -176, 51, 96, -150, -94, 129, -67, -5, 107, 123, -102, -176, 162, 97, -84, 91, -43, -96, 60, -303, 93, -26, 125, -44, -134, 153, 106, 174, 96, -90, 11, 7, 77, 69, 26, -61, -4, -128, -47, -21, -110, 42, -218, -63, 44, 81, -12, 50, -267, 2, -118, 23, -2, -13, -69, -301, -61, 52, -116, 168, -204, 172, -84, 104, 3]
5196Cj41L6K11j9l0m7L2r1O6J17k9l0O4n3k71J22L4j77L79m46K01P3o3K15J4l66
5222a96R6L25m6k70n6J25J49n8k11J38j33M1K15o6k43J96n1J81l80L16J76j64
5244H4p2K11k83N6p8K06k28j09J51J23o6J11j56k7O8l6L9Pn4L47m10J38j0qL9
5269D3J16k86J33r3K28j27O0K7j15KR8q1j37j2J12n4J65r0K14q9k49k9j3J37R7
5294E7r0j3J97j86J03j3k7M3l34J61J15j81K29j65K03j66J29k05K40J78m61Q1
5316a05K20l40L06j03k07K44O2j58mJ37O8o9j44K57j85J05K4j00J03j56K99r3
5338A61r2L6l17K51RJl0k01R6Q6j09J56n8J23Q5k48J10qk2k7r7K8jJ17k04K84
5364A29j14j6P2j64O3J35p3q1j05P9R8J6m4j42J89K3J14l33L4m1J92O7k02J79
$$ y = [3, -138, -102, 109, 90, 60, 13, 45, -46, 20, 137, 108, 78, 142, 89, -182, -60, -26, -203, 176, -270, -69, 4, -59, 156, 170, -196, -100, 225, 179, -91, -147, -22, 127, 69, -142, -4, -137, -96, 119, 53, -190, 6, -45, 136, -244, 72, 248, 84, 12, 223, -60, -4, -82, 124, -104, -213, -62, 61, -5, 106, -50, -77, -9, -45, -6, 1, -53, 294, -116, 22, 12, 4, 43, 159, -127, 6, -87, 141, 14, 74, 101, -14, -12, 86, 5, -132, -144, -32, -86, 79, -11, 203, 114, -135, -164, -177, -40, 57, -33, -46, 151, -35, 68, 55, 28, 71, -263, -102, 13, -168, 61, -104, 99, -67, 62, -143, 97, 275, -186, -105, 115, -225, 81, -22, -229, 15, 77, -81, -85, 52, 120, 51, -93, 164, -21, 84, 108, 8, 111, -45, 254, 161, 69, 105, -212, 39, 48, 49, 19, -182, -86, 0, -109, 47, -11, 112, 197, -51, 59, 51, 29, 2, -95, -67, -68, 49, -155, 129, 15, -1, 71, -93, -30, 105, 32, -49, -154, -75, 23, 39, -5, -147, 42, 65, 179, -154, -120, -161, 31, 98, -104, 75]
5388G5n0P6r0NK38k73JR6k43L62k56K60j58j9O1k24M35m06J96j94N6J32N5L0j47
5413A8j14J48r9J90O1k67j7M4M5L6j31J15P2J9L8k95mK63l74K72Q8k26L42k13
5437A1J09k35%K20O1r9m8N5k52J62q0K72l54J97K34m2j77m7J49j21j2L1J00r6
5461C8o3pK08j93J21q0m6M7N4j89L37l57J55m9P0j48J98k16MJ32q2J9n0j52K35
5486a4j2K29j13l05K60k3Or6j9L1r3L3K32j15m3m6l2O4J79j91J61l7m3m0J3m8
5512f2K3J4J57l47RJ76m0K22j64j19K63j49J49p7j83J92j33o3J33k49J17Q1J32
5535H2O8j49J11o7k08K26M0K7l5j36M0p4qq2J32J3m8%J53j09n0q3K39p0%qJ40
5562A44j53q8J8n5Q4J58m6J25j31J64j70j17N6j32P1J45k57K01o9Rk8Mj8m8J73
$$ y = [75, 25, 101, 11, 16, 254, -19, -18, 78, -165, 197, -59, 201, 43, 24, 85, -139, 296, -110, 86, -108, -52, 80, 135, 165, 18, -96, 52, -47, 143, 204, -63, -80, -36, 9, 45, -86, 29, 101, 120, 158, -137, -141, 122, -252, 20, 108, -118, 224, 11, 120, -115, -115, 105, 166, 67, 19, 74, -178, -16, -96, 176, -178, 19, 253, 211, 34, -13, 136, 15, 3, 34, 134, 38, -25, -32, 176, -17, 104, 24, -22, 25, 79, -110, 227, -130, 25, -24, 46, -102, 96, -120, -116, 16, -66, -47, -97, -249, -14, -26, 203, 90, -215, 45, 22, 28, -68, -87, -56, -149, -116, 116, 1, -42, -88, -120, -56, 123, -68, 93, 56, 13, -27, -14, -62, -39, -25, 132, -215, -206, -30, -70, 152, -12, -131, 132, -17, 132, 55, -128, 64, -69, -132, 1, -248, -131, -50, 82, 150, 1, 112, 45, -163, 63, 103, 130, 95, -41, -1, -75, -83, -165, -33, -20, -68, -68, 85, -24, -74, -157, 82, 12, 12, 4, 144, -9, -97, -79, -134, -50, 108, 62, 187, 56, 220, 50, -67, -11, -143, -72, 73, -184, 17, -52, -43, -71, -67, -85, -133, 40]
5587D0p5J82j99j6J09o3J11k07L92k91o4L15j53k62K23J0j15K9j16J44Q6m4n4
5610a8J46j17k3Q6j48J80k15Q6k3K77k11J34k33J41j3k38M9N2K9j39J35n8L1J93
5634A03j9j66Q9o5r6J52N3p4J07M3N9k30M7j88K20ok4k4J27j10qj04J89j56KJ59
5660H0mj90P6kK50j58j10j4p4J71L9j22J08r1P9j36J61k3p9K0k11L21k37J92p0
5685b4K6Q6J08j38j80M7J64k09O9K5J40J0k58J11j5k15K28l2qL4N5L2n0j2J50
5710A44k18J02j9k36J69m2N2M0k4J78j31j50K67J08k90l1o8K63M7j27L3l30M98
5733B35k30Jm4K19r2l02L28l06J23l3J83j06p2J98L8P7m4j25j71l8J68j16qk8
5757a45k6L07j77J50j95J97J04l86K32n8j1P3k18K60rK2k1k18J17J45k33k4K96
$$ y = [40, -35, 147, -52, -68, 41, -22, 89, -118, 274, -17, -81, 234, 81, -181, 42, 52, -63, -34, -150, -6, 80, 36, -18, 128, 11, -12, 74, -74, 106, -109, -23, -46, 231, 20, 154, -79, 62, 49, -189, -140, -88, -59, -198, -63, -121, -90, 103, 84, -82, 7, -58, -154, -2, 51, -23, 84, 127, 186, -44, 3, -185, 35, 29, 5, -19, 108, -2, -10, -114, 75, -81, -79, 80, 76, -114, -38, -40, 210, 52, -58, -72, -146, 25, 64, -58, 50, -41, 38, -98, 63, 40, -39, -19, -230, 91, -146, 46, -24, 2, 88, 196, 58, -122, -75, 89, -120, -51, -26, 114, 124, -134, -23, -38, -253, -25, -57, -65, -31, 24, 56, 6, -6, 144, -74, 28, 9, -227, -58, -100, -48, -8, -32, 146, 15, -135, 132, 240, -50, -81, -149, 114, 161, 34, 67, -263, 235, 5, 6, -38, 181, 89, -213, 115, -191, -68, -101, 82, -24, -96, 102, 140, 217, 173, 48, -123, -161, 7, -109, -117, -145, -171, 136, -41, 109, -86, 111, 215, -171, 61, 3, -8, 65, -153, 107, 98, 120, 99, -119, -2, 143, -90, -114, 182]
5780A82j97K64l82J01K08l15N3K42l62K37J30k17lJ67j55J87m1q8J0j35J62j33
5802h5K29k3j72NK0k8J50j29k03J71K13j42M6n9l4j7J63k22R8j1j30J23R9p4k45
5827b57J31K3J95n1r5J36j16j32j9p2N19l15j21m3K86o2k65K50k4j40M55k54O7
5850I6k28n9J67K3J31j09p0L5K02k49M6J16j04J10M2J56m29L18m7k16P9q7J6J66
5874A05Mm7J01j50K5k5M4J06j52Ql5j61K43N0j82R0l19K31J47j35p4J67j06J51
5898H6k57J4J78p0n0J91k55K44j35j5J22o0qk40PQ8R5Q6Q9q6k2O0R9k49J03J99
5924B14k86q3K46j11j4J00n5l3K12m42J90J56P8m9j62N5O3O3m3m2k78J35J67k40
5948a59K76o0M2J00j92p6nQ3j82J69o0J67j3Ml26L66J01l42J57RN3n9o8M6q4r5
$$ y = [182, -15, 249, -133, -32, 176, -139, -86, 156, -206, 31, 161, -56, -59, 108, -47, 140, 99, 11, 21, -114, 48, -85, 144, 121, -51, -46, -26, -54, 96, -33, -236, -65, 148, 6, 52, -7, -41, -58, 105, -117, -19, -30, -160, -37, 62, -12, -257, -126, -103, 92, 41, -54, 82, -34, -166, -185, -257, 262, -53, -174, -217, 69, 7, -258, -8, -32, -172, 283, 29, 96, -132, -191, -24, -1, 130, 21, -49, -14, 188, -61, -15, 101, -3, 107, 149, 305, -124, 194, 147, -69, 10, -77, -61, 105, 109, 62, 163, 13, 38, 13, 57, 163, 11, 19, -16, -177, 66, 116, -66, 24, -295, -64, 83, -52, -126, 41, -65, 86, -171, -157, 21, -49, -99, 92, -163, 81, -54, -69, 53, -7, -15, -255, -248, -160, -65, 21, 110, 24, 2, 62, 161, -88, 15, 214, -72, -155, 91, -20, -34, 66, 11, -22, 190, -252, -62, 94, 172, 123, -39, 16, 79, 142, 99, 57, -221, -86, 81, -159, 117, 57, 99, 199, 7, -69, -74, 9, -173, -4, -64, 103, 90, 94, -232, 134, 235, -107, 50, 59, 112, 53, -15, 31, -53, -148]
5974a48K38J24j63q0J08j81j32K07N4n9n2J84p6J59j74k3J39k06J05J04j29J36
5996A35j55J48j45l0K0K21p9k16J12k78L17l2J49j76J3J49K09l10k55L09k00L06
6018B12l88K16O4m2N2n9J08j42r1J39j20M3J5K08o0j28O0lk18J92k5j46J55m5
6042cJ62J0J02k68J38l31R9J48k07M4J27K73j04j82R8k22m0L23l33K84o8l1J03
6065A22j37Q1o5K1K17j85l5p7k04J18J75J6k5Q5N5nr6r4j06R4J42o3J22o3o6j95
6091a68J62m8J04k8K1o8J7Q7p0m8k6q2J35N2l5J88k77Q0m4r0K99k23r2L49r4p2
6117B9l2j30k7J50q0J23K4O4q5j6J59k49K23j59J03q6J48m46K10L0k15K15n7L8
6141f6J28l8j60%J69j4N2n1j17K77j17M7J02j32j23O9j68L7M7kJ69j23R4j35K16
$$ y = [-148, 90, 214, 51, -29, 79, -102, -234, -27, 27, -32, -84, 100, 24, 183, 9, -14, 125, -81, 24, 128, -1, 135, -20, 128, -17, -47, -27, 194, 115, -101, 11, -267, 50, 18, 167, -9, 4, 153, 362, 52, -203, 106, -94, 212, -176, 40, 104, 62, 114, 55, 163, 21, -70, 69, -51, -8, 7, 215, 155, 27, 87, 84, -134, 58, 33, -113, 42, -3, 159, 169, 271, 3, 141, -190, -91, 57, -150, -106, 21, 294, 190, 8, 106, -116, -156, 167, -166, 118, 50, 19, 122, -15, 66, 1, 22, 239, 54, 19, -58, -262, -144, 31, 47, 22, 107, 162, 157, 61, -33, -139, -45, 97, 34, 156, 93, 27, -168, -6, -54, 50, 22, 43, -25, -8, 79, 9, -39, -65, -147, -12, 40, 5, 193, -84, -4, -48, -138, 161, -62, -154, 195, 101, 29, -3, -133, -160, -10, -90, 33, 57, 121, 36, 20, 179, -70, 153, -6, 97, 11, 159, -287, -77, -47, -262, -47, -104, -66, 62, 24, -136, -136, 33, 19, 71, 20, -97, 180, 63, 110, 212, 80, -43, 26, -142, -105, -58, -60, 109, -14, 80, -55, 161]
6166A61j26j7J61j98J57j5p3O4n8k69K14r6J43N2l6J14j75J38M4j29J14k88N3
6189f5k8oJ22J47l11K66r6j24K35j61J20k45M6R1K06r7j19Q9k7J00j83r4O2K11
6213A39k56P0K54k71J05k85L80k15P8N9O9j52K08k84J15k13J90O3j16J45J15r8
6235A00N7k36q7K94k00L3J73m7j7j55M9J4J38r7j45P2N3J69j96NO6l34M77n18
6259c32M39j37J18R8j69L4r9K0j5L0K3K5j05m8K1K69n3m3j91K3O9J13R0k97P1
6284d6j7Q0j26o8O1jK8M6r1K28j43j00J56r0j2J37j54J7P9k2oO9K2j70PJ21k3
6311a8l4J19P7j30o2J06q0J43N7l99K99N3k80K17k78OJ45l2k8K8M2K13k22Q8n
6336B5k01K91k07J60l48J65M4L2n9j50L15K42l81J38O4o0l6N3qp3J46k28K11p3
$$ y = [161, 35, 18, 179, -19, 138, 123, 50, 114, 56, -213, 1, -95, 48, 100, 64, 178, 3, 141, 185, 56, 170, -118, -65, -93, -99, 23, 170, -141, 125, 29, -95, 140, -21, 99, -146, -100, -9, 197, 100, -19, 70, 43, 143, -40, -134, -72, 139, -117, -47, 207, -64, 41, -244, 136, -79, -1, 58, 127, -25, 183, -101, 14, -199, -9, 54, -62, 83, 198, 100, 157, -79, -166, 128, -72, -39, 134, 87, 70, -85, -36, -22, 116, 19, -126, -54, -1, 168, -28, -23, 43, -291, 186, -332, 107, -30, 88, 186, 17, 51, -48, -28, -43, -13, 10, 35, -70, -118, -97, 172, 119, 76, -115, -92, -23, 90, 180, -117, -46, -63, 17, -109, -177, -116, -117, -89, -43, -134, 94, -49, -149, 7, -83, -95, 42, -112, -95, -16, -38, -44, 25, 47, -123, -116, 5, -18, -52, 67, 144, 14, -48, 58, -22, 121, 178, -221, 78, 131, -149, 68, -210, -204, -59, -91, -119, -91, -49, 164, -58, 30, 25, -176, 115, -92, 68, -280, -115, -71, -39, -98, -248, 67, 309, -72, 66, 130, 70, 34, 87, 79, 6, 152, -76, 135, 62]
6360F2J25k49k3J54M9k82L07k60J65p9N2K2n0rm3k80K85l3k8J80j81J90l71M62
6384A65j93K9j38K89Rj72J7R0j81J38Q2k07RJ76j3l78K40K41j63j29l5K40n0m4
6408B2O6K32j75k10K55j93k79K88J3j33J18j70JK24o9p3O8J13o4k89L77k38K52
6431A36mkl33J74J92k07J22l1k74K10n4J45n1j09K92m1j82j27L06jl76O1J14j04
6455a44L49j46j4K78k35M3j14J55k54R2r3j12J04j10J89j8j2k25L07j06p5K18
6477G7m1k39R2K70j79k76N0K8J66J85j38j60J33J26j7j1k01Q4o8K95j25k2j76
6500a47K5L88l42R9j77N7J27k30M00o7j68K16p9k58K42q0J89N1j81j98J17r8P9
6523c5M1l2k47L93k50K37pj38r9J75r1j90O5P4J22O3q5l9J00j3m8o7j30M26j66
$$ y = [62, 187, -62, -85, 69, 118, -164, 143, -117, 48, -31, 21, 43, -7, -16, -59, -339, -54, -87, -115, 65, -116, 74, -297, 165, -28, 1, -137, 152, 161, -11, 6, 96, -85, 53, 135, -72, -63, 113, 100, -278, -38, 203, 40, -89, -124, 116, 66, 22, 88, 320, 145, -65, 190, -3, -282, 6, 19, -114, 4, -166, -165, 59, -10, -83, -15, 98, 34, -255, 122, -116, 136, 132, 130, -203, -29, 163, -44, 78, 47, -227, -17, -71, 74, 23, -86, 206, 165, -17, -144, 162, 161, -215, -154, -40, -144, 205, 59, 45, 323, 88, 131, 17, 172, -82, 10, -83, -195, -91, -201, -12, -30, -42, -267, 40, -66, -141, 77, 36, -203, -111, 159, -20, -296, -246, -218, -52, 133, -5, -165, -32, 94, 77, 66, -135, -51, -119, 176, 51, 29, -147, -122, 266, -76, 23, -154, -97, 30, -200, 200, 133, -35, 181, 102, -156, 86, 6, 195, 246, 65, -133, -16, -114, -35, 6, -26, -273, 120, -130, 107, 100, -38, -137, 38, -53, -243, -178, -104, 18, 81, -4, -43, 57, 44, -4, -71, -201, 225, 59]
6548E9q3M7Q2K3k02M1j20j9J02O7j4M2j29M2r4L49j37l46M24j15k4j16J25k8k3
6573d7K2l6Q6j43Q5J74J3j96m9L5P9n0J75k08kJ09n4m7L1M5J44j5k04J35k41p
6599a66K75m6k20N0J74k17J64J5N0j69K24r7k8q8J25o6J53j85o7j3O4K56l13J23
6623bl49L43M7j00K46J06l31j83L8J41L46m21j34L29m3o0N9j03R2k05L17k29J22
6646B6J55j93J3N2j5J9L7k86K27r5J42p7q3J61j32rJ38M8j17k20K91K46k76n0
6670Bl5j21M03l01J18j00J6J08o7P6j26L0j51J85M9j46P2J81m69K70j9p8j5J95
6694G7j35J48j66N4j7j16R2L7P1o6km4J97k37L79l18j46pk6J66J8l5l1J11R3j03
6720fK13%l28J8K20k52J48mL8k67L10Kl6O6j75R7Om2J03k57K60Kq0M0N4K9j5k87
$$ y = [59, -24, 23, 105, 128, -74, -33, -153, -172, -70, -3, -17, 25, -104, -62, -156, 193, 56, -290, 134, 19, -5, -121, 4, -24, -47, -25, -61, 25, -118, -33, 141, 154, -42, -91, -56, 23, -27, 148, -60, -62, 47, -7, -54, -23, 22, 166, 151, -53, 82, -159, -166, 109, 63, -157, -107, 67, -150, 14, 29, 79, -90, 134, 37, 9, -79, 46, -20, 133, -52, -119, -132, -68, 188, -125, -2, -351, -8, 39, -61, 185, 291, -40, -223, -185, -44, 302, -119, -253, 76, 33, -27, 32, -71, 21, -184, 133, -96, 26, 181, -12, 1, 53, 38, 57, 94, -192, 35, -60, 82, 5, -78, 83, -49, -58, 80, 128, 11, -209, 82, 328, 52, 2, -33, -154, 249, -52, 66, -34, -18, 90, 23, 99, -27, 3, -148, 37, 86, -60, 12, 193, -276, -6, -25, -103, -118, 77, -58, 90, -76, -22, -39, -155, -63, -26, 45, -21, -23, -67, 130, -107, 272, -46, -192, -199, -225, -59, -41, -76, -107, 4, 97, -6, 207, 207, -121, -103, 117, -135, 13, 9, 47, -220, 90, 92, 56, 122, -53, 44, 50, 8, 111, -146, 114, 116, 36, 76, 130, 159, 144, -143]
6748a43K66l4j25o4J95j33J66k3K9J23k19lP9k41N0M5J54j21m3K4Q3m6o1N4J15
6773A27k11J38o7n1L1M5r3j14J71R6l06J58Q0K60l64p1n3J50L18n75L50O6n6k30
6797b01K99k13r7K03j19J58l4k9M7o0q5L9rL07r2j37J87j06Okm8j9J64q5j4L3
6823I3j76j88K48M8J90j65o4J35j7k65J99j91J54O9j53J55o2K93m12J09k70M30
6845A60l41J25J08k84J49QJ18j95K97k58M8K40j06N0M8j57P3o4K24m51J44n8L03
6868A81j62J19j66Q1m4L3J35l14K27J07m7k23K32j77kP6J60q1k82p3R0J55j88
6891a63L24r0j1j10l0Q6J19J2j45r4J29r3J28R7j62K31j03k56J64L9Pj71J05r4
6915h1M7R7j56K07j68L3K25j75O3j18M2j32M0J24q9J92r5k34K77o5k41K57m0j91
$$ y = [-143, 123, 89, -36, -100, 95, -38, 128, 105, 134, 257, 38, 35, 114, -127, -77, -32, 122, 1, -42, -18, 65, 19, -42, 12, 127, -84, 54, -13, -64, -33, 12, -81, -195, -24, 72, -234, -76, 4, 264, -100, -171, -224, -74, 244, -331, 19, 85, 29, -201, 98, -115, -212, -9, -128, 30, -4, -33, 14, -46, -131, -92, -101, 206, 114, -23, 164, 58, 64, 62, 14, -5, 159, 74, 60, 93, -83, -271, -23, 25, 215, 50, -14, 121, 104, -161, 38, -153, 1, 70, -83, 72, 10, 303, -109, 0, -270, 160, -181, -56, 52, -232, -83, -75, 43, -152, 145, -113, -65, 175, 69, 119, 167, 10, 83, 19, 243, -208, -64, -122, 181, 19, 138, -28, 53, 9, 42, 177, -137, 90, 197, 150, -73, 159, -18, -20, 56, 216, 135, -147, -220, -130, 25, -163, 161, 71, 60, -50, -80, 6, 125, 137, -8, -102, 27, -66, 62, 159, -3, 228, 125, -131, 33, 72, 79, -92, 13, -81, -34, 63, -93, 114, -54, -21, 204, 29, 92, -26, 16, -116, -76, 48, -41, 151, 56, -178, 99, 34, -207, 50, 10, -181]
6939a81J62J5k10J92j93J29J41qmR9j30J3m1J18j59J43K2j05J03j78M3J6J78j90
6963b5k44L91Q0l70K46j72O0K42k46J70l2k41K62N9m04K11l0J10k70J57L03k01
6985E6n4J09l83K05P3m1j66J97L85l33L6j93K78n3j94R3p8J1J37q2O1p6j03K35
7009A20j72k1j14J02J90k1J11j38N9j75J75q5J16k6j35Q5j0k23K26k00L2m4K54
7032A06q3l5P3j7j1K59Lm35j8L78j39k1k55J67J03j98K66n2j20J92k78R0j06J80
7056D9qk5j7K25l07M2J44J5j76M7J28m1p8N9j67J77k38j20K98L3k4Jm1o4j46K69
7082C5P9o3K4l07L10o2J76j72j91J3N9K50j13m9L1k4qL9k39J84N7j44J57L2J3
7107H7j95J34q3N9r3q8J01J78j52L6j38N6Q4l4m6l6j06J35K81j84O5J74n5j0k66
$$ y = [-181, -19, -4, -214, -22, -215, -86, 55, 47, 43, 142, 12, 25, -16, 102, -57, 86, 108, 3, 106, -72, -29, -13, 165, -25, -269, 122, 202, -168, 78, -94, -34, 208, -38, 132, 100, -141, 121, 180, -224, -13, -43, 67, -203, -46, 257, 56, 2, 111, -272, -67, 6, -35, -201, -4, 381, 48, 84, -109, 169, 116, -78, 15, -63, -52, 85, 3, 64, -12, -115, 120, -52, -73, -187, -85, 105, 84, 195, 57, 116, -59, 116, 31, 147, 121, -14, 71, 61, -162, 64, -136, -104, -148, 106, 23, -12, 61, 44, 33, 292, 295, -140, -158, 220, 81, 60, -195, -28, 75, -123, 143, 91, -29, 163, -115, -25, -131, 49, 41, 16, -1, 224, -83, -41, 103, 118, -58, -11, 117, 76, -2, 57, -110, 67, -171, -291, 7, 40, 16, 17, -24, -88, -234, 35, 114, 51, 75, -232, 78, 16, 192, 20, -171, -158, -99, 151, 38, -11, 20, -4, -12, 27, -212, -28, 29, -115, 42, 74, 87, -108, 26, -57, 2, -91, -179, -78, 100, -52, -16, -154, -98, -14, -48, -94, -130, -236, -101, 180, -4, 61, 235, 180, 170, -96]
7132i6J70Q5j2j7k23k4J60q5J67k07K02j50j6Oj35K79o8r5J49k65J89j21K5p1
7156a53j0L8J84j11j43K91rM5l12J39J76j81n1N1J2J8J2n1k8Q6J29N1k43k8j44
7181b32K44J55l63K22J32l70J92Mj6K7k27M15k50N0jR5rn5M2R7n28K08L80k44
7205c2J71j82j93K48L9k15L60j98Jk11P8J78O1o0m4J28j08jl6K9j68J24j3K41
7229A97j46q7K08N1l47K30L7n3J18l48R4J8m4j02J56P5j72K61R2k48K1j34j72
7252b95N14j52%j10J91j22Q5K5K0j11j06M3M2P8r4N5M1j03K55j44k47K36j67j05
7276a71L30j10q2K02O7k36J04J3j2j52L9j14P9L6j42L43q5p3m9P6j52j42J56j91
7300b66K51J23l1j1n3j63L18k30r9m7K3pL9K54m0k10J21P9R8j59N3j61J85j37
$$ y = [-96, 74, 159, 147, 130, -93, -117, 43, -42, 125, -82, 120, -30, -46, -40, -175, 104, 36, -59, 90, -175, 14, -107, -82, -153, -163, -125, 59, -52, -195, 96, 87, 132, -180, -41, 135, -46, -97, -46, -34, -16, -4, -55, -83, 3, 132, 183, -60, -88, -232, 12, 167, -196, 26, 158, -212, -20, -16, -32, -5, -232, 183, -67, -17, -18, 77, 68, 13, 55, 152, -376, -168, 212, -32, 139, -43, -236, 12, 51, -164, 196, -2, -1, -212, -134, 44, 105, 45, 1, 129, 21, 20, -16, 13, -155, -31, -44, 197, 51, -36, 172, 223, -124, 106, 143, 90, 208, -140, -46, -28, -72, -174, -18, 57, -115, 146, 238, -10, 11, -123, -295, 219, 67, 67, -43, 148, 26, 111, 136, 156, 45, -61, -18, 24, 102, 8, 63, 104, 1, 256, 112, -135, 101, -66, -171, 159, 49, -33, 169, 236, 0, 104, 117, 105, -47, -8, -122, -43, -7, -149, 194, 109, 36, -13, 63, -89, -231, -75, -266, -15, 108, 77, 66, 13, -150, 168, -62, -161, -208, -185, -192, -153, 101, 61, -149, -28, 51, 149, -10, 43, -118, 67, -70]
7324g0N6j66J68N0k8J39j12j39J15j9K4J1o9Q1o9K7L1K2J00r4J32k43J52q9q1
7349g1m5K98j97J73k36M4k7K11j5o0p1N2j13N0j18M3J05j8k2o4K34l8n6o3q5j6
7375a05L19k45J2l1K0M2J1J51k49K7K9j03J51j28l1r3M14Mj65J84j42o0j18n9
7399a65L52k51J12kOM7j31j55K59n9j80K84p4n7r3K46k85M31k10Lj33o3K71l35
7423a82M2J88K10l51J52j24J95j19l6j07R6J57k12J21j25J58r5O8J5N7J06j36
7445G8j74K53k25Q8m7N3J58J58k73Lj2j96j43M34k10J5J17o2K09j86m14N71r5
7468A00l30L35j3j18O8l1o8J05O2j19j42J72K37m25J71J21j26M2p2RK55l24K03
7491A12l33K06O3k7J04j37K0P3k2j17R8m8J0l1o6J72j21q7L6K36j54K04K2q6j23
$$ y = [-70, -14, -180, -12, 38, 10, 149, 37, -102, 13, -6, 18, 29, -40, 41, -28, -1, 30, 52, 152, 58, 190, -53, 99, 10, -71, -116, 182, -15, 158, -78, -34, -61, 150, 135, 75, 4, 56, -57, -7, -125, -82, 23, 5, -17, -81, 153, 115, 59, -4, -89, -105, 214, -31, -19, -50, -30, 12, 23, 174, -75, -48, -19, -122, 29, -99, -130, -223, 191, 195, 30, 214, 72, 12, -106, -165, 187, -64, 48, 46, 52, 99, -32, -187, 72, 13, -167, 117, 43, -14, -107, 139, -146, 285, 75, 78, -55, -118, 153, -182, -140, 48, 258, -93, 59, -65, 130, 11, -25, -132, -36, 121, -91, 30, -95, 63, -32, 36, 51, 108, 214, 78, -96, 157, -68, 20, -27, 26, 184, 342, 69, 72, 60, -136, -279, 155, -55, -40, 77, 15, 224, 38, -376, 195, 100, -230, 105, 92, -26, 42, 11, -57, 48, 110, -9, -151, 21, 258, -167, 4, 125, -1, 41, -31, -22, 233, -91, 112, -221, -15, 48, 21, 125, -12, 8, 81, 59, -58, 40, -8, 2, -29, -95, 77, -44, -131, -95, 141, -13, 191, 213, 127, 4]
7516DJ56n4j21j13K11o8k58M34k32L10l29K5k8J5J16j01J33j82Q0k71J63M6J87
7539A23l85L29j43l6L01k80J55k81K13Q8k27L0j43J12J59k19K81k8j27p0K50j73
7561g1J65k38K44j3j05J77j11nmj71j03M68j23k3L0J3j15O6k32K62m2n3j22J61
7585E5Lq1k4J45j3n5o5P7J66p2j62J78k22J16j88K85j44J14J6l20Q4J21k6m5j16
7610a73K54kj61R0m6L9Q7j09j53L30o8m0j94J07j26L98l86J95k32L95L8j33k6
7633H4K5M3j24J63o4k8J2N%p0L5p7oR2ln2N9j33M6KK41r8j49k04N8K29k38k6J60
7662a8p6K06k14L1K47j97R2j59O8NM4J7r5j88K44J0j7J21L7m6j22J43j82J27M2
7687A20n3k91K06K95k16L3k22Q0k4J28J34k52J18K57l52K32n1mk78J49q6N8P6
$$ y = [4, 160, 106, -15, -128, 83, 15, -243, 191, -41, 269, -60, -35, -63, -48, 68, -33, 100, -82, -2, -273, -110, -64, 123, -262, 67, -76, -112, 189, -91, 64, -217, -4, 84, -143, -113, -256, -144, 15, -204, 77, 49, -78, -148, 102, -71, 94, -144, 100, 87, -18, 159, 48, 43, 39, -132, -235, 233, 110, 87, 117, 130, 15, 81, -151, 111, 69, 16, -106, 55, 58, -23, -47, 98, 85, 30, -35, 42, 208, 136, -26, 152, -70, 46, -142, 143, -1, 113, 129, -191, -107, 14, -12, -57, -173, 81, 79, -82, 8, -38, 1, 88, -21, -174, 156, 88, 48, -146, -39, -165, 233, -153, 42, -190, 205, 243, 110, 84, 109, 152, 28, 191, 127, 99, 111, 116, 116, 46, 81, 4, -2, 90, 87, 35, 94, -39, 7, 9, 250, 152, 3, -201, -143, 86, -152, -178, -18, -94, 112, -102, -71, 176, -21, 71, -88, -20, -15, 29, 46, -49, -237, 7, 17, 0, 121, 158, 112, -10, 133, -49, 78, 120, 67, -224, -18, 277, 61, 94, -128, -48, -72, 56, 190, -62, 56, 313, -39, 193, 142, 138, -140, 9, -77, -19, 57]
7710E7n5R1k16L04j43m1P4k00L7q0K84j13l3L03l41N7k8q8K42r4k5j05O6j28j7
7735a92L63M7k42jO7j35N2L1K80q4k64J71j46m1L2q9j42N38j11j62K63m69L36
7758A02k6k6j22J38M6j67k7O9J51q4k61K18k2J68j71QJ28j99J29l7L2q6j17N3
7782a03q8L71k62P1r4Q6j15K0k7J34j12J80K7j61K1J34q3J41j63J45K2l50K85
7805G9K6k6r8q3M7K31k26L7J0J59k37K35J7lJ6l78J77o9J1J19R2j89K02J7QJ39
7831C13k82j52J24k7m4L6J18Rj57K8J91m64N13m8j02J21j31o3J13k56J00%K15
7854A55j11j32J02k35J99K7P2j02k20J58O3j42J7J23m2j39J38M42k66L9N2k86
7876h8J58J48j30m8k81O2N8k3J66n8Q2K17m45O2J02l2J47k27J25p7J59p1l1R4
$$ y = [57, 2, 93, -123, 181, 38, -3, 71, -129, -92, -172, 112, -1, -34, 269, -72, -15, -43, -131, 111, 17, -8, -113, -47, -175, -192, 171, 218, -24, -25, 42, -93, -41, -10, 270, 186, -78, 93, -53, -94, -62, -151, -293, 245, 134, -28, 235, -234, 102, 76, 50, -72, 66, 112, -55, -82, -13, 138, 54, -207, 11, -11, 157, -14, -6, 122, -77, 52, 15, 47, -39, -156, -103, -191, 180, -82, -11, -105, -19, -134, -114, -141, -7, -119, 61, 88, -73, -52, 82, -1, 140, -23, 122, 144, -206, 79, 105, 79, -19, -102, -55, 176, -50, -13, -3, 156, -81, 154, 171, 168, 184, -194, -17, -86, -75, 44, 136, -53, 149, 166, 174, 313, 31, -121, 3, -24, -68, -32, 86, 95, -62, -34, 157, -307, 206, 158, 56, 177, 46, -17, 96, -160, -60, -60, 155, 44, -88, 14, -221, -22, 5, 77, -25, -245, -87, -24, -166, -149, -26, -68, -207, -69, 373, 107, 146, 198, -88, 70, 218, 88, 40, -241, -179, -121, -144, 22, -36, 46, 263, -182, -120, -18, -50, 97, -130, -5, -82, 77, 6, -25, 69]
7900F9j73J3J93K2q5l6K3K1R3k78K36O7k90j2J2P8M8J33j15J38j3j72j23J35J12
7925I6j37q5O2j7J07oj90K34K8kj76l0K40Q4j37j01o1j06K9J57j39J14K25j77
7949A2M5j09RN2l1k61L16j40N9j6p9L8J3M8M9k9K10j02j76j08K49j37j95L00O
7974B3K49j56J05r9k49L1R4J48k53L7Q0o1K1K4j53J87k77K73j6j16J10J4J43j02
7998E7p4j23o6M48j99l6J49j15n9K48k91M1J62o1M2N4j77J25l82L34k40J68N3
8021E8k99K59N1q4J14j2lj46jM2p2K08j92J82J52l07k15K24j12J15N2j09j6J14
8045CJ22j37J08q5J12j70ML3n3R6Q0j38K52l22%j26L71j0j54O6R2j32l05M03o7
8070D3N3Q8j53K53l24L6J66l20K44k10J26m7J35p6Q7k34L63r7j29l00J59J62j17
$$ y = [69, -104, -91, 102, 124, 39, 3, 26, 47, 140, -138, 98, 165, -125, -137, -125, -47, 1, 134, 19, 157, 144, -28, -151, -16, 96, -41, -126, -64, -81, 26, 20, -170, 64, 92, 90, -86, -116, 124, 208, 71, -30, -91, -197, -168, -11, -150, -36, 189, 12, 57, -52, -43, 9, -22, -283, 33, -107, -48, -64, -143, -105, -92, -44, 5, -24, 186, 84, -92, -200, 49, -88, -283, 17, 23, 272, 116, 221, 122, -127, -96, -2, 146, -107, -70, 10, -51, -30, -6, -159, 28, -249, 24, 8, -108, 2, 16, 159, 57, -17, -140, -206, 242, 43, 7, 156, 41, -18, 230, -61, -20, 142, 81, 123, 177, 0, 125, -257, 77, -163, 5, 58, -241, 18, 69, -15, 99, 87, 84, -62, -63, -21, -93, 115, -77, 105, 257, -50, -265, -41, -153, -38, 14, -95, -111, 3, 125, -12, 96, 11, 123, -47, -43, -10, -63, 33, 113, -25, 227, -95, -95, -221, 150, 140, -14, 52, 144, 12, -293, 110, 43, 96, 184, 31, 284, -40, -4, 162, -158, 86, -124, 2, -45, 90, 14, 101, -133, 230, 133, 4, -296, -137, 25, -92]
8093i2J20r5r2p9K12qK67k13J4J81j07r8rr1J95k46K32J37k74J66o1j23J51k84
8117a97K82p8r7J59j91K06r9n3l9J80K9K0k22J42k15K04L7OK2j96K6K74j43k5
8141C2N9J89k40j11K24j03K36k18j18k1J36j5r4J35j13j1r1N11m57L6K0j71K95
8164A10N4j97J80k11J65j32K87j26p4M2k0m4rKO1l14j96L47L2r3k9Q1j40J64R0
8189C0N4J87
$$ y = [-92, 28, -67, -159, -238, -26, -34, 233, 20, 34, 215, 108, 10, 1, -90, 105, -141, 91, 228, -46, 120, 59, -64, 87, -197, 85, 7, -90, 69, -122, 84, -15, -68, -107, 73, 102, 122, -100, 42, -173, 31, 68, 74, 96, -100, -74, 200, 57, 32, 91, 280, 40, -71, 153, 50, 286, 68, -50, -71, 65, 50, -44, 91, -22, -33, -124, 387, -70, -34, -14, -185, 110, 164, -33, 147, -64, 101, -31, 256, 130, 56, 98, 78, 34, 25, 27, 88, -226, -422, -75, -43, -136, -165, -84, -224, -60, 30, 84, 271]
8191B71
$$ Imaginary data points
##PAGE= N=2
##DATA TABLE= (X++(I..I)), XYDATA
0@%%%%%%%%%%%%%%%%Qj6J6j6J6j6K4l2L2m0M8n5O3p2Q1q9J04j20J36j52J69j91
38a02K15k39K66k95L27l64M03m45M92n42N98o59P24p98Q80r71J073j189J320j466
58g72J638j842K084k377K743l216L855m769O194q745J4739n8895k7694Q3640J4291
73B0874k3869j8210L0146K2833n074k1740J0152J9710n184k5004O051K2476l662
86B9499k8067n596J7961P852k4743k0791J3737K1040j4270k3965Q967K3671o168
99h73k1034Q08J9812N206j5924o337K0895J6081j5825j7265J4642J9486j0424
112I248k0168N195K0045R32j9603o240J8515R470j7883j1518J5983J2743j4154
125B565j6453P088J5222m340j7378o43J8984N146j8646p746J7923J0819j2893
$$ y = [0, 0, 0, 0, 0, 0, 0, 0, 0, 0, 0, 0, 0, 0, 0, 0, 0, 8, -8, 8, -8, 8, -8, 16, -16, 16, -24, 24, -31, 32, -40, 41, -48, 56, -64, 72, -80, 89, -102, 113, -126, 140, -155, 172, -192, 211, -234, 258, -284, 314, -345, 379, -419, 461, -510, 563, -626, 694, -772, 866, -976, 1108, -1269, 1474, -1742, 2113, -2656, 3538, -5207, 9532, -49363, -77057, 6583, 20874, -2995, -21205, 8941, 31774, 26700, 4960, 15112, 34822, 29638, 4634, 10685, 33161, 29499, 1432, -4164, 13797, 21649, -3094, -23885, -10148, 10892, -3378, -27343, -18376, 5295, -873, -21907, -21099, -1287, 3919, -12005, -18342, 2553, 18634, 2809, -14456, 186, 19672, 9248, -10920, -5725, 14320, 15252, -4351, -10591, 7924, 17394, -489, -12007, 3976, 16719, 2565, -13888, -6800, 8422, 4082, -13296, -13939, 5045, 10191, -8455, -16201, 1722, 12541, -352]
138c52j0811J0821J4136o134j5450K734J6354r23j7457k457J6086M190j5146p918
152a2327J2250J1538q368j3756N321J4918m327j7062Q09J6208K871j3653l995
165i573J3137P887j0879j0724R258J3327o414j3728M247J3471k070j4521k008
178h590J2123M605j1329p019J0340R536q475j0684P572J1852m838j2167R90J1393
192E309J565j2040m336J1131P363r682q243Q067Q661n838r805M104J0778q89j0927
207d782j779J0477L443j1122n177J0160P484p328q365N395R092l181j0239J089
221d833J0885M79j0446k998R310L681q219n233P161P664n179q473L319R198j813
236D503r793k37R371J952r069l919P142N786o124o397N336Q075l578q558J826
$$ y = [-352, -11163, -342, 13794, 7660, -7790, -5056, 11298, 10375, -7082, -9539, 6547, 10737, -4409, -12327, -77, 11461, 3093, -10663, -5342, 9576, 5249, -11813, -11004, 5204, 8075, -5578, -9573, 3564, 11451, 572, -10152, -894, 12433, 6019, -7709, -3462, 10009, 7939, -6582, -8590, 3533, 8138, -3191, -10210, 130, 9666, 1191, -9493, -1921, 9931, 5093, -7074, -6084, 5309, 6874, -5166, -9502, 1629, 8992, -690, -8933, -866, 7795, 1957, -7848, -3744, 7034, 6145, -4782, -6561, 3916, 7359, -3763, -8940, 1220, 8704, 1376, -6989, -1594, 7498, 4317, -5922, -4833, 6052, 6531, -3915, -6913, 2397, 6078, -2141, -7374, -213, 7451, 2272, -6201, -2882, 6316, 4503, -5290, -5527, 3844, 5796, -3273, -7192, -50, 5736, -388, -6785, -1449, 6626, 3048, -5510, -3684]
251c684Q630M5p954j297Q079K889o994n666O387N675m745o477L825P543k367q266
267d377M17P442N89p570k350O729L836n936n452M817O135k990o477K541O757l55
283C756p025n38O661K376n924l161N487L593m310n288L056N994k019n914O10O045
299C399J98o745j747N877K913m879l707M040M688l533n249K466N869q61n501m9
315b821N865R99n380k553M939L178m079l845L398M439k626n153J309N386n31n284
331b759n74N146J711m803k632M308L818l484m302K203M200j363m754P53M824J142
347C434m965j456M166K209m249l048L593L631k490l845J591M320p97m394j35M166
363A731J184m100j816L832K715l256k985K499L304j518m228N23L908m76l572l38
$$ y = [-3684, 4946, 4991, -2963, -4260, 3819, 6708, -286, -5952, 435, 6110, 1365, -5112, -1287, 6256, 3889, -4377, -3960, 3482, 4071, -3499, -5849, 880, 4716, -1220, -6672, -1855, 4280, 1290, -5187, -2646, 4111, 3756, -3269, -3807, 2854, 5230, -694, -3855, 1632, 5225, 915, -4373, -1317, 4677, 2658, -3256, -2646, 3399, 3597, -3148, -4895, 982, 3895, -984, -4691, -651, 4037, 504, -4745, -2279, 3590, 2729, -2772, -2821, 3044, 4043, -1337, -3890, 1049, 4227, 148, -3697, -299, 4140, 1514, -3639, -2330, 3056, 2525, -2759, -3333, 1813, 3524, -1279, -3911, 397, 4215, 731, -3571, -1368, 2832, 1469, -3285, -2532, 2292, 3434, -1531, -2987, 1179, 3388, -861, -3909, -316, 3315, 825, -3020, -1429, 2891, 2094, -2300, -2435, 1731, 2915, -1185, -3001, 831, 3546, 290, -2695, -196, 3108, 1590, -2638, -2115, 1793, 1317, -2255, -2593]
379b593M015J268l399j819K297K893k496l017J912L338j013l749J06L429R75l463
395a316j117L100K044k594k700K075L409j556l231J299L227p59l618n07L075R11
411A742k958j502K954K420k566k432J862K498j710k704N43L026L50l038p30L518
427A273J548k643j738K354K042j853k734J062K468m39k755m90K710Q23l232j241
443b845K857J570j932j698J767K651j035k818J46K758J97l028n70K647O83k129
459g79r95J736J836r80k027P40K482r95k692M37K540M37k122q43J635J371j263
476E18k078R79K015o82k117N74J772m65j817l30J568J096j710j563J586K402r86
493G62j906J409J809l94j787k58J166K33j774r32J747J153j675j548J872J507
$$ y = [-2593, 1422, 2690, -709, -2528, -231, 2662, 166, -2851, -939, 2399, 1386, -2363, -2257, 1172, 2147, -1316, -2433, 667, 2711, 117, -2583, -508, 2901, 1345, -1886, -587, 2640, 1881, -1737, -2244, 831, 1742, -1216, -2718, 236, 2656, 90, -2342, -480, 2018, 308, -2396, -1853, 1173, 1523, -1515, -2245, 1273, 2821, 178, -1560, 794, 2836, 983, -1751, -689, 1779, 1340, -1415, -1905, 805, 1628, -1604, -2845, 12, 1582, -350, -2048, -281, 2370, 1335, -1483, -1337, 1421, 1618, -1410, -1980, 667, 1350, -779, -1774, -38, 1798, 818, -1209, -469, 2013, 1018, -1674, -1237, 1303, 1740, -382, -1225, 410, 1781, 518, -1560, -581, 1434, 752, -1365, -791, 981, 516, -1301, -1631, -63, 1033, -677, -2240, -654, 1748, 762, -1144, 265, 2074, 1680, -107, -365, 801, 1034, -740, -1672, 75, 1228, -447, -1995, -123, 1384]
509A384j241j657M96J772O07j956q07J708R22j725o27J346Q44j316o10P55R15
526H10L12j712r7J701M57k080p20J352N78p81o81M41J184K79j442MJ524P1j617
545d17j76J484k90j067q87N41J209k83j436M70J880k52j506J81J221l61k12j83
563h4J90M93k38j284P28R10j46j512P68R89k72p64j32J15J043l3j632L89J002
582E30o41p33P38M73l75J00k23K53Q39j032j090Q60J130q45o52L70K24J07k89
601b56j4J65R81m75p83J160L54j177l34Q80m49J52m03n68K40R43q81n91J062L86
621C92k87k01L94l59N9k36j72M36K54n05k17R36r6n68o8L12J93O03o13m96L66
642A27N04q55o7M93k8k74j83L38p0K96n83K64L74J91r19k11P68j57l43j37j45
$$ y = [1384, 143, -1514, -1018, 754, 1361, -595, -1402, 306, 1228, -497, -1124, 222, 1066, -250, -860, -105, 810, 1122, -590, -687, 1014, 1471, -609, -1329, 23, 601, -180, -861, -420, 764, 1043, -399, -395, 1129, 1200, -417, -593, 891, 601, -466, -1353, -812, 397, 114, -1322, -852, 1028, 776, -730, -549, 672, 311, 99, -84, 106, 599, 361, -923, -195, 715, 569, -943, -175, 814, 542, -222, -354, -239, 804, 771, -861, -472, 530, -111, -844, -106, 367, -8, 92, -131, 122, 961, -71, -1161, -301, 829, -16, -668, -298, -74, 33, -256, -270, -105, 876, 401, -382, 778, 1132, -45, -379, 501, 52, 204, -199, -767, -527, 416, -465, -1056, 6, 392, 105, -96, 298, -61, -2, -238, -410, 26, 280, -225, -442, 494, 398, -170, -238, 74, 267, 870, 257, -239, 127, 631, -224, -291, 202, 174, -100, -283, 55, -15, 281, -302, -38, 336, 527, -392, -603, 165, 8, -335, -472, -617]
663f17M05M95k84l05O07L14l5l89M14j01j95k34m85O32J54p92j27P77k5n63n5
684d09J55J96K7k8j00K42J72m77K25K49j34l72L09K72J15j32l58L8N74k07l55
705Bk09L52O5k21k24L0K41r2n3k48N84o4m22o5L81K83n38k2j37M91L1n43j49O14
729H7N9p97O64O22k45k61O1p8J66j05l20O8M83k00p56L57K28J04l65J56NJJ98
752A32l62j2M22j39k70j49M62J95k55j17J64J06P1l18K24K71k40l33J80r0J12
773E4k41k18N61m34K95k59L32L14l00l13M05RJ66l43OJ95q9j81k4J5J79m4j88
796a03J91m4k3o1oK78j75m9l74L35L39l40M1j93K99K05l79o2L83N6k85p1L8M87
820D87l58j13L0Q6K0m21Q0n3M51m15Q9k54M46o5p6J16o8M19l08l59K39K40j81
$$ y = [-617, -212, 283, -1, -306, 301, 615, 580, 191, 605, 504, 309, 75, -410, 222, 376, -416, -543, 234, 209, -354, -409, -254, -58, -31, -59, -159, 83, 255, -222, 3, 252, 118, -254, 55, 327, 442, 310, -48, -10, 564, 357, 2, -207, 145, 210, -11, -235, -205, 36, -56, -109, -357, 227, 163, -259, -324, 57, 340, -198, -220, -357, 134, 165, -378, -527, 87, 146, -651, 13, 635, 390, 129, 190, 112, 278, 173, -147, -79, 404, 204, -552, -195, 33, 137, -228, -72, -67, -66, 132, -230, -242, 180, 41, -229, -378, 84, 279, 24, -93, 71, 177, 248, -70, 154, 425, 185, -148, 32, -58, 54, -187, -405, 156, -278, 17, -242, 90, 404, 104, -209, 196, 205, 371, 28, 34, 229, 140, -41, -65, -50, 129, 85, -103, 88, 44, 21, -40, -46, 232, 57, 8, -366, -31, 308, -32, 9, -184, 115, 320, -59, -121, 262, 318, 33, -38, 0, 487, 129, 16, 46, 132, 152, -269, -189, -242, 209, -206, -117, -371, 75, 10, -66, 50, -18, 401, 93, -266, -27, 213, 32]
843C2j02J42M6n2k09J27J93J29n16j07O15j69l44J47k37L38j75l26L36L21J5j36
865F8m04M53j5j83k4J76K22j57k79J72K31j60j56l12O13J27l08l53K16L33j98
886F2l6k4pm3j65k8K9L10l48N2L3J45j14l96K52M25o1m95K79L56jj95r1K70K14
911D23l00j71J25K44j56j85OK03j45l51J48r1L6M18n79J98K15J25m86J55K44J48
933B24l4l70J33J81l0m51M76O0l3l85j1L94N9j25lJ26J38j68k34L31p0l58nQ6
957f9M10l14k90K3M48L27m94k57R8M46n20k60M41K60o8j75l03K37K54k47m2K35
979A40P2o5k43MK82k75R4j13J8M46n31k44P74qn83j29L36K18l5n6m47M59J41l80
1003a25j12Q9L98l27j30L67J08r1l47k49N39J76o79N1M60L17m65K0J14%K28j91
$$ y = [32, -70, 72, 118, 66, -143, -16, 177, 306, -210, -317, 298, 129, -215, -68, -305, 33, -142, -468, -132, 189, 204, 68, -336, 117, 102, -81, -105, 71, 293, 136, -143, 29, 260, 100, -56, -368, 245, 372, 64, -289, -73, 260, 62, 26, 2, -5, -48, -213, -241, -212, 98, -250, -198, -165, -20, -134, -530, -278, 147, 86, -409, -130, 226, 225, 30, -61, 209, 423, 123, -48, 77, 321, 165, -20, -14, 189, 44, -307, -159, -250, -214, 204, -375, -177, 38, 163, -323, -168, 76, 224, 190, -180, -47, 134, 104, -347, 129, 189, 156, -229, -240, 154, 213, 88, 85, 211, 349, 181, -53, 278, 208, -150, -155, -69, 341, 27, -263, -240, 208, 535, 41, -216, -118, 328, -192, -452, -11, 249, 181, 6, -297, -60, 194, -53, -95, 140, 212, 147, -96, -92, 190, -85, 9, -104, -86, 360, -171, -415, 359, 351, -232, -361, -25, 193, 158, 102, -345, 114, 255, -125, -237, -148, 250, -77, -207, 160, 268, 177, -170, -419, 120, 296, -383, -332, 128, 445, -20, 0, 114, 114, 342, 151]
1025A51k33L69q7m00Q4N98l14m54k31L27L35l50k25N1N91j24m84K93J30N5m37
1046c55L84P4k7M8l72K82L01m23k45M84L8k5l52J80j47L53j99l02J72L58l28k39
1068c40N06j32k66r4K76J21P0k85k61L09L63p6n53L69q7P9N2J12j10L17j75k31
1090c6L07J41m36o5J37J33k22j56JR4L64m94j08K07o5j16J64M4N4n7J84l9L47
1113C83r4l35j88N96M5m97j4j15M90k65K01n04J39M58n41J42N26l08l34J35K56
1134A76j45R1k57k0K31l5m09K04M73l43m1J94j73J2J13J87m27L03Qk32J85kj13
1157b0k6J28k5J44j73k75m7L64L14n20k31O05l32J95N5l32r0L46j00P5k89J14
1179a20k60L48J69q8l2j32M9K49k9j56j32J76kP4k57J42q2K77j51k9P0j81o2J85
$$ y = [151, -82, 287, 200, -200, -116, 482, 168, -286, -517, -190, 145, -205, -430, -379, 212, 88, -396, -103, 27, 82, -355, 29, 103, 76, 124, -248, 34, 335, -88, -333, 151, 189, 164, -188, -8, -155, 198, -1, -303, -131, 227, -101, -340, 166, 34, -232, -326, -50, 71, 141, -144, -405, -96, 267, 191, -362, 7, -80, -1, 51, 163, 53, 370, 195, -36, 271, 412, -24, -89, 48, 181, -41, -197, -196, -102, 262, -232, -340, -133, -198, -314, -150, -106, -52, -109, 75, 36, 383, 289, -46, -234, 362, 407, -90, -104, -219, 271, 6, 207, -297, -158, 300, -241, -99, 427, 119, -215, -80, 176, 31, 122, -135, -155, 76, 41, -368, -164, 309, -34, -75, 119, -54, -42, 71, 258, -169, 134, 142, -90, 95, 93, -20, -46, 82, 57, 201, 28, -247, -294, 70, 384, -136, -367, 238, -94, 101, 156, -176, -266, 80, -20, 55, -234, -120, -380, -32, 137, 49, 17, -115, -66, 183, 154, -2, -134, 42, 40, 114, -143, -1, -83, 194, 43, 14, 84, -97, -159, 26]
1203B6J10j46m5j0j9J59k12k9OK45j8j84K49j93p9J49K16k65L00k63j87J83L11
1226C04l23J5k33K27pL6n2K6O1j58L0PK25l98J53J58qj29J38l4Q0j83l7j68M19
1251A49L9n2j6j5lo3j48J69j1j08P0l8J58j0j39J13k0J02j90l6k16L54J2q5O7
1276H3k68Q7J86j26l3J14L6j71R2lJ14j95j38K95J89k14j78J72J25k27l0n3K29
1299H6J0m69J92K87Q0l1j89N0q8n1O7k09K35J02k95J45J74j04O2j62Q1J10J04
1322A87j20q1o6K60l94K66J47o1k32J71N2n8o2l4p7J97O3j95l21M68j26j55K5
1345a46J15K20j92J81k42M6p1j10K54Qo5P2l0j8J02k31LJ27O8J68k47j99K64Q4
1369A61k00j37K10K98j05l62J55k5O9k36Q1L8K17j49n8m3J03J70r2j20q9K89k73
$$ y = [26, 136, -10, -55, -65, -84, 75, -137, -166, -160, 85, 67, -117, 132, -61, -140, 9, 225, -40, 260, -3, -190, -7, 304, -19, -4, -237, -10, -17, 19, -33, -7, 54, -104, -74, -67, 158, -240, -87, 71, 63, -66, 72, 38, 118, -65, -102, -270, 149, 188, 136, 120, 105, 102, 39, -109, 60, 49, -59, 11, -27, 131, 121, -18, 95, 75, 177, -13, -49, -265, 89, 101, 16, 83, -185, -98, 88, -38, -71, 43, 79, -92, 0, -3, 111, -84, -222, 73, 262, 48, -130, 42, 167, -60, -90, -143, 86, 96, -373, -181, 106, 186, 155, -34, 16, -72, -123, -56, -265, -30, 72, -223, -78, 96, -8, 54, -108, -27, 83, 187, 67, -14, -80, 180, -214, 52, 199, 138, -94, 77, 129, 71, 9, -25, -102, 95, 158, -37, -358, 110, -16, -171, -146, -31, 189, -3, 178, -64, -18, -89, -199, 55, 63, -2, 70, 40, 22, 124, -107, -104, 23, 91, 259, 12, -187, 77, 161, -39, -176, 34, 332, 227, -135, 20, -5, 64, -172, -91, -53, 164, 15, -43, -86, 17, 187, 95, -25, -114, 175, -98]
1392i8K6J66J4k26N5j27J45K58k88J06J2K1m1q9O6J08k45j23J01J18j36K4K01
1415D8J65r8l6j06o2J81Lk66k8L64r5J1K8P4j51j01k3J69j00q3P7j04L04j71l9
1440c9N9Q1k1k89J81k07J99j19j1K04l43L86j78J41K3j15m9J47Q0p3k16J45K46
1463B32n7k23m0K84j75J11k51J56Q3p6j64qJ12J15r1j45Q3O3Q2k59K92nOR7l07
1488h5J20M4j08k43M35N2k50k42rM22L3k19K0K73o3l98L78j47m1K26m43K08J37
1511A00p2k39J78N2L0r5n9J11o4j59K20o9K17j39k69K36J18l38K28j3L05l78J14
1534A5L1j53J84K2j51k5J36j76L4Q8J93k71L2j9L34j39J20o04J98L21k77j28K82
1557D7J62k16l9j19J10K83j35J62l05R3k72K91j4J8k15Q0q2L14j98l8j74M50l14
$$ y = [-98, -72, 94, 108, -118, -63, -190, -45, 213, -75, 31, 43, 64, 23, -66, 0, 108, -137, -260, -159, -41, -177, -153, 48, 213, 115, 79, -27, -89, 92, 95, -171, -199, 165, 70, 81, 109, 183, 32, -69, -92, 77, -23, -106, -29, -133, 171, 0, -39, 20, 101, 80, -209, -28, -235, -36, -155, -166, 38, -305, 81, -97, 44, 67, -48, -97, 50, 130, 57, -159, -14, 232, 175, -48, -88, 196, 21, 132, -119, 37, 120, 44, -120, -128, -16, 99, 8, -137, -54, 9, 91, -168, 124, 119, 125, 222, -85, 35, 79, -29, -272, 163, 215, -35, -277, -286, 136, 169, -50, -30, 243, 180, -218, 160, 13, -28, 198, -245, -37, 100, 28, -211, -33, 19, 49, -46, -105, 6, -58, -217, 3, -66, 151, 12, -257, -21, 97, -241, -13, -26, 279, -99, 15, 46, -107, 77, 99, -52, -77, 59, -117, -83, 5, 198, -73, -41, -60, 274, 135, 255, -349, -151, 170, -107, -235, 47, 209, -7, -46, -165, -55, 228, 93, 255, -50, 43, -229, 62, 48, 66, -149, -69, -151, 163, -35, -73, -247, 203, -111]
1580a11o5R2K32q8L1k90K17q6K54k29M4J81k10j29J69O8r4l0k5J32J63j5m13K50
1604D8j8J30j69k5j5l5J32N1j75K54k71j24K17J33l6k76K82j52Q3q8j30K22J39
1627A77l01K54L6j12j47k6J36M1k90J99j95K71J49j66l70J81L61n5N1k53NN0r2
1650i6J50lk67N6p2L80m7j90R4N4o2k14p2J13J96qLo3J51j60j6pJ72j40K32j95
1676a1MJ65k23p4K42m1j60J02K76l09q8P4o0J24l36K89j32L72o5j65n7O1o0l0
1700a02M1O6O0N8n8j43K5O8j35k96N04J4j41j05j53L86m5l02J74L27k12l31L12
1723A2J78j60j67N8N9L21m21j30J80L08k84k37K74J48L6m57P8M17j21j36q7m6
1745a77J98J11r8l3J31q1J77l31J21N6j63l12O77m9j98k41J28M02n10J81M0q7
$$ y = [-111, -176, -84, 148, 60, 91, -199, 18, -68, 186, -43, 1, 182, -28, -157, 12, 80, -14, -44, -69, 63, 226, 211, -202, 48, 30, 160, -9, -34, -49, -84, 48, 99, -76, 178, -93, -217, 0, 133, 97, -179, 103, -49, 34, -54, -184, 38, 177, -124, 130, 166, 54, -93, -119, 17, 58, -232, -33, -228, 43, 192, 26, -344, -163, 198, 143, 194, -59, -54, -4, -96, 54, 51, -216, -160, -232, 148, 101, -89, 5, 59, -3, -217, -289, -176, 20, 12, 15, -48, 103, -57, -73, -80, 92, -48, 184, -11, -7, 158, -65, -139, 103, 62, -98, 4, 280, -29, -117, -43, -103, 21, -315, -26, -158, 214, 149, -16, -73, -12, -72, -102, -61, 5, 65, 123, 65, -78, -53, 15, -120, -416, 88, 102, -39, -144, -297, 89, 44, -258, -84, 243, 31, -300, 12, 190, 30, -137, -79, -20, 301, -120, -250, -70, 238, -46, -283, -9, 139, 175, -282, -204, 213, 92, -44, -131, -177, 21, 132, 34, 1, 132, 51, 228, -103, 18, 74, -89, -401, 276, 227, 29, -212, -84, 318, -192, -11, 29, -58]
1767e8K34k94K3N6N9J8j40L75m24J58m6j01L72%l14j00K95l7j32k10K71M8k84
1790b31L20j24K24l09J8p5K48j94o1M4L92q9l36r8L27L62l22k75L10J67m01j67
1812b70J84K53J94l60p0J72J0l68j84M78J3k24j47K68L13j57m19L40N7J86m45
1833a76J83J07R9k16k5j39K97m73l8L63K20j67l02K8K99J25o5m79M70J77k95N9
1855E2l4J18J47l88Q3P2J13m22J03L58J38l75l02L45K39R2n71q6N81o0m58J67
1877h8o7L02l92J51L6L34l07j68J12M31q9m50K55J64j7l42kK67K51m26j11JO53
1900D98l60l39Q9M09k03k86J56K68ln08J01K84L8j94l36K77L56m5l84n2O29j67
1922B28m71K3L08R0m29m4J67J20N5j61J34L63j23m51j4R1K49m51J72K79P2j11
$$ y = [-58, 176, -118, -95, -39, 20, 38, -102, 273, -151, 7, -39, -140, 232, 232, -82, -182, 113, 76, -56, -266, 5, 53, -231, 89, -35, 189, -120, -102, -177, 71, -123, -184, -140, 252, 163, -173, -271, 56, 418, 96, -179, 131, 298, -103, -270, -86, 167, 361, 1, -69, 103, 113, -255, -439, 39, 52, -172, -319, -51, 262, 105, -314, 26, 83, 269, -176, 7, 114, 213, -3, -28, -167, 130, -343, -381, -18, 202, 35, -267, -239, 60, 185, 120, -359, 111, 288, -7, 52, 18, 136, 283, -105, -22, 50, 163, -259, -156, 202, 340, -35, -337, 8, 247, 339, -232, -318, 263, 203, -255, -88, -155, 147, -245, -94, -58, 276, -31, -199, -87, 344, 255, -195, 60, 224, 207, -135, -137, 130, 381, -45, -156, -155, 498, 138, -201, -112, 297, 94, -192, -36, 232, 229, -279, -178, 106, 144, -50, -386, -109, 247, 202, -182, -234, 395, 228, -243, -220, 88, 178, -251, -295, -128, -8, 47, -114, 20, 383, 260, -191, -205, -114, 135, -316, -144, 135, 207, 96]
1944I6k15R5K38P1m45j76M30mj14p6J15L60m30J4o0L43m8l78K97L68m90j29N1
1967h7M16k94Mj90J97K96m02k38K08K80Lk71O3J69J48n00o4L50R8r4l10J62L70
1990C14k08l66J20K57j0k77q1L78J41m22%Q1L46l39k82J85N34l06k70K9K06J44
2012A74l02j07M24j43k7j73J38J69J45m49m5L17J2k21j11J66K55l51j00K09M0
2033B0J6k31M99j6O2l94j10M33j79k73L06J3m2j21j04k32N18k60K06l08L55j52
2055Fj09j07L50J36l63p8o0M45k46j57l9M15k81j49K07Q1K7J13l74L31J56k67
2077C7j96M41q3j83k82K40P1k02Q3j16K5L01j28j48K21j01j54mJ87K18m12m1L16
2100I0N8J31o86L41J19J25k00o0j3J80K69k40l44K83J2l16L73R6j93k22K99k27
$$ y = [96, -119, -24, 214, 285, -160, -336, 94, 90, -24, -100, 15, 375, -55, -41, -101, 242, 194, -184, 113, 481, -9, -138, -87, 329, 35, 39, -151, 46, 342, -60, -298, -90, 190, 193, -78, -15, 154, 302, -198, -262, 88, 186, 92, -218, -56, 314, 106, -260, -140, 117, 107, -170, -251, 127, 268, -154, -154, -73, 273, -66, -348, -163, 371, 65, -205, -176, 30, 174, -128, -235, 189, 46, 19, -154, -16, 153, 298, -151, -196, 121, 133, -88, -199, -33, 222, -129, -229, -20, 20, 36, -195, 304, 288, 350, -44, -154, 279, 100, -173, 133, 146, 104, -17, -121, -353, 165, -95, 111, -197, 158, 6, -103, -210, 140, 276, -87, -165, -225, 220, -26, -183, -222, 193, -88, -237, -30, 51, 78, 191, -183, 148, 304, 37, -159, 282, 199, 16, -266, -26, 45, -157, -74, -190, -165, 136, 8, -140, 81, -20, -174, -178, 9, 227, -185, -226, 90, 148, 279, -407, -66, 53, 178, -22, -82, -95, 85, 354, 114, -230, 53, 65, -251, 122, 218, 25, -197, 102, -125]
2122a25N25k24l25P9K96j68k01J59r7J6k02K50J35j07J2r7K23j65j25P0o4J33
2144bm1L4q5J40k06mJ24l0K13j82N2K04P1k64M2j17K34L8l12M1j28J99j81K61
2168A01l42L35j17J77n0j25j19mP5J00J33j29k4J18l6l80Q8K82j8Q6j21pN7j20
2192d0j24J97kJ82l08l1k7K65j48j2J03K0j60k20J11K47n5N5o7J39p5O7j1K19
2216C25k53m8k85M1K52K9o6rJ32o6j57L1J85l0k64K29k23K00P0k12K57o5k39m2
2240b08J48n9O1k22L00L1j66O6J87j46q1R3L2l0J33r0l21K69j62L65l50N5L18
2263B23j80k64K76K0Q5k04n9J31p0J35K7J41l15K74k45R7L2l9p2k10M53J31l83
2286a6r4r0K76j08mJ4N1r1k6o8R7R0J27l05J18K18k1j54k47L53p6k4p1Pj90L53
$$ y = [-125, 400, 176, -149, -70, 226, 58, -143, 16, -81, -65, -267, -17, 118, 11, 23, -74, 149, -16, -141, -71, -135, -2, -43, -9, -94, 46, -160, -164, -40, -70, 143, -39, 13, 217, 288, 24, 66, -51, 183, 221, -91, -50, -178, 21, -160, 101, -241, 94, -23, 154, 104, -21, -140, -144, -69, 31, 164, 35, 11, 129, 93, -287, -199, 83, 65, 151, 30, 23, 80, -40, -164, 33, 31, 213, -95, -126, -153, 112, -36, -48, 55, 75, -85, -305, -194, 53, -2, 53, -14, 125, 50, 117, 106, 325, 72, 24, -261, -220, 32, 61, -5, -14, 118, 52, -105, -74, 111, 81, -183, 46, -177, 23, 93, -119, 138, 73, -166, -208, -60, -119, -58, -280, 20, 51, -115, -49, 138, -8, -89, 4, 36, 6, 139, 49, -272, -3, -165, 200, -150, -95, 223, 43, -221, 55, 75, 160, -44, -103, 28, -42, 93, 120, 261, -54, 220, -25, 72, 104, 65, -7, -217, 236, 367, -16, -110, -200, 76, -32, -36, -22, 29, -62, -88, -156, -59, 31, 158, -147, -29, 189, 168, 14, -233, 120, 44, 20, -51, -44, -234, 119]
2312A19j25k25K93k34O2J84R4J53n61K15O1J94l13J03j5j39Q4j29M76l12J80j46
2334A9RP5j49Q6j36K08O6m80L45J62j12j77L3j02L84j4k91J62N1o8m87M96L4k29
2358a15m9J47k1K58j37o5k6R7J30l56J63m1J01oq0J79k13kr0J53n5n9K04l57J51
2383h9Q5lq7J43n6j03P8l9L0J00j15j31K68k2j59J18pO3q4O5k13K32l25K48P6
2408G3r7j38J23J79p7J57j25j69J47j31L8J3j70M22j29p2J78K48m32Om2j32K82
2431A52l4k88J12Q9pp4R2r9K12r5J28k78K45k78J06j04j16M94k47J30k38L8J1
2454d9JN7J60l86J64P2R8j81J47k13l1O3Q6K14j74j76O0J46o4J16k28J12L7p0
2478c9M5K26k93J10l17PL28k00K14r9N3r7K18j34Mn0k48J21J53K4j10J93j67N5
$$ y = [119, -6, -231, 62, -172, -110, 74, 168, 321, -240, -25, 36, 230, -83, 20, 5, -134, -50, -179, 297, -15, 165, 19, 28, 103, -46, 40, -96, 112, 178, -302, 43, 205, 93, -84, -51, -153, 231, 217, -74, 88, 139, 71, -416, 80, 114, -115, -164, -17, -38, 220, 83, 18, -8, 89, 219, -137, 26, -15, 86, 80, 0, 179, -34, -36, -126, 27, -28, -87, 117, -240, -89, -4, -7, -94, 49, -7, -110, -32, -71, -41, 59, -56, -187, 81, 59, -100, 18, 11, 74, -10, 55, -158, 74, -251, -3, 73, -24, -162, -39, 140, 63, 220, 95, -74, 73, -58, -20, -7, -177, 245, 116, 44, 222, 470, 38, 44, 2, -130, 152, 118, -170, -58, 31, 24, -50, 42, -57, 155, 60, 188, -90, 155, -123, -17, -121, -237, 257, 10, 140, -98, -60, -49, -48, 9, 169, -217, -53, 19, 117, -64, 83, -130, -161, -98, -12, 202, 28, -148, -88, 58, -6, 110, -118, -6, 31, -39, 6, 232, -61, 49, -268, -261, 67, -133, 81, -18, 35, -62, 156, 22, 26, -24, -272, -151, 2, 26, -84, 109, -58, -3]
2502cj15P0r1K28o2j2K60j78l0j04K56n7k78K43j21o3P9j16J70M1oJ5k74J07P3
2527C2j34r9K80k2k61Q0L1P8K18j44L7R1m8R4m05L78k22J13r3n3L7P9Q7k37P3
2552a0J11j4O8j29j99O8k5K01q0j01J12l1l90L56l5J5oK26k7k0k03J05j63K27
2576E6r5o6N4Q2q3l4L07j69J38j09r0o4J2K53j41J8j59K4K61k69J68q1j14J23
2600B2R4N2J9l10J19j38J72K9m1O0m5p4m4L4mQ9p6J45n5p8j6J74j19R9k95J11
2626g6n4J14q1M1J01k72K63k34K70k41J46k56L97q9Nk76J37J07%p5p0N6j3K05
2650A05j44K58l31j1J81J7j4n6K41j61j96P8p7K53q8r2l3J91r4j86M6N1P2j63
2674a53J36J08J31k7k92J27qqo3O3Q8J1k19P4N8R0o4n8jOJ44k01k1q1J71k0n9
$$ y = [-3, -118, -48, -139, 89, 27, 15, 275, 97, 67, -37, 219, 162, -116, 127, 6, -57, 22, -94, 76, 117, 111, 126, -148, -41, 32, -102, -201, 79, 57, -204, -124, -93, -15, 203, 59, 96, 187, 139, 233, -172, 206, -16, 97, 4, -49, -12, 67, 154, -83, -10, 101, 87, 155, 26, -173, -105, -130, 71, -9, -110, 2, -29, -419, -63, -98, -83, -89, 137, 110, 90, -113, -8, -171, 56, -39, -105, -51, 31, -52, -86, 221, 52, 190, 81, -9, -73, -61, 192, 51, 69, -90, -66, 195, -74, 94, 13, -101, 22, 116, 168, 187, -123, -4, -142, 30, 59, 18, 78, 33, -41, -85, -51, -55, 34, -42, 103, 48, -30, -46, 128, 9, 108, -187, -76, -130, -16, -97, -56, 45, -227, 36, -198, 72, -169, -23, -279, 118, 29, 34, -242, -105, 2, 2, -73, -143, -87, -100, 105, -39, 219, -112, -123, 58, 75, 61, 5, 246, 85, -111, -33, -110, 143, 55, -37, -70, 121, 27, -159, -113, -62, 10, -153, -17, 91, 222, 195, -97, 30, 22, 14, -49, 14, 102, 113, -106, -32, 26, 116, 52, -6, -7, -1, 143, -58, -79, -160, 11, -9, -68]
2701f8O9r0j57J85J51nj84L59m20J70j41K40l54K85qP3r4n5K66m05J39j35J98
2724A9k11L54n6o4j10J70Qk7k51P5r5K66j40j08K42R8l56Q1j00J76j81M35j60
2747F5J2J7j65J38J11k12j70O8O5j38j2J77P1r2J81k0l50K32j9K4oK5l0j73L04
2772A03k2q0K36k80J02nj47Q4m2L93k56q8pL1m7R3J54l03L9J00n9O9J96m67L71
2797A68l1j11j62R8R3J48l5k09J8J13j38K01l82K41J51k39n9J99Jm3k06L86l30
2820a28R4M3l1M7j35r8K79j34K27n3j38K03j16j40J6kk8L8R2k02N2K45J26k35
2844B2M0Q3k1j20K01j48J19k36j43K03J45O6j02p4J02l99K25J10N9o7P4o2k49
2867a72J78M8k1k0j69L10j81n2J9n9q1J09L40l10j05K22j94L9R0k89K51k44L79
$$ y = [-68, 1, -89, -246, -61, 90, 85, -99, 260, -160, 10, -131, 109, -245, 40, 32, 105, 11, -44, 222, -183, -44, -179, 19, -192, 162, 106, 42, -68, 102, 110, 83, -168, -93, -188, 78, -62, -170, 72, 170, -186, -105, -205, -29, -210, 225, 65, 77, 94, -71, 67, 178, -34, -204, -136, -71, -209, -221, -44, 27, -65, 116, 96, -254, -22, -41, -17, -23, 2, -28, -201, 103, 81, 1, 237, -43, 59, 54, -93, -9, -51, 342, 86, -2, -9, 22, -25, 68, 222, -81, -42, 58, -1, 68, 264, -203, 168, 137, 26, -136, -38, 55, 203, 168, -41, -23, 90, -48, 153, -229, 12, 163, -76, -135, 64, 65, 22, -184, 202, -128, -34, 9, -22, 25, -110, -208, 71, -63, 164, 111, -27, 176, 60, -80, -64, -66, -94, -56, 36, -166, -114, 131, 257, 22, 62, 145, 124, 4, 205, 57, 176, -60, -203, 0, 145, 211, 109, 35, 137, -262, -37, 73, 132, 65, 139, 77, -172, 6, 54, 33, 13, -156, 154, -27, -79, -60, -119, -200, -91, 249, -61, -166, 56, -138, -99, -9, -298, -47, -291, 88]
2890H8j68J08K56l21j01K40j98J90p4o0j25K3M26l23P2r0m4K78P9l84J54j48O5
2913e7l8K42j37l7J2q6J81l9%k18M2J18J97Q0k71O8j30j3O6J44j96K6J66k01J03
2938B2q1o1o2J15J3l2Q6J14j32Q2J6j12m2J26j56J79j9N0j83O0j38K76j86J79
2962A14q1J3M3j54J68o5j11Pj6K2Q7p5J4M5R4j17rK36k67j61M78k48r6M5M06j56
2988B16k62P9m2j99J62j17L02j73oJ91k87J34J56k15K00j74RL1q3J41k10J58j92
3011a81N22m28L1k2J36j20J28j11q8K77J23l15J35m26L03P4j08J11l1L1j13Q9
3033A7j28J4K1J58k50J25q3J62PR1j55j71L25l1r4O8r6j04N3J1P4PKpl6q9J7J68
3061G6k15L19k05J22o3P6j45P3O4J59j88rM0j81N3J32l6r4j02q1K93r4P1ml38
$$ y = [88, -80, 28, 284, -37, -138, 102, -96, 94, 20, -40, -165, -142, 284, -39, 33, -57, -101, 177, 256, -128, 26, -122, -57, -95, 147, 10, -27, -15, -101, 80, 41, 41, -177, -135, -17, 180, 260, -11, 57, -73, -86, -20, 124, -72, -46, 120, -81, 22, -59, -120, -182, -67, -54, -86, 0, 114, -18, 64, 80, -32, -74, 52, -104, 75, 56, 106, -77, -17, -155, 121, -65, 114, 33, 46, 89, -65, 103, 38, -73, -66, -82, -60, 27, -48, -34, 11, 105, -12, -21, 215, -52, -213, 265, 17, -79, -34, 372, 216, -46, 33, -9, -208, -46, -163, 139, -34, -40, 151, -136, -2, 154, -61, 139, -35, -26, 5, -78, 63, -147, 11, -181, 341, -87, -56, -78, 58, -62, 66, -45, -133, 144, 267, -48, 87, -339, -36, 38, -70, 41, 10, 41, -72, 17, -111, -97, -76, 82, -168, -43, -126, 36, 43, 134, -21, -192, 133, 102, 8, 76, -20, -124, -71, -60, 14, 21, 23, 16, -20, -109, -92, 76, -139, 180, -25, 97, 34, 110, -35, 38, 102, 261, 73, 64, 104, -77, -24, 108, 72, -22, -124, -205, 88, -6, 65, 61, -277]
3086b77L40o9k11K75k35j8L50l0j14l2M7j89r1K89k95K1J67L1p3l7Q5NJ67m3N6
3111A19k45L32j59J01nn7qj05L1J00N6l8k17J75K36l59J25o9M1j9P2k29Q7j31
3135a66K61j07r8L99m97R2P7k35J31K78o0j57K17k13NJ11j02k5J12PqNJ33j48
3159A2lo3r9Q1O8q9r3N4R2LN9J8k4r3n9K25k10L11j91l8Q6j45P8J61j08M9m3j6
3187B3J7p9J58j63P2k98M57k36K57j66Q3J11l06K12p2j73K43kk04Q6J44j23j85
3210a44J81j08k14K15M3j87K93n1j15K77j76j27J45j38OM8n4K02l02J3L74q4l58
3233b61N39l5m54K68K2J27j78k0p3K99nj42J49k62J79l8r7l5J32k29P3K87k37
3256IK39k37j10O9J16k44J9K78Qj91j14J51J4J95k19l9R8r1J17p7J8J66m20K45
$$ y = [-277, 63, -6, -217, 58, -177, -195, 155, 125, 11, -21, 26, -163, -254, 35, -260, -239, -72, -41, -114, -151, -66, -61, 106, 63, 119, -126, 206, 47, 148, 143, 86, 78, -27, 4, 104, 160, 122, -95, 80, 316, -43, 82, 13, 54, 35, 107, -122, -35, -166, 95, -12, -110, 289, -208, -116, -39, -274, -143, 135, 75, -82, 135, -78, -73, 38, -64, -89, 23, 30, 22, 27, 160, 12, 9, -54, -153, -72, -4, -93, -186, -132, -40, -37, 22, 40, 16, -77, -136, 89, -121, 190, -1, -39, 47, -98, -20, 141, 33, 82, 39, 23, 40, -39, 119, -44, 28, -270, 187, -49, 208, 42, 125, 236, -70, 142, 70, -103, 140, 138, -66, 20, 164, 41, -144, 37, -71, -285, -70, -27, -214, 79, 28, -87, 190, 14, -113, 32, -106, -100, -52, -106, 96, -206, -193, 181, 97, -261, 278, 243, -211, 57, 79, 206, 28, 8, -65, 234, 229, 87, 236, -26, 153, 115, 18, -17, 115, -114, -41, 246, 9, 248, 11, -99, -30, 86, -158, -139, 139, 147, -44, -158, -7, 7, 202, -17, -56, 42, -49, 68, -9, 9, 175, -245, 0]
3280@J0Q2L7q9N4j44n2J06L0K1N1J0k70J49qK93j35j17M1j16J69l78L09j68J27
3305A2j52K0M5o7N2K61O0m1j90r7Q6j56K23k3k86J77j0M1P7j27K13j64Q9k97K92
3330C8m75L28J50n4NQ9k94k6J83J00L5k13L40j62k63K32K2j49Q7K3P4j03Q7k14
3354a60M1m5K69k33L1J46j2r7Q6K7k5Q5j08qJ95J3k29j06J31K10r6j11M2J23j67
3379Bk23K76P4j37K23j69n9J8K33k39o8K95l31j42K15k4r7J59r2l4O2J84j94O8
3403@p2P0jl02L22j08J90q1n6Q4j54L80k58m4l3J28r3l0N9N1j23J00q6J80k16
3428i3O8l6j6J22J3rk14J89k1k31q7L29j32K09k90j5L19j8j66o5J89QP8k27J01
3453En1P5k42K60j4k77L65k59J52J09l08J07K0K38m2j40j3R4n5J09rj00J12j23
$$ y = [0, 10, 92, 129, 40, 94, -50, -102, 4, 34, 55, 106, 116, -154, -5, -13, 280, 145, 28, 69, -47, 122, -256, 53, -115, 12, -140, -120, -75, -142, -90, 171, 231, 190, 0, -97, -11, -167, 56, 33, -253, -76, -86, -45, 32, -95, 118, -46, 43, -254, 38, -437, -109, 41, -13, -8, 81, -213, -239, -56, 44, 79, -134, 206, 44, -219, 13, 35, -114, -27, -4, 70, -33, 54, -160, -119, -164, 105, -128, -97, 49, 37, -60, 26, 53, 28, 113, 5, -3, 192, 205, -24, -130, 1, 211, 115, 4, 46, 169, 2, -221, 55, 129, -8, 215, 46, -13, 5, 238, -1, -69, 226, -105, -247, -32, -56, -153, 6, -86, -120, -58, 126, -68, 0, -72, -2, -3, -305, 17, -91, 99, 18, -38, 46, -108, 272, 14, -30, -63, 65, -28, -58, 1, 52, -71, 29, -57, 123, -93, -25, -61, -77, 45, 58, 49, -165, 24, 3, -228, -315, 14, -118, 91, -199, -214, 105, 87, -79, -144, 45, 53, 131, -96, 5, -46, 29, -213, 47, 33, -244, 121, -138, 14, 123, -185, -78, -58, 180, 138, -2, -15, 79, 24, 133, 124, 24, 136, 13]
3477A3M5k12J25m5K9K0k3j93K11R7k02m0J00K19j66n4o7J12m8J37k00J82j29j2
3501a01K16j68J95L6pl74J63P2J53k14m6J99k29J93j37M9J5J46L4j86oJ00p5l8
3525a0k67M06m0j68l9J94k54J29k7L7pP2M5L4K7m2m3r5q1K63j46R7K2j57rj43
3551b02J49P7J76k15j07J34k33K13K10k23n2K99r5j32j17O1M7M9j82J70K5q5Q3
3574E0j59J50K09k51Q0j33l6J95l5j8j31J80n5J50k3l9j48l0K02j74J20l02J24
3597g4K92l52K21Q3j6k08j69K01N4L30k79k57K00l4N6r8M7k15O2J83j08l2K18
3620A05j97J41j63l3J67k5L9m13N18j16J3M3o4m9R3j3R3k31j62K09J09K01l99
3643a34K25r8Rm3J8j66L54M4l66K36k13K30Pj40l6K7j15JM3J79O7j65J08M1Q1
$$ y = [13, 58, -154, -29, -74, -45, -25, -48, -241, -30, 67, -135, -175, -75, 144, -22, -76, -143, -31, -79, 58, -142, 40, -89, -101, 115, -53, 142, 178, 171, -203, -40, 32, 185, -29, -75, 124, -105, 88, -49, 0, 15, 161, 195, 9, 3, 103, 28, -10, -277, 129, 89, -79, -118, 76, -178, -49, -76, -39, -46, 26, 71, 105, 132, 90, 47, -48, -129, 134, -12, 85, 107, -50, -59, -202, -53, 24, 200, -15, -122, 12, -221, -8, 202, -21, -73, 226, 131, -1, -118, -57, -10, 39, -143, 27, 52, -33, 50, -109, 41, 250, -1, 79, -54, -90, 105, 70, 52, -79, 101, 46, 196, 173, 134, -14, -44, 158, -16, 104, -198, -74, 218, -134, 87, 170, 154, -54, -223, -22, 32, 362, 83, -174, 26, -8, 48, -50, -3, -218, -156, 27, -81, -113, 105, -92, 49, -114, -147, 20, -5, 34, -379, 139, 23, 36, 79, 15, -34, 59, 46, 139, -92, -254, -45, 64, 265, -134, 91, -7, 2, -41, -23, -189, 165, 209, -157, 79, -134, 96, 103, -37, -73, -46, -161, -160, -117, 62, 129, -36, 72, 113, 194]
3668A94r7j37L00l6k31J21q5j28N0L7J63m6k90L41j88n7K04k44K71k62J0n7J11
3691e6k9m6k8O4J50m9k47J79j6o6K63l93K76j5Q6q5j22K02J48l22N9M0j6kJ8N9
3717E2L1q4N2j02j33nR7J94j55M1L0P7j73p2K12j43j08N43j88j81P1k02K11j09
3741d4J49lk75K58j57J90j02l8N1j33J71J23q5j64K85j26j56n3O6o2J81j28J26
3764G4n0j25J14j73J2P5n0P0J14L1j6m1j03j27jL23j15q2o6Q1J52n5j49J18q8
3789g7L2MnJ56m7N0J3j29j58P5Q0J63j22n8j69J38O7j17N0N0m3k8J86p6k0m6N9
3816B8r9J05j26J75k46L61k94J24p0J20q6r7j26K8J68O6J48j73j50J21j1Q3n6
3839gK43n40L01kn4N5J54j49jj02R5o2J80l0j99K21j10n6N7j38K07j76K7L7O9
$$ y = [194, 97, -40, 260, 224, -7, 114, 29, -99, -49, -12, 151, 105, -185, 156, -32, -89, 115, -129, 142, -120, -110, -167, -56, -85, -131, -159, -95, 55, 6, -241, -62, -78, -144, 119, -274, 2, -13, 73, -12, -134, 68, 216, -106, -47, -7, -23, -25, -7, 52, 83, -1, 51, -51, -184, -189, -92, 102, -53, -12, 18, 95, -78, -150, 62, -81, -189, 354, 166, -15, 56, -146, 65, -44, 105, 102, -173, 85, -72, 118, 16, -22, 29, -104, 67, 190, 105, -59, 226, 100, -56, -109, -43, -105, 76, -52, 74, 24, -101, 13, -160, -148, -73, -123, -53, 61, 92, 76, 35, -68, -195, -196, 127, 12, -70, -136, -55, 97, 42, -107, 11, -77, -45, -41, -46, 110, 63, 113, 126, -3, -161, -86, -6, 157, 35, -23, -192, -54, 13, -104, -54, -4, -47, -75, 111, 35, 15, -31, 28, -71, 34, -92, 83, -163, 198, -96, 28, -42, 78, -8, -105, -231, -203, -35, 31, 179, 6, -144, -23, -34, 49, -7, 236, -304, -3, -5, -59, -4, 150, 1, 0, -102, -7, -69, 111, 81, -118, 103, -7, -63, -6, -144, 63, -113, -86, -49, 20]
3864B0J31k62K18J86k53o5L8j03J66O6p5j03K1q7MJ60j15J18m9K67ql74r3J92
3888@q6K42k60P9O5O2L1J98l86J63j33J40j53p8R8R5K2n9j87J3o6J92j86J56J63
3913A25n7k16O8J65k63L01KR3j81o8j88J48K01J06k25K74j88j52m4J20p7J28J9
3936I1k62J44j75J83k6M5j66J76J85j20j47n2k7p3kJ26L92l57j6l8J75j5l43R6
3960b06K95l5J62k68j61J81R5o8M2n6J21O8k07J13j48J83j78K3o4K89k76J72o2
3983A5J16p3j79K9R8K2p5N7J07k9q3o9J47j92k0K14j85K34j29J71j46r9K2j78
4007b25O6J61j48J53o8J24M8j79j35J72J10K7k12J3L8r2R8P2K30k57p4K50m09
4030b37J21j06K43r6j83N49j17j66J0o7m3K59k45J82j49k8L0N2j49N7N1K1R2P2
$$ y = [20, 151, -111, 107, 293, 40, -25, 13, -90, 76, 142, 67, -36, -15, -102, -98, 62, -53, 65, 16, 283, 275, -99, -192, 0, -86, 156, -104, -25, 40, 102, 133, 331, -55, 108, -25, 115, -38, -116, -18, 77, 99, 40, -147, -134, -200, -8, -194, -38, 125, 68, -148, -80, 85, -178, 123, 125, 218, 37, -31, -219, -71, 130, 236, 11, 285, 97, -55, -99, 21, -56, 72, 91, -171, -27, -202, -19, -45, 0, -166, 10, 195, 75, -72, -124, -151, -224, -226, -100, 292, -65, -81, -119, 56, 41, -302, -206, 89, 54, 216, -52, -213, -32, 63, -5, 37, -19, 102, 170, -37, 76, -72, 111, -67, -44, -108, 181, -95, 77, 15, 131, 58, -121, -92, 6, 28, -47, 10, 117, 88, 5, -64, 83, -109, -129, 85, -100, 134, 5, 176, 30, -69, -47, -225, -159, 2, -146, 7, -61, 63, 111, -68, -203, -31, 79, 106, -106, -93, -55, -147, -49, 23, 253, -4, -78, 172, -237, -116, -222, 21, -75, -258, 291, 174, 8, 18, -49, -92, 167, -78, 104, -45, -73, -43, 9, -140, -83, -32, -11, 81, 153]
4054A53l70J55%O3J09k17J97m6j6O9k15Q5J02J49r8j28k7Q9j37j09J11K49k10
4077d2J49j18n0O9N2J66P5q0l98L19j62o7K10k02K36k80j46J57J16J32l14K57
4099G9m0k30M3K72m9j02J91j89J0P0k22M1K10j70K22j69ok15L05q7QN3j35j15
4123b25J64M0J25M3j12mm8p0NM6p6J12P2J20k15J27N5p4l6J6j28j38K76j02p3
4148a00L54k43k8K07k91J28N7P0j80oPR6QJ24k81O7p6P0M7j38K33j17P1p6R2j11
4174a6L7n1j27K94p1j38k5J14k45J3K46k2j42L69k65n0K30j80J26l58M22j08j65
4197a12K99N4p0q9j56L14k32J81j3k14J08j13J54pj96J2oPL5o2j1J03j30K87l22
4222a79J13k08L58j46J2K82j30j26J40lM7k83J47P7k85L50j66JO2j77K49j66l7
$$ y = [153, -217, -62, -62, 1, 110, -107, 90, 44, 28, 97, -118, -33, 69, 218, 120, -8, -35, 54, -83, -192, -81, 168, -42, 107, -11, -61, 8, 60, 226, 301, 221, -177, 142, -20, -87, 123, -79, 157, -123, -269, -112, 4, 136, -178, 79, 39, -191, -148, 124, 75, -27, 164, -25, -15, 55, -167, -126, 84, -86, 136, -33, -39, -254, 51, -36, -28, 25, -110, -225, -61, -21, 104, 147, 35, 31, -17, -87, -82, -36, -112, 0, 72, 192, -23, 104, 159, 85, 49, 65, -63, -201, 75, -27, -100, 254, 11, -17, 190, -101, 27, 84, 154, -26, -32, -25, 71, 79, 203, -78, -11, -87, -17, 30, -108, 125, 8, 79, 3, 95, -16, 21, -30, -157, 137, 66, -72, -97, 17, -228, -215, 31, 9, -133, 236, -29, -79, 151, -29, 97, -261, 161, 53, -112, 187, 241, 171, 82, -74, 240, 8, 189, 176, -38, 70, -43, 111, 104, -92, -80, -86, -79, -44, -106, -117, -14, -144, 143, -179, -66, -274, 84, -62, -50, 232, 102, -24, 116, 113, 160, -123, 24, 101, -184, 166, 0, 1, 63, -114, 135, -31, -68]
4245f8O2n5J48r3j11j68L87j85J12k63J31m9K25m7J54j07j40J21p1L02l66L08
4267B27r5k0j09k3J47n6n6J2J8J33j18m1J8j31J07k2J00k21J30K0j50J50J0o8
4291c8m3K07j94R4j17K29j75j01L45j72J64J13m09LK43k21n0J67J5J27k47J45
4313H5m0q9n7J75j44P0L4l7o2J15N3r9q7J28o7K20k87pJ58o6j0J46j5m5ql43K51
4340b8m4K2j46K23j25L0Q9M5O2j84L57j84J15k08j65QL20k13K3k4n9J82Jk5J19
4365A91k14k5J09j27L1K9M6o1k0j07P2J33l18K53P4l02J76q2J80m9J96j56q2J31
4389G8q5rQK70l22N8l4j16M0J04o0J38r9oJ12j70L77k10m0m3p2j7k0J10J61p5
4415G8MK80m17J04k58J70K13l24R8J09k33J48K79l32J74j46No8J16O7l33K95k0
$$ y = [-68, -6, -61, 87, -6, -117, -285, 102, -83, 29, -234, -103, -152, 73, 26, 180, 73, -67, 54, -17, 285, -81, 227, 132, 112, 3, -20, 127, 71, 15, 27, 45, 178, 60, 19, 37, -94, 13, -9, 91, -130, 0, 20, -130, 20, 30, -38, -81, 126, -68, 26, -91, 138, -37, -138, 207, 35, 199, 312, -97, -94, 149, -72, -122, 45, 60, 187, -60, 85, 45, -44, -101, 74, -70, 0, 34, -3, -65, 50, 103, 4, -83, 45, -22, 198, -89, -96, 62, -4, -14, 132, 117, 72, 64, -279, -28, -72, -50, -196, 27, -98, -68, 21, 66, 128, -56, 301, 117, 232, 24, -141, -133, 187, -26, -3, -27, -86, 96, 97, 72, 191, -23, -48, 61, -66, -35, -6, 40, -21, -41, -148, -76, 57, -261, -8, 66, -236, -60, -142, 38, -11, 185, 29, -53, 78, -7, -16, -8, 262, -60, -2, -36, -152, -112, -8, -68, 70, -29, -35, 77, -93, 284, 74, 34, -9, -81, -98, -118, -8, 153, 78, 82, 362, -55, 49, -209, -39, 174, -150, -52, 57, -176, -28, 251, -81, 93, -53, -48, -116, 0, 67, -266, 29, 9]
4438Ik4N4K17n02K98o5K37k24o4m4L9J98q9Q1j85k44L4K13Q4j01J1l7J37P6n9
4463E0r7k2N8m5p8P9J29q2K4r6J76k55K51k52K37Qj02J51k20J9j53K79j32O6J75
4488A68RJ6k04j70l5J71J56R4j93Q6j24r8K64j46k35J10l2j17K38J09l1K5k00
4511a39L07j01o5J23j73k2%K39k51P7k4l9Q6j3k30K30L0j02K15q5J01j15j22J12
4535C9J5j21n4K12j90L76j86m4L6o5O4j23J29N9k17K42j59J79k07K0J91j78j72
$$ y = [9, -15, 39, 256, -246, 52, -13, 224, 0, -64, -108, -69, 129, 40, 121, -64, -308, -274, -61, 23, -78, -67, -104, 33, 109, 50, -47, -69, -11, -56, -134, -55, 74, -8, 16, -80, 96, -159, 92, -160, 77, 85, -17, 134, -86, -67, -220, 59, -73, -7, 168, 177, 193, -11, -181, -216, -45, 111, 205, 12, 98, -26, -124, 140, -6, -241, -131, -163, -280, -42, 67, 36, 61, -139, 168, 67, 2, 125, -48, -70, -70, 169, -82, -5, -29, -68, 18, 5, -225, 5, 35, -67, 148, 63, 164, 49, -73, 39, 54, -67, -121, 91, -99, 277, 91, 47, 83, 18, 82, -41, 88, 147, -70, 172, 13, 192, -15, 5, 196, 18, -154]
$$ [...]
8191F3
##END NTUPLES=NMR FID
##END=
