##TITLE=1H_SR126_DCC
 CDCl3
 8 sc, 
 12.05.2022
##JCAMPDX= 6.0         $$ Bruker NMR JCAMP-DX V2.0
##DATA TYPE= NMR FID
##DATA CLASS= NTUPLES
##ORIGIN= UXNMR, Bruker Analytische Messtechnik GmbH
##OWNER= root
$$ XWIN-NMR		Version 3.5
$$ Thu May 12 13:50:38 2022 Russian Standard Time (UT+4h)  she@DPX200
##.OBSERVE FREQUENCY= 200.1313499996
##.OBSERVE NUCLEUS= ^1H
##.DELAY= (6, 6)
##.ACQUISITION MODE= SIMULTANEOUS
##.ACQUISITION SCHEME= undefined
##.AVERAGES= 8
##.DIGITISER RES= 18
##SPECTROMETER/DATA SYSTEM= spect
##.PULSE SEQUENCE= zg30
##.SOLVENT NAME= Pyr
##.SHIFT REFERENCE= (INTERNAL, Pyr, 0, 15.7039)
##AUDIT TRAIL= $$ (NUMBER, WHEN, WHO, WHERE, WHAT)
$$ ##TITLE= Audit trail, XWIN-NMR		Version 3.5
$$ ##JCAMPDX= 5.01
$$ ##ORIGIN= Bruker BioSpin GmbH
$$ ##OWNER= she
$$ F:/spectra/data/she/nmr/H-F/1/audita.txt
$$ ##AUDIT TRAIL=  $$ (NUMBER, WHEN, WHO, WHERE, WHAT)
(   1,<2022-05-12 13:49:17.59 +0400>,<she>,<DPX200>,
      <created by zg, POWCHK disabled, PULCHK disabled
       configuration hash MD5:
       00 E9 B6 7A A2 85 ED C7 34 08 36 98 17 FE 4E 26
       data hash MD5: 16K
       C9 DE 9C 7A 27 6E 88 AC 69 20 F1 0D E2 6E C2 3E>)
$$ ##END=
$$ 
$$ hash MD5
$$ AD 1F 00 ED 37 EB 41 D0 DA 6E 72 B3 88 24 29 6D
##$RELAX= 
##$RELAX= 
##$RELAX= 
##$RELAX= 
##$RELAX= 
##$RELAX= 
$$ Bruker specific parameters
$$ --------------------------
##$DU= <F:/spectra>
##$EXPNO= 1
##$NAME= <H-F>
##$PROCNO= 1
##$TYPE= <nmr>
##$USER= <she>
##$AMP= (0..31)
100 100 100 100 100 100 100 100 100 100 100 100 100 100 100 100 100 100 
100 100 100 100 100 100 100 100 100 100 100 100 100 100 
##$AQSEQ= 0
##$AQ_mod= 1
##$AUNM= <au_zg>
##$AUTOPOS= <>
##$BF1= 200.13
##$BF2= 200.13
##$BF3= 200.13
##$BF4= 200.13
##$BF5= 200.13
##$BF6= 200.13
##$BF7= 200.13
##$BF8= 200.13
##$BYTORDA= 1
##$CFDGTYP= 0
##$CFRGTYP= 5
##$CHEMSTR= <none>
##$CNST= (0..31)
1 1 145 1 1 1 1 1 1 1 1 1 1 1 1 1 1 1 1 1 1 1 1 1 1 1 1 1 1 1 1 1 
##$CPDPRG= <>
##$CPDPRG1= <>
##$CPDPRG2= <>
##$CPDPRG3= <>
##$CPDPRG4= <mlev>
##$CPDPRG5= <mlev>
##$CPDPRG6= <mlev>
##$CPDPRG7= <mlev>
##$CPDPRG8= <mlev>
##$CPDPRGB= <>
##$CPDPRGT= <>
##$D= (0..31)
0 1.2 0 0 0 0 0 0 0 0.06 0 0.03 0 0 0 0 0.0002 0 0 0 0 0 0 0 0 0 0 0 0 
0 0 0 
##$DATE= 1652348957
##$DBL= (0..7)
120 120 120 120 120 120 120 120 
##$DBP= (0..7)
150 150 150 150 150 150 150 150 
##$DBP07= 0
##$DBPNAM0= <>
##$DBPNAM1= <>
##$DBPNAM2= <>
##$DBPNAM3= <>
##$DBPNAM4= <>
##$DBPNAM5= <>
##$DBPNAM6= <>
##$DBPNAM7= <>
##$DBPOAL= (0..7)
0.5 0.5 0.5 0.5 0.5 0.5 0.5 0.5 
##$DBPOFFS= (0..7)
0 0 0 0 0 0 0 0 
##$DE= 6
##$DECBNUC= <off>
##$DECIM= 32
##$DECNUC= <off>
##$DECSTAT= 4
##$DIGMOD= 1
##$DIGTYP= 9
##$DL= (0..7)
0 120 120 120 120 120 120 120 
##$DP= (0..7)
150 150 150 150 150 150 150 150 
##$DP07= 0
##$DPNAME0= <>
##$DPNAME1= <>
##$DPNAME2= <>
##$DPNAME3= <>
##$DPNAME4= <>
##$DPNAME5= <>
##$DPNAME6= <>
##$DPNAME7= <>
##$DPOAL= (0..7)
0.5 0.5 0.5 0.5 0.5 0.5 0.5 0.5 
##$DPOFFS= (0..7)
0 0 0 0 0 0 0 0 
##$DQDMODE= 0
##$DR= 18
##$DS= 0
##$DSLIST= <SSSSSSSSSSSSSSS>
$$ [...]
##$SUBNAM2= <"">
##$SUBNAM3= <"">
##$SUBNAM4= <"">
##$SUBNAM5= <"">
##$SUBNAM6= <"">
##$SUBNAM7= <"">
##$SUBNAM8= <"">
##$SUBNAM9= <"">
##$SW= 18.0517283424761
##$SWIBOX= (0..15)
0 0 2 0 0 0 0 0 0 0 0 0 0 0 0 0 
##$SW_h= 3612.71676300578
##$TD= 16384
##$TD0= 1
##$TE= 0
##$TE2= 300
##$TE3= 300
##$TEG= 300
##$TL= (0..7)
0 120 120 120 120 120 120 120 
##$TP= (0..7)
150 150 150 150 150 150 150 150 
##$TP07= 0
##$TPNAME0= <>
##$TPNAME1= <>
##$TPNAME2= <>
##$TPNAME3= <>
##$TPNAME4= <>
##$TPNAME5= <>
##$TPNAME6= <>
##$TPNAME7= <>
##$TPOAL= (0..7)
0.5 0.5 0.5 0.5 0.5 0.5 0.5 0.5 
##$TPOFFS= (0..7)
0 0 0 0 0 0 0 0 
##$TUNHIN= 0
##$TUNHOUT= 0
##$TUNXOUT= 0
##$USERA1= <user>
##$USERA2= <user>
##$USERA3= <user>
##$USERA4= <user>
##$USERA5= <user>
##$V9= 5
##$VALIST= <valist>
##$VCLIST= <CCCCCCCCCCCCCCC>
##$VD= 0
##$VDLIST= <DDDDDDDDDDDDDDD>
##$VPLIST= <PPPPPPPPPPPPPPP>
##$VTLIST= <TTTTTTTTTTTTTTT>
##$WBST= 1024
##$WBSW= 4
##$XGAIN= (0..3)
0 0 0 0 
##$XL= 0
##$YL= 0
##$YMAX_a= 119083
##$YMIN_a= -158013
##$ZGOPTNS= <>
##$ZL1= 120
##$ZL2= 120
##$ZL3= 120
##$ZL4= 120
##$ABSF1= 10
##$ABSF2= 0
##$ABSG= 5
##$ABSL= 3
##$ALPHA= 0
##$AQORDER= 0
##$ASSFAC= 0
##$ASSFACI= 0
##$ASSFACX= 0
##$ASSWID= 0
##$AUNMP= <proc_1d>
##$AZFE= 0.1
##$AZFW= 0.1
##$BCFW= 1
##$BC_mod= 2
##$BYTORDP= 1
##$COROFFS= 0
##$CY= 11.3945322036743
##$DATMOD= 1
##$DC= 2
##$DFILT= <>
##$DTYPP= 0
##$F1P= 2.36226072786647
##$F2P= -0.459571619588291
##$FCOR= 0.5
##$FTSIZE= 0
##$FT_mod= 4
##$GAMMA= 1
##$GB= 0.15
##$INTBC= 1
##$INTSCL= 1
##$ISEN= 128
##$LB= 0.24
##$LEV0= 0
##$LPBIN= 0
##$MAXI= 10000
##$MC2= 0
##$MEAN= 0
##$ME_mod= 0
##$MI= 1.114404
##$NCOEF= 0
##$NC_proc= 0
##$NLEV= 6
##$NOISF1= 3.799351
##$NOISF2= 2.8
##$NSP= 1
##$NTH_PI= 0
##$NZP= 0
##$OFFSET= 15.70392
##$PC= 1
##$PHC0= -17672.25
##$PHC1= 13.00075
##$PH_mod= 1
##$PKNL= yes
##$PPARMOD= 0
##$PSCAL= 0
##$PSIGN= 0
##$REVERSE= no
##$SF= 200.130013532006
##$SI= 16384
##$SIGF1= 3
##$SIGF2= 2
##$SINO= 400
##$SIOLD= 16384
##$SREGLST= <1H.CDCl3>
##$SSB= 0
##$STSI= 0
##$STSR= 0
##$SW_p= 3612.71676300578
##$SYMM= 0
##$S_DEV= 0
##$TDeff= 0
##$TDoff= 0
##$TI= <>
##$TILT= no
##$TM1= 0
##$TM2= 0
##$TOPLEV= 0
##$USERP1= <user>
##$USERP2= <user>
##$USERP3= <user>
##$USERP4= <user>
##$USERP5= <user>
##$WDW= 1
##$XDIM= 8192
##$YMAX_p= 0
##$YMIN_p= 0
$$ End of Bruker specific parameters
$$ ---------------------------------
##NTUPLES= NMR FID
##VAR_NAME=  TIME,          FID/REAL,        FID/IMAG
##SYMBOL=    X,             R,               I
##VAR_TYPE=  INDEPENDENT,   DEPENDENT,       DEPENDENT
##VAR_FORM=  AFFN,          ASDF,            ASDF
##VAR_DIM=   8192,          8192,            8192
##UNITS=     SECONDS,       ARBITRARY UNITS, ARBITRARY UNITS
##FACTOR=    0.0002768,     1,               1
##FIRST=     0,             0,               0
##LAST=      2.2672688,     0,               0
##MIN=       0,             -158013,         0
##MAX=       2.2672688,     119083,          0
$$ Real data points
##PAGE= N=1
##DATA TABLE= (X++(R..R)), XYDATA
$$ [...]
1810G9k35L22m39N94j20M8l5L4l5K8J85Rk40k48K29j08j04k44O2r1p2K23N2j40
1834b46M2j20N0K48n3j81L02L06j15k19Q4J34j30L13j04n0l71K14r6J24K28j74
1856A86j76P1k56k04L23j32J04k51J89k6N8k35J11n0j02L98m7j13j4K67j1J30
1878B20n5k3j74L41o4l4k00K80l31K45J93j53l39j00J99j03j80L4K36p2j92J44
1900a28m9P5l3j33M01k20m6R8M89k96j97L87k94J60k50J33nL7O3J14l64K58n8
1923A42j51j65L12j50k24k0k5j60N8M16r2m4r6L21j15p7N0Q2n5r6M21k75L8N2
1947A47J03K9k63R3j7J24j38j54j50N7j58L63j92j03Q5m9l53K96j05L12k44R5
1969b22K11n3K4J19j41J89mmN9j0J59P4j4l54M46m11O0k26J74j64l0l3J83k89
$$ y = [79, -156, 166, -273, 321, 201, 249, 214, 248, 213, 241, 426, 435, 195, -53, 176, 68, -36, -280, -218, -309, -381, -158, -106, -246, -204, -324, -274, -26, -79, -260, 42, 348, 233, 14, 98, 232, 102, 415, 311, 261, -110, 104, 8, 132, 360, 186, 10, 81, -175, -379, -56, -188, -84, -335, -146, -172, -114, -349, -238, -288, -390, 8, -39, -152, -166, 101, 90, 220, 165, 142, -32, 309, 245, 211, 11, 291, -40, 205, 398, 245, -94, -194, 5, -98, -278, -244, -8, -80, -272, -128, -177, -102, -135, -268, 133, -87, -133, -35, 454, 158, -39, 348, 54, 214, -36, 97, 92, 129, 192, 306, -58, 200, 142, -9, -174, 138, -12, -236, -256, -281, -441, -383, 33, -59, -103, -199, 122, 7, -70, -20, 62, 7, -89, 332, 57, 95, 147, 250, 279, 16, 109, 92, 216, 78, -76, -226, -169, -327, 36, -156, -259, -174, -223, -576, -280, -385, -73, -317, -222, -11, -64, -40, 79, -62, 127, 123, 119, 178, 168, 327, 401, 387, 33, 479, 68, 128, -98, 76, -88, -118, -151, 32, -257]
1993b57J21r4J5k50K41k88K97j75J12L29j60K63j4j31q1L78j07R6j44m3j33m7
2015g2J09L13j73k4Q3k2k65k29LK59j13L2j53L60k31mj07L64j92m9J4m8J61Q9
2039A05p6K94j01J6J49j31j86MJ97j97JK2m5o3m1o0j00N8k19L73j12K18n59M52
2063an51L92J04j94K62n3M1J12p8J15J55lk21k0K33l21M8J66M0r2N5O3j44j01
2087Gj8k36J94J17j85N7o6J58k93J05L0K0L08j48qQ3l61O07j51k09J16L6n8J37
2111B42q8l5j64J62o1j1j06q1K52k16j34J36J11r6L11k94pO6m9k11N6L02k16L69
2135B38k21K12M5q1k29L8L14m6j10kM29k01m55K21l58K55K04j74k08jPj64J56
2158a31P9j72j31J06J34j68J52n5M32j95k2K84r0m4N6J2l45L80m7j65M5R6k22
$$ y = [-257, -136, -230, -215, -465, -224, -512, -215, -390, -278, 51, -109, 154, 140, 9, -72, 306, 199, 295, 151, 108, -25, -72, 37, 350, 177, 153, 236, 214, -51, -280, -277, -18, -131, -99, -252, 108, -123, -127, -234, 130, -62, -111, -97, -145, 16, 105, 29, 323, 222, 238, 387, 256, 70, 74, 271, 74, 75, 97, 52, -11, -52, -112, -212, -154, -373, 0, -112, 106, -453, -1, -552, -160, -56, -250, 12, -41, 0, 112, 34, 149, 304, 301, 80, 60, 293, -28, 20, 186, 226, 134, 189, 252, 108, 7, -11, -247, -53, 64, -121, -64, -130, 28, -265, -160, -130, -110, 198, 50, 42, 125, -236, 371, 220, 11, 127, 163, 105, 242, 154, 119, -45, 117, 56, 45, -61, -142, 110, -106, -240, -104, 7, -89, 222, -72, -79, -13, -62, -273, -217, 85, -131, 238, 17, 229, 274, 193, -36, 2, 316, 270, 160, 158, 587, 386, -69, 152, -206, 49, 253, 79, -129, -130, -123, -287, -131, -52, -224, -355, -249, -115, -283, -131, -186, 246, 51, 29, 313, 223, 179, 235, 247, -98, 282, 235, 70, 115, 211, -11]
2181a1Oj43R8J54l0o1k03OL0J0j24J7M5M7p5J17J39k17K86J57k70L93k50J21k12
2206C0o6N2%J80k83K64q6j91K71l03j43K54p2J55k46N4KJ10k08K75q8j46o0N33
2230B88l47Q5J34j55R6L18o1j88J74k36K42n24L03l25M07k28n8j3K9o2o4l4o5
2253b84J59n6k5J63k50J20K91j71j72K23PO9L00ql64K53k40p6J34L47k81m0o1
2276C8j49q2K07j03J35j4j82l3K54K05l50j26K4L0l13K55L29n1j85J91L7k94M84
2299C07k08NK46j59j58m0K24P9l40l0N3J41j26j50o8K21N4qj51Qk2j26K88j31
2323i1k6j63K1Q8L91j1p4j45J42L0o3k42M13o5j13O3j93L01j90j29J05k43K15
2346B1l41K6m1K73j84L8K33l14N4l9J97J8k40Q7L06k36J79J74j42L11j96n0R1
$$ y = [-11, -5, -148, -50, 104, 74, 13, -190, -184, -154, -144, -268, -251, -206, -159, -234, -117, 22, -195, 91, 248, -22, 371, 121, 242, 30, -36, 16, 16, 196, -87, 177, 91, -100, 171, -132, -275, -21, -93, 62, -184, -130, -128, -18, -226, 49, -39, -185, -245, 288, -59, 26, 160, 5, 101, 419, 358, 170, 344, 108, 350, -174, 129, -196, 211, -17, -75, -88, -59, -121, -185, -219, -284, -125, -181, -206, -43, -293, -173, 118, -53, -225, -2, 5, 74, 374, 366, 2, 255, 15, -61, 73, 420, 139, 99, 38, -111, -193, 14, -89, 46, 32, -150, -183, 71, 276, -74, -200, -176, -146, -459, -204, 125, 74, -111, 80, 117, -177, 307, 99, 104, 350, 191, 33, -7, 217, 296, -44, -74, -21, 120, -6, -156, -224, -3, 51, 43, -108, -100, -122, -248, 40, -91, -117, -280, -259, -171, 220, 209, 135, -10, 132, 162, 99, -143, 270, 205, 92, 155, -38, 263, 73, -56, 49, -194, 21, -320, -294, -335, -62, -246, -208, 25, -289, -235, -274, -77, -59, -299, -212, 94, -142, 37, 211, 69, 380, 184, 134, 225]
2369B25p1M2M4Qk14R4p3p5m3J42k71K20j81J16j46j33L78k64K72j29m9K01j61
2392f8N4j9J92J73m01L21m9j05L9L6Lk50K41R0m01K21J53j25l45j5K98j96J49
2415dk78J03No3Q6j36K19j00K1jPK18K58k67l3j15K07p5K29j18K9q6l2J19l20
2440a27Oq3L01l3n4k39n0M40l39p7K33L7j00N2k19L20k04N5k3K85k20K63p0k47
2464i3K11k10L24j44N2o8M0k63L78k33Q2j01j74J81j56L2j60J08K94k17J10j49
2486a56J20j19J54J30k01J19R2Mk2k03J50O6k44L11J0l17J97q7K30j65j99J51
2508B1l08L69l13J03R3j19o9J80J43n2q3k2K01j77J39j40m7j04L46ml26M96k99
2531B8J35J24l60L30k73J31o8r9n3Mn7l9n2J08n4J59k07P0J79j9k82J27L27Nj89
$$ y = [225, 154, 196, 240, 248, 34, 128, 55, -20, -63, 79, -192, 28, -153, -37, -183, -316, 62, -202, 70, -59, -108, 93, -68, -14, -33, 159, 332, -69, 252, 203, 98, 137, 173, 176, -74, 167, 257, -144, 77, 230, 105, -240, -255, 43, -153, -4, -282, -179, -174, -237, -151, -287, -68, -168, -147, -148, -141, 77, 335, 68, 35, -80, 127, 52, 281, 163, 192, 106, 74, 193, -127, -121, -204, 97, 64, 10, -229, -279, 161, -178, -255, -22, 15, -85, -33, -252, 68, -136, -81, -104, 181, -39, 224, 154, -93, 118, -92, 232, 88, 140, 72, 112, -151, 227, -6, 76, -25, -199, -18, -174, -142, -302, -194, 100, -117, -7, -156, -36, -155, -1, 129, -72, 47, 139, 143, 121, -82, 68, 134, -110, 201, 211, -106, 91, 4, 234, 69, -130, 21, -287, 82, -231, -128, -35, -154, -223, -43, 100, 48, -35, -57, 144, -33, 106, -34, -81, -185, 161, 157, -169, 327, 28, 163, 287, -73, 257, -16, 115, 47, -52, -105, -101, -158, -197, -249, -141, -195, -36, -243, -173, 6, -13, -295, -168, 159, 164, -25]
2556b5J3j4N2p5k25L07j01K90k85J03L3M5j40J08j56k24J01J98N0l2j24m8O6l4
2580a17j2K2R0l04L48L9j2j73L8L6L73q1L8k37J56j43J48j44j67N49k82k13J81
2603A33J13m15r3K03mk14M9L65j92j98j61M88k1j15J9J65j01K5j8l28N18j07J65
2626B76j03j19m8J44k01K91j33K7j51j15P6N5J72l08N0j36J40M1o2j93M82m15
2648b30J97J38k49K58j17R8M8q7R1j18J58j71m3J19R4j12Pj39J5J4r5M9K46m27
2672b56K91m4j03j18j5r7J98j49M67j47k35K00J21j82K70j8j40P3J33k08R8pK9
2695A61j30rL0O5j13Kq6o2j96L10q3J10k10j09K42j42Q3j9J10K8j07L7L81k67
2719B6M6J15N8l8j06j38R5J40J6R9m22J39r5N5K96n87K05L1j06J22j83j24M10
$$ y = [-25, -12, -26, 26, -49, -274, 33, -68, 222, -63, 40, 73, 118, -22, 86, -70, -294, -193, 5, 55, 23, -101, -149, -83, -117, -129, -107, -17, -321, 27, 66, 54, -119, -81, -45, 328, 247, 285, 48, 204, 61, 209, 65, -102, 447, 165, -48, 133, 246, -169, -262, -59, -63, -277, -228, 137, -55, -253, -414, 74, 53, -62, -43, 122, 21, 46, 28, -300, 218, 111, 276, 173, 54, 6, 150, -51, 240, 107, 134, -17, -132, -56, -1, 171, -137, -87, -223, -83, -42, -104, -297, 185, -230, -33, 105, -144, 114, -3, 95, 143, 56, 147, 29, 187, 16, -27, 92, 186, 74, 81, -58, -43, -29, -124, -75, 171, -256, 35, -9, -112, -230, -245, -342, -144, -293, 174, 27, -208, -8, 113, -69, 201, 183, 43, 116, 249, 41, 139, 132, 161, 31, 22, 52, 117, 4, 6, -80, -142, -338, -28, -111, -1, -211, -320, -78, -220, -137, -156, -46, -18, -125, -88, 293, 26, 72, 187, 245, 207, 101, -37, 58, 198, 214, 313, -109, 30, -65, -10, 286, -301, -96, -65, -171, -49, -232, -356, 54]
2742E4j33l8j7r9K27Q0R5j06j51K06M9O2k19Q5K7N8j80lK05j18j28J88j43J20
2766A21j29j73p0P4N8J64k18L8J29j93L76k94n1K94m5K5n2K36l01J11L5J45m07
2789a27K33K04l67K97l30RN8j19R6K72j84k03j41L03k44L68k05qk15J15R4J04
2811A0j05K28m6L4r9P4j52K09o1j5K12r7r9K97k82o1J98j89p4J3o1PL1J33o7j13
2837g5k15J66J06J08o9R3k3n7m5LJ78j59l67N57j74K42j42Rn8p6J71k26O5j35
2861a23r8N70l89n8n4j9J74m9j30J94n7j23K36O6L3j90q2Q1k04M13k25p4J81J29
2885B02l43J02P3j65K34q8QK20m73M79j66m72K43l3r4J76m2k60L17J4O0k10J11
2908a07o3L13o3L9Pq2K94k87J38p0m9j09J71o1k52L28k4Lm7K0m3k65L03r6K71
$$ y = [54, -79, -117, -134, -233, -6, 74, 169, 63, -88, 118, 167, 229, 10, 95, 122, 180, 0, -3, 202, 84, -44, 144, 1, 121, -8, -181, -251, -177, -119, 45, -173, -135, -6, -199, 177, -117, -168, 126, 81, 106, 54, 290, -11, 100, 135, 280, -127, 106, 310, -57, 240, -90, -81, -23, -142, -46, 226, 42, -161, -302, 1, -243, 125, -80, -88, -303, -188, -94, 10, -95, 133, 87, 121, 22, 96, -56, 153, 92, 77, 289, 192, 93, 390, 108, 47, 245, 56, -18, -5, -66, -59, -28, 105, 38, -75, -290, -124, -18, 90, 21, 114, 91, 34, -11, -8, 170, 11, -356, 201, 27, 269, 127, 136, 78, 2, 173, -53, 12, -123, -221, 349, -40, -98, -152, -171, 3, -46, -176, 18, -39, -162, 74, 140, 173, -17, -99, -18, -222, 191, -34, -108, 73, 202, -141, -39, 34, -131, 103, 15, 23, 243, -230, 249, 83, -389, -146, -179, -273, -97, -139, -399, -82, -68, -8, -218, -107, -170, 143, 80, 119, 126, 44, 338, 51, 189, 119, 70, -39, 132, 71, -181, 147, 123, 126, 79, 99, 56, -209, 94, -2, 269]
2933B69n63J13J21n2K96l48J20q1L33k63J48l01O8L73r3j20M18k88j00r3J03Q7
2955A47K2j7j38J93n3j76m1m2M4ok11M8o7K69l12N2J16L60k37MM1J42Pj26K53
2980B72l58J56k6k9J8l8J32Qk47J56j93J22J15j46Q7k11k7K42j65l7O2J58l53
3003c02R4j4J58J31k37J99K20k32j7J41l2L42n17K82J9l57K07K5r2N9ml34L48
3026H7l30O3J51m06K74j39K01n4OR1J65k95J67Q6Kj42K6Q5K71r3k32J45o6j25
3050f2K34k1Nj60L7j52K6K26k07K04k40j21L80j70j08J37O2j54lJ6mP6n1j13L05
3075A42M9k95OK09m2N1pJ11k02K5J35l09J10j53K55k06n5K96j00K68l80RJ53J6
3099H6n55K99J74j84j14L96o5k5K51l36k45K02L01j16j04lK18k20k8K10j00m3
$$ y = [269, -294, -181, -60, -112, 184, -164, -44, -125, 208, -55, 93, -208, -140, 233, 140, 20, 438, 150, 50, -43, 60, 147, 169, 152, 14, 207, 154, -22, -63, -105, -61, -67, -278, -230, -297, -28, -340, -288, -172, 188, -49, -45, -4, 138, 145, 19, 272, -86, 70, 44, 15, 33, -5, 127, 135, -112, 44, -149, -27, 88, -58, 29, -182, -209, 33, -132, -169, -107, 51, -302, -208, -222, -64, 67, -170, 29, 249, 17, 0, 141, 109, 451, -66, 216, 235, -122, 85, 110, 18, 77, 73, -261, 87, -243, -180, -29, -435, -161, -300, -99, -153, -147, -56, 109, -186, -19, 67, 69, -73, -47, 38, 309, 216, -16, 129, 63, -62, 172, 151, 156, -4, 33, -119, -93, 133, -74, 130, -110, -231, 149, -21, -129, 8, 70, -84, -87, -71, -75, 1, -50, -163, 142, 191, -104, -98, 111, 69, 120, 113, 224, 22, 47, 182, -127, -17, -170, 85, -121, -176, 120, 20, 288, -92, -83, 70, 86, -469, -170, 4, -180, -294, 102, 37, 12, 263, -73, -318, -116, 185, 69, -35, -38, 180, -40, -68, 142, 42, -1]
3121al41L48j58J93l26O5J41j12K09J23o5l14L14Oj64R2K73j73j36j72L03K3M6
3144A74j03P2j32J53j00n8j17p2K05J10k23O4l49K12q1L95l18L13k56m6J15j30
3166a72q9M30m3j34J35M3k44J81M10m11O6j89p7L45K6l42K26k4J9k46j26k3M80
3189B41j71l08J92J65l06J22O7K02j82l9KR8k64L8L13k99K43j16j2K85k16O8M1
3212A64j82n9O9O0o1r5R3N4p4J4j32q9L90k83J14K33M9m99K96j05p3M15j07q3
3236A09j75K50K79o18M56J19l62qJ61N0j95j5K9j78j3K06q9j67J57L7j41R1k73
3259b90M29k94K4N1M2J74k80O6K4K16j14l9K17k07qL17m19L16L5m17J62k4PJ14
3283A02k59L30m40R1J21l29L72j06M8Qm8L8J16r8r4q4M85p8j09l0P2J62j21m4
$$ y = [-1, -342, 6, -152, 41, -285, -220, -79, -191, 18, 141, 76, -238, 76, 82, -82, 10, 283, 110, -26, -198, 105, 128, 174, 71, 143, 11, 164, 64, 6, -111, -183, 22, 132, -91, -27, -376, -164, -245, 150, -168, 145, -111, -157, -42, -172, -261, 169, 126, -8, 127, 170, -74, 107, 517, 106, 172, -17, -94, 251, 277, -65, 161, 137, 156, -90, -216, -239, 241, 70, -238, -46, 119, -187, -65, 2, 204, 22, -17, -15, 83, -181, -143, 170, -129, 114, -2, -14, 271, 55, 123, 164, -18, -77, -8, 52, -9, -104, -11, 43, -31, -17, -149, -238, 152, -131, -17, 216, 265, -234, 62, -43, -116, 299, 192, 109, -66, 184, 463, -155, 301, 420, 58, 50, 211, 261, 66, 51, 80, -98, -111, 95, 6, -161, -4, 33, -108, -17, -290, 139, -155, -131, -80, -38, 136, -144, -78, -54, 162, 48, 9, 226, 19, 11, 328, -91, 225, 260, -157, 5, -19, -12, 102, -157, 173, -267, -176, -55, -384, -12, -118, -70, -62, -110, -72, 44, -54, -148, -232, 253, 175, 66, 36, 108, 270, 149, 105]
3307A05N8K2k51q6J36K54m27K82r3L6n2J6j9OJ2l61K64J27j8j48P9j60M86k54
3331A4Q8rN4Q8j19q7K82k6j28k69Q6P5k45K03j87K57m4J07j64J12j26m6j88M72
3355B00j31Pk13j51M77L3k57j03J20J45l4k36P1J0mj8L66k78K53l4k86J67k44
3378a40J59J57j55k26J57R3J95l62J07Joj74K13K54l97J97j21k13M58j70J95k04
3400A8j12J2J20Nk86J24K46J0j47Q4k40K75L3o2j55k0PO6J38l36M34l28n6K66
3424I6j37P4q8J43L4p6P1N9j27J21k17L4oJ76k68J90k56K75j93L30k82j15J87
3447B5n16L53OJ18q0M07k80m8k77K96j58J52K6j97K41l3N4j94P6J2L7J2K44j4
3471B62l64P0O7j55K65k43p6J58o8L5j47O6J36l59K55K12j41k49K21j64L14j59
$$ y = [105, 163, 185, -66, -152, -16, 238, -189, 93, 0, 36, -16, 0, -19, -13, -1, -362, -98, 29, 11, -137, -58, -218, 268, 14, 102, 93, 147, 235, 116, 29, 311, 285, 157, -112, -26, 49, -196, 7, -180, 77, 33, 140, -24, 88, -38, -84, -272, 200, 69, 76, -137, -288, 189, 222, -35, -138, -18, 127, 93, -143, -72, -62, -66, -84, 282, 4, 257, 223, -63, 104, -140, 19, 176, 21, -205, -48, 45, 240, -122, -15, -14, -20, -194, 19, 273, -124, 73, -48, -261, 197, 27, 222, 18, -94, -82, 38, 43, -243, -119, 127, 137, -10, 74, -166, 109, 142, 80, -75, -95, -88, -22, 116, -220, 214, -114, -170, 96, -41, 33, -55, 88, 122, 46, 117, 176, 49, 170, -47, -13, -19, 157, -111, 79, -177, 98, -95, 235, -47, -162, 25, -491, -138, -132, -14, -94, 313, 33, -15, -292, 4, -154, -2, 24, -173, 68, 35, 89, -105, -29, -17, 20, 32, 276, 262, -102, -32, 35, -120, 145, -98, -174, -16, -84, -49, -196, -130, 6, -353, -98, 114, -27, -276, -55, -219, 95, -64]
3493f4J5K95oj42K9L2m2J52k46M1R3m7k62Q2L26k67J1j46Q1N0K1j68J11M9k0q3
3519a05j14K10l1K0J3K01j48k44P4J06J58j10o4M04j61r2Nk45K05k40J68J00j67
3542e7n7%J50K4l55O6J88J38J90l45j78J83J18q3J60nj34J54K5j42J1j12p6L87
3566B50j13K1Q8n7j93j14Q7O8j10rK7N3q7p5J39K88m24P5j27L24j59K95j09J2
3590A50j50m6K15k74K7J02J73j21j0J37j26k4L9j90nJ93j5j61qP0q4J2p2RL0L48
3616B19k56Q1K80k54j14oK51q5RkN3j28j16M49l10p2km5L36j29q8jn6j74K35k99
3642b24J1J13m9R1O5J8j95k2J89J84j80Q7j04J9Q7Ok2J5k37K99N4j85j19K92o4
3667A29j74Q0J10O2j29j66O8M9q9m3J28q6M0j64J92%l5K7j63K07k0r3L29q4n1
$$ y = [-64, -49, 246, 240, 98, 127, 159, 117, 269, 23, 64, 157, 110, -152, -70, 256, -11, 0, -146, -65, -15, 6, -162, -51, -2, -22, -105, -219, -9, -40, -20, -7, 194, 46, -198, -124, -18, 140, 30, -34, 370, 209, 117, 122, -123, 82, -158, 10, 110, -57, -114, -114, 36, 60, -295, -229, -41, 97, 287, -58, -236, -53, 65, -18, 142, 137, 3, 157, 182, 40, 51, -61, -137, 250, 137, 158, 246, 189, -4, -118, -31, 37, -73, -82, -55, -2, -89, -164, -25, 263, -161, -86, -213, 111, -48, 247, 138, 150, 0, -46, 169, -105, -78, 24, 197, 76, 66, 203, 77, 53, 92, -98, -103, 90, 75, -86, -94, -24, -108, -96, -168, -159, -129, 219, -37, 44, 324, 70, -44, -50, 201, 116, 125, 123, 176, 48, -68, 381, 71, -1, -3, -48, 288, 159, 71, 70, 14, -160, 75, -224, -213, -100, -149, -58, 7, 25, -170, -192, -3, 181, 1, 88, -16, 3, 90, 96, 74, 89, -148, 151, 205, 20, -99, 193, 129, -45, 35, 145, 207, 78, -88, -20, 29, -60, -103, 25, -61, -21, -185, 7, 7, -28, -1, -164, 43, 23, -70, 259, 175, 124]
3692A24m04L06M3Q8k37L17r4j71J20l6j67o5m1L31k47J59j95J07K58k94K65k09
3714d2q7k2K35K09j73r1j67K07r5q7K25J70j28l0n9K33j60N2k30J28q1J0M6j71
3738a08J0K17n4k14K33m06M83k29o8J37J45k9l04L77KJ2l11J66l47K15K25j61
3760iK10q5J72k68k9O6J6l3l2m9Q0j25L71j94j03j64J94J96k52J15N4l0K9l66
3784b36M37lj42m2P8r4K90k33j70J77k17K72k95Q1K7L9K10k65pj07J57k34L68
3807I1j65j19J08k70L79p7P5qMN3K11p5Q3m18J88o2m9k6L11j05j26J07J7l62M01
3832A66j07p5LJ25J18l23r6J01J66O9p6m39P2L33q8K71j70k3R2p4J19l6l98L95
3856A25J7r6J18k25j52K32j83J47n6K63k32K43j10m5K32l87j13P9M36n06N3J3
$$ y = [124, -280, 26, 69, 157, -80, 237, 143, -28, 92, 56, -111, -176, -217, 114, -133, 26, -169, -62, 196, -98, 167, -42, -129, -151, 84, 293, 120, 29, -138, 69, -26, -113, 112, 282, 154, 124, 65, 298, 138, 190, -40, 88, 7, 17, 63, -108, -98, 119, 65, -149, 84, -322, 161, -68, -136, 1, 146, 117, -187, 190, 192, 204, -107, 59, -288, -73, 152, -9, 201, 116, 288, 20, -9, 57, 73, 40, 8, -41, 39, -86, 285, 91, -12, -176, 18, 214, -38, 77, 131, 101, 130, -236, 201, 198, 56, 14, 92, -2, 288, 55, -115, 62, -155, 117, -178, -97, -70, -31, 179, -86, -93, -200, -43, -277, 91, -74, -193, -85, -355, 24, -53, 22, 14, 18, 71, 282, 207, 290, -128, 60, -2, -51, -77, 234, 129, 3, 110, 127, -235, 166, 59, -16, -13, 112, 230, -93, -189, -88, 78, 147, 71, -368, -296, 37, -51, 220, 50, 27, 119, 45, 164, 128, -270, 125, 142, 46, 164, -61, -213, 19, -164, -17, -73, 190, -42, 201, 91, 46, 278, -109, -222, -143, 293, -213, -160, -147]
3878a47J08J90l55J96j56J28K07j75L3J04j69K29k89L68k66j55k6J90K28k17M9
3899G5l10J41K17P7j75N3J8j3J11l87K77m3l1N7K1rJ83k18k7K49j45k55O8J4K27
3924A75m02J62K4R0k8J05k41J67L2j75J44l88L67k00J40N6j23lO5k14M30j76o1
3947e4k3L17j81l5j00K00R7l81J8J05M34l56m2o2P7L5j57k15M02r5kn2J44l20
3971b46N0ON10n29J46P5o%K34m18K83o9kJ90J2q6k33J62R3k94J62J80l22K61l85
3996b26J65J63r1K59n14J86M57m62K7J09J8j38J41o8Q5O7j84J0j23J18l0l5M11
4019C45l60j20J94J69n12N2M12q5k4j89l5K99j31J1o8j1Q6j57J26r8J37r0PmJ07
4044F1O1p4j05k4j26J33j35Q9M00l04k9m4J04o9R7k34L20k73R7q0J88j62J72J81
$$ y = [-147, -39, 151, -204, -8, -164, -36, 171, -4, 29, 133, -36, 193, -96, 272, 6, -149, -175, 15, 243, 26, 75, -235, -94, 123, 200, 25, 78, 96, 83, 194, -193, 84, 41, 10, 67, 88, 79, 262, 44, 17, 266, 121, -134, -66, -52, 175, -227, -65, -41, 49, 21, 126, -115, 52, 84, -91, 53, -335, 32, -168, -28, 28, -95, -98, -33, -247, 183, 7, -54, -77, 240, 59, 24, -76, 124, 221, -160, -142, -37, 397, 41, -1, -63, 14, 49, -108, -323, 79, -16, -18, -70, 74, -246, -196, -190, 320, -209, -63, 12, 6, 6, 240, -178, 105, 36, 34, 224, 236, 150, -83, 79, 172, -122, 40, 220, -102, 159, -226, -61, 102, 11, 270, -244, -58, 399, -63, -36, 73, 91, -47, 94, 26, 111, 178, -6, 4, -119, -1, -31, -66, 345, -15, -135, 59, 228, -284, -232, 180, 95, 71, -118, -153, 146, 15, 26, -42, -53, 33, -124, 2, -96, 41, -49, -42, -46, 61, 122, 48, -57, -81, -207, -74, -209, -120, 280, -24, -53, -97, 7, -62, 35, -199, 121, -152, -55, -135, 53, -109, 63, 244]
4068B44l38J22J6J57l60P2J46j8J31k3J06j83j84J48K26k27J66jk83j69K61O0
4090F9j78J88M9M7l28K73l39J1j3L77l02j02K93j29r1L43j04j9o4r3K1J36J27
4113A72k54J09l8J01N6j43p7J34p8J70k86K3j74L49n9RM4j46J1P5K2J05k91j8
4137a84J76m5k2K36k41Q7k16M55j58j02J1N6Q8k19K23l35L21k73J43KO8k89J04
4160a14L75k11J43q3o1k74L81l23L14m43N5K55J65k35J86Mj41K29k39L9J72n9
4182A35j32L2J15k31n9K29j79k04K61j16J98k96J82Q2j05j77Q1J4M10n03K60O1
4204E8J00k20J68j94J07J50l88K62J2J3M1K6l4j67L3K39k72J90k14J15j60J65
4226C0J64j82p8j23K66j18P1J25l9M6k45O0l7J21MK44k9l61M86l09N3J7kl9l94
$$ y = [244, -94, 28, 44, 201, -159, -87, 59, 41, 172, 149, 255, 72, -112, 36, 262, 35, 201, 200, -83, -252, 9, 69, -109, 79, 128, 175, -153, 120, -219, -208, -221, 156, -146, -248, 45, -84, -175, 168, 64, 45, -19, -112, -91, 45, 172, -82, 27, -11, 90, 146, 3, -74, 60, -18, 152, -134, -111, -285, 64, 5, 14, 58, -88, -77, -2, 20, 125, -166, -184, -8, -53, -75, 161, -80, 7, -209, 246, 88, -14, -3, 53, 141, -78, 145, -190, 131, -142, 1, 3, 71, -218, -114, 261, 50, 193, 110, 49, -225, 156, -167, 147, -296, -241, 14, 179, -56, 130, 134, -7, 222, -17, 22, 194, 135, 3, 35, 150, -81, -140, 89, -90, -294, -33, -149, 49, -247, -65, 17, -88, -265, -184, -170, 240, -263, -3, 58, 158, -62, 106, -88, 19, 169, -219, 43, 55, 68, 109, 135, 101, -66, -33, 206, -66, 124, -90, 25, -135, 30, 194, 12, -66, -189, 77, -41, 30, 155, 116, 162, -83, -23, -60, 61, 65, 309, 280, -81, 405, 96, 149, 166, 164, 125, -269]
4251b69M99j18j3O9k20J15j00jP8j74n6L07q6q9j3J5J68j86j08o2R9K15L03k24
4275A49m9L0%k63R0K41l6j80K37j31j31R0R5l63j04L16K2l73K98J31l66J71J03
4298b3o5J59j94M19j76k37K88l21L12J30j64pj65J87J49m87J58J4J86l6l22j1
4320b06L23j42p1K70r7Pp7j12N3K97j13k8L1j14L4j36K60j37L6j54L21j06k24
4343h5L38l86J75j38N10l85k80K9J58J57k97O1J88J43j76J18j5r1Q5k70J84n4
4365c1M3J51j69J29O3k61j6K09k7j63q0L35k72R9M3O7N8j09k51K84p3J3j42L87
4389B87m56K85O0m69L06R3k83K42j1P4j71jj03K99j31q9J21k0J37j29J47p1p5
4412D2P3pN3j38p2lk0L8J61O9k29O4k4n6j95K85l06J82J32o6L25m29%J01MQ8J05
$$ y = [-269, 230, 112, 99, 168, -52, 63, -37, -38, 40, -134, -190, 117, 31, -58, -71, -56, 112, -74, -182, -244, -145, 70, 373, 149, 100, 130, 130, -133, -43, 198, 162, -18, 219, 88, -43, 47, 142, -221, -325, -9, 13, -360, -62, 69, -297, -126, -23, -88, 71, -123, 296, 120, -117, 171, -150, 162, 292, 128, 121, -44, 143, 292, -195, -37, -23, 163, 127, -195, -206, 117, -25, -96, 174, 77, 84, 7, -105, -52, 245, 132, 104, 135, 21, 55, -81, 179, 42, 78, -76, 245, 139, -85, 253, -133, 42, -96, 414, 29, -251, -222, -64, 93, -204, -143, 45, 188, 12, 130, 115, 24, 109, -161, 23, -31, 12, 163, -6, 123, 186, -75, -91, 118, 91, -72, -152, 183, -89, 10, 53, 120, 178, 69, -182, 102, 29, 42, -100, 287, -169, 116, 176, -293, 13, 106, -177, 65, 54, 128, -43, -44, -147, 152, 21, -68, 53, 33, 170, 41, 188, 117, 42, 115, 108, 161, 23, -49, -52, -72, -34, 127, 196, -33, 31, 7, -49, -244, 41, -265, -83, 49, -17, 308, -121, -121, -20, -16, 72, 177]
4439A77p8k59J80j17K38j99J7J23Q1K00m15k10L96j98n3J34J16k08L9P4j34k05
4461c01K13K02j08J17J56l48Np3m7K62L7k28Q1K92k19j9J98l19K54k48K11k7j15
4484b4K56k13j3Pj2K4m6n3PJ13o8J46j7j48J50k83R2K32l12K32l3J65j78j60L07
4509A71k04J02q1Q1k90J94J50l34k1K77k94J44K59l35J78j07j56L48K14n40K77
4530C3k25L7K66k73O2M05l68L10j75j18k0K46l44J92L7j24K00k25J18j79J80l0
4552Ej81M4J26k78K97j56O9q6K40k81K15J15k60J24n7j58L13J23j83p7m9q6L39
4575A58J27j63j12N3j84J88r4R0K08o04K00Q1N6j5O6j20L17j32k15l5L34o9j08
4598B7qQ1l21K49j42J01R1j50J74m5j71J6M64l81P5K23j95j60j02J44m1l4K8m0
$$ y = [177, 99, -160, 20, -97, 141, -58, -41, 82, 163, 363, -52, -262, 134, -64, -117, 17, 133, -75, -36, 38, -96, -301, -88, 114, 6, 123, 279, -69, -64, -137, -184, 78, 115, -113, -32, 260, 41, 22, 220, -99, 155, -93, 118, 91, -24, 232, 19, 6, 13, 1, 25, -21, -74, -67, 46, -22, 124, 107, -41, 109, -174, -82, 150, -162, 70, 37, 202, 24, -136, 171, -33, 69, -12, 69, -221, -27, 123, -211, -232, 45, -249, -105, 154, -181, -3, -110, -266, 82, 296, -244, 33, -192, -155, 111, -162, -100, 305, -63, 247, 72, -46, -66, 180, -164, 28, 65, -59, 141, -84, 34, -145, 35, 5, -176, -132, -6, -284, 13, -143, -74, -160, 80, -201, 14, 129, -131, -7, -64, -222, 91, 214, 31, -46, -95, -181, 158, 285, 122, 10, 63, -121, 67, -27, 63, 271, -333, -133, -52, 4, -11, 55, -65, 252, 120, -95, -130, 204, 135, 27, 19, 100, -221, 28, -114, -13, 78, -72, 102, 57, -114, -98, 366, -15, 60, 283, 88, -72, -174, -30, -71, -105, -77, -117]
4622a17o0J67J50j17J1N9k04l6J8J33Q0l3m3Q4L6n5N9j99o6L95j91J67k95J49
4646I2m9M3j42K35k38R6R1J91m09r4J78J07J72m3J0k52J27M4j25K7j56J10J33
4669A48j80J26J56l32R0J54J03n2j44j47L8Q9J10m7l16K61o0J22j85K44k96J78
4691F0J35n55K12J75P6p6k09K33j27K4n6pr3Q4K18j25P2j51K70k29j20K57P7p9
4715F6J0j48J54K32m24j9K00N5l46K44k0l61L38k10L28j20K85k86M20k99Jq9m0
4738b9L8J52k51O4O9q7r6J12j32O8J90j25K1j40N2K41n2q2O4j40k0J16k03L18
4762A48k97J89n8J73j52Q0j71M2j88L02j73K2j65J57J73J06n54M99l25J0J39K30
4784A87l74J83j70N7M78l87K9p4OK76l08L5QN3J16k99L15kk24J51J3l7P3kk23
$$ y = [-117, -177, -10, 140, 23, 34, 93, -111, -147, -129, 4, 84, 51, 8, 92, 128, 73, 132, -67, -133, 262, 71, 238, -57, 92, 43, 86, -56, 179, -59, 37, 128, 319, -90, -184, -6, 101, 273, 230, 240, -12, 115, 159, 34, 61, -95, 15, 148, -32, 94, 250, -82, 8, 162, 265, 213, 69, -78, -40, 49, 159, 112, -204, 57, -3, 119, -66, 178, -118, 60, 195, -360, -148, 27, 103, 27, -182, 51, -76, -52, -108, -115, -208, -124, 94, -31, 41, -110, 160, -69, -189, 68, 145, 66, 76, -72, 82, 314, -110, -129, 71, 126, -220, 24, 4, -357, -19, -229, 99, -21, 264, -22, 398, 99, 100, 11, -29, 9, 161, -90, -26, 43, -44, -140, -28, -160, -92, 98, -27, -6, -146, -94, 147, 95, 13, 77, -63, -83, 33, -170, 148, -149, 40, -18, 155, 3, 83, -88, -46, -234, 68, -105, -83, -248, -91, 82, 188, -366, 133, -192, -182, -43, 187, -187, -4, -174, -117, 361, -26, 3, -71, -65, 211, -97, -62, -54, -1, 115, -184, 131, 129, -95, 56, 69, 32, 105, 103, -120]
4809a20oK24J63k34L2J7j20J10l12K80p4K10k18n9J5K8q4M27m25K05j33J88l53
4832b39K65J21j05M7j32qO7M8q7%n7K01k93J48R1J09m73J83J78q5j6j40m0L40
4856A23r1j44P4K18j89MN1q0K53l90L67l88K13L3o1J36l37L3R0J62k56j0M39j1
4880B39n90K60J27j56m3M5J97l26O8J46K34j61J75j14k30R5L5J0O6l93K68j8J41
4903G5k72L47k48J32J04k79L33j95K82l40M3q3j11K99p5k3j07R0N1Nqn0J58n9
4927F9k5j44l0K52j79m5M3J36m7qP2n7K12J07k17j84J59k69P7N8q3J07J20j02
4951B2k09J47M1N9O1j14n9K34l03K84j1k18J13k3p7P8k54K41J50l2k8j00N6O1
4975A19J0m55N10l56K97o5R6r0n6J1K07p7j64K65p1l72J85j24K06J60k03k46L22
$$ y = [-120, -126, 98, 261, 27, 59, 76, -44, 66, -246, 34, -40, 170, -48, -107, -92, -64, -148, 279, -146, 59, -74, 114, -239, 26, 147, 42, 89, -43, -51, 16, 64, -23, -23, -80, 121, -172, -24, 67, 176, -297, -114, 64, -21, -37, -177, -217, 123, 32, -112, -38, 180, -9, -5, 46, -34, 219, -171, 196, -192, 21, 54, -7, 129, -208, -175, -85, 77, -179, -189, 250, 239, -351, -91, 36, -120, -163, -118, 79, -247, -179, -33, 201, 40, 215, 101, -129, -34, 1, 11, 77, -316, -48, -66, 75, -197, 150, -98, 34, 138, -141, 192, -3, 279, -61, -18, -101, -212, 87, 12, -11, -118, -28, 23, 28, 20, -30, 128, 69, 44, -100, -130, 122, -57, -102, -59, 77, 30, 22, 94, 37, 249, 356, 139, -45, 114, -155, -78, -20, -103, 4, 124, 22, -187, -40, 1, 60, 121, 7, -52, 182, -121, 163, 152, -66, 47, 24, -53, 25, -229, 12, 162, 130, 102, 2, 58, 119, 129, -326, 184, -172, 125, 60, 156, 66, 10, 21, 228, 151, -13, 252, 181, -191, -6, -130, 76, 236, 33, -213, 109]
4998A09j40r6r0J22O0JJ17j55R0k61K42J41k82L01k17L30k51J13j08J46j87j40
5020a55K79k76K01%j27K8K25k02J03k32K0r8M14k41R6j41J58p2Q8l33L46o8Q3
5043I6j90N2L1K05m01L13q7J68l87J36J17k0j85J2R2n9K04l1O3j14K03j66J02
5066A54l01J00o3K12K4k37L1J41j67l8J17k1j97L92k45L02l76L05j22K3K6p3J16
5089A03M0j80r1L23j96k52K78j05K32j85j43L98l14J06j9l6R8K9k74Q7K10k18
5111a09k6K50k65J97j39K73k09o0J93k47M24l14o2j08K07n2KqJ48j51J69m8j22
5134e7MP4O5j5j7k39J05O1K2j35J11J05p2J6q3k6J91m1j40K45%m4k72J72J20j42
5160Hk5o9p9L9lJ95n4J76j04j09j59J49M2j33J19M6k55J98K0j13K08j64O9oJ47
$$ y = [109, -31, -127, -217, -95, -35, -34, 83, -72, 18, -243, -1, 140, -142, 159, -58, 272, 21, 134, 26, 172, -15, -155, 124, -152, 49, 49, -78, -50, 175, -27, 76, -156, -136, -234, 180, -61, 35, -106, 52, -20, 68, -265, 81, 13, 96, -94, -42, -11, 194, -207, 106, 19, 187, -200, -64, 53, 33, -152, -140, -48, -107, 97, 66, 129, 15, 218, 52, 154, -147, -47, -110, 102, 126, -111, -80, 61, -106, -144, -27, -48, -245, 147, -98, 204, -172, 133, 11, 34, 60, -13, 103, 143, -37, -128, 195, -1, -253, 25, -80, 152, -33, -176, 222, -92, 14, -5, -41, 57, 86, -188, -101, 109, -109, -135, 115, -150, 47, -92, 181, -28, -88, 105, -142, 282, -32, -94, -202, 5, -47, -45, -53, 95, -56, 113, 65, -57, -53, 21, 86, 71, 54, -185, -80, -19, 3, -132, -21, 84, 12, 28, -55, -81, 110, 69, -71, 174, 174, 130, -142, 30, 150, 8, -17, -86, -165, -126, -129, 66, 12, 188, 84, -25, -184, -35, 7, -126, -7, 39, -216, -18, 2, -111, 97, -67, 2, -4, 143]
5185A43n5j19P0l4j77K70k66M27j55K4J41l90J60J24k95K2L23j29J3r5K17k15
5207Dm4J29p5l8q0J48n0Q6J25p2j56Q0J9R5k41L4j94K46l4J50J48j40J25l63l0
5232a28L66j12k77J13O7qn4k76K06K40j99O7j17L4j32J63j8J5K77j23l17K72m3
5255A6p2j8O6J93m15K42j86K24r1J39Q4o4O3k77J27oR8j2O5k99R9j20J18J69l9
5280A04j89J68J18k06j00J19j50k9J46J22j82J39k47N28n34J60k58Q0K08j90L33
5301A40j96P2q8J68m8l40K45K09l14L55k54K85j28l22K68P8N1m9o2m7q1J55q3
5324A4k14P8N0j82L26K65k86k37J79l9k4k6L2j63p0J86R4K22j15j61P4p0K39k02
5348c0J2m7P7j88L67j27K4j48k1l4J35q7L5m0j45L36k2p7k3m0j70K15K49j34J21
$$ y = [143, 88, -31, 39, 5, -172, 98, -168, 259, 104, 128, 269, -121, 39, 163, -132, -110, 213, 84, 97, 2, 219, 4, -40, 89, 14, -24, -104, 44, -6, 80, 205, 133, -23, 57, 76, 171, -70, -36, -230, 16, -18, 132, 280, 140, 265, -98, -128, 238, 126, -151, -38, 29, 21, -33, -309, -103, 137, -62, 5, -112, -78, -210, -47, -65, -50, 227, 104, -213, 59, 16, -56, -74, -8, 185, -230, 12, -174, 50, -41, 98, 182, 118, 181, -96, 31, 25, 123, 111, 176, -123, -24, -144, -26, 143, 104, -85, 83, 201, -5, -105, 14, -136, -165, -19, 103, -79, 60, -187, 341, -193, -33, -291, -211, -3, -193, 140, -56, 16, -72, 96, 48, -292, -47, 162, -152, 203, -51, 234, 106, -216, 52, 130, 181, 132, 70, 23, -58, 97, 14, -200, -122, -72, -254, 72, 337, 51, -186, -7, -46, -70, -96, -64, -227, -297, -111, -17, 205, 90, -71, 3, -67, 172, -30, -18, -65, 12, -176, 191, 64, 88, -60, -81, -115, 20, -67, -32, -72, -217, 119, 97, 20, -3, -43, -213, 2, 251, 117, 238]
5373B38k74j2J74o4o0n0lJ0K74j9k35j54J96J42m63K12k9O8J73k15J45j54Q2m0
5397e8L40m66K71j12K64k77q4K83j96O1M4j31R8k3j05Qj44J67O1j3N5K08l23Q0
5421HP7j64Q7J42m7k48K34j82M1R5J02k7l3j96J76j44m9N56m04J52J63l31J26
5444A34J82l28N7K3Q1N9k05P0p3k5J4Q9j22J63l4J03p3n0j08J3J18J83j54o4k57
5469b04M65j69j18M7J08k29K42j06j89K65j97K09l95J86j72K76P4K5n1K21k43
5490D5P9j92k07K57J49O0k22L2k30J53K12m9k7q4k9J26j9m84L98k21M20q7J13
5513A93mk59K58k72R8j45K43j90J27R1k04k18L82l3J03J19k20k14J52m7R5J22
5535A77l03L6K22j83j55M98k80K6R5J56k03J0j28k14M87J9j11j77J74j91o2J54
$$ y = [238, -36, -48, 126, 62, 2, -48, -51, -41, 233, 214, -21, -175, 21, 163, -300, -88, -117, -49, 124, -91, 54, -100, -18, -58, 282, -184, 87, -25, 239, -38, -122, 161, -35, 26, 70, -61, 37, 14, -91, -83, -227, -60, 1, -12, 43, 251, -72, 8, 85, -79, 8, 150, 103, -145, 89, -93, -52, 43, 145, 118, 85, -111, 65, -79, -128, 428, 24, 176, 339, 8, 134, 316, -12, 45, 68, 149, 208, 3, 73, 0, -25, -11, 78, -44, 119, 85, 188, 115, 65, -43, -30, 88, 271, 117, 53, -204, 261, 92, -26, 21, 129, -100, 142, 36, -153, 112, -85, 124, -271, -85, -257, 19, 93, 118, 67, 288, 45, 124, -68, -275, -18, 131, 191, -31, 1, -229, -76, 136, 87, 60, -24, -53, 73, 54, -430, -32, -253, 167, 80, 193, 189, -70, 188, -84, 14, -131, 112, -78, 49, 140, -64, -282, 100, 67, 170, 289, 69, -145, 7, -40, 55, 177, -126, -90, 132, -51, -206, 292, 12, 38, 133, 289, 86, 96, -32, -246, 241, 260, 149, -28, 146, -45, -107, 47]
5557D7j11J84j89J28k34K65k18M01k16l2J09k47K21k22j62J54O9j37M56p7mj25
5579F0K7j93L72k36O6r9k40J19J2jK35j96K06m48Q3J29J43l03J76r3L54R6j64
5602A05M7J3k63r0N91j61l02M7j0O8j8n1mJ32j27l5k4K69k20q8K9J67J13k05l2
5627d9P6K23m35L29k4j51k7O6J21O6q5m1J2n1J55m01K73Op9K8l0j63L52k78K64
5652A57k11j56K68r9j42K18K3m3j04J43Q6j46j8R6k25L20j34j39J14J23j93J30
5674F8k18K97j41M0j02J65r3k06L19j26J31n7j42m2n4K01k02kK53q2r4J55q7Q1
5698F2J99j40j69j5K66o5k06J53k20NJ55l9L08k44j11J52j87K07M8o0k29J64Q8
5721A22R9o19L14K53m4%p4r3j31K43R0j49k63L77l00n7rNL43j09M1O0O0m4k22
$$ y = [47, -64, 120, -69, 59, -175, 90, -128, 273, 57, 25, 134, -113, 108, -114, -276, -122, -53, -190, 266, 189, 185, 60, 87, -106, 266, 30, 96, -3, -243, -124, -112, -113, 122, -74, 132, -316, -233, -104, 39, -264, -88, -181, 173, 269, 105, 152, 165, -98, -188, 403, 242, -60, -13, -23, 45, 27, -24, -28, 104, -23, -58, -82, 187, -33, -121, -92, 75, 188, -17, -49, 27, 250, -185, 144, 120, -31, -58, 8, 129, 195, 110, 69, 81, 30, 185, -216, 57, 63, -16, 12, -18, -181, 171, -107, 157, -54, -210, 58, -41, -183, 35, 58, 15, -89, 54, 140, -6, -24, 72, -153, 167, 33, -106, 8, 131, -62, 68, -150, 147, 6, 46, -56, 109, 16, -190, 129, 3, 134, 77, -65, -107, -161, 40, -162, -164, 89, 7, -87, 68, -19, 62, 261, 121, -48, -63, 203, 138, -68, 85, -135, -130, 25, -14, 294, 50, -61, 91, -96, 111, 159, 99, -130, 34, 122, 221, -398, -84, 169, 125, 125, 51, -42, -173, 70, 160, 11, -252, 125, -175, -232, -241, -236, 107, -2, 39, 99, 159, 115, -107]
5746a07p6R0K85k60j03J71j66K45l60qM06K5o8k42J57jK60j55l16J01J66l79K18
5769a17J99M1k42o6q3K80r3J48o2L4o9j59K73p2J57j34p8O6J6j63J30J44j74q1
5793a05J81k5O5k21J80J01k72K92k17p5J32j05K2K09l34l3M35k54j49R6J42%O1
5816A26k8m7oL2p8j12M3J38k90K82k8k69L53m7l46M85k38kon5nK48j71P3J84k81
5842d5P3K9N8l46R8K23Q0j44L2P4j52J49j17r1K83j68M1o2P5j77j95L25n9k62
5866b78K26nk03P8M1L65l82N9L4m7J78k65o1K04J88l02K85K48l75p2K07n4q1j31
5890a43K75k71K57k95J08Qj28P8K22K1j15j11K57j10R8j1j37P9j11J20j76K24
5912A39j23k17J80R5J54j77k6q5j03J24p9K68m7k22P5J2J57j00PK04k05q7J25
$$ y = [-107, -183, -93, 192, -68, -171, 0, -166, 79, -281, -289, 117, 142, 74, -168, -11, -12, 248, 93, -223, -122, 44, -335, -117, 82, 123, -119, -185, -268, 12, -81, 67, 5, 39, -30, -189, 84, 12, 169, 35, -43, 23, 39, -124, 6, 150, -24, -105, 76, 51, 116, -105, 75, 176, -96, 196, -21, -96, 36, -69, -47, 162, -172, -205, 230, -24, -173, -77, 65, 65, 126, 98, 51, 45, 77, -1, -113, -70, 68, -222, 60, 32, -237, 116, 69, -277, 208, -30, -32, -38, -93, -98, 150, -21, 52, 236, -45, 28, 57, 115, -231, -133, 90, 170, 26, 58, 132, -20, 129, 12, -79, 204, 36, 77, 15, 90, -87, -282, 43, -16, -278, -52, -57, -260, -182, -141, 224, -158, -99, -65, -112, 66, -199, -260, -56, 132, -170, 115, 363, -12, -84, 123, 69, -12, -143, 132, -139, 118, -177, -69, -61, -189, -111, 111, 132, 17, -94, 163, 53, 151, 140, 3, 82, -29, 91, -85, 139, 16, -201, -21, 74, 228, 51, 25, -60, -163, -39, -118, 150, 103, -119, -44, -32, 125, 25, 32, 236, 31, -56, 69]
5935F9J04nk53P2J72j65p8K65o7o8k74L3K07J09K4j72Or0J15P4J42k73j7N2j81
5960a99K26K4Q0p7k9m6Q5k42J73j52J90q0P7o3K94m11J66k59K08n1J13J84p6k48
5984a13J43j9k42KK6J45ql8j27J71J98j28j11P8k85L74J02k80J5J32J37k63pQ
6008i0J32o4J58r4q7n3K20j33j19j9K08J87k91J0O2j54O6N9j56J8P7J57m0k94
6032b40L43r9j15R5p6L87j23k32k8K36Qk27l9J62K28j83r5K2n2K47k15J15q8j12
6056h1Q6J10j36J87j71k9K89m86M30k42M2m0J13j41k31L08J15l80J66j60J36j31
6078b46J83K98r9j64Q8j16m1j28K61j76M2L08l60L23j04o2J66k79J17JJ5l0J91
6101A88k24r3P0q5J97l86J01J56J21J7k43K46l0j44K40pr1k40K85k09K64O2l51
$$ y = [69, 173, 168, -85, -13, 159, -6, -84, 181, 114, 46, -228, -195, 12, 121, 145, -27, -21, -111, 4, 78, 220, -53, -70, -18, -199, 27, 51, 131, 54, 25, -21, 64, -178, -5, -157, 33, -47, 30, -33, 261, -150, 16, -243, -35, -86, 27, 211, 135, -113, 30, 11, -231, -229, -203, -58, -66, -104, -231, -60, 138, 10, -101, -23, -308, 66, 168, -112, -97, 35, 172, -91, -98, -90, 42, -22, 136, 42, -45, -98, 122, -11, -130, -149, 59, 246, -45, -35, 27, -127, -61, -2, -158, -140, -63, 94, 54, -240, 103, 4, -111, -16, -92, 295, 172, -60, -88, 148, 156, -71, -110, 52, 280, 97, 2, 24, -28, 219, 4, 119, 31, -81, 5, 115, -21, 166, -5, -34, 255, -231, 199, -43, -1, -41, 72, -69, -300, 8, 123, -257, -91, -251, -115, -246, -63, 235, 136, -28, 60, -56, -97, -225, 36, -140, -98, 210, -150, 173, 69, 7, 173, -106, 11, 12, 27, -3, 188, -36, -129, -59, -144, 53, -333, -232, -76, 45, 62, -181, 65, 35, -109, 131, 124, 33, -207, 78, -131, 133, 195, -156]
6124a56J09j0j23j31L39j4m8L81m38K05o6p1K06L5k05M1lk55K40O6J70l60K22
6147A34p9r3p1M6q8J36Q9j97O8J89n8K2l58J16J55o3m3P1J58l09J60L9o0R4q6
6172b8J27j8M0o6Oj03j86L77r5k2K10j32j25J37k05k5Q6k9J15k30o2Q1P8J92k54
6197a31K05q4k08J75J72k24K80j04r1J40j57L8J4M6L8j29J9J08n1L4j61J39n9
6220Ij0m9K80j34j10j29j71L22o6K4Qm2K86j65j98J80n8lK75k84l8K41j32J67
6244B03j84k96M07k11M5o4Om0P7j08J68j79K04L9j05J48nj01J02j1m4J51j65k0
6268A7l83J19J62K02k47L25k00k2j60L38k01K83k19P5q6K72m06M5NJ92J03j14
6290A00r5r9J71j1j8k68K36n1o0r8J37J96mk3k23Q1K73k18L2o9j97K10j7j29K30
$$ y = [-156, -47, -57, -180, -311, 28, 14, -34, 347, -91, 114, 48, -23, 183, 218, 13, 54, 51, -204, 36, 102, 272, -88, 134, 55, -38, -109, -63, -151, -15, 74, -123, -55, 134, 76, 98, -260, -144, 11, -52, -95, -24, 134, -175, -15, 24, -36, 58, -28, 99, 81, 121, 55, 61, -42, -228, 149, 54, 32, 242, 110, -15, 122, -83, -108, -22, -51, 64, -166, -228, -147, -69, 123, -131, 74, -10, -218, -43, 129, -95, 185, 81, -10, 130, -27, 11, 25, 71, 109, -20, -1, 107, 56, 90, -71, 68, 9, -1, -50, 230, 96, -14, -143, -314, 8, -58, -34, -26, -68, 218, 53, -145, 35, -23, -26, 249, -35, -73, 168, 36, 203, 19, -277, 130, -81, -36, -100, -94, -134, -57, -165, 3, -176, 28, 67, -38, 110, 105, 4, 106, 95, 51, 202, 37, 17, -366, -247, -85, 117, -130, 195, -5, -27, -187, 151, -50, 233, 14, 89, 3, 275, -131, -86, -81, 111, 214, 100, 5, -94, 77, 66, 48, -220, 16, -35, -95, -193, -56, 140, 136, 113, -110, -29, 244, 26, 58, -11, -208, 2, -15, -144, 86]
6315H6j6J49j62j21K1K22m50K41K02j93K48j92L0j20M9k41L91n31Q9M43j81J97
6337A61l67J08K45K2Km01L48j78J24R7PO1l38O2j86K02lj62P4j05M02k7P0k02
6361A6J65j99J62l57L66M1k90L54k12L16m18J0J52j77K01l21K44R1q6j43j21J96
6383a0j50J06nj5j29L93l84J80k7j60J99n3J71l37J65oJ4p0K01j47J13P2l70J58
6407i1J24m0R1k14O8K27k17jL22m19K52J05j81l8r5l2J70k8P0lo6o5K93l88q9
6432b45N8K90J1l43J08K27j51j9j62K86J41O0m50J14Q8r3L32l71O8j28J89J11
6454A21l93L59o5J23j71L5Q9p0o7J93j31j0o3R3K03k58K12j47K8O4m21L06K9j07
6478d8j82K23J55Q9j13l49L18kJ11M2j81j93Q4j0j7o3J22O7m1j1q4q0O7J45k05
$$ y = [86, 70, 219, 57, -64, -43, 179, -271, -30, 172, -21, 227, 35, 65, -55, -6, -247, 144, -387, -298, 145, -36, 161, -206, -98, 147, 169, 171, -230, 118, -60, 64, 161, 168, 229, -109, -47, -233, -31, -34, -196, -122, -227, 175, 148, 218, 16, 181, -18, 144, -213, 153, 194, -96, 258, 46, 362, -56, -46, 106, -71, 130, -191, 53, 144, 58, -85, -206, -10, -160, -54, -59, -74, -203, 190, -194, -14, -41, -201, -2, -55, 116, -221, -56, -62, -48, -118, 83, -64, 49, 121, -249, -91, 33, -7, 84, -130, -62, 165, -52, -53, 269, -150, 102, 207, 26, -12, -107, -139, 31, 3, 73, 70, 4, -61, 232, -156, -245, -187, 103, 114, -229, -121, 106, -45, -64, -226, 60, 201, 261, -189, -75, 13, -80, 252, -119, -51, -179, 10, 121, -272, 87, 22, 145, -26, 9, 98, 28, -39, 154, 23, 13, -50, 43, 246, -12, 200, 53, 81, 145, -276, 30, 59, -48, -230, -7, 148, 237, 124, -225, 93, 91, 202, 244, 63, -130, -46, -56, -73, -136, -14, 53, 12, 1, -83, -163, -96, 49, -156]
6503a56RK99j88o7r5M1K2K64r7R0k09L05j41q2J95p9J11k19j6J96p3j58l07L57
6527BJ2j6m6J36j76J30J22k13N9JJ23j62K56l57K75m17K98j48K03j60L2O2P6j74
6551h2L77k68k51K62K0L2j27J34l12L45j37l3P7k96K87K47k35J14k77L43j9k21
6573b0m9J23n0j23L10l26J58oj23L40k66K3k99K51J62k09J06J08l2j71J53j58
6595i8L29k02K20j84k91L64l6l0j19r6o2R8J57j82J07j17L67j63j99J62l4J41
6617A32kp2j66J51J66l89O7J66Q3j91M6j9k70L35j99K89k48J12k7m0n5Q1J82M3
6641A75m57M74q4k7l8k5j69K56R5l5j49j47o1J39R2o4J10K46k54k3J48j87RK78
6665C02m15j85K54m4J79j20n2l8j29J86m0L4m5j54L30n6j21K50n0k20L6L99j17
$$ y = [-156, -147, 152, -36, -103, -198, -157, -135, 129, 32, 122, -87, 218, 77, -5, 190, 111, 222, 3, -13, 183, 110, -48, -355, 2, 14, -2, -48, 88, -88, 42, 164, -49, 10, 11, 134, -28, 228, -129, 146, -271, 27, -121, 82, -78, -46, 16, 92, -82, 295, 27, -224, 38, 58, 90, -37, 97, -215, 130, -7, -40, 37, -259, 28, 275, 40, 154, -123, 220, 201, -20, -69, 54, 4, -119, 191, -135, 23, 17, -106, 234, -32, -9, -308, -57, 105, -104, 2, 110, 78, -93, 60, -98, 231, 29, 249, 65, -226, 138, 102, 72, -47, -143, -205, -107, 50, -132, -25, -142, 225, 62, -137, 25, -9, 132, 130, 58, -108, 43, 209, -180, -113, 53, 136, -55, -9, -28, -298, 37, -162, 127, -121, -9, -36, -76, -131, -50, 132, 175, -282, 192, 108, 81, 43, 18, -151, 105, 200, 165, 16, -131, -192, -53, 39, -25, 85, 331, 77, 54, 202, 15, 24, 302, -113, -298, -44, -88, 91, -29, -81, -119, -248, -62, -102, -68, -113, -267, 63, 7, -114, 136, 86, -134, -98, 301, 184]
6688A84k06M5k85K93L1P1N1k17k6K59j92J26m8k94L05r0L1J27k27K68pL5k07O5
6712I2l7j21J03nj78J01P4k5K31j82n1o0J26Q1j40r0J60M1j41K51k73K18J4m75
6736b86K79Qn6M9J21K8r8j12R7J47l38o3LJ53j46M05n3P7k60R3j68j75K48L21
6760B74l31L5Q0m81M95J11m55nL34K54j29k73l07K78K05L9l10N7NL5mJ71J4j58
6784f6O9j54L1J72q5M3M1J29n93K99nJ21l4J72k81J12N2l35M05j5r8p9J75J8j67
6809g3K00j46M9j62mJ89l27K28J94k03J3J90l41J09L3q6J85Q0R1l78J08Q3MJ0
6833D6q9Q2Q1j34q4Q0l7J80l4j40qR7q5Jk1K28j93M5j0n0J07j50K73j11k71J13
6859h4JL3j32Q1Q0j19J01oJ14k43J76Q8n9P2m6k01P0m1jK38J37k01q1r3J88Pk72
$$ y = [184, -22, 23, -262, 31, 62, 133, 184, -33, -59, 200, 8, 134, 86, -208, 97, 7, 38, 165, -62, 206, 199, 234, 27, 92, 55, -66, 37, 32, -146, -45, 29, 4, 235, 53, 2, -58, 68, 149, 9, -81, 79, 120, -21, 230, -43, 175, 189, -286, -7, 1, -55, -6, 115, 143, 45, -67, 30, 177, -161, -224, -221, -68, -214, 191, 138, 215, -45, 48, -120, -295, -47, 274, -57, -22, 58, -423, 72, 183, -272, -277, 57, 311, 182, -91, -398, -120, 85, 124, -186, -129, -124, -89, -93, 78, 92, -66, 3, -151, -120, 52, -33, 10, 51, 180, -413, -114, -119, 2, -32, 140, -141, -29, 23, -312, 93, 78, -20, -99, 76, 94, -73, 127, -19, 30, -132, -136, 53, -274, -46, 148, -55, -42, 148, -193, -84, -51, -137, 48, 128, 219, -159, -51, 32, 36, 46, -43, 39, 120, -14, -98, -18, -55, 125, 91, -49, -57, 40, -45, -44, -65, 163, -30, 15, 5, -45, 62, -88, 185, 74, -197, -84, -83, -50, -182, -101, -21, -140, -39, -45, 69, -174, 2, 90, 31, 103, 57, -144, -74, -115, -116, 122, 259, 58, -23, -116, 72, 79, -193]
6886a93L80k12j42L0J26k2j48K90p6k14L54l88L69m6k24J09j09O0M7L42k93o9
6908b9J7L8k58K32P3j11o3K73j15n1K7j9k38Q8l1r2M4K68j2j05R2o5K63k53L18
6933B91m06L8m6K9j17J93j40J60r5j10J99j11KP5l6K66j82j24M9n2J46j77K7P3
6957d8k37L11j80J4J76j57J1J7K14o2Ql6j18K30k13Q8jK37m03L88k45J9J36j32
6981A7p9N6N5p7m4q5K50j19J52j46O2Q0P8k77Q7RJ41l74J51Q4P1n7r5J49j00J13
7007A02k02M1q9j27k6K15K08j9Q5j26l1K43l00J36j10J01J08k31O1P9j00J27j7
7030A28l50O2J97k2l0J00j19N2J57k57J33j33Oj45N63m91j53N19k60K7p4K30k3
7053A17k71K52K4l79J82J6J14j27K88L7k74J18p8K8j03M6p5O8J4n2j8O2j65O7
$$ y = [-193, 187, -25, -167, -137, -11, -33, -181, 109, 33, -181, 173, -215, 154, 108, -116, -7, -116, -56, -9, 333, 40, -29, -12, 26, -232, 0, 73, -38, -101, 172, 57, 6, 33, 14, -224, -136, -167, -259, -215, 53, 41, -64, 28, -37, 226, -27, 291, -115, -77, -123, -94, -211, -18, -158, 2, -93, -203, -4, -115, -113, -38, -74, 192, 10, -114, -65, -117, 29, -148, -121, -48, -285, 26, -154, -140, 36, -121, -110, -93, 121, 59, 67, 31, -87, 143, -70, 18, 17, 254, -149, 239, -6, 13, 149, 17, -62, -6, 49, -28, -72, -157, 93, -26, 126, -20, 42, 122, 200, -77, 10, 19, 160, -214, -63, 21, 92, 35, -60, 89, -11, 102, -100, -59, -148, -275, -301, -86, 122, 103, 188, 62, 31, 274, -26, 110, 0, 101, 209, -22, 39, 118, 18, 145, 128, -222, -160, 37, 15, -15, 85, -34, 18, 175, -82, 51, -82, -76, -221, 342, -149, -302, 217, -43, -16, -90, 140, 117, -154, 98, 122, -257, -75, -59, 55, -72, 216, 253, -21, 97, 19, 47, -56, -10, -85, -17, -3, -55, -73, -11, -176, -109]
7077a09L9J38r8M5J66j70J94l24k34M25K47k49j52j54P8lJ34K47l65j32J77K94
7099A94l03O8JM7l9j6K08m7n9J12j32q6J19k13J84J73j68M0r7j2L1j37L00j69
7123aJJ3j6l18M64k59P9L5k36L11j07J23L1j58J77j66l0J82m10L54K2j75L53k74
7147eL87l17K91k83j56O6p5J78k2j59q0K83l43N4J61l4j01K86l33p4L84J5k75
7170a52J69kM5k82J94j69K24N4l91K51nJ95qo7n5L62j57k39j64K30L2L8J13k63
7194d7j7K07k41nR9j09J34J53k85m0K14J26N8k62M3j19j44J37J72k92L02j66j75
7217b57K77J54j88Q0j04K37m30J61K17k33J07j74K05q6j01J58J03k79R7PL7J03
7239I1o6M08m11l3r6k4RK72O4j65j05K36k71K15PP4k25j05L50j63j12J77k55K72
$$ y = [-109, -70, 68, -30, 15, 181, 11, 205, -119, -353, 72, 319, 70, -82, -236, -158, -161, -27, 220, -145, -277, -100, 194, -109, -41, -40, 7, -32, -48, 160, 113, 54, 166, 34, -52, 67, -146, 38, 211, 43, 83, -14, -26, 5, -132, 168, -1, 0, 13, -3, -321, 143, -116, -37, -2, -238, 73, -34, 89, 120, -38, 139, -27, -57, 125, -285, 69, 91, -84, 269, -5, 382, 65, 356, 73, -83, -17, -92, 86, 64, -95, -175, 108, -235, -181, -20, -54, -155, 131, -202, -276, 108, 123, -152, 17, 15, 60, -222, -28, -197, 27, 81, -310, -59, -64, 131, 123, 56, 1, 363, 206, -33, -197, 33, 65, 103, 216, -47, -64, 143, -98, -103, -4, -113, 21, 174, -111, -151, 63, 189, 247, -15, 28, -91, -235, -98, 74, -218, 84, -82, -257, 20, 174, -14, 66, -38, 199, -231, -70, 147, -86, 21, -153, 52, -34, -135, 23, 126, -153, -56, -49, -12, 91, 25, 433, 22, -11, -107, -131, -122, 150, 214, 49, -56, 180, -91, 124, 131, 205, -20, -125, 225, 62, -50, 127, -128, 144]
7263A44k62P5J16p7q3q7k3K50j13q3J24MJ21j87r2oK84P7m21J58L7o7j08K25J65
7288A71k50N2L17j49j36N4k72O8J96l13K92J76l22J21j04N1N7K3j00N1N5q2k3
7311f7O0O2k64J78k4q6J04J52k35ML32m48J72N1P5lk51K96k46K96p5j28n3RR3
7336DO1j92K76j07K3Pj26r6j9O0J40l65M77l58K8K30m9l0K7l6R7j4J06k63K72
7361A53o3Lj70K55j5K25j76j84k71J06l9Q9J26j15L3K63r6j78J52J6o5k98M20
7384A71r8r3j06L35l91L64k77P5K13k61j2O0j3N3Q9rK34k14q2N5k92K80J74k48
7408Gk42K43Q3j64p2L05q8j71n0J09J38l2O4k0j9j35K13P7j69O8k59K0L6l7J04
7433IK02k56Q6J87j82k6L8L08n58K94j23Q5L5j48R1j03kK40j39R6j95J17K94l26
$$ y = [144, -118, -43, 73, -4, -87, -174, -197, 53, -60, -143, -19, -15, 106, -81, -173, -179, 105, 182, -239, -81, -44, -111, -219, 6, 171, -79, -27, 290, 141, 5, 59, -213, -145, 51, -262, 30, 206, -116, 5, -99, -48, 9, 32, -68, -17, 38, -44, -67, -7, 55, -209, -31, -55, -141, -37, 115, -120, -116, 216, -232, -60, -9, 66, 63, -188, 108, -138, 158, 83, -45, -98, -89, 4, 65, -127, 149, 42, 65, 72, -54, -150, -169, -109, 31, -334, 143, -215, -187, 43, -6, -36, -9, -45, 52, 38, 144, -119, 153, 90, 93, -77, 178, 163, 388, 212, 28, -243, -137, -176, -87, 39, -76, -43, 220, 124, -54, 98, 114, 49, -249, 171, 73, -20, -126, 209, -182, 182, -95, -20, 193, -68, -80, -20, -33, 20, 109, 100, 334, 120, 38, 93, -199, 81, 255, 7, -235, 8, 91, -73, -145, 160, 72, -99, -149, -40, 98, 66, 130, 110, 91, -44, 169, 246, 77, 145, -114, -94, -58, -95, 9, 211, -45, 41, 228, 46, 20, 58, 366, -192, 102, -21, 64, 99, -49, 42, -61, -63, 177, 38, 134, -61, 56, 350, 24]
7457B4n4OJ85j88Q2Q0J85l19j47r9L87j3j71l6K58k55K18k48O9J06j5j94J64o6
7481d1j3n6J58k91J60N4J12k33L51j70l03K70l4P3j24K72k13K37k68L07j79o6
7503CJ1J23k01M6j10K02k01L48r8J25k97o8J63k50J08J47q7J88k39J69j54l5O6
7526d1j18L5l2K31q0J98k92rl6J94n0k37K84J10j04j37K90j86j44L2O3L1k09J96
7550a1K00l73J4K46j73kk9J47O7k03J98j14K79j16l30J44m4m4J00l4l5O0L8K81
7574B66k39j94R0J75N2n4r4p2K24l18K42k68m2L59k57M75m49J3J22J05o0j22J21
7597G5J43j32j63j65J12J42n7M2j4J87J2l24L40l54L3K32j40j76K97k22k9J85
7619B4J2q7J60Nj50j90L67j21J19j00l66M05J04m37J77K81j31R1M8k81L7J4J61
$$ y = [24, -30, -24, 161, -27, 55, 135, 320, 1, -146, -245, 142, 129, -42, -78, 180, -75, 143, -105, -36, 70, 55, -139, 25, -41, -54, -110, 48, -243, -83, -29, 83, -150, 201, 31, -272, -2, -36, 37, -87, 185, -28, 209, -59, 248, 69, 3, 14, 137, -64, -18, -128, 74, -127, 221, 123, 248, -49, -117, 46, -204, -96, 51, -36, 152, -87, 82, -72, -107, -41, -159, -124, -156, 75, -5, 193, -99, -108, -144, 50, 0, -237, 47, 157, 53, -84, 206, 20, -124, -92, -29, 2, -207, -11, 189, -184, -170, 76, -97, -99, -128, 19, 86, -117, 81, -33, 246, 130, -200, -56, -100, -144, -44, -78, -113, -53, -15, 266, 27, -167, -77, 98, 150, 96, 2, -70, 154, -164, 78, -190, -232, 127, -130, 345, -104, -91, 31, 136, 76, -46, 75, 218, 86, -77, -242, -130, 12, -45, -3, -17, 170, 182, -142, 198, -156, -123, 109, -31, -207, 90, -132, -161, 24, 36, -51, 109, 114, -36, -226, 141, 20, 139, 39, -327, 78, 182, -255, -78, 203, 72, 163, 211, -70, -33, -19, 142]
7642A42O7m13j22J10j12K52N2K13Jl68O6J79J91m57L66q3J98k12j04k67L39J8
7664E6r8m9j60J37KJ91l11J77n1J32j20K87k99J3P3O7L6j33J4o5K21j57M0J54
7688A57k7j72J7M1k7n3J28J12k56J20P7p4q0J84k68L43k62J41k90K42j33K48l76
7711b08J36n1L23j28j26K33l38N5K4K9J1l50L68p0Q0J61k36J76K15k44J67l84
7733a57J79J14k72K07k37M12m08J65J48j70J4R5j61Q0r7J17K51m03J03N3KJ51
7755A86k47r3L68k06j09J44k79J98j14l7J04r9L39k02J69k47O1J3K17l01N1J52
7777F8m2m00M18k14K81k37k84M06j06J67O1k61qj3M16j44L3j53o8K28Ll31N0J93
7801F3MK21k94k8J12j25l9K48k86K9pR4J29j76J66O6p8j81k28L99m1n2k22J74
$$ y = [142, 209, -204, -326, -216, -328, -76, -24, 189, 190, -178, -112, 67, 258, -199, 167, 84, 282, 70, -34, -301, 38, 56, -42, -91, -251, -114, -112, 79, -232, -55, -106, 26, -94, 193, -106, -93, -20, 47, 83, -50, -36, -101, 120, -37, 3, 157, 130, -42, -25, 16, -11, -64, 64, 176, -80, 40, 117, 43, -37, 147, -121, 222, -40, 101, -189, 53, -80, 168, -208, -72, -123, 200, 72, -54, 179, -159, -104, -80, -51, -40, -390, -22, -92, -12, 149, -87, 89, 304, 60, 227, -157, 22, 136, -136, 71, -166, 246, -162, 3, 151, -19, -5, 90, -71, 9, -88, 29, 280, -123, -20, 33, 35, 186, -61, -154, 214, 8, -101, 43, -236, -38, -152, -189, -85, -184, 155, -47, 122, -125, -64, -51, 166, -135, -84, 68, 26, -374, 44, -170, 111, -126, -410, -4, -110, 57, 118, -143, -151, -164, 252, 108, 141, -12, -80, 148, 151, -180, -130, 63, 67, 288, -6, -34, 78, -47, -86, 162, -124, -95, -102, -8, 121, -55, 111, 177, 99, -82, -310, 89, 48, -4, -226, -52]
7825e2Q4J13J1l23L33j47k15M5J44q6L38j70l4k09j9J90O7L00k94k3k14J27O8
7848C4Q6j46J6K3J11j35j82K54m3K08q2k13N8l8q6K43p3or3L41k81m2J05q2M2
7873A9K9j17N7k49K72j5O3M6j01j16O6rN4L7R4p5L7K7K38o17o3L95q3m1M6j83
7899a89Q6n7J54j77K83j13k33RR1K61q9k43M18l79L38l40l7J76j84L46O8k44P8
7922B3J05j80P1J2k02K58lj71R3J32o2j17O0j92K42k04j41M04o2m9k32L02l53
7945b66P9J92l7m1J74j36Q3K86l14j5r4P6L1m1J68J27l34m2J88r7K66j57j79J65
7969H2q5j1L4J97p5l17K34J93m57R0K22k6j13L21l21K5N8P1n2p3R1j91n9K39M0
7994A17l25J71J18J09k47N4j1j95M21j48j56J9Q1P5L8l12K38J18n7j28k47L65
$$ y = [-52, 32, 145, 156, -167, 166, 19, -196, -151, -7, -93, 245, 75, 41, -168, -187, 3, 70, 370, 76, 53, -161, -34, 34, 120, -26, -10, 13, 124, -11, -193, 61, 18, 226, 144, -69, -11, -49, -135, 108, 35, 29, -64, 277, -4, -46, 59, -23, 19, 48, -69, -12, -261, 11, -4, 59, 105, 4, -112, -46, -55, -1, 36, 130, 55, 92, 119, 357, -260, -323, 72, -11, -52, -6, -189, -103, -160, -6, -183, 100, -13, -246, -237, -146, 115, 26, -217, 201, -178, 160, -180, -217, -41, -225, 121, 189, -55, 23, 128, -52, 19, 31, -171, 87, 84, -87, 6, 138, 76, -41, 19, -173, 69, -135, -276, 128, 66, 17, -215, 87, -266, -187, 5, -32, -73, 101, -35, 48, 334, 20, 5, -89, -13, 18, -23, 145, 272, -62, -104, 84, -13, 253, 96, -83, 82, -3, -14, 20, 217, 142, -175, 59, 252, -205, -115, 107, 81, -32, 289, -32, -7, 51, 122, 70, -3, 88, -103, -162, 77, 117, -208, -37, 81, 190, -57, -3, -14, -209, 212, 64, -92, -73, 8, 83, 121, -191, 47, 165, 108, -20, -267, 98]
8016I8k53J80j0N2q7J24q0M1K32k15j2k99o9J95K84m7r2lMJ28j44q6M2M6J57j15
8042G1K8j88R3Mj56K27o0J23n9r5r7J05L0j55R1J53l0K55k74p6P9Jk9jJ0p1J6
8069ej44L84l75M7R0K0n2K31k30j07Q7P6r3j16J97j97R1J7QK57Jl08P1l8n1p5
8095b14K6N2K85j24N1l20L11k23P7r2L56j28O8j11P7k99K4L45k29p8JJ83j54O6
8119e0R4k8l27J22Q9J78j37j1J53q4J18j89q8L55j43m3k7j05L79l34NK37q7j36
8143e9m1j2J68M5JJ09l29k65L72p7j61J16K54q4O6j26l8L20l87J63n1J3j85O9
8167a19J72k65M0J79j21J77j25P8O2Q3r2K18k45N0q6M29k22l81K20l9m3l6J29
8190F3J35
$$ y = [98, -155, 25, 15, 67, -20, 104, 24, 65, 297, 82, 70, -229, -298, -103, 181, 134, 42, 39, 43, 171, 27, -59, -17, 29, 186, 71, 99, -89, 4, 8, -148, 79, 19, 142, 83, -12, -109, -4, 26, -129, -38, 115, 85, 340, 66, -10, 69, 70, 41, 40, 50, -21, -5, -149, 235, -140, -93, -3, 17, -35, 196, -34, -141, -54, 22, -71, -187, 10, -187, -96, -79, -71, 186, 187, -121, -50, -88, -139, -214, -188, -136, 149, 25, 76, -244, 67, -156, -79, -171, 185, 57, 125, 14, 91, -208, -184, 161, -68, -146, -145, 38, -116, -50, 44, 16, -311, -189, -100, 78, -59, -70, 83, -1, 117, -72, -160, 195, 52, 9, -18, -123, 256, -78, -73, 164, 77, -59, -100, -112, 56, 101, 102, 211, -118, -383, -11, -88, -249, -133, 121, 37, 103, -23, -61, 259, -128, 35, -16, -3, -188, -119, 53, -212, -172, 7, -114, 63, -62, 16, 78, 161, 69, 287, 42, 92, 6, 435, 213, -168, 52, 13, -30, -66, 63, 198]
8191A98
$$ Imaginary data points
##PAGE= N=2
##DATA TABLE= (X++(I..I)), XYDATA
0@%%%%%%%%%%%%%%%jRj6J6j6J6j6K4l2L2m0M8n4O2p0P8q8J03j17J32j48J64j81
38i5K03k26K51k80L10l43L78m18M61n06N60o18O80p50Q28r12J008j118J243j390
58g34J560j762K006k310K699l212L928m993O730j0014J8207p2450r7668K50167
72I2154p308j94592J06037J21608j67133k6111J64030m0551j18381P5151M7782
83E2686o7363j4K7264k7101J5832J7281l6392J1206K5344n2265L757P3520l7305
96F450o6144O7253L4307p7772R890P3054l9671m2142N3878L405n2568K9779L9882
109C9601l8748j4669K9409j5829j1767L3957j2005m0155K9068K5924m2853n379
121b3446M4035j6594l2442L9283J4073n5790J683N7500j2464m0146K2124J7496
$$ y = [0, 0, 0, 0, 0, 0, 0, 0, 0, 0, 0, 0, 0, 0, 0, 0, -1, 8, -8, 8, -8, 8, -8, 16, -16, 16, -24, 24, -30, 32, -38, 40, -48, 55, -62, 70, -78, 86, -95, 108, -118, 133, -147, 163, -180, 198, -220, 241, -265, 295, -323, 357, -393, 435, -477, 531, -587, 656, -734, 826, -936, 1070, -1240, 1459, -1753, 2175, -2818, 3912, -6102, 12105, -60345, -158013, 92154, 84846, -109746, -3709, 117899, -49234, -75345, 88685, 48134, -70247, 4904, 52686, -14677, -14691, 12573, -14528, 1304, 18585, -17807, -6601, 18743, -33522, -29765, 43755, 6450, -59694, 7559, 41866, -35906, -26016, 47038, 7367, -34775, 19103, 22508, -30060, -281, 39601, 853, -13816, 15593, -236, -12003, 21954, 9949, -30206, -1138, 24786, -18067, -23446, 20589, 3995, -28447, 10836, 24909, -30881, -29198, 28302, 15838, -24308, -2184, 15312]
133A5312k5938O222K7626j5916k0208J3391P133n586P10q053p64J9636o079k4958
147a7472J5820J6373k5943o75L2972j8226l4002L1391K6547l5557r968L5431o043
160A0648k9621J5622J9521j8257r819J8608L991j7558l068J5673N611j4297p545
173a0491J3096M103j5056K318J8028q529j6654J6142J1808k0985o123K3100q55
186I902j9746O211J2529j1107m224J4471j354j3894K060Q572l905m382L413Q87
200e67j391M12K59K36J386n80N37K712k756l372M468M560l635j753L238j084l516
217h46K778J811m022j342K570j345k829J269J370r16o28k89j038J1J074J750J34
234d88m17J31J440J072j50O63R83r41l36J113p44n65J279jk082m38M65k138m92
$$ y = [15312, -10626, -4404, 23222, 7306, -12902, 489, 7622, 2036, 2746, -5307, -6071, 13565, 7486, -17472, -1652, 14721, -11222, -11897, 21075, 2849, -31153, 238, 26785, -8772, -18740, 16691, 10648, -18973, -3351, 16170, -2087, -11906, 6702, 10693, -6865, -9933, 5740, 11351, -2946, -10491, 2605, 6708, -8348, -6030, 11998, 3469, -13185, 2957, 14765, -6220, -12343, 10757, 9902, -9844, -3633, 8896, -2211, -6435, 8036, 6682, -7212, -5152, 3420, -485, -4867, -1454, -567, -1958, -1546, -1287, -1051, 335, -245, 292, 3004, 248, -3124, 1344, 5904, 2269, 516, 3754, 2670, -846, 1932, 3743, -279, -1621, 949, -396, -3225, -1956, -586, -1502, -2130, -2419, -3457, -3446, -2372, -622, -488, -905, -774, 666, 1738, 1588, 2251, 3234, 2293, 1957, 3070, 2326, 1761, 3040, 3039, 957, 519, 984, -1154, -1646]
253a646J211j539k214J431J155k371M65L091j074k329L124J937k642L20L931p5
269B775k856K134K807j938k382L022J368m110j762L824l86n158P97M107l182m931
285e871M508L010o057j785O490j10o298L096O793l715m624O777K702o054p6O135
301D921j460m449K989L162l413j887K451K06k475j638Q07J517j655k879K556K106
317H59m181p47N575j547n216M548L467n757P01O016k922l317N871m63m827M145
333B205J726n544K359L319o183L16P563n306n797P979P20r227M307O104p994j351
349d804Q299k894n788N871J859n449K682K640m239O48L552l326R9L955m202j628
365b725N652j129n183M194L090o558P46N833l535l460N213M74n317K122L514l591
$$ y = [-1646, -435, -1974, -4188, -2757, -1602, -3973, -3508, -417, -1491, -3820, -696, 1241, -1401, -1081, 2850, 2775, -81, 2053, 4860, 2922, 540, 3562, 4930, 820, -942, 2882, 2496, -2662, -1865, 2242, -940, -5871, -1363, 1647, -4410, -6195, 295, 185, -6113, -3017, 3776, 61, -4563, 2214, 4916, -1138, -1214, 4921, 3461, -988, 2001, 5163, 1750, -137, 2314, 2520, 45, -1593, -786, 731, -924, -3803, -1247, 859, -3322, -4069, 1506, -41, -5257, -709, 2758, -2999, -2298, 3718, 796, -2521, 3350, 2887, -1940, 2205, 3931, -1613, 746, 4065, -2118, -1802, 5761, 455, -5342, 2637, 3357, -5870, -1563, 4541, -3453, -4804, 3495, 601, -5187, 684, 2543, -2906, -224, 2416, -1823, -1175, 2377, -949, -850, 3105, -1097, -2725, 2927, 1798, -3385, 809, 3899, -2659, -1913, 3920, 385, -3075, 2138, 2612, -2705, -583, 2931, -660]
381f60j058L497j262k651J855J169k974J014K551k735j411L256m02l103L035K445
397B566m928l17N681j750l836N144J288o133K151N403n405j953N739j622m801
412b773M429J124o445L039M131o332r35N783m105l560P620p93p206N766L923p665
428c999J902P333n455l633Q594j657p399P242L581q719J649O765o190l264P555
443D305j978p440O071K355q350J888O390n668k631P067k330n965O135K684o273
458c740K336M892m163j495O078j689m083M538J382n047J670L776m572j004M887
473C766k484m187L783L58m669J812K858m060r94M767k343k515M351Q22m385J943
489a177L148l201N6M541j817k824L460Q68l569J597K910l730j334L332j427k626
$$ y = [-660, -1718, 1779, 517, -2134, -279, 890, -2084, -1070, 1481, -1254, -2665, 591, 189, -2914, 121, 2566, -2362, -2679, 3002, 1252, -2584, 2560, 3848, -2285, -134, 5269, -136, -2089, 3650, 2028, -2773, 1656, 2780, -3665, -626, 3505, -2827, -3762, 2021, -2084, -5644, 1976, 1183, -6023, -257, 3666, -3999, -2097, 5236, -219, -3852, 4742, 3085, -4314, 2928, 6509, -2210, -561, 6204, 14, -3250, 4305, 2327, -5113, 958, 3313, -5037, -3149, 3241, -2427, -5058, 2009, -321, -6286, -151, 2533, -3740, -1404, 3488, -675, -2170, 3908, 2219, -1864, 2674, 4056, -991, 679, 4455, -117, -1121, 3766, 1282, -2905, 878, 1236, -3433, -1621, 1237, -2823, -3817, 950, -1393, -3908, 443, 1265, -3120, -1177, 1971, -1230, -1174, 3367, 1550, -1274, 2186, 3054, -515, 1082, 3992, 262, -1072, 2260, 833, -1793]
505a793K743J36l035R81J579k899N7K532j402j321K197j20j873K194J250k386
521a160L34K608j705j098K608l8j759J401P69k026j99J946j128p57P80o84j602
538a710J568Q43j255N1P07j207n42J570n24q76R77L99j013L12J593o85o16P25
556C17m55r9N98L5kL73l37m74O35M5p99M55J118j487p16J108L16j211L72J079
576H71r79j237J037M90j213j03J150m09o91L51N99O5o6m4L97k73m6O19J29J96
596H43m15K79n1j41j68P13m64n16K52k92J28l87k55N19m74p18Q5N04j15p91M72
617i92O35l00j80N83L12m48P69O59o95j45P92N04o12l62P34m8n83L16l16k04o04
638a85J08K08p85l81L03J30m75k79J86M31j24j54M60K84q5L23L03K84J05J78K98
$$ y = [-1793, 950, 1086, -1949, -968, 611, -2288, -2231, 301, -1101, -2422, -225, -345, -2218, -24, 1226, -1160, -826, 1782, 77, -1021, 1587, 1549, -210, 1191, 1960, -66, -265, 1681, 553, -204, 576, -108, -1710, -142, 701, -554, -503, 204, -1003, -1545, 25, -499, -1375, -398, 1, -1012, -700, 893, 208, -408, 317, -138, -237, 361, 396, 394, 767, 430, -44, 591, 636, -163, 292, 1410, -77, -793, 315, 631, -580, -208, 871, -108, -1345, -308, 182, -1031, -1134, 16, -393, -1084, -733, -134, -69, -135, -179, 218, -55, -101, 518, 647, 843, 428, 707, 656, 515, 347, 1060, 596, 80, 332, 40, 168, -219, -474, 45, -429, -1147, -1062, -558, -673, -1464, -992, -357, -657, -837, -254, 58, -390, 379, 1038, 343, 198, 990, 1494, 882, 520, 1254, 1206, 623, 939, 623, 419, -185, -77, 131, -654, -1035, -732, -602, -1077, -1356, -1170, -739, -863, -1017, -557, -273, -358, -35, 268, 552, 657, 835, 1133]
659A133j09j49J4J37K32o60p8J04k04o62L41j9p86l80O08l31j277J145L54j037
679a624O61J120q09n07J185M48o35L39O65o52K8J262n06l33N16l47m47R6K94j074
699c20M93N0p04k2J22o32J41P26n74r22R15L89n37M32M80k68k79J117j17o93L88
720A85J070p66l59K98M78m88K13K18n44P3j10j83k90j68J9l8L40n5j029Q38L07
741Ij163Q12Q04j134p35J763M95k037P40J710j073p49J357l58o25P61O53j407
759a77K95R17q45K19K05q56l81J204k83j375Q84N39j411Q07Q73j287j000J489
777a83L31j488O29O41o10P0J444p17n62J211j90l43M59M0j069R14J269j576o72
796d02J777n64j576P34P17j696l1J517r78j275J157J064j152l82R35k67M5O12
$$ y = [1133, 1024, 875, 889, 1026, 1258, 598, 520, 624, 420, -242, 99, 80, -706, -1086, -478, -809, -2086, -941, -587, -1624, -963, 157, -652, -1159, 26, 474, -161, 178, 843, 191, 219, 1481, 975, 642, 1158, 811, 364, 460, 754, -320, 173, 223, -481, -503, -381, -1013, -872, -146, -720, -1642, -727, -338, -875, -443, 37, -231, -510, 607, 490, -203, 185, 1255, 489, 130, 428, 906, 418, 631, 849, 305, 378, 268, 85, -205, -373, -354, -392, -52, -107, -1136, -298, 9, -1154, -342, 462, -672, -1407, 356, 851, -1186, -446, 1264, 191, -558, 799, 441, -184, 577, 1230, -177, 118, 1035, 190, 409, 614, -242, -623, 581, 298, -1077, -193, 346, -1065, -258, 615, -672, -1672, -183, 148, -1340, -711, -70, -680, -610, 834, 117, -445, 766, 576, 233, 692, 732, -337, 577, 1846, 270, -402, 1375, 811, -765, -31, 686, -1010, -1041, 476, -502, -1777, -620, 444, -708, -1090, -155, -422, -377, 235]
814B35p10j45Q98N9N8R21p13r25J441P99k018J15J320p17r85J489k13k049M27
833g13J752j104j365M98M73o74K38J003q24l55O94P47l01k40n15J152N56q28K04
852C98Q52l25p93Q36J71j286J62Q72j03j659R05Q99j293p83J251n56q14P86M74
871fj217q4J005J92k53JL37j4Q52m23l46P3L74J50L24j0l53j83K63k1n89l74n8
894c60L12K4p8l62J97k61J31K69k41o47n1R78k08l54M54M65m32J22R28n26m15
915e5J71Q06q47j56O97P4o42M83L42m81n11J02K4l69o4l3M50m3k52r4L28j99m66
938g35O28k8n77k13J350o86j65J077j49n05O7P23n38k07M72K30m99j51P51k57
958E88k60j71j0l27j21J62m6l16j69N22j61j74J71l62J94J92r9r1J69J90M25J89
$$ y = [235, -475, -620, 278, 337, 395, 1316, 603, -322, 1119, 1918, -100, 15, 1335, 618, -367, 1122, 909, -1140, -713, 1039, -65, -1430, -932, -459, -1133, -895, 108, -716, -1071, -377, 370, 69, -171, -686, 466, 1022, 194, 398, 1250, 925, 132, 968, 1139, -147, 15, 887, 784, -875, 30, 929, -364, -1147, 104, -452, -1266, -480, -6, -1223, -1307, -302, -110, -363, -362, -25, -39, 813, 390, 44, 117, 491, 641, 965, 955, 602, 419, 682, 661, 72, -302, -360, -48, -24, -102, -464, -267, -528, -397, -128, -369, -1016, -1067, -89, -297, -651, -197, 268, -164, -42, 886, 360, -55, 116, 922, 75, -81, 616, 690, 48, 531, 873, 392, -119, -17, 7, -362, -426, -459, -9, -52, -304, -398, -70, -269, -735, -107, -135, -712, -925, 425, -261, -426, 651, 502, -3, 64, 787, 249, 42, 514, 744, 245, 94, 845, 588, 328, 157, 147, -180, -301, -139, -185, -501, -670, -148, -309, -483, -312, -674, -480, -288, -387, -478, -309, -119, 306, 495]
980D95J8l21m5O17n7n64N22P1n69L37N8o90J68K78q47k17O19k36m67N63o8o46
1002i81M31N63q07oP68k47l67O64J28k40L85L99j99j56K87j16J31lJ43m36k34
1023A07k15M82O3m52l69M31p51k30N46k43m52M67N02p59N68K09j39N5N74o3n99
1044b68O46K28j73N19k2q11P0P79m76n25N93m09q34O40J56n71r5J77l15qK46K05
1066b48p37M33K90j58L94K7j29p3P28J41l73j6L06k18K46L72j084m3O14mp11O14
1088C71m71n25M42Q7l19m9J03k34L7L35j71j21l3L93P3L18j27l61M03J11k45J74
1110A91M09l26j73K88K76o41J66K28l27Q1J43j01r81O29L49o24L60o4l10k63L92
1131b98M3l89N83l71j08L74L48n07K28L72Rl80O05q5m43K43K94k35l00N57l45
$$ y = [495, 513, 192, 147, 764, 707, 143, 665, 736, 167, 504, 562, -128, 40, 318, -529, -746, -127, -363, -830, -267, -335, -981, -550, 13, -794, -800, -32, -279, -646, 18, 146, -94, 291, 690, 491, 335, 622, 506, 637, 634, 777, 341, 107, -108, 374, 437, -15, -384, 47, -704, -934, -388, -631, -1083, -616, -114, -873, -305, -96, -235, -180, 394, 331, -268, 378, 606, 433, 952, 930, 119, 189, 968, 492, -33, 560, 151, -683, -43, 113, -458, -553, -376, -691, -699, -453, -248, -985, -552, -262, -420, -26, 1, -128, -201, 527, 668, 295, 279, 585, 367, 613, 985, -99, -142, 472, 468, -243, 371, -100, -625, -183, -96, -415, -464, -361, -595, -558, -223, -394, -515, -548, -155, -82, 236, 109, -252, 151, 262, 17, 191, 600, 274, 101, 389, 665, 24, 190, 418, 91, 172, 315, 214, -767, -138, 211, -413, -53, -117, -427, -690, -298, -255, -644, -61, -432, -540, -166, 182, -325, -97, 275, 284, -96, 509, 424, -19, 224, 518, 283, -17, 540, 195]
1152A95pK78l89j88J04o4k55j49L77j05m70K31L08k51K34l9l00j4L72J16m2K60
1174B02Q3l10L82J87p9p9M44l84j61J89O2q8o1n5n36n1k00K8j45J21J99m85K29
1197e08K61j09l0K01J2q4N01j2Q7r2L75k3k50L15j84q8M9O9m98J58Q1l11j12J38
1221e4j55j48J93k44m5p3J60k04n7M03o7l00M10M92k56l0O14k87m1N19k95k95
1243B40K06R9l10J00P7l80K0r1j40r2R3k29k90N05j96m6J28o8j71M13k8k41J82
1266b19J59K80jK51o0J82l70J41r2J68k4m57N55j14l19j37J78j98j57j23J8N7
1288b82n2K77n31j1N42l13k33P92N2l71L04P2k93j36N76k01j13K61Q0k67j20N89
1310F22n84n6M71n42j4L86j8p91O67j44m30J95J81m37R6L34k42j30K07L44p8m06
$$ y = [195, 188, 466, 77, -111, -7, -71, -326, -475, -98, -203, -673, -442, -134, -385, -151, -190, -490, -504, -132, -16, -58, 202, 285, -25, 357, 544, 465, 386, 830, 446, 285, 474, 536, 448, 387, 332, -204, -255, -455, -427, -572, -451, -252, -737, -508, -247, -356, -386, -185, -173, -257, 244, 232, 319, 227, 602, 579, 329, 644, 460, 372, 421, 490, -8, 150, 231, -80, -192, -54, -209, -357, -164, -408, -453, -526, -366, -570, -627, -224, -291, -591, -181, 311, 55, 25, 639, 352, 311, 830, 535, 240, 446, 545, 235, 335, 412, 32, 52, -39, -179, -271, -178, -407, -697, -192, -388, -434, -306, -374, -545, -132, -160, -401, -219, -60, 220, 219, 470, 410, 592, 222, 363, 271, 439, 415, -42, 513, 399, 80, -57, 121, -77, -234, -357, -339, -282, -334, -57, -588, -599, -57, -370, -603, 189, 241, -130, 174, 246, -47, -183, 393, 192, 79, 340, 420, 153, 33, 622, 38, -18, 453, -89, -103, 283, 265, -526, 141, -3, -433, -238, -57, -494, -398, -64, -306, -436, -229, 115, 37, -369]
1332c69N28m26K63NK47k43J70L64m33M10j67m2j99J49j15J09k96L4p1O4q9j69
1354b76J27l83J77q0J30j09J70j0M6NJ66q3R3j33K95K52j24l3J07p7l4J34K08
1377E68J08m83L21l31j16j87L16n90L1J95J15m17J2o6j57K42O1j7L20J35l3j50
1399a23M50K77k51J3j46j1L21m8m3q2m5P3l34J31J48m93k49K93q2k00J27k00L
1422d71J12J61k15r2M71l24L15L59k37j2K58k8k15K68J06k73K58M4L9l98j10J74
1444A90m16J26p4p1k47K59j18M8L1R6m56M06J44r2o1M14J29k77m5J99J31j01K0
1467B35J26Q2o2j45k9O5j99o2N6q5l6o5J00n27L61J99l57j02K40j57j63J72M56
1490A03k19K9M17l13l01K38K21j2q2J22J74k57J77q8j00J80j47Qo0L0j19J36j96
$$ y = [-369, 159, -267, -4, 1, 248, 5, 175, 539, 106, 516, 349, 307, 108, 257, 142, 251, -45, -11, -82, -18, -107, -276, -149, -532, -355, -435, -305, -414, -244, -254, -208, -203, -37, -120, -27, -160, 135, 387, 263, 230, 337, 260, 226, 360, 568, 676, 193, 514, 183, 67, -120, 196, -394, -363, -168, -53, -470, -458, -524, -681, -439, -378, -395, -75, 60, 27, -123, 327, 604, 353, 366, 220, 209, 530, 482, 439, 357, 312, 385, 51, 182, 330, -163, -412, -119, -201, -401, -274, -474, -471, -359, -198, -413, -505, -34, -358, -43, 316, 79, 67, 325, 297, 82, 350, 456, 183, 441, 485, 524, 126, 16, 190, -226, -100, -174, -245, -492, -233, -351, -303, -272, -176, -632, -226, -82, -174, -235, 179, 308, 31, -14, 185, 316, 215, 235, 361, 443, 381, 236, 207, 272, 73, 11, 67, -18, -54, -119, -19, -546, -185, 14, -343, -445, -205, -362, -525, -353, 103, -116, -87, 330, 17, -284, -46, 175, 163, 81, 203, 377, 120, 297, 209, 109, 289, 142, 150, 90, 120, 1, 137, -59]
1513e9J38j93j22j1K5K24j52K15k25J32J26o8n1M7j10l2K36r6J82k37K55R0N5
1536C69l2p2L1k07L12k62k44K82n1j16j34L9m47K68K1o6j33kN36k1k30K62j69
1559f6k52L59k6Q8P9Q2o3P6m3K16j09j80L46m7k63j33k71LL84m82L12r6r3k01
1583c80K25l9o17M14K18j10j89M43j35J46K4L45p0q9oJ50J21r6N8O4k59p0P1k20
1607aK98m16j57K2o5k05J28J49k28K86N6k16j39K82J89Ll37J40jK54O3O4J29l3
1631B65K07l49L90m63J23Q6j75ol82N09m74j47L46k94N5N7p6J70k66K55N8M2K17
1654A48Rj31K71q6k09j22M38j57Q1R4m0k83K18M5l23L54k63j66k68K78N2j78K4
1677b14J78j15j27K2j5K49l28M0M25Q2J7j95j6K94j99k4L34j04j15K25P8l16j23
$$ y = [-59, 79, -114, -236, -247, -222, 2, -150, 65, -160, -28, 98, 30, -21, 26, -84, -116, 120, 24, 206, -31, 224, 314, 369, 337, 265, 296, 89, 401, 139, -105, 177, 126, 10, -124, -85, -532, -264, -243, -309, -442, -444, 92, 71, -159, 103, -66, -318, 41, 15, 103, 182, 264, 201, 277, 234, 450, 341, 161, 507, 460, 197, 64, -207, -204, 180, -302, 10, -86, -179, -380, -155, -194, -811, -397, -179, -289, -478, -35, -170, -24, 0, 345, 275, 186, 180, 330, 451, 355, 413, 477, 218, 148, 219, -1, 297, -119, -276, -254, -319, -524, -396, -247, -475, -189, -133, -349, -488, -206, -17, -14, -351, -211, -212, 42, 105, 169, 298, 265, 472, 123, 513, 50, 173, 259, 84, 78, -304, 205, -269, -416, -70, -364, -309, -252, -328, -158, -424, -169, -111, -69, 148, 157, 26, 297, 211, 2, -120, 318, 161, 242, 336, 296, 13, 231, 276, -47, 307, 44, -122, -390, -112, -60, -238, -214, -36, -151, -278, -256, -271, -22, -350, -310, 115, 197, 214, 19, 3, 297, 98, 74, 408, 304, 189, 414, 492, 176, 53]
1700E3L60n42j31O71l06n2k8j47p4K40j85k50J32J17k22J21K51j03m1J8j09L94
1722A67N3k09R0K27k01k45M10j1P8m76J90J86o3K0l12O0J21pj30K7j70lL3JN9
1747a05l42J90L1n1J88J75L0k31J45N5K16k2O8M6j99R9j04r9NK09k89K07j63o0
1771aj59J86n5k54o7j20J65l0J18j99M11l26M17m90K08J08J73j04OM05j87rJ89
1794C85j80k15K23J76l43J24J02l31K7J22n3n7j27q3q9j29L47k75K98L9j21j43
1816c03M01j37l6J36J58K5n3K42k29K2J19O2l18q1n9mlM8j42J73m74K30P7j14
1840b60rJ10l7JK6l4J42Pj06J84OO7K34M9l66K06K1L8J9Mj61j01J23J7j67R2k85
1867a80L03n71N4J82Nj91M13q0l02L12O1K0j51l2K54N5j6n2m9O7J24k7k60L26
$$ y = [53, 413, -129, -260, 411, 105, 53, 25, -122, -196, 44, -141, -391, -259, -142, -364, -243, 8, -95, -136, -118, -227, 167, 220, 11, 101, 328, 127, -118, 292, 281, 359, -117, 73, 259, 196, 216, -96, -36, 85, 78, -52, -25, -195, -198, -165, -164, -105, -447, -257, -226, -277, -89, 86, 116, -115, 30, 85, 301, 279, 347, 393, 194, 293, 189, 90, 95, 304, 15, 222, 59, -1, -160, 26, -29, -283, -350, -470, -305, -335, -217, -416, -5, -331, 86, -404, -196, -88, 85, -19, -13, 392, 205, 196, 385, 205, -10, 213, 389, 46, 170, 272, -59, -32, 90, 37, -20, -147, -230, -319, -448, -101, -376, -78, -39, -160, -303, 98, -39, -75, 61, 219, 244, 191, 433, 204, 226, 345, 407, 89, 8, -51, -55, -58, -10, -152, 21, -453, -223, -146, -260, -269, -159, -196, -195, -169, -203, -61, -54, -160, 24, 30, 97, 331, 380, 14, 220, 241, 279, 298, 302, 141, 40, 163, 180, 13, 105, -180, 123, -448, -394, -212, -207, -398, 15, -65, -367, -55, 6, 26, -125, -157, 97, 152, 136, 84, 35, 102, 226, 199, -61, 265]
1891B65J43j42o1j31J62k98K72q2m36K41j05K44j35j49N3j06n2rK33J54k10N6
1913i3K17j5l00p4P5K38J61Q3j06J29j81J30k41O3Q1j6m7q8Q9k3j22j02N4n1R4
1938d5k29J28j7P2Kj13R4J1n6K74N1k47J16L65l15K47k8j62m2J55k57J86R8k43
1962D5J2j97K99k23o6m5k09R8N3J97j49k45M36j59q9j16K70N6J2Q3M5j57J30J89
1986B70K10j37j08K9L3j25n1k05n0J24j2J39j51k50k9M07k61j39K07m78L01J27
2008a49j07j27K93N5qP6J27j8k4j13K59r2Q7m5mJ41r2j93l2J68l38M4R9k93J9
2033b67k8Q5n9J33j50M19k11l92K37L06J65l07J02J12K80l11J09j58K6l4K52p5
2055B34O1r2k2K3k30K06k29K25l21m6J21k17J04j09MJ74q5J99k24J33l3K46N5
$$ y = [265, 408, 266, 205, 74, 236, -62, 210, 128, -308, -67, -172, 72, -63, -212, -159, -265, -317, -326, -93, 61, -149, -93, 124, 109, -191, -265, -190, 48, 209, 292, 186, 315, 134, 264, 23, 86, 167, 151, 104, 16, 105, 82, -40, -142, -88, -139, -45, -274, -146, -163, -91, -89, -202, -108, -97, -153, 121, 172, -75, 41, 406, 91, 338, 310, 148, 106, 261, 4, 190, 288, 45, 57, -140, 159, -64, -130, -175, -384, -286, -233, -36, -185, -430, 6, -153, -242, -358, -88, -32, -20, 63, 108, -49, 81, 270, 480, 343, 235, 264, 297, 172, 121, -84, -134, -10, -22, 117, -34, -284, -313, 94, -167, -306, -99, -577, -276, -149, -256, -383, -90, -35, -43, 33, 160, 142, 118, 5, 264, 172, 259, 214, 210, 351, 259, 66, 34, 202, -136, -92, 7, -286, -267, -295, -210, -269, -136, -286, 133, -78, -470, -233, 73, 238, -69, 33, 145, 425, 114, 223, 65, 91, 57, 309, 234, 295, 203, 181, 204, -26, 180, -49, 176, -145, -191, -70, -287, -183, -292, -288, -114, -199, 0, -224, -91, -124, 122, 177]
2078A77k17N1L03Qk56j00K07J14j33m3m9k1k3J22j74l6P0j21q2M2j37J62J96k36
2102a76J27k64L29j8k94K51L0J95l70L48K01m21J08K3K20n49M55nj73q7P1o5r9
2125a63K35J93k20j80K1J14L6q7j69M51l68MM1m9R6j74L10Pq2k65L99o6j56J5
2149e7r8K82L37l36J97k20j90P3K32j69j9k56J50J6k7q5pk22M12j23J05m09J91
2172b23J64J85k2n5K33k35L3K75k49Q0kl3J14l34K00N3j12j38J19k34N4mQ3J00
2196E2l32J01J29k21J96mj51p6K22N5J72k04L33j62O5k7p0o6M75m05m8R7K7K8
2220A86j50J14l94K6K45m5k94kK49m1P8j7O0K2j10N9Ln9J57k41J60K35p8p9J37
2245B21N7l72J66K12q0k35J42J2k24K05l33J05J6P3j59O2K18j98l63M23j08K66
$$ y = [177, -40, 11, 314, 322, 66, -34, 173, 287, 154, 111, 62, 41, 18, 140, -34, -70, 0, -121, -203, -161, -298, -136, 60, -176, -49, -313, 16, -2, -296, -45, -15, 180, -190, 158, 359, -62, 46, 69, 289, -260, 195, 190, 17, -70, 1, -64, -163, 72, 265, 45, -135, -114, 0, 36, -51, -220, 231, -137, -133, -92, -141, -45, -219, 91, 98, 16, -249, 150, 84, -72, -57, -155, 127, 464, 128, 325, 105, -85, -12, 220, 51, 32, -224, -74, -58, -85, -170, -177, -399, 13, -110, -5, -414, -223, -59, 126, 104, 49, 282, 47, 80, 355, 106, 186, 184, 151, 265, -69, 131, 184, 72, -66, 53, -181, -127, -131, -48, 52, -280, -179, -50, -271, -75, -79, -230, -306, -84, -29, 143, -61, 272, 110, 175, 148, 78, 12, 487, 82, 34, 131, 158, 186, 36, 150, -244, -218, 27, -18, -312, -314, -65, -106, -28, -45, 15, 37, -73, -14, -11, -70, 87, -154, 6, 241, 163, 84, 221, 278, -94, 72, 284, 204, -31, 111, 123, -101, 104, -229, -124, -108, -35, -194, -132, 86, -112, -475, -52, -160, 106]
2267A06k85L32k04P6j20J36o4K71k8j47k2m9K95k74J25J90k76k9q7m3N0Q5j25
2290h7l50L01o5K04r8J34j42N7N4k95Q6K79j48J21j18L0K54j22j37O1j53N10l08
2313F8J57N5m2J01j98R9j34j6M8k13l82N08K8j34J99l44q4J61j9M5k3K28j36J36
2337A08O6M5r7r1J77j50M8l20J62J35J52q9p5k88J59J96l40R0N9L9j48k50J97
2360b15N0j7j9R0M7K8L3k22K73J32o8j13J35P2J4O0j92J1K50k23q8l4j03L4J54
2385H9j04n5l1J6J52l31K10o8k93K93p4P8J21j53K13J19l31J85L58j97j62J95
2407B30J30j73p5J09j07L18l00J00k23J50j04k03N8J29k5o8j21k40L26k6J89k94
2429b20J64J55m22J30L76q1k24K76l60M13j49J66P1k11J34j37Mk0J81l12L14l30
$$ y = [106, -179, 153, -51, 25, -95, 41, -23, 248, 220, 73, 51, 2, 297, 23, 148, 338, 62, 33, -54, -97, -47, 38, -87, -437, -136, -201, 3, -95, 39, -103, -46, 8, -287, -201, 78, -70, 51, -67, -37, 217, 95, -42, 19, -134, 376, 68, 225, 280, 238, 339, 141, 240, 106, 90, 138, -75, -457, 51, 79, -55, 144, -200, -284, -123, -142, -97, -120, 108, -28, 108, 174, 219, 122, 31, 208, 58, 106, -214, -52, 83, 235, 146, 71, -217, -58, 138, -202, -112, -53, -14, -162, -412, -215, -165, -182, -201, -111, -64, -36, -3, -225, 48, 180, 112, -1, 134, 206, 220, 280, 88, 99, 349, 126, 38, 4, -99, -65, 89, -15, -70, -101, -85, 67, -264, -54, -122, -415, -122, -196, -118, 3, -150, 63, 182, -149, 36, 394, 197, 35, 230, 360, 187, 112, 221, 114, 432, 132, 232, 9, 159, 55, -148, -90, 39, 14, -54, -175, -415, -89, -115, 74, -220, -56, 99, -323, -193, 183, 102, -122, 154, -206, 207, 58, 224, 295, 84, 218, 81, 85, 65, 246, -66, 248, -82]
2451h2R8j88k37L94j46o4J01k29r4K17K00oj12L78l96J79R3m6m0K2R1J02j93K6
2475F8o1K63k67J55p6k89K40l39J45j55J61K47l0k20m9j28J21J77J19k63K65k24
2497a40o1K22n8J11k80O70r5l01N8j01q2R3J42m8j8r2q0J7j8j61J26J75l63O6
2521b18J05j28QJ06l6K06n68N85j43M1J75j67K52l5P9k7o5k62K64K19j96l23M1
2544h7K06l36K09l3K7J29k56n2K26k13K87j74q0j09p6K71J49k6J34k31J85q5P0
2567A35m8P4k57N7K50j55K29k35m1Q5P4Jm9j63j97K09J27m42L28k21P0K59k05
2590a15p3K26J14k7j22L04k65j51L65k05Q0m9N8l06K33K1q5j45K98o1J59m30P0
2613a06k9j35p6L08P4k34Q8q4R2p2M3M9P9k0Q2po7O6K37J86n78J18k0J66l28K24
$$ y = [-82, 16, -172, -409, -15, -161, -225, -124, -353, -447, -230, -30, -36, -148, 230, -166, 13, 106, 60, 20, 42, 133, 235, 42, 68, 7, 270, 3, 158, 82, -207, 33, -306, -161, -316, -155, 92, 62, -158, -207, -335, -214, -37, 82, -181, 84, -140, -201, 21, -37, 74, -206, 464, 369, 68, 126, 25, -57, 36, 178, 130, 112, 20, -60, -43, -61, -222, -96, 79, -284, -218, -113, -241, -233, -127, -163, 43, -525, 60, -83, -42, 133, -34, 218, 183, 262, 235, 170, -92, 172, 391, 195, -128, -87, 119, -217, -8, -41, -14, 115, -141, -193, 33, -180, 107, -67, -147, -256, -332, -61, 88, 62, 196, -35, 150, 65, 135, 87, 161, -96, -39, 211, 56, 285, 50, 9, 94, 168, 169, 120, -43, -240, -31, 96, -346, -18, -239, -169, 90, -115, -188, 38, 152, 125, 3, 307, 42, -109, 256, 51, 131, 82, 140, -166, 67, 88, 3, -142, 156, 95, 254, -176, -106, -135, -270, -346, -38, 36, -198, -110, -194, -102, -174, -131, -82, -3, -23, 59, 52, -15, 51, 288, 474, -104, 14, -6, 160, -168, 56]
2639E6J04m14P8M52m61R7n1J94k00K50l3j13ok52l2O6M31k37m4Q2P7K2K94j29
2663B31m5j87J54J96j64j0k3P4k35Q3J00j15P8l87K74j03M8R7j29KJ29M0j38j62
2687a92J83M2j35q2R6n7K29j45O5J43J7P9Oj57J98j72j26K04k09J34j70J2R9k52
2711a90K64J0l21J84j67l7n1L55J20l55%p4K54m7J29pM9K12n44L26LJ76j14p7
2735I8p5q1L70l74oJ79O9j15p1j96j54J39K27j50P7n7j73JL23Qn9k31L55Q1K16
2760D01k71L06n05K38M8j43k5N6J39j12k2j00m5J94l76J20K75l37J25l2j62q7
2782c15n7L04j68K36j08R0J59k68J2O3K73j36K29k82QJ80k59k2Q6J54l19PO5r2
2806a60J27p6Kk06o5P3M0K76j75m2K34N9j16n3J12Mj08M5L64k88j79K9M1L49l1
$$ y = [56, 160, -254, -176, 276, -185, -88, -139, 55, -145, 105, 72, -41, -47, -299, -331, -265, 166, -71, -115, -33, 44, 66, 360, 231, 186, -1, 153, 349, 185, 175, 152, 226, -9, 74, 174, 59, 137, -250, 24, -79, -31, 66, -63, -61, 68, 108, -30, -192, -9, 33, -102, -184, -88, -145, 84, -61, 4, 147, 164, 243, 249, 92, 290, 118, -8, 196, -13, 121, -49, -37, 62, -190, 74, 84, -237, -53, -220, -257, -308, 47, 167, -188, -188, -262, -8, -55, 74, 67, 116, 328, -216, 110, 113, 289, 175, 98, 23, -58, 312, -62, -68, 111, 180, 65, -6, -202, -356, -217, 10, -140, -63, -120, -293, -292, 31, 39, -20, -251, 104, 185, 401, 130, 436, -69, 169, 217, 74, 49, 105, 244, 132, 110, 10, -35, 159, -217, -97, 178, -159, -34, -66, -228, -315, -372, -68, -236, 0, -108, -18, 141, -127, -115, -52, 221, 85, 314, 32, 40, 220, -39, -61, 25, 179, -140, -133, -68, -160, -33, -109, -107, -313, -378, -305, -265, 11, -164, -206, 28, 87, -29, -82, 30, 34, -74, -29, 335, 47, -132, -103, -62, 287, 256]
2831B56k06J72R3j69n3J8k41O6J83j33j62K41N1l1p4l1j04J10l88K11j6K58o8
2854a7L78k41K25k10Q3k50j00J93k0Q1J86k67K74l55qL5J93k47p8K07k32pr2Q3
2878a86j2j41L1N26r3n4l81L04N2j74J61K20o9Qk63M48n36K60J42k59K1j35J65
2901C5j26Q2K1j7l14J49l2N7QK94l45J28j37K62l36K55lQj26L47n3k05J43J38
2925B33n7k9J10j16Op2K21k50O3k78K47O1r3k33L09l10j99L11O4j68l8J21P1J04
2949G8J50p2j60l1J85NK69k16k21L26Kl36J36j39J29r7k39PJ28O9k35K53j33J57
2973A5P1m03L11j16J26l03L91j38L7qj00J32n3j4L01j92J70p7J13j22j02n4k15
2996b30k0J64l23O85l02j19J45j13q7J23j68j51L04J95m7k22J59J08j43l4q6J38
$$ y = [256, 50, 222, 315, 146, 93, 111, -130, -64, 119, -14, -176, 65, 116, 85, 11, -20, -124, -14, -402, -191, -207, 51, -17, 361, 120, 345, 135, 218, -32, -132, 61, 41, 122, 308, 41, 315, -40, -48, -13, 180, -67, -145, 62, -170, -177, -269, -186, -198, -339, -308, 218, 125, 71, -310, -6, 46, -128, 33, 253, 184, 192, -71, 377, -159, 101, 243, -16, 5, -130, 35, -91, -9, 12, -5, -319, -170, -202, -145, -137, 157, -188, -60, -197, 65, -271, -16, -19, -11, -137, 210, 157, -48, 95, 233, 176, 147, 257, 141, 147, 75, 296, 46, 109, -169, 78, 139, 46, -187, 122, -188, -387, -76, -12, -180, -218, -97, -26, 78, 228, 156, -4, -35, 150, 155, 424, 208, -13, 313, 315, -21, 115, -24, 105, 8, -231, -224, -96, -27, -262, -9, -142, 15, 86, -317, -6, -122, 4, -299, 92, -46, -9, -17, -117, 15, -38, -52, 249, 57, 227, 150, 263, 141, 39, -15, -230, -250, -86, -409, 276, -26, -145, 0, -113, -200, -77, -245, -396, -92, 103, 56, -166, -7, 101, -42, -76, -162, -24]
3018b4R3k76P06m68Q6j65L11m05O9J59K8j79L1j09M9M0o8K06j04j7r2j7J01l41
3042c86K59J25k86j34L37L13R5l6k07R7J52j84p4R2J62m35K5J10Mm2J13j83RJ04
3066C0N3j55N0M1N8n3l7k37K45j2O4k44j4L67j05L0o9J33j97L5j28J53J73m3K00
3091C38k79PJ11k16L2j31P5K26k01l6j1P5m2J9L9j46P8Q8P0j84K13j99r7K84n3
3116F0q8r0K86j74K19j41Nnk7j08j0j65J48L15j64R3m21R2J98j85L34l58K62J06
3140A82l47R5O0l2J30J8K29k58J31j92j2p6J4K95L9j18k45K24j35K0O5j4o8k00
3164a95K7J65j25n2l6J24J6j79L31k4N6P4l16J66K26k33J36j86O8j45L92J0j10
3187A90Mk84P9L9q9K23k93J60j69J14j82j6L16q4j08Qk0J30K1k04J82J99m7j2
$$ y = [-24, 69, -207, 499, 31, 117, -48, 263, -142, -73, 86, 114, -65, -34, -143, -94, -54, -122, 84, -20, -37, -129, -146, -45, -386, -127, -2, -288, -422, -85, 228, 323, 287, 80, 177, 329, 145, 71, 163, 325, -110, -85, 25, 29, -13, 100, -83, -74, 30, 83, -72, -22, 19, 77, 24, -13, -250, -5, -17, 47, -197, -211, 156, 51, 81, 12, 145, -52, -17, -145, 8, 181, 138, 338, 59, 66, 177, -39, -7, -138, -63, 163, -38, -74, -85, -10, -52, -33, 6, -140, -62, 26, 96, -88, 125, -74, -171, 113, 60, -28, -118, 168, -6, 213, 72, 77, 72, 45, -63, -73, -238, -90, 225, 61, 154, -267, -175, 23, -162, 172, -186, 76, 182, -165, -70, -10, -42, 88, 106, 335, 77, 208, 16, 4, -72, -58, 237, 276, 158, -87, 137, 2, 22, 87, 73, 5, -195, -168, -3, -128, -180, -216, -92, -76, -255, 76, 52, 108, 182, -134, 32, 258, 25, 161, -25, 43, -102, 290, 300, 190, 194, -90, -11, 28, -61, 162, -131, 29, -140, -26, -208, -224, 92, 8, -100, -92, -112, 18, 39, -165, 17, 216, 169, 157]
3211A57Kr1J49kj00O5k45K74l1l19L05j29Q9p1j72J89j91J27j29L2l6k5o9L62
3235A41k43J20j40J97N5n6J51k82j0Q2J17j82J3J23o3L22l67J68N7k1m36Q1K21
3258D8l41L21l72J25L46j63r3J24j82L11m31M78j83r8q1L99j17Q7n5k4J2j68J78
3281A21l0J33j52mj56L05r8j98K16M2J5l20j38L14j89j66N59J29n12q0Pl2J77
3304e7L34j62k07Q4J43k28J46M9J32N1l38j7J52q3k43L50j4J50m30Q5j35J14Q4
3327d0kl4J1o1L14l37J58j74O3J88J22j16j26Q5k03J93J25J08k89J79j1j54J42
3350A41J0j23n7J86k49J9K21l07O1J78j51J24R6k73m8j65J60M4J77j15N4RQ6Q6
3374A64j08J69l23L06k75K93k33L07q5J00O5k78L9l27M14Q5o09K99j13J55rj54
$$ y = [157, 159, 68, 217, 215, 115, 180, -65, 209, 178, -141, 164, 35, 124, 53, -119, 70, -121, 6, -123, -91, -127, -152, -221, 141, -102, 18, -122, 75, 130, 74, 225, -57, -67, 15, 132, -50, -37, 86, 23, 345, -22, 146, 203, 182, -254, -173, 48, -293, 28, -344, -219, 127, -36, -129, -5, -187, 124, -307, 171, -12, -110, -191, 208, 91, 178, 123, 99, 111, -57, 121, 91, 224, 72, 68, -88, 217, 119, -79, 137, 179, 194, -126, -264, 50, -139, -305, 254, 383, -129, -209, -202, -234, -57, 277, 115, -92, -8, 135, -93, 53, 102, 234, 285, -53, -70, 82, -1, -244, 106, 92, 242, -188, -103, -238, -124, -40, -42, -76, -65, -126, 188, -149, 9, -165, -102, 86, 208, 92, -34, 51, -152, 41, 166, 274, -15, 164, 153, -1, 141, 151, 28, -29, 157, -92, -73, 148, -159, -98, 80, -71, 53, 149, -124, -172, -337, -177, -133, 44, -71, -17, -8, 78, 164, 56, 225, -98, 208, -67, 226, -7, 300, 215, 315, 380, 102, 141, -186, 228, 313, -296, 3, -110, 45, 36, -118]
3396a18M8j13k8K73k01J79k6p4q3J05L15l84J37J18R6nn35M20k45q1J11p9j3J89
3420Fl5p9N9l6Oj76N8J42l5k45K08P9J60LJ9j35k63O00j88J09r2k60J39LK98r3
3446B52l46P5j9p6R4k6j86K10K01j52l40K35K39j83j91K06q6o5Q2O3J76J6l02
3469a23K94m10L01j62P3L26m08J18p1J7R9q4K21j28o3N6Q4k07k20K24J73l30j3
3492b33P1J12p4j13J72R2J1j23J39P3q0P7L1M1q7n0j09R0j15j8K67j03J36j93
3516A4NO6r6r2l4m4K7l4J00J27j3o4j77L26o0k29K29J05j11P5o8K77j49j5o6N7
3542A56K85k05j7r6k05j2K24M8l07j46J74k14J99J51j92J07Q2J41j13k93L02j80
3564a11Q9P5K77l26n0K34k83P5k0M6L9o0L6j01K04N4k55K79k08L1k1r3L6L7L4
$$ y = [-118, -70, -183, -211, 62, -139, 40, 14, -60, -143, -38, 277, -107, 30, 148, 244, 239, -296, 124, -121, -202, -91, -170, -183, 6, -29, -108, -49, -85, -79, -255, -197, -55, -90, -335, -127, -48, 112, 115, 134, -1, -264, 336, 148, 257, 165, -95, 44, 47, 345, 252, -94, -19, -38, -114, -20, -46, -232, -22, 179, 27, -313, -78, 161, -22, -213, -7, -93, -158, -76, -13, 163, 179, -123, 171, -239, 62, -100, -27, 299, -109, 9, -62, -45, 54, -30, 191, 63, 0, 56, 140, -67, -287, -63, 110, -220, -233, -162, -50, -124, -237, -65, 27, 38, -85, 54, 127, 47, 124, 155, 196, 109, 59, -50, 40, -75, -93, 174, 71, 207, 14, 19, 85, -11, -103, -137, -181, -154, -188, -88, 39, 26, -38, -215, 111, 51, -178, 51, 156, 45, 120, 52, 329, 180, 165, 99, 156, 441, 236, 219, 123, -82, -94, 130, 178, -129, -275, -101, -315, -116, 35, -157, -50, 32, 173, 60, -233, 69, -111, -22, 53, 330, 4, -46, 188, -95, -20, -40, 6, 45, -15, 21, -80, 124, 178, -77, 202, -6, 25, 4, -89, -53, -16, 18]
3589A8QK6q0J52p4k47R5J09J9P5j62L08j58k48K89k7l46J69J26k17J53J18l1K9
3613A04j86J68j42n4j4QJ99j54J24r7j15J99n8j94M30k47l7j68L70P6Q8k44o2
3636fK76j45n7k7J73j51k6K80l67J46k87L02j02m5M1l56K02L7K48j35j09K7R0
3659Iq4J37k55K19Q5j17O1J55q4k34K34k80J90J62j21j1k27j6J80n3R1j0J98o0
3683A69j57j13J81j39rj15j19K78L1qk06P7K02j04K9kJ10O6j67r7K03l8j2m6J78
3708A92k70l5Q2J28j19j02J83o1m3o3K85j48J7R5j96K6J18l6l11L15rJ55l16P8
3732c5J80J80m20K31k8j33j27M19j76m14M90l15O6L9J10j17J91l42L67J2O0l91
3754a53J7K07j38J79j91J7L0q7K74n5J7J23k57j6n4N02l06R7k67J40l2k15J81
$$ y = [18, 26, 52, -28, 124, 50, -197, -102, 7, 26, 101, -61, 247, 89, -159, 130, 103, -243, -74, 52, -165, -12, 106, 75, 104, -82, 86, -56, -110, -124, -116, 83, -71, 53, -44, -159, 40, -18, -212, 218, -29, -66, -234, 136, 212, 300, 56, -6, 270, 125, 68, 41, 214, 63, 37, 317, -50, 96, -191, 111, 9, -36, 5, -351, -149, -112, 136, 1, -108, -81, 9, -75, 62, -193, 26, 111, -6, 55, 210, 126, -108, 126, -154, 36, 198, 77, 66, -161, -177, 3, -50, 41, 31, 229, 169, 12, -101, 80, -59, -68, -183, -302, -24, 7, -1, -207, -130, 72, -32, -3, -5, 105, 171, 4, -93, 110, 72, 60, 14, 192, -78, -113, -31, 97, -22, -124, 59, -2, -45, -108, 177, 29, 46, 141, -55, -29, 89, 53, -258, 57, 48, 203, -113, -35, 145, 325, -95, 136, 108, -25, -152, 267, 91, -323, 167, -148, -82, -43, 67, -50, 141, -201, 166, 178, 238, -153, -136, 71, -67, 112, -79, -62, -32, -119, 155, 100, 117, 240, -17, -33, -87, 415, 109, 206, -61, 79, 47, -168, 13]
3777A3J2k37L62l69K38K8m33K73M6R2j76P0l2J03k62L39K75k07k06k56L49n9J11
3800G4J05j08K21l17J13j25J39j16Q3P2k10P6Q2R5l60K80m66L40nj86J13p5J75
3823@j32P5J00k04K97j79j72J09R0J08n3j12J27k3j66O7J77J51k77rK7lk9j63
3847a94K09J0j9q9l3M1J37n2J70n5j39P2K73k42K40l67N8J25l0l7O1l37M31k82
3871d9J78j45K1K56k52n4q4N8R7n1o0mj60M48q3pR3l17n5J10J69J9K7m5k55K94
3897A49q7j80J44l5j75J36J47l49M32l54O4J71p1J6J61l81J95k12K47Kl36L68
3919E2J79m03L26k73J73j04O8%r2q0L91k96Q9M1q0J03k43L85k92J12j52k36L03
3942b9K82l94J53k95K71K58m08L19k08j5K4O8R9j40K37k13N7K30k80p6K33K1j70
$$ y = [13, 25, -212, 150, -219, 19, 47, -386, -113, -67, 25, -151, -81, -113, -10, -272, 67, 342, 135, -71, -327, 22, -37, 74, 179, 71, 292, -25, 88, -37, 102, -14, 69, 141, -69, 7, 89, 184, -176, 104, -362, -22, -27, -213, -100, -175, 0, -132, -57, 43, -161, 136, -43, -215, -106, -16, 92, 39, -73, 54, 31, -135, -68, 109, 260, -17, -26, 1, -2, -31, -194, 15, 25, 6, -83, -116, -75, 62, 10, 180, 125, -14, 58, 331, 89, 329, -38, 20, 145, 115, 78, 139, -198, 233, -49, 129, -16, 5, 261, 9, -45, -129, -71, 26, -25, -85, -89, -249, 199, 116, 109, 202, -115, -170, -60, 109, 128, 155, 110, -145, 149, 62, -118, 26, -9, -184, -48, 99, -250, 182, -172, -108, 63, -8, 8, 169, -212, -17, -229, 18, 20, -316, 52, 231, -172, 154, -119, 54, -50, 18, 18, -74, -154, 237, -59, 30, 71, -9, 94, -149, 236, -56, 56, -96, -332, -29, 253, -141, 12, -283, -12, 246, -162, 157, -51, -66, -42, 26, 125, -15, 222, 9, 66, 296, 16, -60, 173, 194, 24]
3965B4l9o8N6L7l6R8j13N0j15J09L6j92K13j9l7l2J34j38O1N9j28j27K28J08j72
3990cJ2J60j85P7J39j07n7m5J12m25K94N4K49k20j95K03q7K0j74J52p6N1l%J31
4015G7qj08L3J0Q4l4j91mn1J37J39j88N8O6K7Q3j80Nk7P9P5k25P7j85K07j43L25
4042A38n3k55J43j2o9J15L1m8j4n9O7K19k12K43k3l54L36l58J32K53j93K8j12
4065e7o2q1K78j64j28J97N8k96Q6J89N9j61o1K6r1K86K9j47rJ08O1m8J6j30Mj18
4091a56L89l31j35J47j64L12n6o2J03K56m77k15K97K57k61k44J67O1R6j87O0J93
4113E0J52k22q0M6n1K88k83j8K72J5j21p5OK9p0K07m0k17n1p0K44j45J26p6J15
4138C1jr4K7l17J54J55O5k6J18l32J46K93l57o4J34J50k04M8k7M2O9nJ39j43O3
$$ y = [24, -15, -83, -27, 10, -26, 72, -41, 9, -106, 3, 39, -153, 60, 41, 4, -28, 106, -32, 29, 88, -40, -167, 61, 169, -3, 9, 169, -16, 61, 200, 93, 36, -9, 103, -322, -28, 26, 275, 55, -140, 63, -24, -4, -178, -26, -102, -51, -54, -54, 77, 69, -39, -6, 4, 88, 54, -137, -141, -192, -55, 84, -104, -46, 20, 47, 130, -50, -45, -72, 7, 82, -143, -66, -251, -44, -187, 138, 85, -170, -27, -39, -108, 7, 38, -10, -24, -83, -16, 203, -9, 234, 211, -143, 193, -165, -33, 220, 27, 55, -57, -119, -200, 78, -86, -214, -17, 41, -255, -169, 20, 79, -82, -143, -117, -208, 78, 107, -40, -49, 59, 120, 72, 88, -42, -38, -156, 233, -98, -233, -86, -250, 62, 6, -56, 47, 303, -174, -389, -92, 165, -96, -340, -173, -112, -16, -203, -143, 50, 202, -20, -100, -54, -105, 183, -100, -118, 154, 169, 48, -27, -21, 8, -62, 145, 105, -112, -163, -233, 11, -134, -8, -84, 31, 30, -64, -37, -354, -200, -45, 20, -6, 112, -220, -74, 219, -138, -202, -68, 82, -122, -74, -101, -59, 10, 5, 144, 1, 64]
4163F4m68J89J07Q0J1j2j2l0k2N8J15q4Q8J7l94K47P8jkp9J7J12o8nJ3j14J80
4190H5j20J02q5K22r5N3j36p8N2K7M9L2k12N0k15L35k1m6K3p6K30l17K29j74%
4215h6K35J4j47M7R6K3k54K3L33r7j06J39q8p0q2M9R3k56L14J84n63J54JL46l85
4240h3J69L1j61Q0K9o6r1J42j0K66j77p3K52o1j70%m1q4J21L33m76K36j32n6k49
4265b71K88J16o4k14K02j8R9k63J7K75k11J22K0j00N4P1l44J63k8J2j23K28n2
4288b1J42r1j2k50L87l20R3Ol8K62j08j10l6J00L0k5j24J01k17N07k63q7k73L58
4312A1j45K88l9j85j33J43J08l5Q7N7J01k14q5M13l66OJ68k31O2O9L6o2j20M8
4336a8J44r6k0k07K11r0J21ok32J56m15O00l63K15L01l90J89Q8L1j70j14l3M0
$$ y = [64, -404, -215, -108, -28, -17, -29, -41, -71, -93, -35, 80, -4, 84, 101, -293, -46, 32, 31, 29, -50, -33, 79, 11, 6, 19, -95, 85, -35, 67, -18, 204, 109, 162, 26, -52, 0, 27, 76, 108, -104, -54, -269, 66, 45, -1, 22, -54, 176, -141, 88, -86, -86, 149, 163, 16, 63, 159, 182, -72, -49, 284, 187, 81, 220, 132, 62, -20, 29, 122, -134, 180, 364, -199, -45, -44, 302, -83, 86, 117, -44, 36, 65, -1, -92, 50, 40, 306, 129, 56, 308, 247, 77, 77, 36, -48, 73, 406, -70, 166, 34, -22, -271, 17, 133, 69, -145, 57, 39, 138, -125, -108, 167, -44, 78, 98, -2, 52, 123, -221, -58, -86, -74, -197, 31, -21, 121, 30, 18, -232, 155, -165, -72, -66, -104, 158, 50, -60, -96, 4, 34, 9, -115, -14, -231, 276, 13, -74, -347, 11, -134, 154, 115, -70, -203, -60, 48, 13, 100, 157, 258, 44, -41, 372, 6, 12, 180, -51, 11, 80, 116, 54, -66, -18, 126, 30, 10, -197, 14, -76, 45, 39, -193, -37, -452, 148, -215, 0, 301, -89, 100, 188, 219, 49, -65, -98, -58]
4359e8PO6L4k81K05l30K19K33O2r4o8J53l08J59l57M44pj22j00L42j64R9l85L50
4383I9K2l8J9m2l%l8J31q7j39J30J70j16r7L4O0p0q9K2mn2K43k61L04l16j23R0
4410a51J80j4k9L04k06p1K4q3l3J06j63k7J69n8l4N4J45l04J73K35r0m5k26P9
4434f5J0J67n5J6j5j60K29k94L13o1r4K00j69r0K92m8j06k42K67k34J96L9J10
4457B06k05j27L6J28p5m1l7J63j9%J19k68J6K79m12K28L2Q5j74J9O5o8J74j10
4481A4P9L5k83J39J78k99Q8J12N3l8j90J27r5k48L70k17O9j07K14l1j24n7l5K93
4505D7j60J51J36l63K3j5J98j1O7L6j40j27L48n4k48J48K4j81j1J80k25L6K27
4528H6n9j52P2o9N3J77j23J9Q4j46L02p0k40M9J16j73J11j06pL74o47L91J75m81
$$ y = [-58, -51, 15, 49, -232, -27, -357, -138, 95, 157, 63, -5, 148, -160, -1, -358, 86, 79, -43, -143, 199, 35, 134, -251, 99, 121, 83, 102, 60, 57, 57, 19, 150, 63, -76, 54, 224, 108, 11, 45, 105, 35, -54, -32, -36, -88, 155, -106, 198, -118, -241, -151, 29, 15, -14, 290, 84, 13, 37, -46, -79, 27, -136, -163, 6, -52, -86, -32, 113, -191, -18, 217, 127, 82, -144, -65, -55, 112, 57, 73, 58, -102, 127, -167, 146, 85, -9, 191, 22, -68, 224, 176, 70, -172, 95, -139, 57, 96, 206, 1, -126, -90, 38, -37, -78, -115, 48, 29, 29, 148, -120, -104, 175, -237, -9, 23, 108, -66, -47, 18, -50, 124, 14, 93, 128, -155, -16, 162, -137, -49, 63, 116, 78, -112, 15, -80, -328, 42, -175, -106, -213, 1, -30, -154, -211, -246, 47, -113, 38, 174, -189, -166, -181, 17, 6, 73, 109, -31, -158, 190, 136, -112, 36, 60, -121, -132, 48, -177, -141, 86, 27, -125, -53, -122, -69, 108, -15, 4, 88, -58, 244, 174, -66, -17, 99, -74, 37, -69, -76, 298, -349, 42, 217, -264]
4552b64K76Pl5k7n5L29n06J58K11j88J24j30J96k77J13J26J18j71l6jM1J14k05
4575h2P6J93p5Lk5r1k33L42j85J92k60J44r9m2M7J37k5M5r4o6J50k60K53j20J55
4600H0j7j18l7oK79j69j69J86j26L80m68K53k18K3M06l08P9l81K64M0K30k04K23
4623B22q9K4k07J24k64J82J09Q1j3Q4k90L07k09L3jK2l6m4J11M1pp0k24M9l0J28
4649C3J05Knq5n8K02l3k09j14N1K19o4J95k71J45k91L94m1j03m7k70K07J41J42
4673B45j87R8m3l29N23j82m2N6j28O7k87K10J54j33j17Mm6J71k45J25J17j01K45
4696A75k40j14J47O2J18On8q3m8J53j32m9K37l74M94q9j93L20j78r9j60J51N8
4719A04J9k19J65k11n5OM46l58L29r0j62K26j60j94J08M7n2j08J48j85L1K46j34
$$ y = [-264, 12, 19, -16, -43, -98, 231, -275, -117, 94, -94, 30, -100, 96, -181, -68, 58, 176, 5, -31, -32, 9, 123, -82, -6, 187, 112, 115, 90, -1, -234, 108, -77, 115, -145, -1, -100, -142, -95, 42, 17, 62, -32, -98, 52, -208, 45, -75, 80, 63, -55, -92, -98, 181, 12, -157, 29, -97, 283, -185, 68, -150, -127, 279, -29, 50, -331, -67, -27, 203, -1, 222, 133, 157, -50, 74, -190, -8, 101, 182, 169, 253, -37, 270, 61, 94, 93, 115, 79, 35, 146, 187, 180, 110, -114, -65, -95, 33, 138, 140, 135, 50, -8, 194, 161, -48, -162, -111, 108, 44, 239, -32, 113, -178, 216, 175, 72, 25, -245, -38, 103, 245, 58, 156, 113, -216, 307, 125, 83, 139, 11, 78, -209, 1, 155, 22, -95, -91, -137, 34, -211, -86, 31, -70, 175, -65, -179, -32, 30, 148, 154, 96, 13, -35, 118, -14, -63, 174, -200, 294, 205, 12, 332, 154, 55, -105, 46, 104, 123, -96, 69, -142, -197, -191, 255, -103, 226, 136, -26, 200, 40, -154, -46, 1, -51, -159, -11, -196, -165, 81, -53]
4742e3J43k60M89k17K8k64n3K44J03j54m2K02j41J52l40M03m80M77j59k64K48
4763F2j08Qp2L95m72J72k30lK70o2Q1P7q0L1j06J28K09o9k55J24j89J90j17J65
4787A49O5k38K87k48R3j20j4J77j05j73K08j81K40j93L0r8J12M5P7Nj25J08k8
4810G3j08J05j42m5J62k60J98j36j8K03j02o2l0J57J09k77J96J6j64J72N5j6n1
4833C5j39L4O1J05J8L0j50mL2m7J32M2j96j17J58j65K52r0K0J19j71J84k67J50
4857B6j4P0j62O9n3PJ07q6J61k05O9j26L59l16J25k23N9J26M3J44k49J59j99L1
4881g8K07j50n9j77K92Q2j83%J23j8k8N4j86K54j28j05J5M19j77l30J37J02L7
4904A03J09K2k59j49L26k07P6J8q7J96l04NJ66K04j78M1k58Q7L9K3j53M73ok71
$$ y = [-53, 90, -170, 319, 102, 130, -134, -187, 57, 160, 6, -36, 166, 25, 177, -163, 240, -240, 237, 78, -186, 62, -46, -38, -110, 285, -187, -15, -245, -248, 22, -40, 41, 118, 38, 69, -37, 91, 300, 231, -24, 100, -89, 101, -16, 149, 214, -24, 263, 15, 108, -12, -26, 151, 46, -127, 81, -100, 140, -53, -23, -121, -9, 36, 113, 118, -7, 101, 73, -35, 70, -72, -117, 45, -215, -17, -153, -171, 32, -70, -132, -162, -5, 104, -173, 23, 39, -125, 47, 102, 86, 35, -104, -70, -9, 96, 114, 144, -6, -10, 22, -25, 107, 149, -47, -164, -6, -171, 81, -9, 11, 130, -41, 143, -124, 26, 12, 82, -80, -11, -64, -57, 50, -36, 125, -80, -11, -137, 222, -94, 31, -192, -133, -7, 36, 180, -69, 90, -109, -78, 129, -21, -80, -257, 35, 117, -66, -66, 57, 39, 11, 65, -121, 133, 5, -100, -85, 334, 157, -173, -36, 66, 103, 212, 234, -25, -174, 152, -55, 21, 39, -48, 148, -156, -151, 15, 219, 41, 82, -176, -89, -50, -27, -180, 293, 287, 16]
4928A6j23K40J4l38J37N6K07k69j7J1j31J26J73o6j00j2K58k56QJ6N5%r2J85n6
4953D2k10P2K10j91o3n4L16k47N2Q2P8k7N5j57R0j48J59J08j5j2k06N5JJ30K9
4978A49mK6l88J58J5Q1j9N7j92j69K69qK87k67K43l63l5L30J77m87N1k2J71k1
5002C9k94K28J50n2N1o6j34J31J84k26mJ85l86J80n7J06p8J05P7j30oj01k0L46
5026B28m05K56J45j86J01k71K92p5r1j5J08j91N6%J85l43K42J08p9Q2k95r1K26
5049a3L5O0j49O0J34k75K08O8j34n7R1J06j56k49L67j94j27K08J84m23J20J21
5071a5n8J21J5K3j71O9J14j01j06L12k54j46L05k05n2J95k2K19k56n2M6j86K75
5094G0r3L02r6j62J48k61O9L4J89k18q0P5M3k22J10j6O9L10l64mJ13k05k8N4L09
$$ y = [16, -107, 133, 147, -191, -54, 2, 209, -60, -77, -66, -197, -71, 102, 36, -64, -76, 182, -74, -66, -50, 5, 5, -87, 98, 42, -168, -96, 114, -77, -140, -194, 122, -125, -73, 9, 87, 60, 115, -42, 48, -100, 59, 167, 152, 140, -66, -11, -10, 120, 149, 145, 171, -217, -59, -44, 37, 18, 75, -117, -286, -17, -25, 262, -5, 238, -125, -160, 170, 347, -140, -89, -111, 60, 39, -255, -27, 123, 71, 122, 56, -78, 53, 237, 11, 7, 192, -194, -14, -71, 35, -43, 62, 139, 9, 3, -98, -118, 228, -177, 79, 224, 38, 139, -132, 160, 85, -6, -21, 87, -104, -48, -48, 137, -206, 36, 144, 65, 147, -148, -239, -13, 22, 82, -67, -7, 127, -148, 60, 128, -6, -63, 28, 134, -22, -271, 96, -98, -225, -17, 167, -256, -136, -15, -73, 48, 63, 86, -85, -16, 98, -3, -109, 203, -51, -197, 108, -97, -149, 46, 24, 243, -13, -65, -19, -205, 70, -23, 279, 183, 21, 169, -92, -23, 11, 200, -18, -98, -23, 20, -202, -92, -108, -39, 271, -93, -97, 16, -189, -217, -163, 146]
5119A46l67L39j32L0l9J81j53K5K6j43P9jJ17K4j32j28J83j59O5J48r8NJ2k8n
5144eJ20Nk23L08p8j89l2j98J26K99Ml32j19K14K57j31k9M5k4j72K37M8k34j11
5168b14J25J19L5k19J34j47J44Q6M6J42L7pl34O2J62o8j64L05j53J0k40J1L21
5191A93P5k7j70l27N42l53J64j02K43n0l56%J54M6l4K00k84r9J62J70q2L7k87
5214a85J27l7L68j76k77J44j32R6J70l8Q1Rj63j25K01j87j8J23m3j6K2K32n1j08
5238A7k8k20L48j77l7r3J79J14k30J98l0k33P1R5J62j0j63J08O4l39J97J15j34
5261b6k6j03J16J56k81K33J96j96k48m4K91j77M3P5r9R8j7k9J89rR2j61J9L34
5285D26k99j96O3J11K1j21L4m5P9r3J08j60r4N5K52j3k10P2J82l9k37J41mk79
$$ y = [146, -221, 118, -14, 16, -23, 158, 5, 30, 56, -87, -8, -9, 108, 132, 0, -128, 55, -104, -39, 109, 11, 16, 28, 0, -5, 115, 120, -103, 205, 127, -62, -94, -292, -166, 133, 137, -195, -314, -100, 157, 26, -3, 42, 18, -154, 83, 131, -103, -214, -89, 30, 65, -154, -20, -167, -23, 63, 109, 251, 288, 281, -53, 9, 171, 103, -61, 244, 91, 101, -139, -128, 193, 268, 241, 71, -256, 286, -67, 97, -5, 238, 188, -168, -168, -14, 32, -2, 198, -86, -185, -23, 147, 65, 102, -185, -58, -95, 273, 97, -180, -36, -168, -72, 98, 60, 141, 150, -13, -138, 63, -124, -142, -19, -62, -78, -56, 176, 125, 17, -11, -231, 117, -60, -97, -190, -11, 103, -127, 71, 41, -192, -121, -26, 136, 126, -37, 71, 135, -204, -7, 108, -26, -52, -155, -39, 117, -164, 69, 265, 69, -179, -223, 68, -109, -66, 9, -90, 8, -9, -38, 151, 142, 234, 73, 92, 426, 127, -69, -6, 105, 126, 5, 39, -6, 73, -20, 88, -72, -166, -111, 141, 128, -82, -10, 172, 133, -104, 37, 33, -246]
5309b46K22M2Ok28J69L30j13l53K95j46k71K94mj81K99l15N09l36J43M9j81J71
5331A55l0j90j31L12j68r5m6K30k9Q3J57k80J11K15k18n9J15j80R0k3Q8k48J45
5354DJ4j6J6Q6m4j11pm5J86K23l70L5j06K23K0j47O7K06j64j73R4P5j27J05j51
5379a07Q4J20j09j33J35j75L46m8r5r9J06j42L00l6l01J40J9j98j51O61j26j37
5401E4L4k09M10l42o3J89M4j54M1l8L9K19l09mKP3P9M7r3l6k62K32O7m3k64L97
5427A10j75R2P6k42J58j97J15K68k33K04k30K19j04n1M4j43Q7J35j35R6j3k88
5449b07L86k81n7K57l37O5j73M14L01l44j15O7Q4j61K41L3p1j95J01k50RJ50Q4
5472AQ4l2j28O9J24m0J7j75R6o2j08N4J89Q6Qj59M4nJ01j09j49j46N5R4N5L4K5
$$ y = [-246, -24, 18, 24, -204, -35, 295, 182, -171, 124, -22, -293, 1, -3, -184, 115, -200, 309, -27, 116, 165, -16, 155, 125, -65, -196, 116, -52, -147, -193, 37, 8, 91, 248, -32, 79, 294, 76, 17, 132, -48, 42, 19, 107, -141, 4, 18, 2, 18, 104, 60, -51, -58, -103, 83, 306, -64, -29, -135, 88, 108, -39, 28, 234, 70, -103, -9, 66, -61, 44, -107, -23, 97, -12, -145, -10, -185, 161, 113, 18, -81, 25, -117, 183, 147, -154, -14, 5, -193, -344, 317, 191, 54, 88, -121, 289, -53, -116, 73, 117, -37, 4, -34, 5, 224, -85, -89, -87, -14, 65, 112, 19, -17, -279, -47, 20, -23, -287, 110, -65, 27, 103, -139, 19, -178, -63, 205, -28, 176, -54, 165, 61, 10, 54, -89, -2, 133, -2, 94, 81, -207, 179, -102, -159, 98, -239, -174, -347, 67, 368, 24, -91, -24, 60, -101, 140, 173, 102, -93, 8, -242, -233, -83, 1, 85, 53, -75, -6, 118, 78, 95, -80, 16, -46, -154, -100, 89, 175, 183, 24, 68, 63, 164, 55, -94, -240, -185, -91, -36, -2, 23]
5499B3J6l8ll0J6j49O8P5M7p3K55n41K32J29l6K41l13J00mR3k31j08L77l21rL10
5525A26k33K21m5J74or6j48J25Ok30L91l85K29k95L41j06m7M0j19L98n54L94p
5548A74k3O9k33K6J27J64l39Q4k12K64M8k15k7m0J25n5q6K04L1j01k1J73j00O2
5572I9j8k18KK79j16M6j44l2O8p0N0M3K9J7j1l02M71p9k5m7j08n5k2P0j0j0J6
5599g7o4J05j78K25J89k60m3N5m1K9J22M7k83M70k38q6K09l12K20K5M7j43n3o3
5623i8J08J76k38k7n0k6M01n39L17R6j51m0J03J58j24o9q1M6K1J65j41K03k08
5646BJ23k01O7P5j3j07J88j40N3n6K20q8j72J94m41N91l96p4R5j48L25j05j22
5669a30L38k48O5m0J07k50P1K27l70J71o4K60Mjj36K06m13J80P7j59Q4L53l98
$$ y = [23, 39, 1, -2, -32, -16, -165, -97, -22, 25, -48, 207, -334, -102, 27, -9, 232, -81, 19, 15, 108, -123, -231, 146, -175, -184, 126, -107, 114, 69, 243, 237, 141, -7, 118, 124, -106, 285, -100, 129, -166, 175, 69, 22, 62, -57, 341, -213, 181, 174, 151, 220, -13, 13, 140, 304, -35, 49, -163, 101, 149, -66, -93, -133, -8, -63, -149, 55, 86, -15, -36, 137, 37, 99, 81, -137, -135, 144, 28, 74, -70, -102, -34, -104, -54, -11, 18, 35, 24, -278, 193, 114, 89, 42, -66, -121, -143, -73, -83, -93, -77, -141, -36, -214, 11, 200, -60, -103, -48, -89, -60, 62, 109, -174, 296, 58, -28, 181, -131, 89, 114, 161, 18, -35, -98, 10, 186, -52, -79, -129, -155, 246, -293, 24, 120, -31, -71, 32, 190, 66, -3, -84, -38, -17, 148, 7, 210, 2, 125, -76, -9, 66, 53, -54, 134, -6, 47, -9, 211, 123, -49, 145, -296, 295, -101, -175, -80, -228, 97, -8, -130, 208, -40, 25, -15, 92, -158, -87, 140, -230, -59, -123, 137, 141, 140, 4, 210, -203, -23, 54, -105, -21, 332, -66]
5692f6k6K9L3J18j32n1L95l68J97l83J77J83r9j40K97k43J4r7L63m77K49m4j5
5715h6j39K32K7o0J09j96J71k50L64m89L99J40k65J48J2l81N04k88J72j29k8K3
5737a0lM5q9L73m61K25N4l68R5o9K27P2k19J80pn2Q0K8k07j20R3K81q9k82L44
5762A21q0k22R5N1J64J3o6j8O9q3pn6j0J36j80j72M31j15j43K30J55j38l3m7j45
5787e0%No6K38m8j06O8j44QO8j07K06K61m11L9J9L0J19L6j45P5q0J20j57R4l58
5813b86K92m1P9o0M3K6Pk34J85J04n1j72k18P5L66Jj16l2O0k62K09j10J51j23
5837a07L19n3kj93L22j20o2j26J37m1j94N5K37Q3k73K05n5n6k11J25pN2j26j15
5861b06J08K8k24L45J67l63R7Q8j28J00l9K17j16r1J2O6K19j03p1q8M6p4J2K2
$$ y = [-66, -92, -63, -30, 88, -44, -95, 300, -68, 129, -254, -77, 106, 7, -133, 164, -79, -65, -162, 201, -276, -27, -71, -86, -225, 7, 34, -26, 83, -113, 58, -192, 172, -317, 82, 222, -43, 105, 117, -264, 240, -48, 124, -5, -33, -10, -13, 32, -57, 316, -145, 80, 134, -234, -139, -208, 19, 91, -128, 52, 45, -7, 73, 101, -106, -226, -133, 148, 59, -223, 121, 41, -181, -86, -35, 129, 142, 76, 58, 127, 44, 37, -19, -29, 107, -73, -245, 186, 71, -72, 158, 313, 175, 142, 95, -50, -50, -45, -111, 127, 79, -27, 41, -103, -95, -27, -134, 72, 333, -78, -39, -20, 10, 129, 165, 20, 95, 15, 135, -22, 72, -286, 6, -35, 44, -16, 27, 53, 60, -174, 11, 115, 64, -108, -326, -251, 115, 116, 0, -32, 28, -234, -25, -135, 16, -107, 212, 159, 157, -36, 286, 166, 104, -22, 115, 74, -120, -65, 172, 255, -18, 187, 132, 76, -135, -10, -17, 35, -91, -206, -98, -70, -294, 51, 218, -145, -48, 40, -88, 12, -27, 190, 74, -17, -5, 61, 280, 177, 106, 18, 64, -10, 2, 24]
5885B4j90N8j66L51j43j84J37j24L18j07o9J96k4o2K70k97J43j40K0n7kL2k31
5908b47J54J7MJ77l57K07nJ25k70K44j35K2K7LK8k3k15N9M8J08j53K57n31N78
5932A22j58N2r4M0N9j78L66n0K3j18r3J53k38J55k57K06j31K41J38l20L93n89
5954b78K16j8j07J61K8l5r0J19L14j92N1k65K86j79L62k04l78J32L02m13J15J2
5976f1j33J97l3K66k25Q5j94K01k22K62j70L2N7k27J51J60j20K2O1j88m5P1Q3
5999C0j35J07M8PJ39o6l83L98O7k49J80j67M5j02J45j28J77M9q5L3j25j80L97
6022B02K05o25M08j0l77J66Q9O1p0J7l86N86J9k91n6L06j70k2l8o9K7j97J93K94
6046B62k64j62Q9o4P2M3J48j65K99l42p8J95q5K17k42j49L51l29L41n5j33J40
$$ y = [24, -166, -108, -274, 77, -66, -250, -113, -237, 81, -26, -95, 101, 77, 15, 285, -12, 131, -9, 11, -46, -48, -16, -247, -93, -76, -72, 105, -252, -45, -50, 75, -195, 49, -86, -64, -37, -34, -6, -29, -244, -185, -137, -29, -182, 75, -456, 122, -36, 16, -78, -38, 21, -157, 209, 159, 182, 64, -29, 124, -114, 41, -216, -10, -141, 100, 238, -82, 311, -278, -62, -80, -187, -26, 2, -33, -123, -4, 310, 118, 169, -96, 190, 11, 373, 169, -209, -77, 225, -188, -73, -61, -194, 3, -30, 236, 11, 96, -98, 103, -119, 143, -27, 5, 62, -165, -14, 146, 26, 48, 109, -79, -124, -53, 30, -105, 2, 50, 57, 196, 130, -253, 145, 212, -37, 143, -24, 21, -81, 64, -64, 113, 162, 77, 110, -15, -195, 202, 407, -218, 190, 180, -197, -31, 58, 119, 49, 66, -320, 266, 285, -6, -62, 244, 74, 52, 14, -55, -28, -225, -32, 262, -2, -164, -75, -139, -67, -24, 124, -41, 258, -84, -162, 33, -52, 165, -77, -226, 125, -204, 137, 82, -51, 89]
6068H9m5n1k18K08J76l9k48M44rl66J62J63j60q5M1K01j26q6J44k55P7k60KJ07
6092a34J90j68J15j69J96k37M01j64m9j74K35J41l68L80k65K22r4j22oP5L5j80
6114a40L4K05l7j34j83J14K00L0J00j4j49m8r2K32r%j08j16m2J77j84O0Q4ko7
6139h9J00J6k82J35J3Jl4L52l07j03K06j17J16q7O5J57N1k39K2kLJ16O4k07L51
6164C01l94K79K51l96o5J28N8k39r8K9K12J14j96q8J05j91L65j86O6j72J21K75
6186B79j48M4l47P6K60l47J71L0k6o2P6K3j2n7Jj35K57J55k00K5q8p3qK38m5K
6212H9j0n7j23K8l3J66k3J2j75J18J5J59j72K53l83J15r1J8J75k8nk0j20N8K36
6237B02j82P2k3l74K28k9o3r9K86k5m6J55j47j34K31K3P8r2q9o7Pk8K3M53n38
$$ y = [89, 44, -7, -225, -17, 159, 120, -128, 316, 307, -59, 103, 266, 106, 21, 62, 263, 137, 51, 195, -60, 17, -243, -241, -134, 56, -112, 3, -166, 30, -207, 194, 30, -19, -193, 42, 183, -185, 195, -70, 152, 58, -64, -70, 5, 40, -140, -106, 99, 62, -72, -255, -141, 59, 89, 189, 175, 26, -22, -114, 118, 109, 109, 1, -115, -157, 20, -164, -104, -20, -22, -89, 11, 27, -255, -120, -107, -106, -140, 212, -95, -198, 8, -109, 7, -80, -15, 142, 193, -46, -24, -26, -23, 93, 157, -50, 301, -93, 186, 437, 41, -24, 104, 162, -77, -175, -146, 66, 180, -16, -104, 1, -190, 175, -11, 55, -117, 4, 279, 131, 175, -172, -96, 164, -183, -12, 18, -8, -70, 6, 29, 17, -40, -39, -174, 83, 238, 38, 63, -25, -98, -106, 132, 87, 89, 79, 22, -101, -73, -106, 60, 37, 49, -126, -8, 7, 166, -6, 247, -136, -21, -112, -94, 81, 53, 48, 28, -92, -34, 202, 20, 92, 69, -305, -77, -106, -169, -268, 18, -7, -53, 102, -45, -179, 52, 75, 153, 61, -28, -95, -88, -116, -93, 360, -178]
6262a78K10Q0k3J6j35j85K88q8R2l5m9M4o9J62n6K3k68J83k7k52K69J90k01K78
6286B69q2j16Q2l0k91J15j32J66J16M2k24M54n32R6J39j20o5L6L37k78n2K02l9
6309I3k05K92m56M79k48l4J28J1j5N1N1N9o3k52o4J63J03k35qJ15Km1l5J77PJ18
6335A93k26M6l3M2N9L0K00n69Q7J28r8P0M7L8L3k39J73p4K69L4pk12J06m8N6r9
$$ y = [-178, 32, 112, 89, 105, -30, -215, 73, -15, 77, 42, -7, 37, -32, 130, 74, 97, -171, 12, -15, -267, 2, 192, -9, 269, 187, 71, 153, 123, -168, -53, -185, -19, 97, 139, -85, 369, -163, -67, 72, -48, -113, -77, 260, -18, -70, 132, 93, -112, 180, -276, 203, -45, -79, 49, 60, 45, 96, 147, 206, 143, -109, -173, -10, 93, -142, -150, -35, -33, -74, -109, 68, 75, 193, -33, 13, -20, 22, 81, 111, 311, -258, -171, -43, -141, -71, -24, 14, 47, -192, -19, -93, 176, 210, 203, -9, 97, 49, 105, 6]
$$ [...]
8191A89
##END NTUPLES=NMR FID
##END=
