##TITLE=1H_SR126_DCC+d6
 DMSO
 8 sc, 
 13.05.2022
##JCAMPDX= 6.0         $$ Bruker NMR JCAMP-DX V2.0
##DATA TYPE= NMR FID
##DATA CLASS= NTUPLES
##ORIGIN= UXNMR, Bruker Analytische Messtechnik GmbH
##OWNER= root
$$ XWIN-NMR		Version 3.5
$$ Fri May 13 14:04:24 2022 Russian Standard Time (UT+4h)  she@DPX200
##.OBSERVE FREQUENCY= 200.1313499996
##.OBSERVE NUCLEUS= ^1H
##.DELAY= (6, 6)
##.ACQUISITION MODE= SIMULTANEOUS
##.ACQUISITION SCHEME= undefined
##.AVERAGES= 8
##.DIGITISER RES= 18
##SPECTROMETER/DATA SYSTEM= spect
##.PULSE SEQUENCE= zg30
##.SOLVENT NAME= DMSO
##.SHIFT REFERENCE= (INTERNAL, DMSO, 0, 15.7039)
##AUDIT TRAIL= $$ (NUMBER, WHEN, WHO, WHERE, WHAT)
$$ ##TITLE= Audit trail, XWIN-NMR		Version 3.5
$$ ##JCAMPDX= 5.01
$$ ##ORIGIN= Bruker BioSpin GmbH
$$ ##OWNER= she
$$ F:/spectra/data/she/nmr/H-F/1/audita.txt
$$ ##AUDIT TRAIL=  $$ (NUMBER, WHEN, WHO, WHERE, WHAT)
(   1,<2022-05-13 14:03:15.32 +0400>,<she>,<DPX200>,
      <created by zg, POWCHK disabled, PULCHK disabled
       configuration hash MD5:
       00 E9 B6 7A A2 85 ED C7 34 08 36 98 17 FE 4E 26
       data hash MD5: 16K
       7F F1 F9 91 D7 2F EA 1D 0B A7 DA 9C A4 CC 4F BC>)
$$ ##END=
$$ 
$$ hash MD5
$$ 55 3C 69 96 15 0A 55 DD A8 8D DF 32 83 24 22 1D
##$RELAX= 
##$RELAX= 
##$RELAX= 
##$RELAX= 
##$RELAX= 
##$RELAX= 
$$ Bruker specific parameters
$$ --------------------------
##$DU= <F:/spectra>
##$EXPNO= 1
##$NAME= <H-F>
##$PROCNO= 1
##$TYPE= <nmr>
##$USER= <she>
##$AMP= (0..31)
100 100 100 100 100 100 100 100 100 100 100 100 100 100 100 100 100 100 
100 100 100 100 100 100 100 100 100 100 100 100 100 100 
##$AQSEQ= 0
##$AQ_mod= 1
##$AUNM= <au_zg>
##$AUTOPOS= <>
##$BF1= 200.13
##$BF2= 200.13
##$BF3= 200.13
##$BF4= 200.13
##$BF5= 200.13
##$BF6= 200.13
##$BF7= 200.13
##$BF8= 200.13
##$BYTORDA= 1
##$CFDGTYP= 0
##$CFRGTYP= 5
##$CHEMSTR= <none>
##$CNST= (0..31)
1 1 145 1 1 1 1 1 1 1 1 1 1 1 1 1 1 1 1 1 1 1 1 1 1 1 1 1 1 1 1 1 
##$CPDPRG= <>
##$CPDPRG1= <>
##$CPDPRG2= <>
##$CPDPRG3= <>
##$CPDPRG4= <mlev>
##$CPDPRG5= <mlev>
##$CPDPRG6= <mlev>
##$CPDPRG7= <mlev>
##$CPDPRG8= <mlev>
##$CPDPRGB= <>
##$CPDPRGT= <>
##$D= (0..31)
0 1.2 0 0 0 0 0 0 0 0.06 0 0.03 0 0 0 0 0.0002 0 0 0 0 0 0 0 0 0 0 0 0 
0 0 0 
##$DATE= 1652436194
##$DBL= (0..7)
120 120 120 120 120 120 120 120 
##$DBP= (0..7)
150 150 150 150 150 150 150 150 
##$DBP07= 0
##$DBPNAM0= <>
##$DBPNAM1= <>
##$DBPNAM2= <>
##$DBPNAM3= <>
##$DBPNAM4= <>
##$DBPNAM5= <>
##$DBPNAM6= <>
##$DBPNAM7= <>
##$DBPOAL= (0..7)
0.5 0.5 0.5 0.5 0.5 0.5 0.5 0.5 
##$DBPOFFS= (0..7)
0 0 0 0 0 0 0 0 
##$DE= 6
##$DECBNUC= <off>
##$DECIM= 32
##$DECNUC= <off>
##$DECSTAT= 4
##$DIGMOD= 1
##$DIGTYP= 9
##$DL= (0..7)
0 120 120 120 120 120 120 120 
##$DP= (0..7)
150 150 150 150 150 150 150 150 
##$DP07= 0
##$DPNAME0= <>
##$DPNAME1= <>
##$DPNAME2= <>
##$DPNAME3= <>
##$DPNAME4= <>
##$DPNAME5= <>
##$DPNAME6= <>
##$DPNAME7= <>
##$DPOAL= (0..7)
0.5 0.5 0.5 0.5 0.5 0.5 0.5 0.5 
##$DPOFFS= (0..7)
0 0 0 0 0 0 0 0 
##$DQDMODE= 0
##$DR= 18
##$DS= 0
##$DSLIST= <SSSSSSSSSSSSSSS>
$$ [...]
##$SUBNAM2= <"">
##$SUBNAM3= <"">
##$SUBNAM4= <"">
##$SUBNAM5= <"">
##$SUBNAM6= <"">
##$SUBNAM7= <"">
##$SUBNAM8= <"">
##$SUBNAM9= <"">
##$SW= 18.0517283424761
##$SWIBOX= (0..15)
0 0 2 0 0 0 0 0 0 0 0 0 0 0 0 0 
##$SW_h= 3612.71676300578
##$TD= 16384
##$TD0= 1
##$TE= 0
##$TE2= 300
##$TE3= 300
##$TEG= 300
##$TL= (0..7)
0 120 120 120 120 120 120 120 
##$TP= (0..7)
150 150 150 150 150 150 150 150 
##$TP07= 0
##$TPNAME0= <>
##$TPNAME1= <>
##$TPNAME2= <>
##$TPNAME3= <>
##$TPNAME4= <>
##$TPNAME5= <>
##$TPNAME6= <>
##$TPNAME7= <>
##$TPOAL= (0..7)
0.5 0.5 0.5 0.5 0.5 0.5 0.5 0.5 
##$TPOFFS= (0..7)
0 0 0 0 0 0 0 0 
##$TUNHIN= 0
##$TUNHOUT= 0
##$TUNXOUT= 0
##$USERA1= <user>
##$USERA2= <user>
##$USERA3= <user>
##$USERA4= <user>
##$USERA5= <user>
##$V9= 5
##$VALIST= <valist>
##$VCLIST= <CCCCCCCCCCCCCCC>
##$VD= 0
##$VDLIST= <DDDDDDDDDDDDDDD>
##$VPLIST= <PPPPPPPPPPPPPPP>
##$VTLIST= <TTTTTTTTTTTTTTT>
##$WBST= 1024
##$WBSW= 4
##$XGAIN= (0..3)
0 0 0 0 
##$XL= 0
##$YL= 0
##$YMAX_a= 151856
##$YMIN_a= -200338
##$ZGOPTNS= <>
##$ZL1= 120
##$ZL2= 120
##$ZL3= 120
##$ZL4= 120
##$ABSF1= 10
##$ABSF2= 0
##$ABSG= 5
##$ABSL= 3
##$ALPHA= 0
##$AQORDER= 0
##$ASSFAC= 0
##$ASSFACI= 0
##$ASSFACX= 0
##$ASSWID= 0
##$AUNMP= <proc_1d>
##$AZFE= 0.1
##$AZFW= 0.1
##$BCFW= 1
##$BC_mod= 2
##$BYTORDP= 1
##$COROFFS= 0
##$CY= 11.3945322036743
##$DATMOD= 1
##$DC= 2
##$DFILT= <>
##$DTYPP= 0
##$F1P= 2.36226072786647
##$F2P= -0.459571619588291
##$FCOR= 0.5
##$FTSIZE= 0
##$FT_mod= 4
##$GAMMA= 1
##$GB= 0.15
##$INTBC= 1
##$INTSCL= 1
##$ISEN= 128
##$LB= 0.24
##$LEV0= 0
##$LPBIN= 0
##$MAXI= 10000
##$MC2= 0
##$MEAN= 0
##$ME_mod= 0
##$MI= 1.114404
##$NCOEF= 0
##$NC_proc= 0
##$NLEV= 6
##$NOISF1= 3.799351
##$NOISF2= 2.8
##$NSP= 1
##$NTH_PI= 0
##$NZP= 0
##$OFFSET= 15.70392
##$PC= 1
##$PHC0= -18028.66
##$PHC1= 3.400742
##$PH_mod= 1
##$PKNL= yes
##$PPARMOD= 0
##$PSCAL= 0
##$PSIGN= 0
##$REVERSE= no
##$SF= 200.130013532006
##$SI= 16384
##$SIGF1= 3
##$SIGF2= 2
##$SINO= 400
##$SIOLD= 16384
##$SREGLST= <1H.CDCl3>
##$SSB= 0
##$STSI= 0
##$STSR= 0
##$SW_p= 3612.71676300578
##$SYMM= 0
##$S_DEV= 0
##$TDeff= 0
##$TDoff= 0
##$TI= <>
##$TILT= no
##$TM1= 0
##$TM2= 0
##$TOPLEV= 0
##$USERP1= <user>
##$USERP2= <user>
##$USERP3= <user>
##$USERP4= <user>
##$USERP5= <user>
##$WDW= 1
##$XDIM= 8192
##$YMAX_p= 0
##$YMIN_p= 0
$$ End of Bruker specific parameters
$$ ---------------------------------
##NTUPLES= NMR FID
##VAR_NAME=  TIME,          FID/REAL,        FID/IMAG
##SYMBOL=    X,             R,               I
##VAR_TYPE=  INDEPENDENT,   DEPENDENT,       DEPENDENT
##VAR_FORM=  AFFN,          ASDF,            ASDF
##VAR_DIM=   8192,          8192,            8192
##UNITS=     SECONDS,       ARBITRARY UNITS, ARBITRARY UNITS
##FACTOR=    0.0002768,     1,               1
##FIRST=     0,             0,               0
##LAST=      2.2672688,     0,               0
##MIN=       0,             -200338,         0
##MAX=       2.2672688,     151856,          0
$$ Real data points
##PAGE= N=1
##DATA TABLE= (X++(R..R)), XYDATA
0 0 0 0 0 0 0 0 0 0 0 0 0 2 -8 8 -8 8 -16 16 -24 24 -32 36 -40 48 -56 71 -80 95 -106 123 -143 160 -183 207
34 207 -233 263 -296 331 -371 414 -461 513 -569 628 -696 770 -850 936 -1032 1135 -1252 1378
52 1378 -1520 1677 -1852 2051 -2274 2532 -2831 3184 -3602 4115 -4760 5595 -6727 8353 -10900
67 -10900 15502 -26446 112313 19151 -91924 151856 62296 -50334 57314 86667 -54144
78 -54144 -218 79012 6610 -37954 -3708 -59241 -71514 -30410 -35337 -41984 -40703 -67366 -9888
91 -9888 34576 -42954 -81126 -4346 6288 -32889 6505 38384 -533 27244 72780 37909
103 37909 26734 36567 -3438 8542 60266 40623 2331 17759 34065 22548 16764 -798
115 -798 -43611 -38840 -6308 -22427 -37485 -18947 -14376 -25821 -29389 -10832 -10103 -54362 -54738 246
129 246 8530 -11285 5358 21062 10541 22942 42971 6054 -16997 28852 34904 5646 32610
142 32610 45965 10680 6601 28626 19546 -15377 -27269 -13475 -8042 -7672 -7467 -12465 -14741 -20924
156 -20924 -16704 -9348 -34244 -42791 -13058 -8849 -14017 8855 18738 -1127 -6523 19066 21264 -6335
170 -6335 -1538 20345 20941 22519 28058 27485 20087 9210 11273 8229 -8638 -9152 -2918 -4359 -3032
185 -3032 -1909 -4888 -17655 -24543 -16063 -22031 -32787 -24102 -15131 -8587 -764 125 3302 2471 -10
200 -10 4172 6656 10366 11827 13795 27754 30904 22975 22402 15402 7089 5926 1180 -2590 -4584 -3567
216 -3567 -897 -6677 -7684 -8736 -22041 -26074 -22611 -22754 -19095 -16191 -9948 -2095 -762 3638 2485
231 2485 -2362 3790 5345 4149 11653 18265 21280 19177 19825 23634 12018 2056 7112 2805 -3566
246 -3566 547 2745 -460 -5046 -1592 -4477 -19858 -18794 -12718 -21550 -19022 -6881 -4671 -7383 -4532
261 -4532 3156 -257 -8312 -1378 2118 -1192 5790 12449 14674 14303 14410 16321 8507 2403 7402 3213
277 3213 -1218 4897 6318 4532 2333 1227 -1424 -9192 -11417 -11554 -14452 -8845 -6842 -9028 -1878
292 -1878 -1550 -6392 -5654 -5858 -7883 -7146 -2258 3291 1876 6746 13727 8519 7432 8788 3556 3352
308 3352 4429 6763 8600 5800 8722 11073 3928 850 -1617 -6229 -8704 -9963 -4882 -4080 -8594
323 -8594 -5096 -4002 -7280 -7810 -10633 -10116 -10244 -8711 2445 3143 -1851 7689 12465 3831 3313 9984
339 9984 6686 -458 9793 17144 5765 8670 15217 2763 974 5347 -6557 -9931 -3094 -5563
353 -5563 -8605 -2399 -3853 -12588 -6603 -4481 -17891 -11412 -1089 -13441 -6457 10527 1788 -2182
367 -2182 9731 8048 888 6449 8571 1175 7998 16724 6816 7017 14016 2388 -661 4578 -4713
382 -4713 -7541 -1746 -4757 -6595 -1656 -1738 -9673 -9166 -4066 -10615 -10757 -4529 -6663 -2723 4517 1365
398 1365 2840 5166 1708 2653 3309 3472 4778 5300 6994 8811 9232 5393 3 3286 1329 -5769
414 -5769 -1400 -943 -4667 1286 692 -4778 -2018 -2504 -8046 -8144 -3843 -4356 -6209 75 1781 -1539 3802
431 3802 1266 -5321 1687 2326 -3865 1305 5405 4176 4501 6627 4743 733 2785 1431 -2668 2650
447 2650 2769 -1319 4214 4466 -1428 127 -1860 -5669 -4350 -3177 -4873 -5692 -269 713 -4143 -1527
463 -1527 -924 -6182 -3946 -2554 -3734 502 2279 2195 4924 5704 5010 2157 2256 4080 1701 3349 5116
480 5116 3003 5573 5956 1460 1197 -1647 -4365 -4834 -4612 -3291 -4548 -4470 -1828 -3730 -3850 -3098 -7302
497 -7302 -5515 -2982 -3478 43 2783 3691 4547 4465 6079 3550 2063 5140 2818 2506 6872 4437 3343
514 3343 4806 2595 191 -3304 -4118 -4240 -5545 -3675 -2857 -4407 -2362 -3328 -4264 -2030 -4928 -5811 -2828
531 -2828 -1293 857 2453 4068 4963 3090 4058 3638 845 2473 2308 1501 4522 3744 2695 3250 500
548 500 -597 -1344 -3363 -4031 -4678 -1275 -300 -3235 -546 -45 -3555 -2229 -2338 -3324 -2372 -1784 1143 2192
566 2192 2363 3250 992 815 1948 -866 188 1102 -18 2754 3430 2447 2331 745 70 -1200 -1857
583 -1857 51 -1512 -1139 1561 995 1186 815 -1720 -1432 -2336 -3597 -1838 -1718 -340 34 -237 1059
600 1059 -871 -2166 -596 -2487 -1796 228 -298 2251 3247 3121 3785 1713 1341 1327 -74 1764 1392
617 1392 911 3469 1516 1348 2218 -1180 -2739 -3576 -3798 -2714 -3390 -2376 -1001 -1928 -1282 -1946 -2998
634 -2998 -1910 -2911 -2064 523 631 2906 4018 3286 4505 3029 2398 2681 909 1829 2771 1752 2787
651 2787 2141 1190 763 -2465 -2921 -3486 -4949 -2780 -3029 -3315 -831 -1879 -1404 -703 -2500 -2027 -2238 -987
669 -987 1047 1298 3816 3770 2638 4522 3255 1003 1853 342 521 1604 1068 1982 1801 664 -188 -2602
687 -2602 -2392 -2700 -4411 -2199 -1165 -1307 310 -712 -573 463 -1666 -1678 -1362 -1654 1162 1843 2189 2336
705 2336 1393 2792 959 -905 451 -897 -1315 1088 638 1409 1461 192 939 -858 -2167 -1218 -1384
722 -1384 -195 56 480 2124 306 140 1194 -1152 -1561 -888 -2594 -205 846 1127 558 -1144 -482
739 -482 -163 -1194 -874 -2342 -1637 1139 1005 1968 2475 719 1052 730 2 1528 -203 -25 1515 1560
757 1560 2679 1073 -528 -164 -1809 -1682 -1605 -3616 -1628 -908 -1110 613 -1064 -1604 -1307 -1642 -337
774 -337 -541 -1025 1136 2024 3199 3547 1342 1746 1630 1082 1755 358 289 1501 686 1636 1155 -1381 -1373
793 -1373 -2910 -2649 -1676 -3037 -2473 -1747 -1140 1203 -645 -2005 -682 -948 74 620 249 1752 1890
810 1890 2661 4114 1870 685 1120 -74 1220 472 -102 244 -471 851 1003 -1360 -1803 -2508 -3078 -1034
828 -1034 -1310 -1237 -689 -571 1130 808 -296 178 -1119 -371 1509 782 1233 812 1082 2634 714 -61
846 -61 168 -1555 -890 192 -253 210 -115 345 616 -397 4 -1004 -2352 285 615 468 1279 16
864 16 815 1150 -219 81 -1155 -1045 359 -474 218 430 -1070 39 -307 -969 -537 -1868 -762 90
882 90 -279 1363 1198 834 1249 848 1185 396 -1105 1235 1140 234 1924 1023 16 -266 -970 -527 -1728
901 -1728 -2639 -578 -1456 -1490 -216 -1208 -978 -1054 -845 -172 -1293 -540 1378 639 1410 2402 1836 2185 1069
920 1069 1379 1407 -228 870 1124 -166 1005 394 -699 -953 -1760 -1312 -2221 -2785 -744 -1279 -1844 -4
938 -4 -394 -563 -220 -365 187 -622 773 1984 456 2192 2612 870 1727 1525 524 645 -174 328 408
957 408 -525 106 -347 -805 -244 -1792 -1558 -766 -1919 -745 -691 -575 598 -110 245 500 -375 183 376
976 376 -229 873 362 912 1479 54 910 255 -917 -71 -411 97 168 -672 670 506 -1005 484 76
995 76 -1080 53 606 590 -467 442 1605 -338 -232 775 -1426 -889 398 -940 -545 -134 -665 -421
1013 -421 -462 -174 -1031 -986 248 -701 -21 2060 -167 399 1789 644 942 1063 318 723 998 1063 520
1032 520 -40 735 -745 -689 -99 -2210 -2030 -435 -1735 -662 -777 -1670 -977 -195 -293 -550 -735 354 352
1051 352 1077 2276 901 1328 2361 952 1700 1653 -106 608 646 809 770 -210 -609 -1198 -1129 -869 -2345
1070 -2345 -2187 -1145 -2111 -255 169 -1464 -917 -28 -151 225 303 833 306 605 2916 1960 1120 1619 438
1089 438 806 1324 -39 -236 -84 281 434 -472 -858 -1373 -1959 -451 -642 -1767 -902 -987 -441 364 -182
1108 -182 130 -567 -384 822 128 388 637 -7 1589 1173 171 830 -144 -504 731 198 -372 -523 -150
1127 -150 944 -48 14 6 -1446 -443 385 -467 373 -373 -88 460 -138 175 -247 -1213 -134 -341 -502 84
1147 84 -997 428 188 -523 254 -826 -1069 359 380 433 762 325 1059 1323 1187 997 -290 511 652
1166 652 -143 760 281 -403 310 -336 -634 -927 -1944 -1394 -1280 -1326 -541 -1168 -739 -162 -682 82 -114 -440
1186 -440 649 643 1330 1694 861 1688 1435 936 1510 294 327 689 -161 665 -343 -610 -346 -1136 -1565 -1261
1206 -1261 -1981 -1747 -1293 -1347 -15 -640 -820 222 -97 547 310 132 1366 757 1405 2443 1285 1384 1790
1225 1790 640 908 350 25 333 -741 -64 -257 -1256 -487 -1001 -988 -850 -1888 -1551 -495 -881 -201 69
1244 69 -100 357 -280 344 807 -106 968 1056 424 1756 693 444 1175 154 -64 223 -247 -171 -593 108
1264 108 12 -1052 239 -292 -1422 31 -635 -1058 -158 -151 -36 175 101 269 -354 87 422 -787 3 341
1284 341 -278 861 518 152 474 137 -80 -181 -167 504 90 342 1050 226 446 609 -194 -101 -80 -596 60
1305 60 14 -36 -374 -663 -179 -893 -1133 -540 -1191 -1190 -48 -678 222 285 176 802 -44 201 762 320 1256 1224
1327 1224 963 1524 931 943 844 43 23 -134 -714 -354 -783 -711 -524 -1150 -1069 -1176 -1601 -1201 -1407 -694 -210
1348 -210 -671 457 734 118 829 917 589 1348 914 1207 1441 1091 1645 1092 925 608 -501 -264 -561 -1321
1368 -1321 -702 -782 -1310 -759 -1075 -1245 -870 -1431 -858 -1018 -764 178 166 699 815 273 1270 997 643 1143
1388 1143 700 734 1273 773 1155 559 -54 356 -570 -578 -634 -1253 -602 -665 -712 -207 -657 -927 -244 -859 -493 -319
1410 -319 -344 391 3 391 816 393 574 253 23 472 -21 -143 600 182 315 651 -162 91 -433 -401 37
1431 37 -556 96 320 -199 350 -69 -120 23 -382 -313 -66 -590 -106 -241 -124 218 -486 -321 -202 -624 -321
1452 -321 -309 -186 362 169 673 510 169 448 588 209 916 332 541 1001 373 399 310 153 201 -439 -598
1473 -598 -632 -833 -376 -803 -1015 -130 -834 -1191 -603 -1127 -328 -146 -193 635 348 738 943 835 1032 794 678
1494 678 1114 534 467 1097 713 382 130 -303 -184 -941 -993 -674 -1342 -846 -656 -1078 -277 -718 -1211 27
1514 27 -822 -406 67 -125 920 758 863 1045 671 935 864 391 575 448 278 1069 125 -210 -46 -387
1534 -387 -655 -842 -971 -519 -1054 -526 -295 -1058 -172 -199 -669 -78 -86 32 299 166 743 803 525 738 165
1555 165 345 451 -83 172 407 -14 378 255 -32 282 -322 -205 -384 -679 -96 -152 -88 427 -220 260 307
1576 307 -574 -8 -81 -167 355 -122 117 33 -413 135 -386 -490 11 -346 -264 281 46 339 251 280 258 176 173
1599 173 513 310 355 666 184 664 148 166 96 -619 -164 -634 -744 -284 -588 -486 -293 -501 -427 -483 -379 252
1621 252 -48 14 260 440 588 707 756 1048 570 571 616 220 607 427 123 162 156 -306 -223 -1078 -704 -610 -1055
1644 -1055 -651 -812 -577 -522 -644 -188 -156 -346 175 35 157 842 557 894 952 537 1041 671 478 772 341
1665 341 500 107 -301 53 -183 -767 -584 -696 -740 -552 -1041 -322 -187 -312 51 -285 -139 245 -85 268
1685 268 343 169 846 247 483 564 156 424 230 -81 85 -174 -108 118 -272 -42 -199 -534 -86 -441 -287
1706 -287 279 -181 -166 -39 -161 187 13 -46 212 -12 132 28 -158 359 -2 32 198 -308 -26 -170 -392
1727 -392 -86 114 -70 351 -141 73 399 -163 348 152 220 444 0 192 217 -140 203 158 -106 53 -488
1748 -488 -376 -369 -585 -499 -148 -595 -128 -466 -204 -226 -183 442 209 303 949 466 623 592 364 551 143 111 589
1771 589 326 -263 258 -353 -166 -575 -688 -423 -886 -826 -392 -802 -411 -482 -797 -239 -136 -12 517 304 296
1792 296 434 805 729 706 890 970 369 430 367 77 465 -6 -219 29 -607 -591 -446 -1091 -514 -715 -927 -398
1814 -398 -515 -223 419 -261 72 46 -124 394 121 393 559 279 841 301 296 368 166 10 306 -322 -161
1835 -161 -142 -386 -287 -315 -172 -317 -703 -62 55 -350 -12 -89 130 622 -84 222 257 -220 57 295 -62 392
1857 392 100 181 391 -179 155 -64 -719 148 -54 -113 -155 -181 33 289 -100 129 -307 95 110 -136 431 71
1879 71 59 252 -52 -356 33 -693 -24 -393 -424 -73 -268 -239 -36 -294 -95 -268 13 182 -203 319 473
1900 473 111 604 594 474 799 179 336 162 211 158 69 85 195 -488 -679 -763 -811 -544 -576 -793 -24 -276 45
1923 45 233 -229 329 142 -91 665 376 403 719 413 704 928 126 682 47 -74 89 -465 -132 -294 -613
1944 -613 -414 -403 -777 -336 -918 -542 -78 -614 -25 209 -87 462 -44 122 418 114 470 261 147 728
1964 728 334 280 269 -95 -83 -80 -559 -108 -206 -216 -162 -285 -175 -323 -592 -313 -235 -157 187 -29 543 326 125
1987 125 370 155 32 465 62 69 158 73 268 -105 -20 217 -215 -418 -28 -330 17 -175 -192 397 -385 -136
2009 -136 183 -57 284 -213 -171 239 143 132 285 -200 73 66 -325 -94 -204 16 -174 -200 31 -250 -187 107
2031 107 -191 14 -65 21 256 318 144 583 376 514 153 -329 179 175 31 69 -163 -38 147 -530 -205 -342
2053 -342 -482 40 -625 -426 -313 -57 144 -142 -107 415 -3 258 569 -9 288 386 231 607 270 68 313
2074 313 -181 -130 -239 -406 -143 -124 -469 -307 -486 -346 -179 -567 -258 -509 -298 207 -113 166 549 32 391
2095 391 457 386 454 -31 520 407 104 273 83 -52 120 -87 -373 -439 -439 -261 -238 -550 -341 -116 -436 -128
2117 -128 -77 66 -102 -97 363 102 152 257 180 -17 349 -45 107 -46 196 222 -79 176 -34 -478 40 -345
2139 -345 -268 -144 -415 -85 47 -239 252 -182 207 337 140 82 129 -24 205 -26 4 262 -142 25 181
2160 181 -132 90 -195 -205 -32 -57 -87 -129 -394 182 126 -48 303 -139 45 96 183 596 46 -35 186 142 20
2183 20 303 -468 -135 -362 -249 -168 -512 -266 -99 -423 -63 -331 -321 6 -46 -50 169 206 313 196 261 585 327
2206 327 211 413 74 178 117 -150 43 -344 -75 -210 -463 -321 -176 -369 -265 -136 -288 132 -340 148
2226 148 207 272 174 76 466 519 259 405 361 284 386 371 426 387 -169 196 -38 -191 -320 -250 -265 -425 -280 -360
2250 -360 -176 -342 140 -94 -66 279 -15 37 297 27 414 312 57 291 275 38 -67 -277 129 56 -173
2271 -173 -126 -220 -281 -121 -319 -155 -40 -246 -66 -51 -228 156 -143 0 121 -223 -183 -39 101 27 -61 217
2293 217 40 -117 118 -84 -320 -6 -376 -153 -102 -435 -156 -198 -225 11 -42 -103 141 -128 359 -38 4 162
2315 162 224 40 96 -5 -113 202 -281 -89 -453 -109 136 -359 -264 -126 -459 124 38 77 -77 -134 -8 55
2337 55 145 186 5 65 383 53 445 456 95 177 -83 -132 65 -208 -44 -63 -269 2 -225 -344 55 -231 -257
2360 -257 -206 -183 119 -93 -197 167 330 328 450 247 401 111 -61 303 323 196 -7 -84 149 -16 -175 148
2382 148 -541 -404 -68 -382 -193 -256 -50 77 -109 -158 3 -48 207 223 114 310 91 247 721 28 370
2403 370 153 156 -6 -211 -60 92 -309 -122 -262 -337 -37 -373 -27 -61 -254 98 -31 39 93 33 -18 338 179
2426 179 211 164 51 328 217 -96 -32 -229 -206 -141 -245 9 -195 -93 18 -265 -10 -97 -31 287 -53 -11 351
2449 351 253 90 344 -101 336 102 -20 203 0 93 -120 38 270 -267 -481 -52 -346 -281 167 58 -2
2470 -2 -294 -166 251 0 140 150 49 223 189 104 469 159 200 227 -55 60 -242 -30 -125 -265 -154 -138 -300
2493 -300 -173 2 -155 -47 -252 -27 -217 -399 -23 49 -30 548 290 254 318 175 295 179 -80 190 106 -110
2515 -110 -43 -115 24 -155 -392 -212 -180 -374 90 -66 -227 73 -220 209 -163 -86 313 -3 261 138 -22
2536 -22 438 -26 320 456 127 19 -130 -221 187 -255 -188 -86 -271 -112 -318 -326 -86 -129 -15 163 18 38
2558 38 162 370 226 153 127 463 -190 206 437 265 79 35 -157 88 -229 -93 -178 -11 -319 -303 -252 114
2580 114 -47 39 314 -34 201 392 69 141 112 -15 304 59 129 149 -84 37 40 -182 -25 -347 -16 87
2602 87 -275 -96 -162 -115 -38 -132 -164 58 -79 354 206 -82 317 -163 30 465 -9 387 150 52 120 65 -12
2625 -12 -46 -221 -267 -321 -160 -175 -269 -186 -361 -366 -19 68 -36 347 138 175 121 -23 261 247 126 236 40 58 321
2650 321 -11 -5 -5 -3 -32 -250 -494 -205 -412 -247 165 -130 -111 -229 45 -29 51 130 161 -127 286 11 630 497
2674 497 258 115 -25 -21 45 181 130 48 -235 -68 61 -336 -47 -167 -103 -41 -231 -126 -207 277 390 64 387
2697 387 252 -66 180 41 131 377 227 -136 250 25 -94 -127 -306 13 -15 -56 -18 -306 -381 -12 -193 39
2719 39 -132 150 -92 85 72 -34 73 66 458 -113 211 -174 -39 59 87 -65 -386 -128 72 -49 -217 -205
2741 -205 -135 -44 -91 17 215 31 256 -255 -171 61 280 124 260 68 -68 273 -27 117 195 -273 31 -116
2763 -116 -314 5 59 -284 3 -165 -20 -239 31 45 -200 37 164 -60 -53 120 -33 598 -96 195 330
2784 330 299 93 -20 106 -70 -120 -269 4 -57 -78 -26 -383 -102 -118 -287 -101 -10 316 9 -59 232 254 104
2807 104 235 48 109 199 53 412 329 -30 49 -218 -118 -102 -479 29 -181 -229 -2 -407 -92 -159 -354 86
2829 86 -46 -121 -80 189 164 235 -223 295 217 -71 292 289 128 -49 -113 38 -142 -171 198 -150 -182 -31 -206 -88
2853 -88 -326 -261 53 -182 175 -7 75 120 -130 109 189 62 110 353 -28 300 350 27 280 -132 36 -43 -88
2876 -88 -95 -392 -149 -95 -45 -98 105 -162 115 26 -141 301 75 176 111 -59 35 185 -116 10 176 -67 -83
2899 -83 -210 55 -176 -134 35 -167 -216 27 -73 -400 77 -242 228 -211 -163 272 83 398 76 293 41
2920 41 41 -132 123 -57 500 22 -36 72 -97 -241 -316 -331 -246 -13 -147 -251 -84 -186 244 164 -179 278 -71
2943 -71 238 197 192 124 -57 76 89 102 -93 525 -120 -363 -405 -41 -141 -181 -95 -29 -475 -78 140 -129 -76 26
2967 26 -22 -64 -106 49 -176 230 392 131 27 6 176 85 33 70 101 150 -217 98 -280 -141 189 -268 91
2990 91 -64 -4 40 72 -24 353 248 107 -242 -130 99 202 93 230 107 172 -467 -195 -207 -258 56 -112 -99
3013 -99 -306 -34 -72 38 -359 5 210 -361 308 27 -37 131 53 491 232 241 -28 -25 52 153 -137 167 108
3036 108 -300 -186 -109 -272 -130 -80 -72 -18 -335 20 -186 27 86 236 54 217 -152 -18 -12 -105 117 45 247
3059 247 201 -81 162 63 -322 95 -251 -48 -216 -401 -215 -122 -168 -85 -88 353 -47 -271 66 240 -32 230
3081 230 337 199 87 205 294 317 -29 137 -227 279 28 105 66 -185 -153 -54 -86 -189 35 -5 77 192 -256
3104 -256 43 275 -28 20 305 133 231 134 263 118 95 171 -258 -35 -177 212 182 -125 -381 -77 -95 6
3126 6 55 -252 -112 70 -59 62 270 -89 52 138 32 -72 237 247 -11 177 173 -162 -44 30 -2 26 42 138
3150 138 -200 -183 39 -437 -323 -26 5 -123 -79 -187 20 -8 307 82 156 240 -23 -72 70 61 -79 230 -18
3173 -18 -51 92 -300 -182 -97 -281 -276 -148 -211 56 -61 146 208 87 211 177 56 -106 -115 -97 -76 108 174 -161
3197 -161 -47 -83 37 125 61 -25 -154 -325 -181 -115 -217 28 21 62 158 -158 244 -27 82 135 -18 -12 263 79
3221 79 -63 -92 61 232 39 7 91 -8 -276 76 -212 -92 -440 83 -144 -30 -57 72 -331 -132 120 131
3243 131 -32 -19 -109 282 162 -68 -53 -175 94 158 107 -24 -89 -66 83 -359 -105 -22 -182 -191 -48 -165 135
3266 135 -141 -1 97 -303 -143 47 2 27 -60 -107 503 -269 42 -13 -181 172 -159 -82 -110 -297 104 -8 -230
3289 -230 52 -107 -59 -113 114 102 112 251 -81 59 -71 102 207 60 204 273 67 -192 88 -94 -125 -224
3311 -224 -19 -163 -22 -131 221 93 -247 -10 -106 237 95 -25 225 206 273 92 189 115 234 116 191 98
3333 98 194 5 347 -141 305 -40 49 5 -123 -155 -139 -176 168 -93 -187 26 -254 100 -6 93 59 139 -141 80
3357 80 -72 129 160 -49 229 -59 -94 -46 -201 -165 -13 -316 -139 -65 -238 8 -86 172 112 42 127 -14 42 -20
3381 -20 29 22 265 152 180 75 -144 226 -71 65 129 -114 94 181 -1 -66 -149 -254 -118 -129 -327 79 -303
3404 -303 -76 108 148 181 -30 42 193 -41 361 83 151 -14 -8 308 -16 5 -80 25 -197 67 -240 -294 134
3427 134 -74 42 -89 -158 -60 223 228 255 180 142 154 66 305 -276 105 -75 91 102 -177 -172 16 -162 -154 -32 -134
3452 -134 39 -12 76 65 -33 70 -38 74 -33 119 210 150 111 -27 192 123 140 -28 52 358 59 64 307 -424
3476 -424 -69 4 -35 -13 -147 -85 63 -47 40 -234 -78 353 35 86 279 202 121 92 50 87 385 -138 55 -91
3500 -91 49 118 -163 -132 -287 73 -267 -35 -6 46 -198 -226 -123 82 57 210 270 168 -13 -21 154 -37 137
3523 137 -9 69 128 113 -43 13 -284 -56 -272 -170 -96 -206 -271 -154 105 -158 -102 55 249 17 -13 21 96
3546 96 159 123 -103 111 10 -49 -161 163 -11 81 223 13 -40 -22 -118 -221 -88 140 -44 14 118 79 111 129
3570 129 -15 -105 -70 101 -18 255 170 209 226 157 -60 106 -40 58 -142 -180 68 -20 -129 -74 -165 24 -12 93
3594 93 -192 28 -54 194 179 -83 270 -124 124 -30 55 84 -3 -48 70 167 157 30 68 -75 -270 -287 37 27
3618 27 -136 -161 -51 171 21 10 -97 120 -167 -229 128 216 -18 105 -28 47 129 44 130 -86 226 -63 251
3641 251 -151 -105 -28 -67 42 -86 184 -85 -15 -325 -17 25 -95 234 -51 299 229 204 274 -113 1 113 -115
3664 -115 112 -146 276 86 -188 31 -160 121 214 -106 158 -34 -103 -13 91 -100 238 107 -208 98 -64
3685 -64 139 142 164 124 87 54 353 -138 49 59 -184 129 -65 -247 31 -255 137 4 138 105 13 11 -12 45 -77
3710 -77 375 -201 113 -74 164 -27 -4 36 445 -35 -48 72 -125 -70 -199 -35 21 -223 -152 -62 122 -49 88
3733 88 66 -106 -65 250 -131 149 211 252 235 267 195 19 -23 163 158 -27 -197 -74 18 -138 -7 -117 -156 -176 -89
3758 -89 -208 -281 87 -141 -51 100 138 169 35 -31 71 22 -73 71 25 234 -279 -123 -134 -216 111 -10 87 -114
3782 -114 184 26 19 -267 -132 101 -185 -331 -3 18 177 202 13 -144 195 -32 183 -96 328 50 -145
3803 -145 42 0 -196 9 -184 -458 -99 -65 -127 -232 4 252 30 -11 81 -38 53 99 3 57 125 71 29 -89
3827 -89 149 -110 43 50 -69 -14 -176 23 224 -73 -287 -40 -198 -21 -73 -16 -6 72 96 -101 5 -59 10 203
3851 203 220 67 -122 113 -26 91 59 -89 85 -92 73 -17 235 8 -207 119 -130 6 11 228 -25 -112
3873 -112 221 -181 20 171 98 -28 228 103 184 46 1 -163 31 -14 -37 -188 -62 -196 89 274 59 -143
3895 -143 -7 -114 48 226 -28 203 141 -27 69 -141 5 152 32 71 181 -70 32 -175 230 -94 -24
3916 -24 68 -152 -179 -53 178 123 -89 -116 124 -234 -292 -276 -59 -144 48 68 341 120 69 156 12 -116 -202 -87
3940 -87 -104 -182 -157 287 -155 -220 -98 -221 -44 -162 -247 -145 -164 -224 93 50 253 233 -89 -47 57 16 -84 -99
3964 -99 16 -46 -32 -59 60 -140 -136 -83 -74 -38 -81 -10 -71 -149 -270 96 7 65 128 -50 -20 81 -73 141 242 98
3990 98 166 296 -52 149 -151 -236 257 8 -218 -195 1 -48 -163 -83 -146 -209 184 141 209 -84 -25 -70 -49 144
4014 144 324 143 -133 162 -43 -25 43 -12 -3 -216 -262 -51 -118 -97 -60 -75 117 -30 11 -191 219 -115 -74 -6
4038 -6 -85 311 -13 -131 340 36 83 -16 117 169 -205 137 -27 70 250 23 -71 -18 -171 -171 -141 129 -37 26
4062 26 -290 -240 -14 -43 178 -58 104 -93 -48 236 -75 90 252 -17 -28 89 82 -81 -71 10 110 -182 -3
4085 -3 -128 -176 -158 28 -197 181 138 125 -37 84 -5 350 174 92 209 36 -131 144 144 206 41 -117 -79 299
4109 299 147 -132 -66 28 17 -141 -72 -174 -453 37 79 40 204 305 -58 21 58 40 239 130 -192 18 11 46
4133 46 -158 -99 61 -240 238 -9 -138 -233 62 -57 -239 37 -30 231 41 111 143 79 130 221 275 -15 -62 153
4157 153 186 -77 42 47 196 20 19 -254 -71 -94 -2 -241 -89 -101 246 -48 51 55 132 -98 -25 1 38 110 110 -85
4183 -85 -114 -53 182 78 -44 48 19 -65 -32 253 -20 8 216 102 201 -261 0 -80 -117 163 -111 152 -51 6
4207 6 186 112 56 -35 -58 28 19 -219 -77 -323 -260 52 135 111 -185 -40 -145 117 -8 -210 -47 -65 184 38
4231 38 38 244 194 -183 -147 196 105 2 -89 -342 54 201 77 -157 -89 -165 13 -28 -70 60 -24 81 64 -100
4255 -100 -122 108 -3 -29 -17 70 145 175 76 35 103 -46 85 81 -95 82 -214 -67 54 109 31 49 -99 -80 87
4280 87 110 20 -98 304 -32 78 235 -91 113 -88 -90 132 56 41 110 -186 274 148 -32 57 -23 -277 97
4303 97 -95 236 40 11 174 -20 101 -9 -155 -66 51 -49 72 -113 -101 88 91 107 -34 86 -23 -95 78
4326 78 25 -103 -113 -54 -58 -139 -40 220 -244 77 76 33 -240 -170 36 230 159 21 291 -125 -282 206 89 37 238
4351 238 123 97 -149 328 218 166 76 -8 32 -9 100 -302 -67 -32 -35 -62 70 243 -46 163 115 37 -172 64
4375 64 130 49 287 74 135 -12 -233 148 -55 -295 -249 -231 -180 -251 -8 97 75 -40 38 -95 188 120 95 203
4399 203 -180 -161 -2 -44 -206 42 137 190 -289 -1 70 -122 -88 148 230 -2 -69 77 141 69 -122 -187 30 -179
4423 -179 255 -156 9 -166 38 143 -130 -203 31 58 -15 -154 333 -105 -161 182 -58 -241 125 144 -68 -27
4445 -27 -80 133 142 -236 113 -10 117 81 178 167 33 -15 62 131 -3 26 -91 40 -41 73 -27 -18 201 339 136
4470 136 -150 -168 -98 -78 114 -50 214 -173 63 153 -138 93 228 276 155 14 -18 -140 -106 337 8 93 -80
4493 -80 -107 -271 -91 -82 135 -36 -134 41 82 -80 -4 86 -393 -102 122 -34 321 64 220 81 203 147 167
4516 167 -63 -55 -286 145 81 -262 44 -323 -72 -54 -33 -9 -188 154 -100 -51 -83 -230 267 -59 10 179 -242
4539 -242 204 188 275 -6 -106 67 -192 39 -32 -159 -127 -200 76 36 -70 -91 55 -191 53 -121 23 13 298
4562 298 24 30 183 68 -117 -116 94 -49 -41 -19 -11 -19 114 -176 -31 -249 -115 -121 38 3 3 -243 -123 -36 11 -58
4588 -58 313 -106 38 176 115 -68 39 126 -13 -26 74 173 256 -199 -102 147 252 -151 114 148 121 193 -87
4611 -87 -20 88 121 -73 23 286 -107 -26 -112 -73 25 -82 129 192 151 -296 -14 225 46 -128 -50 18 145 -79
4635 -79 -62 -136 107 -25 -45 404 -172 227 14 51 -97 -14 143 -11 -237 55 16 -26 55 -158 296 -63 187
4658 187 112 -32 -107 66 110 230 -86 39 -99 -51 7 -26 71 98 -46 75 -9 111 -182 118 99 -116 20
4681 20 -128 -84 -95 10 -146 35 -203 242 56 169 -141 138 75 -204 182 -30 83 -114 -155 31 90 238
4703 238 275 64 23 9 84 -12 4 -229 -326 231 -117 -57 -143 -85 -46 25 5 -295 -161 75 -167 55 70 87 -286
4728 -286 -34 -189 -16 62 9 127 7 -50 -94 -42 84 149 -152 -29 -28 -100 -129 50 25 -42 260 153 132 180 -34
4753 -34 195 53 78 211 2 -14 -93 -123 20 106 -230 -324 -167 -43 -166 -170 28 9 -322 -14 18 111 31 158
4777 158 158 207 86 -183 392 -17 87 56 -15 163 -32 -35 162 -43 -152 98 -33 3 -52 74 158 46 87 26
4801 26 19 52 -26 -134 248 69 -152 163 14 218 226 -12 36 -156 235 -4 -151 263 29 -170 134 -79 15
4824 15 51 -261 -133 -19 -35 -72 1 -168 -31 134 19 -198 -42 -3 104 89 345 -46 177 81 140 -122 167
4847 167 -182 -88 -255 -170 97 113 -71 42 -10 278 94 -175 -199 53 62 -153 -16 79 -17 52 -53 320 -161
4870 -161 -44 132 -25 27 317 -236 70 -215 5 -114 57 -98 -122 -1 6 9 53 58 202 80 35 8 41 17
4894 17 -116 10 38 -100 201 -52 105 22 153 -4 -10 -46 -33 -7 -178 40 131 301 -365 85 51 -12 83 -76
4918 -76 216 104 -34 -137 -111 -105 -113 75 -354 3 53 64 -5 -182 123 -147 -304 20 -67 -247 -91 57 2 55
4942 55 -171 -167 -27 43 277 166 -6 11 74 -240 131 211 -6 101 -6 -212 -251 57 -56 -126 -164 119 -109
4965 -109 -150 -65 -33 146 -89 61 133 -114 -86 157 -11 -26 -70 -238 110 -19 -2 73 -4 -22 -31 -54 -109 -180 11
4990 11 126 -59 -148 46 -119 -88 -13 21 23 59 121 39 -126 -19 28 -83 164 -16 -79 -15 -220 -57 -34 -106 42
5015 42 93 -16 -104 -252 -103 -295 -74 75 -103 -259 157 354 36 -111 303 -94 0 12 -12 -102 182 3
5037 3 27 16 8 245 -139 112 34 155 -127 -173 -45 111 -151 23 36 23 -106 166 57 -125 188 -164 34
5060 34 103 -223 -186 78 -9 166 -13 -76 -73 124 -5 77 -131 178 -80 -39 83 187 373 -1 8 39 240 -113
5084 -113 -74 92 84 91 97 -75 77 239 -48 -218 62 -61 9 -277 -234 -77 152 -63 -98 -47 -88 -18 47 -207 238
5109 238 194 1 47 201 -62 -92 -89 150 -287 1 -96 -174 -37 -178 114 14 -89 -3 22 -23 -3 43 80 -88
5133 -88 -253 -189 -218 255 -3 133 -166 78 152 -69 177 56 -108 -367 -42 -187 -140 -155 170 115 -148 -161 -199
5156 -199 55 -79 72 -95 -190 -10 -130 -167 93 124 -129 -27 252 136 -115 247 227 39 -72 -46 -97 -71
5178 -71 -124 -123 32 -163 -138 -44 41 169 -180 -181 -250 42 146 -137 -47 3 -119 54 14 -41 -8 -292 103 -26 -149
5203 -149 -58 257 -131 -191 149 -379 78 -18 -201 164 -205 55 -91 193 101 8 -76 326 120 133 122 -160 10
5226 10 136 -75 -110 -76 -37 261 68 202 -76 -268 -24 -130 -157 38 -124 -99 -29 100 -54 122 231 188 44
5249 44 -23 192 -284 79 -162 24 -105 28 77 -52 485 173 -101 -154 -201 -41 47 -39 -132 5 95 -195 30
5272 30 24 1 -76 -161 -21 90 38 -44 -140 -134 -34 -145 -92 -147 -52 -79 62 138 25 -222 68 140 -120 -96 143 59
5298 59 -5 -177 -189 -59 -73 223 -2 -219 -11 163 95 30 -237 -186 -33 -281 -33 55 -185 23 -8 -111 63
5321 63 5 -118 209 150 -78 -98 115 -7 205 108 -180 -206 60 77 12 104 -109 -8 24 -15 46 -9 55 212 -180
5346 -180 -161 -84 -112 -29 -14 -67 124 -32 -139 -95 -112 229 140 76 165 -305 14 -147 71 76 4 130 88 -18 -9 52
5372 52 -310 -64 25 -129 229 -25 20 -62 122 -84 -168 107 -4 -56 129 -22 146 281 156 -66 78 -245
5394 -245 -209 63 -198 -63 152 102 38 100 -256 131 -166 -123 -93 112 49 -78 39 71 16 149 -24 -41 220
5417 220 87 31 58 44 87 182 -407 120 -75 -3 186 -38 5 -361 80 16 -43 -54 8 2 105 112 -102 264 -316
5442 -316 -88 269 61 -87 -99 54 26 115 -81 5 -46 42 181 39 11 -171 -170 -149 -140 136 26 35 122 -27 253
5467 253 21 -111 171 46 1 -15 47 -102 382 32 6 -49 -101 25 -222 27 -14 32 139 258 -3 -110 -342
5490 -342 -167 110 75 -10 68 219 -127 161 -10 -70 -151 -455 61 -138 -175 55 19 -43 109 -181 192 -126 -131
5513 -131 50 -115 34 -55 -14 -232 -118 69 52 -30 87 -173 168 91 120 -36 201 203 -115 -229 43 40 73 -132
5537 -132 -13 -92 -2 -104 -101 131 -36 90 -9 161 147 -91 139 50 36 10 209 -129 -107 153 105 77 -90 28
5561 28 -14 -318 -199 -98 11 -131 2 -8 46 192 122 -230 -34 34 -22 -59 -38 -22 65 394 119 -5 56 174
5585 174 -81 -124 47 -59 36 82 -115 37 57 -101 -102 -180 -64 -49 73 -23 -118 20 -51 111 48 -189 -136 160
5609 160 -181 22 143 -75 56 370 -117 23 9 -184 258 249 -48 150 148 36 160 -144 101 -160 52 -5
5631 -5 -148 -144 96 191 -154 68 -106 63 63 8 -50 -56 -187 -53 38 -5 -24 -158 171 -164 -33 127 216 40 -79
5656 -79 -104 32 78 21 70 -131 65 138 -27 -85 -263 183 17 -160 20 -48 67 30 -355 -96 -12 -247 320
5679 320 88 10 -15 -96 -29 205 239 87 -162 -43 36 309 95 235 -114 14 104 -59 -122 -44 233 -230 44
5702 44 63 -2 -20 -156 -136 107 108 144 -43 -97 -97 197 78 -28 55 -112 242 -193 -53 -3 18 1 129 -5 -225
5727 -225 -206 13 -140 -250 236 -227 239 131 32 125 119 63 118 77 -10 -63 181 27 107 72 164 70 179 123 97
5752 97 -40 179 -182 141 -81 -133 -146 17 40 -232 212 -34 -79 -137 71 -10 -24 108 64 87 34 122 -75 -122
5776 -122 140 -80 26 161 -64 -180 -269 -8 -27 -10 23 -55 9 30 117 -7 -377 -121 -167 -23 270 -239 -128
5799 -128 -26 -8 84 -126 -5 -67 -189 58 3 -60 193 -23 127 227 -76 117 -131 1 164 -180 56 56
5821 56 88 224 19 -223 192 124 25 363 25 86 70 -63 9 -225 -50 106 -59 -65 119 31 -101 -220 -54
5844 -54 230 167 43 178 28 -218 -3 18 91 -53 -10 -106 138 -20 -20 -17 77 -82 33 209 16 72 -100 -56
5868 -56 10 1 130 -79 16 10 56 -3 282 180 -63 36 86 56 83 -237 32 169 9 -227 -58 14 -189 -36 -93
5893 -93 -8 -221 -9 6 -120 -29 -75 -13 82 -167 -120 -182 -256 -125 223 250 331 108 125 -182 -198 320 -301 53 43
5918 43 -40 99 -30 -143 -24 -44 119 80 -181 9 161 0 -20 142 -164 -50 -18 -159 -74 -126 159 -164 18
5941 18 88 282 -57 -99 -101 42 -93 96 174 -52 -95 -182 -343 -18 -132 5 56 -91 78 43 220 219 -110 64
5965 64 22 124 -32 28 -173 201 -10 -175 -87 -163 128 -198 -132 -20 -315 -8 -43 82 273 -76 5 146 203
5988 203 -106 -59 104 -112 -25 52 -65 32 83 151 -69 -68 13 60 80 -168 36 -111 -109 131 197 108 99 222 63 176
6014 176 175 -42 124 11 111 -94 201 -86 38 1 359 -104 -40 -60 3 -46 -167 -111 -11 23 -490 42 -270
6037 -270 -44 -28 -25 51 151 -158 204 117 14 336 -93 58 115 56 102 -286 -53 137 119 95 101 148 -12 -121
6061 -121 -27 -39 80 -93 -141 -70 -48 -165 113 -19 228 111 -48 53 3 182 -13 -20 80 86 -155 42 61 239
6085 239 13 37 -71 -38 -25 -185 -54 -60 195 48 -109 -213 -86 -3 -121 349 -10 108 141 1 -2 -93 51
6108 51 -92 -62 182 -345 54 -191 -67 181 -269 148 -69 -71 -100 -55 -132 43 -96 108 143 -53 -108 -13 203
6131 203 -43 125 -78 18 -124 19 -19 154 -119 -239 -39 -88 293 -108 -146 -45 -225 415 171 -155 160
6152 160 61 58 -87 216 -37 198 22 121 19 198 36 -136 -25 223 117 38 -81 20 -70 228 111 -174
6174 -174 -219 -230 -82 167 73 -223 -140 -99 3 -9 51 369 -148 43 124 206 56 -135 36 84 -280 115 -72
6197 -72 101 -108 -5 -256 -4 -173 28 -33 -180 48 18 129 8 -90 158 291 -91 121 -28 172 142 -16
6219 -16 37 90 8 129 -191 5 55 37 -29 4 107 51 -199 30 -221 -38 38 14 70 -17 122 65 166 -27 -13
6244 -13 38 90 96 -104 51 200 112 -10 36 -196 199 -106 -140 30 -49 -129 212 77 28 -159 71 153 -42 -98
6268 -98 46 36 -18 123 32 211 61 -218 -76 119 98 -94 -95 -12 -113 -316 93 -106 -97 88 -122 -36 90 116
6292 116 37 123 -34 206 -8 -50 153 217 120 38 -118 -278 -149 2 47 272 -114 56 -193 -112 -97 207 -18
6315 -18 -124 208 -42 181 48 52 62 7 -119 290 -249 146 -309 -91 -81 -42 -50 -10 187 -151 17 -42 31 -163
6339 -163 -275 206 237 104 3 87 102 67 -175 64 -71 10 -71 -74 122 29 36 -44 47 -77 -151 -139 -42 16 5 -143
6365 -143 207 41 228 -15 240 82 27 52 -49 121 -14 -70 178 26 54 182 -296 -86 43 3 -130 -169
6387 -169 18 11 64 -113 -5 -20 -295 3 11 39 144 -56 -2 47 67 -14 -37 93 -65 0 14 -37 91 107 -223
6412 -223 -234 -108 -159 -47 -284 -87 -151 50 -109 149 56 -143 131 -16 22 -173 -86 15 -174 99 3 116
6434 116 56 168 58 55 -246 -50 28 192 153 164 125 86 91 38 -205 58 -202 5 -28 -63 124 -137 -81 35 12
6459 12 67 -186 -16 102 -63 327 -187 -22 -95 22 143 -112 -108 -49 20 -258 143 -172 125 58 -148 -99 -71
6482 -71 40 -76 -49 -105 -9 -35 -72 -85 22 299 119 -5 125 52 107 -159 -42 21 46 -42 169 -75 -189 -74
6506 -74 -115 65 110 35 -90 -96 -40 175 -185 22 152 22 -37 -238 -11 207 112 5 -297 56 225 9 68
6529 68 -161 -242 -67 101 104 91 1 53 109 -77 69 116 -13 -13 -151 192 -176 58 -51 45 10 -19 -102 -343 -15
6554 -15 -71 107 208 117 -206 -81 -63 286 -10 -329 -153 35 -27 -84 -149 -79 9 22 89 19 -24 -2 27 -61 20 87
6580 87 -125 222 -55 137 -316 128 205 324 136 122 47 14 93 -143 -103 -178 46 112 -62 -222 -389 129 -248
6603 -248 -36 -118 -75 -171 154 -175 -28 147 55 168 187 294 117 -95 -286 307 -369 115 62 -77 103 134
6625 134 -150 513 116 -145 66 -174 42 -114 -31 255 128 218 100 -5 6 -20 -153 118 264 -118 162
6646 162 -68 -127 232 -247 -230 -27 -102 140 205 89 -89 -70 43 112 -175 -306 -244 59 51 127 13 224 -59
6669 -59 75 -105 -70 56 163 -112 85 101 18 -93 -115 -15 108 33 107 -143 10 -125 -75 -42 177 -122 41
6692 41 -60 95 -260 -32 -176 -97 123 -97 -41 -64 52 86 -92 155 -87 142 90 -91 -27 -54 26 -9 -100 -338
6716 -338 -74 -140 -71 -15 68 3 134 -86 178 31 169 -26 30 -145 89 212 75 -172 426 -148 -11 -233
6738 -233 12 -129 -94 -36 -61 56 23 -226 -14 -178 -108 -14 16 -292 42 -132 46 -244 51 -189 -28 -111 -23
6761 -23 -68 -86 -12 10 101 -144 92 61 157 116 -229 -21 137 -89 -88 135 -34 42 139 -193 82 58 232 -102 -29
6786 -29 198 97 71 32 235 26 -216 170 -130 310 165 -160 145 114 -93 38 -45 -197 121 130 125 -151 28
6809 28 -80 105 -274 -118 -235 -111 41 150 86 -2 -105 159 43 56 181 73 104 9 230 13 -64 160
6831 160 -188 120 82 320 118 50 -127 -20 207 151 -23 45 -122 101 42 -167 10 -104 -278 92 204 -12
6853 -12 -95 -5 -187 -18 -99 57 81 -78 35 12 -136 58 150 -46 -77 -54 -211 0 247 -91 -2 -38 32 -211
6877 -211 -50 42 -158 56 -53 105 -68 191 32 -14 43 -102 -256 -34 -130 32 225 122 -104 -107 126 -121
6899 -121 37 -102 -139 -114 71 -57 126 -259 -34 167 297 -387 124 -195 76 -72 87 -67 -124 109 -337
6920 -337 -108 94 30 -109 78 -244 -9 344 -63 -37 -85 -113 -17 -62 -174 70 -104 154 121 32 185 -109 -171
6943 -171 9 128 247 331 3 186 -142 167 -320 0 212 78 97 39 -80 -271 7 54 212 113 171 -140
6965 -140 67 -15 -250 -29 -118 -9 -56 6 86 56 -99 20 31 23 -164 -13 -87 -86 -51 78 -32 5 261 59 -111
6990 -111 7 146 88 -46 6 237 98 23 10 -22 -162 -49 134 -105 121 -108 -106 -194 -4 93 27 -57 33 42 -179
7015 -179 53 2 -173 4 -116 123 -120 19 -26 82 -69 -125 -264 -96 172 -154 -353 -59 37 -133 104
7036 104 -63 158 35 -94 19 -164 -37 -171 -273 51 132 -236 66 -94 -77 76 111 -12 -38 -77 108 -48
7058 -48 143 -43 -37 -28 -138 -42 -53 85 -349 -120 -53 11 153 -242 -37 136 70 266 87 -32 104 -18 110
7081 110 86 -53 -373 20 13 16 -76 163 -157 -87 8 85 -148 -105 173 302 167 -217 -275 -146 -56 151 -108 -228
7105 -228 82 -179 -60 -15 70 102 49 166 -67 174 -78 -14 13 156 -51 -5 -211 20 -326 -16 -25 52 -361
7128 -361 -24 -172 -16 46 115 -101 -33 -26 -138 112 179 191 113 259 69 306 92 187 47 26 90 2 -129 -150
7152 -150 -338 47 18 -66 -130 -118 7 -8 148 -149 30 -15 -50 -23 -167 -185 63 53 128 -245 -52 75 -32 -122
7176 -122 -82 -92 -168 30 62 126 -116 -119 159 84 -205 -63 -16 204 -14 -138 99 -65 -16 69 -49 3 189 226
7200 226 -44 -191 -144 12 -259 -19 -224 -148 -63 -192 122 -42 36 -186 74 -8 -12 102 -359 -31 -152 -107 59
7223 59 -162 61 85 -136 180 -97 -37 -107 -71 -12 -8 -234 -86 -311 60 -260 103 -91 235 55 125 63 -52
7246 -52 -30 94 -35 251 161 166 84 -225 22 73 60 -55 109 153 213 -296 22 51 30 -55 -151 -169 -233 186 141 -171
7272 -171 -33 -35 116 94 63 72 123 2 271 -60 -121 44 -26 60 252 -198 -218 83 50 -14 17 -69 21 302 -19
7297 -19 -56 -51 -8 -177 69 151 5 104 82 230 272 -196 -88 -54 64 -153 -151 -87 -33 118 97 -182 -162 -73 -258 -35
7323 -35 -137 -196 -96 -40 -253 -106 -192 -42 123 -203 87 134 153 193 -91 170 94 16 31 47 -129 59 -165 264
7347 264 -78 88 58 -105 -48 -82 44 -67 -141 10 52 141 67 -263 88 58 -9 1 151 -144 -94 19 -90 115
7371 115 -119 250 -35 -171 76 127 -63 168 3 -67 62 -23 -145 -95 -81 112 75 91 -38 12 11 73 37 39 76
7396 76 12 152 3 170 126 -72 88 -56 -240 -62 -216 -163 237 4 212 211 -177 77 42 84 -119 68 65
7419 65 60 -245 223 102 -201 98 201 -114 21 27 -143 -21 -159 -125 35 -131 142 -338 -129 -66 129 -36
7441 -36 -24 76 -193 59 43 105 -120 -165 152 -90 -133 -11 -196 -109 78 -155 48 13 4 233 -316 79 52 -124
7465 -124 -124 -40 51 53 21 13 79 -73 104 257 215 123 80 240 382 -129 107 36 -223 -175 85 -83 -51 133 54 12
7491 12 -91 23 13 -149 12 120 -18 -75 101 -12 25 367 -60 105 -135 -191 -6 -84 96 76 -205 166
7513 166 62 62 -35 133 75 -36 91 -1 171 -215 123 182 226 -44 -347 -35 204 -123 131 -221 -294 -57 127
7536 127 107 133 -100 67 -124 134 -106 -15 -2 31 -81 -52 3 -27 5 407 -279 176 199 -67 294 -183 85
7559 85 -55 27 -90 12 -109 -15 170 183 -37 -149 -219 -63 -58 108 -81 130 23 54 189 -148 -19 15 61
7582 61 52 -186 64 220 -34 -60 -42 121 46 130 -20 -174 23 -86 133 -103 3 -211 -124 -115 -5 -92 254 -194
7606 -194 222 103 -100 111 63 29 -225 -145 111 -153 180 -119 -139 122 -68 -148 187 -69 -166 -20 35 16 6
7629 6 -5 185 335 167 -71 40 -31 -236 -17 -175 -16 -93 -14 101 256 43 117 68 56 -35 44 50 78 -14 -80
7654 -80 344 -50 -41 -75 6 -127 -47 149 -11 -74 -53 -34 40 86 -71 -22 132 86 32 -84 -10 15 -40 -271 223 -111
7680 -111 -209 192 47 104 141 -67 -102 27 35 227 28 -193 -38 -43 -192 214 61 -166 104 -101 11 278 -20
7703 -20 128 -116 41 44 124 -21 -1 58 -29 187 210 91 -38 -105 35 -159 -134 99 -279 119 9 301 -12
7726 -12 -285 -119 -41 -181 28 47 10 46 28 46 113 11 74 -37 18 141 9 42 -13 46 40 15 60 -67 -215 48
7752 48 129 54 365 -204 87 -65 67 -82 100 266 -6 246 -220 126 -78 -20 186 -55 -74 60 90 215
7774 215 194 -57 160 246 -105 -81 -11 213 128 51 82 51 -120 14 -128 -193 -34 -9 -53 48 -145 44 -52 399
7798 399 -12 40 -17 108 99 120 -1 85 51 -282 -165 42 68 -9 86 203 70 -93 183 -252 -242 57 8 -46
7822 -46 -41 -34 216 92 -191 79 -118 57 29 116 259 170 40 -49 -328 75 25 126 57 -211 -45 -75 -113 -114 70
7847 70 -139 0 -62 63 -237 -98 -33 140 136 -64 -27 82 -8 -166 239 125 -180 93 -31 219 -81 52
7869 52 47 -28 230 -84 -164 -160 196 191 -38 10 172 -68 36 21 217 -151 70 -3 78 96 -180 -72 -113 -128 -104 -238
7895 -238 57 147 -77 122 218 -151 315 212 -224 -10 97 -11 49 81 128 71 81 -124 -94 -37 -105 64 19 162
7919 162 -35 -115 7 -147 -215 -47 -212 -50 -192 173 116 -38 -6 314 187 175 -77 110 -66 17 -122 -50
7941 -50 4 -1 -51 -89 -108 61 -41 12 185 -28 115 64 60 207 189 -212 -139 -26 -64 12 206 33 13 -70 -108 135
7967 135 -38 -213 -100 24 -48 138 -9 69 -12 5 70 249 90 -114 -115 10 -130 -74 169 108 172 180 -88 -7
7991 -7 -13 -170 -95 260 136 331 32 198 -64 101 -178 78 -87 -104 -30 84 -79 260 -59 -199 17 6 34
8014 34 -17 62 175 246 -198 -125 -104 -170 36 -27 -100 -78 77 -123 -48 -66 -132 68 32 38 -172 245 -48 1 75 -38
8040 -38 113 36 -49 22 37 130 -194 21 11 115 188 -33 -71 4 225 110 152 111 -282 1 -185 -67 92 40
8064 40 226 127 68 169 -25 -148 -116 -10 -184 3 49 -139 103 116 -32 -101 18 -181 -163 -25 -282 29 8
8087 8 1 -70 -233 -102 -92 -86 -377 -46 56 -187 80 81 192 -90 -33 -257 -93 121 139 176 -152 -74 -197 166 -182
8112 -182 -183 117 -114 -178 193 -79 -201 141 92 -134 198 107 329 56 -35 -32 135 -89 50 -175 -96 86 -313
8135 -313 76 51 -93 27 -143 -224 44 -33 193 -149 -69 27 -93 47 128 -200 -79 68 66 129 -69 -60 -67 50
8159 50 224 -122 -133 97 -103 -86 127 79 88 91 187 -10 8 217 -100 -87 -3 -135 11 41 195 77 -228 120
8183 120 -57 110 -112 -122 -13 -115 13 -94
8191i4
$$ Imaginary data points
##PAGE= N=2
##DATA TABLE= (X++(I..I)), XYDATA
0 0 0 0 0 0 0 0 0 0 0 0 0 0 0 0 8 -8 8 -8 8 -16 16 -16 24 -24 30 -32 40 -44 51 -58 66 -75 86 -96 108 -123
36 -123 138 -155 171 -191 211 -235 262 -288 318 -351 386 -426 473 -518 572 -630 694 -768 849
55 849 -939 1047 -1170 1314 -1487 1694 -1956 2292 -2739 3371 -4324 5917 -9050 17462 -85989
70 -85989 -200338 84703 77892 -82280 24108 109243 -19005 8657 120994 53229 -17637
81 -17637 37855 21331 -3814 46822 43590 9117 10998 -11970 5539 32675 -47053 -98947 -21181
94 -21181 3805 -53236 -36427 4611 -35241 -34038 14314 -18387 -45467 -13659 -22330 -10934 48089
107 48089 38109 -2617 20167 49647 35336 21854 16982 -4167 6617 47127 35127 6905
119 6905 20355 21880 -307 -12235 -7287 -11086 -46746 -50054 2328 7287 -31554 -26786 -9596
132 -9596 -23359 -24927 -7728 -28976 -46741 4483 29096 -3714 13391 38855 7888 2041 31896
145 31896 28599 867 1155 27699 37281 29851 24142 14675 7368 888 -3464 -1333 -20619 -32869
159 -32869 -5100 620 -18940 -10919 -7120 -31540 -39994 -17150 -11088 -35117 -28338 4086 7214
172 7214 2192 8931 9249 5817 2873 9584 17572 10704 15249 30202 30165 27102 25315 17850 6445
187 6445 -1472 4748 1576 -12147 -6784 24 -4732 -7976 -15736 -22733 -26232 -30374 -26679 -21498 -18467
202 -18467 -13243 -9476 1945 7175 -1663 -146 3450 2558 10539 16333 18640 22882 25680 28232 22327
217 22327 15815 14014 2367 -3478 2678 849 -1454 -2531 -4513 -5266 -11648 -17132 -20191 -26360 -21888
232 -21888 -16181 -16920 -9354 -1749 -933 -1647 -1537 4124 245 -4904 7856 13983 10431 17829 22793 18587
248 18587 13628 13819 11741 -1356 -2161 7756 321 -2771 6540 3044 -6408 -9489 -7379 -12715 -21901
263 -21901 -16527 -9094 -12797 -7483 -315 -1617 -2965 -3483 -1459 -3337 -6442 3328 7021 4194 12815
278 12815 16805 12639 9998 8490 7248 2275 489 4949 3494 5947 8335 1507 2005 1016 -8661
293 -8661 -10057 -9223 -11790 -10257 -6499 -2919 -5382 -5625 -598 -6765 -10697 -5921 -7357 -4959 1120 4238
309 4238 7692 6604 7676 11707 5542 2991 5367 4481 5757 7479 11234 11942 5082 4194 4491 -2401
325 -2401 -5099 -7508 -8639 -7271 -7482 -2222 -2353 -12400 -7880 -3320 -12792 -14724 -5554 -4401 -8364
340 -8364 995 12173 2660 1374 12940 4892 1177 11358 5723 2931 13685 13460 7363 10412
354 10412 9213 -1427 -990 2480 -9818 -10073 2048 -8725 -11259 3799 -5803 -17754 -7031 -6177
368 -6177 -14905 -9614 -1974 -6175 -1420 10132 3211 -368 10289 4564 -296 10080 6910 3269
382 3269 12117 11336 6780 9161 7799 -1189 -3382 1513 -3901 -8049 -1585 -3485 -5544 -551 -5777
397 -5777 -9164 -6302 -9250 -9060 -5235 -4055 -1652 282 2226 4034 3949 1850 -967 2997 6123 697
413 697 4927 9816 4748 7169 8216 33 1241 2079 -3575 -3436 913 966 -2979 333 2033 -4382
429 -4382 -3442 -3098 -10193 -4686 -16 -6321 -2499 3049 -99 -1194 501 -817 -3553 -1421 1011 -1423
445 -1423 3144 6852 1781 5395 7454 422 1042 2593 -759 1317 3848 2751 1516 4059 4316 -2319
461 -2319 -3157 -1166 -6365 -5435 -1888 -4333 -2260 -563 -3101 -2632 -2701 -4363 -5736 -4879 -559 -531 552
478 552 4766 3578 4857 6661 2356 2486 3448 2228 3769 4973 5697 4499 2663 3801 792 -2705
494 -2705 -2461 -6033 -6546 -2809 -4389 -3734 -2051 -3750 -4341 -4838 -4493 -4729 -5670 -1136 800 592 5549
511 5549 5509 3436 5934 4682 2972 2446 2920 4679 4137 4769 5573 2017 1254 214 -3087 -2477 -4762
528 -4762 -7015 -3677 -2737 -3006 -2589 -3144 -2771 -4523 -4348 -2385 -4011 -1286 1839 1196 4257 5055 2751
545 2751 4168 2644 1551 2296 1472 2221 2704 3955 5006 820 475 1194 -3120 -3340 -2083 -3608 -2222
562 -2222 -1527 -306 386 -1619 -1767 -3075 -3862 -1235 -2668 -1817 1117 410 2162 3076 549 869 56
579 56 -726 96 -155 2119 1954 991 3831 2986 747 998 -1099 -764 44 -902 862 1636 1715 1659 -246
598 -246 -286 -1427 -4066 -2137 -2389 -2712 -269 -1211 -649 643 -1268 -1587 -2499 -2996 -1277 -966 994 2198
616 2198 1855 4154 3434 1608 3169 984 85 1467 1652 3190 2890 1788 2422 365 -1295 -1666 -4151
633 -4151 -3224 -3446 -3983 -1598 -1925 -1855 -669 -2757 -2482 -2508 -3055 -850 -793 954 3869 3087 4000 4361 2817
652 2817 3015 1165 575 2261 1269 2585 2756 1046 1652 -126 -2174 -2104 -4124 -4524 -3390 -2991 -967
669 -967 -1213 -1271 -586 -2090 -1007 -677 -2943 -442 1046 1157 3215 3601 3651 3628 1974 1483 181 390 1548
688 1548 -91 1089 2447 403 562 -538 -2120 -1542 -3246 -3550 -1828 -1914 117 823 -233 -321 -864
705 -864 -433 -530 -2395 137 570 -210 2553 2502 1516 1821 -255 -37 -486 -2190 144 670 921 1748 725
724 725 1307 94 -1381 639 -1210 -2074 383 -286 961 2693 1145 84 -1410 -1331 12 -1613 -2134
741 -2134 -1515 -1122 1572 549 -530 13 -2149 -2038 -649 -1436 362 221 83 2471 2554 2569 1535 -154
759 -154 838 1012 930 1414 408 1241 2552 576 595 -974 -2869 -1895 -2419 -2185 -1720 -2621 -887 -13 -879
778 -879 -498 -2164 -2350 -252 -477 1045 1174 1045 3258 2864 2776 2931 678 594 1261 323 1810 975 407
797 407 916 211 282 -1419 -4007 -2548 -2344 -2006 -1501 -1935 -710 -132 -700 476 -734 -2346 -259 178
815 178 1692 2182 1282 2264 2236 2348 2597 -112 -625 32 -431 1020 770 -481 98 -775 -259 -644 -2506
834 -2506 -1746 -1868 -1500 530 183 -361 230 -13 1200 -12 -1337 129 -369 307 2077 1031 959 905
852 905 388 580 -1009 -815 -694 -1846 264 1226 30 444 -245 0 534 -533 -769 -349 -171 1688
870 1688 767 908 1394 -65 -179 330 -1130 -874 -1339 -936 465 -635 -96 48 -1443 -784 -633 -889
888 -889 -475 -1305 813 1721 74 1586 2028 461 732 927 1495 674 -231 1853 1411 79 1015 -328
906 -328 -1334 -1320 -1903 -1321 -2266 -2396 111 -1172 -1375 65 -993 -995 -722 -518 921 34 1247 2302 1326
925 1326 2148 2516 867 921 839 1026 858 -496 1059 943 -962 221 -729 -2080 -1663 -1591 -1633 -2039 -1299
944 -1299 -127 -1246 -905 915 -775 -316 494 -105 627 1103 1312 1920 1343 1454 1423 378 823 80 -433
963 -433 774 -405 -204 286 -455 -189 -737 -1585 -715 -1252 -952 -3 -909 364 67 7 860 -509 26
982 26 608 -788 348 824 922 738 -92 468 665 -1280 -606 391 -1030 -141 659 366 -214 -81 1324
1001 1324 -349 -852 1128 -399 -535 1656 339 -133 798 237 48 -350 -552 -1101 -1604 -285 -768 -1396
1019 -1396 1017 -955 -1869 422 -795 -1001 59 -629 364 1355 1525 1292 442 1555 1267 452 1738
1036 1738 437 -268 1568 752 204 498 -1312 -1029 -822 -1281 -1596 -1944 -1510 -1114 -847 -238 -1131 -1570 363
1055 363 -891 -188 1333 149 620 2018 1569 2082 1434 847 1292 1263 1536 143 -347 678 141 -160
1073 -160 473 -1830 -2141 -921 -1624 -1488 -1516 -1276 -1135 -1211 199 246 -1241 113 47 261 1728 820 763 1505
1093 1505 1700 2002 989 459 562 -100 734 616 -959 -103 -53 -391 308 -814 -1556 -1334 -1645 -65 -365
1112 -365 -848 -215 -596 492 758 -750 -156 78 -532 1052 660 -147 325 657 1200 185 -305 131 -867
1131 -867 -317 960 -197 300 225 -400 1070 145 -576 -120 -598 209 498 42 426 -348 9 608 -837
1150 -837 -697 -645 -1272 83 -190 -742 13 -646 -488 180 -166 89 -565 -167 1350 530 1045 1291 683 1260
1170 1260 1081 645 625 -352 398 590 -205 292 -283 -966 -725 -1439 -1334 -1510 -2303 -997 -479 -1018 33
1189 33 -581 -604 238 -417 449 794 204 1962 1491 1903 1933 1088 1445 1185 225 910 -34 -383 463 -395 -47
1210 -47 -528 -1658 -1190 -1719 -1949 -1373 -1726 -782 -869 -1024 182 -71 -224 633 124 408 934 835 1887 1438
1230 1438 1513 1902 921 997 944 -166 386 -478 -460 503 -789 -549 -449 -1194 -1073 -1619 -1279 -706 -1249 -512
1250 -512 -225 -325 1066 485 -326 867 396 66 680 527 901 869 1215 971 41 318 477 -919 -307
1269 -307 262 -633 315 -54 -222 33 -416 -550 -705 -668 149 -524 77 896 -341 449 154 -920 -339 -187
1289 -187 -487 96 -365 278 441 -75 923 189 9 669 -145 110 765 131 545 1107 877 689 216 412
1309 412 180 -559 317 51 -782 247 -447 -742 -598 -1296 -935 -1106 -1190 -357 -854 -559 285 -109 855 271
1329 271 235 1055 439 814 1174 749 1480 1083 684 1306 432 148 149 -380 -327 -742 -911 -499 -1144 -1094 -760 -1694
1351 -1694 -1060 -988 -1676 -775 -531 -325 694 396 779 1002 759 1234 507 1005 1729 780 1218 1643 797 580
1371 580 325 -360 -464 -900 -960 -740 -1124 -501 -916 -1338 -594 -1249 -954 -429 -962 -169 587 37 885 645
1391 645 928 1077 417 1124 700 499 1001 664 516 737 108 325 -65 -671 -386 -716 -688 -455 -873 -217
1411 -217 -368 -507 -15 -823 -567 -233 -711 48 169 -175 726 469 365 516 -167 -379 179 -129 335 29
1431 29 103 910 75 244 680 -362 -20 -131 0 563 271 611 438 -290 275 -201 -566 -128 -637 -263
1451 -263 -73 -668 -123 -248 -582 -244 -928 -781 -354 -350 243 36 237 770 461 774 849 343 695 813 561
1472 561 901 691 802 769 -94 310 -268 -893 -566 -831 -773 -390 -1161 -621 -625 -992 -599 -974 -686 -243 -642
1493 -642 345 602 459 1244 883 754 1138 796 734 698 389 1258 666 377 501 -212 -164 -312 -1196 -719 -605
1514 -605 -1224 -562 -1088 -517 -499 -742 -544 -727 -442 -29 -153 744 860 323 1267 957 575 933 317 583
1534 583 518 137 415 468 188 357 -554 -503 -307 -1071 -660 -477 -896 -251 -489 -735 -169 -430 -52 -298 -211
1555 -211 438 74 150 777 368 576 567 23 484 1 15 196 -235 166 197 -283 237 -181 -297 -197 -855 71
1577 71 174 -219 33 269 105 66 -361 14 13 -453 20 -228 -264 52 -209 -58 -28 -338 181 -125 -424 307
1599 307 -47 47 524 131 576 242 82 646 418 263 587 306 503 386 -37 255 -422 -374 -375 -983 -319
1620 -319 -673 -970 -286 -464 -496 -416 -660 -166 -198 -333 513 556 463 969 348 587 795 589 788 297 677 538
1642 538 -15 107 260 -500 -407 -449 -835 -475 -737 -878 -650 -795 -455 -455 -547 49 -317 -253 72 3 788 500
1664 500 730 1024 586 713 755 101 654 639 178 369 -42 90 151 -563 -288 -339 -959 -599 -929 -487 -383
1685 -383 -323 19 -137 -281 146 76 148 362 113 664 600 369 599 219 422 414 -71 191 72 -328 371 54
1707 54 -249 -70 -299 -95 -224 -355 -10 -230 -299 17 -37 383 265 -88 416 -328 -352 339 -331 -179 133
1728 133 -260 -14 -325 -431 22 -269 -149 50 -504 190 43 151 631 130 348 267 -174 411 302 227 392
1749 392 79 189 72 -184 -126 -358 -607 -437 -726 -381 -100 -386 -201 -111 -533 6 -348 154 213 152 516
1770 516 699 462 766 535 505 592 400 248 238 27 454 -180 -202 -109 -617 -484 -515 -869 -537 -897 -564 -308
1792 -308 -289 -364 -68 -168 42 271 419 564 421 503 537 660 646 569 141 683 52 138 10 -414 118 20 -330
1815 -330 -225 -589 -868 -387 -586 -47 -342 -297 185 -19 164 98 -124 66 429 76 774 342 394 455 17
1836 17 452 291 -16 130 -328 -214 350 -318 -122 -93 -60 146 -365 -487 19 -439 98 81 197 126 66 80
1858 80 295 -21 203 334 -255 400 31 -138 43 -269 -274 -102 -574 -311 -316 -298 159 220 38 322 -71 286
1880 286 345 -55 47 -22 486 565 -250 272 -181 -128 -112 -552 -471 21 -374 -101 -362 -520 28 -343 -177 -32
1902 -32 -207 30 -95 180 650 333 562 753 399 501 597 0 314 -144 -21 210 -129 -234 -209 -600 -433
1923 -433 -773 -725 -539 -709 -255 -222 -252 136 -36 -9 366 49 253 502 220 589 384 254 1042 312 317 374
1945 374 -212 -210 -290 -385 8 -213 -486 -159 -581 -480 -326 -785 -146 -405 -200 -23 -23 361 130 132 446 288 391
1968 391 581 126 522 530 272 140 17 234 159 -494 -298 -338 -585 -149 -423 -215 9 -193 -87 -176 -176 59
1990 59 74 -86 365 -53 240 167 229 519 98 -353 168 -74 38 135 -274 12 -221 -531 128 -227 -149 -32
2012 -32 -502 300 -131 -45 293 70 321 5 53 152 107 -7 322 80 88 203 -378 -166 -193 -139 -98 -485 -216
2035 -216 -3 -388 -166 156 16 403 -148 378 224 459 475 392 17 508 375 43 420 -191 107 21 -103
2056 -103 -67 -185 -425 -360 -440 -288 -553 -628 -168 -185 -180 104 -105 255 366 148 361 250 557 267 133 671
2078 671 634 254 30 128 -95 -23 -514 -580 -288 -548 -237 -266 -775 -246 -517 -415 -165 -182 225 21 108 466
2100 466 427 479 390 225 504 796 100 389 198 9 494 -154 -57 87 -201 -134 -207 -488 -261 -374 -230 -285
2122 -285 -205 -49 -246 -107 103 -161 110 223 180 529 151 104 405 -202 50 -57 -187 30 -207 -30 -42
2143 -42 -385 -313 -236 -460 91 -348 -111 208 -69 119 283 13 452 -196 170 167 -38 443 115 -51 -17 306
2165 306 -96 93 -400 -78 -317 -429 -7 -112 -154 13 -102 -206 53 -195 315 -95 151 301 -15 114
2185 114 374 302 479 -50 -325 206 -176 -295 25 -240 -112 -401 -506 5 -282 -290 -58 -217 -94 5 -157
2206 -157 668 77 -80 362 80 354 345 -66 484 175 158 238 76 -129 -68 -390 -249 -363 -247 -112 -700 -276
2228 -276 -134 -337 -357 -297 -297 190 -174 374 -12 208 393 550 302 573 -19 180 560 -11 472 144 -271
2249 -271 -142 -408 -15 -164 -357 -233 -318 -251 -299 -370 -198 101 -279 27 -41 97 332 175 22 290 65 50
2271 50 109 -58 309 -104 -276 80 -167 -44 -28 -138 -163 -350 -116 -151 -412 -90 27 -14 289 -32 -3 398
2293 398 43 64 159 38 404 -34 35 125 -366 86 93 -101 137 -226 -264 -341 8 -38 156 -189 171 -203 -214
2316 -214 230 -57 288 118 126 325 43 119 302 -138 -150 12 -252 -238 -236 -149 48 -273 -288 -112 -568 -56 -184
2339 -184 -170 -240 -14 -117 -31 -112 220 211 131 504 458 73 658 155 32 225 -285 266 -232 -158 -107 -476 88
2362 88 -248 -429 -68 -399 -399 -21 -172 -26 40 -185 446 130 256 365 88 247 29 205 201 -144 194 128
2384 128 -125 302 259 -173 -117 -328 -140 -250 -416 -262 -239 -137 -4 70 -230 151 23 35 96 -3 468 -18
2406 -18 104 457 141 93 191 121 112 -153 -64 -52 -3 -204 -120 -249 40 -3 -223 21 -461 405 -60 -195 0 133
2430 133 -8 74 122 119 111 106 110 -136 -247 192 -350 -134 31 -308 -100 -363 -530 -20 75 -201 -51 134 -60 132
2454 132 -1 295 -54 -6 468 207 400 76 -220 369 -235 -118 -9 -233 -295 -101 -332 -88 -154 -117 -263
2475 -263 -85 -99 -34 -148 22 -199 82 342 21 241 71 82 184 92 -281 212 70 264 155 -136 -128 -457
2497 -457 -263 35 -240 -484 -12 -538 207 -274 -208 321 155 -5 318 254 154 395 110 446 -78 47 659
2518 659 -162 138 316 121 -42 -47 -44 15 -367 -194 6 -503 -239 -493 -219 -89 -35 -189 435 16 384 173
2540 173 174 199 88 26 397 441 435 224 -28 249 -96 -289 251 -59 -43 -293 -260 11 -336 -18 136 -168 116
2563 116 103 8 256 -26 227 127 -56 -2 32 -59 164 86 244 233 179 -13 -179 -253 -19 -336 -242 51 -60
2586 -60 -83 92 -10 88 138 -47 107 -72 86 213 283 129 131 185 -176 68 193 152 -381 -233 4 -231 -106
2609 -106 -289 -371 -116 -297 -90 -82 -275 189 -43 150 172 141 185 303 291 445 58 268 373 241 259 161 -287
2632 -287 -132 -270 -12 -138 -225 -51 -302 -368 -71 -23 45 160 -62 199 -34 96 83 -59 246 287 327 39
2654 39 171 -75 26 -18 -68 237 -202 0 -138 -21 -87 -320 -363 9 -180 -312 -75 -74 155 92 45 292 7
2677 7 50 191 237 204 229 -68 107 -25 19 119 -186 43 3 -139 -166 -88 -176 34 -451 -181 -174 -244 -3 -152 -43
2702 -43 136 160 186 -69 251 48 -156 66 123 37 125 -117 236 224 -42 18 215 -328 -37 -3 -199 3 82
2725 82 -130 -29 342 39 332 -33 219 131 199 171 269 -34 32 -151 -97 79 -118 29 -155 -218 -121 -279 -10
2748 -10 -184 -117 21 72 42 3 -41 368 -2 105 216 306 268 209 229 424 114 -23 134 6 -125 -139 -215 -18
2772 -18 -311 -351 60 -237 -309 -113 -167 -129 -9 -86 334 144 -21 74 158 285 6 33 230 165 102 149 43 95
2796 95 35 49 -68 9 -119 -116 27 -202 -235 -119 -144 -91 -27 237 -313 63 149 -43 230 -35 142 255 330 113
2820 113 28 -55 78 -30 -26 181 -255 -117 150 -239 -153 266 -41 63 -127 -64 -144 -249 59 -109 157 200 126
2843 126 157 300 133 151 159 127 230 102 352 13 -97 -22 -27 -213 -422 -253 -22 -118 24 -2 126 -41 17 127
2867 127 362 270 42 30 372 -177 284 197 -171 172 93 -236 -270 -81 -210 -288 -129 -50 131 -292 53 -208
2889 -208 5 -57 64 119 64 16 381 128 57 -17 68 241 -244 -268 -141 -122 -47 -70 -33 80 -153 -46 -235 -287
2913 -287 -216 -104 -61 -11 -176 -14 247 -45 140 198 -1 78 -100 378 167 -97 171 23 -114 278 83 -90
2935 -90 102 -122 41 -281 -358 -62 -29 21 131 -316 5 78 -65 6 36 -85 59 1 157 202 40 168 138
2958 138 146 -118 -86 130 -188 -100 -122 -258 -251 -4 3 -385 56 -253 -51 -42 36 150 -200 100 -97 80 91 94 244
2983 244 184 56 50 206 -28 128 -6 139 -61 -151 -75 -228 -114 -76 35 -150 -27 -182 -77 157 118 174 302
3006 302 -149 182 -97 -52 143 -336 116 152 132 111 45 30 -35 -321 -73 -14 -240 32 -110 -8 -39 -17 14 157
3030 157 -11 59 176 276 259 16 52 167 10 12 32 -33 -24 -46 -129 163 -178 37 15 -179 -96 -99 -75 -9 -271 162
3056 162 34 20 223 46 343 293 185 259 227 44 155 -28 19 236 -40 -74 -142 -208 -330 -502 -186 -71 258
3079 258 -99 -335 -423 13 -247 -138 293 157 -33 -122 -72 191 79 6 245 28 63 351 -27 -156 -71 -64 51
3102 51 -195 -25 -19 -273 -345 -440 -8 -105 -74 44 -154 5 61 85 55 165 57 -54 133 28 83 53 -81 101
3126 101 -91 1 -170 -158 -19 -88 -358 267 -261 38 134 148 54 -395 40 -65 143 -20 71 86 -14 -9 -2 161
3150 161 -70 -197 209 -62 -421 -55 -50 -85 -146 -120 -18 -195 3 -99 -38 -115 -137 59 325 202 -198 15 30
3173 30 245 -19 -80 -69 5 -56 -45 -92 110 -250 -377 -104 -99 -159 -77 -168 41 -188 106 6 -190 -126 104 77 356
3198 356 139 7 268 -106 36 -244 -131 171 -137 0 31 -138 -111 -120 -281 -77 -197 -167 -128 -235 -39 89
3220 89 -12 278 83 60 49 113 219 135 201 111 49 -276 -4 18 -130 -116 30 -286 -109 -199 34 -103 -178 -158
3244 -158 42 -206 -51 -198 106 -179 232 72 -175 -19 49 127 194 103 -28 251 66 105 -26 -283 42 3
3266 3 -18 -18 -400 -79 240 -212 9 -309 -66 111 184 113 230 -16 -31 58 284 231 -8 -16 193 -91 -4 -57 -146
3291 -146 258 -393 -144 -123 97 86 24 -201 110 -2 -59 164 205 130 -89 -45 220 239 257 164 205 256 -85 -211
3315 -211 118 -85 -114 -165 66 -11 -107 -493 -284 -106 -231 98 -235 -233 -113 26 -33 65 210 313 -20 -130 95
3338 95 157 -27 -53 89 -77 -153 232 97 14 -72 -190 -226 -193 -171 -88 -76 -233 209 264 -241 121 147 401 1
3362 1 203 271 36 -52 418 176 34 225 -34 38 6 -50 8 -205 -85 61 -271 -94 -30 -360 62 94 -125
3385 -125 58 -84 9 140 -103 62 3 -60 83 3 141 56 -91 -29 -4 130 95 -34 -148 -269 -206 221 -62
3408 -62 -399 -64 -16 59 62 121 -141 131 5 165 304 285 -22 72 232 206 -102 125 -52 -146 -86 -170 -259 -165 115
3433 115 -232 -136 -194 9 -18 -53 354 -10 99 -15 94 123 61 37 -183 -205 260 -77 -63 -31 -35 21 -74 -104 158
3458 158 -31 -197 -28 -168 -30 65 12 81 -47 -191 -218 -19 61 327 137 78 1 -175 101 134 8 9 2 -180
3482 -180 -166 -220 221 -17 67 -276 -80 -168 43 -40 80 29 142 -78 273 -9 -88 351 194 -13 100 246
3504 246 -49 181 58 15 15 278 106 -1 -170 8 -65 0 68 -220 123 -71 -272 -24 132 31 -80 16
3526 16 249 241 79 85 194 120 345 -184 212 -108 -257 178 35 169 29 -164 -109 64 -37 -45 29 -42 -70 -135
3550 -135 -72 90 21 263 131 3 303 -101 -54 70 63 135 134 -58 220 6 -53 173 -160 -167 -221 -51 154 -173
3574 -173 120 -68 -126 -167 -47 -152 67 184 -19 13 103 128 41 -165 149 -68 158 -12 -91 -128 -26 -216 79
3597 79 -124 -205 -12 -10 32 -97 -270 185 -13 -74 202 -21 245 151 103 -35 92 81 107 -14 -30 -5 107 95
3621 95 -157 -212 36 50 -201 3 -180 -169 70 -259 -6 130 296 253 133 287 99 56 216 166 152 184 0
3644 0 -8 -7 19 166 -179 91 -130 -148 40 49 -64 -172 71 25 342 -54 135 119 23 321 95 247 29 -57 -234
3669 -234 39 -133 55 25 -48 95 3 13 127 -304 -233 -35 -56 -45 -105 -12 -57 -28 -36 2 -85 109 119 176 187 -100
3695 -100 175 24 -26 129 -73 -60 -215 -193 -47 -28 -119 -115 -87 268 -28 -171 127 11 40 -9 161 175 153 -137
3719 -137 162 182 88 340 153 -12 -92 79 -182 35 -135 -125 -25 -228 56 -159 -178 -117 -44 -25 -59 169 -34
3742 -34 -99 -74 64 -29 -112 3 15 83 -38 171 437 56 172 212 -21 -102 167 -198 -71 -115 -195 -17 -95 20
3766 20 -36 94 -54 42 118 217 122 -91 -244 -30 7 155 264 50 87 -92 145 -7 -56 -192 89 -4 59 74
3790 74 -181 -270 -287 99 -53 81 -273 -20 28 229 -23 71 202 32 164 103 74 -27 -75 -212 -254 210 144
3813 144 -3 -10 -80 -26 -117 148 -158 136 -34 -126 -46 -84 139 257 73 134 -52 -284 99 311 -17 -152 -182
3836 -182 372 -21 -46 -117 -122 -123 -74 79 -49 -108 151 -144 151 -3 -52 -130 -39 144 45 118 77 214 -150 35 214
3861 214 124 -287 -82 120 52 92 67 -376 -217 -219 -78 99 -174 -312 229 64 -118 177 52 -154 199 198 82
3884 82 -61 -2 102 11 152 117 -35 165 81 -34 -41 168 -86 -82 -147 129 -129 -247 198 -7 51 79 15 22 -106
3909 -106 143 135 -1 -171 -33 -10 -49 -188 24 188 54 -169 -318 19 223 -63 -3 22 -226 -25 -164 -20
3931 -20 -36 110 7 53 -19 158 231 136 151 142 -44 47 -37 -36 -78 32 65 131 50 93 -153 107 85 -285 82 -182
3957 -182 -105 72 10 -63 189 -231 -50 -9 58 -123 90 121 166 190 58 266 127 -14 -81 -160 11 -210 34
3980 34 -490 -176 -34 -274 -35 44 -23 -7 -11 -123 480 212 -101 246 59 97 119 -124 41 -93 243 -58 -156
4003 -156 100 278 36 -271 4 -8 -9 -252 213 106 -24 -209 79 145 145 95 -9 52 11 18 165 208 74 -150
4027 -150 253 165 30 25 -61 116 109 -48 -172 -193 -149 147 -64 -45 3 309 -39 -13 -360 -57 -10 70 89 -78 168
4052 168 51 53 116 116 177 -347 123 182 79 -92 -64 -58 -176 235 3 -36 221 -110 68 -66 60 331 -102 183
4076 183 80 10 -23 163 36 -56 78 55 275 15 40 -161 -18 250 -44 -26 -129 57 -124 21 85 -176
4098 -176 236 257 206 -116 -139 65 -79 34 -81 -128 77 18 -70 -24 265 3 -154 -35 -69 -153 93 -125 -73
4121 -73 131 55 7 -48 -151 -51 -69 -137 134 347 -95 10 -37 116 176 -289 75 -100 1 3 -29 248 -145 -107
4145 -107 -225 9 -225 -215 46 -26 101 42 -50 -38 -196 -14 -53 -167 33 8 -7 46 89 239 76 -61 110
4168 110 100 117 134 -162 -134 -150 -111 56 108 -111 -108 -58 182 113 -251 -194 -180 246 139 -163 290 88 105 -67 81
4193 81 -15 -98 -1 -15 -125 -128 -53 -90 -112 -215 -128 -59 272 -212 30 34 112 158 -147 6 -100 81 256 131 180 39
4219 39 39 352 128 91 182 -54 -78 -150 -10 -120 1 132 -121 76 -177 5 58 73 86 121 -170 88 -34 -114
4243 -114 18 -108 238 38 -64 -76 -58 -74 199 182 -17 -15 199 -59 -128 -95 141 35 268 65 -126 -37 361
4266 361 10 5 48 81 101 229 73 221 -58 -46 -44 104 -199 -24 -200 -79 -61 75 37 199 -212 -176 -125 74
4290 74 134 -12 -50 -56 196 198 87 122 -33 -107 -111 255 -150 -43 -67 -215 55 113 -211 -524 185 -122 86 -86
4314 -86 11 21 -8 -16 -148 196 -93 -36 -112 92 217 28 185 -42 91 -159 211 56 155 -103 -107 27 -57 -228
4338 -228 184 -54 -24 -99 203 -6 195 103 89 -93 -127 334 260 132 105 -66 -49 -229 36 48 -62 -11 -49 42
4362 42 26 -281 -105 -10 40 108 43 -12 -73 -89 -37 195 -144 -191 12 -43 -123 79 1 -34 97 100 -12 81 -137 -27
4388 -27 -161 -47 -216 54 62 100 -132 200 250 -12 -97 -20 169 -174 -26 182 -26 127 214 -64 -144 -16 123
4411 123 169 161 -38 54 92 116 -63 288 -27 73 59 54 -266 -17 27 -169 107 -177 -251 37 5 -168 262 347
4435 347 126 -32 -141 239 -113 -189 -65 -122 76 5 -44 -165 -65 10 -216 -100 9 34 159 57 -89 -266
4457 -266 93 -15 186 63 156 193 -86 175 46 -209 -147 124 142 127 -143 244 -33 -204 111 -49 -185 -62
4479 -62 -47 69 100 -42 109 -70 -183 163 217 24 156 -81 -51 136 -31 29 8 154 -122 -84 192 215 -88
4502 -88 98 -29 68 -63 35 135 106 129 -132 -49 273 -35 -125 314 -8 278 -46 -6 -9 179 286 -143 -73 -36
4526 -36 -19 -97 -21 -90 -125 -13 -214 -51 110 -70 -130 243 -153 1 -24 -73 -23 -151 330 153 35 120 48 -149
4550 -149 13 -202 -204 26 18 364 155 79 -69 157 -232 -152 0 -90 92 71 -184 52 152 -174 3 -46 26
4573 26 222 74 165 159 -90 -68 -35 -115 97 -83 41 -76 84 -388 -37 95 -91 -163 236 142 114 134 88 3
4597 3 -97 96 17 194 146 34 3 -97 -67 169 -170 31 287 -83 -103 -153 44 163 -83 116 -227 -92 34
4620 34 -26 35 -93 118 141 51 93 -79 159 -14 -40 -52 -210 67 -99 -46 -191 -109 -138 -116 -196 24 -202 -25
4644 -25 -157 -75 -14 82 144 -14 69 129 -214 -57 316 119 -17 -58 104 -261 73 26 112 54 185 -37 158 -60
4668 -60 -28 -162 0 -69 -332 -164 -171 28 237 -82 -3 37 72 248 -187 77 377 247 60 -28 36 11 -62 -4
4692 -4 139 -108 -7 -130 -230 -25 -199 -186 22 -157 -57 -239 -78 112 -101 -156 124 219 14 124 -234 -46
4714 -46 -110 226 -142 -22 66 21 -120 9 46 -113 165 244 136 99 201 -95 112 61 -39 184 -16 67 48
4737 48 112 -157 -275 10 23 -31 -121 46 -174 98 165 156 -256 -66 137 -190 121 14 19 -63 -31 65 28 -88 7
4762 7 173 -2 37 1 84 -27 -360 15 237 157 171 -79 -114 -86 -163 -5 -14 77 37 -143 231 -82 -42 -103 198
4787 198 124 132 62 -13 -56 -62 302 73 -118 79 -33 -32 44 263 -49 -157 -188 -115 93 -31 -80 4 -83 -129 -41 118
4813 118 193 -68 -14 -122 -148 209 105 -58 81 52 217 -87 185 103 -81 173 -75 315 131 -115 -178 5
4835 5 -164 -201 76 -150 155 160 -38 -133 199 230 31 52 -73 18 -238 -58 -167 -3 -43 135 -83 80 -187
4858 -187 86 -185 107 -153 112 -131 101 112 148 90 68 75 45 -103 -157 -133 107 70 -225 159 39 -169 30
4881 30 -261 211 182 45 9 -103 40 -196 -51 -31 15 -96 -6 -241 194 -64 -99 79 124 -48 -13 -45 -73 193
4905 193 -18 164 -126 -199 -68 -97 -77 32 -93 68 -316 -13 97 -50 131 -108 -40 -11 -119 91 90 -170
4927 -170 22 -35 -96 -89 -42 -107 171 -203 -53 55 154 -98 23 94 66 -120 18 220 -4 -13 -261 134 20 33
4951 33 -5 97 -138 -160 154 -37 104 23 190 -9 -115 -100 88 -100 28 -230 -281 -96 -167 -82 125 -85 47
4974 47 -183 56 -32 -59 -102 7 26 -32 -25 -150 -60 27 155 140 -139 129 125 -245 178 24 -4 70 -97 -192 -137 74
5000 74 70 -182 162 162 106 161 19 51 116 126 214 -26 319 -138 47 56 -33 -67 -34 142 267 71 280 77 174 -155
5026 -155 81 -187 -59 -98 -43 45 -65 1 231 128 194 103 40 -199 -13 -15 128 -204 34 -123 -23 -45 376
5049 376 61 1 -92 -42 72 143 -302 8 53 206 328 108 148 104 312 7 33 -39 199 30 -40 29 -135 250
5073 250 -128 -323 19 -19 -181 -82 -310 -84 193 120 -21 142 163 111 82 132 -7 -207 14 220 88 169 -126
5096 -126 -98 -15 32 17 110 196 -133 -29 -44 91 84 -225 59 49 26 -65 0 -7 -180 -19 -108 -13 -56 -57 -156 31 -93
5123 -93 -11 60 -25 149 -183 -70 -405 160 -140 -139 -153 -93 63 51 -8 168 241 27 64 46 161 45 169 38
5147 38 77 -78 209 146 232 101 226 -90 -39 -2 -249 -407 -124 -119 -115 -277 5 -333 4 -39 -314 -22 69 -276
5171 -276 18 69 112 -118 -13 174 21 114 -126 133 -236 137 207 -143 275 67 250 119 -165 -131 -154 -148 -201
5194 -201 -78 -44 53 45 154 141 136 -114 123 65 173 -2 171 -188 91 -240 -378 -146 74 -83 -138 -274 -154
5217 -154 218 183 72 -200 -80 -219 143 31 122 -162 -107 161 176 -92 33 62 -79 321 45 -54 -63 33 124
5240 124 58 233 -158 -25 25 160 15 -11 31 -6 -87 -149 178 44 89 -95 -63 265 321 104 48 -74 22 -6
5264 -6 116 12 163 -110 57 -133 -202 318 149 162 -15 8 185 108 39 -137 16 197 97 -61 -76 -143 -42
5287 -42 -297 -105 10 141 -136 75 -82 43 -173 131 -61 64 -104 -101 5 -12 242 -72 37 -138 -187 -28
5309 -28 -151 -40 -338 210 62 172 64 62 28 -227 -25 -2 -201 -58 298 -25 199 -83 -10 -228 31 -83
5331 -83 38 -73 -233 -197 90 -17 -73 -42 104 9 132 -77 45 76 -41 229 136 227 -69 197 -36 -50 -159
5354 -159 -17 170 9 95 215 -146 199 189 29 -120 229 209 137 111 -29 -180 169 49 141 -51 217 270
5376 270 -62 -114 -35 -120 -342 43 -29 -8 130 150 120 -102 -219 -121 -80 427 69 68 226 73 -7 72 117 214 9
5401 9 -82 6 -107 123 -110 66 2 107 -241 107 -171 -78 81 -122 -89 -110 -125 189 -246 -45 114 115 145 230
5425 230 6 53 263 319 -219 -50 -74 -106 284 -182 151 129 34 -1 -32 219 343 239 -1 382 182 -43 57
5448 57 215 152 76 49 -82 14 -315 -221 61 7 -194 -136 92 5 -110 -121 -108 -14 -72 -119 -89 200 68 74 -28 -91
5474 -91 -71 106 -85 211 22 51 157 8 153 -7 127 -16 116 35 -9 86 89 -16 26 -70 -131 22 151 -81
5498 -81 98 161 -195 34 61 154 88 154 -66 -2 -34 71 -21 9 -114 -49 294 -301 -81 -247 -241 111 -63 -212
5522 -212 7 34 -9 -42 7 28 93 -163 157 75 78 162 83 108 182 -220 -276 99 51 -84 -275 -78 123 -69 52
5547 52 74 -17 -179 -170 229 -84 93 95 -119 -148 -24 -41 -151 7 -269 15 355 -4 149 -35 -207 -219 176
5570 176 20 -163 183 119 -98 26 160 37 231 245 202 97 -203 231 283 49 -72 -8 -57 40 -110 -73 -54
5593 -54 168 -142 -135 109 -63 -238 98 -169 -259 -228 -38 17 -95 -145 -244 131 187 170 105 -37 -66 123 -76 116
5617 116 -115 -105 -135 219 -105 -234 40 108 -37 34 132 -86 -207 24 -49 67 -180 -63 224 -26 5 207
5639 207 -126 115 -150 102 343 -65 -96 -155 3 76 2 -219 31 -254 -181 -2 -156 -409 147 41 73 24
5661 24 -126 189 39 49 162 196 211 -186 18 166 265 339 -17 -133 -67 127 -29 -29 -60 -63 -112 -29 -19 144 5
5686 5 -80 125 -1 -159 295 -14 -140 67 -25 -39 -185 264 -187 -65 172 277 27 -116 82 70 97 -164
5708 -164 -39 -48 10 131 151 -135 88 248 -20 34 51 -58 -117 -69 12 44 -28 -32 165 123 -22 25 100 218 -103
5733 -103 -203 -49 70 13 -96 -155 -211 163 -250 6 -89 322 -70 133 179 16 -6 147 49 -14 140 25 143
5756 143 169 -69 168 -2 51 -61 -211 -270 -238 25 -12 -42 -72 -47 135 -70 16 34 1 14 -110 57 -176 174
5780 174 -196 71 18 164 -57 126 -43 -16 -126 -14 -122 -143 39 85 -164 -18 15 101 42 -120 -121 -151 -91 80
5804 80 -41 -109 -29 48 -24 144 -35 -148 -60 51 -110 77 -63 -185 -2 -67 2 60 -62 118 -70 -78 85 -59
5828 -59 129 -14 -98 -30 189 53 99 196 25 -109 -176 -88 -45 -44 -54 34 -161 -201 4 -73 26 113 -55 -168 -41
5853 -41 142 312 91 -77 256 192 -295 283 -130 -137 66 -18 109 -163 -22 42 -8 -56 -84 -83 -25 -13 -100 -272 74
5878 74 -53 109 -142 -19 68 180 16 164 40 -5 71 116 64 -37 63 -95 6 -60 -231 46 -71 166
5900 166 -25 166 -41 -139 -77 -134 -213 -55 68 -16 -153 -128 48 -50 -53 -119 -88 -68 -121 151 181 137 52 -143 -144 -63
5926 -63 -39 128 -31 -83 -54 204 -109 219 -135 -196 -166 -40 105 -152 57 51 -200 17 -54 70 188 159 -50
5949 -50 -74 -57 -245 -86 -185 -124 -15 -298 78 121 -145 279 -158 -47 211 -27 23 -51 146 1 6 -51 -141 -132 -52
5974 -52 45 -177 -51 -302 -61 -195 175 -27 18 -81 113 -52 -165 172 7 -14 -61 -21 -128 258 76 -30
5996 -30 -8 61 -106 185 293 -87 94 108 3 -246 22 61 -98 58 -99 56 -129 58 194 -67 125 -129
6018 -129 139 94 204 99 191 56 -86 -90 257 238 -355 -40 -39 32 -33 -51 31 87 -128 156 -382 -17 178 17
6042 17 201 11 -117 -3 233 145 -16 117 157 -176 -4 114 -6 -15 4 99 142 37 -58 114 -52 2 -160
6065 -160 -274 -131 -224 34 3 -110 112 -64 61 -32 233 257 -207 -54 -307 13 -60 362 -111 95 25 229
6087 229 -67 30 0 95 -276 -18 32 -96 27 -53 131 -20 149 86 239 -305 262 -60 -73 -86 -108 64 4
6110 4 3 -55 68 -46 -154 81 18 164 -167 -47 191 144 -39 193 -26 -125 87 104 46 -89 308 126 0
6133 0 258 249 109 -19 209 24 243 113 -169 -228 -74 64 -86 -8 8 118 149 192 -1 147 -177 -35 80
6156 80 -87 61 -11 -31 121 -57 109 344 -68 -295 156 146 68 -127 149 59 128 103 155 -100 210 83 -8
6179 -8 -15 315 -110 -210 113 246 114 215 20 -132 113 104 45 81 -22 172 -101 -30 -70 -199 17 -79 44 2
6203 2 -106 -98 230 -69 -35 166 -101 -33 98 -49 287 -2 -174 107 141 52 93 -124 104 19 -106 13 0 72
6227 72 -131 -217 86 198 56 37 198 -90 78 -89 -119 132 76 124 96 -89 109 -23 -44 -130 -132 -77 -11 -129
6251 -129 17 49 -278 -226 -170 -80 85 241 127 112 -57 89 -34 -66 -2 -177 209 -24 325 84 -73 187
6273 187 -17 -84 -100 78 -95 1 53 -150 -83 -7 34 160 108 -162 21 135 -141 50 -16 -96 -49 -149 161 80
6297 80 254 74 -92 72 104 -120 182 -93 -74 -69 215 -22 3 -23 175 -62 -211 40 -138 175 34 37 -8
6320 -8 -126 -16 -198 -165 -274 128 -170 206 -5 -20 29 26 -58 303 -297 -166 -118 80 27 -193 175 -86 -1 389
6344 389 179 33 -69 222 28 -11 108 105 -152 -33 -148 -284 1 -267 121 138 32 -200 177 145 56 60 -159
6367 -159 3 37 -19 -223 -8 -75 197 46 89 -97 -108 -11 -42 244 163 101 -241 373 -132 -241 232 -69 24
6390 24 -147 78 41 -258 128 -159 -6 178 -179 -206 -104 147 -14 -43 -40 87 86 -38 138 301 -113 -95 -14
6413 -14 -121 -142 127 -53 -66 -29 -123 -193 408 157 38 -199 158 -71 28 -11 -18 144 46 -93 58 100 -163 65
6437 65 181 11 -32 359 71 140 -98 33 -40 293 -81 123 -24 239 3 102 -216 126 136 146 39 42 -141
6460 -141 127 -41 -201 -2 47 46 111 5 100 -115 354 -56 12 151 -3 -189 -74 -17 -94 -57 3 63 -40 85
6484 85 5 14 45 -17 -163 -41 150 27 -1 182 -251 4 -80 -24 16 39 128 -112 226 -6 233 61 6 4 60
6509 60 143 -26 212 23 82 144 11 287 22 -88 -126 46 -99 126 29 -34 -326 -121 182 -126 113 138 -132
6532 -132 77 117 -225 29 -63 65 134 -215 22 -106 -85 98 -26 -106 10 52 70 -32 28 -213 -114 -23 163
6555 163 -130 75 -57 -74 171 84 -13 5 38 146 23 -18 328 -248 126 43 154 187 -94 192 -166 27 48
6578 48 -96 231 -184 96 2 71 -180 -119 15 -17 -175 -138 115 -123 66 181 289 -20 -218 123 101 70 -94
6601 -94 144 154 -21 144 9 -24 77 160 127 -155 -111 -35 -194 -272 99 184 113 -35 69 209 289 -317 -40 67
6625 67 69 -5 76 -45 -11 18 26 97 69 358 8 49 13 90 1 96 -91 -56 -143 -151 163 -52 -139 -147 -124 278 181 28
6653 28 -31 -120 64 -82 -55 -215 59 -115 -127 -222 38 172 -77 75 127 -118 -130 -270 104 47 -59 -209 44
6676 44 -2 49 -201 137 -73 -129 -10 28 85 -54 -205 -41 -245 152 119 90 -97 -125 -195 5 -201 -36 4 -39
6700 -39 -133 -106 -224 44 114 -12 -54 -19 61 10 -82 9 -37 -85 137 282 17 85 139 59 -107 -185 53 35 -208 93
6726 93 -6 -115 -92 13 -35 38 201 -153 100 -31 -108 51 9 -7 -107 -183 -114 138 13 37 -42 -219 -129 -125 -356
6751 -356 90 -19 50 60 320 -161 124 152 101 -152 17 -88 -136 261 -81 -33 35 224 87 77 71 102 127 -102
6775 -102 211 -111 -275 203 -122 -186 -61 -57 -108 -81 -117 111 92 41 -9 -173 54 -354 -96 303 176 -109 66
6798 66 -243 -65 -94 -122 29 -30 -106 61 73 -133 75 -36 -135 -99 -57 92 29 -6 -101 166 290 -18 -152 173
6822 173 4 91 -180 -17 -40 -48 -42 85 185 23 160 51 25 -116 -40 -161 25 10 67 -4 169 67 69 -78
6846 -78 -122 -27 -91 16 -51 -51 119 112 -181 34 140 -9 -127 105 -7 50 1 -90 -258 -167 200 194 53 -65 -42
6871 -42 -32 110 2 106 -10 20 -64 -130 -166 -80 227 18 -188 11 -209 34 123 100 314 7 -24 105 -166
6894 -166 104 -95 -187 -137 -84 -213 -54 219 -207 -35 151 95 75 77 -15 -13 -190 -183 -148 69 -162 -80 156 -53 116
6919 116 32 -54 92 90 -124 -111 114 40 185 227 46 41 -270 48 77 -30 -54 -114 133 -49 82 20 31 122 126 -43
6945 -43 75 98 177 38 98 -48 -71 -101 11 -89 -54 -6 156 298 26 -85 180 -75 -97 170 89 -174 109
6968 109 211 -347 -103 11 217 -13 40 38 79 28 -250 72 20 241 116 52 293 80 -59 18 -78 31 -11
6991 -11 -19 151 -37 -93 -144 146 -72 -97 17 -25 -181 74 -286 -74 280 -41 -41 256 273 -12 -131 9 0 127
7015 127 25 -29 21 -110 141 -20 52 -18 -117 -103 67 -194 148 -45 -49 -65 -92 -81 -195 119 -5 -47 -91 96
7039 96 118 -35 -266 170 190 -56 -149 96 -259 -82 -224 21 -20 -82 127 -214 -193 213 -62 66 -102 -42 69
7062 69 165 -26 11 211 -132 252 112 249 -27 0 -120 100 17 18 -12 -31 -74 -112 -28 -53 45 16 -97 52 -215
7087 -215 332 -31 -26 128 172 52 -64 -218 125 -121 67 119 -32 185 -44 88 -21 -75 -157 -16 134 68
7109 68 -87 -53 20 48 243 157 10 197 -113 -146 103 45 10 133 -43 -15 182 242 10 -227 -96 -374 183
7132 183 -108 -7 12 6 47 0 128 100 20 -135 64 173 -73 43 97 158 104 32 56 50 95 125 35 30 11 164 -145
7159 -145 192 7 127 203 -153 -76 -82 -89 51 47 209 45 -19 59 65 66 -27 -205 222 16 -86 -30 58 148 375 -37
7185 -37 209 -75 -92 -124 -67 186 -197 207 -224 24 -153 154 -46 -267 -160 -114 92 33 33 114 155 -124 148
7208 148 65 316 -16 -77 83 -19 136 -44 136 -77 92 44 -17 240 -220 11 -164 70 -119 74 94 26
7230 26 -51 138 -155 157 -111 87 252 27 66 316 -41 -14 51 -104 42 -177 -193 7 -112 6 182 -78
7252 -78 17 -47 240 23 44 146 85 -57 23 18 326 194 -1 90 120 187 86 37 -7 27 158 -84 -19 160 -38
7277 -38 -74 95 -84 119 -61 18 36 -202 -153 -272 -110 -31 64 -70 67 129 81 -96 -152 189 -176 114 34 -19
7301 -19 43 2 8 115 -16 -92 -42 89 60 -17 -81 233 -11 -116 78 -432 23 38 285 -168 -260 -11 117 -134
7325 -134 -267 -105 -75 91 -38 245 39 136 67 -181 -3 175 -104 -66 0 -36 131 30 -38 9 -73 -121 7
7348 7 40 16 -168 -145 -152 -108 141 -254 -12 -50 -7 -107 -65 211 -11 -91 -126 22 -33 102 -33 4 163 163 240 24
7374 24 55 -72 236 -77 232 -12 -46 124 -113 -14 -22 19 -149 -124 61 -34 29 -151 150 59 -78 17 -257 35
7398 35 -10 71 -306 -73 -49 -13 -111 -46 -53 217 -263 -31 216 -81 -2 -145 -70 -79 176 -25 -130 199 76 -25
7422 -25 -93 7 -2 139 103 -133 -36 -45 -101 115 24 38 84 32 -44 10 110 -97 104 -12 -56 187 129 175 -205 281
7448 281 -74 -19 138 102 65 -26 30 -127 46 285 -121 89 -225 86 -11 -102 41 -145 -133 -91 -358 119 -166
7471 -166 47 -72 0 -77 37 -114 -126 -202 1 -30 -440 88 -24 140 245 71 -18 88 111 -42 -29 -48 -180
7494 -180 57 176 72 -167 123 -7 -34 -188 132 -226 2 329 105 -51 20 -100 -115 -222 279 -181 -110
7515 -110 63 132 -87 80 -30 22 10 75 13 -156 -223 46 -139 258 7 -99 -40 -345 -45 160 -112 7
7537 7 136 -53 75 119 -5 -330 116 -169 176 200 -291 83 39 120 12 -247 40 96 -122 307 -143 -73 6
7560 6 -130 -57 -26 -156 220 -305 -46 120 120 90 304 -53 -111 -133 -38 -127 -45 116 -57 -82 198 159 -50 75 -210
7585 -210 -224 -6 157 -66 -11 -218 -129 123 -40 -131 18 92 126 -19 -94 -74 87 149 27 152 119 26 -23 81
7609 81 -103 0 69 49 200 119 -36 -151 139 -244 164 202 104 124 218 -187 80 -58 -68 -111 -74 142 -13 -228
7633 -228 -78 375 90 -133 -276 28 189 -154 320 188 51 -20 -118 -147 78 213 -74 6 255 -159 144
7654 144 59 -24 -76 16 108 -84 228 -16 -79 -206 -90 147 -251 103 -2 -132 -21 149 19 -334 -101 -22
7676 -22 -103 239 -72 -216 -217 -162 -87 -264 64 129 260 -174 14 -287 212 267 266 -10 -179 -25 73 96 161 -193
7700 -193 8 16 -104 37 99 -15 -204 79 46 1 58 -31 -11 47 -105 -119 264 106 -83 152 -213 -73 80
7723 80 305 9 43 49 -70 98 11 113 -139 -85 -143 22 62 -23 -37 51 -21 -114 -101 -41 48 3 -193 -48 1 60
7749 60 38 -142 -20 25 5 37 85 195 367 -236 265 66 -136 -176 -167 -50 67 -56 152 -155 9 303 41
7772 41 95 81 -203 -262 -28 97 38 -97 97 -16 -90 -175 128 -110 38 190 -44 -141 -180 86 -74 -99 197
7795 197 -33 -324 287 -28 -119 278 -79 67 119 25 39 -242 22 76 19 12 192 0 -15 5 11 14 40 -4 200
7820 200 91 -26 148 -315 132 -10 116 -99 -83 158 -113 -54 38 1 -111 11 -157 -30 30 42 -118 -70
7842 -70 -28 -52 -290 -23 196 87 -158 -111 -13 -53 92 -91 -67 -17 -94 14 15 138 38 36 346 122 67 -47 187
7867 187 134 113 -113 -143 102 28 -92 1 -274 -64 -257 235 -1 85 41 -396 77 -33 132 10 -31 8 71
7890 71 42 198 -180 -82 -43 -106 -152 150 -7 76 31 286 34 5 118 -210 -138 -161 60 -6 -68 102 135 -99 149
7915 149 181 245 53 -241 122 -60 -251 120 43 -142 -123 117 -53 172 236 -55 -1 6 -113 -118 -66 -55 -161 -425
7939 -425 159 -3 30 150 -217 168 129 -111 -54 -20 -53 102 133 -93 -81 72 -43 131 -96 25 -77 160
7961 160 -260 154 47 156 94 166 283 49 117 83 224 11 3 124 -1 -11 228 178 -94 31 -177 -110 -40
7984 -40 -87 -253 -116 -53 21 -14 109 148 -131 -87 -153 124 -15 100 106 3 58 -17 97 79 -175 75 122 -2 179
8009 179 -32 -32 -180 142 -112 -101 -26 99 54 -240 -297 -12 -82 -73 128 200 160 -200 -45 62 54 -246 121 -86
8033 -86 -118 32 106 -195 93 25 -221 89 -195 -30 62 133 -87 112 -89 133 -193 218 96 -69 -89 104
8055 104 139 127 -113 188 -25 34 -37 76 -4 99 -89 186 -19 -71 37 95 -122 23 -22 -36 187 -77 310
8078 310 -65 89 -168 90 168 -60 23 112 135 105 46 115 48 77 49 -205 -252 29 -242 -9 -271 -88 25 69
8102 69 6 116 85 112 -8 -56 34 -83 52 -150 16 30 68 -20 -206 -89 -34 -110 103 -64 145 -243 249 39
8126 39 234 44 87 -8 203 -85 85 154 86 2 -98 131 273 -52 -41 6 345 -110 -20 251 47 -104 91
8149 91 85 -131 123 2 -220 101 73 156 20 28 118 -183 -100 -103 80 -189 1 -13 229 108 203 201 37 116 109 -97
8175 -97 38 -73 -157 128 117 8 243 112 69 241 -136 111 61 190 -17 -91
8191i1
##END NTUPLES=NMR FID
##END=
