##TITLE=1H_SR120_k
 DMSO
 8 sc, 
 30.05.2022
##JCAMPDX= 6.0         $$ Bruker NMR JCAMP-DX V2.0
##DATA TYPE= NMR FID
##DATA CLASS= NTUPLES
##ORIGIN= UXNMR, Bruker Analytische Messtechnik GmbH
##OWNER= root
$$ XWIN-NMR		Version 3.5
$$ Mon May 30 13:53:17 2022 Russian Standard Time (UT+4h)  she@DPX200
##.OBSERVE FREQUENCY= 200.1313499996
##.OBSERVE NUCLEUS= ^1H
##.DELAY= (6, 6)
##.ACQUISITION MODE= SIMULTANEOUS
##.ACQUISITION SCHEME= undefined
##.AVERAGES= 8
##.DIGITISER RES= 18
##SPECTROMETER/DATA SYSTEM= spect
##.PULSE SEQUENCE= zg30
##.SOLVENT NAME= CDCl3
##.SHIFT REFERENCE= (INTERNAL, CDCl3, 0, 15.7039)
##AUDIT TRAIL= $$ (NUMBER, WHEN, WHO, WHERE, WHAT)
$$ ##TITLE= Audit trail, XWIN-NMR		Version 3.5
$$ ##JCAMPDX= 5.01
$$ ##ORIGIN= Bruker BioSpin GmbH
$$ ##OWNER= she
$$ F:/spectra/data/she/nmr/H-F/1/audita.txt
$$ ##AUDIT TRAIL=  $$ (NUMBER, WHEN, WHO, WHERE, WHAT)
(   1,<2022-05-30 13:51:58.48 +0400>,<she>,<DPX200>,
      <created by zg, POWCHK disabled, PULCHK disabled
       configuration hash MD5:
       00 E9 B6 7A A2 85 ED C7 34 08 36 98 17 FE 4E 26
       data hash MD5: 16K
       9B 81 14 02 33 AC C1 47 C3 15 A7 0A 43 3F D2 A3>)
$$ ##END=
$$ 
$$ hash MD5
$$ 07 C3 A8 2D 5B 20 4E 06 09 C8 C6 48 9D 2C 59 72
##$RELAX= 
##$RELAX= 
##$RELAX= 
##$RELAX= 
##$RELAX= 
##$RELAX= 
$$ Bruker specific parameters
$$ --------------------------
##$DU= <F:/spectra>
##$EXPNO= 1
##$NAME= <H-F>
##$PROCNO= 1
##$TYPE= <nmr>
##$USER= <she>
##$AMP= (0..31)
100 100 100 100 100 100 100 100 100 100 100 100 100 100 100 100 100 100 
100 100 100 100 100 100 100 100 100 100 100 100 100 100 
##$AQSEQ= 0
##$AQ_mod= 1
##$AUNM= <au_zg>
##$AUTOPOS= <>
##$BF1= 200.13
##$BF2= 200.13
##$BF3= 200.13
##$BF4= 200.13
##$BF5= 200.13
##$BF6= 200.13
##$BF7= 200.13
##$BF8= 200.13
##$BYTORDA= 1
##$CFDGTYP= 0
##$CFRGTYP= 5
##$CHEMSTR= <none>
##$CNST= (0..31)
1 1 145 1 1 1 1 1 1 1 1 1 1 1 1 1 1 1 1 1 1 1 1 1 1 1 1 1 1 1 1 1 
##$CPDPRG= <>
##$CPDPRG1= <>
##$CPDPRG2= <>
##$CPDPRG3= <>
##$CPDPRG4= <mlev>
##$CPDPRG5= <mlev>
##$CPDPRG6= <mlev>
##$CPDPRG7= <mlev>
##$CPDPRG8= <mlev>
##$CPDPRGB= <>
##$CPDPRGT= <>
##$D= (0..31)
0 1.2 0 0 0 0 0 0 0 0.06 0 0.03 0 0 0 0 0.0002 0 0 0 0 0 0 0 0 0 0 0 0 
0 0 0 
##$DATE= 1653904317
##$DBL= (0..7)
120 120 120 120 120 120 120 120 
##$DBP= (0..7)
150 150 150 150 150 150 150 150 
##$DBP07= 0
##$DBPNAM0= <>
##$DBPNAM1= <>
##$DBPNAM2= <>
##$DBPNAM3= <>
##$DBPNAM4= <>
##$DBPNAM5= <>
##$DBPNAM6= <>
##$DBPNAM7= <>
##$DBPOAL= (0..7)
0.5 0.5 0.5 0.5 0.5 0.5 0.5 0.5 
##$DBPOFFS= (0..7)
0 0 0 0 0 0 0 0 
##$DE= 6
##$DECBNUC= <off>
##$DECIM= 32
##$DECNUC= <off>
##$DECSTAT= 4
##$DIGMOD= 1
##$DIGTYP= 9
##$DL= (0..7)
0 120 120 120 120 120 120 120 
##$DP= (0..7)
150 150 150 150 150 150 150 150 
##$DP07= 0
##$DPNAME0= <>
##$DPNAME1= <>
##$DPNAME2= <>
##$DPNAME3= <>
##$DPNAME4= <>
##$DPNAME5= <>
##$DPNAME6= <>
##$DPNAME7= <>
##$DPOAL= (0..7)
0.5 0.5 0.5 0.5 0.5 0.5 0.5 0.5 
##$DPOFFS= (0..7)
0 0 0 0 0 0 0 0 
##$DQDMODE= 0
##$DR= 18
##$DS= 0
##$DSLIST= <SSSSSSSSSSSSSSS>
$$ [...]
##$SUBNAM2= <"">
##$SUBNAM3= <"">
##$SUBNAM4= <"">
##$SUBNAM5= <"">
##$SUBNAM6= <"">
##$SUBNAM7= <"">
##$SUBNAM8= <"">
##$SUBNAM9= <"">
##$SW= 18.0517283424761
##$SWIBOX= (0..15)
0 0 2 0 0 0 0 0 0 0 0 0 0 0 0 0 
##$SW_h= 3612.71676300578
##$TD= 16384
##$TD0= 1
##$TE= 0
##$TE2= 300
##$TE3= 300
##$TEG= 300
##$TL= (0..7)
0 120 120 120 120 120 120 120 
##$TP= (0..7)
150 150 150 150 150 150 150 150 
##$TP07= 0
##$TPNAME0= <>
##$TPNAME1= <>
##$TPNAME2= <>
##$TPNAME3= <>
##$TPNAME4= <>
##$TPNAME5= <>
##$TPNAME6= <>
##$TPNAME7= <>
##$TPOAL= (0..7)
0.5 0.5 0.5 0.5 0.5 0.5 0.5 0.5 
##$TPOFFS= (0..7)
0 0 0 0 0 0 0 0 
##$TUNHIN= 0
##$TUNHOUT= 0
##$TUNXOUT= 0
##$USERA1= <user>
##$USERA2= <user>
##$USERA3= <user>
##$USERA4= <user>
##$USERA5= <user>
##$V9= 5
##$VALIST= <valist>
##$VCLIST= <CCCCCCCCCCCCCCC>
##$VD= 0
##$VDLIST= <DDDDDDDDDDDDDDD>
##$VPLIST= <PPPPPPPPPPPPPPP>
##$VTLIST= <TTTTTTTTTTTTTTT>
##$WBST= 1024
##$WBSW= 4
##$XGAIN= (0..3)
0 0 0 0 
##$XL= 0
##$YL= 0
##$YMAX_a= 119377
##$YMIN_a= -173466
##$ZGOPTNS= <>
##$ZL1= 120
##$ZL2= 120
##$ZL3= 120
##$ZL4= 120
##$ABSF1= 10
##$ABSF2= 0
##$ABSG= 5
##$ABSL= 3
##$ALPHA= 0
##$AQORDER= 0
##$ASSFAC= 0
##$ASSFACI= 0
##$ASSFACX= 0
##$ASSWID= 0
##$AUNMP= <proc_1d>
##$AZFE= 0.1
##$AZFW= 0.1
##$BCFW= 1
##$BC_mod= 2
##$BYTORDP= 1
##$COROFFS= 0
##$CY= 11.3945322036743
##$DATMOD= 1
##$DC= 2
##$DFILT= <>
##$DTYPP= 0
##$F1P= 2.36226072786647
##$F2P= -0.459571619588291
##$FCOR= 0.5
##$FTSIZE= 0
##$FT_mod= 4
##$GAMMA= 1
##$GB= 0.15
##$INTBC= 1
##$INTSCL= 1
##$ISEN= 128
##$LB= 0.24
##$LEV0= 0
##$LPBIN= 0
##$MAXI= 10000
##$MC2= 0
##$MEAN= 0
##$ME_mod= 0
##$MI= 1.114404
##$NCOEF= 0
##$NC_proc= 0
##$NLEV= 6
##$NOISF1= 3.799351
##$NOISF2= 2.8
##$NSP= 1
##$NTH_PI= 0
##$NZP= 0
##$OFFSET= 15.70392
##$PC= 1
##$PHC0= -18028.05
##$PHC1= 8.20074
##$PH_mod= 1
##$PKNL= yes
##$PPARMOD= 0
##$PSCAL= 0
##$PSIGN= 0
##$REVERSE= no
##$SF= 200.130013532006
##$SI= 16384
##$SIGF1= 3
##$SIGF2= 2
##$SINO= 400
##$SIOLD= 16384
##$SREGLST= <1H.CDCl3>
##$SSB= 0
##$STSI= 0
##$STSR= 0
##$SW_p= 3612.71676300578
##$SYMM= 0
##$S_DEV= 0
##$TDeff= 0
##$TDoff= 0
##$TI= <>
##$TILT= no
##$TM1= 0
##$TM2= 0
##$TOPLEV= 0
##$USERP1= <user>
##$USERP2= <user>
##$USERP3= <user>
##$USERP4= <user>
##$USERP5= <user>
##$WDW= 1
##$XDIM= 8192
##$YMAX_p= 0
##$YMIN_p= 0
$$ End of Bruker specific parameters
$$ ---------------------------------
##NTUPLES= NMR FID
##VAR_NAME=  TIME,          FID/REAL,        FID/IMAG
##SYMBOL=    X,             R,               I
##VAR_TYPE=  INDEPENDENT,   DEPENDENT,       DEPENDENT
##VAR_FORM=  AFFN,          ASDF,            ASDF
##VAR_DIM=   8192,          8192,            8192
##UNITS=     SECONDS,       ARBITRARY UNITS, ARBITRARY UNITS
##FACTOR=    0.0002768,     1,               1
##FIRST=     0,             0,               0
##LAST=      2.2672688,     0,               0
##MIN=       0,             -173466,         0
##MAX=       2.2672688,     119377,          0
$$ Real data points
##PAGE= N=1
##DATA TABLE= (X++(R..R)), XYDATA
$$ [...]
$$ plain form
1787 66 34 -395 57 691 -275 -627 77 337 -516 -1123 -237 361 -275 -489 192 889 134 -619 115 908 -66
1808 -66 -635 200 822 482 -249 32 884 56 -575 -383 31 -356 -600 -181 -31 43 35 -80 624 97 -114
1829 -114 280 -14 -131 -130 407 478 -241 344 665 11 -440 -142 271 -300 -910 -89 768 180 -637 -5 761
1850 761 -190 -974 -391 668 -120 -696 -33 729 692 -192 -102 700 412 -667 -257 166 374 -311 81 445
1870 445 204 -284 -155 6 -379 -460 -401 -213 -349 -7 538 220 -238 179 424 120 -522 -255 900 92
1890 92 -508 -19 862 557 -407 -611 473 46 -753 -378 413 93 -732 -135 774 506 -314 -491 271 138
1910 138 -395 -529 512 597 244 173 386 353 -363 -167 -255 -69 -283 -45 109 -136 -46 452 -28 -504 -240
1931 -240 73 -414 -655 -175 591 100 -334 44 563 543 -413 -434 609 493 -334 -415 740 535 -163 -307
$$ packed form
1787F6l2m29M52O34r66l52P04K60q53o07Q86N98o36k14O81O97p55p53P34P93r74
1808f6n69Q35O22l40p31K81Q52q28o31J92M14l87k44M19J50P4qj15P04n27k11
1829a14L94k94j17JN37P1p19N85L21o54m51K98M13n71o10Q21Q57n88q17O32P66
1850G61r51p84N83J059p88n76O63P62l7q84R0Q02k88j079M10M23K08o85L92L64
1870D45k41m88J29J61l85q1N9J88j36L42N45l18m58M17K45l04o42K67J155q08
1890I2o00M89Q81l05r64k04J084m27p99L75P91l20q25N97R09k68q20j77P62j33
1910A38n33j34J041Q5l53p1K13l3p16J96q8J86k14K38J54k45R0M98m80m76K64
1931b40L13m87k41M80P66m91m34L78N19k0r56k1J043j16q27q1J155k05o98j44
$$ plain form
1951 -307 451 190 -799 -913 119 175 -531 -464 85 417 -118 -220 170 178 -148 -133 115 2 200 203 276 17
1973 17 100 21 -110 -194 -274 173 -260 -328 144 212 398 -480 -558 55 159 -505 -733 133 389 -334 -241 573 839
1996 839 -150 -425 165 433 -296 -670 324 224 39 -314 374 420 27 -636 -186 -114 -382 -286 109 183 28
2017 28 283 382 273 -231 -127 240 -194 -43 380 457 -66 -70 224 619 -367 -367 5 223 -514 -761 362 395
2039 395 -245 -402 399 621 -241 -468 2 267 -226 -304 492 541 401 -254 -34 455 -175 -706 -120 171 -335
2060 -335 -44 4 293 7 -86 187 -52 -392 -219 138 126 -251 118 628 128 30 282 444 -410 -439 157 366
2082 366 -359 -192 305 799 -226 -457 92 182 -255 -770 -428 283 -83 -390 271 530 41 -396 135 287
2102 287 -74 -214 190 400 230 -140 443 300 -100 -125 254 -97 -416 -197 -89 -45 -168 108 290 -48 -406
$$ packed form
1951c07P58k61r89j14J032N6p06O7N49L32n35j02L90Ql26J5K48j13J98LP3k59
1973A7Q3p9j31q4q0M47m33o8M72O8J86q78p8O13J04o64k28Q66K56p23R3Q14K66
1996H39r89k75N90K68p29l74R94j00j85l53O88M6l93o63M50P2k68R6L95P4j55
2017B8K55R9j09n04J04L67m34J51M23P7n23mK94L95r86%L72K18p37k47J123L3
2039C95o40j57Q01K22q62k27M70K65m93p8P96M9j40o55K20M89o30n31N86K91n06
2060c35K91M8K89k86r3K73k39l40J73L57j2l77L69N10n00r8K52J62q54k9N96K09
2082C66p25J67M97M94j025k31N49R0m37n15L42P11l66l07O61K59m89m37N31J52
2102B87l61j40M04K10j70l70N83j43m00k5L79l51l19K19J08M4j23K76J82l38l58
$$ plain form
2123 -406 -18 242 90 -407 211 381 118 -111 140 522 -30 -444 -62 200 -364 -732 263 611 200 -412
2143 -412 240 528 174 -695 -251 323 -111 -292 170 460 166 -56 186 274 -255 -311 191 385 74 -179 9
2164 9 427 121 -62 174 -52 -244 -256 32 -235 -346 78 533 339 61 226 502 -80 -93 -178 472 152 -301
2186 -301 131 562 199 -322 91 276 33 -727 18 270 62 -118 -52 520 -54 -423 -474 272 -96 -388 -272
2207 -272 235 296 -204 95 184 125 -14 -61 -70 -395 -178 116 182 -203 -5 303 169 -171 -355 212 -86 -460
2229 -460 -134 279 71 -24 -141 463 136 -289 -113 246 205 -202 -27 634 221 -216 18 232 -37 -568 -33
2250 -33 185 -109 -393 125 472 23 -123 -147 36 -123 -359 -156 -66 99 -7 318 169 85 134 113 65 -318
2272 -318 -259 106 45 -378 -173 401 279 -476 -272 32 183 -361 -394 200 123 -226 -17 306 349 -23 -2 245
$$ packed form
2123d06L88K60j52m97O18J70k63k29K51L82n52m14L82K62n64l68R95L48m11o12
2143d12O52K88l54q69M44N74m34j81M62K90k94k22K42Q8n29n6N02J94l11k53J88
2164IM18l06j83K36k26j92j2K88k67j11M24M55j94k78J65K76n82j3q5O50l20m53
2186c01M32M31l63n21M13J85k43p60P45K52k08j80O6N72n74l69n1P46l68k92J16
2207b72N07O1n00K99Q9n9j39m7rl25K17K94O6l85J98L08j34l40j84N67k98l74
2229d60L26M13k08r5j17O04l27m25J76L59m1m07J75O61m13m37K34K14k69n31N35
2250c3K18k94k84N18L47m49j46k4J83j59k36K03R0J65j06L25j49q4M9k1m8l83
2272c18N9L65o1m23K05N74j22p55K04L04J51n44l3N94p7l49K09L23M3l72K1K47
$$ plain form
2294 245 106 -287 -255 220 251 6 87 374 27 -197 -155 -153 31 -166 16 95 -1 43 285 21 -323 -164 296
2317 296 107 -241 81 259 373 405 80 377 259 -196 -289 12 53 -354 -260 82 241 -114 -265 41 161
2338 161 -413 -252 48 210 -137 -190 281 553 -38 -37 45 89 -214 -130 -19 -102 -22 13 332 18 -136 127 -34
2361 -34 -76 -389 93 97 51 -113 260 430 54 -239 154 151 -139 -194 10 323 -253 -279 233 273 -146 -255 124
2384 124 -126 -195 -299 16 206 -146 -60 200 298 299 -177 243 -22 -237 32 215 128 107 64 264 -48 103 -183
2407 -183 -84 174 -345 47 86 -153 -195 90 399 -201 -160 -28 86 -49 -479 178 293 58 24 169 190 82
2429 82 -515 167 219 -124 -130 -1 189 -52 -294 13 30 -119 -191 -99 -39 -361 172 292 -81 21 -127 144 119
2452 119 -70 -113 224 -42 -20 215 55 12 6 -55 9 106 -652 -84 120 3 -224 140 476 92 -247 80 273
$$ packed form
2294B45j39l93L2M75L1k45Q1K87l47k24M2KJ84j97J82P9r6M4K42k64l44J59M60
2317B96j89l48L22J78J14L2l25K97j18m55r3L01M1m07R4L42J59l55j51L06J20
2338A61n74J61L00J62l47n3M71K72n91JQ2M4l03Q4J11q3Q0L5L19l14j54K63j61
2361c4m2l13M82Mm6j64L73J70l76k93L93lk90n5K04L13n76k6N12M0m19j09L79
2384A24k50o9j04L15J90l52Q6K60R8Jm76M20k65k15K69J83q7k1m3K00l12J51k86
2407a83R9K58n19L92L9k39m2K85L09o00M1J32J14j35m30O57J15k35l4J45K1j08
2429H2n97O82N2l43oJ29J90k41k42L07J7j49p2R2O0l22N33J20l73J02j48K71k5
2452A19j89m3L37k66K2K35j60m3oo1O4R7p58N68K04j17k27L64L36l84l39L27J93
$$ plain form
2475 273 63 -245 -420 300 210 -317 203 459 2 -26 -57 226 -283 -42 -229 282 -207 -7 180 79 51
2496 51 -114 119 -162 -209 -231 -6 -142 15 97 272 29 54 -195 512 8 -234 -232 219 158 -36 0 193 208
2519 208 -411 -232 -17 -78 -295 65 266 146 -78 -301 173 -109 -3 -117 349 -21 -207 55 66 -37 -146
2540 -146 -39 30 -209 -45 -40 -116 -204 -269 99 241 87 -79 348 168 -10 -177 152 -17 -181 59 116 187 68
2563 68 -60 -4 -127 -5 -45 45 109 -129 90 39 -245 -72 -118 -5 -214 45 45 65 73 -74 -1 245 -175 -93 13
2588 13 -30 -156 -108 -10 -22 -351 -69 -19 102 -185 82 -30 78 -268 -36 -45 298 102 -226 54 137 -123 -165
2611 -165 200 129 -106 -185 217 305 97 -103 161 134 84 -44 -27 -23 -39 138 222 -3 -230 68 163 -136 -249 -46
2635 -46 130 -91 -122 -85 254 93 -17 -106 350 265 -535 -61 207 317 -159 92 -117 -28 -239 -33 385 -121
$$ packed form
2475B73k10l08j75P20r0n27N20K56m57k8l1K83n09K41j87N11m89K00J87j01k8
2496E1j65K33k81m7k2K25j36J57Q2J75k43K5k49P07n04k42KM51o1j94L6J93J5
2519B08o19J79K15o1k17L60K01j20k24k23M74k82J06j14M66l70j86K62J1j03j09
2540a46J07O9k39J64Np6q8o5L68J42j54j66M27j80j78j67L29j69j64K40N7P1j19
2563F8j28N6j23J22m0R0O4k38K19n1k84J73m6J13k09K59%K0Qj47P3K46m20Q2J06
2588A3m3j26M8R8j2l29K82N0J21k87K67j12J08l46K32rL43j96l28K80Q3k60m2
2611a65L65p1k35p9M02Q8k08k00K64k7n0j28J7Mj6J77Q4k25k27K98R5k99j13K03
2635d6J76k21l1L7L39j61j10q9M56q5q00M74K68J10m76K51k09Q9k11K06M18n06
$$ plain form
2657 -121 -70 37 -6 91 -81 -3 83 -61 -260 231 95 -355 2 -16 44 20 154 140 169 -134 -229 68 58 -194
2681 -194 -243 -78 -47 -367 128 13 -160 -107 -62 75 -32 -151 -46 272 147 -158 44 -46 134 -133 -28 175
2703 175 -187 -229 143 276 19 -1 -92 215 -28 -258 -39 -131 -170 141 220 209 -83 -142 -162 384 60 -124 282
2726 282 220 -133 -81 119 43 -131 262 39 237 -249 -254 -73 105 84 25 -2 82 132 -266 147 -134 -39 -98 -245
2750 -245 37 32 237 225 -38 8 -130 -30 0 -17 42 11 51 -109 206 176 -52 1 76 142 -196 -100 257 316 -323
2775 -323 22 199 127 -118 -160 18 -272 130 -38 -33 99 -59 -199 120 -45 -185 -236 -109 -34 -110 46 -92
2797 -92 -19 -30 144 72 87 -76 33 -20 -191 14 197 369 207 -63 301 280 114 -137 -112 164 -8 -165 -22
2820 -22 -171 -45 -138 -129 61 -200 34 117 -124 -58 -132 76 284 -25 -37 86 105 130 41 253 197 342 141 232
$$ packed form
2657a21N1J07m3R7j72P8Q6j44j99M91j36m50L57j8O0k4J34j4K9l03r5K97j0k52
2681a94m9J65L1l20M95j15j73N3M5J37j07j19J05L18j25l05K02r0J80k67J05K03
2703A75l62m2L72J33k57k0r1L07k43k30K19r2l9L11P9j1k92n9k0N46l24j84M06
2726B82o2l53N2K00p6j74L93k23J98m86nJ81J78k1n9k7Q4N0l98M13k81R5n9j47
2750b45K82nK05j2k63M6j38J00L0j7N9l1M0j60L15l0k28N3P5O6l38R6L57N9o39
2775c23L45J77p2k45m2J78k90M02j68NJ32j58j40L19j65j40n1J27P5p6J56j38
2797i2P3j1J74p2J5j63J09n3j71K05J83J72j62k70L64k1j66k51K5K76j72j57J43
2820b2j49J26r3RJ90k61K34Q3k41O6p4K08K08l09j2J23J9K5q9K12n6J45k01R1
$$ plain form
2844 232 79 -266 -73 46 -52 -442 -22 65 311 -366 -193 97 59 39 190 255 124 7 -48 55 79 259
2866 259 -48 63 -42 61 319 110 -41 147 -236 17 201 36 228 197 -151 33 -42 53 -60 31 -16 276
2888 276 -11 68 218 -41 -238 -36 36 13 -233 179 284 161 -237 -64 43 -41 55 -195 197 -61 -104 129
2910 129 243 41 -84 93 332 65 -159 -133 143 -204 -92 125 141 219 -164 114 23 -118 -155 133 -166 12
2932 12 53 -9 154 127 -52 -68 208 40 18 94 42 -119 -85 61 244 -148 36 122 212 -96 -75 -26 145 -258
2956 -258 79 -31 188 40 -215 -44 71 76 -216 0 3 83 -38 182 -9 3 206 -229 -82 -51 26 171 -193
2979 -193 -44 -196 380 -77 -431 5 211 -52 -64 115 -40 -222 -183 97 136 190 39 -124 -73 -79 -142 139 150
3002 150 174 72 103 -245 116 -143 184 250 20 90 68 -75 123 -93 27 -85 -35 -51 -45 324 -187 -85 61
$$ packed form
2844B32j53l45J93J19r8l90M20Q7K46o77J73K90l8k0J51O5j31j17n5J03K4J80
2866B59l07J11j05J03K58k09j51J88l83K53J84j65J92l1l48J84p5R5j13R1m7K92
2888B76k87P9J50k59j97K02P2k3k46M12J05j23l98J73J07q4R6k50L92k58m3K33
2910A29J14k02j25J77K39k67k24K6K76l47J12K17J6P8l83K78r1j41l7K88k99J78
2932A2M1o2J63k7j79j6K76j68k2P6n2j61L4J46J83l92J84Q6R0l08K1M9J71m03
2956b58L37j10K19j48k55J71J15Nk92K16LQ0j21K20j91J2K03m35J47L1P7J45l64
2979a93J49j52N76m57l54M36K06k63j2J79j55j82L9K80L9N4j51j63N1oo3K81J1
3002A50K4j02L1l48L61k59L27O6k30P0k2j43J98k16J20j12N0j6OL69n11J02J46
$$ plain form
3025 61 -55 -217 -29 -37 -128 -74 88 -312 50 18 104 294 171 25 -25 -65 229 56 103 -55 -70 -142 311 16
3049 16 -199 -195 -37 37 19 -300 -207 141 -96 160 -53 106 -19 58 -150 57 -67 28 367 28 -332 136 107
3072 107 132 25 -171 47 224 -124 111 165 -49 15 178 380 67 -55 -61 208 -326 80 -1 78 -273 -67
3094 -67 0 219 85 242 -190 67 -191 -263 12 117 104 -378 -18 -93 56 -59 -79 189 92 -7 -27 26 -117
3117 -117 -221 133 -106 -358 -103 1 296 -264 32 -58 -112 -269 -292 -182 131 -258 -71 22 -30 -8 -72 226
3139 226 -178 43 150 45 75 -43 233 -239 -55 -112 -115 -89 -243 46 -154 15 -36 -271 90 35 -30 -104 -52
3162 -52 275 -133 -25 200 20 -97 -107 37 10 -94 -11 -106 43 -61 -90 -126 8 -66 -46 -167 -126 -111 -18 -95
3186 -95 -139 65 -123 -51 -154 -173 -65 58 -122 -4 241 -3 60 -89 195 102 25 -106 68 82 104 22 264
$$ packed form
3025F1j16j62J88qr1N4J62m00L62l2Q6J90j23j46n0m0K94j73M7j58j5p2M53k95
3049A6k15MJ58P4j8l19R3L48k37K56k13J59j25P7k08K07j24R5L39l39l60M68k9
3072A07K5j07j96K18J77l48K35N4k14O4J63K02l13j22oK69n34M06q1P9l51K06
3094f7O7K19j34J57m32K57k58p2K75J05j3m82L60p5J49j15k0K68r7r9k0N3j43
3117a17j04L54k39k52K55J04K95n60K96r0n4j57k3J10L13l89J87R3n2K2o4K98
3139B26m04K21J07j05L0j18K76m72J84n7lK6j54K89k00J69n1k35L61n5o5p4N2
3162e2L27m08J08K25j80j17j0J44k7j04Q3r5J49j04k9l6J34p4K0j21M1J5R3p7
3186i5m4K04j88P2j03j9J08J23j80J18K45k44O3j49K84r3p7j31J74J4K2q2K42
$$ plain form
3209 264 227 -7 63 -380 -79 -43 -234 -136 -287 -1 -102 54 123 -72 187 257 147 40 141 106 -64 47
3231 47 105 -118 -166 37 -243 -8 -64 -125 -7 153 36 -214 -95 141 5 59 134 -21 -47 -222 -178 41 168
3254 168 -151 -40 28 35 114 102 53 46 12 12 138 -57 -148 92 -18 22 24 -259 297 204 -247 -43 53 -174 -45 166
3280 166 -70 -45 -141 1 195 -28 -140 -220 -62 -32 76 107 228 -183 -92 341 183 107 -89 89 -170 -40
3302 -40 -197 1 171 -214 18 22 67 -136 -247 218 -202 -39 366 212 -45 -171 -44 161 -164 -92 -187 -50
3324 -50 -91 -41 353 -65 -20 -56 114 -117 -110 -108 -148 213 -183 -94 90 62 -147 -272 31 -2 40 -59 87 -72 -227
3349 -227 -181 -14 58 50 26 -204 63 38 106 41 17 86 102 58 117 103 -64 153 5 116 -93 1 123 -32 -15
3374 -15 135 81 -113 -231 44 75 33 112 -17 42 -128 10 230 63 -198 125 -143 -161 -206 -47 -24 -55 114
$$ packed form
3209B64l7k34P0m43L01L6j91R8j51K86j01J56O9j95K59P0j10j07J01l5j70J11
3231D7N8k23m8K03k80K35n6o1J18J60j17k50J19K36j36N4P5j55k6j75M4K19J27
3254A68l19J11O8PP9j2m9pl4%J26j95r1K40j10M0Kk83N56r3m51K04R6k27J29K11
3280A66k36K5r6J42J94k23j12q0J58L0J08L1J21m11R1M33j58p6j96J78k59J30
3302d0j57J98J70l85K32MM5k03j11M65m20J63M05j54k57j26J27K05l25P2r5J37
3324e0m1N0L94m18M5l6J70k31PKm0L61l96Q9J84k8k09j25L03l3M2r9J46j59j55
3349b27M6J67P2qk4k30K67k5O8o5k4O9J6m4N9j4j67K17j48J11k09R4J22j55J7
3374a5J50n4j94j18K75L1m2P9j29N9j70J38K20j67k61L23k68j8m5J59K3l1J69
$$ plain form
3397 114 43 97 73 -270 366 253 -129 160 -36 288 -117 -93 -71 -55 41 -23 22 -23 -35 145 -80 -41 -202 -105
3421 -105 178 -201 -77 -96 81 111 18 -103 35 -137 7 77 54 -100 -67 -96 -352 -72 -36 178 -19 -27 62 -2
3445 -2 86 112 -186 304 206 -95 -146 -7 -76 173 -56 26 23 -215 -57 311 15 -127 187 -47 -177 -66 100
3468 100 64 79 -141 194 -22 142 -8 207 -136 -16 92 45 -30 -179 -70 -98 -25 143 69 -149 72 -109
3490 -109 -138 -56 -33 -294 -80 88 188 188 -19 97 -2 -105 158 -6 -100 119 137 -29 143 -69 -269 -24 -36
3513 -36 -5 -37 -143 -10 131 -74 -45 119 -174 -96 232 100 -45 60 82 248 -43 30 113 37 -408 -235 81
3536 81 -203 -306 99 81 -53 -149 -88 -13 -16 -23 12 105 72 -9 124 -10 115 -61 80 229 -55 -46 11 113 -33
3561 -33 -41 -91 -17 52 -250 170 -32 52 -182 -128 -108 -36 -168 45 93 60 -56 257 189 37 200 -81 -4 -201 -19
$$ packed form
3397A14p1N4k4l43O36j13l82K89j96L24m05K4K2J6R6o4M5m5j2J80k25L9j61R7
3421a05K83l79J24j9J77L0r3j21J38j72J44P0k3j54L3k9k56K80L6K14j97qQ9o4
3445bQ8K6k98M90r8l01n1J39o9K49k29Q2lk38J58L68k96j42L14k34j30J11J66
3468A00l6J5k20L35k16J64j50K15l43J20J08m7p5j49J09k8P3J68p4k18K21j81
3490a09k9Q2K3k61K14J68J00%k07J16r9j03K63j64r4K19J8j66J72k12k00K45j2
3513c6L1l2j06J33J41k05K9J64k93P8L28j32j45J05K2J66k91P3Q3p6m45J73L16
3536H1k84j03M05j8j34r6O1P5lpL5R3l3q1J33j34J25j76J41J49k84RN7J02j46
3561c3qn0P4O9l02M20k02Q4k34N4K0P2j32K13M8l3j16L13o8j52J63k81P7j97J82
$$ plain form
3586 -19 -34 -128 62 273 -101 -210 -141 -16 -124 8 -369 -104 116 -142 -79 160 -146 -144 159 288 126 -30
3608 -30 80 -78 -215 58 -147 21 -40 69 -52 104 -76 -66 -20 88 109 -95 -130 -34 -31 -297 23 -53 -18 -195
3632 -195 45 266 17 98 -120 11 16 -116 -157 -15 -61 -187 -35 -86 -115 -58 292 -140 117 -154 -232 26 77
3655 77 125 -95 24 -55 -43 -86 120 312 93 -43 240 -91 140 316 -164 206 13 123 75 18 -134 78
3677 78 106 71 -221 89 0 213 99 -56 -101 -82 -17 15 118 170 -169 -91 472 -175 19 44 260 -165 4 32
3701 32 114 -18 -84 120 112 -1 -182 -20 42 -82 -149 84 -60 -64 -38 150 184 88 -145 61 -176 -11 31 -90
3725 -90 149 -29 -17 -27 -25 -107 -146 99 -136 -14 -183 -30 135 -213 99 -108 138 37 -104 118 1 -39 330
3748 330 -145 -36 -123 -31 -165 -114 100 6 26 -72 -215 -48 146 -132 123 -5 259 -109 93 113 177 -214 -16
$$ packed form
3586a9j5r4J90K11l74j09O9J25j08J32l77K65K20k58O3K39l06KL03J29j62j56
3608c0J10j58j37K73k05J68o1J09j21J56j80J0M6J08K1k04l5R6Lk66L20p6L5j77
3632a95K40K21k49Q1k18J31Nj32m1J42m6j26J52n1k9N7L50m32K57k71p8K58N1
3655G7M8k20J19p9J2m3K06J92k19j36K83l31K31J76m80L70j93J10m8n7j52K12
3677G8K8l5k92L10q9K13j14j55m5J9O5L2J03N2l39P8N63o47J94K5K16m25J69K8
3701C2Q2j32o6K04qj13j81J62O2j24o7K33j44mK6J88L4r6k33K06k37J65M2j21
3725i0K39j78J2j0Kq2l9K45k35J22j69J53J65l48L12k07K46j01j41K22j17m0L69
3748C30m75J09q7R2j34N1K14r4K0r8j43J67J94k78K55j28K64l68K02K0O4l91J98
$$ plain form
3771 -16 -75 -298 72 -91 238 42 -54 39 -173 -105 -34 -47 59 -11 -201 98 3 -186 -175 59 48 -44 48 214
3795 214 128 -10 69 160 131 84 129 246 -40 -125 100 12 115 -173 111 187 120 182 225 -77 285 -153 21 157
3819 157 66 137 -126 191 -9 72 -99 264 53 194 171 -121 -220 278 65 72 -78 -232 13 95 141 -224 -35
3842 -35 39 164 22 43 20 210 -67 -97 131 -27 -140 -57 80 111 69 -183 -61 67 173 117 -121 -37 -45 175
3866 175 -101 -35 59 -4 76 -239 97 286 149 35 100 -90 -53 -15 212 132 190 -65 78 -22 -267 -183 -43
3889 -43 -22 -165 93 -140 74 120 -16 -98 -40 -78 65 -405 87 -69 70 59 -135 57 64 29 -52 51 104 163
3913 163 73 -39 -78 -42 -6 128 -141 125 145 289 60 110 81 -175 111 10 -173 -43 92 108 121 -26 -44
3936 -44 -132 41 122 -66 0 -96 230 69 39 -73 -59 139 234 7 -31 170 70 -4 -25 125 6 -408 -43 -11
$$ packed form
3771a6n9k23L70j63L29j96r6R3k12O8P1j3J06p0j90K99r5j89J1K34j1r2R2J66
3795B14q6j38P9R1k9m7M5J17k86q5K25q8J03k88K84P6o7O2M3l02L62m38J74J36
3819A57r1P1k63L17k00Q1j71L63k11J41k3k92r9M98k13Pj50j54K45Q2M6l65J89
3842c5P4J25j42K1k3J90k77l0K28j58j13Q3J37L1m2k52J22J28J06n6k38Q4qK20
3866A75k76O6R4o3Q0l15L36J89j37j14O5j90L7L8K27q0N8k55J43j00k45Q4J40
3889d3K1j43K58k33K14M6j36q2N8l8J43m70M92j56J39j1j94J92Pl5q1J03N3N9
3913A63r0j12l9L6L6J34k69K66K0J44k29N0k9k56K86j01j83J30J35J6J3j47j8
3936d4q8J73Q1j88O6r6L26j61l0j12J4J98R5k27l8K01j00p4k1J50j19m14L65L2
$$ plain form
3960 -11 -152 59 139 111 -18 -273 -223 -115 211 14 -88 120 -261 -358 141 258 -76 -22 78 85 -262 94 113
3983 113 -88 182 76 17 82 208 -170 116 -70 -83 -23 19 -58 -79 -267 -176 164 -252 36 145 66 88 58 -55
4007 -55 -366 -150 245 -105 -63 -38 52 191 -141 58 -319 104 13 -43 -175 -10 111 64 94 -35 -158 -303 76
4030 76 133 59 -254 100 -167 281 -59 -77 76 -40 -111 247 -35 -48 19 -14 10 -173 -210 129 175 -284 -160 -229
4054 -229 258 -108 -5 133 -74 -50 -86 -103 107 119 83 114 56 287 -104 -63 -17 -9 -65 42 103 -60 -61 -88 -16 -123
4080 -123 61 -127 304 -208 -475 64 133 227 8 110 -77 86 -268 -111 -3 52 -329 36 -6 -39 16 -8
4102 -8 86 188 40 -188 27 -57 94 -78 133 -29 93 60 31 -53 -169 -33 48 98 160 -59 152 219 -10 250
4126 250 -119 -41 136 -116 -13 84 193 -274 -225 9 -286 109 -135 78 -51 -71 13 -244 -62 -92 -183 73
$$ packed form
3960a1j41K11Q0k8j29k55N0J08L26j97j02K08l81r7M99J17l34N4J00Pl47L56J9
3983A13k01K70j06n9O5J26l78K86j86j3O0M2p7k1j88R1L40m16K88J09p9K2l0j13
4007e5l11K16L95l50M2K5R0J39l32J99l77M23r1n6j32J65J21m7L0j29j23j45L79
4030G6N7p4l13L54k67M48l40j8J53j16p1L58k82j3O7l3K4j83l7L39M6m59J24o9
4054b29M87l66J03J38k07K4l6j7K10J2l6L1n8K31l91M1M6Qn6J07O1j63jk7P2j07
4080a23J84j88M31n12k67N39O9R4k19J02j87J63l54J57J08N5l81L65m2l3N5k4
4102hR4J02j48k28K15q4J51j72K11j62J22l3k9q4j16J36Q1N0O2k19K11O7k29K60
4126B50l69P8J77k52J03R7J09m67M9K34k95L95k44K13j29k0Q4k57J82l0r1K56
$$ plain form
4148 73 15 -193 61 162 129 37 38 294 -81 -18 -8 73 282 -55 53 -42 14 -136 -89 116 -134 63 111 -13
4172 -13 184 -220 37 -154 -109 -282 -112 0 -26 80 -57 91 -97 -11 -3 -176 -248 11 -94 -95 -58 176 108 -69
4196 -69 67 -114 32 -66 27 13 229 31 117 -11 105 183 -45 -225 -42 114 42 -184 135 86 28 -207 -26
4219 -26 -222 -101 60 -43 -99 -44 89 177 80 -14 -114 -170 -104 152 132 285 216 -157 -55 -62 -188 53 189 -127
4243 -127 256 -70 -53 -73 -335 83 -28 -36 -168 -88 94 68 118 -194 -51 -260 5 -7 -318 -114 191 -142 92
4266 92 -122 -41 -62 -236 149 139 17 59 102 -249 -39 89 -127 -121 123 -4 -38 -103 73 86 104 -24 -151 -124
4290 -124 78 -14 -22 259 120 270 35 221 90 -90 -6 94 79 -168 15 161 163 -46 -132 19 -3 119 -199
4313 -199 -44 -13 91 104 -16 -21 -148 -187 -352 -442 -29 56 -118 -97 -111 44 41 173 -115 -79 87 53 -30 -241 -266
$$ packed form
4148G3n8k08K54J01l3r2JK56l75O3J0Q1K09l37J08r5N6j50M7K05k50J97M8j24
4172a3J97m04K57j91M5j73J70J12k6J06j37J48j88Q6Qj73p2K59j05jL7K34o8j77
4196f9J36j81J46r8R3j4K16j98Q6j28J16P8k28j80J83J56p2k26L19m9n8k35J81
4219b6j96J21J61j03n6N5J33Q8r7r4j00n6O6K56k0J53o9l73J02pj26K41J36l16
4243a27L83l26J7k0k62M18j11qj32Q0J82k6N0l12J43k09K65j2l11K04L05l33K34
4266I2k14Q1k1j74L85j0j22M2M3l51K10J28k16OK44j27l4o5J76J3J8j28j27K7
4290a24K02r2qK81j39J50k35J86j31j80Q4J00j5k47J83J46Kk09q6J51k2J22l18
4313a99J55L1J04J3j20nj27l9j65r0M13Q5j74K1j4J55lJ32k88L6J66l4q3k11k5
$$ plain form
4338 -266 126 0 -103 -167 67 42 158 -54 107 286 33 64 -219 17 122 -235 -363 44 139 211 146 6
4360 6 68 -173 54 -364 8 125 193 70 78 21 -34 237 -8 59 75 90 130 74 -2 79 107 245 -221 55 -54
4385 -54 32 -162 77 135 -182 199 26 259 151 -33 33 147 -38 95 -54 -44 -174 -62 -63 87 106 -2 -42
4408 -42 -7 36 -3 -257 -48 -172 -35 28 23 178 -63 78 11 -162 74 -136 11 54 30 62 -134 131 15 10
4432 10 233 -16 77 -76 86 -143 337 -68 225 -40 -165 277 -129 100 -62 82 -111 -147 92 22 -5 -156
4454 -156 173 -62 -304 -150 -227 -56 130 237 -209 -31 108 64 131 14 37 184 53 17 100 223 91 160
4476 160 192 93 110 9 -256 94 14 42 -62 54 18 92 146 36 143 -107 -43 1 92 -24 105 -17 -5 -80
4500 -80 125 87 -22 130 14 48 83 -49 -210 -155 134 -277 207 -37 -295 124 -39 -90 -41 -167 78 128 123
$$ packed form
4338b66L92j26j03o4K34k5J16k12J61J79k53L1k83K36J05l57j28M07R5P2o5j40
4360FO2k41K27m18L72J17O8j23Qn7n5K71k45O7J6J5M0n6p6Q1K8J38m66K76j09
4385e4Q6j94K39N8l17L81j73K33j08j84O6J14j85J33j49J0j30J12jJ50J9j08m0
4408d2L5M3l9k54K09j24J37O3nJ55k41J41o7j73K36k10J47M3k4L2j96K65j16n
4432A0K23k49R3j53J62k29M80m05K93k65j25M42m06K29j62J44j93l6K39p0k7j51
4454a56L29k35k42J54p7J71J86J07m46J78J39m4O7j17K3J47j31l6Q3J23j32O9
4476A60L2r9J7j01k65L50q0K8j04J16l6P4N4j10J07k50O4M4R1j16J29j22J2p5
4500h0K05l8j09J52j16L4L5j32j61N5K89m11M84k44k58M19j63n1M9j26K45N0n
$$ plain form
4523 123 -245 -88 60 -41 202 45 -53 144 86 -93 -211 -187 26 58 -11 175 149 223 -67 67 62 267 8
4546 8 -105 -14 -148 -4 89 -190 158 -69 18 130 -58 272 -240 -85 207 -267 143 8 42 -37 -180 -139 -97
4569 -97 -97 77 -124 71 -29 12 3 -242 128 13 -161 -36 43 -84 41 7 203 136 -4 118 71 -3 -292 -20
4593 -20 102 17 -1 -79 -46 -255 -116 -124 -215 -91 118 -82 -154 -55 -59 -134 253 -54 190 -116 39 121 10 15 149
4618 149 -114 -94 -123 176 115 -242 3 65 -17 130 -243 -283 127 167 23 -6 227 -279 134 12 -61 142 -18
4641 -18 -82 -83 186 -46 97 119 49 67 0 -134 -177 172 -205 91 150 56 -166 86 138 135 -175 -54 87 -207 94
4666 94 -17 82 18 165 5 -153 175 -216 22 21 122 -45 61 88 -200 206 -151 129 -19 -104 -59 94 92
4689 92 -104 96 221 -195 103 -102 156 -48 -392 -167 -19 54 176 110 0 -83 49 -229 -27 -25 156 -48
$$ packed form
4523A23l68J57J48j01K43j57r8J97n8j79j18K4K13L2o9J86k6P4k90J34nK05k59
4546Hj13R1j34J44R3k79L48k27Q7J12j88L30n12J55K92m74M10j35L4p9j43M1M2
4569i7%J74k01J95j00M1rk45L70j15j74J25P9j27J25l4J96o7j40J22m7p4k89K72
4593b0J22q5j8p8L3k09J39qr1J24K09k00p2R9mp5L87l07K44l06J55Q2j11NJ34
4618A49k63K0k9K99o1l57K45O2q2J47l73m0M10M0j44k9K33n06M13j22p3K03j60
4641a8o4jK69k32J43K2p0J8o7j34m3L49l77K96N9r4k22K52N2ll10J21J41k94L01
4666I4j11R9o4J47j60j58L28l91K38jJ01j67J06K7k88M06l57K80j48q5M5J53k
4689I2j96K00J25m16K98k05K58k04l44K25J48P3J22o6j10q3J32k78K02KJ81k04
$$ plain form
4711 -48 68 -23 -77 191 -41 57 135 85 -14 49 56 -138 185 -96 -146 34 -41 93 -127 44 105 5 -70 158 -124
4736 -124 -181 4 25 275 60 257 -68 23 20 -210 51 26 68 -158 249 4 90 27 -167 -98 44 -163 95
4759 95 4 -85 -171 -161 -285 -52 33 -5 -340 -71 103 -146 -156 0 108 196 -76 -137 -99 -154 56 143 -45 -194
4783 -194 -45 -244 -51 131 126 2 48 -39 251 -230 -54 -68 -107 -124 313 48 277 93 -70 -85 163 67 61 132
4807 132 216 241 -85 26 -196 -347 -6 99 -119 233 108 -212 -172 235 -7 -31 12 -7 221 -373 -25 -125
4829 -125 72 -214 87 74 -251 70 17 -194 -87 -268 -195 -28 -16 -40 125 72 -115 210 -39 149 166 40
4851 40 -155 127 -217 265 99 -297 -242 66 57 5 -193 -8 -52 -121 109 -24 -58 -63 -125 42 78 -14 -101 147 -139
4876 -139 -113 109 91 -42 70 72 95 198 42 15 36 -21 -4 174 79 58 -52 -61 78 -96 -182 -95 42 252 52
$$ packed form
4711d8J16r1n4K68k32R8P8n0r9O3Pj94L23k81n0J80p5J34k20J71O1j00p5K28k82
4736a24n7J85K1K50k15J97l25R1lk30K61k5M2k26M07k45Q6o3j94O9J42k07K58
4759I5r1q9q6J0j24K33Q5l8l35K69J74k49j0J56J08Q8k72o1L8n5K10Q7j88j49
4783a94J49j99J93J82nj24M6q7K90m81J76j4l9j7M37k65K29j84j63j5K48r6oP1
4807A32Q4K5l26J11k22j51L41J05k18L52j25l20M0M07k42k4M3j9K28n94L48j00
4829a25J97k86L01j3l25L21n3k11J07j81P3J67J2k4J65n3j87L25k49J88J7j26
4851D0j95K82l44M82j66l96N5L08rn2j98J85m4o9K30j33l4no2J67L6r2q7K48k86
4876a39K6K22j8j33J12KK3J03j56k7K1n7J7J78r5k1j10rJ39j74q6Q7J37K10k00
$$ plain form
4901 52 27 232 72 -163 -13 -170 117 47 -54 207 -59 -149 28 22 124 149 -184 -292 -293 228 14 229 176
4924 176 -145 -65 -123 236 -20 25 -144 23 -13 74 86 89 -220 -23 30 85 -147 220 -46 -102 1 -179 286 -118
4948 -118 -203 -21 26 -138 -28 64 -63 -410 -58 -254 -247 -153 28 20 -142 35 -86 92 124 -120 161 -62 16
4971 16 22 44 -254 -171 -27 -111 250 216 -105 -15 79 -227 -222 -1 284 -93 32 86 64 372 209 138 -103 -133 -254
4996 -254 -233 25 144 89 -77 95 281 19 76 -108 -5 -55 231 -34 131 97 -64 -125 216 118 281 -180
5018 -180 0 -74 38 -191 60 -141 26 -133 112 -77 -193 35 107 137 -224 -47 -285 35 1 139 -284
5039 -284 -106 -14 198 68 -51 -26 -110 -140 24 -171 139 -206 61 137 47 159 6 126 206 -18 -126 79
5061 79 162 -173 61 -26 -28 -114 -21 -270 123 -142 65 -153 70 -183 117 -98 -213 -133 11 110 -104 -157 73
$$ packed form
4901E2k5K05j60k35J50j57K87p0j01K61k66r0J77oJ02K5l33j08jN21k14K15n3
4924A76l21Q0n8L59k56M5j69J67l6Q7J2Ll09J97N3N5k32L67k66n6J03j80M65m04
4948a18q5J82M7j64J10R2j27l47L52j96PR4J81qj62J77j21J78L2k44K81k23P8
4971A6OK2k98Q3J44q4L61l4l21R0R4l06NK21K85l77J25N4k2L08j63p1k41l0j21
4996b54K1K58J19n5j66J72J86k62N7j84J03n0K86k65J65l4j61o1L41r8J63m61
5018a80J80p4J12k29K51k01J67j59K45j89j16K28P2L0l61J77k38L20l4J38m23
5039b84J78R2K12j30j19K5q4l0J64j95L10l45K67P6r0J12j53J20Q0k24j08K05
5061G9Q3l35K34q7kq6R3k49L93k65K07k18K23k53L00k15j15Q0J44R9k14n3K30
$$ plain form
5084 73 250 -154 -114 172 -124 -54 286 127 221 99 136 -376 -30 -65 -302 1 37 -262 107 88 -65 86 -13
5107 -13 -11 59 163 -76 -478 -10 7 -118 103 -55 30 65 -290 -197 104 231 -151 -137 -22 -126 229 111 20
5130 20 30 -39 -69 -88 95 -98 112 -100 8 55 61 -156 132 177 4 -104 85 -229 -148 64 -94 -178 -33 -89
5154 -89 106 -261 -17 70 39 -3 -123 -143 215 58 5 3 183 99 286 157 6 322 179 -233 16 -35 83
5177 83 94 -89 -151 -69 -54 -343 59 63 -13 -130 -43 -166 170 5 218 68 -287 -66 42 -211 35 -14 99
5200 99 51 164 -76 -178 63 213 -62 72 -38 260 91 182 232 -246 -146 286 -33 32 186 161 -31 4
5222 4 120 -35 19 -19 143 113 -35 -6 6 -191 -124 163 189 -8 44 -120 -89 15 132 -11 -93 -114 -149 -228 149
5247 149 -183 217 -100 -140 78 -131 185 -67 -12 -21 45 156 122 36 120 -77 96 77 -192 255 62 -209 -140
$$ packed form
5084G3J77m04M0K86k96P0L40j59R4j22L7n12L46l5k37L03L6k99L69j9j53J51r9
5107a3KP0J04k39m02M68J7j25K21j58Q5L5l55R3L01J27l82J4J15j04L55j18r1
5130B0J0o9l0j9J83j93K10k12J08M7Ok17K88M5j73j08J89l14Q1K12j58q4J45n6
5154h9J95l67K44Q7l1m2j20k0L58j57n3kJ80q4J87j29j51L16j43m12K49n1J18
5177H3J1j83o2Q2J5k89M02Mp6j17Q7j23L36j65K13j50l55K21J08k53K46m9J13
5200I9m8J13k40j02K41J50k75J34j10K98j69R1N0m78J00M32l19O5J54k5j92L5
5222DJ16j55N4l8J62l0j48K9J2j97O7K87K6j97N2j64L1J04J17j43q2k1l5p9L77
5247A49l32M00l17m0K18k09L16k52N5rO6J11l4q6Q4j97J73j9k69M47j93k71O9
$$ plain form
5270 -140 -127 472 -170 -96 20 -132 164 -261 -89 -56 30 41 -119 -82 80 -196 -17 126 73 -24 -67 -60 470 -90
5294 -90 34 -150 -20 186 138 192 -219 -40 -150 -364 60 32 -57 -10 -43 -47 185 88 -81 -134 -170 185 60 -138
5318 -138 36 218 -57 -150 143 -57 6 -126 -2 109 -91 170 -130 166 -312 -3 -2 -9 -147 94 62 156 -21
5341 -21 303 -98 90 202 -4 -108 413 141 -140 211 -38 -64 -38 216 -178 189 127 136 29 -188 47 22
5363 22 -144 137 -44 -87 -295 -9 -29 -196 22 164 -61 34 206 193 81 -209 19 58 -2 -17 -177 -67 21
5386 21 97 -153 -62 182 53 89 -109 216 -136 65 11 105 108 -33 73 2 255 -32 78 -309 -32 -159 65
5409 65 -116 -70 17 119 170 47 69 121 107 -186 41 183 -224 5 -266 80 195 -8 198 -173 -1 -212
5431 -212 166 21 -51 -34 47 -96 -16 -40 219 -28 21 32 86 70 127 103 -238 45 146 119 27 -74 48 -40 182
$$ packed form
5270a40J3N99o42P4J16j52K96m25J72L3Q6J1j60L7J62k76J79J43n3r7m3PN30n60
5294i0J24j84J30K06m8N4m11J79j10k14M24k8q9M7l3mK32r7j69n3l6L55j25j98
5318a38J74J82k75r3K93k00O3j32J24J11k00K61l00K96m78L09Jpj38K41l2R4j77
5341b1L24m01J88J12k06j04N21k72k81L51k49k6K6K54l94L67o2Rj07k17K35k5
5363B2j66K81j81m3k08K86k0j67K18J42k25R5J72j3j12k90K28L9o0j5j60J10Q8
5386B1P6k50R1K44j29L6j98L25l52K01n4R4Lj41J06p1K53k87J10l87K77j27K24
5409F5j81M6Q7J02N1j23K2N2j4k93K27J42m07K29k71L46J15k03K06l71J72k11
5431b12L78j45p2J7Q1j43Q0k4K59k47M9J1N4j6N7k4l41K83J01k7r2j01J22q8K22
$$ plain form
5456 182 -44 118 80 195 -263 6 -179 -96 -211 -25 3 -6 46 362 81 58 -89 -32 42 -159 -104 -145 -19 -234
5480 -234 -81 -250 91 -77 18 -47 -135 68 89 15 -99 -134 -149 -22 -85 -37 211 -26 -58 -151 -76 89 -136 158
5504 158 243 79 -215 53 101 70 144 147 -32 1 9 123 122 -195 118 186 79 -168 -3 -10 -218 137 -29 -130 42
5529 42 33 8 89 -128 48 102 -176 -44 -187 130 -107 -7 -21 -137 -254 -74 -80 19 -38 -188 -101 -10 -160 -74 -99
5554 -99 11 9 -59 -64 -193 -150 32 12 174 46 12 -187 17 27 -52 13 -67 -392 14 -12 20 -89 116 96 -36
5579 -36 48 21 -31 172 51 -182 -125 -123 169 137 -19 16 136 -272 -141 67 127 144 -55 69 -155 216 -40 -62
5603 -62 64 -143 288 50 -44 7 173 84 -198 -20 -1 -86 47 -17 95 -47 -43 357 -10 69 -188 -57 13 102
5627 102 234 19 -7 15 -153 -241 -194 66 -195 117 3 37 -254 193 113 -122 -206 95 117 -191 123 59 -21
$$ packed form
5456A82k26J62l8J15m58K69j85Q3j15J86K8rN2L16k81k3j47N7P4k01N5m1J26k15
5480b34J53j69L41j68R5o5q8K03K1p4j14l5j5J27o3M8K48k37l2r3P5J65k25K94
5504A58Q5j64k94K68M8l1P4Lj79L3QJ14jl17L13O8j07k47J65pk08L55j66j01J72
5529D2rk5Q1k17J76N4k78J32j43L17k37J00j4j16j17J80oR9n7j50Q7R1j50Q6k5
5554i9J10ko8nj29M3J82k0J62j28l4j99K04J0p9O5q0l25M06k6L2j09K05k0j32
5579c6Q4k7n2K03j21k33N7KK92l2j56L5J20m08J31K08O0J7j99J24k24L71k56k2
5603f2J26k07M31k38r4N1J66q9k82J78J9q5J33o4J12j42MM00l67P9k57J31P0Q9
5627A02J32k15k6K2j68q8M7K60k61L12j14L4k91M47q0k35q4L01K2l08L14o4q0
$$ plain form
5650 -21 45 6 -453 -32 134 111 84 -73 29 -137 17 2 143 126 -57 -9 -186 28 99 -129 -69 -121 58 -1
5674 -1 -279 -358 -20 -109 154 -15 81 -61 24 -20 -172 -66 -125 -148 312 77 76 10 -227 39 101 183 -243 139 128
5699 128 72 20 -141 -21 -262 86 -201 -149 -4 217 -64 -78 -98 -121 -88 -224 259 100 123 -43 -50 348 6
5722 6 -67 399 -133 44 -146 196 -61 6 -205 -141 -136 -5 -140 -27 -69 -61 -30 95 18 -12 -170 171 56 -20 -133
5747 -133 31 -76 -5 79 104 -15 -261 110 -5 -9 -13 -98 11 -37 160 -144 -184 -138 -196 308 105 -84 -47 57
5771 57 22 30 90 -102 -10 -290 132 -50 -145 15 -139 -124 19 -71 -148 120 156 91 -29 -2 118 219 47 157
5795 157 92 -87 56 -8 -237 -60 53 38 117 188 -74 38 -133 -116 -64 95 17 8 -168 4 -237 209 -127
5818 -127 -224 310 -65 -160 -115 186 244 -39 -41 -41 -108 -62 20 -86 3 -94 -72 -1 -65 188 -132 17 -109 -116 110 -52
$$ packed form
5650b1O6l9m59M21J66k3k7j57J02j66J54j5J41j7j83M8j77K14P1k28O0n2J79n9
5674ak78p9L38q9K63j69R6j42Q5m4j52J06n9k3M60k35jo6k37K66O2Q2m26L82j1
5699A28n6n2j61J20k41L48k87N2J45K21k81j4k0k3L3j36M83j59K3j66pL98l42
5722Fp3M66n32J77j90L42k57O7k11O4NJ31j35J13m2QL1J25p7l0j58L41j15p6j13
5747a33J64j07P1Q4K5j19k46L71j15mmq5J09m8J97l04m0M6n8N04k03j89L7J04
5771E7l5QO0j92R2k80M22j82r5J60j54J5J43r0p7K68L6o5j20K7J20J01j72J10
5795A57o5j79J43o4k29J77J13j5P9P1k62J12j71J7N2J59p8rj76J72k41M46l36
5818a27r7N34l75r5M5L01N8k83k%o7M6Q2j06Q9r7K2P1o4K53l20J49j26pK26j62
$$ plain form
5844 -52 -93 -203 -105 -17 -26 -77 -189 59 121 257 229 102 259 61 14 10 175 153 95 -215 271 123 -23 -226 143
5869 143 56 57 -75 -78 83 -190 0 -134 -326 120 61 -82 -89 -33 -232 73 -68 27 185 37 159 -56 -268
5892 -268 -43 151 99 -145 -4 -207 91 174 123 26 -92 147 -20 26 -44 -44 -155 -206 95 -30 -64 -185 -63
5915 -63 92 300 -106 5 84 11 -78 -65 51 -93 122 302 -139 -211 27 -59 93 -62 138 17 78 -294 -144
5938 -144 -13 97 197 181 444 -83 -97 5 26 153 81 61 218 -80 -8 3 -54 233 3 -84 -195 55 37
5961 37 16 -46 -40 125 -63 -99 160 -135 59 -20 -98 -168 160 -94 101 -4 306 -155 70 -4 -115 -177 226 117
5985 117 -30 -45 109 -105 -87 104 92 -15 82 232 -68 83 -57 206 -96 -189 14 -106 30 79 -75 -33
6007 -33 247 111 -232 39 -144 -110 55 -9 -14 93 -113 -176 32 -44 35 166 -187 144 -22 -105 104 -11 11
$$ packed form
5844e2m1j10R8Q8rn1j12K48O2J36k8j27J57j98m7mJ65k2n8l10M86j48j46k03L69
5869A43q7Jj32lJ61k73J90j34j92M46n9j43pN6j99L05j41R5J58j48J22k15k12
5892b68K25J94n2k44J41k03K98Q3n1r7j18K39j67M6p0%j11n1L01j25l4j21J22
5915f3J55K08m06J11P9p3q9J3J16j44K15J80m41p2K38q6J52j55K00j21O1l72J50
5938a44J31J10J00j6K63n27j4J02K1J27p2k0J57k98P2J1n7K87k30q7j11K50j8
5961C7k1o2OJ65j88l6K59k95J94p9p8p0L28k54J95j05L10m61K25p4j11o2M03j09
5985A17j47j5J54k14J8J91j2j07R7J50l00J51j40K63l02r3K03j20J36M9j54M2
6007c3K80j36l43K71j83L4J65o4nJ07k06o3K08p6P9J31l53L31j66q3K09j15K2
$$ plain form
6030 11 -259 -135 130 166 -149 21 -94 125 -201 -90 96 53 -320 53 171 31 121 -63 264 121 -124
6051 -124 104 85 0 99 42 -34 51 39 224 58 136 134 39 -61 -66 -79 187 62 63 17 39 40 -266 239 321 99 -14
6078 -14 71 -78 -195 92 85 35 -111 86 39 209 -202 -317 -205 -3 -185 -226 -104 -109 -9 105 -13 16 164
6101 164 -168 -201 -25 -263 168 -101 -125 238 156 80 168 58 41 -119 -150 -10 260 102 -200 -131 -137 -34 -20 -285
6125 -285 -133 -86 -114 -53 66 59 157 44 -13 59 -138 7 -172 72 63 -24 134 -62 -245 -84 -95 3 -101 16
6149 16 -38 163 121 -92 -117 43 194 -2 154 274 158 135 135 -39 -169 128 61 -14 -99 -258 245 310 -29 -64
6173 -64 -10 -135 79 66 134 166 -132 -127 77 233 120 19 -85 -175 -186 67 -15 -240 130 69 -68 32 -119 135
6197 135 99 115 170 178 26 61 6 394 -29 150 -80 -190 127 -127 282 -109 44 -94 -37 -128 -91 258 -203
$$ packed form
6030A1k70J24K65L6l15J70j15K19l26J11J86m3l73L73J18j40R0j84L27j43k45
6051a24K28j9q5R9n7p6Q5j2J85j66P8kr5j00nj3K66j25Jm6K2Jl06N05Q2k22j13
6078a4Q5j49j17K87pn0j46J97m7J70m11j15J12K02j82m1J22nJ00J14j18K9J48
6101A64l32l3J76k38M31k69k4L63q2p6Q8j10j7j60l1J40K70j58l02O9oJ03J4k65
6125b85J52M7k8O1J19pR8j13n7P2j97J45j79K44rq7J58j96j83J61j1R8j04J17
6149A6n4K01m2k13k5J60J51j96J56J20j16k3%j74j30K97o7p5q5j59N03O5l39l5
6173f4N4j25K14j3O8L2k98NK04J56j13j01j04r0j1K53q2k25L70o1j37J00j51K54
6197A35l6J6N5Qj52L5n5L88m23J79k30j10L17k54M09l91J53j38N7r1L7L49m61
$$ plain form
6220 -203 125 -70 119 282 133 -62 -214 -233 -177 -79 50 206 -148 -62 9 -226 8 37 75 89 79 96 -47
6243 -47 -92 -139 -210 135 252 62 105 -55 163 -5 -162 -21 123 -152 -21 -148 -85 -211 52 -42 85 69 17
6266 17 240 -101 -62 20 -220 -277 -88 -92 187 81 -213 -184 -41 45 -218 -127 -69 201 -250 38 160 -276 30
6289 30 -99 171 -13 -38 -287 173 -133 -5 246 265 20 -136 201 -186 105 213 64 -6 200 21 183
6310 183 -230 49 77 -39 -8 26 78 99 38 154 -113 166 -3 -107 -199 155 37 -135 90 49 17 -100 -125
6333 -125 202 -86 10 -102 -60 207 -42 186 -209 -71 37 173 -65 -13 49 -105 -71 -56 55 -78 -293 -203
6355 -203 85 -54 -257 225 -145 232 19 39 90 -102 110 100 45 102 90 135 55 154 104 -47 -5 128 17 215
6379 215 142 107 26 0 158 82 -80 -249 -32 105 1 223 171 -22 114 -127 -104 2 291 9 149 -37
$$ packed form
6220b03L28j95J89J63j49j95j52j9N6R8J29J56l54Q6P1k35K34K9L8J4j0J7j43
6243d7m5m7p1L45J17j90M3j60K18j68j57J41J44k75J31j27O3j26K63r4J27j6n2
6266A7K23l41L9Q2k40n7J89mK79j06k94K9J43Q6k63R1N8K70m51K88J22m36L06
6289C0j29K70j84k5k49M60l06J28K51J9k45j56L37l87K91J08j49p0K06j79J62
6310A83m13K79K8j16L1L4N2K1o1J16k67K79j69j04r2L54j18j72K25m1l2j17k5
6333a25L27k88R6j12M2K67k49K28l95J38J08J36k38N2O2j54L4J5J11j33k15R0
6355b03K88j39k03M82l70L77k13K0N1j92K12j0n5N7j2M5q0R9n0j51M2J33j11J98
6379B15p3l5q1k6J58p6j62j69K17J37j04K22n2j93J36k41K3J06K89k82J40j86
$$ plain form
6401 -37 10 -220 177 4 -16 176 -19 12 -130 138 167 70 -108 -37 -82 -134 -17 62 -99 -128 169 -67 -2 -257
6425 -257 -24 -136 -29 101 155 353 -46 -2 -84 -292 16 -121 -242 -68 -247 20 81 126 40 139 -61 -99 -95
6448 -95 40 24 -20 -145 -97 132 58 -99 333 -95 -28 -126 -74 186 -51 -21 -126 -84 8 -63 -2 238 92 100 30
6473 30 -74 -366 -280 -248 70 88 -32 145 207 -18 -165 -59 311 11 68 23 -91 -96 -160 -24 -56 208 56 81
6497 81 42 -39 -125 -22 59 -50 44 -171 98 139 -185 39 132 178 14 5 105 52 57 -229 38 130 -127 147 140 21
6523 21 135 5 -86 -319 15 -134 -39 214 127 311 26 73 -146 157 -81 64 -264 -51 -72 32 18 14 -167
6546 -167 82 116 -38 -18 39 250 69 -5 58 -163 -55 -121 -26 205 -157 -1 374 -11 -30 -85 33 63 -38
6569 -38 -226 32 179 -145 33 161 1 -63 -116 -70 153 -61 113 -67 271 -300 -104 119 74 54 -141 -77
$$ packed form
6401c7M7k30L97j73k0J92j95L1j42K68K9r7j78P1m5n2J17P9j61k9K97k36O5k55
6425b57K33j12J07J30N4J98l99M4q2k08L08j37j21J74j79K67O1M5q6R9k00l8M
6448i5J35j6m4j25M8K29p4j57M32m28O7r8N2K60k37L0j05M2R2p1O1K40j46Qp0
6473C0j04k92Q6L2L18J8j20J77O2k25j47J06L70l00N7m5j14no4J36l2K64j52K5
6497H1l9q1q6J03Q1j09R4k15K69M1l24K24R3M6j64rJ00n3Nk86K67R2k57K74pj19
6523B1J14j30r1k33L34j49R5K53q7J84k85M7k19L03k38J45l28K13k1J04j4mj81
6546a67K49L4j54K0N7K11j81p4O3k21J08o6R5K31l62J56L75l85j9n5J18L0j01
6569c8j88K58J47l24J78J28j60o4n3M6K23k14J74j80L38n71J96K23m5k0j95O4
$$ plain form
6591 -77 -22 -235 123 -181 -8 -13 9 -107 -173 -149 -7 -68 -89 368 4 -99 -38 -98 66 106 96 -131 93 -386
6615 -386 -68 -127 -88 -99 110 -100 19 152 95 3 -183 26 96 189 17 -54 155 86 56 -41 -38 -68 151 -30 115
6640 115 -166 85 -135 -68 -42 -56 31 42 133 160 -32 74 -30 152 98 -173 24 125 -151 109 -264 -260 -7
6663 -7 -238 27 70 -160 -185 -130 -8 -226 2 -45 317 249 17 110 -102 -79 93 -106 123 110 -160 -143 157 -84
6687 -84 -77 93 408 60 120 -102 139 -73 -67 -38 -164 -179 192 -10 53 -314 -181 -46 222 174 41 5 3 -16 93
6712 93 169 -27 -36 -13 82 127 -263 -163 -160 2 104 0 -83 163 202 -117 -87 -219 130 -201 -40 122 -183 -27
6736 -27 -137 216 -119 81 107 -52 76 -174 42 -214 6 -53 156 119 -29 93 81 -69 34 -281 162 129
6758 129 88 -118 -48 -140 -436 85 18 -74 -86 -121 -14 -81 -134 -112 -102 -132 -180 -114 221 -50 -9 143 344 -278 223
$$ packed form
6591g7N5k13L58l04J73nK2j16o6K4J42o1k1M57l64j03O1o0J64M0j0k27K24m79
6615c86L18n9L9j1K09k10J19J33n7r2j86K09P0R3j72p1K09o9l0r7Ll0K19j81J45
6640A15k81K51k20O7K6j4Q7J1R1K7j92J06j04J82n4k71J97J01k76K60l73MK53
6663gk31K65M3k30k5N5J22k18K28m7L62o8k32R3k12K3J72j99K29j3k70J7L00k41
6687h4PJ70L15l48O0k22K41k12OK9j26j5L71k02O3l67J33J35K68m8j33l6kj9J09
6712I3P6j96rK3R5M5l90J00LJ62J02j04q3K46L9l19L0j32L49l31J61J62l05J56
6736b7j10L53l35K00K6j59J28k50K16k56K20n9K09l7j48J22j2j50J03l15M43l3
6758A29m1k06P0r2k96N21o7r2j2l5J07o7n3K2J0l0m8O6L35k71M1J52K01o22N01
$$ plain form
6783 223 136 -89 -112 -34 118 -104 -233 -224 -18 -31 139 79 67 -65 -90 -40 7 156 -138 -335 17 -110 -37 -30 71
6808 71 59 109 -12 -39 80 -39 -64 298 23 217 -32 103 -112 -134 92 5 55 -249 84 -83 72 -162 -244
6831 -244 286 90 -133 216 64 123 -102 -101 -53 121 -162 -44 -261 72 -17 -111 204 -16 286 46 -78 -209
6853 -209 116 128 -78 -63 51 31 123 -123 -85 -2 -180 145 15 20 85 79 304 -20 -51 63 -70 -60 120 314
6877 314 33 -103 -14 187 -92 -68 -44 95 -121 -137 55 186 -160 81 119 -317 173 1 -197 136 129 66 262
6900 262 13 157 21 -47 17 -265 -46 -6 151 99 36 -261 -111 77 -24 -127 69 97 54 194 104 68 -26
6923 -26 -296 223 133 104 -99 112 -201 -116 -79 -121 -192 -219 147 -107 -75 -29 71 152 2 74 -179 64 57 156 179
6948 179 54 -192 18 194 -15 -12 -130 -136 -133 10 21 84 47 -1 38 -134 -152 -61 -26 -170 114 165 -137 93 -26
$$ packed form
6783B23q7k25k3P8J52k22j29RK06j3J70o0j2j32k5N0M7J49k94j97L52j27P3PJ01
6808G1j2N0j21k7J19j19k5L62k75J94k49J35k15k2K26q7N0l04L33j67J55k34q2
6831b44N30j96k23L49j52N9k25JM8J74k83J18k17L33q9r4L15k20L02k40j24j31
6853b09L25J2k06J5J14k0R2k46L8Q3j78L25j30NO5oK25l24l1J14j33J0J80J94
6877C14k81j36Q9K01k79K4K4J39k16j6J92J31l46K41L8m36M90j72j98L33po3J96
6900B62k49J44j36o8O4k82K19M0J57n2o3k97J50J88j01j03J96K8m3J40r0l6r4
6923b6k70N19r0k9k03K11l13Q5L7m2p1k7L66k54L2M6J00Q1j50P2k53K43pR9K3
6948A79j25k46K10J76k09Lj18oLJ43J1O3l7m8L9j72j8R1L5j44K84N1l02K30j19
$$ plain form
6973 -26 -73 -87 204 -5 213 -112 -45 38 227 108 -153 -54 -61 -78 45 -190 102 -65 -132 -70 17 190 48 37
6997 37 -23 87 -195 74 150 -164 -97 73 40 183 173 16 103 34 46 178 -165 257 -167 -60 63 -41 18
7020 18 133 -136 90 221 -94 -198 -118 26 202 206 -87 -124 18 39 -103 158 -18 -44 29 57 -157 156 180
7043 180 -108 -27 -116 44 69 -7 114 209 55 -13 12 -335 -157 -55 90 61 -34 140 357 51 -89 -57 -137 101
7067 101 -12 52 33 -105 238 -240 6 122 -9 -154 99 -55 -23 66 -205 314 78 284 21 -37 84 -152
7089 -152 -37 -188 -210 79 130 -352 46 -63 -71 -143 171 -11 88 -34 -130 117 75 168 -150 -1 43 74 67 -54
7113 -54 -128 -38 -114 -89 145 69 13 278 -20 159 -35 132 -249 2 42 -86 -35 -64 364 -33 36 -91 88 290
7137 290 -126 -339 -15 14 -93 -144 39 158 -55 120 54 239 -84 66 129 -114 242 124 296 -152 345
$$ packed form
6973b6m7j4K91k09K18l25O7Q3J89j19k61R9pj7J23k35K92j67o7O2Q7J73j42j1
6997C7o0J10k82K69P6l14O7J70l3J43j0j57Q7o9J2J32l43M22m24J07J23j04N9
7020A8J15k69K26J31l15j04Q0J44J76Mk93l7J42K1j42K61j76k6P3K8k14L13K4
7043A80k88Q1q9J60K5p6J21R5j54o8K5l47J78J02J45k9r5J74K17l06j40L2q0K38
7067A01j13O4j9j38L43m78K46J16j31j45K53j54L2Q9k71N19k36K06k63n8J21k36
7089a52J15j51k2K89N1m82L98j09qp2L14j82R9j22r6K47m2R3l18J49M4L1pj21
7113e4p4R0p6K5K34p6n6K65k98J79j94J67l81K51M0j28N1k9M28l97O9j27J79K02
7137B90m16k13L24K9j07n1J83J19k13J75o6J85l23J50O3k43L56j18J72m48M97
$$ plain form
7158 345 49 -70 -96 14 122 242 106 -134 30 85 65 -440 108 220 97 49 349 -22 -167 102 -179
7179 -179 16 125 -5 -27 212 147 -81 51 62 26 20 -35 70 133 -19 400 -30 -174 109 54 149 -13 -5 82
7203 82 36 -47 -15 8 51 15 -126 -142 -255 88 156 -32 -346 19 33 -62 234 -21 -89 35 14 156 48 219
7227 219 0 -60 -139 -167 -50 247 -14 77 -16 -81 135 -107 -70 -28 86 -5 -2 51 258 -109 258 -35 159 -105
7251 -105 -195 295 96 121 36 -84 11 82 -23 -81 69 100 29 137 -26 -75 122 -6 131 -39 -131 -16 108
7274 108 -125 100 13 -63 -102 207 -54 127 -188 36 -27 120 -159 147 -16 343 53 -202 -63 13 -3 120
7296 120 -127 33 65 162 -60 -47 89 -104 102 88 139 -141 183 -97 -80 48 -71 -103 -5 97 -61 -121 52
7319 52 -200 125 -159 98 -340 70 -3 -75 -308 -170 -7 -193 295 47 -52 -97 -120 -72 -185 9 3 -98 151
$$ packed form
7158C45k96j19k6J10J08J20j36k40J64N5k0n05N48J12j23m8L00l71j45K69k81
7179a79J95J09j30k2K39o5k28J32J1l6on5J05O3j52M19m30j44K83n5R5j62QQ7
7203H2m6q3L2K3M3l6j41j6j13L43O8j88l14L65J4r5K96k55o8J24k1J42j08J71
7227B19k19o0p9k8J17K97k61R1r3o5K16k42L7M2J14r1LN3K07l67L67k93J94k64
7251a05r0M90j99K5q5j20R5P1j05n8J50L1p1J08j63m9J97j28J37j70r2J15J24
7274A08k33K25q7p6l9L09k61J81l15K24o3J47k79L06j63L59k90k55J39P6j6J23
7296A20k47J60L2R7k22J3J36j93K06j4N1k80L24k80J7J28j19l2R8J02j58o0J73
7319E2k52L25k84K57m38M10p3p2k33J38J63j86M88k48r9m5k3M8j13J94oj01K49
$$ plain form
7342 151 65 -70 103 20 -19 187 132 -79 -62 -133 -160 -90 -162 147 -156 -124 -101 4 21 102 -64 -3 157 164 157 136
7368 136 103 -136 9 -144 107 -35 6 101 -54 -154 251 213 188 155 2 102 -37 123 174 -12 -158 -139 10
7391 10 139 216 104 61 19 66 -86 -31 -72 49 -148 -93 -191 80 -126 185 2 26 -16 -15 -8 -207 82 34 -28 80
7417 80 26 -142 -121 165 -17 -139 -104 72 93 -67 -154 43 -72 -256 205 202 -127 -4 102 105 29 158 49 255
7441 255 207 47 -106 -78 -163 -43 387 -260 -45 -215 -192 110 290 -19 -170 -161 43 131 43 -14 -85 96 -105
7464 -105 -97 27 342 24 149 237 278 73 -332 -89 -15 270 49 157 -113 -94 -60 -52 95 133 12 75 -86 100
7488 100 159 261 217 134 350 -91 -15 46 105 211 -55 222 -171 -252 -15 269 191 57 -75 6 -30 152 26
7511 26 99 184 -8 26 -198 70 -15 106 149 256 99 -168 -131 48 -80 -87 -293 206 30 -260 128 -17 28
$$ packed form
7342A51q6j35J73q3l9K06n5k11J7p1k7P0p2L09l03L2K3J05J7Q1j66O1J60Ppk1
7368A36l3k39J45j53K51j42M1R5j55j00M05l8k5l3j53J00j39J60N1j86j46J9J49
7391A0J29P7j12m3m2M7j52N5m1J21j97N5r8K71k06L11j83K4m2JPj99K89m8o2J08
7417H0n4j68K1K86j82j22L5J76K1j60q7J97j15j84M61ll29J23J06Lp6J29j09K06
7441B55m8j60j53K8q5J20M30o47K15j70K3L02J80l09j51RK04Q8q8n7p1J81k01
7464a05QJ24L15l18J25Q8M1k05m05K43P4K85k21J08k70J9L4QJ47L8j21O3j61J86
7488A00N9J02m4q3K16m41P6O1N9J06k66K77l93q1K37K84p8j34j32Q1l6J82j26
7511B6P3Q5j92L4k24K68q5J21M3J07j57k67L7J79j28pk06M99j76k90L88j45M5
$$ plain form
7534 28 -29 299 0 -151 338 -14 -63 244 122 -238 -160 56 12 179 -103 -73 -104 -111 184 -129 -130 -143 90 -156
7558 -156 64 95 -94 101 -63 22 -83 74 -240 -184 101 -133 181 -149 50 -37 -224 -83 23 277 233 -195
7580 -195 -34 39 230 400 -50 125 73 23 -60 -106 24 41 68 111 87 158 205 125 122 -88 139 -28 50 -129 81
7605 81 -275 -229 49 -60 135 -42 61 17 76 -266 98 128 -203 28 9 14 -138 -168 -115 -100 -200 -116 132 -142
7629 -142 -52 -151 -90 -77 55 94 -43 -27 25 -88 -6 6 -73 30 29 -153 250 86 261 45 156 -91 -71 -29 114
7654 114 109 135 -111 240 73 -311 22 185 1 -116 80 14 153 157 326 -55 -326 98 29 -40 -366 -86 150
7677 150 215 55 -95 -151 42 109 -70 -22 -113 -144 209 -95 -97 -188 -197 110 -217 226 -120 51 107 55 2 98 18
7702 18 -165 81 -32 -45 135 -48 -303 -30 70 46 -13 -108 -7 -114 -109 97 -104 105 51 134 -134 96 12
$$ packed form
7534B8n7L28k99j51M89l52m9L07j22l60P8K16m4J67k82L0l1pK95l13jj3K33k46
7558a56K20L1j89J95j64Q5j05J57l14N6K85k34L14l30J99q7j87J41J06K54m4m28
7580a95J61P3J91J70m50J75n2n0q3m6J30J7K7M3k4P1M7q0lk10K27j67P8j79K10
7605H1l56M6K78j09J95j77J03m4N9l42L64L0l31K31j9Nj52l0N3J5j00Q4K48k74
7629a42R0r9O1J3J32L9j37J6N2j13Q2J2p9J03jj82M03j64J75k16J11k47K0M2J43
7654A14nK6k46L51j67l84L33J63j84j17J96o6J39MJ69l81k71M24o9o9l26K80K36
7677A50O5j60j50n6J93O7j79M8r1l1L53l04kr1rL07l27M43l46J71N6n2n3R6q0
7702A8j83K46j13j3J80j83k55K73J00k4n9r5J01j07NK06k01K09n4Q3k68K30q4
$$ plain form
7725 12 -59 -198 51 131 91 -204 1 30 339 -119 193 102 -79 88 -8 8 -23 -27 -78 -107 185 -83 -116 125 120
7750 120 41 100 201 -51 37 -65 31 14 -7 -97 49 -87 -93 -132 -84 211 78 282 -75 -281 57 -54 95 43
7774 43 -250 -85 -218 -283 226 -71 3 -124 -91 124 12 44 -27 64 -123 -177 10 -67 86 -163 -39 -197 -241
7797 -241 48 -45 113 -195 50 -91 46 40 -28 78 -109 -270 22 36 22 -169 94 20 156 -278 -132 146
7819 146 112 414 -133 314 -71 -48 159 -77 13 27 -22 -65 100 133 93 50 66 -148 115 98 -290 27 -156 -161
7843 -161 15 -195 -97 -70 -149 -51 -71 -26 202 203 -168 -195 -118 -145 16 123 120 -156 186 92 -13 138 111 -205 -13
7868 -13 122 138 77 -176 232 89 -182 -29 -252 189 -181 -98 44 -275 -169 -149 -66 -46 -327 232 34 -46 78
7891 78 75 -170 40 -90 -122 -89 28 -161 -141 71 132 77 -203 -236 145 68 106 72 43 51 -240 -99 -52 -344 -106
$$ packed form
7725A2p1j39K49Q0m0k95K05K9L09m58L12r1j81J67r6J6l1mn1k9K92k68l3K41n
7750A20p9N9J01k52Q8j02R6j7k1r0J46j36ol9M8K95j33K04l57k06L38j11J49n2
7774D3k93J65j33o5N09k97P4j27L3K15j12L2p1R1j87n4J87p7J53k49J24j58m4
7797b41K89r3J58l08K45j41J37oo8J06j87j61K92J4j4j91K63p4J36m34J46K78
7819A46l4L02n47M47l85K3K07k36R0J4m9m3J65L3m0m3J6k14K63j7l88L17j83n
7843a61J76k10R8K7p9R8k0M5K28Jl71k7P7k7J61J07lk76L42r4j05J51k7l16J92
7868a3J35J6o1k53M08j43k71J53k23M41l70Q3J42l19J06K0Q3K0k81N59j98q0J24
7891G8lk45K10j30l2L3J17j89K0K12O1n5k80l3L81p7L8l4k9Qk91J41M7k92K38
$$ plain form
7916 -106 -509 41 4 155 -270 -186 -126 -85 59 -62 168 44 12 267 25 294 -2 -187 -259 72 169 27
7938 27 37 -75 89 121 -264 -17 38 140 -47 181 -135 -145 -344 -87 -12 121 194 62 -106 -7 -63 -167 204
7961 204 -48 -7 99 122 -137 1 -98 90 100 -6 -313 -106 -38 39 20 -64 57 -30 133 -83 24 20 -158 -31
7985 -31 -193 124 189 -177 -93 82 -8 71 35 111 -277 262 75 -147 -54 163 -37 35 164 114 101 27 64 -195
8009 -195 92 -238 2 29 -139 264 79 -51 -150 -265 255 245 114 -18 94 227 22 -117 142 -138 -176
8030 -176 -65 173 105 -147 175 -120 -199 209 160 88 -93 90 -123 178 103 -51 111 -78 -121 45 -141 -11
8052 -11 -126 -72 -50 72 145 54 79 -158 279 124 97 41 -84 103 -75 5 -53 -165 67 -54 -1 -60 -50 301
8076 301 176 84 -90 -114 48 -163 -170 -56 100 25 -167 -225 -181 -299 209 50 -88 -31 36 25 -43 167 198 -83
$$ packed form
7916a06m03N50l7J51m25Q4O0M1J44j21K30j24l2K55k42K69k96j85p2L31R7j42
7938B7J0j12J64L2l85K47N5J02j87K28l16j0j99K57P5J33P3j32j68R9n6j04L71
7961B04k52M1J06K3k59J38r9J88J0j06l07K07O8P7j9q4J21q7J63k16J07mj78J27
7985c1j62L17O5l66Q4J75r0P9l6P6l88N39j87k22R3K17k00P2J29n0j3p4L7k59
8009a95K87l30K40K7j68M03j85j30r9j15N20j0j31j32J12J33k05j39K59k80l8
8030a76J11K38o8k52L22k95p9M08m9p2j81J83k13L01p5j54J62j89m3J66j86J30
8052a1j15N4K2J22P3r1K5k37M37j55k7n6j25J87j78Q0n8j12K32j21N3n9J0L51
8076C01j25r2j74k4J62k11pJ14J56p5j92n8M4j18N08j59j38N7O7j1o8K10L1k81
$$ plain form
8100 -83 -162 99 -28 9 260 180 115 18 -2 39 -145 52 7 -108 140 153 -132 71 109 4 -69 -67 -59 15 184 -76
8126 -76 137 62 -110 -2 144 91 -41 -55 -115 -34 42 -93 -155 -146 -167 -158 30 5 83 -99 -50 -28 -183 27 33 -93
8152 -93 -111 -346 -92 -44 -52 -14 -45 -167 67 -30 180 -33 -88 194 -54 -42 -219 10 209 -47 182 3 -223
8175 -223 -98 108 51 -51 -217 58 108 116 189 -1 235 -38 145 83 -76 11
$$ packed form
8100h3p9K61j27L7K51q0o5r7k0M1j84J97m5j15K48J3k85K03L8j05p3KQP4J69k60
8126g6K13p5j72J08J46n3j32j4o0Q1P6j35o2Rk1RJ88k5P8j82M9K2j55K10Oj26
8152i3j8k35K54M8qL8l1j22K34r7K10k13n5K82k48J2j77K29J99k56K29j79k26
8175b23J25K06n7j02j66K75N0QP3j90K36k73J83o2j59Q7
8191A1
$$ Imaginary data points
##PAGE= N=2
##DATA TABLE= (X++(I..I)), XYDATA
$$ plain form
0 0 0 0 0 0 0 0 0 0 0 0 0 0 0 0 0 -8 8 -8 8 -8 10 -16 16 -18 24 -25 32 -35 40 -48 56 -63 72 -80 89 -101 113
37 113 -128 142 -158 176 -192 216 -238 264 -290 320 -354 389 -429 471 -520 574 -632 701 -777
56 -777 863 -961 1080 -1219 1388 -1599 1866 -2218 2716 -3458 4690 -7096 13555 -68418 -173466
71 -173466 -10721 52705 6777 19836 92696 108493 92509 58499 58472 89346 61828 -26925
83 -26925 -29848 23909 8048 -29603 -5493 -219 -32645 -49156 -65938 -90138 -72722 -47748 -61393
96 -61393 -63673 -15984 20638 21772 25072 38060 48761 52514 25810 6621 48536 80813 38722
109 38722 13961 56986 67408 6813 -29464 -12567 -13855 -49586 -75787 -65216 -30208 -24047
121 -24047 -51856 -38212 1291 -16453 -44322 -12927 15311 -453 342 31763 47251 44619 45348
$$ packed form
0@%%%%%%%%%%%%%%%qJ6j6J6j6J8k6L2l4M2m9N7o7P5q8J04j19J35j52J69j90K14
37A13k41K70l00L34l68M08m54N02n54O10o74P43q18R00r91J094j206J333j478
56g77J640j824K041k299K607k987L465m084M934o174Q148j1786K0651q1973j05048
71a73466J62745O3426m5928J3059P2860J5797j5984l4010k7L0874k7518q8753
83b6925k923N3757j5861l7651K4110N274l2426j6511j6782k4200J7416K4974j3645
96f1393k280M7689L6622J134L300J2988J0701L753k6704j9189M1915L2277m2091
109C8722k4761M3025J0422o0595l6277J6897j288l5731k6201J0571L5008O161
121b4047k7809J3644L9503j7744k7869L1395K8238j5764P95L1421J5488k632P29
$$ plain form
134 45348 47222 48270 41190 17180 3058 8890 2933 -10398 -10589 -12290 -20533 -20286 -22669 -39801
148 -39801 -44605 -27857 -24211 -40598 -32684 1767 16641 3514 -164 24076 41954 22442 -334
161 -334 17959 44024 26848 -1893 12606 40893 22684 -12513 -8536 6993 -8572 -35041 -33430
174 -33430 -14377 -14213 -30371 -25734 -3544 -426 -11782 -8932 2576 922 -3824 4694 13322 14626
188 14626 18813 24020 21978 15826 14517 14615 4905 -6741 -4483 -216 -9970 -17055 -5267 4563 -7990
203 -7990 -22334 -12327 -427 -14081 -28577 -12351 10850 4784 -10355 5412 30721 21909 -3015
216 -3015 54 19361 12825 -10451 -8695 14498 16427 -2807 -6024 8200 8096 -9244 -18128 -10698
230 -10698 -8011 -14211 -12907 -3177 1484 2854 6514 5393 -748 -443 4768 -410 -6658 903 12073
$$ packed form
134D5348J874J048p080k4010j4122N832n957j3331j91j701q243K47k383j7132
148c9801m804J6748L646j6387P914L4451J4874j3127l678K4240J7878j9512k2776
161c34J8293K6065j7176k8741J4499K8287j8209l5197L977J5529j5565k6469J611
174c3430J9053J64j6158M637K2190L118j1356K850J1508j654m746Q518Q628J304
188A4626M187N207k042o152j309R8r710j1646K258M267r754p085J1788R830j2553
203g990j4344J0007J1900j3654j4496J6226K3201o066j5139J5767K5309q812k4924
216c015L069J9307o536k3276J756K3193J929j9234l217J4224j04j7340q884P430
230a0698K687o200J304R730M661J370L660j121o141L05N211n178o248P561J1170
$$ plain form
245 12073 10158 2485 6085 15987 8266 -10961 -11464 1374 -3728 -18515 -10180 9469 7251 -7554
259 -7554 -2718 11209 5361 -12897 -12469 4003 5852 -8222 -5720 15364 18637 786 -4087 8731
273 8731 7602 -8875 -14064 -3049 2579 -3265 -4681 2198 6777 2433 -3261 -3685 -4234 -5126 -3027
288 -3027 -1300 -1690 3433 12258 10167 112 1066 9824 3215 -11709 -8936 4705 3964 -7640 -5273
303 -5273 8991 8399 -7532 -11379 1119 2299 -12888 -13326 4195 8580 -2670 -2266 11758 13062
317 13062 -609 -4599 4958 6067 -4194 -6313 4783 9475 1048 -3214 4060 4528 -6007 -9718
331 -9718 -4755 -3835 -7996 -5675 -223 285 98 3836 3751 -1245 -1764 3415 3149 -2895 -1368 9058 11228
348 11228 1089 -578 9744 9297 -6183 -10757 549 2398 -9884 -11804 1426 5964 -4558
$$ packed form
245A2073j915p673L600R902p721j9227n03J2838n102j4787Q335J9649k218j4805
259g554M836J3927n848j8258M28J6472J849j4074K502K1084L273j7851m873J2818
273H731j129j6477n189J1015N628n844j416O879M579m344n694m24n49q92K099
288c027J727l90N123Q825k091j0055R54Q758o609j4924K773J3641p41j1604K367
303e273J4264n92j5931l847J2498J180j5187m38J7521M385j1250M04J4024J304
317A3062j3671l990R557J109j0261k119J1096M692q427m262P274M68j0535l711
331i718M963R20m161K321N452N08j87L738q5m996n19N179k66o044J527J0426K170
348A1228j0139j667J0322m47j5480m574J1306J849j2282j920J3230M538j0522
$$ plain form
361 -4558 -8667 460 3976 -5645 -10243 -842 5299 -971 -2409 7409 11942 4492 1889 7337 6865
376 6865 -1556 -3287 1617 1748 -2772 -2415 2271 1579 -3867 -4548 -1762 -5326 -9702 -6859 -1544 -4091
392 -4091 -4688 3337 7975 2361 -419 6216 7753 -1241 -4442 4185 9101 1273 -2660 6962 11574
407 11574 531 -7712 -1433 2733 -7534 -13705 -5195 2345 -3239 -7162 241 4923 -656 -5570
421 -5570 -1760 1748 -1315 -2543 3239 7319 5393 5119 8447 6608 821 23 2021 -1796 -6198 -2813
437 -2813 1822 -888 -4249 -632 2692 -3622 -9244 -5208 -418 -5275 -8241 162 7428 3223 -735
452 -735 6237 10978 2741 -4481 1035 7153 523 -4827 2757 9522 3170 -4195 -201 3332 -3420
467 -3420 -10840 -7441 -2089 -4090 -6655 -1570 4026 1711 -1228 1327 2031 -1679 -1694 2309 2575 900
$$ packed form
361d558m109R127L516r621m598R401O141o270j438R818M533p450k603N448m72
376F865q421j731M904J31m520L57M686o92n446o81K786l564m376K843N315k547
392d091n97Q025M638n614k780O635J537q994l201Q627M916p828l933R622M612
407A1574j1043q243O279M166j0267o171Q510P540n584l923P403M682n579m914
421e570L810L508l063j228N782M080j926k74L328j839n787p98J998l817m402L385
437b813M635k710l361L617L324o314n622M036M790m857k966Q403P266m205l958
452g35O972M741q237p222N516O118o630n350P584O765o352p365L994L533o752
467c420p420L399N352k001k565N085N596k315k939K555P04l710j5M003K66j675
$$ plain form
483 900 4418 8545 6256 1842 2679 4699 -709 -7484 -5021 793 -1863 -7145 -2357 4658 44 -7106
499 -7106 -3833 1714 -2941 -8994 -3818 3998 2665 -978 4227 10359 6203 -910 1019 5518 1376
514 1376 -4584 -622 4873 1702 -2015 821 3498 -1280 -5912 -4957 -3514 -5516 -6254 -2470 662 -73
530 -73 -215 3738 3862 -532 -548 3478 2014 -2433 773 7812 5970 194 2013 6384 2532 -5125 -5232
547 -5232 -128 -1528 -7257 -5711 1755 1758 -4519 -3250 2712 247 -5999 -3548 2444 1365 -1095 2641
563 2641 6827 5374 2022 3291 4811 1436 -3024 -1333 2253 -721 -3598 454 3088 -1466 -4349
578 -4349 -1246 -1281 -5683 -6337 -1890 157 -2253 -1428 3696 5154 1082 -239 4079 4216 -1855 -1822 4394
595 4394 4540 -866 -227 5510 3811 -2772 -3435 -141 -1849 -6691 -6169 -1023 1 -3341 -1790 3095
$$ packed form
483I00L518M127k289m414Q37K020n408o775K463N814k656n282M788P015m614p150
499g106L273N547m655o053N176P816j333l643N205O132m156p113J929M499m142
514A376n960L962N495l171l717K836K677m778m632R55J443k002p38L784L132p35
530g3j42L953J24m394j6M026j464m447L206P039j842n776J819M371l852p657j07
547e232N104j400n729J546P466Lo277J269N962k465o246K451N992j079k460L736
563B641M186j453l352J269J520l375m460J691L586k974k877M052K634m554k883
578d349L103l5m402o54M447K047k410Q25N124J458m072j321M318J37o071L3O216
595D394J46n406O39N737j699o583o63L294j708m842N22N146J024l342J551M885
$$ plain form
611 3095 1669 -2535 -1384 2329 -104 -3011 1101 5363 2816 1378 4898 6083 1894 -1894 -259
626 -259 1356 -2702 -5480 -1677 2145 -1338 -4080 471 2312 -3050 -5765 -1794 111 -3163 -3157 2272
642 2272 4833 2557 1589 4683 5180 226 -2243 1599 2403 -2034 -2330 3227 3674 -1356 -1436 1333 -579
659 -579 -5370 -4822 -2250 -2270 -3844 -1452 2779 2265 -456 1089 3822 628 -2940 91 3683 1130
675 1130 -1090 3727 6419 2039 -1170 972 2097 -2442 -6099 -2954 320 -1817 -4033 -4 3422
690 3422 -615 -3530 -496 757 -2564 -3705 912 2809 1013 1261 4720 5410 1207 -434 1457 1505
706 1505 -2678 -3155 1411 1509 -1781 -1279 2333 807 -3612 -3748 -630 -1861 -4676 -2619 2028 1875 -213
723 -213 1581 4540 2445 -1216 -35 2669 119 -2377 804 4088 1929 -794 988 2535 -1040
$$ packed form
611C095j426m204J151L713k433k907M112M262k547j438L520J185m189l788J635
626b59J615m058k778L803L822l483k742M551J841n362k715L971J905l274ON429
642B272K561k276r68L094M97m954k469L842Q04m437k96N557M47n030q0K769j912
659e79m791N48K572k0j574K392M231n14k721J545K733l194l568L031L592k553
675A130k220M817K692m380l209K142J125m539l657L145L274k137k216M029L426
690C422m037k915L034J253l321j141M617J897j796K48L459O90m203j641J891M8
706A505m183m77M566R8l290N02L612j526m419j36L118j231k815K057M647j53k088
723b13J794K959k095l661J181K704k550k496L181L284k159k723J782J547l575
$$ plain form
738 -1040 -4325 -2477 -833 -3031 -4342 -432 2018 -129 -1482 1633 2452 -1124 -2508 729 1858
753 1858 -700 -352 3853 4791 1060 3 2862 2003 -2920 -3417 187 163 -3034 -2471 1559 1805 -1924
770 -1924 -2151 870 33 -3599 -3125 1000 1235 -952 1053 4417 3391 48 1121 2490 206 -2393
786 -2393 -1029 1730 311 -1645 379 2620 -271 -2828 -1068 22 -2897 -4495 -1289 1472 -368
801 -368 -1118 2310 3646 598 -1408 1168 1988 -1327 -2096 1954 3452 227 -503 2649 2815 -1635 -3335
818 -3335 -313 -209 -3784 -3568 244 1324 -1172 -882 1626 1243 -1879 -1819 686 361 -1672 171 3666
835 3666 2590 470 1950 3333 732 -2238 -997 970 -1387 -3270 -582 2337 229 -2449 -27
850 -27 1281 -1686 -4115 -1511 998 -1194 -1753 1560 3861 1623 -261 2174 2759 -400 -1968 469
$$ packed form
738a040l285J848J644k198j311L910K450k147j353L115Q19l576j384L237J129
753A858k558L48M205R38l731j057K859q59m923m97L604k4l197N63M030K46l729
770a924k27L021q37l632M74M125K35k187K005L364j026l343J073J369k284k599
786b393J364K759j419j956K024K241k891k557J760J090k919j598L206K761j840
801c68p50L428J336l048k006K576Q20l315p69M050J498l225p30L152J66m450j700
818c335L022J04l575K16L812J080k496K90K508l83l122O0K505l25k033J843L495
835C666j076k120J480J383k601k970J241J967k357j883K688K919k108k678K422
850b7J308k967k429K604K509k192n59L313K301k238j884K435N85l159j568K437
$$ plain form
866 469 1808 -465 -1252 1544 2540 -530 -1950 -20 -256 -3332 -3846 -610 -97 -2184 -604 2539 2242
883 2242 -643 3 2004 650 -1863 -636 2245 1744 -374 1555 3875 1965 -1681 -825 1069 -1668
899 -1668 -4027 -2143 851 -315 -2152 -84 2129 10 -2392 -1094 486 -872 -1966 531 2961
914 2961 1452 659 2984 3359 388 -1056 582 642 -1746 -1940 939 1762 -646 -1187 1202 482 -3117
931 -3117 -3549 -634 -356 -3004 -1720 1982 2254 -164 498 2965 1933 -1151 -1269 1563 1294 -1095 266
948 266 3058 2508 -725 -353 1314 -797 -3288 -2494 -881 -1198 -2416 -527 1604 442 -783 382
964 382 1158 -809 -1951 252 1710 120 -118 2714 3645 898 -531 1591 908 -2277 -2850 297 822
981 822 -1627 -1716 1098 1611 -1657 -2492 -167 45 -2835 -2967 1050 1979 -270 469 3343 2777 88 -255
$$ packed form
866D69J339k273p87K796R96l070j420J930k36l076n14L236N13k087J580L143k97
883B242k885O46K001j354k513J227K881n01k118J929K320j910l646Q56J894k737
899a668k359J884K994j166j837K068K213k119k402J298J580j358j094K497K430
914B961j509p93K325L75k971j444J638O0k388j94K879Q23k408n41K389p20l599
931c117m32K915K78k648J284L702K72k418O62K467j032l084j18K832k69k389J361
948B66K792n50l233L72J667k111k491P94J613l17j218J889K131j162j225J165
964C82P76j967j142K203J458j590k38K832R31k747j429K122o83l185n73L147N25
981H22k449q9K814N13l268q35K325K12k880j32M017R29k249P39K874n66k689l43
$$ plain form
999 -255 1397 747 -1402 -718 1430 1447 -413 187 1802 -147 -2624 -1772 -491 -1772 -3055 -934 1109
1016 1109 134 -1051 815 2152 -10 -1325 456 1734 -43 -1151 1598 3430 1150 -297 1698
1031 1698 2109 -1133 -2306 -685 257 -1978 -2390 -121 1130 -727 -1483 414 632 -1835 -2102 224
1047 224 777 -690 171 2412 2218 931 808 2145 1092 -1101 -896 1015 237 -1487 -167 1773 184
1064 184 -1985 -856 568 -1727 -3146 -1661 469 -639 -1479 823 2929 1279 -673 536 2216
1079 2216 327 -1499 499 2256 493 -284 1649 2438 -88 -1553 -539 -496 -2162 -2885 -870 120
1095 120 -1169 -1093 1213 1382 -1017 -1368 560 426 -1224 -433 2093 1870 515 1152 2811 1761 -818
1112 -818 -790 598 -471 -2358 -1301 1388 386 -1470 -443 1182 -392 -2649 -1854 121 -311 -1870
$$ packed form
999b55J652o50k149O84K148J7j860O00J615j949k477Q52J281j281j283K121K043
1016A109r75j185J866J337k162j315J781J278j777j108K749J832k280j447J995
1031A698M11l242j173J621R42k235m12K269J251j857p56J897K18k467k67K326
1047B24N53j467Q61K241j94j287j23J337j053k193K05J911p78j724J320J940j589
1064A84k169J129J424k295j419J485K130j108q40K302K106j650j952J209J680
1079B216j889j826J998J757j763p77J933P89k526j465J014M3j666p23K015R90
1095A20j289P6K306J69k399l51J928j34j650P91K526k23j355O37J659j050k579
1112h18K8J388j069j887J057K689j002j856J027J625j574k257P95J975m32j559
$$ plain form
1128 -1870 -50 2255 1620 86 1348 2299 557 -1343 -6 1184 -172 -954 1003 1865 90 -737
1144 -737 302 132 -2176 -2703 -788 -307 -1680 -1293 1235 1863 -244 -725 1321 1175 -1438 -1022 1298
1161 1298 1296 -86 470 2710 2178 -214 -627 389 -159 -2435 -1930 107 -241 -1699 -633 1017 330
1178 330 -1403 -1132 437 -449 -1624 -239 1727 908 194 1618 2471 994 -456 522 917 -802 -1706
1195 -1706 68 1006 -356 -1146 589 915 -1501 -2280 -788 -261 -1936 -1776 243 1515 316 -93 1497
1212 1497 1729 -92 -529 1068 886 -668 -82 1715 1357 39 -165 1047 89 -1975 -1604 -383 -1400
1229 -1400 -2214 -665 836 376 -934 340 1523 71 -1188 -324 1314 286 -452 1290 2783 1057
1245 1057 -424 365 1276 -686 -1684 -618 426 -846 -1677 145 785 -327 -1252 -371 199 -1283 -1615
$$ packed form
1128a870J820K305o35j534J262R51j742j900J337J190j356p82J957Q62j775q27
1144g37J039j70k308n27J915M81j373L87K528O28k107m81K046j46k613M16K320
1161A298kj382N56K240n32k392m13J016n48k276N05K037l48j458J066J650o87
1178C30j733K71J569q86j175J385J966q19p14J424Q53j477j450R78L95j719r04
1195a706J774R38j362p90J735L26k416p79J492N27j675J60K019J272j199m09J590
1212A497K32j821m37J597j82j554N86J797l58j318k04J212r58k064L71J221j017
1229a400q14J549J501m60j310J274J183j452j259Q64J638j028p38J742J493j726
1245A057j481P89R11j962r98J066J044j272q31J822O40j112r25Q81N70j482l32
$$ plain form
1262 -1615 -98 759 -158 -42 1899 2179 324 -10 1286 464 -841 -708 653 471 -623 -98 1132
1279 1132 715 -1282 -1193 -225 -881 -2244 -1070 425 216 -589 510 1651 651 -762 107 1199 285
1296 285 -907 244 1744 829 -250 938 1630 -131 -1580 -741 -477 -1720 -1933 -469 774 -374
1312 -374 -799 598 700 -856 -1203 187 619 -667 -358 1609 2104 468 698 1508 848 -750 -1027 198
1330 198 114 -1229 -870 881 696 -1021 -962 159 -408 -2036 -1485 62 62 -984 412 1825 1335 105
1348 105 515 1530 340 -1206 -269 829 102 -445 724 1406 137 -1041 -635 -35 -1644 -2121 -701
1365 -701 16 -474 -761 738 1208 -199 -594 642 791 -754 -812 729 1560 261 324 1576 1601 -567
1383 -567 -667 104 -324 -1466 -1495 308 68 -431 -328 483 223 -1054 -916 181 -314 -985 -68 1376 744
$$ packed form
1262a615J517Q57r17J16J941K80j855l34J296q22j305J33J361j82j094N25J230
1279A132m17j997Q9R68o56j363J174J495k09q05J099J141j000j413Q69J092r14
1296B85j192J151J500r15j079J188O92j761j449Q39K64j243k13J464J243j148
1312c74m25J397J02j556l47J390M32j286L09J967M95j636K30Q10o60j598k77J225
1330A98q4j343L59J751j85j717N9J121n67j628N51J547%j046J396J413m90j230
1348A05M10J015j190j546R37J098p27n47J169O82j269j178M06O00j609m77J420
1365g01P17m90k87J499M70j407l95J236J49j545n8J541Q31j299O3J252K5k168
1383e67j00P71m28j142k9J803k40m99J03Q11k60j277J38J097m95o71R17J444o32
$$ plain form
1402 744 294 864 1502 611 -883 248 713 -389 -1108 234 1154 54 -750 186 680 -934 -1800 -635
1420 -635 459 -1022 -1233 554 1472 449 -236 835 1277 -184 -759 373 648 -388 -386 1136 1079 8
1438 8 -319 225 106 -1179 -1319 -126 -97 -1006 -331 810 620 -473 -197 750 218 -1196 -430 737 532
1457 532 -290 680 1702 982 -574 -129 598 -303 -1339 -568 620 -67 -998 94 832 -170 -1148 -639
1475 -639 374 -594 -1320 10 805 106 12 921 1331 163 -163 234 385 -655 -726 453 612 -319 -330
1494 -330 670 361 -1035 -1214 -45 -542 -1452 -910 543 757 -364 381 1203 428 -980 -391 518 227
1512 227 -608 207 1343 913 -147 211 918 130 -1258 -628 527 -339 -786 87 589 -101 -486 -57 222
1531 222 -548 -962 -31 478 -460 -306 1097 1218 476 -99 654 571 -858 -769 89 192 -446 -603 651 780
$$ packed form
1402G44m50N70O38q91j494J131M65j102p19J342R20j100q04R36M94j614q66J165
1420f35J094j481k11J787R18j023o85J071M42j461n75J132K75j036KJ522n7j071
1438Hl27N44j19j285j40J193K9r09O75J141j90j093K76R47n32j414P66J167k05
1457E32q22R70J022p20j556M45P27r01j036P71J188o87r31J092P38j002r78N09
1475f39J013r68p26J330P95o99r4R09M10j168l26L97J51j040p1J179J59r31j1
1494c30J000l09j396j79J169m97r10N42J453K14j121P45Q22p75j408N89R09k91
1512B27q35Q15J136m30j060L58P07p88j388O30J155q66m47Q73N02o90l85M29K79
1531B22p70m14R31N09r38J54J403J21p42n75P53q3j429Q9Q58J03o38j57J254J29
$$ plain form
1551 780 -241 -511 190 -8 -1263 -921 319 210 -417 42 1117 732 -179 -227 547 504 -738 -488 429
1570 429 586 14 249 877 386 -886 -316 221 -711 -1092 -355 340 34 -219 370 758 107 -673 2 306
1590 306 -358 -553 600 882 -157 158 1043 924 -439 -631 67 -98 -781 -939 379 711 -401 -580
1608 -580 559 350 -1079 -1025 -167 104 -701 -354 808 616 47 -65 694 307 -459 -557 339 108 -417 142
1628 142 952 561 -144 -112 299 -228 -1283 -449 139 -269 -580 503 829 135 -296 241 712 -710 -1068
1647 -1068 312 423 -114 -404 934 1232 -115 -488 423 188 -944 -964 208 256 -371 -243 667 535 -420
1666 -420 -757 161 122 -996 -747 454 715 -310 181 931 683 -172 -278 343 41 -595 -419 661 332
1685 332 -482 419 687 -107 -742 -482 -91 -527 -640 54 781 -76 -186 446 673 -342 -626 147 517 -185
$$ packed form
1551G80j021k70P01j98j255L42J240j09o27M59J075l85r11m8P74m3j242K50R17
1570D29J57n72K35O28m91j272N70N37r32l81P37O95l06k53N89L88o51p80O75L04
1590C06o64j95J153K82j039L15Q85j19j363j92O98j65o83j58J318L32j112j79
1608e80J139k09j429N4Q58K71q05L47J162j92n69j12P59l87p66r8Q96k31n25N59
1628A42Q10l91p05L2M11n27j055Q34N88m08l11J083L26o94m31N37M71j422l58
1647a068J380J11n37k90J338K98j347l73R11k35j132k0J172M8o27J28R10j32r55
1666d20l37R18l9j118K49J201K61j025M91P50k48q55j06O21l02o36J76J080l29
1685C32q14R01K68p94o35K60L91m36j13O94P27q57j10O32K27j015k84P73L70p02
$$ plain form
1705 -185 -586 794 1005 -77 -462 485 581 -569 -736 -27 160 -489 -611 128 604 60 -132 426 -16
1724 -16 -629 -562 75 284 -249 18 615 624 -59 170 507 -13 -534 -39 275 -177 -485 205 556 -154 -468
1745 -468 29 351 -588 -911 -166 364 -190 -173 446 848 -48 -530 120 688 -232 -902 -41 594 353 -213
1765 -213 684 596 272 -734 -239 186 -517 -818 118 200 16 -246 289 304 -66 -453 -170 -81 -308 60 634
1786 634 604 138 807 426 31 -494 -163 213 -392 -944 33 718 -16 -414 185 838 -265 -1184 -399 572
1806 572 -316 -740 -41 946 117 -337 386 729 236 -584 66 512 101 -226 126 679 166 -237 -298 -36
1826 -36 -420 -772 -61 -265 -142 60 400 36 -286 373 536 3 -707 -152 728 148 -264 221 1042 268
1846 268 -579 -41 801 -442 -1038 -287 856 130 -719 -229 621 461 -485 -650 402 62 -840 -263 726
$$ packed form
1705a85m01J380K11j082l85R47R6j150j67P09J87o49j22P39M76n44j92N58m42
1724a6o13O7O37K09n33K67N97Ro83K29L37n20n21M95L14m52l08O90L51p10l14
1745d68M97L22r39l23P45N30n54J7O19M02q96m82O50N68r20o70Q61O35k41n66
1765b13Q97q8l24j006M95M25p03l01R36Q2j84k62N35J5l70l87K83Q9k27L68N74
1786F34l0m66O69l81l95n25L31L76o05n52R77O85p34l98N99O53j103r19P85R71
1806E72q88m24O99R87q29m54P23L43m93q20O50M46m11l27L52N53n13m03o1K62
1826c6l84l52P11k04J23K02L40l64l22O59J63n33p10N55Q80n80m12M85Q21p74
1846B68q47N38Q42j243n96P51J143p26q49M90Q50j60r46j65J052l40r02N77R89
$$ plain form
1865 726 302 -122 316 671 260 77 -229 35 109 -228 96 130 325 174 283 67 -293 -351 -11 -284 -850
1886 -850 -148 510 237 -335 64 795 120 -576 -377 625 402 -553 -62 842 613 -438 -217 491 138
1905 138 -936 -522 46 241 -485 -399 356 483 -167 55 243 40 -428 -229 46 306 97 350 434 78
1925 78 108 239 -32 -523 -290 159 -190 -547 -122 500 361 -419 -178 431 175 -594 -761 569 296 -462
1945 -462 -65 635 641 -531 -514 470 415 -738 -760 435 782 -144 -368 258 184 -212 -536 -157 26 -460 -93
1966 -93 159 301 -214 225 154 107 226 240 140 -364 -158 374 503 -46 -117 718 209 -733 -308 133 75 -669
1988 -669 -498 334 328 -485 -346 719 636 -416 -901 255 418 -481 -322 425 697 -78 -291 267 431 -251
2008 -251 -333 -228 157 -60 -141 31 180 105 -250 -99 -232 -227 -264 -71 -67 -146 302 520 -125 -44 365 300 -234 -256
$$ packed form
1865G26m24m24M38L55m11j83l06K64P4l37L24L4J95j51J09k16l60n8L40k73n66
1886h50P02O58k73n72L99P31o75o96J99J002k23r55M91R04k29j051K21P08l53
1905A38j074M14N68J95p26Q6P55J27o50K22J88k03m68J99K75K60k09K53Q4l56
1925G8L0J31k71m91K33M49l49l57M25O22j39p80K41O09k56p69j67J330k73p58
1945d62L97P00Oj172J7R84n5j153k2J195L47r26k24O26p4l96l24L79J83m86L67
1966i3K52J42n15M39p1m7J19J4j00n04K06N32J29n49p1Q35n09r42M25M41n8p44
1988f69J71Q32oq13J39J065q3j052m85J156J63q99J59P47K72p75k13N58J64o82
2008b51q2J05L85k17q1J72J49p5l55J51j33Nl7J93Mp9M48K18o45Q1M09o5n34k2
$$ plain form
2032 -256 27 351 -406 -425 374 587 -279 -212 36 163 -791 -647 123 572 -121 -484 110 628 149 -468 -68
2053 -68 133 -332 -232 52 361 314 117 283 440 -61 -158 -4 -66 -249 3 -10 -79 -49 47 358 -62 -410 -51
2076 -51 -29 -411 -458 282 576 -44 -76 456 618 14 -594 132 450 -242 -596 19 545 -171 -582 31 276
2097 276 -378 -628 -107 283 -53 -218 65 520 61 -160 109 389 -170 -214 -32 225 -31 152 111 293 -120
2118 -120 64 498 -78 -403 -189 114 -390 -306 -89 308 161 -255 -90 578 -288 -356 189 663 145 -335 56
2139 56 389 133 -506 -32 415 -95 -556 -144 436 62 -143 65 87 73 -593 45 144 -40 -372 23 247
2160 247 2 -73 469 332 -105 -54 -32 -165 -362 -268 -25 188 -207 -83 142 119 -571 -324 -18 -399 -392 14
2182 14 558 71 -386 -108 211 87 -222 -2 260 222 -295 309 610 237 -159 -122 332 -115 -199 -368 73
$$ packed form
2032b56K83L24p57j9P99K13q66O7K48J27r54J44P70M49o93l63N94N18m79o17M00
2053f8K01m65J00K84L09m7j97J66J57n01r7J54o2j83K52j3o9L0R6L11m20l48L59
2076e1K2l82m7P40K94o20l2N32J62o04o08P26L18o92l54O15N26p16m11O13K45
2097B76o54k50N21L90l36j65K83M55m59k21K69K80n59m4J82K57k56J83m1J82m13
2118a20J84M34n76l25K14L03n04Q4K17L97j47m16J65O68q66o8N45M74n18m80L91
2139E6L33k56o39M74M47n10m61M12N80l74k05K08K2j4o66O38R9j84l32L95K24
2160B47k45p5N42j37m37N1K2j33j97R4K43K13l95J24K25k3o90K47L06l81PM06
2182A4N44m87m57K78L19j24l09K20K62l8n17O04L01l73l96L7M54m47q4j69M41
$$ plain form
2203 73 22 -12 22 400 154 -442 106 77 -309 -170 -182 155 -202 -3 353 37 17 -29 226 -226 -285 -326 -11
2226 -11 10 -598 -105 249 53 -266 -6 133 59 -405 -252 295 163 62 113 275 325 -307 -312 261 229 -222 -184
2249 -184 354 292 -175 -33 440 40 -224 -282 -14 -269 -264 -316 -101 94 30 -35 105 -40 -369 -6 34 -203 -24
2272 -24 398 400 -103 -307 256 270 -589 -460 251 32 -574 -326 435 124 -320 -413 386 336 -742 -857 -11 135
2294 135 -178 -105 331 673 13 -93 72 235 -368 -65 243 3 125 -9 174 -139 87 -76 -124 -57 -23
2315 -23 -384 15 104 -43 201 133 -136 -48 373 80 -173 -55 247 166 5 11 517 339 -167 -308 14 191
2337 191 -265 -163 -22 431 -34 -55 544 125 132 52 89 31 -233 -78 -48 369 118 123 97 137 -76 -31 37 -113
2361 -113 -160 -87 171 -138 -134 -15 162 36 -419 -264 83 -220 -196 29 349 -36 -245 103 148 -109 -248 -1
$$ packed form
2203G3n1l4L4L78k46n96N48k9l86J39j2L37l57J99L56l16k0m6K55m52n9m1L15
2226a1K1o08M93L54j96l19K60J39p4m64J53N47j32j01N1J62N0o32nN73l2m51L8
2249a84N38o2m67J42M73m00k64n8K68k55Nn2K15J95o4o5J40j45l29L63M0k37J79
2272b4M22Kn03k04N63J4q59J29P11k19o06K48P61l11m44r3P99n0j078j15Q46J46
2294A35l13P3M36L42o60j06J65J63o03L03L08k40J22j34J83l13K26j63m8O7L4
2315b3l61L99Q9j47K44o8k69Q8M21k93k53J18L02q1j61ON06j78n06j41L22J77
2337A91m56J02J41M53m65k1N99m19Pq0L7n8k64J55L0M17k51Nk6M0k13M5O8j50
2361a13m7P3K58l09MJ19J77j26m55J55L47l03K4K25L20l85k09L48M5k57j39K47
$$ plain form
2383 -1 157 -154 -204 177 172 -2 -193 198 -7 -147 -168 -158 169 -100 20 162 423 -272 -148 -24 15 -42 2
2406 2 -9 91 -178 158 34 -228 -133 -136 419 -255 -497 -88 204 117 -121 262 283 16 -136 -74 212 -47 -305
2429 -305 -35 314 -30 -36 305 373 231 -441 161 213 -233 23 2 158 25 -200 221 29 -389 -165 122 -74
2451 -74 -162 -3 42 -47 225 116 506 -142 -99 239 228 -33 -299 -89 388 17 -187 112 -26 -127 -298 22
2473 22 32 -150 -498 72 456 254 -142 -30 191 -283 -155 -51 27 -376 106 104 236 47 -213 -119 62 17
2495 17 -232 -16 56 -172 -320 249 137 -253 53 152 -90 -319 12 306 76 -312 68 592 0 -41 -148
2516 -148 219 166 -147 30 24 -210 -99 33 194 -233 -207 209 204 91 -458 97 -81 -89 -48 151 180 144 -134 172
2540 172 467 -115 -38 -50 148 -186 -36 550 313 -400 -359 -15 -1 -252 -379 -34 -95 61 38 -32 33 60 -311
$$ packed form
2383aJ58l11n0L81nj74j91L91k05j40k1J0L27k69J20J42K61o95J24J24L9n7M4
2406Bj1J00k69L36j24k62R5lN55o74k42M09K92q7k38L83K1k67j52O2K86k59k58
2429c05K70L49l44oL41O8j42o72O02N2m46K56k1J56j33k25M21j92m18K24K87j96
2451g4q8J59M5q9K72j09L90o48M3L38j1k61k66K10M77l71k04K99j38j01j71L20
2473B2J0j82l48N70L84k02l96J12K21m74J28J04P8m03M82kJ32j89k60R4J81m5
2495A7k49K16P2k28j48N69j12l90L06R9k42k29L31K94k30l88L80N24n92m1j07
2516a48L67n3l13J77ok34J11J32J61m27K6M16nj13n49N55j78qM1J99K9l6k78L06
2540A72K95n82P7j2J98l34J50N86k37p13M1L44J4k51j27L45o1J56k3p0O5K7l71
$$ plain form
2563 -311 82 -123 -226 1 151 315 125 -64 86 123 -261 -32 -94 -131 -99 -160 87 64 -279 -29 -123 -79 -177
2586 -177 -43 257 48 -70 225 156 88 -162 29 116 -49 -367 -35 387 -72 -120 130 245 46 -13 -40 39
2608 39 -193 -100 77 -284 -116 60 -81 0 173 4 255 127 -208 118 -104 -197 -257 163 134 -63 -291 72
2630 72 62 124 -248 -100 -15 -154 -8 -41 255 25 -155 22 288 -18 -146 -125 104 9 -12 234 368 11 40
2653 40 174 23 -51 -159 -13 -297 -77 -224 15 290 -72 -71 4 122 -136 30 31 213 104 -67 273 153
2675 153 74 -98 288 32 -57 -50 115 -27 -17 17 -148 -130 -162 -67 29 109 -44 -253 247 340 -113 -73 -218 -115
2699 -115 -183 -74 55 25 -54 233 220 85 75 181 114 -89 -124 -164 67 -7 -303 -108 120 43 -213 -4 -242
2722 -242 -18 -326 368 -87 -193 -84 165 78 -276 -174 -165 71 -269 -182 179 213 -158 13 -45 194 -89 53
$$ packed form
2563c11L93k05j03K27J50J64j90j89J50L7l84K29o2l7L2o1K47k3l43K50r4M4r8
2586a77J34L00k09j18K95o9o8k50J91Q7j65l18L32M22m59m8K50J15j99n9k7P9
2608C9k32R3J77l61J68J76j41Q1J73j69K51j28l35L26k22r3o0M20k9j97k28L63
2630G2j0O2l72J48Q5j39J46l3K96k30j80J77K66l06j28K1K29r5k1K46J34l57K9
2653D0J34j51p4j08J46k84K20j47K39K75l62JP5J18k58J66JJ82j09j71L40j20
2675A53p9j72L86k56q9PJ65j42J0L4j65J8l2R5R6Q0j53k09N00R3m53M0j45J03
2699a15o8J09J29l0p9K87j3j35j0J06o7k03l5m0K31p4k96J95K28p7k56K09k38
2722b42K24l08O94m55j06J09K49q7l54J02RK36l40Q7L61L4l71J71n8K39k83J42
$$ plain form
2744 53 -10 -90 -347 -51 121 31 -206 91 -111 162 -547 -38 236 -66 -207 40 125 184 37 11 210 153 -238
2767 -238 -119 125 6 -5 -156 80 -138 -212 219 214 96 112 30 -73 -195 -130 64 148 -21 -212 -35 271 -132
2790 -132 -127 -15 81 -62 50 63 -115 36 -81 206 -134 -174 -272 44 180 -89 -97 21 -180 -210 55 143 19
2813 19 -240 -132 82 127 -235 -8 294 -154 1 -186 151 102 -89 70 275 304 -286 166 73 -242 56 -9
2835 -9 252 89 100 199 22 -192 28 198 66 76 -302 3 70 -296 85 186 306 -62 72 128 51 -295 -271
2858 -271 135 195 75 -31 258 119 -80 -69 320 -51 -39 38 -53 -102 46 -104 125 114 -196 66 60 -219 -76
2881 -76 -170 67 -17 -121 243 304 -26 -87 27 109 -83 83 104 47 -26 -242 219 206 -355 -83 215 -67 -264
2904 -264 114 -60 26 58 -4 -18 125 -318 -109 137 101 -344 -89 -89 -302 84 -80 153 83 -104 249 74 -113
$$ packed form
2744E3o3q0k57K96J72r0k37K97k02K73p09N09K74l02j41K47Q5N9j47k6J99n7l91
2767b38J19K44j19j1j51K36k18p4M31nj18J6q2j03j22O5J94Q4j69j91J77L06m03
2790a32NJ12R6j43J12J3j78J51j17K87l40m0r8L16J36k69qJ18k01l0K65Q8j24
2813A9k59J08K14M5l62K27L02m48J55j87L37m9j91J59K05K9n90M52r3l15K98o5
2835iK61j63J1R9j77k14K20J70j32J0l78L05O7l66L81J01J20l68J34N6p7l46K4
2858b71M06O0j20j06K89j39j99J1L89l71J2P7r1m9J48j50K29j1l10K62ok79J43
2881g6r4K37q4j04L64O1l30o1J14Q2j92J66K1n7p3k16M61j3n61K72K98k82j97
2904b64L78j74Q6L2o2j4J43m43K09K46l6m45K55%k13L86j64K33p0j87L53j75j87
$$ plain form
2927 -113 -72 -56 323 -341 -45 130 -174 -80 21 -31 -33 -112 -255 164 214 82 -185 0 85 -242 -52 72 -34
2950 -34 162 -37 -149 207 53 -7 72 -222 -83 -196 126 108 113 119 178 189 4 112 71 -133 -15 66 58 45 -2
2975 -2 50 189 -75 -294 114 -16 114 -275 -215 115 132 -26 241 177 -163 -45 -266 315 -172 24 107 17 -112
2998 -112 99 -97 -66 -179 76 -73 -93 -25 51 126 42 11 -22 93 261 -73 -14 39 -142 -339 -64 -76 -151 -70
3022 -70 -87 80 35 -82 76 -15 -25 23 -41 -90 148 77 186 112 12 -96 -139 -111 -101 -170 22 -106 -93 152 274
3047 274 93 46 -77 43 -4 -43 -194 -194 169 -45 29 134 128 173 60 -108 183 77 -18 243 -208 160 248 262
3071 262 124 72 36 79 89 -186 -69 104 26 -182 267 185 -136 -341 -56 -62 46 -157 -153 152 252 30 -243
3094 -243 -149 215 31 -133 4 53 -271 41 102 -129 -182 6 -137 -21 5 -159 70 -15 -27 -195 103 -101
$$ packed form
2927a13M1J6L79o64K96J75l04R4J01n2kp9j43M19N0j32k67J85Q5l27J90J24j06
2950c4J96j99j12L56j54o0P9k94J39j13L22j8NON9J1j85J08m1k04J18Q1qj3m7
2975bN2J39k64k19M08j30J30l89O0L30J7j58K67o4l40J18k21N81m87J96Q3r0j29
2998a12K11j96L1j13K55j49k0O8P6P5q4l1l3J15J68l34N9N3j81j97K75j2p5Q1
3022g0j7J67m5j17J58r1j0M8o4m9K38p1J09p4j00j08m3K8J0o9J92j28J3K45J22
3047B74j81m7j23J20m7l9j51%L63k14P4J05oM5j13j68K91j06r5K61m51L68Q8J4
3071B62j38n2l6M3J0k75J17J73p8k08M49q2l21k05K85oJ08k03ML05J00k22k73
3094b43R4L64j84j64J37M9l24L12O1k31n3J88j43J16K6j64K29q5j2j68K98k04
$$ plain form
3116 -101 -6 -74 217 -68 -27 116 -276 53 -70 152 368 110 38 -31 -69 164 -90 -4 -14 -51 154 80 -28
3139 -28 25 33 122 71 -13 106 142 77 -7 84 68 61 43 12 184 -33 -149 225 -105 -192 -412 51 -52 -124 45 -13
3165 -13 -205 -138 50 54 44 31 -445 -225 -84 -171 189 142 -152 -3 8 65 -45 -68 47 203 209 78 397 237
3189 237 -163 -41 -64 151 -127 25 -289 64 15 -68 -248 144 173 45 78 22 38 83 -66 -104 -98 -240 36 35
3213 35 -238 -79 -53 62 62 70 219 -45 -170 -2 82 188 130 -220 -203 217 -177 -9 34 -147 114 -192 -13
3236 -13 -235 -22 90 -52 -171 -185 138 5 -26 -311 -413 11 -119 221 -28 -45 -12 107 -179 151 -52 105
3258 105 169 282 61 -133 212 -12 223 97 -154 78 -57 108 17 -198 -162 0 179 49 89 47 -64 227
3280 227 98 191 9 -47 20 7 371 358 -87 -23 67 42 -73 -99 228 -7 -90 22 72 -118 -62 -290 21 -232
$$ packed form
3116a01R5o8K91k85M1J43l92L29j23K22K16k58p2o9l8K33k54Q6j0l7K05p4j08
3139b8N3QQ9n1q4J19L6o5q4R1j6pj8l1J72k17j16L74l30q7k20M63j03p2J69n8
3165a3j92O7J88Mj0j3m76K20J41q7L60m7k94J49J1N7j10k3J15J56Oj31L19j60
3189B37m00J22k3K15k78J52l14L53m9q3j80L92K9j28L3n6J6M5j49l8Oj42K76j
3213C5k73J59K6J15%QJ49k64j25J68Q4J06n8l50J7M20l94J68M3j81K61l06J79
3236a3k22K13J12j42j19j4L23j33l1k85j02M24j30L40k49j7L3J19k86L30k03J57
3258A05O4J13k21j94L45k24K35j26k51K32j35J65r1k15L6J62J79j30M0m2j11K91
3280B27j29R3j82n6O7j3L64j3m45O4R0k5j15k6L27k35q3J12N0j90N6k28L11k53
$$ plain form
3304 -232 -170 -222 38 142 14 -239 100 -92 -292 -75 -120 28 -142 -59 54 -7 96 -61 169 121 43 -10 -174
3327 -174 -209 44 18 102 -268 52 156 -70 -53 -243 26 -53 -148 -102 -33 -2 105 -16 -20 65 -318 -82 192 -198
3351 -198 19 -248 -140 -90 -152 -212 120 40 -149 -42 -11 -132 100 -99 -316 23 -114 -131 76 -79 -64 70
3373 70 115 137 -88 26 15 17 -28 93 276 -203 -148 -333 229 -233 -174 152 51 -4 41 174 69 -75 6 58
3397 58 293 61 10 -10 73 194 -51 -142 88 -147 86 113 184 -87 -299 113 -153 -76 220 205 -159 28 42
3420 42 24 -28 -187 167 -69 -162 -27 34 85 -80 170 86 29 267 -60 -105 147 -181 151 201 -28 10 -3 123
3444 123 139 127 -132 319 -71 -57 38 129 214 -67 -293 39 154 1 234 -38 -235 55 139 312 -127 42
3466 42 221 -11 40 140 -58 -33 -102 -20 -31 141 110 30 44 -10 -211 -362 25 25 127 -85 58 -43 -54 -31 -140
$$ packed form
3304b32O2n2K60J04j28k53L39j92k00K17m5J48j70Q3J13o1J03j57K30m8p8n3j64
3327a74l5K53k6Q4l70L20J04k26J7j90K69p9r5M6O9L1J07j21mQ5l83K36K74l90
3351a98K17k67J08N0o2o0L32q0j89J07L1j21K32j99k17L39j37j7K07j55J5J34
3373G0M5K2k25J14j1Km5J21J83m79N5j85N62m62N9L26j01n5M5J33j05j44Q1N2
3397E8K35k32n1k0Q3J21k45r1K30k35K33K7P1k71k12M12k66P7K96j5l64J87J4
3420D2j8n2j59L54k36r3J35O1N1j65K50q4n7K38l27m5K52l28L32N0k29L8j3J26
3444A23J6j2k59M51l90J4R5R1Q5k81k26L32J15j53K33k72j97K90Q4J73m39J69
3466D2J79k32N1J00j98K5o9Q2j1J72l1q0J4n4k01j51L87%J02k12J43j01j1K3j09
$$ plain form
3491 -140 -98 -45 -56 -3 174 124 91 7 -81 -245 62 -73 58 -82 -162 69 139 -340 -107 374 71 252 -138
3514 -138 -53 6 56 45 -166 60 -147 -245 -66 -112 24 -2 -315 -113 -210 262 31 -7 -103 12 -13 -280 -279 286
3538 286 -5 -115 58 -2 248 -44 -136 -31 97 -355 -157 -250 263 -3 50 -163 58 -17 -88 -62 242 -21
3560 -21 16 -7 124 -90 51 32 48 199 -4 154 184 9 114 333 -136 82 43 -133 55 59 -230 235 140
3583 140 -97 -76 159 2 -168 -68 -23 117 -133 115 101 70 -47 -15 195 36 146 131 -53 1 168 64
3605 64 44 41 -35 152 -139 43 149 -97 -33 -75 -46 -64 76 52 55 70 56 -57 199 113 -337 93 -40 171 112
3630 112 -28 279 118 167 -211 -53 91 86 169 -221 -10 -26 19 -216 -5 107 34 -83 -27 -23 115 -69 87
3653 87 -140 -65 -55 -59 -99 95 67 53 -251 -259 -99 11 164 -44 132 3 -180 45 -184 57 -107 -154 141 29
$$ packed form
3491a40M2N3j1N3J77n0l3q4q8j64L07j35J31j40q0K31P0m79K33M81l03J81l90
3514a38Q5N9N0j1k11K26k07r8J79m6J36k6l13K02r7M72k31l8r6J15k5k67JN65
3538B86k91j10J73o0K50k92r2J05J28m52J98r3N13k66N3k13K21p5p1K6L04k63
3560b1L7k3J31k14J41j9J6J51k03J58L0j75J05K19m69K18l9j76J88Mk89M65r5
3583A40k37K1K35j57j70J00M5J40k50K48j4l1j17L2K10j59J10j5j84N4J67j04
3605F4k0lp6J87k91J82J06k46O4m2K9j8J40k4LJ5j4j13K56q6m50M30j33K11n9
3630A12j40L07j61M9l78J58J44nQ3l90K11j6M5k35K11J12p3j17N6MJ38j84J56
3653H7k27P5J0mm0J94k8j4l04qJ60J10J53k08J76j29j83K25k29K41j64m7K95j12
$$ plain form
3677 29 30 -173 -155 -286 -8 -153 -7 -92 -58 81 159 203 49 -49 4 -259 -38 32 -112 65 145 50 -38 -240 114
3702 114 60 33 -29 -64 186 55 -184 113 257 59 -107 -170 65 -25 -75 -6 -90 -37 -187 63 -171 -178 292 -4
3726 -4 248 220 -48 33 -85 205 -72 94 238 -139 -35 -29 93 -214 32 137 -139 60 -72 -113 115 36 -26
3749 -26 -51 91 -165 -70 97 -18 -10 -198 207 163 -98 -19 13 65 -149 75 70 37 -16 -126 29 39 166 -25 -69
3774 -69 -73 -78 131 -30 76 -15 -72 173 110 32 -10 242 -58 327 114 -31 -173 98 -95 138 66 -119 -213 -169
3798 -169 -44 -160 -127 -85 -64 -103 -127 127 11 -112 246 -32 165 188 -327 271 24 -69 -50 -18 51 -89 129
3821 129 -340 -4 -101 115 96 231 17 96 -9 -116 -149 -129 -39 -61 -69 -81 120 24 128 17 164 3 -162 76
3845 76 232 -93 201 -92 -126 -192 -9 -71 -231 -148 74 -156 95 215 130 -219 35 -84 -95 144 -155 95
$$ packed form
3677B9Jk03J8j31K78j45J46q5L4J39P8M4j54r8N3k63K21P0j44J77Q0r5q8k02L54
3702A14n4k7o2l5K50j31k39K97J44j98j66o3K35r0n0O9q4N3j50K50k34pM70k96
3726dK52k8k68Q1j18K90k77J66J44l77J04OJ22l07K46J05k76J99j32m1K28p9o2
3749b6k5J42k56R5J67j15Qj88M05m4k61P9L2N2k14K24nl3n3j10J55J0J27j91m4
3774f9mnK09j61J06r1n7K45o3p8m2K52l00L85k13j45j42K71j93K33p2j85r4M4
3798a69J25j16L3M2K1l9k4K54j16j23L58k78J97K3n15N98k47r3J9L2O9j40K18
3821A29m69L36r7K16j9J35k14P9j05j07l3K0R0k2qj2K01r6J04j11J47j61j65K38
3845G6J56l25K94k93l4o6J83o2j60Q3K22k30K51J20q5l49K54j19j1K39k99K50
$$ plain form
3867 95 -341 137 -392 200 44 189 168 48 193 -83 -150 -22 -4 163 76 31 122 -119 34 -82 37 -127
3889 -127 -178 -14 110 358 -174 37 -101 34 78 -91 -11 -200 -155 88 111 -49 95 82 5 -232 -152 -223 -5
3912 -5 -59 -153 -132 -114 86 89 -122 -140 8 41 -173 -372 75 -48 16 251 -184 77 -126 -73 -38 18 70 -76 -244
3937 -244 -103 194 154 -28 -140 -71 -109 -4 -134 110 19 63 7 -37 379 22 -101 281 -164 -156 -113 68 -283
3960 -283 -207 63 40 -32 -4 -240 15 -207 -144 -3 103 66 -203 -262 14 -267 -89 109 41 169 -108 -44 137
3983 137 130 140 125 69 -102 158 -121 -40 12 243 72 29 242 37 149 296 -135 -82 -131 -27 -20 17 -196 -18
4007 -18 15 -280 40 -85 -133 -22 -9 -155 55 178 60 -4 161 -180 267 81 -21 107 23 19 181 -238 -1
4030 -1 345 78 324 54 -128 162 -5 153 145 63 -100 22 -163 40 -108 -142 94 58 83 425 -193 -8 58
$$ packed form
3867I5m36M78n29N92j56J45k1j20J45k76o7J28J8J67q7m5R1k41J53j16J19j64
3889a27n1J64J24K48n32K11j38J35M4j69Q0j89M5K43K3j60J44j3p7k37Q0p1K18
3912en4r4K1J8K00Lk11j8J48L3k14j99M47j23O4K35m35K61k03N3L5N6N2j46j68
3937b44J41K97m0j82j12O9l8J05j30K44r1M4n6m4M16l57j23L82m45QM3J81l51
3960b83P6K70k3p2K8k36K55k22O3J41J06l7k69n9K76k81J78J98o8J28k77O4J81
3983A37pJ0j5n6j71K60k79Q1N2K31j71m3K13k05J12J47m31N3m9J04PL7k13J78
4007a8L3k95L20j25m8J11J3j46K10J23j18o4J65l41M47j86j02J28q4mJ62m19K37
4030aL46k67K46k70j82K90j67J58qq2j63J22j85K03j48l4K36l6K5L42o18J85O6
$$ plain form
4053 58 42 -252 -124 -196 144 79 104 181 62 -29 49 207 56 -10 83 -23 -218 164 185 148 86 186 60 263
4077 263 89 -18 14 -98 3 12 -104 -326 48 94 -31 -35 54 -33 110 -170 -28 -43 46 58 24 34 -232 -198 -125
4102 -125 113 38 -28 105 42 -131 -61 159 -41 -74 85 21 83 148 166 250 10 4 280 -238 133 32 12 49 137
4127 137 107 129 -4 102 231 107 40 -92 -125 186 -86 -112 -82 20 223 106 152 -238 -119 -133 -26 121 70
4150 70 -145 -105 -40 109 297 81 21 -49 10 128 -94 -107 108 115 86 -140 -31 169 -83 -30 218 308 192 13
4174 13 -80 -54 -29 -176 -127 -89 -249 -100 68 103 -88 -305 201 -45 -128 -277 -249 -32 17 -100 -103 -43 7 17 -8
4199 -8 4 55 53 362 -13 233 123 247 29 4 -310 146 24 49 143 75 -75 92 45 -41 -39 39 -116 -123 6 213
4225 213 104 -25 68 -127 83 233 -88 -222 -41 -78 -222 -212 -135 -63 -107 27 47 45 -86 7 78 180 -18 28
$$ packed form
4053E8j6k94J28p2L40o5K5P7j19r1P8J58j51o6R3j06j95L82K1l7o2J00j26K03
4077B63j74j07L2j12J01Rj16k22L74M6j25mQ9q7J43k80J42j5Q9J2l4J0k66L4P3
4102a25K38p5o6J33o3j73P0K20k00l3J59o4O2O5J8Q4k40oK76n18L71j01k0L7Q8
4127A37l0K2j33J06J29j24o7j32l3L11k72k6L0J02K03j17M6l90J19j4J07J47n1
4150G0k15M0O5J49J88k16o0p0N9J18k22j3K15Pk9k26J09K00k52N3K48R0j16j79
4174A3r3K6K5j47M9L8j60J49J68L5j91k17N06k46q3j49K8K17M9j17lO0N0J0k5
4199hJ2N1kL09l75K46j10J24k18k5l14M56j22K5R4o8j50J67m7q6KP8j55pJ29K07
4225B13j09j29R3j95K10J50l21j34J81l7j44J0P7P2m4J34K0kj31R3P1J02j98M6
$$ plain form
4249 28 -93 34 102 -128 -6 -185 102 72 -93 -237 -167 -100 24 -273 -39 -122 -140 -38 -249 197 93 -118
4271 -118 -161 -88 -259 33 107 57 -117 58 36 161 274 -128 40 138 -171 152 -100 186 135 -369 -8 -108
4293 -108 115 22 -29 5 331 -219 -104 20 -42 175 -115 -35 -17 -58 -34 226 130 -164 -139 -141 -104 63 -174 122
4317 122 13 36 171 148 150 60 11 -143 -166 -47 -208 -89 -37 -121 111 33 -106 70 246 -126 256 32 -189
4340 -189 -73 44 265 75 147 -104 77 -131 -36 -188 123 -118 19 -75 201 -22 -22 214 -85 -198 -174 -76
4362 -76 -122 -20 38 -29 341 201 -54 -83 114 -50 -101 165 -43 -151 -195 108 162 -113 -71 -16 -72 87 -125 -114
4386 -114 19 -24 256 -178 -146 78 123 80 -37 20 -121 -151 -95 -327 -231 161 250 -11 -128 -255 183 183 -58 -54
4410 -54 177 60 127 -222 108 56 336 -192 69 -171 77 -15 -120 -112 -125 304 -228 65 58 3 22 -236 -470 77
$$ packed form
4249B8j21J27O8k30J22j79K87l0j65j44P0O7J24k97K34q3j8J02k11M46j04k11
4271a18m3P3j71K92P4n0j74J75k2J25J13m02J68R8l09L23k52K86n1n04L61j00
4293a08K23r3n1L4L26n50J15J24o2K17k90Q0J8m1K4K60r6k94K5kL7J67k37K96
4317A22j09K3J35k3Kr0m9j54k3J19j61J19N2q4K32p8j39J76J76l72L82k24k21
4340a89J16J17K21j90P2k51J81k08R5j52L11k41J37r4K76k23%K36k99j13K4R8
4362g6m6J02N8o7L70j40k55k9J97j64n1K66k08j08m4L03N4k75M2N5n6J59k12J1
4386a14J33m3K80m34L2K24M5m3j17N7j41l0N6k32R6L92Q9k61j17j27M38%k41M
4410e4K31j17O7l49L30n2K80n28K61k40K48r2j05Qj3M29n32K93pn5J9k58k34N47
$$ plain form
4434 77 -119 -35 276 105 54 5 12 -22 -71 179 -19 -353 133 -45 12 210 68 -64 -65 -55 97 140 404 18
4458 18 127 227 -19 -74 164 230 -104 -19 240 -36 69 235 -87 -117 1 -23 270 -177 106 103 -112 -251 -3
4481 -3 159 -220 104 122 -62 250 -138 -156 258 72 -223 30 14 96 8 66 -105 -96 68 -86 -24 63 33 -294
4505 -294 74 87 -59 185 102 55 84 149 117 -22 191 -5 10 -106 90 52 -73 232 39 138 -67 -174 -412
4528 -412 -95 -157 -211 -60 334 -89 246 81 86 122 57 223 -29 -61 165 -219 -71 34 92 1 -205 78 -137
4551 -137 58 44 -58 -13 182 23 26 191 41 -30 -127 62 -171 -231 -116 -7 231 74 -45 48 -2 -113 59
4574 59 -74 -67 128 -184 177 28 -79 72 5 143 -35 200 20 352 -117 25 -50 -147 -36 46 -106 -17 180
4597 180 -296 9 1 -274 21 -134 188 -39 -167 24 -148 68 -225 76 -17 11 58 3 159 188 61 -86
$$ packed form
4434G7j96Q4L11j71n1m9Pl4m9K50j98l34M86j78N7J98j42j32jJ0J52M3K64l86
4458A8J09J00k46n5K38O6l34Q5K59k76J05J66l22l0J18k4K93m47K83lk15j39K48
4481cJ62l79L24J8j84L12l88j8M14j86k95K53j6Q2q8N8j71RJ64j54O2Q7l0l27
4505b94L68J3j46K44q3m7K9O5l2j39K13j96J5j16J96l8j25L05j93R9k05j07k38
4528d12L17o2n4J51L94m23L35j65NL6o5J66k52l2K26l84J48J05N8r1k06K83k15
4551a37J95j4j02M5J95j59LJ65j50p1r7J89k33o0J15J09K38j57j19R3n0j11J72
4574E9j33PJ95l12L61j49j07J51o7J38j78K35j80L32m69J42p5r7J11Q2j52Q9J97
4597A80m76L05qk75K95j55L22k27j28J91j72K16k93L01r3K8M7n5J56K9j27j47
$$ plain form
4619 -86 -139 200 74 -125 232 176 94 189 182 141 -165 266 46 31 -135 -98 124 -74 256 -204 71 -70 152
4642 152 -108 58 194 -44 16 205 11 -186 350 123 -18 186 -43 -143 -209 -12 282 -117 231 -70 -13
4663 -13 -435 213 180 83 -51 -323 127 -76 -105 40 -48 65 1 111 -134 34 93 -507 53 -75 -52 -19 -62
4686 -62 -126 -33 75 7 -117 -157 170 102 105 70 -38 28 -96 60 42 54 88 -2 -86 132 -234 -189 -39 -75 -6 -63
4712 -63 -31 136 202 34 155 113 162 120 15 -81 -23 -105 -43 126 -10 -132 -48 -45 -105 154 -103 77 10 74 36 89
4738 89 19 -13 -301 39 309 338 -124 151 127 -6 23 -54 2 -132 128 17 -144 161 265 64 -135 -227 59
4761 59 82 17 74 -294 -101 24 37 -115 168 320 -5 7 -263 55 147 77 106 -91 -282 77 27 -50 -42 82
4785 82 -197 -324 -161 -163 -155 -78 72 264 -17 32 151 60 214 208 -66 -98 71 -23 -230 205 54 130 -250 15
$$ packed form
4619h6n3L39j26j99L57n6q2R5pm1l06M31k20j5j66L7K22j98L30m60K75j41K22
4642A52k60J66J36k38O0J89j94j97N36k27j41K04k29j00o6J97K94l99L48l01N7
4663a3m22O48l3r7j34k72M50k03k9J45q8J13o4J10k45J68N9o00N60j28K3L3m3
4686f2o4R3J08o8j24m0L27o8Ll5j08O6j24J56j8J2L4r0q4K18l66M5J50l6O9n7
4712f3L2J67O6j68J21m2M9m2j05r6N8q2O2J69j36j22Q4Lo0K59k57J80o7O4l8N3
4738H9p0l2k88L40K70K9m62K75k4j33K9p7N6j34K60j11j61L05J04k01j99r2K86
4761E9K3o5N7l68J93J25J3j52K83J52l25J2k70L18R2p0K9j97j91L59n0p7QJ24
4785H2k79j27J63kQP7J50J92k81M9J19r1J54ok74l2J69r4k07M35j51P6l80K65
$$ plain form
4809 15 125 51 79 -82 -162 146 -12 -299 -39 -51 31 -192 306 -41 61 25 101 -65 111 7 28 -54 -121 -24
4833 -24 13 -68 -183 -1 85 94 345 60 -170 18 -174 -34 42 182 48 42 27 -26 173 -53 -193 -3 13 -48
4857 -48 -105 2 -265 -78 -24 229 72 -270 141 -18 10 331 1 -22 195 -151 -10 159 138 28 -53 -123 -172
4880 -172 -68 275 -58 114 160 265 24 72 0 -100 -7 -105 -184 17 -118 -172 -154 81 412 -103 328 -48 55
4903 55 0 -46 -121 48 -109 12 111 134 3 439 115 -81 -225 102 -33 -73 139 242 186 78 -86 -163 -166 1
4927 1 134 -123 77 -229 -96 -58 -1 -248 69 -116 95 -211 -229 -238 -15 15 -84 -89 25 -57 -9 -116 -131 13 122
4952 122 37 -8 -87 20 14 -352 229 39 -10 44 0 -240 129 -72 139 -95 207 79 62 55 -251 43 51 198
4976 198 -31 -95 20 -24 -114 108 -244 55 -76 -16 -47 63 -111 70 248 43 146 144 101 21 79 24 102 -123
$$ packed form
4809A5J10p4K8j61q0L08j58k87K60j2Q2k23M98l47J02l6P6j66J76j04K1q2o7R7
4833b4L7q1j15J82Q6RK51k85k30J88j92J40P6J40j34oj5n3J99k26j40J90J6o1
4857d8n7J07k67J87N4K53j57l42M11j59K8L21l30k3K17l46J41J69k1j10q1p0m9
4880a72J04L43l33J72M6J05k41M8p2j00R3r8p9K01j35n4J8K35L31n15M31l76J03
4903E5n5m6p5J69j57J21R9K3j31M36l24j96j44L27j35m0K12J03n6j08j64p7lJ67
4927AJ33k57K00l06J33L8N7k47L17j85K11l06j8rK23L0r9nJ14q2M8j07j5J44J09
4952A22q5m5p9J07ol66N81j90m9N4m4k40L69k01K11k34L02j28j7pl06K94QJ47
4976A98k29o4J15m4r0K22l52K99j31O0l1J10j74J81J78k05J03km3q0N8n5P8k25
$$ plain form
5000 -123 -154 -91 -106 -242 109 50 -136 197 -37 12 96 -64 204 -49 -101 -80 -216 -211 -65 -5 -307 133 -197 -36
5024 -36 -282 -266 -60 -62 162 -122 153 -114 -65 -17 -129 162 -26 -79 111 33 -31 148 154 -12 -109 25 28 214 236
5049 236 38 -87 67 -204 -64 -35 -63 246 -152 -67 59 243 -341 170 94 -41 24 118 -23 226 -323 -36
5071 -36 -14 -47 -29 -47 42 -79 228 95 -76 -75 6 -4 293 -132 -53 -125 -209 -67 116 -39 -54 -28 106 -152 226
5096 226 208 -150 42 35 78 -73 218 41 -87 188 -122 299 -129 52 -190 35 233 267 54 90 137 -22
5118 -22 -180 -9 169 8 -34 43 86 217 -133 85 17 -184 72 -105 234 90 122 -72 -33 43 100 -3 -61
5141 -61 -227 294 3 -264 25 -42 -113 214 9 48 -81 35 -2 147 3 -86 254 23 -89 -202 -45 -89
5163 -89 -88 38 160 -14 129 33 -19 95 158 -87 119 17 66 -90 -49 108 46 1 33 96 57 -37 44 95 -26
$$ packed form
5000a23l1O3j5j36L51n9j86L33k34M9Q4j60K68k53n2K1j36NJ46O0l02M40l30J61
5024c6k46J6K06kK24k84K75k67M9M8j12K91j88n3J90p8o4J79Oj66r7J34LJ86K2
5049B36j98j25J54k71J40K9k8L09l98Q5J26J84n84N11p6j35O5R4j41K49n49K87
5071c6K2l3J8j8Q9j21L07j33j71JQ1j0K97m25P9p2q4J42J83j55j5K6J34k58L78
5096B26j8l58J92pM3j51K91j77j28K75l10M21m28J81k42K25J98L4k13L6M7j59
5118b2j58J71J78j61m2P7M3J31l50K18o8k01K56j77L39j44L2j94L9P6N7j03n8
5141f1j66N21k91k67K89o7p1L27k05L9j29J16l7J49j44q9L40k31j12j13J57m4
5163h9JJ26J22j74J43r6n2J14O3k45K06j02M9j56M1J57o2m5L2O3l9r4Q1N1j21
$$ plain form
5188 -26 35 266 37 153 148 -117 -85 -78 26 20 -137 161 -173 -50 -179 91 -5 -113 -118 -40 83 75 18 -163 -31
5213 -31 0 -91 78 -157 -168 21 40 -194 34 196 -62 355 -211 -17 26 -204 -154 61 100 101 -20 47 -30 -58
5237 -58 132 141 -156 112 -220 -207 143 -1 -34 -129 124 -53 -149 -75 -154 -16 47 -123 -82 -117 100 -91 140 215
5261 215 26 152 82 106 76 -147 130 237 -446 123 -37 13 -36 12 -241 163 99 -75 65 -23 18 -81 -130 -7
5285 -7 277 292 -54 92 105 -93 379 233 -11 -170 29 79 38 369 134 -160 19 -125 100 -67 175 -125
5307 -125 -129 -97 -199 56 -40 -130 -127 234 -118 82 -78 20 -18 -60 -2 136 -118 -208 110 -30 -86 49 -175 78
5331 78 82 154 -10 -137 97 -125 -41 197 59 -143 -38 -15 -83 -169 46 133 -91 -170 184 238 7 -196 76 186
5355 186 17 -10 -60 -119 15 86 31 -95 79 -181 249 96 -126 -77 -130 -39 54 -134 -105 128 -276 -6 -10 102
$$ packed form
5188b6O1K31k29J16nk65L2PJ04oj57K98l34J23j29K70r6j08nP8J23qn7j81J32
5213c1L1r1J69k35j1J89J9k34K28J62k58M17n66J94M3k30N0K15L9Jj21O7p7k8
5237e8J90Rk97K68l32J3L50j44l3r5K53j77r6P4p9J38O3j70M1l5K17j91K31P5
5261B15j89J26p0K4l0k23K77J07o83N69j60N0m9M8k53M04o4j74J40q8M1r9m9J23
5285gK84J5l46J46J3j98M72j46k44j59J99N0m1L31k35k94J79j44K25j67K42l00
5307a25mL2j02K55r6r0LL61l52K00j60R8l8m2N8J38k54r0L18j40n6J35k24K53
5331G8MP2j64j27K34k22Q4K38j38k02J05K3o8q6K15Q7k24p9L54N4k31k03K72J10
5355A86j69k7n0n9J34P1n5j26J74k60M30j53k22M9n3R1R3j88K9K33m04K70mJ12
$$ plain form
5379 102 100 83 -238 91 23 8 -8 15 41 -243 -40 -42 284 -196 -56 -74 74 338 -220 -21 -72 -85 166 -170
5403 -170 -51 263 45 -57 165 -151 210 8 1 62 121 371 -37 78 102 -79 246 -198 129 229 41 -93
5425 -93 242 -214 28 -83 -61 104 105 46 -39 185 104 64 -53 62 116 -71 115 -45 84 -127 66 26 -77
5448 -77 -329 74 54 -58 87 -78 271 25 -237 64 4 42 271 19 42 -105 58 -73 35 22 105 102 -149
5471 -149 -160 45 -192 102 -9 -179 80 34 50 -149 149 213 108 -1 1 -80 -25 -116 -243 6 13 -181 -144 216
5495 216 -104 193 45 -134 -30 -116 102 96 -71 255 146 104 155 -12 134 132 -7 -54 -40 33 119 11 68 -237
5519 -237 14 -165 290 -102 30 -242 -9 233 -184 236 340 -163 -341 -5 98 -27 -10 5 139 -45 220
5540 220 -161 101 -115 -56 81 -85 159 45 -49 152 103 -69 413 -18 103 -21 14 -99 68 -114 42
$$ packed form
5379A02kj7l21L29o8j5j6K3K6k84K03kL26m80J40j8J48K64n58J99n1j3K51l36
5403a70J19L14k18j02K22l16L61k02pO1N9K50m08J15K4j81L25m44L27J00j88j34
5425i3L35m56K42j11K2J65Jn9q5K24q1m0j17J15N4j87J86j60J29k11J93m0j03
5448g7k52M03k0j12J45j65L49k46k62L01o0L8K29k52K3j47J63j31J08j3Q3lk51
5471a49j1K05k37K94j11j70K59m6J6j99K98O4j05j09Kq1N5r1j27K49Pj94L7L60
5495B16l20K97j48j79J04q6K18oj67L26j09m2N1j67J46kj39m7J4P3Q6j08N7l05
5519b37K51j79M55l92J32k72K33K42m17M20J04n03j78L36J03j25J7J5J34j84K65
5540B20l81K62k16N9J37j66K44j14r4K01m9j72M82m31J21j24L5j13J67j82J56
$$ plain form
5561 42 -9 -121 -63 -70 33 104 122 -270 0 -108 -97 216 48 -162 -35 48 -14 -10 -120 71 18 -60 -84 -215 175
5586 175 -25 -272 -55 -1 201 -109 48 -115 28 269 -84 286 15 258 21 -61 -91 -138 90 105 74 86
5608 86 -286 31 -50 -70 -186 -106 -83 -50 201 211 -156 -117 -43 -156 -129 -29 217 184 9 -134 124 189 49 -112
5632 -112 -34 -117 85 14 -80 43 122 221 -126 138 -158 28 26 67 17 -40 178 -87 -103 -7 -29 -291 216 -39 117
5657 117 -70 -142 48 25 55 65 -16 193 -130 -2 39 -316 -16 -234 -138 -106 93 61 50 -40 122 45 -33 63 249
5682 249 177 -17 -45 247 -3 111 -275 -238 -51 -9 -105 -272 -316 -105 -71 -117 168 -1 68 -156 -49 -175 -190
5705 -190 83 -271 -39 92 -48 -34 -30 -145 120 -26 -103 66 -120 95 -6 27 -35 43 -249 45 101 5 206
5728 206 -200 -334 -99 51 -44 -184 -180 69 -66 -31 -72 152 106 -149 -80 -9 -128 -36 -48 -291 -152 -131 -27 -69
$$ packed form
5561D2n1j12N8pJ03P1J8l92K70j08J1L13j68k10J27Q3o2Mj10J91n3p8k4j31L90
5586A75k00k47K17N4K02l10J57j63J43K41l53L70k71K43k37q2l0m7K28J5l1J2
5608H6l72L17q1k0j16Q0K3L3K51J0l67L9P4j13K7J00K46l3j75j43K58O5j40j61
5632a12P8q3K02p1r4J23P9R9l47K64k96J86kM1n0n7K18k65j6R6k2k62N07k55J56
5657A17j87p2J90k3L0J0q1K09l23J28M1l55L00k18R6L2J99l2j1r0J62p7p8R6J86
5682B49p2j94k8K92k50J14l86L7J87M2r6j67m4K11L4m6K85j69O9k24J07j26j5
5705a90K73l54K32J31j40J4Mj15K65j46p7J69j86K15j01L3o2P8k92K94N6r6K01
5728B06m06j34K35J50r5j40MK49j35L5m1K24m6k55O9P1j19R2j2k43J39K1J04m2
$$ plain form
5752 -69 -20 101 -91 86 -206 124 143 -40 2 -16 -84 -136 -72 27 57 -63 186 13 60 -29 -139 94 -225 -238
5776 -238 45 79 56 -99 -60 80 -153 -207 -91 -120 161 -286 -68 -79 -231 -379 -40 -161 -114 -116 86 -107 108
5799 108 95 94 214 77 -106 -317 -37 -79 -135 41 -117 128 85 6 -142 53 -363 -104 -1 159 -255 -198 40
5822 40 -191 106 113 13 44 32 -26 -86 -126 -115 -168 -78 71 -59 -19 115 -72 86 79 63 332 -252 -143 304 119
5847 119 -29 127 -7 149 153 107 -123 26 161 67 -101 -78 -200 -94 -109 60 224 197 201 18 -197 -137 -8
5870 -8 -9 -39 -127 -98 144 -248 80 174 -102 -123 81 -92 -292 -206 19 125 226 151 -161 -91 51 -140 -177 43
5894 43 86 229 -3 -92 10 -130 42 195 -132 274 -6 -119 102 -324 -59 96 -76 68 -15 -195 -180 22
$$ packed form
5752f9M9J21j92J77k92L30J9j83M2j8o8n2O4R9L0j20K49j73M7q9j10K33l19j3
5776b38K83L4k3j55L9J40k33n4J16k9K81m47K18j1j52j48L39j21M7kK02j93K15
5799A08j3jJ20j37j83k11K80m2n6J76j58K45m3p9j48J95m16K59J03J60m14N7K38
5822D0k31K97Pj00L1j2n8o0m0J1n3R0J49j30M0J34j87J58pj6K69n84J09M47j85
5847A19j48J56j34J56Mm6k30J49J35r4j68K3j22J06j5J69J64k7Mj83k15O0J29
5870hjl0q8K9K42l92L28R4k76k1K04j73k00Q6K25J06J01p5l12P0J42j91l7K20
5894D3M3J43k32q9J02j40J72J53l27M06k80j13K21m26K65J55j72J44q3j80J5K02
$$ [...]
8191D8
##END NTUPLES=NMR FID
##END=
