##TITLE=1H_SR118_0
 D2O
 8 sc, 
 15.04.2022
##JCAMPDX= 6.0         $$ Bruker NMR JCAMP-DX V2.0
##DATA TYPE= NMR FID
##DATA CLASS= NTUPLES
##ORIGIN= UXNMR, Bruker Analytische Messtechnik GmbH
##OWNER= root
$$ XWIN-NMR		Version 3.5
$$ Fri Apr 15 14:03:14 2022 Russian Standard Time (UT+4h)  she@DPX200
##.OBSERVE FREQUENCY= 200.13135
##.OBSERVE NUCLEUS= ^1H
##.DELAY= (6, 6)
##.ACQUISITION MODE= SIMULTANEOUS
##.ACQUISITION SCHEME= undefined
##.AVERAGES= 8
##.DIGITISER RES= 18
##SPECTROMETER/DATA SYSTEM= spect
##.PULSE SEQUENCE= zg30
##.SOLVENT NAME= CDCl3
##.SHIFT REFERENCE= (INTERNAL, CDCl3, 0, 15.7039)
##AUDIT TRAIL= $$ (NUMBER, WHEN, WHO, WHERE, WHAT)
$$ ##TITLE= Audit trail, XWIN-NMR		Version 3.5
$$ ##JCAMPDX= 5.01
$$ ##ORIGIN= Bruker BioSpin GmbH
$$ ##OWNER= she
$$ F:/spectra/data/she/nmr/H-F/1/audita.txt
$$ ##AUDIT TRAIL=  $$ (NUMBER, WHEN, WHO, WHERE, WHAT)
(   1,<2022-04-15 14:02:22.50 +0400>,<she>,<DPX200>,
      <created by zg, POWCHK disabled, PULCHK disabled
       configuration hash MD5:
       00 E9 B6 7A A2 85 ED C7 34 08 36 98 17 FE 4E 26
       data hash MD5: 16K
       EB E9 FD 1E 1E 7E 13 DE 2B AB 1E 5F C0 61 11 86>)
$$ ##END=
$$ 
$$ hash MD5
$$ 30 C2 3B 75 DB 68 E7 B0 81 E1 C6 5E 75 25 9E 9A
##$RELAX= 
##$RELAX= 
##$RELAX= 
##$RELAX= 
##$RELAX= 
##$RELAX= 
$$ Bruker specific parameters
$$ --------------------------
##$DU= <F:/spectra>
##$EXPNO= 1
##$NAME= <H-F>
##$PROCNO= 1
##$TYPE= <nmr>
##$USER= <she>
##$AMP= (0..31)
100 100 100 100 100 100 100 100 100 100 100 100 100 100 100 100 100 100 
100 100 100 100 100 100 100 100 100 100 100 100 100 100 
##$AQSEQ= 0
##$AQ_mod= 1
##$AUNM= <au_zg>
##$AUTOPOS= <>
##$BF1= 200.13
##$BF2= 200.13
##$BF3= 200.13
##$BF4= 200.13
##$BF5= 200.13
##$BF6= 200.13
##$BF7= 200.13
##$BF8= 200.13
##$BYTORDA= 1
##$CFDGTYP= 0
##$CFRGTYP= 5
##$CHEMSTR= <none>
##$CNST= (0..31)
1 1 145 1 1 1 1 1 1 1 1 1 1 1 1 1 1 1 1 1 1 1 1 1 1 1 1 1 1 1 1 1 
##$CPDPRG= <>
##$CPDPRG1= <>
##$CPDPRG2= <>
##$CPDPRG3= <>
##$CPDPRG4= <mlev>
##$CPDPRG5= <mlev>
##$CPDPRG6= <mlev>
##$CPDPRG7= <mlev>
##$CPDPRG8= <mlev>
##$CPDPRGB= <>
##$CPDPRGT= <>
##$D= (0..31)
0 1.2 0 0 0 0 0 0 0 0.06 0 0.03 0 0 0 0 0.0002 0 0 0 0 0 0 0 0 0 0 0 0 
0 0 0 
##$DATE= 1650016941
##$DBL= (0..7)
120 120 120 120 120 120 120 120 
##$DBP= (0..7)
150 150 150 150 150 150 150 150 
##$DBP07= 0
##$DBPNAM0= <>
##$DBPNAM1= <>
##$DBPNAM2= <>
##$DBPNAM3= <>
##$DBPNAM4= <>
##$DBPNAM5= <>
##$DBPNAM6= <>
##$DBPNAM7= <>
##$DBPOAL= (0..7)
0.5 0.5 0.5 0.5 0.5 0.5 0.5 0.5 
##$DBPOFFS= (0..7)
0 0 0 0 0 0 0 0 
##$DE= 6
##$DECBNUC= <off>
##$DECIM= 32
##$DECNUC= <off>
##$DECSTAT= 4
##$DIGMOD= 1
##$DIGTYP= 9
##$DL= (0..7)
0 120 120 120 120 120 120 120 
##$DP= (0..7)
150 150 150 150 150 150 150 150 
##$DP07= 0
##$DPNAME0= <>
##$DPNAME1= <>
##$DPNAME2= <>
##$DPNAME3= <>
##$DPNAME4= <>
##$DPNAME5= <>
##$DPNAME6= <>
##$DPNAME7= <>
##$DPOAL= (0..7)
0.5 0.5 0.5 0.5 0.5 0.5 0.5 0.5 
##$DPOFFS= (0..7)
0 0 0 0 0 0 0 0 
##$DQDMODE= 0
##$DR= 18
##$DS= 0
##$DSLIST= <SSSSSSSSSSSSSSS>
$$ [...]
##$SUBNAM2= <"">
##$SUBNAM3= <"">
##$SUBNAM4= <"">
##$SUBNAM5= <"">
##$SUBNAM6= <"">
##$SUBNAM7= <"">
##$SUBNAM8= <"">
##$SUBNAM9= <"">
##$SW= 18.05172834244
##$SWIBOX= (0..15)
0 0 2 0 0 0 0 0 0 0 0 0 0 0 0 0 
##$SW_h= 3612.71676300578
##$TD= 16384
##$TD0= 1
##$TE= 0
##$TE2= 300
##$TE3= 300
##$TEG= 300
##$TL= (0..7)
0 120 120 120 120 120 120 120 
##$TP= (0..7)
150 150 150 150 150 150 150 150 
##$TP07= 0
##$TPNAME0= <>
##$TPNAME1= <>
##$TPNAME2= <>
##$TPNAME3= <>
##$TPNAME4= <>
##$TPNAME5= <>
##$TPNAME6= <>
##$TPNAME7= <>
##$TPOAL= (0..7)
0.5 0.5 0.5 0.5 0.5 0.5 0.5 0.5 
##$TPOFFS= (0..7)
0 0 0 0 0 0 0 0 
##$TUNHIN= 0
##$TUNHOUT= 0
##$TUNXOUT= 0
##$USERA1= <user>
##$USERA2= <user>
##$USERA3= <user>
##$USERA4= <user>
##$USERA5= <user>
##$V9= 5
##$VALIST= <valist>
##$VCLIST= <CCCCCCCCCCCCCCC>
##$VD= 0
##$VDLIST= <DDDDDDDDDDDDDDD>
##$VPLIST= <PPPPPPPPPPPPPPP>
##$VTLIST= <TTTTTTTTTTTTTTT>
##$WBST= 1024
##$WBSW= 4
##$XGAIN= (0..3)
0 0 0 0 
##$XL= 0
##$YL= 0
##$YMAX_a= 147015
##$YMIN_a= -189451
##$ZGOPTNS= <>
##$ZL1= 120
##$ZL2= 120
##$ZL3= 120
##$ZL4= 120
##$ABSF1= 10
##$ABSF2= 0
##$ABSG= 5
##$ABSL= 3
##$ALPHA= 0
##$AQORDER= 0
##$ASSFAC= 0
##$ASSFACI= 0
##$ASSFACX= 0
##$ASSWID= 0
##$AUNMP= <proc_1d>
##$AZFE= 0.1
##$AZFW= 0.1
##$BCFW= 1
##$BC_mod= 2
##$BYTORDP= 1
##$COROFFS= 0
##$CY= 11.3945322036743
##$DATMOD= 1
##$DC= 2
##$DFILT= <>
##$DTYPP= 0
##$F1P= 2.36226072786647
##$F2P= -0.459571619588291
##$FCOR= 0.5
##$FTSIZE= 0
##$FT_mod= 4
##$GAMMA= 1
##$GB= 0.15
##$INTBC= 1
##$INTSCL= 1
##$ISEN= 128
##$LB= 0.24
##$LEV0= 0
##$LPBIN= 0
##$MAXI= 10000
##$MC2= 0
##$MEAN= 0
##$ME_mod= 0
##$MI= 1.114404
##$NCOEF= 0
##$NC_proc= 0
##$NLEV= 6
##$NOISF1= 3.799351
##$NOISF2= 2.8
##$NSP= 1
##$NTH_PI= 0
##$NZP= 0
##$OFFSET= 15.70392
##$PC= 1
##$PHC0= -18395.62
##$PHC1= 12.00074
##$PH_mod= 1
##$PKNL= yes
##$PPARMOD= 0
##$PSCAL= 0
##$PSIGN= 0
##$REVERSE= no
##$SF= 200.130013532006
##$SI= 16384
##$SIGF1= 3
##$SIGF2= 2
##$SINO= 400
##$SIOLD= 16384
##$SREGLST= <1H.CDCl3>
##$SSB= 0
##$STSI= 0
##$STSR= 0
##$SW_p= 3612.71676300578
##$SYMM= 0
##$S_DEV= 0
##$TDeff= 0
##$TDoff= 0
##$TI= <>
##$TILT= no
##$TM1= 0
##$TM2= 0
##$TOPLEV= 0
##$USERP1= <user>
##$USERP2= <user>
##$USERP3= <user>
##$USERP4= <user>
##$USERP5= <user>
##$WDW= 1
##$XDIM= 8192
##$YMAX_p= 0
##$YMIN_p= 0
$$ End of Bruker specific parameters
$$ ---------------------------------
##NTUPLES= NMR FID
##VAR_NAME=  TIME,          FID/REAL,        FID/IMAG
##SYMBOL=    X,             R,               I
##VAR_TYPE=  INDEPENDENT,   DEPENDENT,       DEPENDENT
##VAR_FORM=  AFFN,          ASDF,            ASDF
##VAR_DIM=   8192,          8192,            8192
##UNITS=     SECONDS,       ARBITRARY UNITS, ARBITRARY UNITS
##FACTOR=    0.0002768,     1,               1
##FIRST=     0,             0,               0
##LAST=      2.2672688,     0,               0
##MIN=       0,             -189451,         0
##MAX=       2.2672688,     147015,          0
$$ Real data points
##PAGE= N=1
##DATA TABLE= (X++(R..R)), XYDATA
0 0 0 0 0 0 0 0 0 0 0 0 0 0 0 5 -8 8 -8 8 -10 16 -16 24 -24 32 -33 40 -48 56 -64 73 -82 94 -106 121 -136
35 -136 155 -172 193 -216 240 -268 297 -330 366 -404 447 -494 546 -599 662 -729 803 -884 977
54 977 -1078 1195 -1326 1476 -1652 1857 -2106 2410 -2793 3292 -3973 4964 -6544 9467 -16747
69 -16747 78613 56599 -117829 -129274 -82259 15354 55847 36984 1564 32369 62254 44154
81 44154 -39178 -121332 -120258 -3628 108270 122666 49251 -38659 -79987 -39443 12426 4873
93 4873 -33474 -25618 28723 82446 76700 -2859 -92172 -103490 -34630 49981 81182 40368 -16349
106 -16349 -20830 7112 9230 -21543 -52190 -48201 10917 80223 83409 16500 -53149 -71610 -36009
119 -36009 13700 27887 9229 63 15131 35304 30850 -15293 -68371 -64796 -7202 44875 58412
132 58412 35640 -3366 -23554 -15476 -10020 -22916 -32145 -14851 30077 67901 54772 -1228 -50736
145 -50736 -64597 -40681 5599 36659 34687 25250 22021 7038 -22659 -49874 -53420 -20267 33544
158 33544 66325 54694 10293 -35969 -51620 -32675 -9198 3971 18776 35184 38064 23176
170 23176 -8763 -46962 -58756 -29005 16624 45992 45505 22258 -2445 -16811 -27854 -36280 -29726
183 -29726 -6461 27402 56087 50616 6596 -38237 -52185 -37626 -8008 18563 27983 26491 24889
196 24889 16208 -8077 -37137 -51001 -31198 13513 47331 45613 18794 -11936 -28219 -22020 -9810
209 -9810 -9946 -9921 7376 31497 39403 19741 -17413 -44277 -38915 -8389 20711 27498 14562 4138
223 4138 7798 9383 -8303 -33406 -40693 -18251 23524 54647 46096 3848 -34008 -40836 -22146
236 -22146 -2521 5008 7932 18206 31227 29905 3998 -36342 -58878 -37958 11534 47776 46941
249 46941 18309 -10872 -21433 -16124 -12617 -18728 -18986 2082 36423 52541 29787 -17347 -51655
262 -51655 -49131 -15510 20926 33999 22856 9504 7138 3217 -13787 -35319 -39152 -13489 28114
275 28114 55069 43726 1024 -38130 -44862 -22284 3161 14474 15668 17240 19175 14133 -4329
288 -4329 -30723 -43619 -24877 14331 42606 39293 12154 -14442 -25284 -20552 -10605 -5235 -1750
301 -1750 9379 26562 32501 14216 -17486 -38712 -34587 -10000 16866 29679 23822 10559 407
314 407 -7286 -17795 -27352 -23202 -1705 24084 37572 28585 1365 -25108 -32935 -21139 -3340
327 -3340 9475 16452 20017 17698 7231 -8580 -23703 -28877 -16302 7526 25905 26819 13797
340 13797 -1391 -12953 -18852 -18342 -11913 -604 13713 26157 26133 9009 -14934 -30007 -27814 -12327
354 -12327 8190 23472 26942 18538 3636 -12220 -25863 -29981 -17724 6376 26717 33008 22640
367 22640 1115 -20821 -30780 -24455 -8618 8643 21728 27263 20689 3486 -16056 -27136 -25908
380 -25908 -12884 7333 23991 27520 17829 1738 -14248 -25271 -24747 -12232 6031 21345 26886
393 26886 19921 3519 -15882 -27536 -24163 -10321 8068 23918 28872 17812 -2051 -19600 -27337
406 -27337 -21962 -5764 12910 24136 22887 12376 -3098 -17234 -24800 -20785 -5373 12073 23196
419 23196 23349 12544 -5438 -19087 -21224 -15351 -5155 7239 17598 20991 15079 1878 -13704
432 -13704 -24077 -22496 -8796 10083 22151 21637 12969 499 -13174 -21394 -19263 -9552 4392
445 4392 19143 25819 18004 -165 -17486 -24945 -18683 -4808 9243 18855 19160 11010 476 -10734
459 -10734 -20322 -20334 -8582 7613 19185 22133 14237 -947 -14555 -20433 -17950 -7866 5192 17467
473 17467 23728 17863 1286 -15642 -25090 -23455 -9156 10670 23941 24735 15279 -447 -17471
486 -17471 -26796 -23174 -8045 11606 25674 26669 15057 -4845 -21643 -25725 -17978 -4651 10896
499 10896 22585 22959 12620 -2577 -17521 -25104 -19085 -3719 12873 21593 19647 9585 -2611
512 -2611 -14438 -20901 -16898 -4992 8474 20044 22760 11665 -5525 -17682 -20856 -15350 -2332
525 -2332 11066 18778 18407 9437 -3966 -16159 -21623 -16503 -1199 14595 20244 16163 6560 -6029
539 -6029 -15592 -16366 -11558 -3305 7948 17738 18517 9722 -3981 -15452 -17915 -12205 -2831 7335 14270
554 14270 14931 11654 3924 -10061 -21487 -20319 -7542 8416 20729 21558 9972 -4350 -13646 -16742
568 -16742 -14211 -7378 3641 16091 23321 16574 -581 -17904 -26329 -18601 685 16756 19225
581 19225 13539 5397 -3020 -10762 -15848 -16267 -8619 7148 22474 25713 11562 -10201 -23417 -21132
595 -21132 -8830 3506 11845 14638 13148 9772 1905 -12988 -25620 -22822 -3863 18522 29299
608 29299 21709 2412 -14994 -20757 -15155 -6167 336 6611 15778 20540 12476 -4657 -21102 -26283
622 -26283 -14432 6741 21407 19764 7994 -2693 -6682 -8122 -10368 -10880 -5841 5407 17325
635 17325 20902 9619 -9435 -20436 -17089 -5591 4738 9968 10096 8486 7237 2439 -8226 -19040
649 -19040 -19015 -4599 13866 22733 17537 2818 -10680 -15952 -12515 -5824 -1202 4199 12736 18120
663 18120 12524 -2442 -17375 -23036 -14730 2269 16079 18102 10954 2539 -3199 -8724 -14331 -15061
677 -15061 -7078 6433 19284 22733 11780 -7345 -20244 -19497 -9857 1368 9903 14782 14585 9066
691 9066 -1148 -13706 -21658 -17677 -1635 16418 23131 16040 1873 -11099 -17126 -14263 -6506 1594
705 1594 9215 15173 15569 6612 -7862 -18317 -18090 -7963 5476 14954 15874 9214 125 -6360 -11771
720 -11771 -14176 -9688 869 11794 17057 13881 3553 -9236 -16209 -14176 -6367 2183 9719 14594
734 14594 13329 4539 -6829 -15024 -16212 -9398 3720 13791 14855 9090 1735 -5085 -11189 -13400
748 -13400 -9296 23 10150 15861 13456 2742 -9491 -14344 -10385 -3777 1324 6122 9922 11197
762 11197 7254 -1317 -12091 -18285 -13054 1822 14943 17393 10129 169 -7605 -11251 -10819 -7729
776 -7729 -2732 6405 16914 18835 7755 -10181 -21134 -19088 -5811 8963 15882 12909 5528 549
790 549 -3177 -8779 -14934 -13756 -2122 13250 21561 16768 975 -14617 -18750 -10929 -436 4627
804 4627 6326 9026 11028 7847 -1551 -13996 -20364 -13442 4030 18877 19740 8341 -4505 -10983
818 -10983 -10973 -7713 -4210 -562 5742 14017 15906 6131 -10312 -20135 -16536 -3030 10351 15500 11072
833 11072 2322 -3106 -4408 -6687 -10284 -9471 -499 11249 17191 12699 1 -12438 -15765 -9056
847 -9056 -174 5006 6633 8375 9299 5747 -2962 -12620 -16866 -10490 3582 15815 16499 7669 -2732
862 -2732 -9080 -10361 -8549 -4760 428 7217 12785 12736 4428 -8488 -15967 -12927 -3598 6085 11173
877 11173 10419 5464 248 -4102 -8387 -11390 -8520 1062 10730 14578 10327 695 -9060 -13452 -10329
892 -10329 -3289 3488 7906 11455 10299 3003 -7100 -14105 -13809 -6433 4886 13805 14790 7671 -1136
907 -1136 -8576 -12277 -11590 -5483 4770 12392 14220 9261 -548 -10705 -14299 -10062 -2641 4885 10271
922 10271 11776 7975 448 -7672 -12784 -11865 -4400 5645 12407 11699 5575 -1015 -6572 -10690 -10191
937 -10191 -4626 2862 10186 13870 9743 -1434 -11486 -14003 -8802 235 6978 9833 8677 5064
951 5064 -588 -5821 -10537 -11408 -4793 6152 13413 12122 4491 -4574 -10132 -9403 -4663 -600 2828
966 2828 5607 8680 9092 2749 -7540 -13498 -11655 -3551 7089 12848 9863 3069 -1882 -4843 -7807
981 -7807 -8491 -6455 297 9488 14207 10619 249 -10872 -15225 -9256 134 6496 8822 8536 4888
996 4888 319 -4382 -9857 -11926 -5945 4640 12595 13573 5973 -4161 -10124 -10290 -6610 -630 4238
1011 4238 7081 9519 8435 765 -8419 -12833 -11496 -3109 7666 13284 11007 4295 -3567 -9163 -10293
1026 -10293 -8123 -3089 5297 12033 11731 6457 -2451 -11867 -13601 -7127 1120 7226 10654 9218 3415
1041 3415 -2508 -8044 -10945 -7803 -923 6105 11307 9777 2315 -3780 -7094 -8795 -6724 -498 4285
1056 4285 7570 9086 5737 -2138 -8288 -9888 -7202 -33 6047 7880 7628 4324 -2072 -6767 -8541
1071 -8541 -8508 -2689 6056 10545 8929 3885 -3591 -9000 -8670 -5038 -698 4433 7882 8047 5893 -390
1087 -390 -8173 -10795 -7321 -1352 5593 10537 8491 2889 -1699 -5858 -9148 -7818 -2999 3446 10259
1102 10259 11680 6111 -2346 -9560 -11875 -7447 563 5543 8672 9774 5295 -1844 -7394 -10904 -9315
1117 -9315 -1098 7825 11893 9534 2526 -5618 -9099 -8152 -5284 226 5868 8488 8244 4590 -3155
1132 -3155 -10781 -10309 -4936 1664 8090 9463 5771 1453 -3202 -6951 -7975 -6141 -1405 6099 11267
1147 11267 9160 2052 -4828 -9914 -9649 -3660 2166 5480 7657 6808 2920 -2335 -7679 -9882 -6151
1162 -6151 1431 7212 9572 6571 -57 -4564 -5906 -6095 -4758 -206 4411 6787 8122 3983 -2755
1177 -2755 -7857 -8268 -4781 888 5422 6636 6333 3588 -1806 -6109 -7989 -6877 -1567 6093 9782
1192 9782 7339 2358 -3601 -7613 -7986 -4988 -630 5117 8570 8325 3978 -3431 -10207 -10242 -4257 2078
1208 2078 7183 8904 6229 1316 -3026 -6598 -8744 -6577 -538 6821 11057 8611 1454 -5630 -8961
1223 -8961 -7986 -3169 1566 4782 7010 7627 4627 -2660 -8530 -10768 -6521 2027 9275 10258 5363 -1360
1239 -1360 -5596 -6343 -5373 -3767 183 4920 7882 7743 2815 -5537 -10644 -8235 -1373 4745 7040 5617
1255 5617 2618 -49 -2097 -4131 -6151 -5527 -697 5978 9980 6867 56 -6101 -7925 -5715 -1386
1270 -1386 2087 3651 5011 5551 3614 -1574 -7411 -9506 -5368 1711 7607 8915 4853 -583 -4456
1285 -4456 -5421 -5220 -3925 -397 4320 7496 7126 2562 -4116 -8820 -7643 -2475 2475 5371 5626 4324
1301 4324 1686 -2155 -5820 -7199 -4974 133 6269 8962 6237 378 -4935 -7169 -6248 -3216 1328
1316 1328 5411 7464 6466 2233 -4252 -9121 -8464 -2583 3682 7656 7473 4323 -686 -4493 -6328 -6571
1332 -6571 -3593 1679 7183 9039 5206 -834 -6115 -7877 -5624 -1037 2814 4949 5808 4824 1607
1347 1607 -3639 -7523 -7311 -2940 3056 7154 7246 3760 -1021 -4287 -5309 -5048 -3052 830 5303 7319
1363 7319 5959 688 -5409 -8406 -6217 -558 3830 5508 4945 3050 306 -2857 -5691 -6171 -3548
1378 -3548 2304 7155 7863 3686 -1858 -5097 -5471 -4002 -1676 927 3302 5537 5958 2491 -3698 -8608
1394 -8608 -7923 -2290 3884 6843 6056 2716 -632 -3196 -4253 -5461 -4556 227 6062 9029 6494 -322
1410 -322 -6707 -8721 -5262 310 3896 4605 3640 3564 2038 -2193 -6270 -7519 -3952 2184 8054 8252
1426 8252 3107 -3108 -5384 -4899 -3224 -1132 714 3287 6010 5546 2030 -4476 -9251 -7516 -779
1441 -779 5182 7225 5795 1509 -1773 -3583 -4431 -4892 -3241 1379 6349 8476 5065 -1711 -6862 -7576
1457 -7576 -4258 880 4323 4677 3608 2650 671 -3080 -6106 -5843 -2407 3015 6831 6554 2678 -2158
1473 -2158 -4710 -4428 -3183 -1665 1103 4697 5742 4233 474 -4405 -7387 -5278 -197 3705 5340
1488 5340 4414 2179 -412 -3213 -5017 -4639 -2104 2284 6158 6737 2630 -2302 -4883 -5102 -3322 -203
1504 -203 2502 3707 4680 3863 450 -4233 -6848 -5618 -727 3612 5721 4569 2227 -1488 -3332 -4006
1520 -4006 -4584 -3239 1392 5915 7429 4472 -955 -5985 -7263 -4160 91 3486 4740 4210 3195
1535 3195 656 -3763 -6718 -5548 -1657 3504 7235 6302 1390 -3050 -4657 -4361 -2631 -460 1546
1550 1546 4192 5405 3995 -476 -4889 -7267 -4746 1087 4763 5111 3727 1179 -1680 -3756 -4296
1565 -4296 -4500 -2144 2852 6428 6360 2435 -3341 -6131 -5042 -2476 1021 3259 3781 3373 3033 250
1581 250 -4277 -6245 -4662 -284 4388 6258 4057 99 -2548 -3357 -2839 -2339 -1935 582 4238 5555
1597 5555 3329 -894 -5117 -6051 -3289 1410 3461 3538 2397 1796 300 -2142 -4850 -5447 -2087 2816
1613 2816 6591 6756 1741 -3481 -5230 -3828 -1820 571 2237 3315 4091 3729 -43 -4739 -6902 -4739
1629 -4739 688 4759 5749 3532 549 -1993 -3451 -3267 -3200 -2065 1728 5683 6310 3107 -2088 -6073
1645 -6073 -6232 -2932 1405 3841 4204 3437 1978 -255 -3497 -5692 -4242 -543 4043 6130 5044 293
1661 293 -3579 -4453 -3651 -1519 366 2162 3966 3979 2167 -1695 -4749 -5480 -2623 1999 4327 3665 2016
1678 2016 379 -1587 -2879 -3147 -3186 -1054 2512 4970 4682 1164 -2948 -4739 -3760 -1557 1074 2241
1694 2241 3043 3051 2385 -247 -4125 -5685 -3679 422 3789 5109 3315 -183 -2608 -2889 -2735 -2195 -1223
1711 -1223 1664 4442 4561 2278 -1647 -4759 -4908 -2489 1434 3203 3448 2489 1393 -395 -2734 -4442
1727 -4442 -3956 -1144 3011 5607 4566 651 -2824 -4243 -3572 -1855 529 2733 3754 3666 1891 -1528
1743 -1528 -4695 -5347 -2497 1433 4422 4680 2833 279 -2163 -3546 -3569 -2489 -91 2975 5277 4235
1759 4235 367 -2944 -4239 -3658 -1438 1140 2777 3258 3148 1720 -1050 -4112 -4880 -2676 1181 4183
1775 4183 4396 2816 -365 -2193 -2622 -2751 -2208 -446 2358 4330 3999 1149 -2524 -4653 -3691 -763
1791 -763 2233 3199 2121 1355 725 -633 -2514 -3713 -2894 -347 3305 5060 3448 -352 -3106 -3389
1807 -3389 -2258 -1003 300 1629 2843 3317 2375 -1006 -4338 -5467 -2354 1418 4483 4204 1946 -286
1823 -286 -2021 -2448 -2783 -2200 -917 2199 4579 4434 1189 -2686 -5234 -3899 -664 2200 2728 2306 2051
1840 2051 1074 -263 -2991 -4246 -3150 138 3774 5054 2930 -840 -3231 -3359 -2165 -794 200 1943
1856 1943 3117 3450 1593 -1881 -4762 -4866 -1573 2416 4368 3407 1099 -821 -2144 -2152 -2498 -2062 -73
1873 -73 2785 4734 3446 -277 -3420 -4226 -2561 -105 2030 2765 1773 1600 1099 -599 -3044 -3681 -2334
1890 -2334 851 3427 3730 2264 -477 -2571 -2833 -2164 -1176 10 1927 3312 3036 930 -1867 -3866
1906 -3866 -3657 -1277 1729 3081 2612 1616 149 -1557 -2838 -2807 -1283 684 2632 3540 2455 -7
1922 -7 -2346 -2976 -2482 -1212 872 2317 3299 2487 588 -1681 -3326 -3430 -1289 1148 2534 3175 2183
1939 2183 262 -1465 -3278 -3498 -2193 538 3501 4189 2843 -816 -2959 -3328 -2381 -782 1090 2125
1955 2125 2937 2389 1056 -1648 -4005 -3953 -1143 2103 3820 3046 682 -1053 -1883 -1652 -1432 -1423 -557 2050
1973 2050 3821 3159 293 -3124 -4145 -2796 98 2595 2344 1427 715 546 -702 -2362 -3475 -2232
1989 -2232 585 3547 4468 2361 -1772 -3837 -2656 -828 517 1023 1365 1910 2084 1368 -1284 -3635
2005 -3635 -3963 -1390 2399 3918 2531 136 -918 -1760 -1175 -1387 -1370 -748 1431 4004 3383 881 -2641
2022 -2641 -4287 -2790 436 2394 2344 1458 1029 787 -296 -2370 -3128 -2141 677 3142 3838 1754 -1460
2039 -1460 -3208 -2759 -1132 -7 704 1203 2076 2429 801 -1508 -3519 -3713 -1219 2430 3415 2259 782
2056 782 -738 -1774 -1813 -1970 -1530 168 2513 3640 2630 52 -3054 -3663 -2100 7 1814 2699 2066
2073 2066 1087 260 -1305 -3043 -2750 -1027 1450 3068 3353 1194 -1284 -2301 -2235 -1470 -180 536 1933
2090 1933 2677 1478 -447 -1836 -2522 -2294 -119 1561 2132 1785 934 -272 -1362 -2334 -2274 -768 1195
2107 1195 2677 2513 1343 -880 -2202 -2073 -1673 -694 760 2252 2671 1857 54 -2553 -3264 -1912 -144
2124 -144 1802 2428 1489 641 291 -880 -2162 -2202 -1578 238 2871 3431 1655 -983 -2709 -2515 -925
2141 -925 216 464 977 1756 1854 1090 -1266 -3443 -3683 -748 1959 3126 2843 322 -1610 -1739 -1087 -1359
2159 -1359 -888 -116 1898 3187 2641 -446 -3229 -3637 -2069 835 3038 2406 520 279 -81 -844 -1993
2176 -1993 -2443 -1585 733 3192 3655 1703 -1361 -3238 -2495 -681 680 858 1054 1524 1281 865 -921
2193 -921 -3107 -3178 -406 2026 3108 2259 117 -1507 -1527 -1379 -788 -579 34 1155 2718 1767 -460 -2363
2211 -2363 -2795 -1704 555 1894 1677 1055 384 261 -547 -1543 -2178 -1147 785 2444 2681 1352 -1085
2228 -1085 -2245 -1674 -923 -365 823 1416 1917 1807 383 -1430 -2796 -2532 -345 1871 2858 1515 332
2245 332 -602 -1432 -1668 -1433 -831 334 2129 2780 1341 -581 -2135 -2517 -1614 317 1509 1830 1691 1230
2263 1230 308 -1166 -2272 -2225 -471 1447 2454 2523 1163 -1060 -2079 -1776 -1118 -228 1028 1789 2078
2280 2078 1002 -643 -2168 -2428 -1489 276 1623 2083 1294 796 -307 -1636 -2089 -1494 -476 1139 2356
2297 2356 1898 608 -998 -1753 -1436 -790 45 725 1662 1897 1449 25 -1854 -2724 -1909 106 1565 1950
2315 1950 1287 526 -173 -1247 -1654 -1715 -939 447 2364 2842 1249 -1187 -2311 -1732 -738 466 918 854
2333 854 778 926 388 -990 -2480 -2210 -480 1610 2564 1792 182 -1393 -1567 -985 -411 -591 228 1352
2351 1352 2287 1510 -305 -2113 -2891 -1772 376 2066 1958 1111 299 -216 -1070 -1762 -1987 -983 786
2368 786 2731 2657 807 -1274 -2356 -1722 -555 349 955 1168 1461 1021 395 -951 -2409 -2050 131 1739
2386 1739 2508 1557 159 -1082 -1374 -1086 -717 -571 -4 1587 2184 1270 -484 -2332 -2351 -1202 398 1632
2404 1632 1339 705 588 -262 -817 -1722 -1788 -328 1266 2408 2288 196 -1365 -1763 -1214 -160 223 676
2422 676 903 1620 1357 236 -1439 -2645 -1940 156 1591 2103 1291 -106 -559 -1123 -979 -1129 -717 346
2440 346 1878 2511 1376 -655 -2194 -2149 -825 401 1163 1486 904 726 -48 -1139 -1649 -1877 -127 1419
2458 1419 2261 1754 705 -1040 -1537 -1219 -650 -185 581 1608 1794 943 -317 -1708 -2229 -1151 290
2475 290 1480 1778 1213 345 -364 -1401 -2003 -1245 -348 1088 2146 1938 455 -994 -1722 -1473 -697 98
2493 98 1052 1406 1338 819 -535 -1762 -2026 -1020 464 1683 1614 1015 291 -550 -1034 -1323 -1305 -662 574
2512 574 1821 2047 615 -1046 -1929 -1480 -551 99 890 916 814 800 13 -1438 -2193 -1440 -35 1612 2193
2531 2193 1205 -272 -1018 -1290 -757 -669 -538 283 1504 1793 1024 -564 -1773 -2398 -951 669 1409 1358
2549 1358 840 139 138 -793 -1561 -1970 -678 1000 2172 2192 629 -1396 -1837 -1298 -649 192 696 730 1337
2568 1337 1271 -118 -1636 -2613 -1753 152 1985 2216 956 -206 -905 -885 -828 -628 -697 389 1922 2009 765
2587 765 -805 -1998 -1875 -464 1031 1314 1237 606 163 132 -816 -1648 -1708 -355 1097 2199 2004 325
2605 325 -1564 -1701 -996 -477 177 586 838 1380 1020 -63 -1486 -2127 -1239 517 1871 1528 939 -186
2623 -186 -1093 -837 -867 -809 -379 436 1487 1814 1038 -810 -1776 -1886 -694 355 1069 1282 696 594 203
2642 203 -1127 -1390 -1199 -262 886 2143 1479 163 -1010 -1463 -1301 -632 85 652 1492 1499 769 -663 -1426
2661 -1426 -1975 -1032 589 1439 1515 1463 239 -651 -1252 -1556 -1136 141 1136 1612 1645 577 -904 -1142 -1218
2680 -1218 -1156 -79 912 1476 1507 824 -661 -1679 -2004 -600 470 1306 1401 969 203 -366 -1197 -1713 -949
2699 -949 -159 889 2041 1446 367 -1006 -1816 -1109 -342 678 619 898 1002 631 -176 -1259 -1849 -1194
2717 -1194 604 1596 1969 1094 -199 -872 -872 -1032 -595 -226 479 1275 1904 1082 -712 -1658 -2033 -803 757
2736 757 1618 1197 669 396 -280 -620 -1347 -1540 -475 1084 2276 1799 397 -1250 -1748 -784 -270 223
2754 223 679 1006 976 1368 -2 -1418 -2255 -1464 572 1657 1863 879 -323 -818 -762 -1023 -704 -648 390
2773 390 1602 1711 924 -910 -1969 -1932 -557 792 1341 1007 417 129 -231 -890 -1564 -1538 -272 1458
2791 1458 2297 1489 103 -1616 -1713 -872 -61 251 561 1090 1402 634 -325 -1643 -2289 -1229 676 1718
2809 1718 1555 855 -227 -936 -1223 -979 -742 -408 610 1495 1622 409 -933 -1643 -1471 -474 604 943
2827 943 776 644 144 -361 -1157 -1677 -976 107 1009 1413 1358 -128 -714 -1242 -1007 -553 51 741 1242 1363
2847 1363 543 -589 -1229 -1615 -882 418 1347 1272 933 273 -270 -1299 -1528 -928 126 1356 1872 1177
2865 1177 -122 -1086 -1297 -1024 -656 -41 711 1366 1607 772 -676 -1738 -1727 -771 662 1229 1472 757 220
2884 220 -334 -900 -1155 -1041 -301 969 1923 1589 318 -1399 -1821 -1151 -464 810 976 842 905 625 -526
2903 -526 -1448 -1956 -1081 660 1622 1574 689 -284 -1015 -1147 -563 -477 -141 671 1252 1632 633 -703 -1823 -1746
2923 -1746 -498 975 1381 847 471 47 -148 -823 -1306 -1113 -138 973 2074 1554 127 -1300 -1746 -839
2941 -839 -194 436 701 1001 907 633 -529 -1449 -1854 -935 524 1411 1642 824 -226 -1026 -826 -1021 -534
2960 -534 -93 884 1592 1537 362 -911 -1848 -1641 -423 763 1331 1194 545 70 -15 -1110 -1546 -885 -119
2979 -119 1360 2014 1269 -165 -1519 -1372 -859 -135 60 697 1329 1224 570 -449 -1382 -1829 -573 1040
2997 1040 1593 1342 797 -223 -725 -904 -907 -1006 -92 777 1886 1510 -59 -848 -1383 -1256 -420 367 893 1086
3017 1086 868 380 -751 -1371 -1676 -864 635 1356 1633 1086 -254 -1102 -1215 -946 -530 222 923 1495 785
3036 785 -54 -804 -1623 -1189 -304 432 1280 1086 437 310 -447 -1160 -1328 -853 12 1611 1663 1342 -186 -1139
3056 -1139 -1261 -929 -548 365 709 1217 1408 316 -804 -1592 -1766 -566 639 1452 1210 342 -235 -716
3074 -716 -927 -1246 -734 -110 1046 1703 1413 28 -1228 -1897 -1326 -6 669 965 694 825 182 -484 -1406
3093 -1406 -1555 -998 758 1675 1916 793 -535 -1420 -1227 -739 -470 475 756 1646 1049 498 -1018 -1808
3111 -1808 -1397 -238 942 1597 1092 326 -154 -713 -846 -1180 -678 14 1269 1845 1142 -40 -1345 -1499
3129 -1499 -906 -19 514 1125 1092 777 503 -765 -1522 -1838 -779 671 1495 1758 782 -678 -841 -1137 -950
3148 -950 -644 -23 973 1501 1172 -46 -1354 -1814 -1222 -291 997 1210 920 477 208 -502 -1083 -1508 -824
3167 -824 583 1579 1826 962 -414 -1086 -1416 -654 -300 213 871 1300 1119 737 -790 -2017 -1562 -549
3185 -549 841 1818 1187 316 -105 -775 -1224 -868 -463 34 1363 1654 1162 -253 -1280 -1598 -1233 11
3203 11 713 1098 842 582 129 -748 -1332 -1557 -818 696 1682 1756 726 -547 -1290 -934 -883 -642 172 1124
3223 1124 1630 1077 184 -1287 -1518 -1497 1 1004 1277 833 610 266 -598 -1063 -1291 -772 526 1516 1643
3242 1643 1012 -296 -1045 -1176 -663 -76 406 875 1023 906 342 -800 -1563 -1467 -330 841 1547 1292 240
3261 240 -333 -669 -1554 -1022 -862 219 1370 1951 993 -282 -1132 -1610 -1312 -111 942 1154 1183 545 -120
3280 -120 -764 -1556 -1535 -374 688 1746 1501 814 -630 -1231 -1374 -838 -315 371 1219 1344 1139 89 -1236
3299 -1236 -1554 -1299 -50 1184 1521 1019 655 -102 -901 -1318 -1513 -510 596 1580 1623 732 -394 -1417
3317 -1417 -1586 -595 73 782 1050 1048 758 140 -997 -1613 -1532 -62 1251 1636 1032 457 -493 -1030 -876 -887
3337 -887 -236 156 1244 1590 1038 -373 -1604 -1800 -1124 298 1045 1017 946 624 32 -792 -1312 -1365 -552 901
3357 901 1469 1797 586 -803 -1230 -1426 -428 -100 514 1082 1275 880 -49 -1201 -1779 -1152 -61 1057
3375 1057 1629 1011 446 -331 -831 -1115 -988 -539 535 1376 1915 972 -468 -1370 -1860 -899 165 928 991
3394 991 966 634 -374 -1089 -1321 -1448 -339 1137 1718 1440 367 -852 -1399 -1322 -697 -65 552 1305 1539
3413 1539 743 -308 -1173 -1588 -1017 55 1060 1441 1104 363 -395 -825 -1414 -1013 -326 686 1601 1728
3431 1728 416 -821 -1272 -1133 -599 158 864 1242 1390 855 9 -1336 -1759 -1124 -40 1231 1316 1194
3449 1194 212 -613 -830 -1187 -882 -108 712 1471 1519 674 -608 -1586 -1351 -790 222 987 1180 1057 440
3468 440 -207 -1096 -1624 -881 -155 933 1770 1286 233 -779 -1220 -1299 -773 -45 505 1368 1443 618 -384
3487 -384 -1480 -1791 -846 112 1207 1400 830 33 -455 -963 -1164 -1393 -5 861 1525 1324 164 -909
3505 -909 -1426 -1500 -735 302 600 1124 1333 764 -186 -1244 -1626 -1108 345 1199 1555 1021 -112 -612 -1137
3524 -1137 -944 -805 -319 646 1424 1398 673 -567 -1634 -1609 -729 322 864 1028 929 536 -237 -738 -1507 -1091
3544 -1091 -143 986 1630 1564 290 -844 -1308 -1033 -377 175 671 1064 1199 663 -64 -1244 -1627 -1236 395
3563 395 1281 1468 907 53 -797 -849 -1095 -850 -30 960 1265 1325 639 -931 -1648 -1361 -498 401 1164 1369
3583 1369 877 346 -467 -1112 -1340 -993 282 1236 1802 1128 10 -897 -1234 -1034 -700 262 873 1433 1373
3602 1373 618 -594 -1425 -1476 -690 351 1222 1465 842 23 -669 -1007 -1124 -901 22 989 1719 1274 85
3621 85 -1300 -1429 -1135 -549 446 1133 957 1007 517 -549 -1240 -1384 -810 304 1502 1561 964 1 -781 -1242
3641 -1242 -1005 -530 72 981 1532 1044 300 -1018 -1543 -1326 -450 513 1142 1140 770 272 -488 -1181 -1465 -809
3661 -809 370 1296 1360 1010 -130 -1086 -1339 -1149 -662 349 996 1361 1206 202 -786 -1517 -1467 -630 356
3680 356 1415 1220 759 209 -917 -1088 -1402 -763 -38 1372 1797 1337 148 -765 -1518 -1002 -390 189 1106
3699 1106 1217 1073 207 -804 -1563 -1365 -814 589 1456 1279 737 -200 -726 -1131 -785 -500 145 968 1534
3718 1534 1244 382 -1051 -1917 -1333 -415 632 1305 1272 751 -77 -599 -1075 -1339 -696 121 1093 1641 904
3737 904 -128 -1211 -1537 -851 -578 358 991 1190 936 359 -637 -1511 -1459 -508 691 1297 1363 662 -154 -903
3757 -903 -1086 -1141 -717 164 1008 1533 1179 62 -1079 -1563 -1174 -26 601 1194 1101 656 179 -410 -1224 -1430
3777 -1430 -710 438 1452 1334 784 -391 -1134 -1140 -969 -429 207 819 1230 775 -57 -1039 -1450 -1458 -605 815
3797 815 1141 1085 585 19 -773 -1257 -950 -398 451 1445 1268 814 21 -1419 -1377 -1040 -322 466 1090 973
3817 973 1039 -28 -818 -1358 -1282 -391 899 1378 1442 669 -441 -990 -1158 -1023 14 247 1215 1196 909 -70
3837 -70 -1037 -1381 -1029 -51 814 1398 1127 637 -66 -793 -1318 -1273 -457 731 1215 1281 775 -455 -1202 -1356
3857 -1356 -1074 -83 334 1084 1202 906 -165 -1134 -1546 -1286 -117 893 1278 1195 582 -231 -645 -1208 -1041
3876 -1041 -387 470 1286 1449 967 -294 -1096 -1425 -935 -315 650 1160 1105 828 -41 -990 -1428 -1311 -196
3895 -196 877 1410 1589 403 -337 -1029 -1244 -951 -126 438 1093 1579 959 -110 -1266 -1563 -1236 -7
3913 -7 680 1069 1299 253 -204 -852 -1424 -1366 -243 725 1335 1443 739 -610 -1162 -930 -758 -164 438 984
3933 984 1098 762 -100 -976 -1591 -1380 -240 987 1512 954 448 -272 -856 -1216 -664 -465 684 1056 1645
3952 1645 808 -175 -1136 -1436 -799 77 727 1123 996 614 83 -917 -1326 -1279 -269 682 1650 1378 573
3971 573 -272 -1279 -1177 -550 -141 533 942 1066 875 -210 -1095 -1406 -904 -67 886 1580 1163 174 -470
3990 -470 -774 -1009 -1015 -192 316 1353 1329 954 -288 -1435 -1228 -992 140 650 1156 899 360 -286 -1012 -1158
4010 -1158 -937 -90 913 1487 1331 503 -423 -1011 -1379 -578 103 634 1479 1090 638 -488 -1309 -1269 -941
4029 -941 51 932 1190 1014 389 -386 -1033 -1262 -1065 -69 946 1490 1080 391 -738 -1202 -1238 -657 -56 757
4049 757 1392 1038 573 -273 -1075 -1329 -712 375 981 1185 666 306 -312 -1060 -1080 -862 -22 1010 1203 1219
4069 1219 234 -579 -1225 -1096 -614 59 886 1155 881 465 -388 -1091 -1225 -827 103 1075 1439 997 343 -389
4089 -389 -913 -933 -508 -11 754 1124 995 623 -601 -1155 -1257 -526 258 1091 1139 1021 214 -344 -1030 -1152
4109 -1152 -768 -295 989 1329 1320 275 -951 -1048 -1240 -484 44 806 927 898 565 -277 -1006 -1326 -711 193
4129 193 1222 1660 1052 95 -701 -1032 -1015 -687 -40 885 1161 1039 366 -572 -1367 -1229 -709 237 885 1108
4149 1108 875 433 -164 -864 -1265 -1190 -53 1061 1394 821 230 -867 -1209 -1010 -597 154 753 1050 729
4168 729 244 -796 -1147 -1348 -843 230 1513 1225 702 226 -581 -1120 -773 -366 176 917 1156 1116 318
4187 318 -317 -1271 -1108 -572 550 885 1319 770 318 -417 -1150 -937 -746 236 1025 1454 761 169 -436 -1133
4207 -1133 -711 -362 453 683 1026 1067 417 -767 -1236 -1177 -659 245 964 981 713 529 -672 -1000 -1387 -569
4227 -569 134 992 1410 871 116 -724 -1116 -1004 -160 169 895 876 1037 -26 -545 -1305 -1232 -495 283 1024
4247 1024 786 565 -222 -834 -1076 -772 -589 43 789 1183 881 174 -927 -1119 -994 -467 361 935 918 670
4267 670 -23 -574 -1075 -1210 -488 512 1189 1243 766 -77 -950 -1055 -813 -208 381 936 966 889 -69 -734 -1409
4288 -1409 -1087 -200 788 1116 985 591 -30 -618 -1163 -1062 -818 458 987 1407 779 -257 -1160 -959 -1232
4307 -1232 -265 399 946 1017 835 250 -695 -1004 -1163 -651 849 1039 1279 594 -77 -532 -734 -812 -328 290
4327 290 934 1229 917 -152 -887 -1321 -1061 -109 557 1136 945 579 17 -508 -1094 -911 -644 312 875 1340
4347 1340 686 -172 -985 -1313 -725 -118 552 873 1111 819 -291 -691 -943 -1176 -186 636 1259 1232 477 -329
4367 -329 -804 -1137 -825 -93 242 1024 1050 809 -261 -1117 -1263 -967 -198 834 994 1045 608 22 -889 -1137
4387 -1137 -1013 -347 697 1336 980 546 -146 -854 -1419 -900 -50 450 820 1218 667 87 -951 -940 -667
4406 -667 -231 521 1076 1183 362 -175 -995 -824 -849 -299 349 1012 977 483 -89 -733 -825 -798 75 209 980
4427 980 1118 412 -288 -918 -1087 -1019 -172 679 893 1052 412 -390 -735 -1175 -655 81 796 1246 982 506
4447 506 -190 -906 -1284 -845 -132 826 1037 874 470 -312 -1055 -1186 -873 -144 897 1152 1061 451 -433 -861
4467 -861 -1130 -671 -189 382 1056 833 167 -363 -760 -1301 -806 190 564 1259 749 526 -170 -872 -746 -882
4487 -882 -286 578 1079 1178 541 -228 -1155 -1152 -508 -201 437 895 1270 343 -204 -1071 -1288 -878 79 1030 1100
4508 1100 948 293 -476 -1169 -969 -887 -187 333 879 917 554 63 -962 -1221 -634 32 949 891 793 186 -269
4529 -269 -727 -816 -562 -18 507 1111 1051 325 -377 -1116 -891 -550 214 583 956 905 513 -210 -1081 -1206 -770
4550 -770 164 664 1163 937 224 -260 -1023 -896 -673 -195 446 1117 873 444 -370 -1219 -1236 -572 215 771
4570 771 939 708 27 -469 -825 -811 -830 -176 431 1277 1048 145 -331 -809 -859 -527 48 401 966 781 143
4591 143 -290 -748 -1105 -571 260 673 1116 1065 322 -365 -955 -1116 -667 49 722 1086 769 42 -650 -912
4611 -912 -949 -648 -82 705 983 966 145 -311 -975 -875 -811 47 1060 976 694 125 -596 -1027 -1027 -422 227 463
4633 463 1204 988 233 -456 -1009 -949 -171 250 922 999 527 -147 -250 -936 -859 -669 1 968 1059 699 205
4654 205 -462 -719 -861 -331 168 663 873 824 344 -597 -1049 -1164 -567 169 1110 987 622 105 -457 -845
4674 -845 -855 -845 -82 657 1100 902 183 -609 -1345 -781 -292 476 959 968 783 330 -234 -1002 -975 -501 262 830
4696 830 928 686 265 -455 -847 -792 -345 168 754 866 876 313 -721 -1031 -921 -232 149 1109 873 532 -308
4717 -308 -598 -613 -804 -440 375 764 1204 838 -115 -633 -1185 -928 -258 511 821 954 352 188 -357 -950
4737 -950 -1196 -644 397 1036 1249 569 142 -631 -784 -627 -492 111 795 1066 894 71 -698 -909 -951 -395
4757 -395 403 950 884 694 -101 -498 -829 -856 -501 236 695 940 702 -29 -598 -1011 -814 -278 475 1065 783
4778 783 638 246 -704 -1065 -946 -520 359 967 1008 539 -36 -807 -718 -679 -212 271 939 896 769 38 -691
4799 -691 -1292 -863 -215 503 769 782 640 215 -650 -1129 -1068 -376 287 863 873 379 -147 -790 -859 -768 -194 463
4821 463 988 950 862 142 -694 -1258 -798 -216 227 743 659 507 37 -726 -712 -1061 -350 192 849 1107 634
4842 634 -259 -863 -998 -749 -114 388 425 824 666 95 -513 -910 -815 -14 435 818 825 278 -271 -492 -703
4863 -703 -888 -150 438 579 903 576 -85 -589 -1056 -674 -161 598 974 519 349 64 -652 -979 -971 -253 301
4884 301 925 1137 358 -261 -660 -832 -443 -144 489 510 863 365 -246 -694 -897 -891 -228 643 953 653 537
4905 537 -414 -504 -857 -609 -265 194 920 954 439 -173 -526 -883 -654 203 696 920 816 299 -71 -695 -910
4926 -910 -882 -317 537 985 928 418 -426 -956 -694 -447 -162 511 831 733 595 -164 -603 -1151 -733 -21 561
4947 561 909 776 266 -180 -410 -1104 -583 48 616 863 669 276 -512 -775 -564 -500 -28 240 760 654
4967 654 330 -421 -746 -887 -654 -73 386 980 782 249 -30 -841 -669 -713 -261 589 1050 991 438 -359 -975
4988 -975 -839 -518 -33 507 639 798 120 -380 -663 -739 -669 -94 647 691 882 186 -268 -632 -611 -359 -72
5009 -72 308 943 692 430 -388 -935 -841 -520 170 526 651 610 153 -185 -631 -769 -410 -115 506 885 804
5030 804 189 -427 -803 -639 -338 -72 679 692 710 405 -320 -855 -723 -600 73 615 742 754 80 -409 -598
5051 -598 -875 -512 -132 388 746 934 147 -349 -842 -966 -462 -77 402 815 523 478 -433 -700 -729 -684 -77
5072 -77 635 1024 669 295 -473 -730 -664 -338 165 331 1041 771 336 -242 -1011 -976 -370 317 653 829 498
5093 498 69 -280 -678 -684 -401 -181 397 758 687 188 -600 -861 -726 -210 239 645 893 567 376 -167 -620
5114 -620 -966 -365 -38 463 846 751 122 -429 -839 -741 -381 -93 529 812 803 220 -346 -489 -793 -558 113
5135 113 676 764 481 132 -148 -585 -663 -284 -50 765 876 682 17 -311 -918 -536 -571 256 626 502 653
5156 653 -29 -241 -821 -437 -366 399 585 790 486 17 -521 -775 -876 -241 194 349 911 586 224 -528
5176 -528 -699 -638 41 83 741 547 587 -72 -363 -908 -656 -403 -30 796 968 713 -313 -516 -790 -382 -328
5197 -328 257 588 713 723 204 -354 -876 -838 -349 258 830 661 488 51 -277 -769 -507 -88 105 723 676
5218 676 598 44 -564 -861 -655 -284 165 658 618 407 26 -382 -1054 -766 -168 406 673 501 388 -79 -356
5239 -356 -684 -400 -153 278 631 811 489 -77 -420 -741 -373 -189 476 561 627 765 218 -479 -748 -694 -365
5260 -365 89 708 927 422 -315 -687 -720 -638 -153 118 437 354 298 -25 -535 -746 -759 -272 210 788 694 358
5282 358 -6 -345 -733 -475 -98 220 692 655 721 -84 -425 -783 -759 -138 419 833 679 392 125 -388 -770
5303 -770 -820 -76 420 684 654 387 23 -595 -479 -602 59 344 599 689 376 -56 -515 -924 -849 -206 282
5324 282 760 605 439 -94 -481 -280 -744 -151 238 557 698 279 -37 -698 -926 -786 -12 383 346 435 468
5345 468 157 -331 -754 -684 -289 393 680 783 459 -4 -432 -689 -448 -288 274 580 1011 406 -100 -555
5365 -555 -711 -357 43 287 499 753 133 -160 -286 -413 -836 -53 196 727 682 427 -74 -497 -796 -564
5385 -564 -67 418 436 519 546 -263 -492 -855 -718 -86 221 570 552 16 -227 -520 -410 -382 90 52 612 728
5407 728 278 -21 -588 -954 -446 -56 249 550 554 244 41 -523 -589 -585 -123 230 452 724 351 -104 -579 -614
5429 -614 -319 -85 362 549 818 358 -20 -719 -778 -478 10 369 802 497 156 -25 -688 -452 -744 -207
5449 -207 516 711 512 292 -175 -635 -525 -399 136 61 492 664 258 -152 -593 -819 -468 5 373 662
5469 662 558 316 -273 -472 -778 -592 -11 221 521 502 228 -230 -528 -556 -374 140 303 462 305 61 -202
5490 -202 -399 -446 -528 -211 499 638 614 125 -267 -693 -402 39 101 277 630 447 361 -184 -467 -872 -431 135
5512 135 459 950 661 -19 -270 -546 -457 -413 -48 519 426 734 315 -139 -659 -514 -183 55 309 121 491
5533 491 212 -313 -293 -735 -378 71 380 864 474 208 -365 -718 -594 -521 -113 231 641 552 254 -145 -441
5554 -441 -598 -468 53 504 623 374 148 -382 -397 -423 -452 -177 313 625 725 4 -462 -587 -686 -399 -57
5575 -57 250 467 574 130 -210 -380 -263 -302 212 575 518 180 229 -314 -636 -655 -404 30 396 609 342 181
5597 181 -194 -549 -498 -161 259 323 464 432 94 -261 -313 -540 -404 62 512 557 632 -284 -448 -453 -337 -171 45
5620 45 371 576 514 98 -234 -695 -373 -348 160 411 436 249 116 -181 -658 -625 -359 -43 436 449 590 158
5642 158 -344 -456 -365 -323 194 372 583 270 6 -64 -552 -502 -268 181 371 613 336 -339 -417 -574 -597 -375
5664 -375 26 192 496 273 258 -374 -786 -451 -39 -168 367 518 386 -78 -392 -492 -476 -316 -161 496 744
5685 744 313 39 -564 -338 -412 -227 140 431 510 366 402 35 -625 -448 -131 242 551 378 256 132 -369
5706 -369 -298 -407 -242 -44 330 353 410 129 -460 -699 -289 66 144 299 441 337 25 -267 -665 -507 -504 216
5728 216 335 412 150 -168 -476 -364 -347 -218 102 253 578 343 222 -256 -408 -338 -98 114 536 614 35
5749 35 -104 -303 -260 -92 -231 93 515 513 342 -53 -363 -298 -473 -73 84 233 408 116 -5 -312 -566 -390
5771 -390 -274 230 442 740 166 -73 -271 -736 -286 -18 266 299 418 81 129 -354 -275 -280 -104 411 486 534
5793 534 163 81 -291 -440 -413 -397 -65 509 366 451 -115 -234 -375 -362 -144 187 384 332 362 -67 -136 -678 -347
5816 -347 -4 391 452 426 374 -169 -386 -385 -458 -179 38 463 592 595 12 -185 -356 -429 139 203 498 114 293
5839 293 85 -407 -453 -316 55 274 480 519 110 -156 -320 -577 -258 20 -94 242 532 395 -42 -496 -537
5860 -537 -385 110 169 374 452 220 -304 -316 -321 -324 -178 465 735 537 351 -24 -402 -140 -296 -22 176 238 533
5883 533 238 28 -377 -172 -385 -111 475 430 114 171 -27 -349 -236 -248 -216 382 264 443 361 -2 -282 -502
5905 -502 -538 -36 227 630 123 238 111 -337 -614 -321 -238 242 505 624 251 -272 -424 -242 -47 -77 111
5926 111 254 327 289 -159 -348 -223 -243 -77 364 567 457 137 -97 -404 -279 -158 -196 174 315 483 257
5947 257 -209 -476 -509 -159 42 53 480 82 128 109 -281 -469 -304 11 348 387 223 48 -313 -429 -327 -107
5969 -107 56 205 496 315 394 -194 -319 -381 -209 -101 220 508 70 304 -126 -356 -287 -387 -29 199 496
5990 496 513 103 -359 -419 -581 -205 16 341 287 449 106 -362 -230 -355 -387 131 236 517 254 116 -86
6011 -86 -503 -513 -11 4 -2 325 419 -22 -348 -373 -514 -161 -27 273 495 320 342 -272 -448 -227 -166 164 207
6034 207 466 307 124 -258 -484 -301 -73 89 293 321 373 39 16 -446 -533 -64 168 229 390 268 -12 -94
6056 -94 -280 -349 -346 29 193 484 463 110 -4 -433 -462 -126 149 299 442 50 158 -42 -82 -545 -457 -132 490
6079 490 285 191 -64 -269 -289 -285 253 -37 184 311 186 186 -229 -425 -258 -40 -184 46 433 37 -7 -300
6101 -300 -216 -331 -367 -229 181 534 258 199 -479 -456 -319 -257 236 168 285 365 75 20 -187 -389 -277 26 157
6124 157 361 278 -24 -211 -182 -305 -320 -4 227 385 544 263 -287 -549 -530 -148 231 173 526 232 -26 27
6146 27 -421 -615 -215 167 423 351 351 -294 -336 -277 -346 -172 338 158 279 256 123 -192 -449 -256 -67 86 189
6169 189 326 27 -98 1 -239 -444 -125 -31 352 550 407 -38 -179 -190 -222 -178 -90 237 332 386 292 60 -481
6192 -481 -429 -120 206 314 142 116 16 -90 -370 -295 -174 186 596 365 407 61 -277 -357 -359 -87 226 271 178
6215 178 371 -89 -52 -403 -345 -415 125 395 455 244 166 -204 -276 -101 -75 114 122 332 299 80 -298 -267 -342 85
6239 85 -70 306 325 251 -211 -299 -162 -303 -127 -84 214 440 74 -235 -94 -469 -16 114 200 115 58 70 20
6262 20 -205 -299 -460 -289 40 249 339 365 -321 -85 -225 -161 35 -44 -91 404 149 75 15 -405 -349 -68 134
6285 134 294 265 -196 -24 -309 -127 -284 17 148 364 335 401 -203 -278 -377 -223 89 256 275 103 195 72
6307 72 -120 -416 -500 -196 151 497 438 191 -117 -148 -287 -80 -62 205 99 196 229 49 -323 -293 -291 -83 -38 226
6331 226 176 -70 401 86 -218 -209 -153 464 134 285 228 -31 -151 -254 -81 -109 162 298 248 201 99 -121 -350
6354 -350 -171 63 154 -45 252 0 -154 -133 -261 -434 92 -3 361 210 366 94 -116 -328 -350 71 268
6375 268 162 265 34 219 -96 -394 -337 -172 128 293 363 3 -51 -93 -56 -346 -37 209 174 500 347 100
6397 100 -280 -409 -217 198 34 92 228 -40 -37 -77 -307 -176 -31 137 263 354 -10 -406 -190 -273 -61 -150
6419 -150 -41 198 235 426 13 -260 -330 -155 127 316 384 165 187 -81 -205 -29 -125 -52 17 268 370 224
6441 224 -106 -273 -114 -194 129 154 114 157 20 -39 -369 -234 -395 -92 61 285 316 66 19 -134 -351 -41
6463 -41 120 13 -57 182 95 -144 -47 -330 -304 -41 143 226 45 84 -3 -159 -318 -176 -126 4 172 291 314
6486 314 -182 -336 -363 -138 120 396 -9 53 30 -29 -396 -377 -230 190 -7 543 33 -249 -242 -156 -446 268 34
6509 34 359 154 366 97 102 -387 -362 -252 -46 198 102 184 -173 134 -183 -301 -259 13 158 264 169 77 -245
6532 -245 -368 -396 -118 139 -203 269 250 200 -55 -189 -271 -271 -88 419 372 216 65 48 166 -335 -116 99 143
6555 143 34 331 210 -297 -460 -352 16 0 82 72 209 83 116 -109 -110 -385 -118 -26 239 205 175 -222 -39
6578 -39 -175 -106 136 205 244 122 153 129 -9 -306 -67 150 288 122 209 -18 -140 -145 -307 -327 -134 409 443 -16
6602 -16 45 -278 -207 44 -49 293 84 250 67 -105 115 -61 -330 -164 78 112 150 188 68 -220 36 -1 -227
6625 -227 -361 -23 22 91 -63 -147 -379 -260 -191 -163 -65 462 -22 4 -210 101 20 -232 -259 71 97 -121 58
6648 58 -332 -110 -353 175 -22 185 164 -132 158 12 -68 -69 -296 187 44 1 121 -109 -22 -191 -113 -239 -80
6671 -80 -38 486 317 244 138 -70 -162 -146 35 84 205 39 -35 -86 -8 -87 -101 -40 -45 78 93 -14 -10 -44 -275 -330
6697 -330 17 18 208 274 222 120 -327 -122 -139 38 267 397 40 111 40 -173 -236 -142 -43 -125 262 -37 -56 277
6721 277 -128 -239 85 179 32 104 135 218 -23 -76 -183 -223 164 278 260 280 -35 -45 76 -25 -133 -150 274
6744 274 206 412 82 -160 -335 -355 -310 147 280 0 -154 196 6 -203 -217 -145 60 131 108 87 -134 -131 -29
6767 -29 -94 -14 182 155 -85 165 208 -170 -153 -83 40 35 -96 216 230 90 -86 -202 -342 -283 72 149 382 385 -63
6792 -63 -211 -184 65 -227 88 -13 3 190 -97 -246 -80 -147 -45 124 160 194 230 49 -146 -50 47 -63 34
6815 34 153 106 183 122 -46 -204 -217 -235 285 103 227 -146 156 -33 97 -336 108 12 -168 70 157 68 -173
6838 -173 -291 -101 97 -68 87 81 169 4 66 -120 -221 -129 -123 249 286 308 -103 -119 89 -79 -234 -204 -102 78
6862 78 246 265 -100 -74 -60 -27 28 -25 201 -10 -35 -58 -82 -243 -105 -65 192 212 0 184 -223 -84 -155 -136 -59
6887 -59 97 67 156 105 -298 -236 -104 231 -55 178 210 -63 -179 -82 47 -180 -245 -60 19 190 277 -77 -386
6910 -386 26 2 -218 -149 97 153 -71 281 45 -166 -125 -137 46 232 80 15 269 -121 -191 -425 -38 183
6932 183 94 119 292 270 -93 -202 -115 101 67 151 22 178 170 -18 -158 -233 -102 -104 344 303 164 2 -87 -141 -200
6957 -200 -228 -125 119 121 -76 282 -133 -263 39 117 -46 299 -283 16 134 29 -24 -26 -77 202 306 157 96
6980 96 76 -196 -103 -46 379 -154 31 66 128 191 -104 -248 -234 27 107 285 -94 53 -34 -312 -380 -129 -175 -12
7004 -12 24 168 4 -36 -146 -235 -23 68 108 -55 160 0 0 125 -248 -226 -170 -290 242 49 -91 9 90 -129
7028 -129 -169 -35 118 -235 174 -250 169 107 -8 -260 -216 327 25 -71 23 102 -42 -131 -99 78 11 88 253
7051 253 350 214 118 -30 -140 -212 -9 169 55 128 50 164 -53 -254 -151 120 -292 3 35 -57 -208 72
7073 72 -103 -138 336 176 -15 23 109 13 -86 -136 -167 -76 117 -225 -6 15 -97 -140 47 -222 -35 226 358 74
7097 74 80 -213 -67 133 34 200 218 -37 -1 204 79 67 -177 143 165 289 -102 -42 16 83 -230 37 -360 -194
7121 -194 -107 -69 162 116 105 -111 125 13 90 -151 8 54 81 -291 -55 -220 -41 -118 207 247 78 -2 -152
7144 -152 -118 -162 67 4 -138 247 260 227 -53 -250 -18 -119 129 372 -10 -183 262 88 -131 -148 -248 -154
7166 -154 181 60 138 53 -64 -132 84 -29 -34 -78 -43 -31 51 -48 -27 29 -43 10 143 -32 -35 14 15 -142 3 -107
7192 -107 -61 -179 -59 26 -43 -150 -188 -250 -109 -125 -156 143 94 266 179 -173 -95 -186 -95 107 268 95 -71 -225
7216 -225 35 10 -55 20 -155 116 60 120 -56 -54 -46 -283 -219 -29 13 158 -23 -5 -58 -94 -271 -145 10 127 -82
7241 -82 52 -240 -85 -239 -40 103 -163 -13 -232 40 28 -196 -207 -199 -70 128 112 244 80 -2 -65 -185 12
7264 12 -205 54 -19 280 135 -323 -247 -71 -152 61 215 -101 23 239 -59 -142 -257 77 -46 62 220 49
7286 49 73 -35 -208 187 -55 -59 -135 60 207 -285 96 -184 -134 -141 25 -114 -92 9 -28 -29 -95 28 -174 86
7310 86 5 256 53 220 135 -300 -32 -62 20 102 8 75 71 74 220 -296 -122 -115 39 56 219 -52 109 103 -42 3
7336 3 -9 304 175 197 -110 -150 -259 54 -171 -42 64 75 187 -311 26 98 -220 -119 -155 134 138 -75 100
7359 100 -89 99 -97 130 -166 58 -168 -32 185 -61 -187 72 -177 26 20 -61 182 152 -7 58 -109 -328
7381 -328 -154 201 351 180 134 -296 81 30 -58 125 -96 200 45 289 109 119 -187 -116 70 74 -133 33
7403 33 -100 -152 62 -273 -126 10 139 261 130 -70 10 -78 -46 110 8 49 -100 220 -41 6 52 -176 -10
7426 -10 96 -51 -62 -36 -3 -81 -168 -180 -35 -6 52 186 70 142 45 141 -178 97 145 212 109 -103 18 34 -20
7451 -20 11 41 105 30 -19 361 131 168 -58 -234 -80 25 61 317 115 -64 36 122 -12 -263 -87 -150 39
7474 39 -49 15 -55 -118 -87 -95 -222 92 14 -46 301 95 -7 59 131 39 -220 -111 -10 89 9 -33 -189 -184 -203 -126 241
7501 241 174 28 -43 20 16 102 -148 31 219 70 -3 -53 -38 -88 -238 -98 -23 91 229 -241 52 65 -147 128
7525 128 16 -270 288 -119 82 -85 -260 -38 64 -90 139 127 -217 1 -50 -101 -52 -44 -130 -270 159 357
7547 357 27 401 101 -215 -80 -13 -129 162 82 -17 -107 50 107 -352 225 -110 47 115 71 107 -27 -174 -48
7570 -48 -205 -27 170 103 11 32 -20 -101 -99 -151 22 -50 -162 75 -78 -68 8 -8 -204 104 56 62 -191 -156 33 -63
7596 -63 -243 -71 127 -48 127 1 -69 -103 -132 12 42 52 190 4 115 194 -238 -114 -215 -226 230 29 155
7619 155 85 -16 -50 -26 -2 -103 66 77 63 62 -37 -48 -165 15 81 -35 66 -73 -101 14 66 -76 -268 21
7643 21 41 -123 53 12 46 -134 -44 44 -255 108 56 216 125 95 290 -281 -42 -131 91 234 123 150 332 -192
7667 -192 217 20 -234 87 -45 -23 63 125 75 4 -134 -14 63 -81 141 255 -284 54 -114 -198 223 89
7689 89 -40 152 52 -157 -93 -19 -140 -68 281 -106 184 36 3 31 -284 -77 61 -26 127 281 -56 110
7711 110 -105 44 -86 29 -42 -50 361 66 61 26 -362 134 14 170 139 263 -3 69 -144 -179 -174 -67 32 152
7735 152 128 182 66 -76 -80 -338 -99 -123 42 166 194 60 8 -106 2 -160 -87 38 62 -67 138 -58 -48
7758 -48 -35 120 -159 236 269 -141 179 -117 -136 253 206 176 38 126 168 21 -125 -78 39 189 62 -93 35
7781 35 85 -13 -190 -156 -119 -144 -78 12 111 36 -257 -184 -108 10 279 92 234 157 -68 266 -204 -15 -110 -199 152
7806 152 265 174 93 -231 -97 63 -236 -136 0 80 243 271 34 -223 -61 -205 73 311 246 137 -69 173
7828 173 -137 0 -98 -108 -55 184 -128 12 -240 -42 -152 9 -150 81 11 237 478 32 -288 -33 3 -168
7850 -168 140 204 144 227 -77 -9 -111 -123 36 -1 310 355 252 -187 -219 -12 21 -69 38 83 158 -134 315 -116
7874 -116 -125 -7 -191 254 343 194 -60 -65 1 -183 20 -384 8 160 -169 -63 -225 -146 -81 71 -81 -138 112
7897 112 46 -12 -245 -38 -172 -222 -123 90 76 107 270 -84 -118 -144 -156 -64 118 287 107 -261 85 -161 -78 4
7921 4 -105 97 182 116 136 88 -325 -194 -49 -165 -6 280 206 -46 1 -76 -235 -238 -145 345 65 54 321 148
7945 148 17 -58 -216 -30 26 371 -104 202 -240 -206 210 -330 237 -33 146 -134 92 85 -229 -62 -248 170
7967 170 119 138 95 -76 -101 1 136 -38 -38 264 145 -15 217 -5 77 -99 -170 256 -66 31 166 154 -286
7990 -286 -205 -217 -66 -149 211 40 133 -135 33 32 -268 20 -177 181 249 347 117 18 -186 -98 -156 170 166 267
8014 267 140 -8 -213 -107 -239 -224 137 126 99 257 6 16 -192 -203 -77 68 150 195 194 300 155 3 -27
8037 -27 76 178 157 -22 71 125 67 -256 -38 -241 -193 285 28 326 68 -46 -22 -147 -82 360 -127 257 194
8060 194 328 -9 -212 -237 -147 -123 -32 213 -152 -58 -203 -63 -67 -114 224 -75 49 131 197 84 -217 -23 -86 264
8084 264 159 134 144 246 -125 -100 -99 58 59 44 22 86 5 -213 -12 -46 -45 114 12 79 107 -5 -110 -96 -48 -48 19
8111 19 105 290 39 95 19 -50 -141 -131 124 77 313 114 224 -20 -109 -220 -41 265 -60 81 112 -18 135
8134 135 -119 -5 -58 -47 128 303 73 184 -122 30 88 -173 -47 34 -44 -10 115 -156 -172 -218 5 166 -27
8157 -27 171 -40 -69 -46 -89 -114 -59 116 29 239 168 116 -282 -176 -88 -342 36 179 237 188 59 156 -42 -74 -68
8182 -68 23 -48 40 42 124 -418 -118 -359 -7
8191g
$$ Imaginary data points
##PAGE= N=2
##DATA TABLE= (X++(I..I)), XYDATA
0 0 0 0 0 0 0 0 0 0 0 0 0 0 0 0 0 0 8 -8 8 -8 8 -9 15 -16 16 -21 24 -27 32 -35 41 -49 53 -59 68 -76 86 -97
38 -97 108 -119 134 -148 164 -182 200 -221 243 -268 297 -327 360 -396 436 -484 533 -592 659 -736
58 -736 823 -929 1058 -1218 1422 -1693 2071 -2639 3588 -5464 10619 -56098 -189451 -118600
72 -118600 -964 88008 93385 39136 -12207 5081 22375 -12413 -77394 -101436 -41680 81948
84 81948 147015 87107 -28874 -98137 -89481 -16718 41873 27415 -13056 -503 46010 63080
96 63080 19403 -61353 -108889 -64019 33101 95779 78115 5457 -51893 -41499 -650 4349
108 4349 -22197 -32355 -5398 47754 80844 42865 -41184 -86951 -61130 2771 49151 44904
120 44904 10065 -5664 6231 14706 -1245 -39110 -62196 -27296 40768 72080 47733 90
132 90 -37797 -42867 -18896 -1667 -5713 -5469 16620 46092 51871 11640 -48089 -71410 -45013 3875
146 3875 46740 56159 28696 -167 -11028 -22093 -38332 -39917 -16432 25142 61332 58633 14486
159 14486 -37692 -62757 -46799 -5256 25850 30714 28561 26390 11441 -14101 -38286 -49991 -32258
172 -32258 13998 52848 54225 24742 -12438 -34256 -34292 -25448 -15346 3546 27743 44389 43034
185 43034 12843 -35443 -61611 -43506 -4108 28674 41899 32229 12285 -1992 -13692 -30298
197 -30298 -39809 -27488 7166 45095 53881 24254 -16155 -38942 -36001 -14195 6536 9901 8212
210 8212 18852 29209 18300 -11650 -39903 -43212 -15401 22424 40211 28470 2994 -11433
222 -11433 -8222 -5316 -17571 -28509 -16362 15296 44975 47888 13809 -33407 -53815 -34475 1501
235 1501 23337 23366 15792 14669 14326 1163 -25155 -46866 -39670 1550 47771 58250 27239 -14942
249 -14942 -37751 -31905 -12371 -72 129 4354 22120 39097 29846 -8936 -48564 -54788 -22958
262 -22958 21793 46846 37850 8971 -11627 -14097 -13210 -21011 -26253 -11787 20089 47417 45036
275 45036 9286 -35892 -54947 -34115 5541 30357 29198 16494 7192 1340 -7981 -21822 -32302
288 -32302 -23843 7397 40435 45990 18555 -18275 -36424 -29694 -10083 6396 12184 12489 15953
301 15953 20341 11654 -12788 -36025 -36233 -11804 19330 36399 30509 9162 -10609 -18281 -17957 -17142
315 -17142 -13525 290 21334 34419 27402 2256 -25712 -38057 -26142 -391 19488 24113 18446
328 18446 10219 228 -11572 -21807 -23546 -13462 6974 26102 30167 14839 -6613 -20615 -22050
341 -22050 -15907 -5235 6393 16032 21483 19580 6808 -14390 -30172 -28220 -9518 12694 27030
354 27030 27818 15754 -2761 -18383 -25430 -23381 -11938 7918 27367 32903 19985 -3172 -23980
367 -23980 -32742 -24683 -4170 15899 26209 25060 14797 -1157 -19106 -28522 -23410 -7553 11337
380 11337 25480 28066 16063 -3955 -19479 -25496 -21407 -8064 10205 23865 26149 15925 -1307
393 -1307 -18423 -27853 -23209 -6380 13254 25168 26130 15443 -4691 -22759 -28120 -19328 -2066
406 -2066 16195 26770 23237 8691 -8547 -20731 -23459 -16735 -2320 14822 25061 21782 8558
419 8558 -7665 -21494 -23970 -13307 1380 12880 18959 18664 10350 -3017 -15651 -22913 -19365 -6040
433 -6040 11507 24299 23558 10132 -6241 -17024 -21473 -17349 -4920 9573 19486 22521 15306 -1890
447 -1890 -19485 -26173 -18571 -1917 14054 21576 19128 8835 -5273 -15311 -18539 -16205 -6293 9437
461 9437 21211 20979 11128 -3968 -17447 -21964 -15532 -2727 10387 18993 20502 13515 -935 -17563
475 -17563 -25522 -20134 -5302 12706 25905 24972 11042 -5871 -20037 -25905 -19783 -3738 14721
488 14721 26436 25822 11433 -8004 -23846 -27451 -16854 1633 15888 23193 21533 9728 -7444
501 -7444 -20310 -23656 -17128 -1140 15944 23961 19640 6541 -8829 -18071 -19520 -13984 -1492 12633
515 12633 20262 19229 10268 -6272 -20696 -22184 -12519 1429 14548 20684 16563 5674 -7062
528 -7062 -17541 -20287 -13593 22 15256 22923 16435 2332 -9835 -17355 -17702 -9156 2653 11041
542 11041 16191 16296 7246 -6102 -16877 -19049 -11462 1779 11709 16086 14359 6836 -2596 -10651
556 -10651 -17599 -18133 -6327 10976 21516 21238 10227 -7052 -18789 -18885 -10934 -945 8519 15767
570 15767 18334 13560 -1431 -18011 -24944 -18152 -567 18389 25032 15528 313 -9533 -14194 -14509
584 -14509 -10839 -3030 7930 19061 22466 11662 -8535 -24982 -24965 -9569 8554 17743 17334 10783
598 10783 2106 -4898 -11995 -18550 -18557 -4630 16510 29061 23271 2942 -17903 -25999 -18451 -2850
612 -2850 9259 13525 13298 12916 8491 -4744 -19227 -24348 -14688 5159 22607 25253 11190 -6815
626 -6815 -15051 -12758 -7706 -4203 -769 5826 13615 16758 9525 -6666 -21185 -21089 -6431 9011 15386
641 15386 13248 6144 247 -3554 -7520 -13017 -14470 -5542 11384 23027 19505 2846 -13300 -20208
655 -20208 -15277 -3421 6439 9839 10736 11776 8940 -2461 -16147 -21650 -14592 1900 17841 22116
669 22116 12883 -1410 -10911 -12790 -11330 -9256 -3235 7667 17441 19196 10535 -5979 -21457 -22907
683 -22907 -9988 5935 15403 16486 12066 3877 -5426 -13772 -18012 -14193 -1441 14951 24110 17881
697 17881 602 -14662 -20034 -14937 -4155 7054 13081 13494 11010 3673 -8309 -17671 -17901 -7507
711 -7507 7256 17349 17456 8876 -3456 -11725 -13288 -10527 -5832 2830 12378 16344 11987 1402
725 1402 -10639 -17441 -14477 -3952 6784 12761 13286 9919 2116 -8194 -15904 -15074 -6816 4690
739 4690 14804 16919 9151 -2602 -9728 -12127 -11275 -6099 2179 10915 15042 11585 2252 -9643 -16535
754 -16535 -12861 -2311 6907 9906 9350 7541 3255 -3450 -10681 -14639 -11239 716 14425 19619
768 19619 11826 -2307 -12151 -13913 -10084 -3581 2922 8202 12477 14030 7322 -7914 -20552 -20205
782 -20205 -6604 10264 19695 16750 4999 -5832 -9837 -9611 -9280 -8017 -982 11230 19283 16241
796 16241 1941 -14473 -22203 -14899 760 11442 12228 8310 5237 2319 -3136 -11268 -16258 -12028
810 -12028 1420 17549 22179 11486 -6080 -16244 -14867 -7047 596 5433 7709 9574 10302 5291
824 5291 -7043 -18434 -17938 -4296 11469 18589 13955 2171 -7788 -10604 -7373 -5095 -3976 343
838 343 8914 14834 11708 174 -12202 -17865 -11497 1082 10372 11414 7164 3926 1194 -4210 -10305
853 -10305 -13326 -8865 2720 14653 18433 9421 -4540 -13290 -13223 -7621 -880 4800 8662 9932 8783
868 8783 2857 -7137 -15354 -14113 -3555 8074 13733 11562 4220 -3516 -8038 -8402 -7365 -4931 1324
883 1324 9833 13997 9587 -398 -10322 -14126 -10450 -1899 6945 11082 10036 6378 616 -7555 -13355
898 -13355 -12464 -4431 5981 13853 14735 7139 -4038 -11788 -13298 -9269 -2135 6038 12875 13572 7346
913 7346 -2101 -11086 -14644 -10776 -315 8548 11940 10700 5516 -2063 -9415 -12478 -10074 -2384 6713
928 6713 12939 12655 4912 -4352 -9961 -10454 -7618 -2293 4926 10621 11543 7786 -1399 -11343 -14943 -9437
944 -9437 1154 9813 12136 8151 2202 -3826 -8212 -9315 -7423 -2982 5264 12992 12905 4176 -6041
959 -6041 -12049 -11256 -4440 3301 6687 7078 6323 4813 1261 -5972 -11967 -11441 -2790 7231 13218 11898
975 11898 3063 -6214 -9035 -7686 -5682 -2675 2442 8208 11558 9471 365 -10073 -15235 -11076 397
990 397 10112 12003 7730 2356 -2843 -6838 -8481 -8476 -4658 3917 12311 13513 6358 -4515 -12456 -12231
1006 -12231 -5310 1663 7432 9256 7285 3803 -376 -7208 -12668 -10062 -1508 7551 13917 12135 2924
1021 2924 -6417 -11090 -10515 -6006 419 6494 11045 11406 4646 -4364 -11147 -13195 -8005 2877 10541
1036 10541 11340 7953 1923 -5417 -9652 -9565 -6390 566 7640 10518 8788 2630 -5877 -10080 -7870
1051 -7870 -4395 599 6158 9015 6880 3547 -2290 -8939 -10183 -6261 621 7322 9900 6767 1943
1066 1943 -3393 -7688 -8869 -5388 -830 5176 10890 9706 2494 -4892 -9378 -9854 -4727 2474 6357
1081 6357 7982 7112 2792 -2139 -7202 -10459 -7418 113 7073 10061 9009 2507 -5135 -8126 -7673
1096 -7673 -6123 -1248 5063 9381 10238 5853 -3317 -10158 -11521 -7477 954 8994 10207 7333 2825
1111 2825 -3326 -9081 -10142 -6676 -753 7573 12523 9335 1710 -6181 -11073 -8790 -2924 2665 6689
1126 6689 9087 6614 1717 -3511 -8898 -10797 -4984 3379 8771 10029 6096 -799 -5715 -7545 -7206
1141 -7206 -3721 1340 5687 9583 9079 1908 -6352 -10332 -9289 -3630 4421 8863 7461 4672 1152
1156 1152 -4099 -7674 -8233 -5210 1675 8213 9844 6180 70 -6292 -8745 -5473 -1861 1339 4850
1171 4850 6814 5331 2591 -2658 -8115 -8833 -4135 1838 6735 8253 4988 963 -2769 -6448 -7355
1186 -7355 -4715 159 5438 9608 8206 1510 -5150 -8561 -7973 -3633 2189 6449 8150 6982 2088
1201 2088 -4074 -9343 -10085 -4977 3523 8905 9107 5685 -277 -5813 -7805 -6714 -4393 778 6971
1216 6971 9834 8062 1263 -6796 -10389 -8009 -2374 3822 7414 6908 4769 1716 -2670 -8090 -9508
1231 -9508 -5549 2035 9252 11207 6192 -2158 -8147 -8401 -4760 -760 2529 5036 6966 6058 1544
1246 1544 -4829 -9351 -9356 -2118 5835 9349 6582 1627 -2670 -4663 -4478 -3973 -2707 52 4916 8413
1262 8413 7401 502 -6870 -9024 -6103 -347 4720 5983 4830 3114 1124 -1982 -6198 -8093 -5054
1277 -5054 1755 8003 9671 5511 -1323 -6775 -7239 -4282 -1135 1762 4327 6708 6057 1701 -4064
1292 -4064 -8175 -8090 -2885 3796 7631 6595 2941 -580 -3685 -5569 -5909 -3218 893 5896 8273 6244
1308 6244 -264 -6449 -8110 -5814 -1425 3007 6380 6913 4741 499 -4448 -8569 -8245 -2555 4519
1323 4519 8934 7829 3335 -2156 -6270 -6876 -4955 -1414 2652 6686 8288 4927 -1486 -6991 -8630
1338 -8630 -5315 -135 4489 6481 5397 2625 -172 -3935 -6705 -6640 -2810 3395 7555 7740 3722 -2020
1354 -2020 -6245 -6336 -3443 -528 1986 5018 6541 4732 14 -5382 -8188 -6344 -370 5179 7315
1369 7315 4741 1210 -1536 -3941 -5248 -4755 -2108 2310 6334 7612 4229 -2210 -6750 -6680 -3155 453
1385 453 2978 4404 4353 3569 1139 -2729 -7317 -7465 -2755 4551 8457 7016 2326 -2408 -5130 -5397
1401 -5397 -3486 -1869 790 5009 8188 6009 -481 -6714 -9176 -6024 470 5878 6554 4162 860
1416 860 -689 -2346 -5100 -5948 -3056 2403 7120 8464 4236 -3222 -7439 -6590 -2523 1112 3128 3757
1432 3757 4031 3558 830 -3570 -7619 -7429 -1800 5683 8919 6353 1039 -3646 -5833 -4944 -2856 -698
1448 -698 1897 5229 6905 4588 -1459 -6960 -8645 -4453 1401 5850 6605 3899 254 -1776 -3384
1463 -3384 -5108 -4832 -1585 3152 6569 6796 2583 -2920 -6069 -5701 -2662 748 2609 4131 4802 3164
1479 3164 -621 -4250 -6490 -5442 -638 5149 6483 4699 1171 -2207 -4366 -4581 -3688 -806 2826
1494 2826 5652 5873 2960 -2387 -6394 -5543 -2426 746 3557 4791 3484 2041 -515 -3727 -5932
1509 -5932 -5069 -729 4279 6738 5285 1145 -2490 -4692 -5064 -2646 -659 1550 4957 6869 3882
1524 3882 -1166 -6154 -7608 -4827 1050 4916 5834 4102 1363 -1555 -3459 -5404 -5076 -820 3827
1539 3827 6835 6142 2055 -3918 -6610 -5182 -1653 1163 3332 3840 3951 2497 -961 -4682 -6469 -4612
1555 -4612 341 5489 6761 3670 -273 -2913 -4464 -4266 -2168 -549 2544 5693 5960 2493 -3085
1570 -3085 -6870 -6376 -1744 2410 4493 4690 2620 418 -1528 -3237 -5400 -4345 118 4560 6351
1585 6351 4907 75 -4090 -4748 -3212 -987 645 1701 2938 4358 3061 -1036 -4895 -6036 -3756
1600 -3756 1046 5150 4864 2224 321 -1395 -2492 -3714 -3429 -1573 2363 5887 6123 2312 -3320 -6834
1616 -6834 -5290 -1041 1771 3556 3776 2880 1280 -552 -3638 -5938 -4522 339 5064 6956 4068
1631 4068 -291 -3794 -4459 -3465 -1366 128 1592 4015 5285 3034 -2034 -5761 -6431 -3246 2022 5514
1647 5514 5190 2887 -228 -1944 -3386 -4460 -3715 -322 4044 5852 4795 514 -4180 -6027 -3741
1662 -3741 -454 2072 3099 3651 2945 1037 -1756 -4417 -4885 -2739 1603 4984 5111 2152 -1049 -2500
1678 -2500 -3171 -2684 -1550 73 2524 4404 4365 1233 -2913 -5564 -4404 -1009 2047 3288 3383 2050
1694 2050 783 -936 -3166 -4770 -3579 399 4544 5749 3581 -615 -3775 -4333 -2792 -764 616
1709 616 2225 3509 3725 2033 -1924 -4563 -4866 -2391 1435 4370 4181 1779 -152 -1574 -2789 -3325
1725 -3325 -2845 -590 3028 5062 4455 969 -3365 -5318 -4196 -1049 1733 3318 3808 2820 928 -1828
1741 -1828 -4057 -4640 -2577 1588 4899 5062 2642 -612 -3131 -3773 -3255 -1402 868 3139 4345 3678
1757 3678 423 -3354 -5019 -3810 -890 2194 3714 3616 1859 30 -1824 -3445 -4294 -2460 1183 4479
1773 4479 4848 2632 -284 -3499 -3891 -2214 -695 873 2237 3352 3200 982 -2498 -4799 -4234 -870
1789 -870 2678 4354 3390 832 -889 -1622 -2341 -2408 -1660 195 2749 4297 3614 205 -3664 -4801 -2724
1806 -2724 92 1878 2235 2453 2217 1076 -816 -3461 -4756 -3253 1156 4793 5075 2453 -1128 -3090
1822 -3090 -3411 -2356 -755 169 2070 3501 3856 1482 -2884 -5208 -4197 -829 2707 4079 3129 990
1838 990 -500 -1233 -2454 -3088 -2560 419 3522 4827 3415 -316 -3657 -4593 -2434 117 1631 2351
1854 2351 2660 2274 789 -1634 -3898 -4485 -1976 2222 4930 4212 1355 -1674 -3248 -2759 -1743 -500
1870 -500 898 2389 3752 3159 92 -3417 -4938 -2952 214 2573 3520 2201 505 -561 -1282 -2420
1886 -2420 -2918 -2159 787 3316 4079 2526 -550 -3035 -3656 -2156 -198 1445 1856 2321 2183 619 -1761
1903 -1761 -3464 -3478 -1550 1790 3674 3261 1336 -907 -2103 -2606 -2212 -980 1218 2830 3169 2163
1919 2163 -158 -2635 -3607 -2455 -440 1519 2940 2745 1653 -273 -1912 -3434 -2840 -1016 1617 3492
1935 3492 3271 1583 -376 -2200 -3099 -2642 -1348 1238 3208 4112 2652 -651 -3487 -4180 -2616 176
1951 176 2029 2770 2485 1782 109 -1617 -3409 -3487 -1282 2199 4184 3434 979 -1761 -3021 -2277 -959
1968 -959 158 573 1366 2538 2571 464 -2843 -4447 -3226 -31 3037 3908 2033 -8 -1395 -1227 -1865
1985 -1865 -2114 -1763 444 3216 4325 2446 -1188 -4180 -4089 -1323 1564 2149 1845 1239 643 598 -909
2002 -909 -2795 -3551 -1593 2013 4359 3550 670 -2207 -2581 -1794 -872 -319 80 704 2519 2928 1110
2019 1110 -2613 -4049 -3211 -265 2811 3378 2121 -62 -813 -1111 -1536 -1986 -1752 402 3128 3734 2304
2036 2304 -1190 -3626 -3734 -1209 1050 2025 1603 1317 1033 465 -1299 -2833 -3092 -1400 1967 4274 3497
2053 3497 292 -1660 -2574 -2062 -1209 -139 582 1990 2902 2203 -22 -2840 -3977 -2519 277 2566
2069 2566 3005 2155 628 -868 -1626 -2030 -2399 -794 1681 3026 3161 1488 -1400 -2973 -2800 -1295 444
2086 444 1846 1937 1702 1272 -469 -2009 -2737 -1753 -267 1891 2821 1741 328 -935 -1929 -2288 -1569 -599
2104 -599 1316 2885 2407 889 -966 -2776 -2784 -1270 364 1112 1903 2298 1223 -438 -2116 -3256 -2090
2121 -2090 115 2323 2854 1901 -144 -976 -1101 -1789 -1975 -872 697 2257 3180 2036 -989 -3275 -2953
2138 -2953 -1213 801 1840 1547 1090 1078 452 -1045 -2231 -2953 -1336 1950 4073 2766 711 -1835
2154 -1835 -2867 -1901 -161 250 697 1435 1939 2093 92 -2296 -3830 -2305 537 2994 3428 1448 -968
2171 -968 -1472 -767 -1174 -1425 -802 338 2435 3362 1837 -1291 -3365 -3125 -1174 1364 2048 1540 878 392
2189 392 -91 -840 -2180 -2795 -1172 2140 3321 2680 431 -2017 -2629 -1362 -190 548 610 641 1492 1711
2207 1711 114 -2247 -3011 -1730 248 2363 2723 1276 -329 -946 -872 -1217 -1276 -952 602 2326 2613
2224 2613 1266 -726 -2532 -2595 -741 1070 1279 1567 1551 971 -148 -1386 -2502 -2460 -547 1959 2966
2241 2966 2459 93 -1692 -1757 -1593 -916 7 995 1756 2261 1288 -732 -2569 -2904 -1269 292 2041 2385
2259 2385 1356 295 -612 -1380 -1617 -1761 -726 1599 2554 2478 662 -1167 -2229 -2112 -881 487 1267
2276 1267 1729 1814 839 -707 -2249 -2524 -1312 428 2080 2762 1353 -313 -812 -1165 -1804 -1222 87
2293 87 1493 2236 1903 546 -1249 -2327 -2172 -617 575 1362 1554 1459 986 -34 -1532 -2348 -1885 -54
2311 -54 2073 2545 1301 -73 -996 -1268 -1277 -1120 -349 679 2003 2316 1340 -1070 -2677 -2321 -982 946
2329 946 1806 1683 568 225 -282 -988 -1678 -1926 -723 1472 2680 2121 540 -1402 -2414 -1508 -454
2346 -454 531 398 958 1526 1474 113 -1831 -2791 -1765 82 2372 2612 1464 -420 -1456 -1162 -1315 -978
2364 -978 -310 678 2200 2582 1096 -1163 -2997 -2371 -498 1209 1695 1533 907 283 -431 -931 -1891 -1823
2382 -1823 -437 1682 2582 1967 65 -1487 -1861 -1357 -112 402 676 1481 1803 1396 -293 -2086 -2464
2399 -2464 -1297 492 2171 2096 646 -270 -1110 -947 -1136 -1294 -226 1123 2217 2120 516 -1405 -2510
2416 -2510 -1646 -232 830 1331 1073 899 802 -128 -1086 -2050 -1702 45 1780 2587 1392 194 -1406 -1592
2434 -1592 -943 -659 -202 481 1482 1979 1168 -587 -2500 -2285 -915 807 1856 1914 757 159 -519 -1039
2452 -1039 -1415 -1507 -316 1061 2191 1761 438 -1447 -2045 -1734 -361 596 1187 1256 1255 559 -332 -1654 -1948
2471 -1948 -1282 227 1922 1974 1165 -125 -1085 -1347 -1473 -944 66 1372 1794 2017 660 -1489 -2393 -1792
2489 -1792 -481 644 1115 1634 911 398 -510 -1488 -1844 -1094 475 1824 2185 777 -492 -704 -1350 -1078
2507 -1078 -704 -324 677 1530 1798 641 -699 -2095 -1830 -456 1129 1178 1182 900 -47 -265 -883 -1578 -1464
2526 -1464 2 1494 2313 1714 26 -1520 -1773 -1126 -355 155 720 1013 1555 1017 -446 -1834 -2102 -1147
2544 -1147 563 2089 1962 595 16 -874 -977 -1063 -977 -671 814 2098 2077 1048 -1167 -2334 -1961 -463
2562 -463 852 1449 1367 746 432 -171 -1102 -2239 -1423 132 1643 2402 1166 -505 -1494 -1450 -768 -42 230
2581 230 685 1063 1663 594 -722 -1984 -1946 -927 979 2104 1594 545 -335 -853 -930 -863 -1187 -249 1259
2600 1259 2001 1600 504 -1631 -2279 -1492 -218 754 1085 771 943 805 -504 -1256 -1759 -1489 287 1710
2618 1710 2114 986 -598 -1279 -1407 -979 -140 -89 548 1442 1610 637 -658 -1663 -1913 -641 782 1266
2636 1266 1364 1011 -87 -602 -986 -1358 -1200 -155 913 1775 1737 381 -1271 -1926 -1414 -575 685 1255
2654 1255 1338 1199 604 -737 -1464 -1493 -957 558 1478 1835 816 19 -961 -1677 -1377 -761 194 1203 2091
2673 2091 1287 235 -769 -1557 -1421 -660 271 1033 1364 1205 389 -592 -1491 -1870 -832 265 1729 1920
2691 1920 916 -446 -897 -1418 -1029 -532 144 950 1548 1681 227 -1292 -1952 -1485 -166 883 1301 811
2709 811 510 127 -488 -776 -1129 -1138 21 1475 1845 1201 -487 -1577 -1579 -861 -314 122 775 1168 1479 875
2729 875 -347 -1865 -2026 -1051 611 1807 1778 531 -564 -582 -800 -829 -756 -221 753 1924 2017 478 -1450
2748 -1450 -2069 -1730 -12 928 969 706 876 317 -64 -1065 -1824 -1379 -7 1684 1974 1251 -303 -1208
2766 -1208 -1449 -691 -314 231 391 933 1572 923 -881 -2001 -1854 -524 1015 1719 1613 309 -423 -808
2784 -808 -800 -1093 -933 -86 1237 2125 1670 148 -1489 -1900 -1231 64 687 752 809 681 65 -391 -1243 -1742
2804 -1742 -1186 253 1519 2058 1033 -649 -1286 -1381 -671 -232 160 1081 981 1324 615 -727 -1956 -1577
2822 -1577 -282 769 1515 1281 463 -153 -738 -1069 -1394 -815 201 1069 1713 1235 -19 -1109 -1581 -948
2840 -948 -108 348 1007 1389 816 443 -817 -1683 -1371 -833 472 1465 1436 735 -18 -674 -1201 -1409 -563 383
2860 383 1341 1827 1355 -51 -1331 -1824 -1219 -239 806 639 1112 1104 586 -770 -1740 -1568 -635 715 1855
2879 1855 1677 729 -335 -805 -1169 -884 -731 82 983 1477 1732 235 -1097 -2215 -1539 143 815 1299
2897 1299 1007 383 -102 -203 -1009 -1472 -999 247 1628 2132 1068 -595 -1539 -1572 -697 114 617 579 1082
2916 1082 1125 625 -612 -1761 -1680 -573 810 1833 1554 288 -490 -853 -806 -744 -785 1 994 1618 1557 241
2936 241 -1405 -2056 -998 -230 996 1203 547 665 245 -497 -1068 -1597 -1044 489 1823 2006 906 -577
2954 -577 -1145 -1458 -634 -98 255 674 1047 1404 568 -976 -1839 -1629 -626 942 1846 1571 335 -464 -556
2973 -556 -993 -1241 -1007 138 1350 1874 1393 38 -1428 -1934 -845 443 605 1354 911 660 320 -795
2991 -795 -1560 -1390 -654 354 1731 1738 705 -675 -1004 -1077 -748 -248 295 880 1313 1267 514 -951 -1705 -1193
3011 -1193 -122 833 1403 1073 697 -152 -765 -1058 -1214 -409 583 1476 1518 632 -581 -1146 -1559 -868 -56
3030 -56 518 1066 1068 968 29 -1057 -1684 -1282 -254 745 1330 1122 429 -310 -770 -1201 -1100 -730 420 1304
3050 1304 1677 982 -63 -1247 -1473 -1168 -96 524 979 1021 600 281 -743 -1185 -1540 -577 885 1834
3068 1834 1773 715 -300 -967 -1012 -738 -10 270 1216 1574 1198 -37 -1326 -1957 -1236 44 1308 1501
3086 1501 925 268 -325 -629 -952 -1175 -531 411 1674 1861 1081 -172 -1578 -1748 -690 219 496 1019
3104 1019 1152 924 172 -932 -1789 -1503 -493 871 1851 1389 378 -662 -1044 -877 -1057 -453 277 1234
3122 1234 1606 1011 -170 -1376 -1619 -1119 256 825 1185 827 708 -96 -701 -1212 -1405 -655 822 1646
3140 1646 1687 534 -645 -1569 -1153 -737 -13 582 995 1009 1132 203 -1283 -1759 -1196 -179 1045 1730 1094
3159 1094 357 -567 -887 -1199 -910 -685 184 1572 1546 957 -201 -1630 -1680 -734 323 746 795 928 728
3178 728 260 -746 -1604 -1836 -434 1044 1637 1565 515 -663 -1431 -1024 -938 -192 309 1099 1333 1070 -147
3197 -147 -1575 -1677 -1049 308 1235 1283 1023 449 -573 -1084 -1170 -1269 -184 737 1671 1657 571 -749 -1633
3216 -1633 -1488 -515 267 699 1186 1169 783 -49 -1065 -1858 -1155 -30 1209 1646 1116 378 -727 -1116 -1151
3235 -1151 -1058 -368 465 1285 1603 859 -476 -1585 -1378 -704 378 1213 1058 988 639 -125 -1033 -1271 -1379
3254 -1379 -351 1244 1644 1437 449 -559 -1408 -1339 -731 -119 713 967 1388 790 -411 -1641 -1776 -966
3272 -966 167 1111 1522 1046 3 -542 -966 -1306 -1178 -345 612 1515 1763 647 -443 -1419 -1441 -805 217
3291 217 949 1255 1245 582 -174 -1176 -1678 -1258 159 1280 1567 1094 215 -464 -1095 -1194 -749 -333 547 1509
3311 1509 1579 702 -552 -1514 -1436 -735 187 770 1128 683 462 -302 -1003 -1651 -1589 -238 1095 1574 1303 204
3331 204 -949 -1283 -1059 -529 -86 645 1079 1422 860 -198 -1471 -1861 -823 253 1498 1666 986 16
3349 16 -622 -900 -997 -1046 -399 721 1765 1580 601 -711 -1687 -1727 -685 389 830 1012 1011 436 -26 -1021
3369 -1021 -1627 -1350 174 986 1943 1211 31 -809 -1337 -1157 -447 50 845 1235 1402 883 -515 -1613
3387 -1613 -1808 -945 181 1318 1311 978 301 -770 -1069 -1323 -1219 -150 1213 1782 1278 81 -1031 -1517
3405 -1517 -1037 -423 256 907 1257 1030 642 -470 -1504 -1729 -986 341 1122 1659 848 143 -617 -1082 -1263
3424 -1263 -837 -7 1086 1509 1563 505 -804 -1255 -1400 -638 510 1058 1096 1129 392 -475 -994 -1548 -864
3443 -864 -23 1250 1759 1153 32 -1027 -1325 -889 -555 -149 542 1348 1486 808 -701 -1860 -1603 -583
3461 -583 351 1241 1239 879 -58 -479 -1069 -1363 -1023 249 1157 1689 1291 254 -865 -1293 -1221 -702 362 1028
3481 1028 1156 1096 619 -477 -1582 -1597 -668 325 1344 1451 943 -53 -627 -1308 -1051 -515 42 986 1522
3500 1522 1359 382 -1039 -1714 -1528 -452 498 1013 1075 759 73 -388 -1002 -1508 -1223 244 1533 1852 1321
3519 1321 -355 -1219 -1418 -1125 -173 270 758 1226 1266 409 -705 -1510 -1605 -626 446 1243 1537 653 -324
3538 -324 -739 -1035 -959 -781 28 1172 1751 1108 311 -1101 -1826 -1144 -305 441 1163 1096 782 116 -633 -1314
3558 -1314 -1272 -870 95 1568 1561 1115 -138 -1082 -1224 -1199 -535 95 1010 1352 1129 499 -644 -1647 -1611 -717
3578 -717 766 1334 1143 903 29 -697 -1119 -1127 -805 178 1254 1626 1144 -158 -1223 -1071 -937 -363 656
3597 656 1104 1215 912 261 -864 -1592 -1430 -495 660 1257 1717 568 -293 -890 -1328 -879 -646 242 1202
3616 1202 1426 966 -28 -887 -1622 -1060 20 775 1102 1089 650 29 -688 -1295 -1490 -812 427 1470 1629
3635 1629 911 -451 -1167 -1365 -964 -246 548 1080 1193 1129 53 -947 -1570 -1331 -382 1028 1156 1102 1014
3654 1014 -459 -1016 -1180 -1251 -531 607 951 1417 986 -212 -989 -1575 -1064 -62 656 1168 1171 808 316
3673 316 -887 -1657 -1531 -263 498 1428 1526 696 -241 -781 -1394 -1218 -592 334 1171 1285 1174 56 -1208
3692 -1208 -1856 -1123 -209 942 1248 1277 788 -236 -668 -1297 -1232 -619 353 1547 1637 813 -379 -1466 -1384
3711 -1384 -998 -5 312 1060 1314 985 115 -795 -1749 -1256 -196 790 1739 1229 612 -183 -960 -962 -961 -390 519
3732 519 1420 1401 860 -133 -1253 -1589 -930 5 590 1059 1122 742 48 -659 -1376 -1273 -549 789 1583 1547
3752 1547 619 -575 -1378 -1392 -920 -194 511 1242 1401 950 -178 -1051 -1554 -1098 18 913 1238 1046 567
3771 567 -124 -830 -1032 -1100 -392 575 1417 1326 722 -213 -1335 -1376 -701 -43 552 970 955 726 97 -516 -1634
3792 -1634 -1402 -347 760 1477 1430 500 -604 -1141 -1257 -981 -340 464 1190 1453 977 -228 -1115 -1653 -1171
3811 -1171 45 918 1198 1449 495 -159 -960 -1267 -1175 -337 708 1568 1325 645 -616 -1047 -1409 -685 -40
3830 -40 619 1185 1107 559 -236 -967 -1573 -1182 154 945 1348 1138 356 -575 -1106 -1165 -1213 -92 536 1091 1275
3851 1275 759 -430 -1175 -1493 -809 157 911 1070 1203 497 -152 -1066 -1205 -963 -141 1107 1421 1568 424
3870 424 -282 -1326 -1240 -950 -147 699 1127 1256 755 -364 -1217 -1275 -888 -64 775 1052 967 494 -30 -1155
3890 -1155 -1367 -845 -67 958 1644 1362 462 -621 -944 -1294 -813 60 779 792 1199 616 -480 -1121 -1530
3909 -1530 -1080 -67 1116 1372 1054 155 -402 -848 -1075 -1068 -228 872 1187 1341 675 -605 -1210 -1387 -691
3928 -691 78 1005 969 1025 254 -531 -1049 -1109 -1083 -135 1183 1506 1146 292 -745 -1172 -1300 -557 157 538 1368
3949 1368 1309 654 -472 -1435 -1428 -621 193 979 1270 833 185 -572 -1064 -768 -936 -149 668 1321 1246 344 -744
3970 -744 -1119 -1352 -877 394 909 1007 1181 389 -289 -681 -1262 -1061 109 822 1617 900 141 -558 -1428 -963
3990 -963 -749 82 717 1158 961 408 -503 -1465 -1323 -776 97 1060 1285 874 213 -642 -1090 -1332 -663 172
4010 172 923 1320 950 144 -475 -1265 -1338 -343 320 867 1090 1097 436 -471 -1181 -1215 -914 263 1186 1362 948
4031 948 37 -790 -826 -1179 -559 -163 1011 1443 991 103 -823 -1185 -1245 -595 178 608 1301 1047 290 -473
4051 -473 -1367 -1286 -696 221 1201 1341 786 166 -650 -1200 -873 -540 312 1007 1284 904 -48 -704 -1322 -1300 -469
4072 -469 409 1083 1051 346 115 -496 -1148 -1034 -900 94 1178 1343 1162 -121 -872 -1210 -1027 -383 317 860
4092 860 1267 944 313 -417 -1195 -1234 -794 594 1151 1140 944 8 -764 -971 -1080 -298 121 852 1389 1099
4112 1099 154 -810 -1308 -1074 -340 408 975 1015 810 15 -525 -1227 -1111 -731 329 1278 1386 1147 -190
4131 -190 -1036 -1201 -1173 -269 134 904 1091 876 264 -744 -1329 -1077 -335 669 1204 1321 679 -55 -598 -934
4151 -934 -1115 -651 331 1167 1213 940 -29 -715 -1240 -884 -295 502 915 878 773 134 -729 -1013 -1041 -377 280
4172 280 1055 1462 935 -218 -1149 -1362 -814 -116 475 996 931 643 226 -887 -1323 -1071 -513 666 1255
4191 1255 1012 738 -436 -608 -1352 -1089 -289 294 1147 1351 749 -107 -569 -1100 -887 -271 425 1211 1063
4210 1063 611 -73 -863 -1172 -963 -147 556 1024 1301 323 -211 -924 -1169 -874 -149 364 949 1085 665 11
4230 11 -1145 -1201 -1040 -68 554 1150 1081 672 -61 -799 -1096 -885 -211 574 1319 1261 544 -274 -851 -839 -924 -338
4252 -338 437 1048 1209 836 -447 -951 -1409 -944 -173 549 957 897 507 -363 -902 -1152 -1019 -369 573 1122
4272 1122 1109 456 2 -1024 -1201 -774 -242 473 897 892 540 59 -816 -1034 -982 27 705 1022 1136 602
4292 602 -412 -976 -1066 -853 -394 368 1278 1298 802 -242 -1184 -1302 -758 116 946 1277 1164 433 -445 -814
4312 -814 -1285 -1076 -409 683 1279 1346 587 -515 -893 -1301 -622 -155 574 1055 1148 824 -244 -722 -1137 -1022
4332 -1022 -187 798 1302 874 340 -380 -814 -1000 -788 -347 611 921 1062 607 -231 -1143 -1306 -814 173 886
4352 886 987 868 606 -287 -511 -1121 -973 -385 705 1334 954 436 -506 -976 -1134 -681 154 506 1022 1063
4372 1063 633 -235 -1051 -1207 -687 31 602 954 1195 219 -343 -684 -1129 -680 -405 610 1081 1218 314
4391 314 -382 -840 -1137 -642 19 805 955 742 276 -341 -987 -932 -706 -35 922 1125 865 273 -631 -893
4411 -893 -954 -734 -118 400 1016 948 577 -503 -1035 -1059 -327 70 845 1149 780 345 -366 -942 -1320 -829 -125
4432 -125 759 1186 958 165 -511 -680 -848 -505 113 637 1017 936 489 -626 -1038 -1152 -619 153 688 807
4452 807 910 353 -487 -880 -1050 -906 168 662 1183 1194 412 -436 -1050 -999 -750 215 869 1000 838 448
4472 448 -150 -996 -987 -417 118 1059 1298 747 90 -516 -930 -876 -621 -75 773 1021 1048 526 -629 -1174 -1079
4493 -1079 -311 181 835 1166 570 64 -393 -796 -1279 -738 -271 865 1030 943 275 -669 -951 -1162 -241 64
4513 64 664 1144 890 517 -311 -907 -882 -748 343 825 1093 952 33 -440 -604 -853 -382 24 673 937
4533 937 777 -75 -685 -1279 -963 -524 198 1065 878 614 212 -343 -980 -953 -446 97 846 1308 1027 39
4553 39 -608 -1097 -784 -717 614 660 1020 723 215 -351 -983 -1007 -576 433 1041 945 486 123 -470 -883 -723
4574 -723 -583 206 499 1019 992 175 -580 -1116 -721 -504 242 992 912 494 79 -497 -793 -875 -608 360 762
4595 762 1129 637 7 -526 -872 -938 -347 229 729 960 670 28 -369 -1092 -879 -225 59 896 1082 824
4615 824 107 -503 -819 -907 -300 259 920 1041 961 42 -815 -963 -738 -342 115 741 805 580 -114 -581 -810
4636 -810 -759 -518 437 1119 939 554 -2 -765 -870 -930 -480 406 1042 1019 640 -84 -691 -1020 -855 -250 404
4657 404 970 1041 433 144 -572 -792 -864 -384 242 880 1031 850 -95 -830 -844 -907 -303 95 786 747 613 271
4679 271 -605 -1230 -758 -227 600 1034 773 455 -16 -627 -746 -780 -427 202 1150 1020 767 -128 -1038 -1084 -711
4700 -711 -121 358 820 895 550 -7 -505 -903 -817 -446 231 1014 971 516 -361 -725 -747 -450 -102 225 808
4721 808 880 489 -76 -785 -1060 -965 -238 731 946 842 320 -126 -714 -1000 -781 -200 406 892 911 469 -269
4742 -269 -982 -878 -864 -89 380 651 902 409 -211 -494 -946 -741 -85 512 1060 907 324 -299 -730 -855
4762 -855 -666 -288 208 954 1003 549 95 -852 -1148 -725 -105 470 797 1015 589 -362 -588 -753 -656 -40 378
4783 378 638 787 435 -514 -579 -876 -604 -2 563 756 887 359 -197 -684 -1379 -567 -340 783 941 706
4803 706 256 5 -573 -856 -876 -257 732 1012 781 385 -214 -795 -847 -698 280 614 851 1155 492 216 -798
4824 -798 -1038 -795 83 636 963 1048 358 -396 -523 -715 -611 19 608 860 824 464 -208 -719 -906 -733 74
4845 74 366 659 663 410 -200 -764 -969 -681 -73 544 1052 936 395 -646 -810 -658 -411 -105 541 832 800
4866 800 737 -180 -699 -1031 -633 61 466 984 387 289 -39 -683 -767 -801 -21 544 808 1060 520 -300 -515
4887 -515 -1001 -265 -4 647 794 697 524 -225 -771 -775 -826 -171 526 678 970 376 -158 -918 -845 -363 -216 656
4909 656 861 974 447 -150 -731 -897 -528 -218 523 730 555 199 -459 -779 -964 -627 -39 669 1028 686
4929 686 39 -475 -789 -894 -165 205 550 923 796 306 -135 -666 -903 -394 67 736 940 675 236 -263
4949 -263 -944 -769 -440 -108 532 891 879 368 -625 -822 -957 -445 341 711 868 783 243 -92 -939 -812 -583
4970 -583 238 892 870 708 23 -409 -805 -782 -378 151 737 898 940 228 -450 -745 -880 -465 139 627 952
4991 952 603 61 -384 -749 -914 -606 39 633 1013 850 70 -548 -872 -678 -376 126 508 814 752 273
5011 273 -117 -866 -832 -389 258 612 1024 450 79 -469 -641 -714 -496 232 549 872 600 495 -538 -945
5031 -945 -756 -463 334 723 932 535 186 -265 -702 -812 -539 -234 766 929 757 294 -509 -674 -409 -322
5051 -322 147 426 722 714 332 -542 -735 -704 -333 251 578 840 551 119 -466 -686 -690 -392 303 553 774 1065
5073 1065 0 -518 -813 -1095 -187 81 963 802 824 102 -229 -815 -1060 -408 251 651 679 668 144 -640
5093 -640 -636 -601 -301 590 576 532 586 345 -443 -931 -711 -456 484 684 848 339 -68 -142 -567 -818 -144 307
5115 307 599 1150 692 -108 -578 -578 -737 -262 289 618 907 670 269 -230 -679 -665 -472 51 727 652 469
5136 469 -105 -316 -813 -555 -157 196 506 703 577 -88 -493 -788 -538 11 313 613 571 505 65 -370 -809
5157 -809 -549 -314 351 713 782 449 -33 -540 -713 -375 -410 5 775 1005 356 13 -493 -1000 -680 -374 181
5178 181 684 791 376 -23 -560 -1015 -378 -280 105 683 845 450 27 -692 -660 -496 -219 350 831 610 586
5199 586 150 -445 -688 -617 -258 341 833 751 549 -80 -618 -744 -592 -158 229 448 751 440 94 -505 -799
5220 -799 -698 -403 361 706 633 261 -136 -496 -850 -750 -237 331 724 839 322 -378 -566 -674 -499 -104
5240 -104 390 446 392 231 39 -631 -804 -1003 -62 388 818 513 116 -104 -539 -661 -408 -304 162 664 568
5261 568 577 -192 -656 -708 -385 -282 601 788 608 202 -121 -460 -542 -714 -366 397 631 712 347 -129 -451 -493
5283 -493 -627 -79 -73 640 560 356 -83 -539 -823 -773 1 197 874 641 290 -154 -469 -705 -664 -42 43 544
5305 544 656 225 -155 -619 -837 -381 11 248 806 665 401 -25 -741 -630 -521 -137 406 697 567 146
5325 146 -266 -601 -679 -453 70 512 680 648 393 -63 -573 -537 -510 292 663 677 476 365 -124 -628 -756 -459
5347 -459 -402 500 849 687 314 -200 -671 -727 -395 44 431 323 503 137 -215 -561 -474 -482 41 480 676 581
5369 581 236 -415 -425 -555 -438 115 462 923 829 157 -333 -615 -554 -539 146 434 430 619 320 -81 -381 -556
5391 -556 -481 -8 601 802 728 286 -188 -284 -763 -385 -196 353 639 514 424 -280 -709 -492 -276 20 368
5412 368 722 537 191 -336 -518 -779 -342 -228 358 690 434 -51 -380 -479 -487 -406 59 463 482 483 247 -470
5434 -470 -490 -572 -341 -139 455 609 611 62 -375 -310 -383 -369 14 425 400 604 159 -313 -706 -857 -241 41 619
5457 619 475 587 157 -248 -612 -746 -181 75 572 765 770 274 -535 -706 -562 -102 101 443 757 673 522
5478 522 -206 -622 -658 -433 167 662 592 518 -26 -123 -630 -448 -358 -67 377 414 248 167 -479 -547 -711 -274 321
5501 321 506 517 567 12 -55 -668 -492 -466 311 477 685 331 114 -14 -574 -438 -381 91 254 749 707 214
5523 214 -257 -602 -668 -211 115 530 666 183 109 -343 -360 -640 -420 47 787 695 600 -47 -374 -510 -525 -117
5545 -117 316 443 560 486 94 -529 -748 -704 -161 113 385 660 252 -113 -361 -355 -598 -418 115 271 615
5566 615 332 -133 -709 -471 -447 -249 177 656 385 348 0 -242 -582 -559 -363 189 584 436 375 158 -266
5587 -266 -597 -356 -262 147 241 548 652 197 -400 -744 -519 13 275 231 587 430 81 -299 -324 -535 -134
5608 -134 262 452 447 373 115 -230 -762 -594 -156 264 453 427 355 -34 -234 -582 -508 -288 211 476 705 558
5630 558 -101 -454 -565 -383 -52 62 338 580 352 -264 -367 -446 -526 -115 396 534 384 254 -71 -234 -398
5651 -398 -605 -273 186 483 677 468 -326 -509 -496 -555 -232 177 420 430 400 87 -255 -670 -488 -150 329
5672 329 617 473 167 -175 -353 -503 -327 -220 98 406 486 415 -57 -454 -347 -423 31 191 345 378 582
5693 582 -40 -328 -498 -411 -277 399 736 659 163 19 -339 -369 -397 -8 138 294 682 501 4 -262 -571
5714 -571 -396 -185 320 607 366 220 75 -149 -360 -338 -299 215 581 558 509 -130 -521 -360 -383 -40 141 569
5736 569 390 444 115 -395 -681 -335 93 255 596 358 148 -55 -183 -576 -275 -121 289 393 376 317 -22
5757 -22 -491 -521 -485 -51 397 390 577 197 -145 -340 -549 -437 92 -14 793 511 102 -164 -644 -524 -447 -44
5779 -44 232 397 551 303 5 -544 -569 -308 -38 326 660 330 202 -82 -316 -311 -420 -123 222 418 488 636
5801 636 -316 -436 -690 -154 -23 130 429 165 84 229 -510 -377 -515 -228 244 517 591 224 -268 -585 -382
5822 -382 -291 -30 25 534 600 279 9 -392 -551 -401 250 422 393 547 214 -86 -309 -561 -486 -278 518 628
5844 628 519 336 48 -438 -255 -362 -88 326 336 233 164 -112 -456 -445 -169 -192 69 623 490 226 55
5865 55 -207 -487 -271 -321 166 429 346 122 -267 -261 -662 -225 -7 342 407 328 66 -288 -397 -637 -544 -181 372
5888 372 831 544 175 -227 -324 -282 -101 192 167 434 257 185 -218 -334 -917 -492 58 269 427 403 102 -189
5910 -189 -334 -211 -173 81 352 436 290 70 -98 -413 -515 -203 -193 376 409 234 155 -299 -363 -315 -387 338 437
5933 437 526 238 134 -296 -539 -266 -309 -47 293 172 383 230 -293 -375 -463 -206 270 495 388 21 53 -170
5955 -170 -248 -226 -112 -93 216 549 530 163 -130 -425 -566 -84 174 248 217 440 336 -50 -376 -339 -114 34
5977 34 334 554 281 79 -276 -279 -342 -319 -112 343 712 481 262 -194 -318 -645 -287 -147 248 398 99 -54
5999 -54 -297 -506 -521 -409 165 160 414 546 12 -433 -257 -197 -181 83 543 204 340 179 -175 -226 -428 -290
6021 -290 57 428 122 -39 52 -167 -275 -257 -455 73 320 669 242 226 -107 -312 -592 -242 -30 308 321
6042 321 369 -12 -310 -227 -507 -122 139 580 518 285 4 -198 -268 -146 -210 -26 162 525 283 83 -378 -630
6064 -630 -243 -283 311 149 382 353 -164 -99 -233 -196 -273 246 399 580 196 109 -578 -365 -273 32 188 260 244
6087 244 239 -13 -164 -816 -453 -287 -36 323 366 160 209 -164 -169 -332 -229 -166 193 559 215 20 -441 -444 -438 -111
6111 -111 170 143 232 273 -47 -68 -297 -446 -314 142 584 523 296 -199 -385 -359 -260 -238 36 393 471 251 14
6134 14 134 -331 -657 51 347 287 389 125 10 -229 -388 -352 -251 122 267 487 310 -37 -90 -308 -423
6155 -423 -37 212 242 166 135 201 -33 -332 -345 -185 17 400 376 88 -100 -21 -250 -442 -85 321 374 266 215
6178 215 -117 -262 -341 -437 -180 413 362 177 222 22 -111 -253 -290 -211 180 488 485 245 -52 -239 -460 -397 -368
6201 -368 248 192 373 388 60 -385 -482 -254 -215 22 257 357 34 -6 -396 -222 -371 -188 -59 311 407 455
6223 455 -449 -329 -392 -71 242 137 -133 339 171 -49 -120 -224 -286 -144 112 378 302 144 -41 -342 -122
6244 -122 -201 -268 190 78 614 294 208 -221 -138 -76 67 21 304 201 150 -81 -119 -170 -332 -253 223 598 366
6267 366 316 -158 -385 -480 -321 -64 142 190 340 237 -179 -180 -509 -432 -145 281 244 418 -161 -164 -386 -319 -110
6290 -110 -100 315 349 410 140 -72 -129 -442 -200 -126 260 362 180 39 -87 -193 -192 -128 -209 98 105 358 150 -168
6314 -168 -269 -248 -52 8 148 27 332 32 199 -459 -233 -247 44 192 145 493 38 -129 -287 -167 -18
6335 -18 58 219 427 304 294 -242 -85 -333 12 28 50 289 107 57 211 -256 -319 -333 -113 4 430 413 -189
6358 -189 -47 -112 -358 -179 2 -303 207 265 102 117 -244 -198 -46 16 -63 443 131 187 65 -174 -506 -340
6380 -340 -192 249 260 470 130 -168 -272 -232 -63 -147 300 36 154 226 -95 -356 -322 -237 117 22 125 288
6402 288 -3 -348 -239 -299 -234 -68 469 356 258 278 -155 -287 -599 -81 202 310 17 406 125 129 176 -231
6424 -231 -168 89 113 292 50 -75 -314 -236 -166 -190 -223 75 291 401 61 -5 -335 -630 -136 229 101 284
6446 284 117 14 -126 -98 -191 -259 72 -101 368 252 267 -58 -220 -240 -193 64 36 275 127 -131 -18 -263
6468 -263 -557 -159 6 158 0 386 58 319 -324 -523 -61 -42 93 252 384 375 -106 -236 -92 73 42
6489 42 76 213 288 152 -135 -279 -252 -165 -148 32 337 298 251 -86 -123 -367 -234 278 234 87 156 353 -205 36
6513 36 -266 -33 5 212 380 226 74 -35 10 -179 -306 -49 -79 232 171 48 -84 28 -369 44 195 267
6535 267 502 75 103 -137 -49 -277 -60 64 244 271 387 123 -196 -270 -259 156 -4 114 154 24 172 -270
6557 -270 -106 -125 -338 361 131 459 136 7 133 -81 -77 12 -66 116 309 94 -19 -165 -189 -5 -154 -13
6579 -13 15 266 10 133 -82 11 -610 -390 112 438 125 131 -67 -237 41 -51 57 68 128 181 370 134 -178
6602 -178 -380 -190 -18 -56 204 370 296 89 -129 -264 -457 -304 -172 166 490 128 21 -260 -121 10 -144
6623 -144 -143 187 248 189 214 -58 -352 -430 -82 -180 51 313 56 -91 -40 -135 -143 -177 -56 238 -10 322 174 -372
6647 -372 -212 -249 -69 173 -66 208 101 96 -30 -16 -226 -183 46 229 187 184 -115 49 -93 36 -96 -1 -92
6670 -92 -44 35 -10 -112 -340 -74 -124 135 209 169 302 -5 18 48 -189 -198 -27 45 285 23 -25 -143 -303 -179
6694 -179 -157 -285 83 83 164 65 -219 -284 -231 -114 -33 276 56 -43 -117 -165 -182 39 14 54 196 101 120 41 -365 -374
6720 -374 -258 -69 65 408 190 64 -207 -83 -261 -218 -208 43 158 371 171 60 -279 -117 -133 62 68 123
6742 123 218 63 -258 -178 -160 -363 -93 5 115 492 147 -89 -176 -234 -45 -106 216 254 269 197 101 -73 3 -89
6766 -89 29 24 129 -296 195 189 213 -266 -191 89 246 130 209 357 -118 -156 -252 -170 -156 -132 134 13 305 32
6790 32 -55 -230 -329 153 356 215 278 108 -242 -189 71 -99 -244 191 168 355 -27 -107 -388 46 21 -47 58
6813 58 -372 231 272 47 77 -253 -81 -18 142 104 8 124 -210 -166 -270 -24 -74 -53 149 376 13 49 141 -180
6837 -180 46 -30 -99 119 70 -142 -118 -106 -367 -349 -178 39 407 233 89 20 -140 -22 -144 -42 53 176 58
6860 58 63 7 -47 -152 -44 81 83 98 -96 -58 219 -130 -193 -306 -79 -118 293 236 83 183 13 -99 131 87
6884 87 115 72 238 85 122 -7 -241 -212 -143 -62 52 103 65 165 -57 -259 -12 -18 165 243 360 274 -31 -67 -7
6909 -7 -94 83 224 -46 60 -109 27 20 -269 -158 -80 15 169 29 84 56 -126 77 -100 38 -15 65 -55 -169
6933 -169 154 -166 -55 -321 -154 282 112 200 -4 -44 247 -136 -131 -95 -212 219 109 -25 -151 -128 -74 30
6955 30 26 56 121 60 -25 -146 -93 -58 -118 -17 177 114 39 42 107 -111 -171 -233 99 3 302 212 234 177 -65 -218 -282
6982 -282 -12 9 65 40 175 -48 16 -185 -144 -81 -30 170 191 -190 -79 -120 -40 16 -144 -231 85 196 18 173
7006 173 160 -181 -38 -123 211 92 -85 7 -32 88 -100 -94 -60 -55 -72 23 -19 102 -29 -153 201 128 233 204 244
7031 244 6 -96 177 -47 -24 -271 -249 338 140 73 -36 -14 -66 -120 -108 -249 74 -70 49 26 41 -135 -129 -119
7055 -119 105 -98 9 16 -178 58 20 -66 8 94 257 251 267 -290 -34 88 19 -67 -88 401 196 167 -128 -62 -333
7080 -333 -233 101 327 -148 58 -222 -4 -5 -28 -79 -258 -63 -56 14 -69 -81 -51 -91 31 -43 94 -34 -81 175
7104 175 184 63 -263 -400 -161 -113 62 97 32 128 33 -169 -4 -132 -74 317 288 33 -79 -194 -189 -43 -155 61
7128 61 46 -114 40 -51 86 -148 -83 -17 -29 215 167 48 30 7 -122 41 -94 -236 -31 158 37 22 -138
7151 -138 -142 14 -33 -106 114 74 106 -82 14 -217 -202 -207 56 -135 209 11 138 -95 -60 15 14 171 -138 125 -36
7176 -36 107 129 -276 -165 -102 82 69 114 82 -121 56 -2 -175 -167 -4 -100 161 86 -149 -113 -84 -200 194 -146
7200 -146 106 -183 51 75 -185 17 -6 -38 32 82 -167 116 26 -163 -319 111 103 29 -56 24 32 154 88 -159 -163
7225 -163 -90 26 194 165 370 -42 -118 -97 -87 23 -153 280 22 49 -49 -84 -238 -129 149 127 78 63 -145 41
7249 41 -226 -38 -83 -249 57 -34 329 1 -89 -296 123 -3 -18 166 137 6 93 133 -213 -211 -166 -173 -268 42 148
7274 148 -69 -91 -18 -25 -61 -75 -153 231 -54 -64 203 -170 -131 24 313 77 110 -21 219 48 106 -180 -123 -99
7298 -99 181 166 276 68 68 10 -119 258 -201 25 -113 305 257 37 -66 107 -55 -45 -58 -95 193 59 152
7321 152 -22 -73 -162 -176 46 36 -6 252 -54 -48 -302 -158 -16 -107 -82 2 190 115 27 -292 -196 -156 39 -170 32
7346 32 -66 70 118 97 -152 -237 -170 -65 -26 152 -288 -53 -130 44 -201 -106 152 -98 69 74 181 33 -79 -48
7370 -48 -35 69 94 220 -246 139 -197 -34 55 -174 -181 173 50 59 -167 -78 -103 161 161 235 259 207 -17 -18 143 -121
7396 -121 -77 54 271 166 102 -184 -98 -38 -115 -148 -33 113 280 92 102 -216 166 -142 189 -43 113 45 25
7419 25 -19 57 -46 -42 -197 -68 232 159 170 107 -69 -329 -94 -180 76 -232 55 214 264 150 -98 -236 -11
7442 -11 -20 219 273 212 86 48 -209 58 10 35 -96 18 212 -55 29 -317 18 -234 -168 96 -14 -171 74
7465 74 -147 -257 -66 -67 197 -59 125 161 -38 -133 -98 -110 16 14 16 89 213 75 -1 27 -146 -43 -87 39 146
7490 146 -16 -42 118 38 -382 -91 -14 139 185 249 53 325 -210 -297 36 108 -232 -71 171 -81 -60 -157 -315
7513 -315 -349 -91 250 450 59 188 6 -57 -52 -27 -108 -44 70 246 73 -94 -264 -41 -120 -234 77 83 -67
7536 -67 163 -135 -201 -215 -81 -26 97 5 -2 -176 -266 99 69 145 -55 -211 213 300 124 311 55 -217 5 297
7560 297 153 282 318 119 -74 -50 101 102 49 30 213 88 211 56 -303 -281 67 243 -60 -309 85 -73
7582 -73 -68 -15 -256 -117 -71 81 109 60 112 -266 -45 29 -215 162 -57 -166 4 345 -41 -32 -2 -194 174 156
7606 156 -12 23 -84 -20 -63 -117 -145 -170 -62 229 38 -99 -115 -14 -77 93 123 -195 188 182 244 98 107 -88 -370
7631 -370 -5 127 67 -135 3 -232 -38 -28 -23 69 18 162 77 48 -231 -235 -59 -84 -42 109 39 -113 -31 -95 20
7656 20 13 5 -49 -199 207 -161 114 9 36 -177 -71 -59 41 218 174 223 -295 -173 -329 -55 -48 271 98 168
7680 168 78 245 -145 -260 -121 -71 250 65 226 143 -63 -274 -78 -74 -132 33 -129 219 120 62 183 -223 -131
7703 -131 -303 -26 133 148 -49 -4 -4 -105 32 162 208 -144 141 -15 39 -44 30 -94 212 59 48 295 -41
7726 -41 -116 -73 -93 -150 119 203 56 48 109 -96 -100 -24 13 -59 56 261 171 -37 15 -178 -184 -112 51 77 174 14 208
7753 208 15 -124 98 -145 -187 91 330 169 28 -45 -201 -210 -134 -84 80 136 134 224 111 -6 61 -139 -74 261
7777 261 153 159 54 300 -212 -5 -72 -40 96 -155 55 349 -85 -320 -20 -193 158 -55 171 145 -108 -157
7799 -157 -248 -177 -100 88 -25 278 341 61 -356 109 -206 243 137 -28 82 -56 241 1 -378 -166 -171 110
7821 110 208 307 319 -48 34 -26 -175 57 8 275 119 380 157 142 204 -269 -122 -70 109 11 49 186 18 78
7845 78 -143 -86 93 171 152 221 104 -93 -143 -215 -229 80 16 250 195 -7 -112 -360 -178 -96 -147 226 262 197 50
7870 50 146 -409 -122 -130 -147 155 -65 191 -80 -148 -221 -55 160 277 101 362 76 8 153 -169 -191 -102 -67 202
7894 202 -49 97 66 -11 -152 36 -95 96 -150 356 219 143 -55 52 -182 -9 47 39 64 2 -250 8 -280
7917 -280 -351 -57 -151 85 40 29 82 100 -379 -65 -122 81 -67 -184 -15 176 -371 -142 -150 -186 -169 221 95 34
7941 34 -124 13 46 -33 -80 12 160 71 -31 -44 87 -41 -239 -236 -181 88 108 390 -36 131 194 -232 58 -185
7965 -185 281 164 98 -230 -326 -207 -89 -249 5 118 210 220 -8 -500 -78 14 -202 78 244 379 184 -137
7987 -137 -132 -93 -117 -162 -31 34 180 193 176 -13 -143 92 -37 189 195 111 47 55 55 -275 -421 -58 148 133 43 132
8013 132 31 -35 -123 160 -31 98 15 269 252 205 -192 -299 -173 -140 84 -44 287 438 -56 -10 -217 -249 -309
8036 -309 180 107 125 74 -16 -74 -81 -66 -111 -150 83 104 264 165 -199 -62 -156 -111 -157 84 66 142 246 114 -121 -30
8062 -30 47 -49 96 -95 15 45 12 -390 -196 14 -243 267 108 191 3 9 -190 -277 -327 -63 71 398 461 -15
8086 -15 -199 -84 -99 -63 264 185 179 367 -88 -298 -73 -402 -317 160 27 188 37 -25 -140 -194 -520 70 23
8109 23 160 402 143 -84 -63 -108 -9 -224 12 150 296 152 -2 -420 -180 -200 -73 210 257 387 -19 -59
8131 -59 -144 -357 -242 156 38 78 -13 82 104 -33 -178 -98 -124 20 158 61 -7 165 -103 -72 27 -7 318 468
8155 468 257 114 -105 2 -273 -308 -79 -139 -31 234 425 70 14 -53 53 -47 1 -23 118 195 90 -23
8177 -23 -170 -188 84 -42 -39 248 403 254 -186 -268 -69 -36 52 144
8191A44
##END NTUPLES=NMR FID
##END=
