##TITLE=1H_SR117_k
 DMSO-d6
 8 sc, 
 25.08.2022
##JCAMPDX= 6.0         $$ Bruker NMR JCAMP-DX V2.0
##DATA TYPE= NMR FID
##DATA CLASS= NTUPLES
##ORIGIN= UXNMR, Bruker Analytische Messtechnik GmbH
##OWNER= root
$$ XWIN-NMR		Version 3.5
$$ Thu Aug 25 15:20:31 2022 Russian Standard Time (UT+4h)  she@DPX200
##.OBSERVE FREQUENCY= 200.1313499994
##.OBSERVE NUCLEUS= ^1H
##.DELAY= (6, 6)
##.ACQUISITION MODE= SIMULTANEOUS
##.ACQUISITION SCHEME= undefined
##.AVERAGES= 8
##.DIGITISER RES= 18
##SPECTROMETER/DATA SYSTEM= spect
##.PULSE SEQUENCE= zg30
##.SOLVENT NAME= DMSO
##.SHIFT REFERENCE= (INTERNAL, DMSO, 0, 15.7039)
##AUDIT TRAIL= $$ (NUMBER, WHEN, WHO, WHERE, WHAT)
$$ ##TITLE= Audit trail, XWIN-NMR		Version 3.5
$$ ##JCAMPDX= 5.01
$$ ##ORIGIN= Bruker BioSpin GmbH
$$ ##OWNER= she
$$ F:/spectra/data/she/nmr/H-F/1/audita.txt
$$ ##AUDIT TRAIL=  $$ (NUMBER, WHEN, WHO, WHERE, WHAT)
(   1,<2022-08-25 15:19:18.23 +0400>,<she>,<DPX200>,
      <created by zg, POWCHK disabled, PULCHK disabled
       configuration hash MD5:
       00 E9 B6 7A A2 85 ED C7 34 08 36 98 17 FE 4E 26
       data hash MD5: 16K
       58 05 C0 77 8E 2E 01 98 F5 E2 C5 FA B3 7F 99 44>)
$$ ##END=
$$ 
$$ hash MD5
$$ 7E A6 2C 69 5F 2E 84 92 E8 2E 2C 83 AA 7A 3A B2
##$RELAX= 
##$RELAX= 
##$RELAX= 
##$RELAX= 
##$RELAX= 
##$RELAX= 
$$ Bruker specific parameters
$$ --------------------------
##$DU= <F:/spectra>
##$EXPNO= 1
##$NAME= <H-F>
##$PROCNO= 1
##$TYPE= <nmr>
##$USER= <she>
##$AMP= (0..31)
100 100 100 100 100 100 100 100 100 100 100 100 100 100 100 100 100 100 
100 100 100 100 100 100 100 100 100 100 100 100 100 100 
##$AQSEQ= 0
##$AQ_mod= 1
##$AUNM= <au_zg>
##$AUTOPOS= <>
##$BF1= 200.13
##$BF2= 200.13
##$BF3= 200.13
##$BF4= 200.13
##$BF5= 200.13
##$BF6= 200.13
##$BF7= 200.13
##$BF8= 200.13
##$BYTORDA= 1
##$CFDGTYP= 0
##$CFRGTYP= 5
##$CHEMSTR= <none>
##$CNST= (0..31)
1 1 145 1 1 1 1 1 1 1 1 1 1 1 1 1 1 1 1 1 1 1 1 1 1 1 1 1 1 1 1 1 
##$CPDPRG= <>
##$CPDPRG1= <>
##$CPDPRG2= <>
##$CPDPRG3= <>
##$CPDPRG4= <mlev>
##$CPDPRG5= <mlev>
##$CPDPRG6= <mlev>
##$CPDPRG7= <mlev>
##$CPDPRG8= <mlev>
##$CPDPRGB= <>
##$CPDPRGT= <>
##$D= (0..31)
0 1.2 0 0 0 0 0 0 0 0.06 0 0.03 0 0 0 0 0.0002 0 0 0 0 0 0 0 0 0 0 0 0 
0 0 0 
##$DATE= 1661426357
##$DBL= (0..7)
120 120 120 120 120 120 120 120 
##$DBP= (0..7)
150 150 150 150 150 150 150 150 
##$DBP07= 0
##$DBPNAM0= <>
##$DBPNAM1= <>
##$DBPNAM2= <>
##$DBPNAM3= <>
##$DBPNAM4= <>
##$DBPNAM5= <>
##$DBPNAM6= <>
##$DBPNAM7= <>
##$DBPOAL= (0..7)
0.5 0.5 0.5 0.5 0.5 0.5 0.5 0.5 
##$DBPOFFS= (0..7)
0 0 0 0 0 0 0 0 
##$DE= 6
##$DECBNUC= <off>
##$DECIM= 32
##$DECNUC= <off>
##$DECSTAT= 4
##$DIGMOD= 1
##$DIGTYP= 9
##$DL= (0..7)
0 120 120 120 120 120 120 120 
##$DP= (0..7)
150 150 150 150 150 150 150 150 
##$DP07= 0
##$DPNAME0= <>
##$DPNAME1= <>
##$DPNAME2= <>
##$DPNAME3= <>
##$DPNAME4= <>
##$DPNAME5= <>
##$DPNAME6= <>
##$DPNAME7= <>
##$DPOAL= (0..7)
0.5 0.5 0.5 0.5 0.5 0.5 0.5 0.5 
##$DPOFFS= (0..7)
0 0 0 0 0 0 0 0 
##$DQDMODE= 0
##$DR= 18
##$DS= 0
##$DSLIST= <SSSSSSSSSSSSSSS>
$$ [...]
##$SUBNAM2= <"">
##$SUBNAM3= <"">
##$SUBNAM4= <"">
##$SUBNAM5= <"">
##$SUBNAM6= <"">
##$SUBNAM7= <"">
##$SUBNAM8= <"">
##$SUBNAM9= <"">
##$SW= 18.0517283424941
##$SWIBOX= (0..15)
0 0 2 0 0 0 0 0 0 0 0 0 0 0 0 0 
##$SW_h= 3612.71676300578
##$TD= 16384
##$TD0= 1
##$TE= 0
##$TE2= 300
##$TE3= 300
##$TEG= 300
##$TL= (0..7)
0 120 120 120 120 120 120 120 
##$TP= (0..7)
150 150 150 150 150 150 150 150 
##$TP07= 0
##$TPNAME0= <>
##$TPNAME1= <>
##$TPNAME2= <>
##$TPNAME3= <>
##$TPNAME4= <>
##$TPNAME5= <>
##$TPNAME6= <>
##$TPNAME7= <>
##$TPOAL= (0..7)
0.5 0.5 0.5 0.5 0.5 0.5 0.5 0.5 
##$TPOFFS= (0..7)
0 0 0 0 0 0 0 0 
##$TUNHIN= 0
##$TUNHOUT= 0
##$TUNXOUT= 0
##$USERA1= <user>
##$USERA2= <user>
##$USERA3= <user>
##$USERA4= <user>
##$USERA5= <user>
##$V9= 5
##$VALIST= <valist>
##$VCLIST= <CCCCCCCCCCCCCCC>
##$VD= 0
##$VDLIST= <DDDDDDDDDDDDDDD>
##$VPLIST= <PPPPPPPPPPPPPPP>
##$VTLIST= <TTTTTTTTTTTTTTT>
##$WBST= 1024
##$WBSW= 4
##$XGAIN= (0..3)
0 0 0 0 
##$XL= 0
##$YL= 0
##$YMAX_a= 117954
##$YMIN_a= -196166
##$ZGOPTNS= <>
##$ZL1= 120
##$ZL2= 120
##$ZL3= 120
##$ZL4= 120
##$ABSF1= 10
##$ABSF2= 0
##$ABSG= 5
##$ABSL= 3
##$ALPHA= 0
##$AQORDER= 0
##$ASSFAC= 0
##$ASSFACI= 0
##$ASSFACX= 0
##$ASSWID= 0
##$AUNMP= <proc_1d>
##$AZFE= 0.1
##$AZFW= 0.1
##$BCFW= 1
##$BC_mod= 2
##$BYTORDP= 1
##$COROFFS= 0
##$CY= 11.3945322036743
##$DATMOD= 1
##$DC= 2
##$DFILT= <>
##$DTYPP= 0
##$F1P= 2.36226072786647
##$F2P= -0.459571619588291
##$FCOR= 0.5
##$FTSIZE= 0
##$FT_mod= 4
##$GAMMA= 1
##$GB= 0.15
##$INTBC= 1
##$INTSCL= 1
##$ISEN= 128
##$LB= 0.24
##$LEV0= 0
##$LPBIN= 0
##$MAXI= 10000
##$MC2= 0
##$MEAN= 0
##$ME_mod= 0
##$MI= 1.114404
##$NCOEF= 0
##$NC_proc= 0
##$NLEV= 6
##$NOISF1= 3.799351
##$NOISF2= 2.8
##$NSP= 1
##$NTH_PI= 0
##$NZP= 0
##$OFFSET= 15.70392
##$PC= 1
##$PHC0= -18042.64
##$PHC1= 17.00069
##$PH_mod= 1
##$PKNL= yes
##$PPARMOD= 0
##$PSCAL= 0
##$PSIGN= 0
##$REVERSE= no
##$SF= 200.130013532006
##$SI= 16384
##$SIGF1= 3
##$SIGF2= 2
##$SINO= 400
##$SIOLD= 16384
##$SREGLST= <1H.CDCl3>
##$SSB= 0
##$STSI= 0
##$STSR= 0
##$SW_p= 3612.71676300578
##$SYMM= 0
##$S_DEV= 0
##$TDeff= 0
##$TDoff= 0
##$TI= <>
##$TILT= no
##$TM1= 0
##$TM2= 0
##$TOPLEV= 0
##$USERP1= <user>
##$USERP2= <user>
##$USERP3= <user>
##$USERP4= <user>
##$USERP5= <user>
##$WDW= 1
##$XDIM= 8192
##$YMAX_p= 0
##$YMIN_p= 0
$$ End of Bruker specific parameters
$$ ---------------------------------
##NTUPLES= NMR FID
##VAR_NAME=  TIME,          FID/REAL,        FID/IMAG
##SYMBOL=    X,             R,               I
##VAR_TYPE=  INDEPENDENT,   DEPENDENT,       DEPENDENT
##VAR_FORM=  AFFN,          ASDF,            ASDF
##VAR_DIM=   8192,          8192,            8192
##UNITS=     SECONDS,       ARBITRARY UNITS, ARBITRARY UNITS
##FACTOR=    0.0002768,     1,               1
##FIRST=     0,             0,               0
##LAST=      2.2672688,     0,               0
##MIN=       0,             -196166,         0
##MAX=       2.2672688,     117954,          0
$$ Real data points
##PAGE= N=1
##DATA TABLE= (X++(R..R)), XYDATA
0@%%%%%%%%%%%%qJ6j6J6j6K4l2L6m4N6o4P2q8J04j20J36j59J84k09K40k73L10
$$ 0 0 0 0 0 0 0 0 0 0 0 0 0 -8 8 -8 8 -8 16 -16 20 -24 32 -32 40 -48 56 -64 72 -87 97 -112 128 -145 165
34A65l51L95m45M98n56O21o93P72q57R50j053J164j284J418j564J724j898K090
$$ 165 -186 209 -236 262 -294 327 -366 406 -451 499 -554 610 -674 744 -820 904 -994 1096
52A096k305K543k805L102l441L824m265M783n400O146p070Q255r836J2059j5444
$$ 1096 -1209 1334 -1471 1631 -1810 2014 -2251 2532 -2868 3278 -3792 4463 -5373 6686 -8758
67h758K1305l4295J19791m4028j11746J20102o7007m7390R2912L3208r1186K5872
$$ -8758 12547 -21748 98043 54015 -57731 62371 -4636 -52026 40886 74094 -17092 8780
79H780K6339l2191L3410K7513j23753n4140N6712j9716j7460J16077K7099q4058
$$ 8780 35119 2928 36338 63851 -59902 -114042 -57330 -77046 -94506 21571 48670 -35388
91c5388J5814M2300n7552K2202Q3238n9389p3300P6277L2479m6081N4831N4486
$$ -35388 -19574 22726 -34826 -12624 70614 11225 -62075 14202 46681 600 55431 109917
103A09917q3111m9135L3983k0032j1168N9399j6458o4818L0933K2719n4085J7891
$$ 109917 26806 -22329 11654 -8378 -19546 39853 23395 -41423 -10490 12229 -41856 -23965
115b3965N1309n7073m7583M6234J1378j0217N5706J3366n4742J1190K7526m2784
$$ -23965 27344 -29729 -77312 -31078 -19700 -29917 25789 39155 -15587 -4397 23129 -19655
127a9655N645O3870k6943n0995M4281K9016l4101J5544K4553m9825k9383K5270
$$ -19655 -14010 49860 22917 -28078 16203 45219 11118 26662 51215 1390 -27993 -2723
139b723j1251j2612L6834M70l7961J3725K1692k4453J223K2830k5090j9208K8979
$$ -2723 -13974 -26586 10248 10718 -27243 -13518 8174 -16279 -15056 7774 -17316 -36524 -7545
152g545M588r611L3589J1564l8754o45K7465j6500j1786K7650m084k5835J4444
$$ -7545 -2957 -12568 21021 32585 -6169 -6814 20651 4151 -7635 20015 15931 -9904 4540
165D540J4637j4890L958Q028k6379j1797J7403l070p461J9131K276j8336N970
$$ 4540 19177 4287 8245 16273 -10106 -21903 -4500 -7570 -15031 4100 6376 -11960 -5990
178e990R652j2765J377J2221j4490q716K0872O217p771J3032P843j7724n611Q582
$$ -5990 3662 -9103 -7726 4495 -9995 -18711 2161 8378 607 13639 21482 3758 -1853 6729
192F729o132l907Q937m268o923J0680M140r104L294K276j4313n971P457j445r57
$$ 6729 597 -3310 5627 1359 -5564 5116 9256 152 3446 5722 -8591 -14562 -7105 -8550 -9507
207i507J0268J509n701O497L787q420J33N536p066l679P451L166N95N142j022
$$ -9507 761 2270 -3431 3066 6853 -1567 -1434 4102 -2964 -6643 808 3974 4569 9711 8689
222H689n643O43m23q443j68N558m312k835P440K573l423Q14j03n112o29J234k849
$$ 8689 3046 3689 3266 -5177 -5345 213 -4099 -6934 506 3079 -344 470 367 -4745 -5374 -4140 -6989
239f989K229O869j46j019M194J221l534p71o49l225R48K024j333J874M552j547
$$ -6989 -4760 2109 1963 944 5138 6359 2825 2054 1405 -1820 -872 1152 -181 1693 6245 4698
255D698m323Q08p4m689j775J004j69J445K717m70J429K772k431m016J751J265
$$ 4698 375 1183 1109 -3580 -5355 -4351 -4520 -3075 -358 -828 601 3373 942 -3074 -1323 -58
271e8k819Q6M174J254N08P48p30k79q5k816l034K338K042k301r1L638p9k810n80
$$ -58 -2877 -2791 1383 2637 3145 3893 3163 2884 2799 -17 -3051 -713 1329 -972 -1063 2575 2496 -314 -894
290h94l57j827m51N40l10J846K496L58r70Q95N68j784j520k11J267R55P55j81
$$ -894 -1251 -3078 -3529 -2989 -3299 -1453 1043 1401 431 1326 1894 110 -1410 -1621 -354 601 1356 1175
308A175K072J308j338k998p1N37k527j430J821K138m46q39Q55M34j895k014l11
$$ 1175 3247 4555 3217 219 148 685 -1842 -3272 -1451 687 241 -598 257 691 -1204 -3218 -3529
325c529N71L99M29J258K009J495M15k89p28n45q13j541K43J645J250m52K90J127
$$ -3529 -2958 -2559 -2130 -872 1137 2632 3047 2758 2030 1485 672 -869 -626 1019 2269 1817 2107 3234
343C234o57k364j063j046j254k47L1O56J449K063m07j027J68P3j530M3O86O96
$$ 3234 2577 213 -850 -1896 -3150 -3397 -3366 -2710 -1261 802 395 -632 -464 -391 -1921 -1878 -1192 -496
361d96J800P31m6J758J291k852l071J133K49l199J15L865k57j173J248K55j837
$$ -496 1304 2035 1989 3747 5038 2186 -885 248 497 -2702 -2587 1278 1021 -152 1096 1351 -486
378d86l11j061k143J047J660m85J002L214L85j681J3m48j832J020j81j821K278
$$ -486 -797 -1858 -4001 -2954 -1294 -1779 -777 2437 2822 1141 1154 706 -1126 -106 -287 -2108 170
395A70L308k385j022L627j076n624J146J999k989J10L622o90l67K850j484k562
$$ 170 3478 1093 71 3698 2622 -3002 -1856 143 -2846 -2736 886 196 -171 2679 1195 -1367
411a367J907l6m185J144L816j469O55L394j985k186K817k349m791L605K426n212
$$ -1367 540 504 -3681 -2537 1279 -190 465 3859 1874 -312 2505 156 -4635 -1030 1396 -3816
427c816J018P051j892l582L961j27n818J714K090l510K087M681l480j333N113
$$ -3816 -2798 4253 2361 -1221 2740 2613 -3205 -1491 599 -2911 -824 3857 377 -956 4157
442D157j479n284K338R17n083J791M032k447J491M756m528m023N794r97p521L398
$$ 4157 2678 -2606 -268 649 -4434 -2643 1389 -1058 433 5189 661 -3362 2432 1435 -6086 -2688
458b688N793n317m73P225j108l716L568j839n706L229J884n060K436O943m254
$$ -2688 3105 -2212 -2685 4540 3432 -284 3284 1445 -4261 -1032 852 -4208 -1772 5171 917
473I17l700O286o66o185L097O39n652K693N760m088o91P420l481o579M833K054
$$ 917 -2783 3503 2837 -3348 -251 388 -5264 -2571 3189 -899 -1590 5830 2349 -4230 603 2657
489B657o782J230M710l466L34N538k713k587N450k097q042M161N294o633j84P814
$$ 2657 -4125 -2895 1815 -1651 -1317 4221 1508 -1079 4371 2274 -5768 -1607 3687 -2946 -3130 4684
505D684k680m504N644K24o212K709J613o785K144P173m546l003P027p05p304M058
$$ 4684 2004 -2500 3144 3368 -2844 -135 1478 -5307 -3163 4010 -536 -3539 3488 2783 -4521 -463
521d63K532o433K209M666m919L42P747l440n340P300J14r105L069O403n661j444
$$ -463 2069 -4364 -2155 2511 -2408 -2066 5681 2241 -3099 4201 4315 -4790 -1721 4682 -979 -2423
537b423O526k865l919N528l8o488K487K258n896J520N632l455j828N341j910m076
$$ -2423 4103 1238 -2681 2847 2809 -3679 -1192 1066 -4830 -3310 2322 -1133 -2961 2380 470 -3606
553c606N054K0n844L670N230n886n8P301k449m630M722j11o249K202L323m428
$$ -3606 1448 1468 -4376 -706 4524 -1362 -1420 5881 3432 -1198 3524 3413 -2836 -634 2689 -1739
569a739M64L956l345j662M649k259m573K983M03l613K919L250l756J497M812l263
$$ -1739 -1275 2681 -664 -2326 2323 64 -4509 -1526 -1123 -4736 -1817 1433 -2323 -826 3986 723
585G23k800M961j247m980M067L065m143N19M619k130k313K408k123l313K237j03
$$ 723 -2077 2884 1637 -3343 724 3789 -354 165 4784 2654 341 2749 626 -2687 -450 -553
601e53k531K235J669k376J261K051l633j439K929j379k558L920J668k786K232
$$ -553 -3084 -849 820 -1556 -295 1756 -1877 -3316 -387 -1766 -4324 -404 1264 -1522 710
616G10L665k864r59J777j928k171K685O18k009J814J568k255l9J512l061j275
$$ 710 4375 1511 552 2329 401 -1770 915 1533 -476 1338 2906 651 612 2124 -937 -2212
632b212K070k037j315L508K61j816K282J800m647k18L266j727k296L549P82k546
$$ -2212 -142 -2179 -3494 14 275 -1541 741 2541 -2106 -2324 942 -785 -3081 468 1250 -1296
648a296K742K539l111k42J563k637j235K477n57j590K846Q96l302J050J479l241
$$ -1296 1446 3985 874 632 2195 -442 -1677 800 243 -1347 1499 2395 -907 143 1622 -1619
664a619p74K714k112j948L714J094k209J641J621l427m52L273j747j327L194p1
$$ -1619 -2393 321 -1791 -3739 -25 1069 -1140 501 2122 -1305 -1757 1516 -231 -1558 1636 1565
680A565k177K453J792l526k66K177k704j422K996n17k164K781R40l725Q56K274
$$ 1565 -612 1841 3633 107 -159 2018 -686 -2108 888 371 -1793 988 1928 -1797 -941 1333
696A333l064j106L604j223k163L565J337k974J083K165l558n07L223j365j869
$$ 1333 -1731 -2837 767 -456 -2619 946 2283 -691 392 2557 -1001 -1508 1715 350 -1519
711a519L137L87k520J995J212m072K6K380k593j574L861m8k619K639J320l031
$$ -1519 1618 2005 -515 1480 2692 -1380 -1354 1026 -1567 -3141 720 672 -1947 692 2012 -1019
727a019K82J862k487r93K652k39j554L053O95k257O80J590k929q98K450j405j150
$$ -1019 -737 1125 -1362 -2355 297 58 -1496 1557 2252 -5 675 2265 -664 -1562 888 -517 -1667
744a667K424P02j437R31R79k584p85J737j268j520K249O82j156J358R02j588j88
$$ -1667 757 1459 22 953 1932 -652 -1437 300 -968 -2488 -239 443 -713 645 1547 -41 -229
761b29P87j560o58J562o4r91J880J294j441K54O78j383r15N71k71n84J267R00
$$ -229 558 -1002 -1660 -98 -162 -1153 727 2021 580 834 1512 129 -786 -215 -486 -1070 197 1097
779A097o53M18O29j494p43L20q83m99R99M56p5O24N97q63j00K46p22l39O32J21
$$ 1097 444 862 1491 -3 -746 -426 -1309 -1808 -809 -353 -428 196 793 -70 -170 76 -646 -985 -353 -232
799b32j35Q24P80j36J91l1r46o27J31N5l89N06O36l78k8K32l18q68k06O2k87K03
$$ -232 -367 457 1237 1101 1292 1261 315 -312 -181 -126 -515 -9 627 249 221 453 135 -733 -939 -877 -1164 -961
821i61N89J42R01jm68L14j80n36m45R01j16K86J93P59n58m71K68p62m91q9M51
$$ -961 -372 -230 671 670 202 516 336 -200 -645 256 140 426 619 1378 820 349 617 -145 -636 -725 -274
842b74M7J26J48L08j28l29l09m66k69K94R6Q39m9K18O42p1p20J8Pn64l09P15N90
$$ -274 -227 -101 47 355 227 -102 -411 -877 -1146 -852 -756 83 34 252 894 823 103 121 128 -436 -745 -30 560
865E60O2L5K54n4q51j05k86k96PO23J9M23J07k25J68m61o24j50M76o33K17J067
$$ 560 622 657 911 857 6 -99 -385 -681 -674 -51 -32 391 498 273 441 -20 -644 -794 -318 -951 -734 333
887C33L75p62O71L77j102o29N48N7o57M66M10K81K02K83n37r9k36p11m1M66L19
$$ 333 708 -54 617 994 -108 -737 -189 -132 -789 -323 87 368 570 853 316 217 -19 -730 -771 -305 14
908A4l07O97P9m05L72l54p86J86L56o17m63J462O66o99L60M24r77k26M97j17l08
$$ 14 -293 404 483 78 450 96 -690 -504 -148 -765 -1228 234 900 201 561 985 8 -218 279 162 -146
929a46L14m42J34R42m05m4j68k17j022J92P27o07J50J299o31r04J252M86j179
$$ -146 168 -274 -140 802 397 353 185 -32 -1054 -862 -135 -742 -592 707 76 -828 424 910 -269
948b69j24L31p41M3J144L27m29O96n53n86P39j49p16J29L07j208L99J342m29m95
$$ -269 -393 -62 -803 -760 384 711 282 978 425 -161 578 429 -287 -158 149 -1059 -660 682 253 -242
968b42O46o99j468J220R79j031m1J336p83m10J553L35j203K33m7j594M88J863
$$ -242 404 -295 -1763 -543 436 -595 -636 700 -83 -493 1060 1395 192 425 378 -1216 -728 1135
986A135l41n84R27j054q77J378M46j616j1Q29j592K80K430p57j480J261m50j834
$$ 1135 794 210 1137 83 -794 584 1030 -586 -597 232 -1360 -1080 1350 593 -887 374 -76 -1910
1004a910P34K001q07m13J239q99q79K528L46k335O12L24k201J205K573j401r84
$$ -1910 -1176 825 18 -395 844 -55 -934 1594 1940 -395 217 541 -1660 -455 2118 717 -267
1021b67J580j172k026K427Q33k783N6J886j886m90L343n11k186J164L15k600J599
$$ -267 1313 141 -1885 542 1375 -1408 -1352 534 -1352 -1842 1501 990 -1196 -32 283 -2317 -718
1038g18K415j731n10K297j559j966L736L35l008O38J495k953M50L687j846k139
$$ -718 1697 -34 -544 1753 194 -1772 1964 2299 -709 -71 1424 -1529 -1079 2608 762 -1377
1054a377K599o88l119K612J598l194L1K583k094q67L468m68k217J724L77l412
$$ -1377 1222 534 -2585 27 1625 -1569 -1538 1045 -1049 -1916 1552 1084 -1133 591 968 -2444
1070b444J754L181k505p93K943j609k335L216Q27l466M82J896k782N71L385j776
$$ -2444 -690 2491 -14 -807 2136 527 -1808 1408 2235 -1231 -749 1147 -1635 -1064 2321 545
1086E45k158K508l25k565J769J446k736L19K598j976n85K817m69k647K183J79
$$ 545 -1613 895 570 -1995 -226 1220 -1516 -1197 1401 -575 -1160 1657 1188 -1459 724 903
1102I03k799J359K607k222r06K536j107j357K061N61l185N29J770j873P0K562
$$ 903 -1896 -537 2070 -152 -1058 1478 371 -986 1075 1636 -1549 -1020 750 -1123 -1053 1509
1118A509j303j412J599J83k122J469J093j962j40J972r73j075K526M8j915N26
$$ 1509 206 -1206 393 576 -1546 -77 1016 -946 -1086 886 -87 -1162 1364 1412 -503 23
1134B3R42j794M75J756j040j186J524k11j250J277N46j906Q1J027p64n17J757
$$ 23 965 -829 -354 1402 362 -824 700 489 -761 516 1062 -844 -763 264 -500 -1017 740
1151G40l29j095J149j06j219M76R81j219j03J372n52p13J553J52j160J64P14j158
$$ 740 411 -684 465 359 -860 -384 597 -622 -725 647 95 -618 935 1087 -73 91 805 -353
1169c53k88J225k10r91J021K97j108L04L10q20m2P40q98k17J376k79o29R44J70
$$ -353 -641 584 374 -617 404 701 -407 -103 207 -613 -655 85 -813 -1030 346 67 -562 382 552
1188E52j309K47R54m17m90J061l86l73Q43J76r77J44N68j151J52R09m78m21Q49
$$ 552 -757 -510 444 27 -463 598 212 -161 682 858 -119 25 593 -558 -406 503 25 -396 453
1207D53j03o92LJ63o43j34J131n51M5P10n7n18N93l28n57M71L83m92J54O00k62
$$ 453 350 -342 -339 -176 -819 -953 178 -373 -328 382 325 -193 400 72 -485 -14 369 -123 31 631 369
1228C69j7J84r4n44N3j85m77N78Q7q6K0M73k85m52P6k59k44M51L94m5N5M11n9
$$ 369 352 536 442 -102 -49 -234 -711 -133 -46 -132 -112 361 76 -376 -300 -559 -803 -352 42 -3 52 463 404
1251D04l91J62j99k01J01L39k89K08J66K6P1q3k89m75J58K76k27j49K45j5J80
$$ 404 13 175 -24 -225 -124 215 -74 134 300 326 397 314 25 -450 -292 -16 -243 -392 -147 -162 18
1272A8K27k20k10R9l25j4K68LJ44J68q8K24P8j99k84J4j9p1K27K21L2K6P0o7k87
$$ 18 245 25 -185 -86 -411 -425 -157 -154 -10 158 70 294 372 173 -111 -97 -116 -187 40 261 293 319 389 322 35
1297C5j85p1j41k09L50j77L62J65p4l25K6L42j74J9k86L18j75M06Q7J91l7q0j41
$$ 35 -150 -221 -362 -571 -221 -398 -36 129 55 -270 -244 98 -76 -57 -343 -25 -200 206 293 484 447 367 226
1320B26j66J80j00l46q7N36l95L70k73q0j63Jq4k22J73J41M0J22K04K67kj89k66
$$ 226 60 240 140 -206 -293 243 -152 218 -55 -135 -298 -297 -381 -603 -430 -289 -249 -127 77 344 342 153 -113
1343a13R0Q9K9m40O05J43k26R2J39k89j25J26k98r0O6N5O6K60l37Q0p3J20o01
$$ -113 -23 66 95 -345 260 403 177 269 408 119 -6 120 -178 -268 -202 -147 -81 179 -158 -78 -151 -31 -632
1366f32N10K79m61K91L45j52k23K00J4j62j47J64Q5K28j17o1J54n3j68j22k30
$$ -632 -122 157 -304 -13 332 180 -43 157 171 9 -138 26 111 339 222 161 315 262 94 -28 -258
1387b58q0j83J96J93mK97j38qj66q7j3j41K95K56j17J27N4J59j51k1p0q8o8J24
$$ -258 -338 -521 -325 -132 -136 161 23 15 -151 -238 -251 -392 -97 159 42 169 223 382 231 210 140 52 -16 108
1411A08j27J46k8M9j21J09j42k85N1J72j14J40J4J16j39J81j07q2j43K12k30k89
$$ 108 -19 127 99 148 27 136 -6 -291 -240 -68 -182 -42 -28 88 -51 130 23 -59 -202 10 -220 -509
1433e09R80m01j33L07J39r2l87K71k29j36J8k7q8N53J92n13K07l34n4L34k04j07
$$ -509 471 70 -63 244 383 291 -96 175 -54 -190 -172 -199 -287 266 458 -55 152 -182 -236 98 -106 -213
1455b13P3K18k07p3J79M05n09J09M09n05L22j08L34l20J63j95j27j44J75m2j26
$$ -213 -140 78 -129 -202 -23 382 -127 -18 391 -114 208 100 434 114 277 82 -45 -189 -14 -56 -182
1476a82J64Lm14N80mk27l2q0k06J62M63k72o0L25p2Kj26J30j07m3J77l02j93L67
$$ -182 -18 -15 -429 151 147 -80 -112 -192 -398 -236 227 -45 -105 220 148 150 24 154 47 4 181 -121 -314 53
1500E3J73K4l84J69k7j62K96o4p1k50K96j08R7K40l37q1K65m12J2L27K11k73J42
$$ 53 226 250 -134 35 8 -154 142 78 7 -243 53 -55 42 282 -55 -136 129 -283 -271 56 267 -6 136
1523A36J13J68n41M78k14k59J51l1J6J24O5K3j95j9J81l16L37j49m02K6L44l63
$$ 136 249 417 -124 354 140 -119 32 1 17 141 206 229 34 15 196 -120 217 68 -334 -308 36 -327
1545c27P9O38m12N5L4M8l16K34o2q9J42K35l58K3M06j52k02Q4j37k16K37J09J79
$$ -327 -248 390 -22 33 67 115 -201 33 -29 -118 24 259 -99 -76 330 178 -24 60 -77 -293 -56 53 232
1568B32j21n3j84j30L32L1n96P11M7j47j09K52K1k92K6M5m5k7j4K92J1k81j0L76
$$ 232 111 58 -126 -256 76 107 -489 222 269 122 13 265 286 -6 20 65 20 -7 -21 271 282 1 -9 367
1592C67k47m8K28m82k17K03K75j61K20K3l83L67L4l40k8K40k50N1N52j68j68m9
$$ 367 120 72 300 -182 -399 -196 79 -82 138 161 -222 145 179 -161 -189 51 -199 -148 404 236 68 19
1614A9J99m06jK73l59r4O73l11m39N60J70p19J96J14l31L23M69k03j43K47k45
$$ 19 218 -188 -189 84 -275 -369 304 -7 -446 114 284 -435 -239 -125 -456 -133 336 133 -10 237 -8
1635hk85K04N72o16j13N44l71l01Q72k7o00N77j24n84N3M62m14m9O10m12l40N08
$$ -8 -293 -89 483 -133 -246 298 -73 -374 498 471 -129 448 324 -260 -207 255 -159 -208 402 -10 -350 158
1657A58P2m14K92k04l36L75L53j09m77N21K4n29L96J62l09nJ43k1k96M25q2k98
$$ 158 230 -184 108 -96 -432 -57 296 187 -290 231 255 -274 122 284 -25 -30 113 92 -204 221 139 -159
1679a59L05J21l07j3J43r2l23M26m38J69L07n3j50M5k1m1J2L02k60L8k9K39j1
$$ -159 146 267 -40 -53 90 -2 -325 101 -337 -168 139 86 -64 -19 -40 -81 -69 233 -27 11 -18 221 210
1702B10k41J79n8k62N8J47J10k27L38k24J24q4k91R9K09k2l81J44Q7J14q7L12
$$ 210 -31 148 90 -172 -114 33 143 -84 254 30 154 70 -221 -122 87 65 -316 -172 -85 29 -58 254
1724B54k76k21J14K32k13K00J08k29K4K72j01n6K7k97mJ77o7j65M04K25o68L04
$$ 254 -22 -243 -129 103 -110 90 198 -31 -7 265 164 108 135 -162 -166 11 -56 -221 183 408 -260 44
1746D4j20K2N0J44j83J63K0J8j30J50L24m51p2k8L61k81n8L19k55N0j98J18J00
$$ 44 -76 -54 -4 140 -43 120 140 158 28 178 502 51 -21 -49 312 31 -27 292 37 87 -111 7 107
1769A07k82j9mP5Q7J05M2Nk58O20o31p4K33q8L4L8L72l08rJ0j51L0k52J4j23N30
$$ 107 -175 -194 -198 -123 -36 69 111 116 -142 478 -153 -227 6 -82 -48 -10 362 54 45 55 -96 -66 -318 -304 -427 103
1795A03n3r5K74k12j56J23r2j77K14K02k66J19J95M6j43J48k58P3q0Q4K34J0j13
$$ 103 50 -45 229 17 -139 -16 -108 -285 -71 131 -135 -16 179 225 82 230 -28 45 -35 49 283 293 180
1818A80K2r7np3j79k04J18M52m62R0L35l07n7J93J14j67J75j43o1J09Q2k9N6R4
$$ 180 202 105 100 27 -152 -356 -238 214 -248 -158 177 -130 -187 6 120 -47 128 -15 -76 33 115 86 142 236
1842B36Q9l23R3j41O2l00K53KL7K12l84J49j19K06k62L03l49K89k37J62J40l19
$$ 236 325 2 95 -46 16 -284 -31 -29 8 220 -164 -15 -134 72 -190 113 -236 53 -184 -22 118 -201
1864b01K5K64j71K06O1k81J9K2K08k12J50J32n4k64rJ02q1J51k58R2N35n09j69
$$ -201 -176 88 -83 123 184 -97 -78 -56 152 -60 90 222 168 -96 -105 -3 -84 67 -191 -99 436 -73 -242
1887b42M38l41K20m2k24L7L00k38r7J34M7M39l38QJ3q6P4k8J33j06m9j88J5J86
$$ -242 196 -145 75 33 -191 -154 146 -92 -189 -55 -8 431 93 101 114 28 102 74 207 101 52 -136 -121 65
1911F5l33J25M0K08k99OM9N0kL3q3J05r4M43l41N0j45J99O0L0k16J93Nq4q7J89
$$ 65 -268 -143 -103 105 -194 -188 -139 -89 -91 -58 -141 -36 -130 313 -28 22 -123 76 136 166 -50 143 148 64 -23 166
1937A66q1j71L0K90k56j09J11K17l60J09r4P3K20N7l63M0L66l06j97M18m6n64
$$ 166 85 -86 -56 234 -22 -131 -20 197 -163 -54 -148 -75 145 202 -161 -121 245 -61 -258 160 114 -450
1959d50M39n5R5K41k54N4j60K86j45q0K48m6l10N4l8K04m04M57j68j7r3l0M5J70
$$ -450 -11 -66 29 270 16 70 -90 196 51 -29 219 173 -137 -83 -121 83 -321 136 -32 -49 -142 -172 -127 43
1983D3J35j0J7j4j69j96N72k79k47L75p6r9K66M8m09k06K04L19n38J04K03r8O8
$$ 43 178 168 185 171 2 -194 378 99 -148 227 151 52 318 366 -43 -249 -45 274 -264 -160 43 -55 13
2006A3p6n0P7J65k6l70K93Pk04J64R7j95J42J19k39Q6J97l55O8K42j09K34m78
$$ 13 -63 -113 -36 129 103 -267 26 33 -171 -7 90 -105 37 156 -83 3 200 -155 -87 155 46 280 -198
2029a98M23j13l02K01l3j75Q6Po3L58j72k2%J00j85L38K8k72J02j8Q6j76j84J80
$$ -198 225 112 -190 11 -22 -197 -111 -104 -167 191 19 -3 -3 97 -88 250 278 6 108 90 176 0 -184 -4
2053dK57j76L9P7k51J7K03j39Q6l68m5N05k63l1n6O8J14M2k0l73K31l5ojK15j93
$$ -4 253 77 116 193 -58 -41 162 23 109 -259 -304 201 -62 -93 -149 -81 33 75 55 -318 -87 -122 -128 -129 86 -107
2079a07O6J14P4Nj30o0L1p2J76j40l3M7K6q4K63k65J99l41J78L38l68j4J04p8
$$ -107 -41 73 147 152 22 -38 -7 -79 97 -43 -76 -29 -3 -87 176 -89 110 -231 -53 285 -83 -97 7 -71
2103g1O1O4p3J6M6L49j52k54K82k03j36j3J42j86K17m0m93L47K73m36l19R06k19
$$ -71 -10 54 -19 -3 43 392 240 -14 268 65 -71 -84 58 -128 89 49 -444 -97 176 -260 -579 327 108
2126A08j92L59j27l81J97p3L6j2L75j25k28L98j17k23J70m3k58L55o7n35K09J93
$$ 108 -84 275 148 -233 -36 -109 -73 -85 290 165 -63 335 218 -5 165 122 -136 219 152 -383 -174 19
2148A9J24k38N83j90m03%R8q9j59O42l85R4J16l81p7N43m30p2K52K05n09L89q4
$$ 19 143 -95 488 298 -105 -105 -7 -96 -255 387 2 96 212 -169 -246 297 -133 -205 47 252 -257 132 48
2171D8j00k97P40m41l85N89j28o8M0J88k10k00K24K35k32J57k5o7O4J67n08Q8
$$ 48 -52 -349 391 -50 -435 154 26 -42 -2 186 -24 -224 0 235 3 160 135 68 132 299 -209 -121
2193a21K77k23j17M49l40n7J08o6O8o5rJ13j03L99l53l58N04Q3l39q1L05l27K23
$$ -121 156 -67 -184 265 -75 -132 -24 -90 -22 -87 -96 17 -86 313 -40 -398 106 189 -150 -231 74 -253 -30
2216c0K90j39j53O9m2P2J21K4j33l00K01l8MJ57J31n29J31M34k91K68j30L9l30
$$ -30 260 121 -32 37 -5 67 188 212 79 -221 -20 -58 -54 103 234 -295 -164 270 -21 247 117 156 -174
2239a74J21N9j2J7J8Q8j35p6M7J27k48K32k36J07K94j97p5jJ56l91J95J21P1J70
$$ -174 -53 6 -6 11 29 117 -18 -94 -47 80 -168 64 -172 -65 229 32 -43 -44 112 -279 -84 37 108 278
2263B78j44n15K84J81lk11K41P9k65J70k09J82j14J43k22K30j66Q8j43L90k50
$$ 278 134 -381 -97 84 81 -130 111 190 -75 95 -114 68 -46 97 -125 105 -61 27 -116 274 24
2284B4j86N0M20j39k94K67k50o2J03l8j9J23J86k81O9Q7k60K75J21k93J21L2j17
$$ 24 -162 -112 308 169 -125 142 -108 -170 -67 -105 -124 -1 185 -96 -27 60 -200 75 196 -97 24 56 -61
2307f1J01mK87j31n2p5o8K9J52n6J29p5j37k03l26O28r7j48O9j75J46J49J03k31
$$ -61 40 36 323 192 140 65 -3 26 178 122 251 176 39 -164 -490 138 41 -107 -38 -213 -67 82 185 -46
2331d6n6J36P3mJ22j54j04J40J6k32K19o1j75K97J2k28J3p1R3Q3K9j73o2M37j74
$$ -46 -102 34 107 103 225 71 -33 107 123 -109 110 49 -126 171 183 -45 -32 -103 -10 73 102 -71 -133 304 130
2356A30r6K76n9n29K34k16J94K02l56M22j82J47j65n7K07k80J40j84J22J06RN0
$$ 130 34 310 251 -278 -44 -260 -66 136 -220 202 20 167 2 -55 152 -128 12 -172 -50 56 65 115
2378A15K02k12j16q3J29K1k52M2J63M9P5Nj67l9k46K49J55j49R6p0j79J29M8K15
$$ 115 317 105 -11 -94 35 56 -196 -154 9 58 133 138 -29 -68 -314 -65 90 -59 37 -33 -212 -83 -35 180
2402A80j85K6m2o7K94l71K00p2p3j69P2K00o9R5Rk4J67j07L6k04J24P7k80M17
$$ 180 -5 21 -21 -88 206 -165 35 -37 -110 -279 -207 -7 -76 19 28 4 171 64 100 -104 20 97 -183 234
2426B34j25rR0k21PK41k26P4j15O7j02m7Q4kP3k16R9J88O0j90o5R5R1J03k59K98
$$ 234 109 100 190 -31 -24 217 -9 65 -50 17 -85 -132 -48 -50 23 -193 -94 94 154 -36 -101 -6 85 188 -71 227
2452B27j21j85K78k44J0J03l4l85kN40j57J40k36m4J8Q8J30r5L6J40m2j25Q4j99
$$ 227 106 -79 199 -45 -35 68 34 -351 -353 187 30 170 -66 -110 -92 -4 126 31 67 207 165 40 124 -75
2476g5J54qj65o7L89j96o1K1Qpj22K94m51L22L2m50M99o9k84O7K9M28k42j47L48
$$ -75 79 71 -94 -161 228 32 -29 -8 0 -7 -129 165 -286 36 68 -382 117 48 -236 -169 -140 288 46 -101 247
2501B47J32m34L09j17m39K97L0p8m8L99k72k67N23k28o1J89q2k51L35k07j87K96
$$ 247 379 -55 254 137 -302 -5 25 -53 -101 298 26 -241 282 54 -7 182 100 -151 184 -23 -210 86
2523H6p6j24K23p4J83k63n8J51r0n0K05l16J47R4k19N8J67K70m44P4K05j37O7
$$ 86 10 -114 109 35 218 -45 -103 48 -42 -92 113 -203 -56 38 -181 -123 44 314 -130 -56 149 12 79
2546G9j24k19J08L68n9l15O0k2%M8L10k63K0K02k44j31Q8M01m31M6Q8j16r2K38
$$ 79 -45 -264 -156 212 153 -162 -102 -124 -124 -76 234 -29 -9 193 -51 -182 -94 307 -124 -78 10 -106 -198 40
2570D0j73q8K70N6k63l4K64n0L4J39j38j04K77j49KJ0K00j78j77J42o3l42M18
$$ 40 -133 -221 49 105 -158 -192 72 22 56 195 57 -47 230 81 83 93 293 115 -62 80 17 -325 93
2593I3P8k32K20oO2l83K50l55J30M92k22k02J1p7o2K5J41K1J10J67k57K3K58q2
$$ 93 171 -61 159 153 215 -168 82 -273 -143 349 127 -75 -64 -141 -203 -178 -37 -16 94 261 4 27 285 203
2617B03j95j1K71m84L33Q6l90K73O3k9l44QK31j72N0M44m57j97O89n60k58L61
$$ 203 8 -3 268 -216 117 203 -187 86 149 120 -224 -216 15 -157 -107 337 -120 -317 372 -188 -446 -85
2639h5L2p0N9L68o48J71L32O2n63L95K53o38K89J26j73qJ18J75k68J37Q6m45M75
$$ -85 -53 -123 -64 304 -344 -173 159 221 -342 53 306 -332 -43 83 -90 -98 20 195 -73 64 150 -295 180
2662A80m3l47J58J4J83k50J7R2j00J1L75k95j6J60k62K2J78j21p2J06n1L0j35
$$ 180 137 -210 -52 -38 145 -105 -88 4 -96 -85 290 -5 -21 139 -123 -101 77 -44 -116 -10 -61 -31 -166
2685a66J91j92K99k41J02m02M27k21K23mM65m75j9J03j5k39L44j84j99J92J53
$$ -166 25 -167 132 -109 -7 -409 18 -203 20 16 481 6 -13 90 75 -164 180 -4 -203 -11 142
2706A42m7j91O4j19J25J43q7j2o3k6N3J05O0k5j78J3K07j11j62J92j86l9K69k08
$$ 142 95 -96 -32 -151 -26 117 30 18 -45 -71 -18 87 147 122 -56 -43 164 53 -109 83 -103 -142 127 -81
2730h1J43J80l59l3j19N13k34L21j40k74P0p5K72k58J13J33k38J66J18j44j76
$$ -81 62 242 -117 -150 -269 244 10 331 191 -83 -13 -88 184 -74 39 172 -66 100 218 74 -102
2751a02J20J19l2l4j15N0l68M88q2m4m8J00j25O0K04j34k71L02rj73J66r3Q0j64
$$ -102 18 137 105 71 -44 6 -362 126 44 0 -48 52 -73 -13 191 57 -214 88 79 -94 72 -21 59 -105
2775a05J16K53j65j83m6J05j58O6K06M9k44L9K15j45j45O7K16k04J92M3k06J29
$$ -105 11 264 99 -84 -130 -25 -183 -117 89 138 -106 -67 148 3 -142 -75 141 -63 129 172 -34 95
2797I5L15m15l4k55K85K34j14K4k37J06K6j26K43j89J62jp6j66OL14q3k50j09
$$ 95 410 -5 -39 -294 -9 225 111 135 -102 4 30 -96 147 -42 120 119 43 -123 -117 197 114 -136 -245
2820b45K59J16l58K36m3L9j63O2J40j28J42P9k25K09l86J95K26k32J9l1J37o9
$$ -245 14 130 -228 8 -35 4 -159 -97 43 -85 57 136 -89 120 -266 -71 155 -77 -58 -89 48 -21
2842b1J42j24J27j0K57k67l8n2p6K09O4l85K92m9j10K8q1Kn4K04j84L62m09K02
$$ -21 121 -3 124 114 371 104 66 14 -62 147 211 -174 118 69 -41 -13 -94 -92 -146 58 -126 236 -173 29
2866B9l6j07q1n7J85J2J46k17P0o7j06L15n6q0N5m8J89j05r8o3K1K60pm91O41
$$ 29 -7 -114 -195 -252 -67 -55 91 -126 -56 -123 -229 86 30 -50 5 -43 146 41 -57 -120 -99 161 154 -337 304
2891C04J73k87k72q0rK81k42P3p0J7j40J38P8j32K36J0l1j2O9k38l0L18o2r0Q8
$$ 304 477 190 -82 -162 -171 110 -132 -59 -129 -112 -252 -114 -36 -168 68 78 47 35 104 -134 -164 154 92 2 90
2916I0Nj68J8q2J03j60J53j43R2K00k70L18q2%j55q1J19j16mK61k45J9L9N0M8
$$ 90 95 -73 -55 -137 -34 -194 -41 -184 -92 108 -162 156 74 74 -81 -162 -43 -159 -163 98 -147 -128 -89 -39 9
2941In7L97l17J75j84K8j0L56l95J2k0p1K1r8p6K71kk1J17j11J62j97O6p5J51
$$ 9 -48 349 32 207 23 51 41 397 2 14 -6 -77 -56 -154 -230 41 39 18 135 24 186 -11 55 -20 131
2966A31l45K51K90j40J69m5k33J82k65j32K34j57M8J63ll79J39J91j38L7o5R3
$$ 131 -214 37 327 187 356 311 78 260 -5 -137 97 -60 -12 151 148 -231 -92 99 -39 -2 -67 26
2988B6j7K20l36N4K24k56R2M6p3jj33J56N9o4j7On5J33j57j19K96j51J2J49j38
$$ 26 9 229 -107 -53 171 -85 7 53 -20 -21 -154 2 61 -3 -20 -14 -69 64 -93 -212 84 -67 -55 94 -44
3013d4J85J59k77J4Q3M6l07J07J02K84n54J74j34Q1K01l59J91q0Q7P7p5r0J30
$$ -44 141 300 23 37 120 166 -141 -34 68 352 -202 -28 -162 -81 120 -239 -48 -128 -41 36 -39 -129 1
3036AJ87k16O2j87J56n2q7Q1L51m65J49K20n3l66K44K09j83J77r5l26J32J91k21
$$ 1 188 -28 34 -153 3 -49 -136 -55 296 -169 -20 200 147 -219 25 234 51 228 133 -193 -61 130 -91
3059i1l4K87j84J21k1m4m70M27j6K17p9k61N4J89r0R0k44M2J46j64L32j30j54
$$ -91 -125 162 -22 99 78 34 -436 -9 -25 192 113 -148 -94 95 5 95 -149 -107 39 -125 207 77 -77
3082g7J00p9RJ29k06Q8j3j25J06N1k1K0k66K19j61L52J28m47J66J73mk20J75k44
$$ -77 23 -56 -47 82 -124 -36 -49 -174 -68 -17 -38 -18 -284 -65 -226 126 254 -193 -27 146 142 -78 97 -147
3106a47L44l37K15k3k85M49r9N1l45R8L0K29j60O7qn5k35K87n1k22PK90Q6J20
$$ -147 197 -140 75 52 -233 216 117 168 -177 -79 -49 180 20 87 79 24 -211 76 25 -197 -190 100 186 306
3130C06k86j73L70k00q5J1J42J2k33P7M0nJ18j11j29K12L4m9j46J72j76J86k86
$$ 306 20 -153 217 17 -68 -57 85 97 -136 -59 -19 -24 94 -17 -146 66 100 51 -95 77 -99 87 -199
3153a99qK71K10j49k44J73M0J24r7q1j34j34L37j8p9L4p9L9K1J73q4j93J54n8
$$ -199 -207 64 274 125 -119 54 94 218 121 40 -94 -228 109 91 12 46 -33 6 27 200 116 -77 77 19
3177A9R8n6N9k86K15p4L2j89J12k5L7J0L7k2M9J5J3Q8%j81j09L30m1J6k07L49
$$ 19 117 61 120 -166 49 -25 7 -182 -70 -95 -58 -48 -11 -33 16 31 44 132 132 -49 -158 172 131 147 -60 289
3203B89m00K3plQ2J97k30J52pn2R2J54m21K5J18L37n11j51N18M7j59j91q4N6k2
$$ 289 -111 -88 -95 -98 -16 181 -49 103 96 44 136 290 -131 -106 12 349 -162 -313 205 252 93 -98 -182 -126 -148
3228a48J90N5p9Q8j56p5K48j28r5O6k2k30K12J73j54O4K25k09J3l0J1J84j97J16
$$ -148 42 97 18 106 -50 -125 123 -5 -100 -34 -56 -286 -74 99 -55 9 234 25 38 8 19 203 6 122
3252A22r2K6M0lj39p6K75k73L2R9O5j72L8NK03k68K47j42l7J83j4j72J43n9j57
$$ 122 30 56 96 93 -46 -122 153 -120 -88 11 76 -96 -58 -53 150 -118 129 -13 -50 133 119 -53 90 31 -126
3277a26j77L06J00J2L0J68l93K26k58L07l36J43j72K31k39J26J29r7K84k21j58
$$ -126 -303 3 103 115 145 313 -80 146 -112 195 -141 2 -170 61 -178 -52 77 -20 264 43 -115
3298a15o0K29J10j27J14k00j3J50k6j91K61l44J50RQ3j43J08j17K83J4j74r7J49
$$ -115 -175 54 164 37 151 -49 -62 88 62 -129 132 -212 -62 -53 30 -113 -5 -122 161 175 1 -96 53
3321E3j18j35J88K49k68j64K44q4j10M0mK23j87L4N2KJ05j13ok4K76k06N0O0k52
$$ 53 -65 -200 -12 237 -31 -195 49 -35 -145 -105 -109 114 -73 -39 13 15 120 7 1 -23 253 47 97 157 -95
3346i5O5J56k01J3K80l33K26j54J06J08j98k71M53j25j92O6J36M7k28J1L36n0
$$ -95 -30 126 -75 -62 218 -115 111 -43 63 171 -27 -298 155 30 -162 -96 40 87 -141 -130 206 156
3368A56q2r7j47J7K0NL37j75l4J43j69L7j30k0K68k14K0J65j90K11j66K03j75
$$ 156 74 -23 -170 -153 -133 -128 209 34 0 143 -26 11 -119 -139 129 -85 -65 100 -90 121 -45 158 -17
3391a7J22J07k70K19l73J45Q7K05k61M5O0nj19M6%j95K82Lj2K3n3M1l3j69l0J63
$$ -17 105 212 -58 161 -212 -67 20 225 -36 9 69 64 -55 -9 -9 -204 78 81 69 92 39 80 47 -122 -152 11
3417A1L1k84J07M9Oj42m1L89n9k63M6J49M7j69J08j64j11K55JK72K28o31L2J50
$$ 11 42 -242 -135 -86 -80 -222 -263 126 67 -196 -150 -1 46 -123 -15 -179 -290 -35 -34 238 466 -165 -133 17
3441A7M4l23L32j81M2L6L5l3l2K00j34M2o2L49k81kJ96l59O1R7p0L10k38j72K18
$$ 17 61 -262 70 -111 -69 -33 2 -31 -63 137 3 45 -17 332 51 49 245 -114 -53 44 -26 284 46 -126 92
3466I2q6L02o41M99j50j00j75K26m2m0K09k96M07l14K73k33j1k6N4J55j42m0J7
$$ 92 6 308 -333 166 16 -84 -259 -33 -75 -115 94 -202 205 -109 164 -69 -80 -106 -52 103 -39 -79 -62
3489f2K18j39Pk40L32k58Q3J55l09K61j31K09m9j12L8q8R4J30l52K62n9k28RJ51
$$ -62 156 17 24 -216 116 -142 -59 96 -213 48 -83 126 77 -35 3 -85 9 139 -213 49 -10 -238 -229 -78
3513g8n1K01J66q8m7k56J42K3j85K15j89J84J58r9j65j20P1L7QJ08nj13O5m9O4
$$ -78 -129 72 238 150 103 -153 -11 12 -173 42 -147 37 195 96 -69 -189 -118 -81 -73 35 30 -83 -18 -67 -3
3538cm5J08J38j77Pm2P8j73j6K22j22m2K5r5K33k48J21J40j48j48J47Q7m1r3J20
$$ -3 -48 60 198 21 28 -14 64 -109 -125 97 -25 -67 -42 -137 96 -152 -31 109 -39 -187 -40 47 6 -87 33
3563C3j49j6N4j7R9q4J61p6pK3p5K18m24J90J25O3k19l3K72k63r3L00k28K39N4
$$ 33 -116 -132 -78 -95 4 -80 81 5 -2 21 -54 164 -260 -70 55 118 -101 -134 138 -125 -218 82 -146 93 147
3588A47k39J78j60K7L9Q5J10o8LoL9j33p6L2K25o1k69j82K55Q7j42L26l16R8n5
$$ 147 -92 86 -74 -47 -8 77 187 119 122 116 155 22 -54 -22 203 142 -127 -309 -54 33 -109 217 -99 -1 -56
3613e6N1q7K03j16m6J07m0j97M62k04j43K73k08j91K41l0k8k95L91j08k21K6K56
$$ -56 -5 -92 111 -5 -51 56 16 -181 281 77 -66 207 -1 -192 49 19 -9 -304 87 -21 -242 -216 40
3636D0k64J05m8P1K88r7L9j16J14j13j54M5oM8K62k15P3o4q3J69k7r7mj45L39
$$ 40 -224 -119 -167 -96 192 95 134 18 132 19 -135 -90 -96 -48 214 -1 72 8 -75 94 67 -30 -34 -179 160
3661A60J40k40O5j39M6q8j39K41j04J52l11K05k8J08q9P4k36L7Q9K26k20o8J68
$$ 160 300 60 125 -14 32 -56 -195 46 -58 94 -217 -12 -40 68 -21 53 -183 -146 -57 169 -51 -119 49
3684D9j88Q2L83m8l58JN03n71j27J80l9J35P5l30J8P5J85j60K89k4k75K82j92
$$ 49 -139 -57 326 278 -80 -79 424 -147 -274 -94 -133 2 77 -253 -235 -160 25 -135 154 130 -145 137 -55
3707e5J60OQ0l66kk8P7p4L96k34n6R3oO7P2j37Q9m2J10l88K78j9N3k6j36L3J91
$$ -55 105 111 191 -175 -177 -205 -128 -202 194 -40 -96 -3 -9 58 130 -7 82 40 150 -238 40 21 74 48 -88 -55 136
3734A36l24k1K23R4O8k00L3J92l65J07L65m04L03l34K05r8M5l08K56J62k92m4
$$ 136 -188 -209 14 108 176 -24 9 201 -164 -57 308 -96 207 -127 78 -20 25 -283 -27 135 -157 -201
3756b01J82P4K7J70l05J03N3j71L11l08J01rK03k38k46L83j88L0Or0P4r8J52J20
$$ -201 -19 55 82 252 -53 50 103 -68 243 -65 36 27 230 -8 -254 129 -59 -29 -23 -113 -39 -137 15 135
3780A35j05P8n4n0o2J27j53l5n1P8J85r8n1M14l67L8o0L2Q9j61L4o1J29J72L6
$$ 135 30 108 54 4 -58 69 -84 -119 -170 -92 93 -5 -56 358 -9 29 -31 1 90 -71 -37 -98 31 203 239
3805B39j64k2k0Q9r0j55J30qR4O9j40l05J02J29P5j3o5J3j2j6o3k4J2M31j43k71
$$ 239 75 53 33 122 32 -123 7 -1 93 162 22 -283 -181 -52 23 10 -55 -42 -54 -70 -133 -157 -145 286 143 -128
3831a28K48j79r8M16l83k5Q6Q9j20J68k31R2K40j63n9N1Q2k02J85o8j38L4R8J93
$$ -128 120 -59 -157 259 -124 -149 -63 26 -94 74 -157 -65 175 12 -47 4 86 -116 69 1 -137 -103 -5 188
3855A88j89j3m5J45Mo3rk37L37l93K23m7J17j77K97J37j62L8l40J79K73k90q0
$$ 188 -1 -14 -59 86 90 27 18 -219 118 -275 -52 -99 18 -159 138 275 113 151 -189 -10 263 -27 -107
3878a07K93j55o8j0r1K66j90K31j42j64K46k7l29J02rj5p6k6L67k55J28J79k25
$$ -107 186 31 -37 -47 -138 128 -62 169 27 -137 109 82 -247 -145 -154 -169 -245 -271 96 -159 -31 148 -77
3901g7J20j90J77J38l27j27L29j11J04k02J65J63l05J59L9J9j63J3j33N2K54k13
$$ -77 43 -147 30 168 -159 -286 43 -68 36 -166 -1 162 -143 16 55 74 -89 -76 -209 -157 97 -116
3923a16J70k12QK53j46J72Kr3R8Lq6j88J94K8j75K40j97k35K01N3K77j80j3k49
$$ -116 54 -158 -150 103 -43 129 131 38 136 139 53 -135 59 87 -88 152 -45 -280 -79 -26 251 71 58 -191
3947a91Q0j8K43R7l07K91j49k73J83K13j94J02j7p7J31q4k18L7K82N3l83K19N8
$$ -191 -111 -129 114 211 -96 195 46 -227 -44 169 -25 77 60 -17 114 30 -188 -151 131 184 -199 20 78
3970G8n25N11j77N5J16J2j55J80n%j78R0p3J06l8l24J63J7n5L39j82L9j73J46
$$ 78 -447 64 -113 -58 58 70 -85 95 90 90 -88 2 -71 35 -3 -327 -164 -147 -202 137 -45 -6 -179 -33
3994c3J08J5j30j18J79l27N75k07l06J55J24j5k38M0K39O6k28M0P4j9J15l60K09
$$ -33 75 90 -40 -158 21 -306 269 62 -244 -89 35 20 -218 -178 61 127 -101 -61 13 -6 109 -251 -42
4017d2N5o8K61j49J31k43K3o3J59r3k95L95j39n2J2Q6j0m4J40K5o3J03k03J14
$$ -42 13 -55 206 57 188 -55 -32 -95 64 -29 -324 71 -68 -120 -108 -22 -32 -76 64 89 26 129 -74 40
4041D0Q7N9j54k38K06q1P4Kj02n6K64j15O6o2j35K12k00j5J46m4J81l83P4M28
$$ 40 127 186 32 -206 0 -81 -7 -5 -107 -163 101 -14 52 -10 -145 67 -133 -148 -2 -46 135 -248 -174 254
4065B54k22j28J05k1lK95m16j3mJ37O2m1m3K44k89J63J9j17k33J48L11l02J4L28
$$ 254 32 -96 9 -12 -15 280 -136 -149 -153 -16 46 5 -38 206 -83 80 99 -18 -251 -103 208 -94 -80 248
4089B48k71rJ97k01n0K40k72K01j54J27nk2l7k0K30k72R0q3J10k72K61k05J9J10
$$ 248 -23 -32 165 -36 -86 154 -118 83 -71 56 51 29 -8 -28 202 -70 20 -63 47 -225 36 -169 -150 -40
4113d0K4J62j65l4j1m4O7kj8N7n5L3P6j4lJ02m13L24O6j57O7q5L5K93k85Q1m7
$$ -40 -16 146 -19 -53 -64 -108 -41 -43 -61 -4 -59 -26 50 36 33 135 -278 46 112 -45 22 -63 -28 265 -20 61 14
4140A4J9k05J48j47J33P1p6k9M2m8O0J01j32J21j27L65n48L17j78j45K18J05O5
$$ 14 33 -172 -24 -171 -38 33 -43 -72 -30 -78 -18 83 -49 72 -55 310 -238 79 -99 -244 -26 79 144
4163A44j96j51K83j91K88o5J15k32Q9p8j72K07L3K12l39J72j9k9j23j23L08j15
$$ 144 -52 -203 80 -111 177 112 227 -5 84 6 -166 41 74 286 -53 119 100 71 -52 -175 133 18
4185A8Q9l3j04L2J3J11m38J21J93oQJ46j92k52Q6l9J61K5lJ65P1j24j83m0J2K70
$$ 18 107 74 -30 2 15 126 -312 -191 2 -4 4 150 -42 -294 -208 -247 -86 -61 -64 101 172 48 -135 -175 -163 107
4211A07k02J51k48L54q8J20m7k30R0j35K98j28j89O5P7lO6O2k68P0q6M18l48K91
$$ 107 -95 56 -192 162 74 194 147 -83 7 -128 170 42 -147 -82 -5 -8 58 120 -148 -78 -164 254 -94 197
4235A97m55K84j3k5J30k14J60m0j51L20j77Q7j34M0J77j79k17J26J89k26K91J41
$$ 197 -258 26 13 -12 118 -96 64 24 -127 193 16 103 -31 9 186 7 -210 -84 105 -121 170 311
4257C11k06k89K14p8RJ19m5J75n2j37j88J66j75Q2O8J18N7k79P2J10l51J60J88
$$ 311 105 -184 30 -48 -39 80 35 210 158 21 -167 -1 -176 -94 -26 92 149 -130 -58 52 -299 -139 49
4280D9j56J36j72K67j19j69J02N1o7Ko6R0K59j84j39J43J33j74J57j68j01n8J53
$$ 49 -107 29 -143 124 5 -164 -62 -11 -78 -76 -142 -52 207 23 -116 27 160 -14 143 -25 -126 -184 -31
4303c1L2j4p9J39l0N5k96r8K31n6Q5J6r0L98j93r3K24j57o6J1o1Q1m8p1J33p3
$$ -31 1 -13 -92 47 17 72 -224 -322 -91 -147 -62 -46 -136 262 69 -24 200 43 -23 -12 -73 8 -40 -111 22 -51
4329e1L3j77K2L39j08j32J6r6J59k42R7J84j59J61j36r5J22k9J31P4O2j47j61
$$ -51 -18 -195 -173 166 58 -74 -58 -154 5 -237 -140 44 -115 46 -90 -185 -63 -92 39 113 175 28 -133
4352a33K1J22j39p7K73j22O1j62J84l27J03K2J21R7j38J2N9k7K64k61P5l50L80
$$ -133 -112 10 -129 -206 67 -55 6 -156 28 -299 -196 -174 -53 44 -94 -82 -23 -50 214 -47 28 -322 58
4375E8J10O2k13L71j75l0l90J77J04m6k48J93K90m33K39j64N5M88n41Q2O9k77
$$ 58 168 230 17 388 213 183 -207 -30 74 28 -220 -27 263 -170 69 -95 -40 448 -93 -11 58 -219
4397b19J50j9o7O5p8J46J59j22j48n1J28lL6J22j11j0K6p6J80o2l00J88J06M4
$$ -219 -69 -88 -155 -90 -168 -22 137 15 -133 -184 -56 -59 -23 99 -12 -22 4 -72 108 46 -254 -66 40 84
4421H4J6j11J11Oj86k35M67o6m2j62oK96k77M51k90k06Q2j16J78J24j59J78p9
$$ 84 100 -11 100 106 -80 -315 152 86 44 -118 -124 172 -105 346 56 -150 -68 -184 -6 118 -41 137 58
4444E8j8J10j93k06K40j03J79j36K81k53M9r5p3L52j1n60L28R2J09k75J05K21
$$ 58 40 150 -43 -249 -9 -112 67 -69 212 -41 8 -87 -160 192 181 -379 -51 41 150 -125 -20 201
4466B01k00KK3N3j01K32k21J99k99M6K18j68J09L2j93J58Q4j02J02j42j09J62
$$ 201 1 3 26 79 -22 210 -11 188 -111 -65 153 -15 94 126 -67 91 175 73 175 33 -76 86
4488H6J64j48K33n24K23Q7k17MJ0L57l32J80L1m2J20l63J33k40K52k88J21l3K50
$$ 86 250 102 335 -189 34 121 -96 -92 -82 275 -57 123 154 112 232 -131 2 -238 14 -274 -153 -186 64
4511F4m5j79K2N2l4M51m96K75o3n2m8n3O0R2r2J54ml53J05j4O6p0M0O8J35k60
$$ 64 19 -160 -138 -86 -120 331 -165 110 47 -5 -53 -106 -46 46 -46 108 104 -249 -144 -158 -92 -162 -122 -54 81 -179
4537a79K90p7J1n8J1K12j52j11o8Q7J4J98l57P7l2p9J89J20k08L65k85j7j27m
$$ -179 111 34 45 -13 -2 210 58 -53 -121 -34 -20 178 -179 -102 -134 -213 -24 96 -112 253 -32 -49 -176 -180
4561a80K24j19K96k84j33J78J04K27r0K15m16R6j06RJ14l70j08K10J97J17n8j1
$$ -180 44 -75 221 -63 -196 -18 86 313 223 438 22 118 12 21 135 -235 -343 -133 64 181 123 112
4583A12p9r5J02j7K3j25K75k32O3J9m6O8n2m6qJ89j11n2j35K91k53K10j08o4M4
$$ 112 33 -62 40 23 46 -79 196 -36 27 46 0 68 16 -30 -38 151 40 -12 -147 144 -109 101 -7 -71 -27
4608b7R4jJ8q0K10kl73R8K24r8j73J07r4N3j48R5j69R6J17o9K7q4J47LK58m9Q
$$ -27 67 66 84 4 214 212 -161 -63 161 63 -110 -3 -97 -44 -192 -97 -266 -170 -53 -122 -95 -179 -32 -29 229 180 188
4635A88Lj22Kj29L71l99m3L36k20J4P6k04L66l68J26k49J28J08N7L60n32J43n
$$ 188 191 69 71 -58 313 -86 -129 207 -13 1 77 -127 239 -129 -3 -252 -124 -16 41 401 -131 12 7
4658Gq2q5J67k77L38m3j95K16k54L06r2l2K26m5j88k17L96j91j19N5J56J61j10
$$ 7 -75 -160 7 -270 68 25 -170 46 -208 98 6 -26 200 155 -33 -250 146 -45 -164 -109 47 208 98
4681I8j29MO7j88n6K71j66J19K02k38K69k88L12l30J32n4j73JN6J36J05l68k5
$$ 98 -31 -27 40 -148 -204 67 -99 20 222 -16 253 -35 277 -53 79 25 -148 -147 -91 45 150 -218 -243
4704b43N38l86L2r8J06J2r2J40J18j42l5K8j26K48J01k68K70o0j62J26l23K54
$$ -243 295 -91 -59 -157 -51 -39 -131 9 127 -15 -50 -22 -148 100 201 -67 203 143 -19 107 -216 38
4726C8l5j87J67k8L5J57m00K91qm3rK40m39J64k8O0p4J72j19j81K04j13k8K76
$$ 38 3 -184 -17 -45 -10 147 -253 38 30 -13 -22 218 -221 -57 -85 -25 -99 73 -46 -227 -23 -136 -164 112
4750A12O4k63R5L3k62L13l8k9n3L6o0kj40J28P5r2J1l3J72r4K12l68J35K05k34
$$ 112 176 -87 8 41 -221 92 54 25 -28 8 -52 -54 -194 -66 9 -83 -72 -105 67 -27 185 -183 -48 157 -77
4775g7qJ9o3n4K95l7n4j58K72k41J39o3J04k8o7m07L98k80R6K19OJ76j97l1pR5
$$ -77 -85 -66 -129 -183 112 75 21 -137 135 -106 33 -30 74 46 -21 -428 -30 -310 -214 5 11 187 -10 -41 -48 47
4801D7q5K13j56J67N2j90j01o4P1j02J53K8l07K10J35n2J66r4r8m1j29J57k05
$$ 47 -38 175 19 186 238 48 -53 -117 -46 -148 5 33 -274 -64 71 19 185 91 -7 -48 -177 -20 -225
4824b25M12j94J62j03j25M7j70J96m9%J42L9j62L0O8j71K20m04L96o6jR1j83L8
$$ -225 187 -7 155 52 -73 -26 -196 0 -49 -49 93 132 -30 0 68 -103 117 -287 109 43 42 133 -50 -12
4848a2P7o4PQj81K68J80k63k9J75l28J32k5J37J0j31j25J56J2P0K7m6j04J08l3
$$ -12 65 1 8 16 -165 103 283 20 -9 166 -162 -30 -55 82 92 -39 -164 -8 4 74 101 55 -49 59 26
4873B6j53K64k39J3j22J22j73M59o5l43J39q5K5l1L39q8j4j77p3Q7K71j78J87
$$ 26 -127 137 -102 -89 -211 -89 -262 197 132 -211 -72 -157 -132 -163 176 88 74 -103 -176 -89 182 4 191
4896A91k76PL81k34O9k48K01k06j16L87k54J5J23j79p3J9J63q8m1kJ43J17Q1n8
$$ 191 -85 -78 303 69 138 -110 91 -115 -231 156 -98 -83 40 -139 -212 -193 -30 -118 -159 -161 -18 99 180 122
4920A22l7P5Kj32l5j47p3M58k95q2K97k97N5l7J77R0j64L36j76k59L06j30k14
$$ 122 85 160 162 30 -5 -152 -225 233 -62 -144 153 -144 -89 -126 51 141 -23 313 137 -122 184 54 -160
4943a60L25o6J05l91J46K1k20J25J28L4P6k68o6j34M53j58J10q8J56P4j23J4m4
$$ -160 165 99 204 -187 -41 -20 -240 -115 13 47 123 -145 -211 -345 108 -50 60 -28 128 202 79 93 49
4966D9K19l48K17l5k04M9j46J02M7J65m7j73Q2N6J94k97k1J80l29kq8L83M2j07
$$ 49 268 -80 137 102 -102 -53 -199 -97 -50 115 68 -105 -23 33 227 -70 -91 89 -240 -242 -330 53 95 -12
4990a2j40L34k79J18l1P0K4k13L34N8K0l09K39j51n7J53j92j3l7Q7j51P6K43l81
$$ -12 -152 182 -97 21 -10 60 84 -129 205 263 283 -26 213 62 5 158 -34 -47 -84 3 -148 -72 171 -210
5014b10K22M7k54NJ92k1P6p8O4J49l72L77p7k37k41J83K37j3j18NJ11M0J22k57
$$ -210 12 59 -195 -190 2 -19 57 -21 43 192 -180 197 120 -117 -358 -175 62 49 -69 -64 47 87 209 -48
5038d8r5L51m64L06q8K1O7p1J66k15J51o6q8OJ24k04M0j71L23j55j42L25j17M6
$$ -48 -143 208 -256 50 -38 -17 50 -21 145 -70 81 15 -73 -67 57 -147 -107 -278 45 -110 -252 73 -44 2
5062BJ85j53J42j82J99O3l98n2R0L22l79J68Q2l13J00p1j5L17q2rj97L71l62Q4
$$ 2 187 34 176 -6 193 256 -142 -194 -104 218 -161 7 89 -224 -124 -195 -210 107 25 16 -181 190 -172 -88
5086h8L37l51N6mK6j81L36k52K18l26K53j29J83q6P7o3k8J22j55J26j49N6J1J73
$$ -88 249 -102 -46 -50 -24 -205 131 -121 97 -229 24 -105 78 -8 69 6 -22 100 -55 71 -78 -22 -11 162
5110A62k93K71k65L05p7m7Q7oo9N7j90k48R0J76l3j8J91j86J18J15j4j11J31K1
$$ 162 -131 140 -125 180 103 56 143 137 68 125 -65 -313 -223 -47 -80 -98 93 -93 25 140 126 15 146 167
5134A67k12o8k44L95k1k72L19j88J16Nl2J59j56P1L8j41k61M61Oj77j07J23n6
$$ 167 -45 -113 -357 38 17 -255 64 -124 -8 -3 -35 124 -32 39 77 -64 -325 136 142 -35 -142 -19 -75
5157g5jJ13k06J86J85j57o8J06N7j3l74M82l50k11K94j21K2j59M23O7j92J11j65
$$ -75 -76 37 -169 17 202 45 -23 83 140 127 -247 235 -115 -326 -32 -153 -131 -290 133 200 8 119 -46
5180d6k41K81R8J0k84k6J24K12j68J09m9j58M02j03l11M1m2L3J41J03k3l3j07
$$ -46 -287 -6 92 102 -182 -208 -84 128 -40 69 20 -138 264 161 -150 -109 -151 -118 23 126 103 70 -37
5203c7Q2J05k18j62K60o0j1q9O4M5J17Ml2j91n1J57p7J78l52L26Q9n2k68K24m1
$$ -37 45 150 -68 -230 30 -30 -41 -130 -66 -21 96 100 68 -123 -174 -17 -94 84 -268 58 147 95 -173 51 10
5228A0j15L24k46K33l96N53j96n8q2J60k77m1M36m82J00m9J38l86K23J54J19k09
$$ 10 -105 219 -27 206 -190 363 167 109 27 187 -90 -131 305 -177 -77 -126 12 -374 -151 3 122 -87
5250h7l8J56Lj13J09J1j14K05o9k57OQ7m6n8R7l1n9Q6j68K35J39j56j02N4J13
$$ -87 -125 31 34 -79 30 41 -73 132 63 -194 -188 -101 -147 -205 -108 -139 -198 -112 -280 -45 94 -62 -164 -110 3
5275Cq5J8M6m3Q4K6r3Q4lj18J39m7R2p0j4r3R1o9j05k58M75oJ05k90KL93j90J40
$$ 3 -82 -64 -18 -61 23 49 -44 40 37 -81 58 11 103 33 19 -74 17 -52 -157 -415 60 54 159 -131 -129 264 74 214
5303B14k71K94l39j2K8M3L2K03k38k5L25n05O6O9J1K99m87L93J8r1OJ36rN2q9
$$ 214 -57 237 -102 -114 -86 -43 -11 192 -46 -71 254 -251 -185 -116 -105 194 -293 100 118 27 33 169 160 212 123
5328A23O6k17k6M8J10j04J67j3j52mp7q9k3K79k34P3J21J8Q8qk20J12Q5q9q2p4
$$ 123 189 -28 -54 -6 104 0 167 154 2 -2 -79 -168 -191 88 -146 -73 48 66 154 146 -74 38 123 34 -48 -122
5354a22J18p2J20mo7R1q8P8k23L06m01J37J30M6j59J85j05LJ23l00K90l1P1k52
$$ -122 -4 -76 44 40 -27 64 -24 54 -169 137 -264 -127 3 49 -110 75 -30 -27 96 -204 86 55 126 -126
5378a26J99R3j83J45j37rJ41lno9O1j42J41k01P9L1k0j68NK42n1N0n9J32l5l0
$$ -126 73 166 -17 128 -9 -18 123 120 115 46 107 -35 106 -95 -16 15 -5 -173 -168 74 23 73 14 146 111 81
5404H1N4j75K57j83L5j1r0j09K17j52R8J77k93p4K35n4K11jj78j20O1N0m2L7j01
$$ 81 135 -40 217 34 69 58 -32 -141 76 -76 22 199 -94 -168 67 13 224 223 45 -75 -14 36 -6 31 -70
5429g0Q3M7p3k24L20j07j48J45P3j92K78l82M08l00J89j11J40m7R5k26J51n8L10
$$ -70 13 60 -13 -237 83 -24 -172 -27 46 -146 132 -250 158 -142 47 -64 76 29 124 -102 49 -9 301
5452C01m91J20KJ23k3Q6j30j02p2M44j96j71J44N8J32l82O4m4j12L89k47J98j48
$$ 301 -190 -70 -68 55 32 118 -12 -114 -186 258 62 -109 35 93 225 -157 -93 -137 -249 140 -107 91 -57
5475e7K5k7k14R7P9L04J32l06j05l2R4J63o1j50j0J29ROj08K11j12j36j20K13
$$ -57 -32 -59 -273 -176 -97 207 339 33 -72 -104 -10 153 92 -58 -68 61 70 76 -32 179 67 -69 -189 24
5499B4J61lml09R3L9j99J54J70j63J24M0j78J27j24K63k23J18r5j43J15j5J31
$$ 24 185 182 178 -131 -38 1 -198 -44 126 -37 87 127 -51 76 -48 215 -8 110 15 -128 -13 -28 103
5522A03n0p2p7J19jq2J88O5j69j5J32J53l62J86j65P2R0q4L3j63J77j49j5O5k1
$$ 103 53 -19 -96 23 22 -60 128 193 24 9 141 294 -68 118 -47 25 115 31 64 -99 78 -71 -86 -21 -42
5547d2Q9q8j57O6K43m5k77M1K24k94L68M6n5l3k09J74j27k47M11n6j88L19k91
$$ -42 47 -41 -198 -132 111 66 -211 -170 54 -240 128 174 119 86 -123 51 -76 -323 88 32 -156 163 -128
5570a28J9J26J97l26K66l83J86J20j69J72j24o8M8L9q9J54L6j72K77j89L3j60
$$ -128 -109 17 214 -112 154 -229 -43 77 -92 80 -44 -112 -64 -25 -114 40 76 -96 181 -8 25 -135
5592a35J54j05J09Q1R1q3k10L3m6J58M7J49j21k23P6q1R0n6k76J58QK91j00j8
$$ -135 19 -86 23 104 195 112 -98 -65 -111 47 94 243 122 -101 -25 -106 -16 -72 -348 -190 -182 109 9 -9
5616iPk29L73j7r9J11p8K2j10m7q1K15j3k19J36j6J09k79J07O8O9j32rm6J32k1
$$ -9 -2 -231 142 125 26 137 59 81 -29 -76 -157 58 45 -174 -38 -54 55 -224 -117 -49 20 -112 -121 -167 -35 -56
5642e6j0l4JJ08Rn9L3N7k38M79j80j15K46k83j34K61p2O3m8K22j40k29n8J78J42
$$ -56 -66 -100 -99 9 18 -41 -8 49 -189 290 110 -5 241 -42 -176 85 13 76 28 250 110 -119 -177 1 143
5667A43l6L7k23K7J79k51M43k23k65J34P6j35J12m2K22k54R5R8j00n9j25J62j05
$$ 143 107 144 -79 -52 127 -124 319 96 -169 -35 41 -94 18 -24 198 -56 39 137 37 -22 -147 15 -90
5690i0K00o3Q7N1k40J25m2Q3j01k53N24p5l15rj28R5K75R3P4m37L32n9k97M58
$$ -90 110 47 134 185 -55 70 28 111 10 -243 281 206 -109 -118 -246 -151 124 217 291 -146 186 127 -170 288
5714B88l56K4O8N9k28K63o9Jr5J11r1q2N8J73j46J50Nj6l15J83K1m3j42J4R4J98
$$ 288 -68 -44 24 83 -145 118 49 50 -45 66 -25 -107 -49 124 -22 128 133 117 -198 -15 6 -37 -179 -165 -71 127
5740A27k33J09L1j26K8J95L0j12j76J20J95o5K6j08j41M6j48K08J4J32j34K3O9
$$ 127 -106 3 34 -92 -64 131 161 49 -127 -7 188 123 149 41 -100 -54 -202 6 20 152 18 41 110
5763A10k18K72k12O6L9k93N38j61K3k82P8J09J61j7k80R7k45J86L3P6j42J26J38
$$ 110 -108 164 -48 18 57 -236 302 141 164 -118 -40 69 230 213 -67 30 -215 -29 4 80 -62 64 202
5786B02j40K24k73k97K98J8J75k71O5P7j75K9Q1J48j21OrR5oQ0j02Nm2l03L24
$$ 202 62 286 13 -284 14 32 207 -64 1 78 -97 -68 13 161 40 46 37 132 126 206 104 109 67 -236 88
5811H8l83L23rK3j6j51K24J01k04M8J03m35J86Q0P9O2J00k49k20K3J96J0o5J2
$$ 88 -295 28 19 42 26 -125 99 200 -4 44 147 -288 -102 -22 57 119 219 -30 -250 -227 -31 -21 -86 -74
5835g4K45n6r7O6J04j78j72J74j65K71j12J37M5k03k15l1K51m4j47K93r7k8Q9
$$ -74 171 115 18 84 188 10 -162 12 -153 118 6 143 188 -15 -230 -261 -10 -54 -201 92 -5 -33 56
5858E6q1J00k34J36M8j8k2K02J13m24K2JK08k4j02J14n8r4j90K74o3j59J76l29
$$ 56 -25 75 -159 -23 25 7 -15 187 300 -124 -102 -101 107 83 -19 95 37 -57 -247 27 -36 -195 -19 -348
5882c48L54O7k0l1K39k76J2K6j2j88K28K08j89j02L19r0m94M34J28k19J18j66
$$ -348 6 73 53 22 261 -15 -3 23 11 -177 51 259 70 -32 287 197 -297 137 265 46 164 -2
5904bK34j66Lk60K76j8M8%k46R7o2L47k26K46j57J09k66J4O9mj21j8Q8j56J28
$$ -2 232 66 69 -191 85 67 115 115 -131 -34 -96 251 25 271 114 223 -43 -29 40 36 -85 -103 -15 -171 -43
5929d3r1j1q1L32l47L08k04o4J84R3p3K05Q8l50R5j2j36K87j49l33R7Q9K47j1
$$ -43 -134 -145 -226 106 -241 67 -137 -201 -17 76 3 208 296 -54 41 29 -107 180 31 -302 -205 -116 131 120
5953A20o4j08k7N7K0L3k77L60k9j41n8J11J86j72J75m44K08j0J68k50J21j6mo4
$$ 120 56 -52 -79 -22 -2 31 -246 114 85 -56 -114 -3 183 11 186 -258 -50 -60 108 -142 -21 -37 -41 -105
5977a05K85p6l48K98j31L4M1K8K7k0Ro4P7q0J23k87L95o1k09J28r4LRJ64J1k90
$$ -105 180 104 -244 54 -77 -43 -2 26 53 33 42 -22 55 -25 98 -189 206 145 -64 64 -30 -27 -18 146 157 -133
6003a33J92m7j57j82M20k4o3k53n8J25K48j69J86n2j38J37K4j06l7Q9J09j00p5
$$ -133 59 12 -145 -327 93 69 6 -247 -305 -180 68 -101 85 33 -105 32 56 -50 -87 2 111 11 -64
6026f4J29j25N0j21L47k82Q1N4p4O3k29J36J47M2k27p9J45j38K09K0J39l28R9
$$ -64 65 -60 -10 -131 216 -66 15 69 -5 58 -171 -35 112 154 -73 -152 -7 -145 64 84 223 -105 -6
6049fj27Q8K20l54K94Pj29J26J20K3j70k67J53RR6m8L4j20J39k09O8j33l0M20
$$ -6 -133 -45 175 -179 115 122 -7 119 239 262 92 -175 -22 -13 83 35 69 -51 88 -121 -53 -186 -216 204
6073B04l79J9L02L4l5j46L6j27K06n5j29J20J21j76L42j59j22J52j12R5o5k10
$$ 204 -175 -156 146 180 145 -1 35 -92 114 59 -70 50 171 -5 337 178 56 208 96 191 126 -84
6095h4J3Jm3J36L24l68O3k89J60o9J04K7mL2j85P4q4K35M3j91k36L87J36j59j85
$$ -84 -71 -70 -113 23 347 -21 42 -247 -87 -156 -52 -25 -29 3 -182 -108 -192 43 86 -105 -341 46 182 23 -162
6120a62L11k1n5l58K22J14R4k25J37j76J9J07J65j2p5j87o2J48o9P5j35J71j42
$$ -162 149 128 73 -285 -63 51 145 -80 57 -119 -100 7 172 160 85 -102 -164 -16 -85 -10 -145 26 -116
6143a16K5J55Mj59p0J8L81m72K70j01K8M1J62j72Q9j05P5p5j42J64J11l0K12j21
$$ -116 -91 64 68 -91 -161 -143 238 -234 36 -65 -37 4 166 -6 83 -22 53 -22 -164 0 111 81 293 172
6167A72K8j28k40J51J46k17mN2L63n27j34N04j54j94K03L9n0R3l60L05l85M55
$$ 172 200 72 -168 -17 129 -88 -92 -40 323 -204 -338 166 12 -182 21 60 10 103 -257 48 -337 118
6189A18K44j32r5J4o4p7J18j38J26j09J80n8j12j01P9p5K65j52N0J15n0j24p3
$$ 118 362 230 135 149 85 8 126 -12 114 5 185 127 15 -86 -7 -82 183 31 81 196 146 22 -51
6212e1L3J84l01L04p9j88J83j61J45k30L52j87K78k86j4J7R9J99k65O7j47J37
$$ -51 -18 166 -135 169 90 -98 85 -76 69 -161 191 4 282 -4 -18 -1 98 297 32 99 -48 89
6234H9M7r8k4l6N3n5j6n0K37q0m9J3O7Qr9j35J25p5J59J42k68J85j31k19K17P0
$$ 89 136 38 14 -22 31 -24 -40 -90 147 67 18 31 98 106 7 -128 -3 -78 81 223 -45 140 9 -210 7 77
6260G7j6q2N2J43K5m83J65j36K32J2k35K80k4j5O4j16l03O09k89J27L2j79K76
$$ 77 61 -21 31 174 199 -284 -119 -255 -23 -11 -246 34 10 -5 59 -57 -360 249 -40 87 119 -60 216
6283B16J7j16j27l2j64K4J77j7J8K14l00J99o0j35m8K63l36L79J27l25M1O8J52
$$ 216 233 117 -10 -42 -206 -182 -5 -22 -4 210 -90 109 49 -86 -134 129 -207 172 299 -26 15 83 235
6306B35n9j52j69n9J27L0J80o2L34j81j96N7k34r6K09j25QJ39m6j47Q8M31j72
$$ 235 176 24 -145 -204 -77 -47 133 71 405 224 28 85 -149 -245 -36 -161 -153 -14 -60 -207 -119 312 140
6329A40l08K30j90r9J93K7j14Q0o6P1J27k58J39q2K02k9K1k62J80l7J16q7O4j57
$$ 140 -168 62 -128 -227 -34 -7 -121 -41 -107 -36 91 -167 -28 -110 92 63 84 -178 2 -35 81 -6 58 -99
6353i9J01k51L59K7L5l03J17k65K79J81j54k3j1k94J52J49r6K07j69l0q2l9M6
$$ -99 2 -249 110 137 172 -131 -14 -279 0 181 27 4 -7 -301 -149 0 -96 111 -58 -88 -170 -209 -163
6376a63P1J55k31J41m2J24j8j04J57j47K52k52N6P4o3%J77l08O9JK45j60J63j59
$$ -163 -92 63 -168 -27 -69 55 37 -67 90 -57 195 -57 -1 73 10 10 187 -121 -52 -51 194 34 197 38
6400C8m4J55j87q0L22j22j20K26j15k14J21K7j21L09q5k08J42J7j79K53J38k10
$$ 38 -6 149 -38 -118 204 82 -38 188 73 -141 -20 7 -114 195 110 -98 44 61 -118 135 273 63
6422F3k64K30k42K08j8P7k48M15j28l20K61j22K26j34JJ98j64M2J48k23J44J48
$$ 63 -201 29 -213 -5 -23 54 -194 221 93 -227 34 -88 138 4 5 203 39 81 229 6 150 298
6444B98k72l59L44j05Q6KM8O8k35K98j06k35nK03r4rJ88k57n6K97l4K1M1p9j7
$$ 298 26 -333 11 -94 -8 -6 42 110 -125 173 67 -168 -173 30 -64 -73 115 -142 -198 99 65 86 127 48 31
6469C1J20k01J14mj10R2m1j23K67k14j25K06K9J06p9k43K7J17K0j16J28j8%j71
$$ 31 151 -50 64 60 -50 42 1 -122 145 -69 -194 12 41 147 68 -175 -148 -31 -11 -127 1 -17 -17 -188
6493a88M27k82K59m8k93O8J77j43J87J06l24K64m01J69m4J9J50k5N0l08R7J59
$$ -188 239 -43 216 168 -125 -57 120 -23 164 270 -54 210 -191 -22 -66 -47 103 78 128 -180 -83 76
6515G6m72K41L2K29%M9k25k67M43j3j26J05K4k32M14l61J38j72L00k21qJ7j67
$$ 76 -396 -155 -123 106 106 155 -70 -337 106 93 -33 72 96 -136 278 -83 55 -117 183 -38 -46 -29 -196
6538a96J94m2K1j61K64j6kj43N3J63O2k38J39r2j11LjJ01j62J43l3j15On6K97
$$ -196 -2 -44 -23 -184 80 64 62 -81 -28 135 197 -41 98 6 -105 -102 -103 -2 -164 -21 -54 -169 -163 -219 78
6563G8j30L40k02k63K83n5R6l40K73k49J04M9K58k69j94P5J26J60p5j04k2K02
$$ 78 -52 288 86 -177 106 51 147 -193 80 -169 -65 -16 242 -27 -221 -146 -20 140 65 -39 -61 141
6585A41K5J72l88MJ31k39J59p9k00J06M3J81l1Q0q3p1o6j13K61m4k00J26K06r8
$$ 141 166 338 -50 -46 85 -154 5 -74 -274 -168 -125 56 25 105 22 -49 -115 -228 33 -11 -211 -85 121 23
6609B3j34J40l6n4J03J09k62L03l27L77j11nj97J09j94q9J40J0J7K37j86j19j17
$$ 23 -111 29 -7 -61 42 151 -111 192 -135 242 131 126 -71 38 -156 -245 -105 -95 -78 159 -27 -146 -263
6632b63J19K01j75K2QM5r9L6J6K9M16j50k07J07K27k20J11l25P0L17k95q1J25
$$ -263 -144 57 -118 -96 -88 -43 -142 -106 -90 -61 355 205 -2 105 332 112 223 -102 -32 285 -10 -91 34
6655C4j90j9K01N5Q8m72J08LM08j93j19M1R4J23j09m7l3M9o5L07k87o3k4K21p1
$$ 34 -156 -175 26 81 169 -303 -195 -192 216 23 -96 -55 39 162 53 6 -27 22 -43 264 -23 -86 -110 111 40
6680D0j96L44k56J00K4j9J93k78Q6j36k07L12L9K6j83K47l11L95k58j52M06k74
$$ 40 -156 188 -68 32 56 37 230 -48 38 -98 -305 7 46 72 -111 136 -175 220 -38 -190 216 -58
6702e8j88J39j03K28o2J6K73l00k1q0J93l4J03k81K50R2j48p4LQ3k0j0N8j9M8
$$ -58 -246 -107 -210 18 -44 -28 245 -55 -76 -156 37 3 106 -175 75 167 19 -55 -52 31 11 1 59 40 88
6727H8k08K87o8j69N5N2Q5m0j4j6RR7k1j81o9R5L5n6J33K09m07j88L87j92K03
$$ 88 -120 167 99 -70 -15 37 122 82 68 52 61 158 137 -44 -113 -18 17 -39 94 303 -104 -292 95 -97 106
6752A06m9j0m2l2J32l20L20k68K17j73j3n2L48j87Q2j80K83j92j96L26j08J55
$$ 106 57 47 5 -27 105 -215 105 -163 54 -119 -132 -184 164 -23 59 -121 162 -30 -226 100 -8 147
6774A47J6k1l17L32J4k07Q3Oq0J80j99OJQ7J18m01L40O8k72J01J60j35o0PK8J37
$$ 147 163 142 -175 157 171 -36 47 53 -27 153 -46 -40 -39 48 166 -235 105 173 -99 2 162 27 -33 -26 2 139
6800A39k60K0l6J70P5r5k1P4K10l81m6J50jJ15j55L7Q2j58Q4J69p3k69J31J37
$$ 139 -121 -101 -137 33 108 13 -8 66 276 -105 -151 -1 -2 113 -42 -5 77 -81 3 172 99 -170 -39 98
6824I8N2J38m1j58j92K23j47J34j16o4J45j95J79k78L16k34J76J35l08J92K19
$$ 98 150 288 247 89 -103 120 -27 107 -9 -73 72 -123 56 -222 94 -140 36 171 -137 55 274
6845B74l25K00j42kk99M37l6R0l82L69j48k77M74k53P6M0k58J03J40k9l5L2k82
$$ 274 -51 149 7 5 -294 143 107 197 -185 184 36 -241 233 -20 56 96 -162 -59 81 52 17 49 -233
6868b33K70j76R2J8Q6o4q7J15K35l88J78k31J85p4K26j34r0L67j51k14q8j46L28
$$ -233 37 -139 -47 -29 57 -7 -94 21 256 -132 46 -185 0 -74 152 18 -72 295 144 -70 -158 -304 24
6891B4l27K39K28k28j56J20J79j89l9J84k7K01o7r8j11O4Ln1Q6j22N5p7L04o7
$$ 24 -303 -64 164 -64 -220 -100 79 -110 -149 35 8 209 142 44 -67 -3 0 -51 35 -87 -32 -109 195 128
6915A28j81j21J22K64l52L39j97m20M10o8J48k7k96N45l78Q5J43n05O18l97L0
$$ 128 -53 -174 -52 212 -140 199 2 -418 -8 -76 72 45 -251 294 -84 1 144 -361 257 -140 -110
6936a10J08L4p5O9k83K45l7J90j86J7j6K64m10K87j35J33l64J86K02k15K65N4
$$ -110 -2 32 -43 26 -257 -12 -49 141 -45 -28 -44 220 -190 97 -38 95 -269 -83 119 -96 169 223
6958B23K1n20L27l6J70j39P8N1l14o6k9L28p9L68k30m9j80K65j00j32J65j2J46
$$ 223 244 -276 51 15 185 46 124 175 -139 -205 -234 94 15 383 153 104 -76 189 89 -43 122 110 256
6981B56k21j08j2J05K71J3l76jJ97j8N0k06q0J79K33l28o4K77l25L29L4k99q6
$$ 256 35 -73 -85 20 291 304 -72 -73 124 106 156 -50 -130 49 282 -46 -110 167 -158 171 205 -94 -180
7004a80K70j78M5J09k51j4J18J4K78m71O7J19J81j85K75l00J12J77j63L19k59
$$ -180 90 -88 -43 66 -185 -199 -81 -67 211 -260 -193 -74 107 -78 197 -103 9 186 23 342 83
7025H3r9K90l86J1J28J05j72L38m38O7K03p3J74j24k24J16J97J77l56j44K41j25
$$ 83 -16 274 -112 -101 27 132 -40 298 -140 -73 130 57 231 107 -117 -1 196 373 17 -127 114 -11
7047a1r3OJ25k79R9R3Q1Ll8k09K96l2m4J1p5J93n6M1k1l18L80m0j60K8M5l5k06
$$ -11 -104 -98 27 -252 -153 -60 21 24 -14 -223 73 41 -3 8 -67 126 70 111 90 -228 152 112 -48 -20 25 -10 -216
7074b16J39jr1L49k16L2PJ6J16j1k67Q3j83K76q2O2J6j14K30J90l77r6l4N8J41
$$ -216 -77 -78 -169 180 -36 -4 3 19 135 124 -143 -60 -243 33 -49 13 29 -85 145 335 -42 -138 -172 -114 27
7099B7J71j42l16N85l18J19j96N2j09J86K0j29j7J09k37J51J22J63l96K32j12
$$ 27 198 56 -260 325 7 126 -70 -18 -127 59 79 -50 -67 42 -195 -44 78 241 -155 77 -35
7120c5n0J17O4j18k5M3l7J28O2k46k8L13k07J89p9n7N2n5j0oo7J53J28j36k60
$$ -35 -85 32 96 -22 -47 -4 -41 87 149 -97 -125 188 -19 170 91 34 86 31 21 15 -52 101 229 93 -167
7145a67K11j90K01l1mj87J49j10M29k61j29l7j7J02J45K11l86O0m5J03n9J21k09
$$ -167 44 -146 55 24 20 -167 -18 -128 301 40 -89 -126 -143 -41 104 315 -71 -11 -56 47 -12 109 -100
7168a00J59j42j34N13k64n5j14L9J65n5L3j97K41j98K6K17k50K66j57j31K28J08
$$ -100 59 -83 -217 296 32 -23 -137 -98 67 12 45 -152 89 -109 -83 134 -116 150 -7 -138 90 198
7190A98j53l6k55J94J39oj55L72J5j98J01k97L24k50J02k99J06M08m07L00k16
$$ 198 45 9 -246 -52 87 81 -74 298 313 115 216 -81 243 -7 95 -204 -98 310 -97 203 -13
7211a3k8P9j22j1N9J09l88J27K13k26M98k99j5P9Ol83K50J09R8o4N9q4J51j54
$$ -13 -41 38 -84 -95 -36 73 -315 -188 25 -201 297 -2 -17 62 68 -315 -65 44 142 78 137 53 204 50
7235E0l60K12o0J81K6m0J16j89r0L7K81k03J15J62k82k8j3K21k65J14J65p7l41
$$ 50 -310 -98 -158 23 49 9 125 -64 -154 -117 164 -39 76 238 -44 -72 -85 136 -129 -15 150 73 -268
7258b68J65K42j04J05l20J08J57o1j24L32o06N12k4k55J14%J23m3o8mm5R7j23
$$ -268 -103 139 35 140 -180 -72 85 24 -100 232 -374 138 114 -141 -27 -27 96 53 -15 -19 -64 33 -90
7281i0J86j62K91m15pJ92j74J22k5J46j7j0P1r7L5R1j21n4Q2q6J33p7n4%r9oP0
$$ -90 96 -66 225 -190 -197 -5 -179 -57 -82 64 47 37 108 11 46 137 16 -38 44 -42 91 14 -40 -40 -139 -145 -75
7308g5J90k00JJ71o0M9j50J08jj24Q7k9J41K18k30m1J94j46j73p6m0J20q2J91
$$ -75 115 -85 -84 87 27 76 -74 34 33 -91 -4 -33 108 326 96 55 249 103 -70 -146 -186 -66 -148 43
7332D3o3M8N3kj90J09K07j31j24MN9q4n2M79l20j84K64k23K07j15J73j17k59k6
$$ 43 -20 28 81 79 -111 -2 205 74 -50 -46 13 -71 -123 356 36 -148 116 -107 100 -15 158 41 -218 -244
7356b44K80l7J94L6l10Q7O2j30l6L15k93Q8j00J99j14K0l12K98M4o4K13k12j15
$$ -244 36 -1 193 229 -81 6 68 -62 -98 217 -76 12 -88 111 -3 17 -295 3 47 -17 196 -16 -131
7379a31j3N8J61j48J04J79j76J7j01k6J30l5p9m9M0K12j05k59L99j72J41k06j53
$$ -131 -144 -86 75 -73 31 210 34 51 -50 -76 54 19 -60 -109 -69 143 38 -221 178 6 147 -59 -212
7402b12L23j45j56J42L6j24K60j40O7j35K01k12J25j86M19m14L38L4l39J49j0
$$ -212 111 -34 -190 -48 -12 -136 124 -16 51 -84 117 -95 30 -156 263 -151 187 221 -118 31 21
7423B1l7l0J23n5K50m85J36Qq7K14k02K46k17K37j51m13P12k22k58K80k05K08
$$ 21 -16 -46 77 22 272 -213 -77 -69 -156 58 -144 102 -115 122 -29 -442 270 48 -210 70 -135 73
7445G3j17j10L01M3k12j59J58r7k0K10l07Q4J53J12q2p4R9m2Q5l0Q6j46J17J5
$$ 73 -44 -154 147 190 -22 -181 -23 -120 -140 70 -237 -153 0 112 30 -44 55 13 98 68 154 8 125 140
7469A40j69j87J13P1J59j54j54L55l76J13j11K89k42J04P0j87J03K08r8K01k73
$$ 140 -29 -216 -103 -32 127 -27 -181 174 -202 -89 -200 89 -153 -49 21 -166 -63 145 47 248 -25
7490b5q3J55K30k72L8j37R7j9J7L5Kj71O7Q3k5j29J14j61J94k8m6K30k86M8J02
$$ -25 -108 47 277 5 43 -94 3 -16 1 36 38 -133 -66 17 -8 -137 -23 -184 10 -18 -64 166 -120 -72 30
7515C0k3J07j87k51L88j03J21k85J12L41k4l44K34L8l01J09l1L8N6m3j96K75k85
$$ 30 7 114 -73 -324 64 -39 82 -203 -91 250 226 -118 116 154 -147 -38 -69 -31 25 -18 -214 61 -224
7538b24K44Q9m6k87MM38j73j26m3K52O4j37n3O3n6Q0j84M23l09mj01j7J78o8k06
$$ -224 20 109 63 -224 -220 218 45 -81 -124 128 192 55 2 65 9 89 -95 328 19 15 -86 -103 75 7 -199
7563a99J55J82r8j83J2J93K4j12p8J41n5m7O0q7P0K07m44K46O1j15L4j28L21m13
$$ -199 -44 138 40 -143 -131 62 86 -26 -104 37 -18 -65 -5 -92 -22 185 -259 -13 48 -67 -33 -161 160 -253
7587b53K43N1j29rJ99j12J03L4k78n3J13J79o8P9j61l5P9M5L4j14j6Q1l8j21K83
$$ -253 -10 41 -88 -97 102 -10 93 127 -151 -204 -91 88 20 99 -62 -97 -18 27 61 -53 -69 12 -26 -147 136
7612A36J3j50nJ24r4j37J3J56j32K16k52p2R7J83K4j59j5K4o1J47p3l6R2m1O5
$$ 136 149 -1 -6 118 24 -113 -100 56 -76 140 -112 -184 -87 96 120 -39 -54 -30 -91 56 -17 -53 39 -2 63
7637F3j0k15J46p3K4K7K05j96j9J79j71J33mm4K61k11k06j22M2K82l00J34n5J63
$$ 63 53 -162 -16 -89 -65 -38 167 -29 -48 131 -40 93 89 45 306 95 -111 -233 -191 91 -209 -75 -130 33
7661C3j65J91l5M2j02NJ36j30K7M5j21J44J25k80K22j91j38K43j57LL03k83L5
$$ 33 -132 59 24 66 -36 -31 105 -25 2 47 -74 70 195 -85 137 -54 -192 51 -106 -103 200 -83 -48
7684d8K14j48J33k02Q5k82M43j83k91K73L60l25k64J74K03j52J37pj49K20j76
$$ -48 166 18 151 -51 34 -248 195 12 -279 -6 354 29 -235 -61 142 -10 127 120 -29 191 15
7705A5k01K03q1j31J69pj6j9J49j47J84j72j05J56Q9k09J11k4L1J21j25N0q7J36
$$ 15 -186 17 -64 -195 -26 -33 -49 -68 81 -66 118 -54 -159 -3 86 -123 -12 -36 -5 116 -9 41 -46 90
7729I0q2O4k8k25J86n8J99l69K65n4lJ77j07j32J03j42m0J55n8K00l63m7J44j04
$$ 90 8 72 44 -181 5 -53 146 -223 42 -12 -15 162 55 -77 26 -116 -156 -1 -59 141 -222 -269 -125 -229
7753b29K93k8K4M9p5l5J6K17k18K0j70J97J21j98K53k67J54j18Q8k0k38j17L14
$$ -229 64 36 60 109 34 -1 15 232 14 34 -136 61 182 -16 237 -30 124 6 94 74 -164 -281 33
7776C3j45J7j17J35L58m03rQ4r7L08l03J69j45K62j14j18J65J5j5r0m7K33r5O8
$$ 33 -112 -95 -212 -77 281 -122 -131 -47 -144 164 -139 30 -115 147 33 -85 80 95 80 -10 -57 176 81 149
7800A49k50K89j97l04J81o7L14k49J93p8J30k60L17n7l6r0R9r1O0J08l12K04R5
$$ 149 -101 188 -9 -313 -132 -199 115 -134 59 -19 111 -149 168 111 75 -15 84 -7 53 161 -151 53 148
7823A48j32L8mJR7l6J4j94K61k31R1O0n2j32Q9j69K32k16q4K63p9j0N5K01l69
$$ 148 16 54 50 51 148 112 126 -68 193 -38 53 113 61 -71 18 -151 81 -135 -219 44 -35 -45 10 211 -158
7848a58j10M55l26P0J97r4k0rk8J93pk26J32k09K91k36K73K1k38j73L09P0l16
$$ -158 -268 187 -139 -69 128 34 14 5 -23 170 163 -63 69 -140 151 -85 188 209 -29 -202 107 177 -139
7871a39R7K7j14J9N9J51pp9j62K33Oj14lKM2k57K59j49R2J03j41K58J33m24k0
$$ -139 -42 -15 -129 -110 -51 100 93 14 -148 85 91 -23 -26 -24 18 -239 20 -129 -37 66 -75 183 316 -108 -128
7896a28l0L08mq2O2j5j40q9J13J94j89p2j5k58K01K7kJ11KM9K6Mr8k35L20O7j6
$$ -128 -158 150 146 64 126 111 -29 -118 -5 189 0 -72 -87 -345 -144 -117 -119 -8 -6 43 69 73 -25 -260 60 127 111
7923A11j65J29ML8j77Nj42L59K05m32O8j08J98k80M42l13Q2K36l52k19J54M68
$$ 111 -54 75 79 117 -60 -55 -197 162 367 -65 3 -105 93 -187 255 -58 24 260 -92 -311 -157 311
7945C11k88O7J34j12j31O8j49K97j61q3j61K90k34nM46l22J93j45r9j86K28L74
$$ 311 23 90 224 112 -19 49 -100 197 36 -47 -208 82 -152 -157 289 -33 160 15 -84 -270 -42 332
7967C32n00J86l02L36J35j52q9K83k50J1L9j20J73m1j77l5J95k5J23J4P7j66L7
$$ 332 -168 18 -284 52 187 35 -54 229 -21 -10 29 -91 82 41 -136 -171 24 -1 122 136 213 47 84
7990H4r8J13M1q8M6k07J09L3j83L8q1K91q8k09K49L8p8p9j54K50q5L8j05p6mK01
$$ 84 -14 99 140 52 98 -109 0 33 -150 -112 -193 98 10 -199 50 88 10 -69 -223 27 -58 -20 -125 -201 -205 -4
8016dK38l71J71n2o6j26J32K15j78L02j77O0j13l55K99j8J86j45j8O9j11j2J58
$$ -4 234 -137 34 -18 -84 -210 -78 137 -41 261 84 144 31 -324 -25 -43 143 -2 -20 49 -62 -74 84
8039H4J17l19J07K2j56J28r0K17rk03J93j92K86k58k9K6P0L1M1j58r1J93k12R4
$$ 84 201 -118 -11 11 -145 -17 -107 110 101 -102 91 -101 185 -73 -102 -76 -6 25 66 -92 -183 10 -202 -108
8063a08J60j30J68k38J43M0J26j24j54L32k66R5mO8m2j59K79m0l36J26N0q0K72
$$ -108 52 -78 90 -148 -5 35 161 37 -117 215 -51 44 40 108 66 -93 186 146 -190 -64 -14 -94 178
8086A78k29k65L44K8q0q1K77j29q6L88m81Q2k06L06L9n1Pr8N9q1JL6Q8R9Q3k32
$$ 178 -51 -316 28 56 -24 -105 172 43 -43 345 -136 -54 -260 46 85 34 41 -57 2 -79 -78 -42 46 145 228 -4
8112dJ94k74J06P3j27K4j01K23k61M7J22l4Q1j71N6R2rj44K84Lk43K77m71K7M47
$$ -4 190 -84 22 95 -32 -8 -109 114 -147 -100 22 -12 69 -102 -46 46 37 -107 177 180 -63 214 -257 -230 217
8137B17l79P4J48o6j03K3j4K72K6j48j49PK57l28J19K42j99kJ73Nl39L2K0q8K8
$$ 217 -162 -88 60 -6 -109 -86 -100 172 198 50 -99 -92 165 -163 -44 198 -1 -3 170 175 -164 -132 -112 -200 -172
8162a72K25n4Q9j03L05j96M2j02n7o7L8K08l12k8M22j82l31L34J35l73L20k73
$$ -172 53 -1 88 -15 290 94 136 34 -23 -90 -52 156 -156 -184 238 56 -275 59 194 -179 141 -132
8184a32P7R5R7j28j08l2j0
$$ -132 -55 40 137 9 -99 -131 -141
8191a41
$$ Imaginary data points
##PAGE= N=2
##DATA TABLE= (X++(I..I)), XYDATA
0@%%%%%%%%%%%%%%Kj0J6j6J6j6K4l2L3m1M8n6P2q0Q8j04J20j36J52j72J96k21
$$ 0 0 0 0 0 0 0 0 0 0 0 0 0 0 0 2 -8 8 -8 8 -8 16 -16 17 -24 24 -32 40 -40 48 -56 64 -72 80 -92 104 -117
36a17K48k77L10l47L87m30M76n27N83o44P10p84Q65r50J047j156J273j405J553
$$ -117 131 -146 164 -183 204 -226 250 -277 306 -338 372 -412 453 -497 550 -606 667 -738 815
55H15j719J908k125K378k678L037l476M032m759N753p197R499j3737K4026r3554
$$ 815 -904 1004 -1121 1257 -1421 1616 -1860 2172 -2587 3166 -4031 5468 -8269 15757 -77797
70g7797j18369J80424J8640n0149J00003O5202r2992O947N7587l4524j0244K0638
$$ -77797 -196166 -15742 2898 -47251 52752 117954 24962 31909 89496 54972 44728 65366
82F5366r9703n1146R0279K1967l7836P1686J3362j18417k0777N7897m4946j2123
$$ 65366 -34337 -85483 4796 26763 -11073 60613 73975 -44442 -65219 -7322 -52268 -64391
94f4391P3622l8553p6426P9554O5209n1654K0986N5849p4754n2848O8237K3930
$$ -64391 9231 -29322 -105748 -26194 39015 -12639 8347 64196 -10558 -63406 4831 28761
106B8761j5383M7751j829o7719K1106M1368m9394p802M8093m7482n7794N2506
$$ 28761 13378 61129 59300 -8419 12687 54055 4661 -3141 44952 -2530 -60324 -7818
118g818L0562l0548K0738O986o5956o992M2463k4761n902O1409j2675n3892M4447
$$ -7818 22744 -7804 12934 19920 -46036 -53028 -10565 -35326 -41228 20181 7506 -46386 -1939
131a939M7406l7681m888L0377l5977k8426M1295J2978j6459K7192M866m4507K750
$$ -1939 45467 7786 2898 33275 -2702 -31128 10167 23145 6686 33878 38744 -5763 -3013
144c013K7903k4602j5000K0471j7422k4467K9251J4833j9095J3860R418l9671
$$ -3013 24890 288 -14712 5759 -11663 -36130 -6879 7954 -11141 2719 12137 -27534
156b7534o458L6373n670j6957K7358O746k5615J2411K4027j4372o510J0226j7599
$$ -27534 -33992 2381 -3289 -20246 7112 13858 -11757 654 24681 10309 3799 14025 -3574
169c574j0332K4192N675j3278J0790L379k2938j186J2081j2118o001J2056q386
$$ -3574 -13906 10286 15961 2683 13473 16852 -6086 -7272 4809 -7309 -13310 -1254 -9640
182i640r978K0195R145j4067L971P103j7285o482J5255J823m012J0165K158o772
$$ -9640 -19618 577 9722 -4345 -374 6729 -10556 -17038 -1783 40 -3972 6193 8351 1579
196A579Q534O387j2064k209M131j0919n776J1632K793m098O054J17r705R57L511
$$ 1579 10113 16500 4436 2227 6358 -4561 -10337 1295 4088 -10 6044 6161 -3544 -2587 924
211I24r294k710O964k616l430R862N694k309J704k20o462R10K651m160P23Q613
$$ 924 -8370 -11080 -4116 -6732 -10162 -300 5394 3085 4789 4569 -1893 -983 1668 -2492 -1769 6844
227F844j607m119O256K071p200k370k43n106j048L278q40Q72N502n24m233K103
$$ 6844 5237 1118 7374 9445 2245 -125 -368 -5474 -6522 -3244 -4084 -3212 2290 1766 -2467 -364
243c64O08m771l60J527o08K421M293O3M36L513j786n142L57J293l204l87L234
$$ -364 244 -4527 -4887 -3360 -3968 -1547 2746 2809 3245 6758 4972 -170 187 1480 -1724 -2111 1123
260A123J033L61J435j563j809O00l078m057J529K366j471L15L936J105j255k75
$$ 1123 2156 2517 3952 2389 580 1180 -1898 -5955 -4426 -2060 -3531 -3216 720 1825 570 295
276B95j009r12P89j056j003L180L280j236jK486o42l835m70P13j812O0J553k8
$$ 295 -714 -1626 -837 -1893 -2896 284 3564 2328 2327 4813 4171 336 -134 579 -1233 -1173 380 352
294C52L40J261j058k115q24o9j534n29J344J660J309P03N8P21J65j354j948L26
$$ 352 692 1953 895 -1220 -2044 -2113 -3647 -4176 -2832 -1172 137 840 898 1619 1784 430 -1518 -1192
312a192J711o44O4K744J899j146j532k34l94k365j516J55J087M85j02P10Q58J20
$$ -1192 519 -125 -61 2683 4582 3436 1904 1670 1276 -1089 -2605 -2450 -1363 -878 -980 -270 588 708
330G08j433j475p87J37K45M0J807K114J291k23L0N10q37j880j14K83j89P05R59
$$ 708 -725 -2200 -2987 -2850 -2605 -2565 -758 1356 2647 2424 2454 2964 2127 247 133 416 227 932 1891
349A891L74K89o1k097k212n30m94r97k49K007J238R04J210q38K10M01k061j802
$$ 1891 2265 2554 2493 396 -1816 -2346 -2840 -3837 -4086 -2079 -841 63 1273 435 645 1046 -1015 -2817
367b817J865J997j853P96M194Rk554L48J07k821q29O39j172O94K129m09k26J579
$$ -2817 -952 1045 -808 -12 4182 4191 1637 1985 2092 -729 -1558 -919 -2091 -1397 732 323 97 1676
385A676p44l084j60N61j551J716J563r52J751L443k250k289K632q98n222J112
$$ 1676 932 -2152 -2312 -1751 -3302 -1586 -23 -975 776 4219 1969 -320 2312 1414 -3808 -2696
401b696M211j784o87M115q02k365J696r26l871J090J594k881J229M462r91j445
$$ -2696 1515 -269 -956 3159 2357 -8 1688 762 -3109 -2019 -425 -3306 -2077 2385 1394 -51
417e1L102k107l327K460O4m031L096M164m454l95O542k099n976K831J255n561
$$ -51 3051 944 -2383 77 141 -3890 -794 3370 -1084 -1479 5063 2964 -3012 -181 1074 -4487
433d487J074N040k479N46M940l144l332M158k83o176K056L511m003R89N446j652
$$ -4487 -3413 1627 -852 -306 4634 1490 -1842 2316 2033 -4143 -2087 1424 -2579 -1590 3856 2204
449B204j616L243l661n251M946J844o881K343P481m347k988O728m58o095J960
$$ 2204 588 3831 170 -5081 -135 1709 -5172 -2829 4652 305 -2683 4045 3587 -2508 -548
464e48N84m753K600M953l696N46O599l772n508M959R96p040J763L765m348J225
$$ -548 36 -4717 -2117 2836 -860 -314 6285 2513 -2995 1964 2960 -4080 -2317 1448 -2900 -1675
480a675O662l644l166N526j699q090M210M488o157k6O971k248k315M897j856m632
$$ -1675 4987 1343 -1823 3703 2004 -6086 -1876 2612 -3545 -3571 3400 1152 -1163 3734 1878 -2754
496b754L967o9p344L085P614n034k194P332j193o671M222J966n943J257M000m766
$$ -2754 1213 1144 -6200 -3115 4499 -535 -2729 4603 3410 -3261 961 2927 -3016 -1759 2241 -2525
512b525Q72P725l445n717N847O97q099K594M373n824K45O202l870j823O465j955
$$ -2525 -1653 6072 2627 -3090 2757 3454 -4645 -2051 2322 -3502 -3257 2945 -925 -2748 3717 1762
528A762o765M915L019q416J804Q839m174l549O777r07n745M563J853o822J521
$$ 1762 -5003 -88 2931 -5485 -3681 5158 984 -2565 4212 3305 -2440 2123 3976 -2846 -1325
543a325M606m544l10O422l161m474M534r17n865L363K313n583J899O253m715k300
$$ -1325 3281 -1263 -1573 4849 1688 -2786 1748 831 -5034 -1671 642 -4941 -3042 3211 -1504 -3804
559c804P197j356o077L840K638n404K000N489k962j159M057j780l269L615q07
$$ -3804 3393 2037 -4040 -200 2438 -2966 -966 4523 1561 402 4459 2679 -590 3025 2218
574B218n137K208K177l665J228L947m013j454M432l260m309M380J072m775L301
$$ 2218 -2919 -711 1466 -2199 -971 2976 -1037 -2491 1941 -1319 -5628 -1248 -176 -4951 -1650
589a650M721l801n27M864j520l417K713j28l086K385K047k038J378K054k831n85
$$ -1650 3071 -730 -1257 3607 2087 -1330 1383 1255 -1831 554 2601 563 1941 3995 1164 579
605E79J576l173k735L159K39l037K726K353l186J74L077k535l071K642j99j766
$$ 579 2155 -1018 -3753 -594 -355 -3392 -666 1687 -1499 -1325 1752 -783 -3854 -1212 -1411 -3177
621c177L430J775k142J548K241k793r28K034k025j734L007m86j607L206R03l257
$$ -3177 253 2028 -114 1434 3675 882 -46 1988 -37 -1771 1236 750 -857 2349 3252 -5
637eM37J312l983j644L738n82k498K946J660k743Q31K236k659j542K567j246q35
$$ -5 432 1744 -2239 -3883 -145 -727 -3225 -279 1381 -1362 -531 1705 -954 -2496 71 -1175 -2010
654b010L350O75j895K225R42l236j24K296k703j514L365p82k642L112J897l754
$$ -2010 1340 2015 120 2345 3287 51 -73 2223 -480 -1994 1371 589 -2053 1059 2956 -798
670g98k97K032l127j220L732o50k306K720J598k686R92K579l655p68L283j444
$$ -798 -1095 937 -2190 -3410 322 -328 -2634 86 1684 -1002 -10 2569 -1086 -1854 1429 -15
686a5j734L381P62k680J590J465l426r46L261k405j822L393j53k718K347J834
$$ -15 -1749 1632 2394 -286 1304 2769 -657 -1603 1658 -747 -2569 824 671 -2047 300 2134
702B134l506o32K745k158j549L829j52k314K852J333l141J102J639k961r85L483
$$ 2134 -1372 -2004 741 -1417 -2966 863 711 -1603 1249 2582 -559 543 2182 -779 -1764 1719
718A719j410j936L579N68l261J184J653l055j097K102r14j493K793M94k252K247
$$ 1719 309 -1627 1952 2520 -741 443 2096 -959 -2056 46 -868 -2361 432 926 -1326 921
734I21R08k904k27J960k158p86L023j86j650K578Q96k248J77J376k668r42K495
$$ 921 1829 -1075 -1302 658 -1500 -2286 737 551 -1099 1479 2375 127 304 1680 -988 -1930 565
751E65m17j488K292Q39j627M03Q40j938j014J054q34l85J472P55j044J488M76
$$ 565 148 -1340 952 1791 164 567 1407 -531 -1545 -491 -1325 -1710 -238 517 -527 961 1437
768A437j376p83Q79j240l99J113M55k47Q90P73o20m66O08r14j008O44k7j65O14
$$ 1437 61 -722 157 -1083 -1482 -369 86 -161 729 1502 882 416 1024 110 -898 -254 -281 -446 168
787A68J106p84J67o3q21r76K12l49k18J129L44M7K95M47n74l02N6n30l06N43N49
$$ 168 1274 490 657 594 -227 -1203 -991 -1340 -1558 -429 -85 -38 257 704 130 -172 -116 -646 -952 -409 140
808A40J57J109K98m07p44L7l88r08K38L38K06j41L48J06l41m27j91n17lj94K80
$$ 140 297 1406 1704 1297 553 590 202 -706 -468 -130 76 -65 283 389 48 -379 -570 -1087 -1090 -1284 -1004
829a004Q31M60l25K93N90m01n97k43O23m68L87N48J71q2O3j89m85m72J8l07q0
$$ -1004 -173 287 -38 255 845 444 -153 -396 227 -241 146 694 865 783 846 657 172 -300 -282 -589 -669
850f69K12M64L29k18l40K31l11o69J54M08J46l49Q08P25m25m37L54n7r80r8M51
$$ -669 -457 7 336 118 -222 9 -302 -971 -817 -409 -263 -612 196 921 496 59 413 356 -624 -722 -271
871b71j26O05O19Rj87j13m31j35m26l65J59O47j08J26J013l8r31o63Q19q01m46
$$ -271 -397 208 827 836 649 536 105 -30 -456 -821 -662 -15 -123 3 1016 978 47 -616 203 -598 -1044
892a044P95L74l92L74M54lj72J20n62m37Q6J12Q7N63J27r0K83k07p04K85L7q37
$$ -1044 -249 125 -267 107 561 558 386 506 -56 -493 -407 -295 -208 355 482 392 675 468 -236 49 86 -751
914g51J39K90J0k04J039K40p02l28L90r38qO61k06n3K88M74Q6O16r1p12j51m17
$$ -751 -612 -322 -312 -516 523 763 61 -267 123 -815 -823 -162 -368 -421 -133 341 427 1043 952 240 89 -328
936c28l74P45O60n56k21J097o55r66O15N14j346k17M99l02K54J078K03n88J13
$$ -328 -702 43 703 147 -74 1023 368 -598 17 531 -815 -1032 -533 -835 -581 497 700 112 225
955B25m79n29P15O60j207L42N91l04N2J502n20j359L21j7j210P76J078q29l95
$$ 225 -254 -783 -68 592 -615 -273 318 14 66 1568 1048 -311 10 -7 -1217 -441 637 -192 -587
974e87Q97n25q07J414J44j501L7M86o51O01K124p65j006Q31k96j094J376M72j581
$$ -587 310 -215 -1022 392 536 -965 -928 -442 -1093 -492 1632 867 -139 692 396 -698 678 1150 -431
993d31j34J553j199k47K448n53k306N19N60j924R17J974j064j083J320q47p60
$$ -431 -565 988 -211 -458 1990 1437 -869 -350 210 -1714 -797 1177 113 -970 350 -497 -1257
1010a257J548N83k290K06J456j357N82K829r34j963J199K7j306J080J708k873
$$ -1257 291 874 -1416 -1210 246 -1111 -529 2300 1366 -597 602 629 -677 403 2111 -762
1026g62m87K567j239j291L044j54l327O71J366k343M66L057j520j719K399n67
$$ -762 -1249 1318 79 -1212 1832 1678 -1649 -978 388 -1955 -1489 1568 48 -1671 728 161
1042A61k350K980J293l645l4K669j893J88L479j230l132J912J066l248J584K680
$$ 161 -2189 791 2084 -1561 -1595 1074 -819 -631 2848 1618 -1514 398 1464 -1784 -200 2480
1058B480k959r59K774r81j984L138j75l247Q64J741k580M35L910k319k011K772
$$ 2480 -479 -1438 1336 355 -1629 1509 1334 -1913 -1049 692 -1888 -1453 2457 138 -1873 899
1074H99l58k400K394J499l432r1K722j220n14L029j018k932J863R58k797Q79K292
$$ 899 541 -1859 535 2034 -1398 -1489 1233 13 -501 2528 1510 -1422 441 1399 -1398 -519 1773
1091A773k688n87K698r04j920K592k0k740J051J654k525P17K972j461j868K190
$$ 1773 -915 -1502 1196 292 -1628 964 944 -1796 -745 909 -1616 -899 2073 612 -1256 934
1107I34O4k347J767J432l098J92K377j315m69K061o05k155J206P32k029M53J826
$$ 934 998 -1349 418 1850 -1248 -1056 1321 6 -463 1598 993 -1162 44 776 -1253 -800 1026
1124A026j565q02K180o98j300K025L12k630M27J519j134l5J862l77j920J800O25
$$ 1026 -539 -1341 839 141 -1159 866 1178 -1452 -1025 494 -640 -675 1187 810 -1110 690 1315
1141A315j817O80J020j962o1J392l03p16J234J84j522N54O34j482j65J652j249
$$ 1315 -502 178 1198 -764 -825 567 264 -452 782 966 -556 -2 632 -850 -1015 637 -612
1158f12n62J713l24r92J040N85j452j06R57p30l31J647j93j006Q33R22j228m17
$$ -612 -1174 539 215 -777 263 848 -604 -710 247 -483 -814 833 640 -366 467 1389 161 -256
1176b56Q45o00n86J113n18m90R94J52j238L91M37j385L8J234j89p73P71L67n48
$$ -256 589 -11 -597 516 -2 -492 502 654 -584 -193 244 -1141 -1103 131 -58 -831 -60 307 -241
1195b41J34N76j071J99O90k90l18J117k54o70R03P7j110M3P31r10J00Q45l75m74
$$ -241 -107 469 -602 -403 287 -3 -321 796 542 -128 775 852 -258 -215 516 -394 -294 551 176 -298
1215b98P14j25r24K21J86o47J88N72Jo4P43j66n53L34J21n30K88M65p76M69O77
$$ -298 416 291 -633 -412 -226 -873 -685 -113 -112 -176 567 401 -152 182 303 -227 61 526 -250 219 896
1236H96n86J18L08m48q44K26L66n81L36L92l88j86N62O8o77L09j97m06M48L26
$$ 896 310 428 736 288 -556 -330 36 -545 -209 183 -205 -391 171 239 -438 -129 -326 -732 -284 42
1256D2j57N59J50l44j2K12m90k99J20M07j75K46K18k72R0j4k33m92M74l08k02
$$ 42 -115 444 594 250 238 450 -40 -339 -219 188 13 259 477 205 295 281 48 -444 30 -278 -480
1277d80J05L44j58L3K37P7m22J03r9j87M43K39j25J04J92j92r1L24m56j21N1K20
$$ -480 -375 -31 -189 -156 81 158 -264 -161 -260 -447 -4 235 110 214 406 214 123 447 -9 -130 -79 141
1299A41O7k77L95k48R2j06k33j00j00k03K2L25k7K97R3J6m89K16n1m8J61r8K10
$$ 141 208 -69 326 78 170 64 -169 -269 -369 -572 -550 -225 -252 45 138 154 -335 -119 -170 -218 -57 -155 55
1322E5K51l55N40k28J68k45r4L7J32j42j56R3o8K41j92j99j62P8k7k43K2K98O0
$$ 55 306 -49 491 263 431 186 92 129 261 119 -37 56 -12 229 37 -162 -324 -246 -273 -516 -494 -196 -136
1345a36n6K49L08j21j48N4j42q0K26j38K01P0j6J25l36K91k31j68j14l08M61j36
$$ -136 -192 57 365 244 96 150 8 -72 154 16 217 287 271 396 60 351 120 -48 -162 -470 -9 -145
1367a45J10k6J44l0k37j6j01j37O8P8K69N5Jk1K7K9n5k07J98J3O8j82M64O0l11
$$ -145 -35 -61 83 53 -184 -200 -301 -438 -370 -292 -23 32 33 12 39 68 13 -194 4 17 85 -97 367 427 116
1392A16r7O8l47mK4o2K0M73q0k46K53j3J5m44J54L37l40J37L20j59K19J69l87
$$ 116 19 87 -260 -264 -240 -302 -282 191 111 -135 118 105 120 -324 -170 167 -173 -36 284 125 344 513 126
1415A26j77k15J46j07J26J1K20P4l7p4k83Lm10J4N10j25k26O62j28K0j47l0o4
$$ 126 -51 -266 -120 -227 -101 -90 130 204 167 93 -190 -187 -597 -583 -73 -198 -424 238 110 130 -17 -47 -111
1438a11k91L94j81M59p0J13L1o5p3rj23P4l46M6K56k50j06O26k22k77j9L71m41
$$ -111 -402 -8 -189 270 200 313 344 279 206 197 74 148 -198 -152 104 -146 -252 374 152 -125 -144 227 -214
1461b14j49J83j47n1L54J52j72K19j62k07q9N48k56o5J85O3J23j57R3n61J79L04
$$ -214 -363 -180 -327 -378 -24 128 -44 175 13 -194 -283 265 9 -56 129 192 315 158 251 -310 -131 173
1483A73l73K38K53l81p4J92k5j63j53L20Q1j54k23K61q4J23N35m46j05K51j94
$$ 173 -200 38 291 -90 -164 28 3 -160 -313 7 88 -66 -289 -28 -112 11 546 100 -5 246 52
1504E2r2J20R7j50n9J03r6N9L02n02n7K96k01j59K5M73k02j75L88r7n5k48L90
$$ 52 -40 80 177 27 -32 71 -25 34 336 -166 -223 73 -128 -287 -262 211 9 -166 222 125 70 -178 212
1527B12m13r2N35n57L94M24l54k67L03jk12J42j55l26J51M84j55N4K18l18l54
$$ 212 -201 -293 242 -315 79 503 149 -118 185 184 -28 114 -41 -367 -216 268 113 167 385 67 -287
1548b87K66Q5k72J07L05o7m9L0j0j00LJ97p48M16J01j3r4L17k75j59M06j29K53
$$ -287 -21 64 -208 -101 204 137 88 118 108 8 11 208 -540 -124 -23 -36 -130 187 -88 -247 159 30 283
1571B83r7n89K69j07N47j48j03l46L09k05j0J7J57N7RL17k67k33J54J06j12m8
$$ 283 186 -403 -134 -241 306 158 55 -291 18 -187 -197 -180 -23 34 43 360 93 -140 14 120 8 -40
1593d0k5j00J58J13J80l43RN9l85K79L80n65k47O24j38J31K07j06m01J79J42n27
$$ -40 -65 -165 -7 106 286 -57 -48 11 -374 -95 285 -280 -527 97 -41 90 297 191 -210 -31 111 -416
1615d16K66L98j04l5J97p7m13M27J23l59k73L51k75l2O88l96k70K23Lp10Q67r8
$$ -416 -150 248 144 109 306 229 -184 243 366 7 -266 85 -190 -222 466 70 -200 23 26 -684 183 85
1637H5m70P1O97j19m89N53m65j69L51L49n54J41M10p53N52J39m44j49L42M5q22
$$ 85 -385 -314 383 264 -225 328 -137 -306 45 394 -160 -19 391 -362 190 329 -115 -264 78 123 -699
1658f99O80J86l50OM14k1o34O83k18k21K66J36n62M12K27k69j86K82j96k07O07
$$ -699 -19 167 -183 -177 237 216 -418 265 47 -174 92 228 -334 78 305 36 -150 132 -64 -271 336
1679C36j14l88K7P19n00j67J36O8k73N0J54p6k28R1j43K94K68n5k87PQ0j12p1
$$ 336 222 -166 -139 580 80 -87 49 117 -156 -106 48 -28 -256 -165 -308 -14 254 199 -88 -81 -1 -113 -184
1702a84L78j33M6p9J47j82rK83m56J15P6j64M2k4J03j20L4mm2K60j0j22m92N69
$$ -184 194 61 107 28 175 -7 -16 267 -189 -74 2 -162 -120 -144 -41 -161 -127 -131 -173 87 77 -45 -537 32
1726C2%J71k01J92o9m2J26l66R2K27j07k59L49K03m35J11K16k62l53L64k0J2J32
$$ 32 32 203 2 194 125 83 209 -157 -65 162 55 -204 145 348 -87 24 240 -22 -375 -11 -31 -19 113
1749A13l21K44J1J24j70j55L98m07k6K94P2j03j45J76K52l27K7j2k04J61m9r2
$$ 113 -208 36 47 171 1 -154 244 -163 -189 105 177 74 -71 105 357 30 57 45 -159 2 -47 -139
1771a39P0J63j87P9j35J85l02o5J72l6K02j49R7K47j72l4N3q1L7K15p9j19K92
$$ -139 -69 94 -93 -14 -149 36 -266 -331 -159 -195 7 -142 -45 202 30 -4 49 -32 5 220 141 22 314
1794C14j89J61j58N4l28l37L21P6N0q9J31k01M51k85pj06K25o7j97L6L52L7j01
$$ 314 125 286 128 182 -146 -483 -162 -86 -36 -125 6 -195 256 -29 -36 -142 83 16 -181 -145 207 244 143
1817A43j93M16o5m35K48l71N34j48k36J43J75j84r0J04l57R1J54ML7K1J29k91
$$ 143 -50 366 301 -134 114 -257 277 129 -107 36 211 27 -63 41 -316 -225 -71 -67 -30 -9 120 -171
1839a71J45L12k36j49q7K65Q4k17L4J91R4R2j61q2j29q5n3J68o4J41k95L8K01
$$ -171 -26 286 50 -99 -186 79 163 -54 -20 171 265 357 196 114 -15 -100 -153 15 -49 92 -203 -165 36
1862C6J71j33k97L65j78O8R5j29j42J18RJ04NJ06j41p3R3J02k72P0j48M39j42
$$ 36 207 74 -223 142 -36 32 127 -2 -144 -26 -17 87 92 198 57 -16 77 179 -93 -23 -171 268 126
1885A26k34J57j15J15j11r9J46r3M6O9r9M8Q9k48M5K0J52j00J60j61N21l02O5
$$ 126 -108 49 -66 49 -62 -161 -15 -108 -62 7 -92 -44 45 -203 -158 -138 14 -86 74 -87 434 132 197
1908A97j53mR5j31j01K57l9n06K88J59j19r3l6K85k01L3j87J91J38k15k07K11
$$ 197 44 40 135 4 -97 160 121 -385 -97 62 -57 -150 -186 99 -102 -69 -256 -65 73 -142 -349 -138
1930a38K29j72K22k62J01K80j17j38J79J33m48jL48q5l52R7J37n5J07K28k82q9
$$ -138 91 -81 141 -121 -20 260 143 5 184 317 -131 -132 216 131 -221 -124 13 -42 65 293 11 -78
1952g8M5R0k34o9J57j12K01M8j51K18q8R5k29J66p3p4M91J5l89m7J99p5P8k86
$$ -78 -33 57 -177 -246 -89 -201 0 48 -103 115 27 122 -107 59 -14 -88 403 418 29 -18 181 106 184 -102
1976a02j23KK13j3r7L4K23j97l3P3m6o9OJ88l16L54k13L0K26L71n37J62j90R9
$$ -102 -225 -223 -10 -23 -120 -86 137 -60 -93 -20 -66 -135 -129 59 -257 97 -116 -86 140 511 -26 136 -54 45
2000D5J22m31L12LK06o21L04j6K03k63q2M58p1m84J16J07p5N8J31j47J49L5j32
$$ 45 167 -264 48 51 257 -364 -60 -76 127 -136 -218 240 169 -315 -199 -92 -167 -109 22 -125 24 59 -73
2023g3O8j76J40P9J95j33k50K36P2j11J91m1n1m07L03j07N9j41J66J84k38O5l15
$$ -73 -5 -181 -41 38 233 100 -150 86 158 47 238 197 146 -261 42 -65 -6 -147 19 203 -35 30 -285
2046b85L85j38N5j77L5K34%q2jJ9J08j61L7K64k46M4k35J61L4j57J18J19l78N8
$$ -285 100 -38 17 -160 -125 109 109 27 26 45 153 -8 29 293 47 91 -144 17 51 -106 12 131 -247 -189
2070a89K74j85R6n3J1K35j74L5J31n2j69pM29p06M73o3q8k58K43K51j79K82k13
$$ -189 85 -100 -4 -57 -46 189 15 50 181 129 -40 -47 382 -324 149 86 -2 -260 -17 234 55 337 124
2093A24j66K21k44J35n3j0l5J14q8r2N5j05M7Q1R4j26M5K91k72pL14l60q9J62
$$ 124 -42 179 -65 70 17 7 -28 86 -2 -94 -39 -144 -97 -16 78 -48 -3 288 16 9 323 -37 -126 36
2117C6J46l36p1L59l38N0L10k82R2%J97l71j1M07l36j68L91k43J62K57k24j91
$$ 36 182 -154 -225 134 -204 -154 156 -126 -34 -34 163 -208 -219 188 -148 -316 75 -168 -6 251 27 -164
2139a64Q5N30o33K08O7p8n1L24m86j3M99k74k01n2L19L0J02J56l68m41N05J54
$$ -164 -79 451 -182 26 93 15 -36 288 -198 -211 288 14 -187 -239 80 110 212 368 0 -441 64 218
2161B18l69M42k47j94J47N9J6P6p5j24n1M55ln12J24N27n89l3M36m15j61L66J49
$$ 218 -151 291 44 -150 -3 56 72 148 73 -51 -102 353 350 -162 -38 489 -100 -133 303 -112 -273 93 242
2184B42l17J7N7M7k1J5l06M6L65J48n91M11j84q5K93J46l67K5J46j65j4J95M9
$$ 242 -75 -58 -1 46 25 40 -266 -220 145 293 -298 113 -71 -156 137 283 -84 -59 87 -78 -92 103 152
2207A52m31L74J24l59P8J57r0j7K02r9m1rN7q9J26j05k8l02L55Ll02J34K71k26
$$ 152 -279 95 219 -140 -62 95 5 -12 190 91 50 41 98 9 135 30 2 -300 55 58 -244 -110 161 -65
2231f5N2J54j60p7K8J16j54JJ10lJ87N5l8m49K57j78J21J12k02MJ09K39k65j28
$$ -65 -13 141 -19 -96 -68 48 -106 -105 5 2 189 244 206 -243 14 -164 -43 69 -133 -129 -20 219 -46 -174
2255a74K86N0k09J92j30pJ02k07L8Q2k1R5j58J22j84m9%J86J49k27J26K5k87K51
$$ -174 112 162 -47 145 15 8 110 -97 -59 23 2 97 -61 61 -123 -172 -172 14 163 -64 62 87 -200 51
2279E1K6k26K38j33j97L35k4j9j4m3J87j49r2K12m00N80k06l0k62J78p7P6o0M7
$$ 51 77 -149 89 -44 -241 94 70 51 37 -6 181 32 -60 152 -248 332 126 96 -166 12 -65 11 -49 -2
2303bJ94q7l11J68J35j03k7k24K27J07mk04K04k4p1n9o5J61L8r3m56M70K70Pj54
$$ -2 192 105 -206 -38 97 -6 -33 -257 -30 77 73 -131 73 49 -22 -81 -146 15 53 -40 -496 -26 244 251 97
2328I7j33j25L11j37p5L9L9O0j4j64J1J43p0lk5j7K07k30o7K13J29L6j96p0J20
$$ 97 -36 -161 150 13 -62 -23 16 76 62 -102 -91 52 -18 -21 -46 -63 144 -86 -153 60 189 225 29 -41 79
2353G9L7k39J83k38J15L84j86Q3o0j47j35K69L1n7pk99M5K38o6J00j22L05k83
$$ 79 116 -123 60 -178 -63 321 135 218 158 11 -124 145 176 119 112 -187 -142 96 30 130 8 313 30
2376C0j77K24j72J71k11P2l4R3j15J2M17l23J48k99J34km0J59R0k20K63l48l1
$$ 30 -147 77 -95 76 -135 -63 -97 -4 -119 -107 310 -13 135 -164 -30 -32 -72 87 177 -43 220 -128 -159
2399a59J60j91J64J18m6K0R4j84J5j31P5R9m0r2J71j4r5Mm9L1J25J33k11Q5j87
$$ -159 1 -190 -26 92 46 66 160 -24 -9 -140 -65 34 -6 -98 73 59 -36 -32 -81 -50 75 208 -3 82 -105
2424a05J44j41Q2%J67r9J27j88j86M1K66j25O3J51J5j93O8J24J4o33N69J19l01
$$ -105 39 -102 -20 -20 147 48 175 -13 -199 -158 108 -17 46 197 212 19 87 211 225 -408 161 280 -21
2447b1N2j26K17k68L18j36q8J4j38L87k67%J01Q1l54M05k66J64r6J26k22n2K36
$$ -21 31 -95 122 -146 172 36 -52 -38 -176 211 -56 -56 45 126 -228 177 -89 75 -21 105 -117 -169 67
2470F7j02j98K20j13JJ00oK67l72L15j61k46M78r8k94L24m3j24J54j01Po9j8L7
$$ 67 -35 -233 -13 -126 -125 -25 -31 236 -136 179 18 -228 250 152 -142 182 139 15 169 68 75 6 -12 25
2494B5j88K12Q1p4j45K78k90Q1m7J18k60L94l76j12M33q1Mj19L64n29J08Q3L1
$$ 25 -163 49 130 56 -89 189 -101 -20 -67 51 -209 185 -191 -303 130 49 53 -66 298 -231 -123 -40 -9
2517iJ9J33j09o3MN0p8N5J12m9k26N9P6l81M44m9j28n4J62J19K7q1J47m09J52
$$ -9 10 143 34 -29 -25 25 -53 2 114 65 -161 -102 -26 -407 37 -12 -140 -194 -32 87 114 33 180 -229 -77
2542g7L40l40o7J88l3J54N2p3j82l7J74j74L1K89l58J74J02N0n70N71o6k76K6
$$ -77 263 -77 -144 44 11 165 217 144 -38 -75 99 -75 -44 245 -113 61 163 213 -357 214 148 -128 -102
2565a02K41j65n5K01K24n07kK33o6k39L81j71j83J56J04k88K65J01k43J52k16
$$ -102 139 -26 -81 120 344 -163 -165 68 2 -237 144 -27 -210 -54 50 -238 27 128 -115 37 -179
2586a79Q2j23M76m19J89n%m30M57jj17K8J44o3o9j1L26n20J65k2k9n3L34k08j2
$$ -179 -97 -220 256 -163 26 21 21 -409 48 47 -70 -42 102 39 -30 -41 285 -235 -70 -92 -121 -174 160 -48 -60
2611f0L80j39j47O9M9l06K01M3j58M8J64j71k84J80J38j98R7L49k22k65L23M2
$$ -60 320 181 34 103 152 -154 47 90 -68 -20 144 -27 -311 -131 7 -191 -94 255 33 -232 91 133
2633A33j26K83L6m94K83p6K2k71M88j77j40K94k77k31K39M17n47N0J44n3k9j14
$$ 133 7 290 326 -168 115 39 61 -210 278 101 -39 255 -22 -253 -14 403 -144 -94 50 -3 -32 -146
2655a46J56l01L68Q3k14K65K1n44L0M51k46k6R1l9r1Q7K45j11j30L27k34k82L97
$$ -146 10 -291 77 160 -54 211 232 -312 -282 169 -77 -103 -12 -51 -142 -55 190 79 -51 276 42 -240 157
2678A57j86o6L90o21K50j29J97j00KK91m1j90J84l6m62O30k47o7l6J78o7p1J50
$$ 157 -29 -95 295 -326 -76 -205 -8 -108 -106 185 144 -46 138 102 -360 270 23 -44 -80 98 31 -40 110
2701A10pk4r7K56k94q7K05o6J3P6J37m05K31J02l49M42l22N5M4J15l06J63j40
$$ 110 103 79 -18 238 -56 -143 62 -4 9 85 222 -183 48 150 -199 243 -79 -24 20 135 -171 -8 -148
2724a48Q2K50k04p1J04K21k98L8k03R9J55l4J27o0k06j3P1R1J62l52n5J31J14
$$ -148 -66 184 -20 -91 13 234 -64 -26 -229 -130 25 -9 118 58 -148 -161 -90 1 163 -189 -244 -113 1
2747Aj09m5L41j34J59n06L32m5m0j68J04n2K7O2k65K51MR4M0r3K84j33r5n7kK25
$$ 1 -108 -153 188 54 213 -293 39 -6 -46 -214 -110 -162 -135 -73 -338 -87 -83 11 51 -42 242 109 14 -43 -45 180
2773A80l0pk4j0j9j08J93k58K45q7j05J25m05N17j06k56L6J73q4L8m1j2r5K33
$$ 180 150 143 119 109 90 -18 175 -83 162 75 -30 95 -310 207 101 -155 -119 54 -30 8 -33 -45 -140 93
2797I3O3l34J71mn6N3P9nk02K46o0r3L05j84k81K95p5m9mJ9j50K04J46k3n7l2
$$ 93 156 -178 -7 -11 -67 -14 65 60 -142 104 44 -49 256 72 -209 86 11 -38 -42 -23 -173 31 177 154 97 65
2823F5m27L47K49j04k70L93j80k10J68J52p8m6j41J85l36P8q4Q4J31o5j0J4K64
$$ 65 -362 -15 234 130 -140 253 73 -137 31 183 105 59 -82 103 -233 -155 -239 -155 -24 -89 -99 -85 179
2846A79k96k5R6Q4j17M7m2k0j32J05J45J18j09J12K6j40J48k83J2K02N1l47J33
$$ 179 -117 -142 -46 38 -79 -32 -74 -94 -226 -121 24 142 33 145 171 31 179 -104 -92 110 161 -186 -53
2869e3P9r1J26m8J05j56J67n2k68K42n5K6K31k34m1J02k8r6J51K7j60P8nj43K37
$$ -53 26 -65 61 13 118 -38 129 77 -191 51 -4 22 253 19 -22 80 52 -44 107 134 -26 52 47 -96 141
2894A41j22L7p6j81J88Q0j42Q2J18k75J29J44j29J8J94k07K04k67M9%J4j5L16
$$ 141 19 56 -20 -201 -13 67 -75 7 125 -150 -21 123 -6 12 206 -1 203 -64 -15 -15 -1 -16 300
2917C00l15M4j60P2M5j90J13K25J24k10m4j4R7n12Q5M45k05j2M4J62p1m6o9m2
$$ 300 -15 29 -131 -59 -14 -204 -91 134 258 48 4 -10 87 -425 -340 105 -100 -112 -68 94 23 -23 -92 -134
2941a34J62j76M6L00m28J91JK03j14p9Q1j41j0N1J57k02K7o8K62j09J3K6L9j63
$$ -134 28 -148 -102 198 -230 -39 -38 165 51 -28 53 -88 -98 -47 110 -92 -65 -133 129 20 33 59 98 -65
2965f5R9Q9j36o4J45qJ32k40j24L81n8mk86J24j1k4J13k08J25Q7R6J00k29L3l91
$$ -65 34 123 -13 -77 68 60 192 -48 -172 209 151 147 -139 -15 -26 -50 63 -145 -20 67 163 263 34 67 -324
2990c24M75O6k98J11Pj36J8K08l16r5M74n6k49J94j11K9K69k45k1k7m8m5K46j75
$$ -324 151 217 -81 30 37 -99 -81 127 -189 -284 190 134 -115 79 -32 -3 266 21 0 -27 -75 -120 126 -49
3014d9J6P2p8K35m7o9kq3j64M9K57p4J31pk63Q4P5j02J28j10o1M6nJ01J2Q0k15
$$ -49 -33 39 -39 196 149 80 78 -5 -169 -120 137 63 194 187 -76 8 83 -19 109 -1 -62 -16 -21 80 92 172 -43
3041d3K58n3k10J48k31J59J7l7p3J14l01L07r1J39j82q6j3N00n25M11j75nj17
$$ -43 215 162 -48 100 -131 28 45 8 -65 49 -252 55 -36 103 -79 -165 -178 322 -203 208 33 28 -89
3064h9L3K08l70K63l1k5Q6k77K83J01l37K66l29L1O3k19K34j8j0J19%k49K10M7
$$ -89 -56 152 -218 45 14 -11 75 -202 81 182 -155 111 -218 -187 -124 -343 -109 -127 -137 -18 -18 -267 -57 -10
3088a0j11jJ22l85L60J58k90L19j60J00K7k91oJ62k0J5L9p9K55k94P7K33Kk74
$$ -10 -121 -122 0 -385 -25 133 -157 162 2 102 129 -162 -168 -6 -26 -11 28 -51 204 -90 -13 220 222 -52
3112e2L56q0m42L67j34q6J15Q9j29K17k13p0O0O4r6j43J16n7J91j0rr9ro6l8j20
$$ -52 304 224 -218 149 15 -71 44 133 4 221 8 -62 -2 62 -34 -177 -61 -118 73 63 54 -45 -54 -120 -158 -278
3138b78L83j05P2p8K4j57J98K05l21q1L21k08K3K23k11q4j04k9L07m48L33K16
$$ -278 105 0 72 -6 18 -139 59 264 -57 -138 183 -25 -2 221 10 -74 -178 -207 100 -348 -15 201
3160B01l83L91j22m9M9O1k81jJ93J3j67J04Q0J05j38J7J17p9j04m4j05L16l5m18
$$ 201 -182 209 87 38 87 148 -133 -134 59 72 -95 9 89 194 56 73 190 111 7 -37 -142 174 139 -279
3184b79M42L9k58J90K65o00j50M62j94M3N1k16J96J1R5j8n0L0J55k13q4J87l40
$$ -279 163 202 -56 134 399 -201 -351 111 -83 -40 11 -205 -9 2 97 79 29 59 214 1 -83 104 -236
3207b36M39O7l87r4J55j60J82m5K1o9K47J8l7j16q4J39j6k1P9j97J40k19J17J12
$$ -236 203 270 -117 -211 -56 -216 -34 -79 -58 -127 120 138 101 -15 -99 40 24 3 82 -115 25 -194 -77 35
3231C5o3K4l8r5K42j13j00R5J85j34O1j11J6M4J30j59n9K60k47R5O1j27j79J68
$$ 35 -28 -4 -42 -137 105 -8 -108 -13 172 38 99 -12 4 48 178 19 -40 220 -27 68 129 2 -177 -9
3255iJJ44k51J43K37j45j61Qj21K74k3Q0j01k89J89r1J23k11M06j96M4Jj10K3
$$ -9 -8 136 -115 28 265 120 -41 -33 -154 120 97 177 76 -213 -24 -115 8 -203 203 7 51 52 -58 -35
3279c5P9N3r1m3J75j22k1J48j86pp2K13k55M6n8l0K10k4K29k19n6P1j99O9J40
$$ -35 44 97 6 -37 138 16 -5 143 -43 -50 -122 91 -164 -118 -176 -206 4 -20 209 -10 -66 5 -194 -125 15
3304A5J13k10Q4K3k13J88L2j42j30J95J10j77M3L9r2J08K36j44oj75J25j55J67
$$ 15 128 -82 2 25 -188 0 32 -110 -240 -45 65 -112 -69 -30 -122 -14 222 78 72 -103 22 -133 34
3327C4j4n6k2J57o5M4P6n0o7P8j53J48o8N3j95P6J29j76j06J76K6k15J48J89j69
$$ 34 20 -36 -58 99 34 78 154 104 37 115 -38 110 42 95 -100 -24 105 -71 -177 -1 25 -190 -42 147 -22
3352b2J03n7K0J01l56p0Q2J56K14r8j13l1J38q1K5p5k24O9L75r6j50l3j43K95
$$ -22 81 24 44 145 -211 -281 -199 -43 171 73 -40 -71 67 -14 11 -64 -288 -219 156 60 -90 -123 -266 29
3376B9m7J35j60r0K35k47K69k34Q1J17j5K3l3j32M0J06O3p6l2k55K21K1L9j34
$$ 29 -18 117 -43 -133 102 -145 124 -110 -29 88 73 96 63 -69 -29 77 140 64 32 -223 -2 19 58 -76
3400g6k9P7q2L6J2r3Rj88J22p2K16Q5q1L7P7P9j27J06J4J2k85J53O8j73R0j45
$$ -76 -105 -28 -110 -74 -62 -155 -146 -334 -212 -284 -68 17 -64 -27 50 129 2 108 122 134 -151 2 70 -103 -13 -158
3426a58j23K04l3J92k64K5J20J53k39n4l1J85n9j88L71J67k27k09K05J73k20n5
$$ -158 -281 -77 -110 82 -182 -157 -37 116 -123 -177 -208 -23 -82 -270 101 268 41 -168 37 210 -10 -65
3448f5n5M64k00l27J95N9j40J82j19J80jk43M33l78j35j44K13R8j84K0J58K3j37
$$ -65 -120 344 144 -183 12 71 -69 113 -6 174 173 -70 363 -15 -150 -294 -81 17 -167 -147 11 34 -103
3471a03J10j73K34L33k94r6m3m1O4r5QK32j23J9Oj48J14k47M76On5k02k39K58
$$ -103 7 -166 68 401 107 11 -32 -73 -9 -104 -96 136 13 32 38 -110 4 -243 233 239 184 -18 -257 1
3495AKJ38k37J22n1O1j73J74J97k0l71Q3K2q1nJ62l9j80J28o0K3J74J3Q2q9P6
$$ 1 3 141 -96 26 -25 36 -137 37 234 214 -157 -74 -52 -133 -138 24 -15 -195 -67 -127 -104 70 83 165 76 152
3521A52r3j67J45j18j66K62l1l6j7m8l3J46J65k10K32q7mn3O0j3P9l13J80L01
$$ 152 59 -108 37 -81 -247 15 -16 -52 -69 -117 -150 -4 161 -49 183 96 92 39 99 86 165 -148 32 333
3545C33o61M93ok91K65m5o7L3j3q8j48J99j9p0k39K67j22L73j20k29o7K15J16
$$ 333 -328 165 159 -132 133 88 21 54 41 -47 -195 4 -15 -85 -324 -57 -179 194 74 -155 -222 -7 109
3568A09r0r3L40m32L11j26K8j59J08J12j35L6R4j1k35O3J7P3q0J3M7jm6K25j80
$$ 109 19 -74 266 -166 145 19 47 -112 -4 108 -27 9 103 92 -143 -80 -63 10 -70 -57 -10 -11 -57 168 -12
3593a2j6L5r3K43k35K1K33q2j89J94qJ4k3q6Q8j40J93l42M95l63J88j35j03R0
$$ -12 -28 7 -86 157 -78 -57 176 94 -95 99 91 105 82 -4 84 -56 137 -205 290 -73 115 -20 -123 -33
3617c3j5r1L58l7l14L18r7k8L3j24J44p8j93K21j4j07J8r3L07k37J67O7l65M6
$$ -33 -48 -139 219 182 -132 186 89 61 94 -30 114 36 -157 64 50 -57 -39 -132 175 -62 105 172 -193 -147
3641a47J62K3rjp4k9n4K48j1j78O0j17l5J55j92K51Q5J2J18j10k20p9K10j81M4
$$ -147 15 38 29 28 -46 -75 -129 119 108 -70 -10 -127 -162 -7 -199 52 137 149 267 157 -63 -142 68 -113 -69
3666f9J93m38M00L15m42P0r5l1Q1J23j19j39k64N37M0l55J87n5L15k53L60k68
$$ -69 124 -314 86 401 -41 29 -66 -97 -16 107 -12 -151 -415 122 162 -193 -6 -61 254 1 361 93
3688I3M1l3k10M6J58j43K13l04L69j40k8l5l6o1R8k8j83L62k11q6Q7NL2O3j89
$$ 93 134 101 -109 -63 95 -48 165 -139 230 90 62 27 -9 -70 28 0 -183 179 -32 -118 -31 -26 6 69 -120
3713a20J00j40J71K02n28O23j93l8j55N0NK52j99M7j1k9P4l18J72j4r5K10P1J00
$$ -120 -20 -160 11 213 -315 308 115 77 -78 -28 -23 229 30 77 66 37 111 -207 -35 -49 -144 66 137 237
3737B37j93K18l12K43l20K3M5r3K33k33J5J48J46j15K9m3q4j3Q2k79J18K36QR9
$$ 237 44 262 -50 193 -127 -104 -59 -152 81 -152 -137 11 157 42 71 28 -56 -69 13 -266 -148 88 96 195
3761A95j07p1R3o1j84K94k03R2K29k32p4J84k66R6m5j22J69j89K04k22K67l6J91
$$ 195 88 17 110 49 -135 159 -44 48 277 45 -29 155 -111 -15 -60 -182 -13 -202 2 -220 47 11 202
3784B02j18l08LK47O6J05m42N8O6L3j28M69p3p23O77P5j54l39K03K14l41K69j3
$$ 202 84 -224 -221 26 92 197 -245 -187 -121 -88 -216 253 180 -543 134 209 55 -284 -81 133 -208 61 48
3807D8k8p6l6L2K15j45k5M3j33J07lm7J03m8O9R9k68J49J24k39k5R6M1l6N2j76
$$ 48 20 -56 -92 -60 155 10 -15 28 -105 2 -1 -48 55 7 76 175 -93 56 180 -59 -84 12 53 17 69 -107
3833a07J19J32j21J26j00J54j58L4J79j21P6j78j33K28l3N3j1j33j19K62l54N1
$$ -107 12 144 23 149 49 203 45 79 258 137 213 35 -98 130 97 150 139 6 -113 149 -205 -154
3855a54P5L47J20l32R3o1q0j58J86N1j48R1j16k20L70j13P3R1k17J29J67m38O8
$$ -154 -79 268 388 56 149 88 8 -150 36 87 -61 30 -86 -306 64 -49 24 115 -102 27 194 -244 -176
3878a76N86k34r2k36J96J36k1j74j9m0r3rJ28K40j75q8L8L11l47K05j29P9jm3
$$ -176 410 176 84 -152 44 180 159 -15 -34 -74 -167 -176 -48 192 17 -71 -33 278 -69 136 7 86 85 42
3902D2k1K1k2L6p6J06p4j74Q8N0m8K19k12R3j09R4l0N7j58J05M7N5J12l58J94
$$ 42 21 42 20 56 -20 86 12 -162 -74 -24 -72 147 -65 28 -81 13 -17 40 -118 -13 34 89 201 -157 37
3927C7k74L19k79M44l41K79k06R0j39P6J93n5j94o3jK98j00j24J64j16j97K70
$$ 37 -237 82 -197 247 -94 185 -21 69 -70 6 199 144 -50 -113 -114 184 84 -40 124 8 -189 81
3949H1q0j19J65k8l54K82J89k4l03J26J21m7J33j35q8K62k32j62Q7Q7K10k61M9
$$ 81 1 -118 47 19 -335 -53 136 112 -191 -65 56 9 142 7 -81 181 -51 -213 -126 -39 171 -90 -41
3972d1J48k43J42l6l7o8J78O4k97J61j46L65l63K45r1J23m0j34K78k00k06N6J61
$$ -41 107 -136 6 -30 -67 -135 43 107 -190 -29 -175 190 -173 72 -19 104 64 -70 208 8 -198 -142 19
3995A9n8l9L29m8O5j93j38j23kK82m3n1n3P3K76j72j44L9qo0p0K82k31K29J26
$$ 19 -39 -78 251 203 268 75 -63 -186 -188 94 51 0 -53 20 296 124 -20 19 11 -49 -119 163 -68 161 287
4020B87j37k62J71j59J41j54J23j13J10l0r9J53k54L90l24J91Q0j66J04j47J02
$$ 287 150 -112 59 -100 41 -113 10 -103 7 -23 -122 31 -223 167 -157 34 114 -52 52 -95 7
4041Gk62J93M1j32J57K31j35J33j55m21N27k78J63k04J14q7o0L27Ml4j15j03J09
$$ 7 -255 -62 -21 -153 4 235 100 233 78 -343 184 -94 69 -135 -21 -108 -168 159 163 129 14 -89 20
$$ [...]
8190In6
8191d7
##END NTUPLES=NMR FID
##END=
