##TITLE=1H_SR117_0
 D2O
 8 sc, 
 15.04.2022
##JCAMPDX= 6.0         $$ Bruker NMR JCAMP-DX V2.0
##DATA TYPE= NMR FID
##DATA CLASS= NTUPLES
##ORIGIN= UXNMR, Bruker Analytische Messtechnik GmbH
##OWNER= root
$$ XWIN-NMR		Version 3.5
$$ Fri Apr 15 14:20:49 2022 Russian Standard Time (UT+4h)  she@DPX200
##.OBSERVE FREQUENCY= 200.13135
##.OBSERVE NUCLEUS= ^1H
##.DELAY= (6, 6)
##.ACQUISITION MODE= SIMULTANEOUS
##.ACQUISITION SCHEME= undefined
##.AVERAGES= 8
##.DIGITISER RES= 18
##SPECTROMETER/DATA SYSTEM= spect
##.PULSE SEQUENCE= zg30
##.SOLVENT NAME= CDCl3
##.SHIFT REFERENCE= (INTERNAL, CDCl3, 0, 15.7039)
##AUDIT TRAIL= $$ (NUMBER, WHEN, WHO, WHERE, WHAT)
$$ ##TITLE= Audit trail, XWIN-NMR		Version 3.5
$$ ##JCAMPDX= 5.01
$$ ##ORIGIN= Bruker BioSpin GmbH
$$ ##OWNER= she
$$ F:/spectra/data/she/nmr/H-F/1/audita.txt
$$ ##AUDIT TRAIL=  $$ (NUMBER, WHEN, WHO, WHERE, WHAT)
(   1,<2022-04-15 14:19:44.89 +0400>,<she>,<DPX200>,
      <created by zg, POWCHK disabled, PULCHK disabled
       configuration hash MD5:
       00 E9 B6 7A A2 85 ED C7 34 08 36 98 17 FE 4E 26
       data hash MD5: 16K
       58 C5 2E 63 5F 30 1C 61 D0 64 CC 3C BE 54 3F 40>)
$$ ##END=
$$ 
$$ hash MD5
$$ 66 86 21 B1 AE 7A 0D 24 7A 98 69 28 75 2C BA BC
##$RELAX= 
##$RELAX= 
##$RELAX= 
##$RELAX= 
##$RELAX= 
##$RELAX= 
$$ Bruker specific parameters
$$ --------------------------
##$DU= <F:/spectra>
##$EXPNO= 1
##$NAME= <H-F>
##$PROCNO= 1
##$TYPE= <nmr>
##$USER= <she>
##$AMP= (0..31)
100 100 100 100 100 100 100 100 100 100 100 100 100 100 100 100 100 100 
100 100 100 100 100 100 100 100 100 100 100 100 100 100 
##$AQSEQ= 0
##$AQ_mod= 1
##$AUNM= <au_zg>
##$AUTOPOS= <>
##$BF1= 200.13
##$BF2= 200.13
##$BF3= 200.13
##$BF4= 200.13
##$BF5= 200.13
##$BF6= 200.13
##$BF7= 200.13
##$BF8= 200.13
##$BYTORDA= 1
##$CFDGTYP= 0
##$CFRGTYP= 5
##$CHEMSTR= <none>
##$CNST= (0..31)
1 1 145 1 1 1 1 1 1 1 1 1 1 1 1 1 1 1 1 1 1 1 1 1 1 1 1 1 1 1 1 1 
##$CPDPRG= <>
##$CPDPRG1= <>
##$CPDPRG2= <>
##$CPDPRG3= <>
##$CPDPRG4= <mlev>
##$CPDPRG5= <mlev>
##$CPDPRG6= <mlev>
##$CPDPRG7= <mlev>
##$CPDPRG8= <mlev>
##$CPDPRGB= <>
##$CPDPRGT= <>
##$D= (0..31)
0 1.2 0 0 0 0 0 0 0 0.06 0 0.03 0 0 0 0 0.0002 0 0 0 0 0 0 0 0 0 0 0 0 
0 0 0 
##$DATE= 1650017984
##$DBL= (0..7)
120 120 120 120 120 120 120 120 
##$DBP= (0..7)
150 150 150 150 150 150 150 150 
##$DBP07= 0
##$DBPNAM0= <>
##$DBPNAM1= <>
##$DBPNAM2= <>
##$DBPNAM3= <>
##$DBPNAM4= <>
##$DBPNAM5= <>
##$DBPNAM6= <>
##$DBPNAM7= <>
##$DBPOAL= (0..7)
0.5 0.5 0.5 0.5 0.5 0.5 0.5 0.5 
##$DBPOFFS= (0..7)
0 0 0 0 0 0 0 0 
##$DE= 6
##$DECBNUC= <off>
##$DECIM= 32
##$DECNUC= <off>
##$DECSTAT= 4
##$DIGMOD= 1
##$DIGTYP= 9
##$DL= (0..7)
0 120 120 120 120 120 120 120 
##$DP= (0..7)
150 150 150 150 150 150 150 150 
##$DP07= 0
##$DPNAME0= <>
##$DPNAME1= <>
##$DPNAME2= <>
##$DPNAME3= <>
##$DPNAME4= <>
##$DPNAME5= <>
##$DPNAME6= <>
##$DPNAME7= <>
##$DPOAL= (0..7)
0.5 0.5 0.5 0.5 0.5 0.5 0.5 0.5 
##$DPOFFS= (0..7)
0 0 0 0 0 0 0 0 
##$DQDMODE= 0
##$DR= 18
##$DS= 0
##$DSLIST= <SSSSSSSSSSSSSSS>
$$ [...]
##$SUBNAM2= <"">
##$SUBNAM3= <"">
##$SUBNAM4= <"">
##$SUBNAM5= <"">
##$SUBNAM6= <"">
##$SUBNAM7= <"">
##$SUBNAM8= <"">
##$SUBNAM9= <"">
##$SW= 18.05172834244
##$SWIBOX= (0..15)
0 0 2 0 0 0 0 0 0 0 0 0 0 0 0 0 
##$SW_h= 3612.71676300578
##$TD= 16384
##$TD0= 1
##$TE= 0
##$TE2= 300
##$TE3= 300
##$TEG= 300
##$TL= (0..7)
0 120 120 120 120 120 120 120 
##$TP= (0..7)
150 150 150 150 150 150 150 150 
##$TP07= 0
##$TPNAME0= <>
##$TPNAME1= <>
##$TPNAME2= <>
##$TPNAME3= <>
##$TPNAME4= <>
##$TPNAME5= <>
##$TPNAME6= <>
##$TPNAME7= <>
##$TPOAL= (0..7)
0.5 0.5 0.5 0.5 0.5 0.5 0.5 0.5 
##$TPOFFS= (0..7)
0 0 0 0 0 0 0 0 
##$TUNHIN= 0
##$TUNHOUT= 0
##$TUNXOUT= 0
##$USERA1= <user>
##$USERA2= <user>
##$USERA3= <user>
##$USERA4= <user>
##$USERA5= <user>
##$V9= 5
##$VALIST= <valist>
##$VCLIST= <CCCCCCCCCCCCCCC>
##$VD= 0
##$VDLIST= <DDDDDDDDDDDDDDD>
##$VPLIST= <PPPPPPPPPPPPPPP>
##$VTLIST= <TTTTTTTTTTTTTTT>
##$WBST= 1024
##$WBSW= 4
##$XGAIN= (0..3)
0 0 0 0 
##$XL= 0
##$YL= 0
##$YMAX_a= 84142
##$YMIN_a= -106318
##$ZGOPTNS= <>
##$ZL1= 120
##$ZL2= 120
##$ZL3= 120
##$ZL4= 120
##$ABSF1= 10
##$ABSF2= 0
##$ABSG= 5
##$ABSL= 3
##$ALPHA= 0
##$AQORDER= 0
##$ASSFAC= 0
##$ASSFACI= 0
##$ASSFACX= 0
##$ASSWID= 0
##$AUNMP= <proc_1d>
##$AZFE= 0.1
##$AZFW= 0.1
##$BCFW= 1
##$BC_mod= 2
##$BYTORDP= 1
##$COROFFS= 0
##$CY= 11.3945322036743
##$DATMOD= 1
##$DC= 2
##$DFILT= <>
##$DTYPP= 0
##$F1P= 2.36226072786647
##$F2P= -0.459571619588291
##$FCOR= 0.5
##$FTSIZE= 0
##$FT_mod= 4
##$GAMMA= 1
##$GB= 0.15
##$INTBC= 1
##$INTSCL= 1
##$ISEN= 128
##$LB= 0.24
##$LEV0= 0
##$LPBIN= 0
##$MAXI= 10000
##$MC2= 0
##$MEAN= 0
##$ME_mod= 0
##$MI= 1.114404
##$NCOEF= 0
##$NC_proc= 0
##$NLEV= 6
##$NOISF1= 3.799351
##$NOISF2= 2.8
##$NSP= 1
##$NTH_PI= 0
##$NZP= 0
##$OFFSET= 15.70392
##$PC= 1
##$PHC0= -18394.98
##$PHC1= 12.80075
##$PH_mod= 1
##$PKNL= yes
##$PPARMOD= 0
##$PSCAL= 0
##$PSIGN= 0
##$REVERSE= no
##$SF= 200.130013532006
##$SI= 16384
##$SIGF1= 3
##$SIGF2= 2
##$SINO= 400
##$SIOLD= 16384
##$SREGLST= <1H.CDCl3>
##$SSB= 0
##$STSI= 0
##$STSR= 0
##$SW_p= 3612.71676300578
##$SYMM= 0
##$S_DEV= 0
##$TDeff= 0
##$TDoff= 0
##$TI= <>
##$TILT= no
##$TM1= 0
##$TM2= 0
##$TOPLEV= 0
##$USERP1= <user>
##$USERP2= <user>
##$USERP3= <user>
##$USERP4= <user>
##$USERP5= <user>
##$WDW= 1
##$XDIM= 8192
##$YMAX_p= 0
##$YMIN_p= 0
$$ End of Bruker specific parameters
$$ ---------------------------------
##NTUPLES= NMR FID
##VAR_NAME=  TIME,          FID/REAL,        FID/IMAG
##SYMBOL=    X,             R,               I
##VAR_TYPE=  INDEPENDENT,   DEPENDENT,       DEPENDENT
##VAR_FORM=  AFFN,          ASDF,            ASDF
##VAR_DIM=   8192,          8192,            8192
##UNITS=     SECONDS,       ARBITRARY UNITS, ARBITRARY UNITS
##FACTOR=    0.0002768,     1,               1
##FIRST=     0,             0,               0
##LAST=      2.2672688,     0,               0
##MIN=       0,             -106318,         0
##MAX=       2.2672688,     84142,           0
$$ Real data points
##PAGE= N=1
##DATA TABLE= (X++(R..R)), XYDATA
0@%%%%%%%%%%%%%%jRj6J6j6J6k0K8l2L6m4N2o1P2q2R3j07J23j40J59j79K02k29
37a21K57k88L21l58L97m39M88n42O01o63P30q06Q87r76J076j186J306j441J596
56H39j770J967k194K461k780L164l639M250n068O219p977J1033j7870O4531k1983
71C1183p8160K9101k9622j684O0466M7777j3014m457k6300l5032j2999r876j1344
84e3961M4652L9037p856P179J2613n7688m9331K1358J7215L854N5106L8978l3600
97C7556l6065j2054k7784q103L2388L0250K1642J5219k1630k9836q033k3743k4081
110e4274L1658M1441J423J1507J7700l8505n3138n201O880N761L7249L8577J518
123D2596j6262k3606l1671j0795P734J3139L0902L1781m985j5491m681k7601l4662
$$ plain form
0 0 0 0 0 0 0 0 0 0 0 0 0 0 0 0 -1 8 -8 8 -8 8 -12 16 -16 20 -24 28 -33 39 -43 50 -57 66 -74 85 -94 108 -121
37 -121 136 -152 169 -189 208 -231 257 -285 316 -347 383 -423 464 -512 564 -622 684 -757 839
56 839 -931 1036 -1158 1303 -1477 1687 -1952 2298 -2770 3449 -4528 6505 -11365 53166 31183
71 31183 -46977 -17876 -47498 -49182 11284 59061 46047 41590 15290 -19742 -32741 -42617 -53961
84 -53961 -9309 29728 21872 29051 41664 -16024 -65355 -43997 -26782 -22928 32178 71156 37556
97 37556 1491 -10563 -38347 -46450 -14062 16188 37830 53049 31419 1583 -6450 -30193 -54274
110 -54274 -22616 18825 20248 31755 49455 10950 -42188 -47389 -40509 -34748 2501 41078 42596
123 42596 26334 2728 -28943 -39738 -32004 -18865 12037 43818 38833 23342 18661 -8940 -43602
136d3602J1426K9581R324J8335K3265j5629l8974k1730q782o95J9811K8576J9861
149C0767L493k0102k7186j2387p615l512K5342L5116P101m157l05k1414l4261
162b9120o072J6434J5266J9903K2019K331k0627k8249k0117m329P084J5934K7057
175A7514K0137r302k2923j3372j6696j7270J1255L1342J7501O096M991j1169k8614
188a0510k1046M75J3291J7283J9357J6435o90k2882k5326q918j414K405K1562
201B2K8116N254j3406j1695j6406k2561n495J9113K2019J2782P269j577j6779
214F656k5995j4317O688J3919J4315K0079J4767j1137k5113j4278o614n711J0924
227a5817K7970J8236j884q766j2716k1089j7793L316J9852J8348R858O512l901
$$ plain form
136 -43602 -32176 -2595 6729 25064 48329 32700 -6274 -28004 -36786 -37481 -17670 10906 30767
149 30767 34260 14158 -13028 -25415 -33030 -36542 -11200 23916 31017 26860 26555 5141 -29120
162 -29120 -35192 -18758 -3492 16411 38430 40761 20134 -8115 -28232 -32561 -25477 -9543 17514
175 17514 37651 28349 5426 -7946 -24642 -41912 -30657 685 18186 24282 29273 18104 -10510
188 -10510 -31556 -31081 -17790 -507 18850 35285 34595 11713 -13613 -22531 -23945 -21540 22
201 22 28138 33392 19986 8291 -8115 -30676 -36171 -17058 4961 17743 25012 23435 6656
214 6656 -19339 -33656 -26968 -13049 1266 21345 36112 24975 -138 -14416 -21030 -26741 -15817
227 -15817 12153 30389 28505 19739 7023 -14066 -31859 -28543 -8691 9657 19515 26027 22126
240B2126k2762k4606m656P920Q719J6996K3171M545j7927j7301j0823j0863j247
253b6708J8371K4859J0925l406p470j3604k1582j1936J0665J9674J1885R634P265
266B8572j1150k6055j5938J261M165R967K1320J6932n134j7404j4177j0886j0137
279b8664M528K2785K1014M279l723o243j7598k1902k595J5855J4878J0845J3174
292B6633K552j8776k3218q795K96L093J4373K2484R939r900j5108j1395j3629
305b1451p862J1333K2677J3333K135o22r897k0584j5502M179J3726J1396J3261
318A6122J1122m779k0210j6825m822j62N679J8260J9015J986j1744j2190j2154
331a0702j3708j910J7234J9385Q561J752k572j4970k1346q480Q110J1471J1556
$$ plain form
240 22126 -636 -25242 -29898 -21978 -13259 3737 26908 31453 13526 -3775 -14598 -25461 -26708
253 -26708 -8337 16522 27447 24041 16571 2967 -18615 -30551 -19886 -212 11673 21307 28572
266 28572 17422 -8633 -24571 -23310 -19145 -9178 12142 29074 23940 6536 -7641 -18527 -28664
279 -28664 -24136 -1351 19663 23942 20219 13976 -3622 -25524 -28119 -12264 2614 13459 26633
292 26633 29185 10409 -12809 -21604 -21308 -18215 -3842 18642 28581 18681 3573 -7822 -21451
305 -21451 -29313 -17980 4697 18030 20165 19543 9646 -10938 -26440 -22261 -8535 2861 16122
318 16122 27244 22465 2255 -14570 -19392 -19554 -13875 4385 23400 25386 13642 1452 -10702
331 -10702 -24410 -26320 -9086 10299 18860 20612 18040 3070 -18276 -26756 -18646 -7175 4381
344D381J5142P707j1349j9836j1118m516j318J0061K1854J3716l390r366r802
357B166j5401j2494N605J7547J3353O455M026n751j9040j6884j901P423R010J3802
371G916J4216L59j4765j5067q069n390K015J5565J9497O391n173p850j2380j6061
385a8796n952J1150J5508J0417P437K027j1481j9878j1511J537O180R988J6678
398A3304J1418n538j5333j1637q594n940N919J8678J4769K258l601p777j5427
411g501j3889j29J2326J2344R314Q080j146j5284j6365n613J553M787J3026J6847
425A8350M858j0040j2269r439j0080l143J2171J7568R282k11l584j0382j6402
438a3321j0028O081J1796R751J0660P284o282j7538j2398l416P53P537J6311J3834
$$ plain form
344 4381 19523 27230 15881 -3955 -15073 -19589 -20907 -10846 11008 24724 21334 11968 2166
357 2166 -13235 -25729 -20124 -2577 10776 17231 21257 15506 -3534 -20418 -22319 -14896 -5886 7916
371 7916 22132 22491 7726 -7341 -15410 -20800 -18785 -3220 16277 22668 17495 9645 -2735 -18796
385 -18796 -24748 -13598 1910 12327 19764 21791 10310 -9568 -21079 -19542 -13362 -3374 13304
398 13304 24722 19184 3851 -7786 -16380 -22320 -16401 2277 17046 19304 15703 7926 -7501
411 -7501 -21390 -21519 -9193 3151 12465 20545 19399 4115 -12250 -17863 -16310 -11523 1503 18350
425 18350 23208 13168 899 -8540 -18620 -21763 -9592 7976 17258 17047 13463 3081 -13321
438 -13321 -23349 -17268 -5472 4279 14939 22223 15941 -1597 -13995 -17411 -16658 -9121 7190 21024
452B1024m80j0161j0239j1347j0006J958J5446J4556N152L02l055j3522j6546
465a6918l719Q147Q306R588J2265L861j2121j5274p823l605Q15J0916J7549R421
479B1408n229r540r390j1580p487P909J5974R953L650J654o861j6367j1927Q96
493a6937O618P710J2022J0836j711j3674j2961o915l941L515J5047J6192L603
506A9404o697p831j0358j2218k689J2221J3059O792M699O31j0317j6102p986K676
520a4716N892Q557J3809P608o613j3903j0172o097k700O947J6408J1556l13n609
534A0654p882j2047r691K524J1562J0371O839M995k968j3521j3289l694K633O088
548g426J1658J3450K412j0177j1975q273n782q71J1694J5404O201k273m599q966
$$ plain form
452 21024 20544 10383 144 -11203 -21209 -19251 -3805 10751 15903 16205 13150 -372 -16918
465 -16918 -20637 -12490 -4184 5404 17669 21530 9409 -5865 -13688 -17293 -16478 -5562 11987 21408
479 21408 16179 6639 -2751 -14331 -21818 -13909 2065 12018 15668 17322 10461 -5906 -17833 -16937
493 -16937 -10319 -2609 9413 20249 18538 4864 -8097 -15012 -18953 -15438 -391 15801 19404
506 19404 12707 4876 -5482 -17700 -20389 -8168 4891 11683 16382 17013 6696 -9406 -17392 -14716
520 -14716 -8824 -267 13542 21150 14537 634 -9538 -15635 -18335 -11388 5020 16576 16263 10654
534 10654 2772 -9275 -18966 -16442 -4880 5491 12330 17325 14357 836 -12453 -16147 -13514 -7426
548 -7426 4232 17682 20094 9917 -2058 -10331 -16113 -16984 -5290 10114 16315 14042 9443 477
562D77j3173o877N961J0297Q967Q295L726p155j4534j0035k085K929Q142J3836
576H771J0250k213j1037q534p691o766L585J4369J0714K103q8m803j2113j1634
590a5087j821O227R009R343P674N81r688j4097p130Q9L623R761J4612N595o646
605A2045q356p898r942l279R049J2170P316L858j075q537j2721q613P44P735Q373
620H69Q803P675k233j3583j1340l598j740L837J4312J1952J25n909o607j0304
634g741q162J093R216J0396P314K213k511q932j2349n826L988O817P381J0761
648A3658M605q742j2081o404n043j401R002J3782P006j210n465q617j0143n929
662a6982L703J0844R497N134K444l953j2147j1252j172M266N701J0033J0139k63
$$ plain form
562 477 -12696 -19573 -13612 -3315 5652 13947 17673 10518 -4016 -14051 -16136 -13207 -5065 8771
576 8771 19021 16808 5771 -2763 -10454 -17220 -13635 734 11448 13551 13463 8660 -3453 -15087
590 -15087 -16908 -10681 -1672 7671 15345 15926 6238 -7859 -14989 -14900 -11277 -1516 13096 18691 12045
605 12045 3689 -4209 -14151 -17430 -8381 3789 11105 14963 13888 5351 -7370 -15983 -15239 -7504 869
620 869 9672 17347 15114 1531 -9809 -13407 -15147 -11310 3002 14954 15079 9170 2563 -7741
634 -7741 -15903 -14810 -5594 4802 12116 14329 11818 2886 -9463 -15289 -11301 -4484 2897 13658
648 13658 18263 9521 -2560 -8964 -14007 -15408 -6406 7376 14382 13172 7707 -910 -11053 -16982
662 -16982 -13279 -2435 7062 12196 14640 10687 -1460 -12712 -13884 -9618 -3917 6116 16255 15992
676A5992r741q833o965n600K066J0974J1393M231j896n003r121j0519l540P207
690i355R443O796N656J680p781j2454o820O75L124P296J1519O800m146r092p619
705d278o849l648N289J2013Q950K103k527o016j0396r474K71Q035P912O776N919
720A4080j306j0861j0861m013O84L393R204J1723L227o136p824o414o983j979
734a4066P856J1950O099N13j725p195j1545o851L895P362O012P572M780n174j1273
749a790q031k505N73N033J0967R393m15o815o754p257o496J540J0142J0036M118
764A1739N21l092r466j0757k703M638P046P330P219J922p499j0505o501j965J233
779a0840P136J1304O043k910o019o738p870n023M563J0322P870L260L99m692j0498
$$ plain form
676 15992 6251 -2582 -9547 -15147 -13081 -2107 9286 13517 11621 6618 -2503 -13022 -16562 -9355
690 -9355 88 6884 12540 14220 6439 -6015 -12835 -12160 -9036 -1740 9779 16579 12433 3341 -4278
705 -4278 -11127 -14775 -9486 2527 11477 13580 11053 5037 -5359 -14833 -14562 -6527 1385 8161 14080
720 14080 12774 1913 -8948 -12961 -12277 -8884 320 12043 15270 9134 1310 -5104 -12087 -14066
734 -14066 -6210 5740 11839 12352 10627 3432 -8113 -14964 -11069 -3707 2305 9877 14657 9483 -1790
749 -1790 -9821 -12326 -11753 -6720 4247 13640 13225 6410 -344 -7601 -14097 -12557 -2415 7621 11739
764 11739 12260 9168 -298 -11055 -13758 -9120 -2074 5256 12475 14397 6898 -3607 -10108 -12073 -10840
779 -10840 -3704 7600 13643 10733 4714 -2024 -9894 -14917 -10354 -32 7838 11098 11497 6805 -3693
794c693q237J1M701O202Q361O774j303r124q613m751k169K698R277R691K840l661
810I004n702p642p978k025P301R029N819L545m34p562j0552n006J757M615O764
825I33Q878M548m643q691o784m694j641N319J0546P473P4l264n631r140o737J523
841a1931P726P485N342L541k540r587q863k726J752M726Q021Q432J494o047p381
856e56o184m500K25P418R816M605k74l052p144r186m001M044P238O059N623K163
872A2294n567j0072o509j284J980N542R416O469j631o463o441o037m433K970R625
887a41P818K815r0l762q797q182j029M691O095O517N582J66p649r076m203j088
903a0333J872O769R863L412l776n372n411o735k777N775Q830N521K133l38n394
$$ plain form
794 -3693 -11930 -11919 -7218 -1016 7345 14119 12816 3692 -4921 -9672 -11841 -9143 134 9825 12665 9004
810 9004 3302 -4340 -12318 -14343 -7042 1987 7806 11351 10917 3355 -7197 -12203 -10446 -5831 933
825 933 9811 14359 9716 1025 -5759 -10453 -12094 -6775 3771 11244 11318 8054 2423 -6717 -13454 -11931
841 -11931 -4205 3280 8622 12163 9623 36 -8827 -11553 -9801 -5075 2946 11378 12872 6825 -556
856 -556 -6740 -11240 -11015 -3597 6219 10824 10550 7498 354 -8832 -12833 -8789 -1551 4508 10131 12294
872 12294 6727 -3345 -9854 -11138 -9158 -3616 5800 12269 10638 4175 -2266 -8303 -12736 -9766 -141
887 -141 7677 10492 10402 6640 -2157 -10339 -11368 -6677 -582 5935 11517 11683 4034 -5042 -9245 -10333
903 -10333 -8461 -1692 8171 11583 7807 2435 -2976 -9711 -12488 -6713 2117 7638 9771 9433 4039
918D039r345n978J463N336N624O219M988k834q728p122l025r53L830Q946P788
933A0248P46m185n342o605o296J2P182P712M408J969j123p470q997l540K575M660
949d046N612P918K784m962q003n394l027m35N163R541N497j287l896m968o999
964f502n267K681P622N897L177K259l007q779p322o52K474M518P263O546N2o379
980D581p226m221k806Q15P575Q966L085k751l288o008p732k538N202O253N396
995E303L653Q76n085q762n198r4K627N205P599N016k068p054n813l787k940L136
1011g386Q599P060Q39j796l606p595o358P94N315N713M539L792j116o910p663
1026e779l258N71K699O340P734K894m753o256m927m780j191O185Q365M039Q54
$$ plain form
918 4039 -5306 -11284 -9821 -4485 1139 7358 12346 9512 784 -6338 -9363 -10316 -6486 2460 10248
933 10248 10994 6809 1467 -5138 -11434 -11422 -4240 3472 7880 9849 8726 1256 -7741 -11281 -8706 -4046
949 -4046 1566 9484 12268 7306 -697 -6091 -9118 -9553 -4390 5151 10648 9361 5465 497 -6502
964 -6502 -11769 -9088 -1466 4431 7608 9867 6860 -1919 -9241 -9893 -7419 -2901 4362 10908 10960 4581
980 4581 -2645 -6866 -9672 -8857 -1282 7684 10769 8018 4730 -1278 -9010 -11548 -6346 -93 5303
995 5303 8956 9832 4747 -4015 -9213 -9307 -6680 -1475 6124 11140 9072 2018 -3795 -7582 -10522 -7386
1011 -7386 1213 8273 9112 7316 3710 -3885 -10243 -9449 -4134 1579 6118 9910 8794 1884 -5779
1026 -5779 -9037 -8466 -5767 573 8307 11201 6448 192 -4735 -9515 -10706 -4521 3844 7883 8737
1041H737j472n383p800m147K333N159N232M738K992k994p920o318j175k24L372
1056d870Q084O511m23m769m658o004m276J768P117O275L326Q5k552o257o976k153
1072i772L595M586M953N344J700n760p449l844j665L31O016Q298L141j776l714
1087C984n297o090k762L482P139N257K304J24l510q077n852J021L421L580O008
1102D732N125j518o641n043l404k302K397P131P173J563k430l964n523o054r06
1117i664N738O047L434K441J5n887p656k923J220K529M884O611L011l653o110
1132C7m041l391j437L915Q030M811r6k307l598o743m913K220N368M784L442K402
1148H483j665p123o245j396J662K676N572O914O20n507n235l320l838j02O084
$$ plain form
1041 8737 7265 1882 -5918 -10065 -7732 -2573 2659 7397 10389 7395 -525 -6843 -8018 -8242 -4870
1056 -4870 3214 9725 9302 4533 -125 -6129 -10405 -8637 -1520 4755 8081 8166 5614 -643 -7619 -9772
1072 -9772 -6177 -1591 3362 8706 10406 4646 -2803 -6647 -8312 -7981 -1965 6333 9474 7698 3984
1087 3984 -1313 -7403 -10165 -6683 456 5713 8017 8141 4631 -3446 -9298 -8277 -4856 -1276 4732
1102 4732 9857 8339 1698 -3345 -6749 -9051 -6654 477 7650 9213 6783 2819 -2704 -8758 -9664
1117 -9664 -3926 2121 5555 7996 8011 2124 -5532 -8455 -7235 -4706 178 6789 9800 6147 37
1132 37 -4004 -7395 -8832 -4917 3113 7924 7828 5521 1923 -4820 -9733 -7513 -2145 2639 6081 8483
1148 8483 6818 -305 -6550 -7946 -6284 -3608 1964 8878 9498 3991 -1244 -4564 -8402 -8504 -2420
1163b420P055K794l01j724n545o738k678L342N125M160L839J981l845p436m274
1178f665r5O11L208P421M987k382m477l825m445l496K507O516N435J573k50k690
1194C933o007n842o83M502M155L690M495K07n995o518k145n40J054N269P155K120
1210H850k666m201m428m565j993M368O504M024J004l15l617o894m807J620M045
1225c071L465M612L698k047o731m466j791r82K435O520N504L07k839l330m684
1240c400m368K00N241N320L004J411j253n483o678j836K142L075M267N290J609
1255H541m311n584l366k516j95M299P099L529r76k466l838n312l434K330N530
1270f70M295K564J527k770o556n051q4J859K993M878M977n94m804m455l177k005
$$ plain form
1163 -2420 4635 7429 7128 5404 -141 -6879 -9557 -6215 -1090 3070 6909 8890 5045 -2391 -6665
1178 -6665 -6760 -6149 -2941 4480 9467 7085 2608 -1217 -5662 -9158 -6651 -135 5300 6873 6623 3933
1194 3933 -2074 -7916 -8599 -4097 58 3748 8243 8450 2455 -4063 -6208 -6748 -5694 -425 6730 8850
1210 8850 6184 1983 -2445 -7010 -9003 -4635 1869 5893 6897 6582 2965 -3929 -8736 -7116 -3071
1225 -3071 394 5006 8704 6657 -74 -4540 -6331 -7313 -4878 1642 7146 7453 4614 1284 -3400
1240 -3400 -7768 -7568 -2327 2993 5997 7408 6155 672 -6006 -7842 -5700 -2625 1642 6932 8541
1255 8541 4230 -1354 -4720 -7236 -7431 -3132 3967 7496 6520 4054 216 -5096 -8530 -6200 -670
1270 -670 3625 6189 7716 4946 -1610 -6661 -6745 -4886 -1893 2985 7962 7368 2564 -1891 -5068 -7073
1286g073O60N832N900J673j388k179m815n415j356M018M583L478K709P68m687
1301B708o379k860M45J555L959N897K933k716m233l455l565j708K733O327L853
1316E494M38m91k799n878m880J302L920L569L436L055r86n634n036j549K13J892
1332c934N001N685P39l412l437l250m021p57M838N569K455N74p32m135o475k515
1348g807K512L296L330M037K494l310n892l413j361J28L122N751M056r05k910
1363C128l148l979l419J128N561M497J572Q84j280n649n446m04K543K800L800
1378B588M139P00n020m849k047j553K40M465N976K010j776k611l089m592k230
1393g649L104N417L117J470O97k844o099l458J002J939K559M692L687j950m742
$$ plain form
1286 -7073 -6413 -581 5319 6992 5604 3425 -1390 -6805 -8161 -4143 440 3918 6627 7395 2708
1301 2708 -3671 -6531 -6086 -4531 -572 5325 8258 5542 1309 -2146 -5711 -7419 -4686 1641 5494
1316 5494 5932 5441 2642 -3236 -8116 -6814 -2894 675 4111 7166 6180 546 -4490 -6039 -5826 -3934
1332 -3934 1067 6752 7491 4079 642 -2608 -6629 -7386 -2548 3021 5476 6050 5318 1183 -5292 -7807
1348 -7807 -5295 -1999 1331 5368 7862 4552 -1340 -4753 -6114 -5986 -2864 2887 6943 6038 3128
1363 3128 -20 -3999 -7418 -6290 -729 3768 5340 6224 4944 -705 -6151 -6555 -4012 -1212 2588
1378 2588 6727 7427 2407 -2442 -4489 -6042 -5802 -1337 4639 6649 4873 2262 -827 -5419 -7649
1393 -7649 -4545 872 3989 5459 6156 3312 -2787 -6245 -5243 -3304 -745 3947 7634 5684 942
1408I42l759k100j488J203N856M575M94j815j905m088m722nM419L920K382K280
1424F189q4m882n374j504Q77J699L874M497J761k521m653k980k067j283L026N999
1440B574L080n83j170k715m978l623K052L968K794L105K042j890m912m525p98
1455e579Q05K210M370M488K0l588l114k793k870J19N006M560J475L7j160m104
1471a18n158j203K383L170L083K666J369l115n149k778m17N52L029N356K922j602
1487D990l023k824l675j947K378M853L164J297J96k160n101l809P1K419K944L079
1503B852L118m23m550l828j460r57P53M399M999Q57k271k079l129l820o37L710
1519b466M224K329Q00M2l099n427k256J708J705K751M116K312k650m061k720j782
$$ plain form
1408 942 -2817 -4917 -6405 -5202 654 5229 5723 3908 2003 -2085 -6807 -6812 -2393 1527 3909 6189
1424 6189 6105 1223 -4151 -5655 -4778 -3079 795 5292 7053 4532 -121 -3101 -5168 -6451 -3425 2574
1440 2574 5654 5071 3901 1186 -3792 -7415 -5363 -1395 1399 4504 6546 4656 -256 -4781 -5579
1455 -5579 -4774 -2564 1806 6294 6314 2726 -388 -3181 -6051 -5932 -926 3634 5109 5146 3986 -118
1471 -118 -5276 -6479 -4096 -926 2157 4823 6192 3077 -2072 -4850 -5267 -4715 -1686 3670 6592 4990
1487 4990 1967 -857 -4532 -6479 -4101 752 3916 5213 5409 3249 -1852 -5661 -5590 -3171 -227 2852
1503 2852 5970 5547 997 -2831 -4291 -5248 -4495 -96 4903 5760 3489 1410 -1719 -5539 -6176 -2466
1519 -2466 1758 4087 4887 4929 1830 -3597 -5853 -4145 -2440 311 4427 6739 4089 28 -2692 -4474
1535d474j314K489N239L063J07j797k525l841l286P20M376L704J397J396o84m548
1551B2m609m06J248J528L693M325J05k853l702k595k185L52L066M772K265q07
1567D219j720k409m204k923L184L392K158K589J578k721n401k025k5M38K543M009
1583B682L160o31l389l005k017j975K84M492M740O20j312o71m070m480k1L093
1599b500K542K232L322o98l510l817k081J22J187K724M249K198k282l119k118
1614a549k384k045K575N035K422L14J36k540m644k710R23K661K552K735J764r97
1630D248m031l627r49J62Q04M186M461j41k775j976k386l426M08L788L080J996
1646C822R55r58l251m241j377J437K465K485K930J190k587m157j882o99o00K092
$$ plain form
1535 -4474 -5788 -3299 1940 5003 5110 3313 788 -3053 -6339 -5619 -1243 2461 3858 5254 4570 22
1551 22 -4587 -4993 -3745 -2217 1476 5801 5906 3053 -649 -3244 -5429 -5077 -2011 2761 5026 4219
1567 4219 2499 90 -4114 -7037 -3853 -461 1697 4286 5864 3143 -2258 -4283 -4308 -3870 -1327 2682
1583 2682 5842 5211 1822 -1183 -3200 -5175 -4891 -399 4341 4961 3649 2978 -1092 -5572 -5593 -2500
1599 -2500 42 2274 5596 4898 1388 -2429 -4510 -4388 -3201 -477 3772 5970 3688 569 -1549
1614 -1549 -3933 -5978 -3403 1632 4054 4368 4504 1964 -2680 -5390 -4467 -1806 746 3481 5245 4248
1630 4248 217 -3410 -4359 -4197 -3393 793 5254 5113 2338 362 -2024 -5450 -5042 -1254 1826 3822
1646 3822 4777 3819 568 -3673 -5050 -3613 -1148 1337 4267 5457 2870 -1287 -3169 -3868 -4468 -2376
1662b376N077K499j107j716k165l488k239J427L876K809J471N23j261m242l320
1677d232k51J490J703K998L378O7l655k872j796j421N54L814L624J060r17j558
1693A986k937l161j266K384L412K073J502O09k669m358k026P17J353J743L847
1708C209K115j472l290j911k309j043J641L932K979L29r79j887l323l503R69K712
1724a831K529J788K068n76l493l674q09L64J086L159L538O02j901k838j955k077
1740d020o19K919L582J937k41n19k317l903j545J200K426K280K097J471j610l998
1756h60k401l41K92J485L741K632o55k231k040k222j889O33L317L115R67K55r79
1773B819l260l477k43J639K006K163K326N31l051l128j451o13N52K247L702J607
$$ plain form
1662 -2376 2701 5200 4093 2377 212 -3276 -5515 -4088 -212 2597 4068 4591 3330 -912 -4232
1677 -4232 -4483 -2993 -1290 1708 5086 5153 1498 -1374 -3170 -4591 -4037 -223 3401 4461 3544 1986
1693 1986 -951 -4112 -5378 -2994 418 2491 3993 4602 1933 -2425 -4451 -3734 -2381 -638 3209
1708 3209 5324 3852 562 -1349 -3658 -4701 -3060 872 3851 4180 3201 1314 -2009 -5512 -4543 -1831
1724 -1831 698 2486 4554 3978 485 -3189 -3998 -3634 -2548 611 4149 4751 2850 12 -1943 -4020
1740 -4020 -4639 -1720 1862 3799 3558 3039 722 -3181 -4726 -3526 -1100 1180 3277 4748 3138 -860
1756 -860 -3261 -3602 -3310 -1825 1916 4548 3893 1662 -378 -2600 -4489 -3856 -539 2576 3543 3798 2819
1773 2819 -441 -3918 -4161 -2522 -516 1647 3973 4504 1453 -1675 -3126 -3739 -3187 -940 2762 4369
1789D369j212j754k180k471j539K061L412J947P34P49k034l752k733R47J625J592
1805b39K604K277q78l093k767j135r23J007L633L069M69j609j497k300k808j49
1821d339K699K779J360J425k01k791l673j340J045J339K047L083R04j727k947
1836c37j641j331q32K344L431K137l23j111j653l225k051J083K871K215J040J313
1852C930r04l553k831l43R12J284K728K874J22k505k392j561j370L93K515L233
1868B532J199o22q24k389l222q43J769K258J605J914N19k126l294j779j6O59J657
1885a003L269J973q74k245j916j910j384R57L609K353M29Rj518l108k495K61J782
1902a811K061J762J877m41k536k962j151P6O78K559K998Q31j440j968j712k290
$$ plain form
1789 4369 3157 1403 -777 -3248 -4787 -2726 686 2633 3367 4116 2082 -1670 -4403 -3456 -1831 -239
1805 -239 2365 4642 3764 671 -2096 -3231 -4154 -3147 486 3555 4024 2415 918 -1382 -4190 -4339
1821 -4339 -1640 1139 2499 3924 3723 932 -2741 -4081 -3036 -1697 350 3433 4337 2610 -337
1836 -337 -1978 -3309 -4141 -1797 1634 3771 3448 2337 684 -2541 -4592 -3509 -638 1577 2617 3930
1852 3930 3026 -527 -3358 -3701 -2789 -1505 1223 4097 4219 1714 -678 -2239 -3609 -3216 -701 2532
1868 2532 3731 3109 2285 -104 -3326 -4169 -2400 -142 1463 3377 3896 1770 -1524 -3303 -3319 -2660 -1003
1885 -1003 2266 4239 3365 1120 -796 -2706 -4090 -3133 476 2829 3258 3267 1749 -1359 -3854 -3593 -1811
1902 -1811 250 2012 3889 3448 912 -2050 -3201 -3125 -2447 112 3110 3941 2501 533 -1179 -3469
1918c469o22K235K983J632K56j48j874l222j563R40J467J971K082J372j252l135
1934c47j652j051k93J300L112K342q7j502j470k316k062O25K691K212J286M57
1950C245q80k327k739q95J097J561J762K671L42k035k511j565o43k48K093L142
1966B070J144m88j083k065k265j269J248K458K014J065M60j201l316k024L68Q56
1982b028J229K692J837q41k126j506j826q68R75K714K321N74n39j286k342k146
1998c166l38J859J992J668J194n9k217k907r12J6P75K176K551Q92j268j834j602
2015a180j167r41J415K604K201j59l41j627k519j559M95J901J457J765R54p66
2031B533k680k026p83K6J341K122K571J24j777j588j409j823K0K581K475Q35L30
$$ plain form
1918 -3469 -4091 -1856 1127 2759 3015 2867 993 -2229 -3792 -2852 -1385 586 2668 4040 2788 -347
1934 -347 -1999 -3050 -3343 -2043 1069 3411 3324 1822 352 -1964 -4026 -3401 -710 1502 2788 3245
1950 3245 2365 38 -2701 -3596 -2499 -938 824 3495 3837 1802 -709 -2274 -2917 -3165 -1072 2070
1966 2070 3214 2726 1643 -422 -2687 -3956 -2708 -250 1764 2829 3289 2088 -1228 -3252 -2884 -2028
1982 -2028 -799 1893 3730 2889 763 -743 -2569 -3437 -2462 252 2573 3147 2608 1322 -1020 -3166
1998 -3166 -3504 -1645 347 2015 3209 3150 933 -1974 -2886 -2870 -2095 81 2632 3524 2256 422 -1180
2015 -1180 -2347 -3288 -1873 731 2932 2773 2432 805 -1714 -3273 -2778 -877 580 2345 3299 2533
2031 2533 -147 -2173 -2956 -2930 -1589 533 3104 3228 1451 -137 -1546 -3369 -3349 -768 1707 2542 2872
2048B872q41j931k726o89J133J500J495J876N90j398k542j683k76J60J543K571
2064A654J832p12j627j398j818j362Q63K619J853P09K80j377k517k231K15J396
2080a621J283J808J675k14k031k253r02l36K31K178K407Q41j098p66j826k014
2096b638p91J785K158J609M00J5j649k379j666O65J275J148K139J319j142k254
2112fj340r08q11J357K361J918J42r37j373j705j575M3J743K117J005P23m4k261
2130D49k867l58P22J087J579K205M49j609j783j650j196L89J660K168J482l26
2146B401r21j329k170r99O55K019J443J006J066j412k239j562l81M03J390J980
2162A350J627l44j494j663j419q84O31J954J932P11j95q94j472k386k78J097J595
$$ plain form
2048 2872 2031 100 -2626 -3315 -2182 -682 813 2689 3279 1881 -661 -2344 -2620 -2460 -917 1654
2064 1654 3486 2774 1147 -251 -2069 -3431 -2568 51 1904 2613 2893 1516 -1001 -3232 -3017 -1621
2080 -1621 -338 1470 3145 2931 900 -1353 -2255 -2591 -2360 -182 2225 3066 1968 1202 -624 -2638
2096 -2638 -3429 -1644 514 2123 2523 2538 889 -1490 -3156 -2491 -1216 -68 2071 3390 2248 -6
2112 -6 -1346 -2254 -3065 -1708 653 2571 2713 1776 403 -1302 -2877 -2834 -1091 1026 2031 2754 2710 449
2130 449 -2418 -2776 -2054 -967 612 2817 3266 1657 -126 -1776 -2972 -2583 -923 1245 2727 2401
2146 2401 1480 151 -2019 -3018 -2363 -344 1099 2105 3171 1759 -480 -2042 -2423 -2020 -630 1350
2162 1350 2977 2633 1139 -524 -1943 -2827 -2196 -242 1690 2401 2206 1312 -160 -2546 -2824 -1727 -132
2179a32J504J159K12j953j966j076j39M02J826J986J033p72j542j275j376o28
2195b737J000K456J162M01l81o29k706j350N04J064J345J499J219m85k406j650
2211a694m41j29N46K125K085K64j042j420j535j021l78J679J920J077M40l17j532
2228F27k332j080O59J328R89J953P36j383k084q56n09m21J212K342J511l73r34
2245A385j367j445j303M32K083J440O15O69q49k185j807j03J030P10J739J401
2261B445J26j690j781j069l29L34J726J796Q87m57r85j414j657m78J004J637J031
2278A126R74J54j207k170j136L23N39J100J934J020n48j695j417j053n06Q15K179
2295D32J573L87n84j179j409j818M1J859J174J161Q17m26j716j934n59J77J022
$$ plain form
2179 -132 1372 2531 2743 790 -1176 -2252 -2391 -1989 -163 1823 2856 2084 542 -733 -2109 -2737
2195 -2737 -1737 719 1881 2282 1901 1272 -1434 -2784 -2280 -1216 129 1628 2847 2362 -44 -1694
2211 -1694 -2135 -2264 -1718 407 2492 2756 1714 294 -1241 -2262 -2640 -961 959 2036 2476 2159 627
2228 627 -1705 -2785 -2126 -798 191 2144 2880 1497 -587 -1443 -1952 -2373 -1161 1181 2692 2319 1385
2245 1385 18 -1427 -2730 -2298 -215 1225 1840 2509 1660 -525 -2332 -2435 -1405 -695 1044 2445
2261 2445 2571 881 -900 -1969 -2298 -1964 -238 1558 2445 1988 1003 -411 -2068 -2546 -1542 95 1126
2278 1126 2100 2254 1047 -1123 -2259 -1936 -1397 -297 1637 2657 2109 414 -1003 -2056 -2562 -1747 432
2295 432 2005 2392 1808 629 -780 -2598 -2557 -698 476 1637 2454 2028 312 -1622 -2181 -2004 -982
2312i82J402J500P10j080j423j324j137j67J543J714J320j20o24q08k151j006
2328b633N81J292J462J032O88p57k108j529j20K15J087J749J244Q3j091j416j128
2345a349j038L1J949J738P70K29r83j537j681n90R44J583O69J472o2r61j869j185
2363a870o8L43J143K041R99p53j263r69j144j121J229J729J051P10k1q05j974
2380g43j275k40J065J228J130J423n96j836j196p84l34O55J543J928mn27r74j504
2398a041j087r9J172J687R41M70k67j399j563r68L06R10J172J530L51m61j563
2415I1j425n35l93J155J810J256j21p56p69j357j324N30J456J174O69M70n30j653
2433b52j657m3M29Q65J416J486K2j235j289j090n77R2J436J639R62m73n51j016
$$ plain form
2312 -982 420 1920 2630 1550 127 -1197 -2334 -2501 -958 756 2076 1956 1332 524 -1627 -2633
2328 -2633 -2052 -760 702 1734 2422 1665 -443 -1972 -2092 -1877 -790 959 2203 2286 1195 -221 -1349
2345 -1349 -2387 -2356 -407 1331 2101 2330 1347 -190 -1871 -2461 -1517 66 735 2207 2145 1184 -685 -1870
2363 -1870 -1938 -1595 -452 1589 2588 1835 572 -397 -1541 -2662 -1433 296 1347 2057 2036 1231 -743
2380 -743 -2018 -2258 -1193 35 1165 2588 1992 156 -1040 -1824 -2158 -1503 40 1968 1964 1437 463 -1041
2398 -1041 -2128 -2227 -1055 632 1573 2043 1776 377 -1186 -2154 -1848 -938 234 1764 2115 1654 91
2415 91 -1334 -1869 -2262 -1107 703 1959 1838 1082 313 -1044 -2368 -1838 -382 792 1461 1931 1401 -252
2433 -252 -1909 -1952 -1523 -658 758 2244 2266 1031 -258 -1348 -1925 -1833 -397 1242 2204 1731 1180 164
2451A64j902p72J009J373J097J001K16j090j884j072N8L18J030J706R73j67j441
2468F17j080j120l43M31J521J510M52l40o13j741j115m31J280J062R51Q72j44
2485A769r97j950n11n8O72P37J761J102j009j129r81j155o74J204J807J043K71
2502A902m44q22j607j205L54J214R49J034N80l07j774j306p5J06L18J410J778
2519B105r4q93j014j093j037Q1J418J487M17M92l48j277j699o42Q79R97Q63P21
2537A363Q54r13j834o96m34J85O82J668J165m63q56j068q78q81O73J345J144Q38
2555A894j21o20j614j390Q1N81P53J400J163k46j327j187p16l17M2J400J641M65
2573A882l12q12j226j299j34O39J490Q95L72L62j296j526q55J18N54R54J651R41
$$ plain form
2451 164 -1738 -2510 -1501 -128 969 1970 2186 1096 -788 -1860 -1802 -1484 -454 1252 2225 2058 617
2468 617 -463 -1583 -1926 -1495 26 1536 1988 1648 1035 -706 -1821 -2252 -972 90 1041 1913 1769
2485 1769 772 -1178 -1689 -1747 -1075 -338 1423 2525 1516 387 -594 -1749 -2423 -1219 588 1631 1902
2502 1902 1458 636 -971 -2176 -1822 -608 341 1375 1955 1648 -126 -1432 -1507 -1401 -1083 327 2105
2519 2105 2011 1118 104 -989 -2026 -1945 -527 960 1377 1869 1521 244 -1455 -2097 -1218 -221 642 1363
2537 1363 2217 1304 -530 -1226 -1660 -1475 -793 875 2040 1577 721 -347 -1225 -2106 -1433 -88 1056 1894
2555 1894 1773 1153 -461 -1851 -1770 -1189 -436 964 2127 1881 554 -633 -1349 -1666 -1624 -224 1417 1882
2573 1882 1570 758 -468 -1767 -1901 -1262 228 1123 1495 1857 561 -965 -1820 -1702 -1148 -194 1457 2398
2591B398j061j049j002p74j88K48K025Q72K45l10j068j042j240N5J404R95P36
2608A244N63k93j347j712j17k5J087J115J348j4q89j163q72k81l86J126J398N04
2626A286L69m84j016j485o92P29J174R99O45O26q95j760p08j38J2Q34J360J007
2644A863k24j017n88j107q24L91J371J158N79j78l39j363j286k63N92R36J084
2661G85R73J15j218j500l46n03N07J001J465M82n51o62j032r18p35R18J702P88
2679A271l3J9l59j735p89N4Q30Q21J011J056n42j287j077o58Q9J15J386J232O5
2698A469k76r25p14j339n6J246J250M98K23J20j066j586m10K74R39M97J465K93
2716A902q24j323o64p47L60Q96J056Q85o8o03o05j129r20L82R95J190N65R2l80
$$ plain form
2591 2398 1337 288 -714 -1488 -1676 -1428 597 1469 1714 1404 336 -706 -1946 -1891 -487 508 1244
2608 1244 1807 1514 167 -1545 -1662 -1687 -600 515 1863 1849 960 -203 -1075 -1356 -1742 -616 782 1286
2626 1286 1655 1171 155 -1330 -2022 -1293 -119 880 1525 2151 1256 -504 -1212 -1350 -1338 -504 856 1863
2644 1863 1639 622 34 -1073 -1897 -1506 -135 1023 1602 1424 1085 -278 -1564 -1827 -1235 -299 785
2661 785 1758 1873 655 -845 -1191 -1694 -1187 -186 1279 1761 1210 548 -484 -1402 -2137 -1219 483 1271
2679 1271 1238 1257 898 -837 -1626 -1572 -742 79 1090 2146 1604 317 -760 -1418 -1329 -1214 172 1404 1469
2698 1469 1193 268 -446 -1785 -1841 -595 655 1153 1376 1496 430 -1156 -1566 -1292 -353 144 1609 1902
2716 1902 1078 -245 -909 -1656 -1296 -400 656 1541 1473 870 265 -864 -1784 -1402 -407 783 1348 1440 1060
2735A060j341j357J41L81O76Q34J450k27j092r79o35l81o0J111J486L11k54m33
2753F91o22j460n51J020P79P17R22j16n65j353p90j39L35J121R41J007o37r14
2771C86r13o19m62M66J064J388j85L6o31j098j123n3J136P23Q04P23k37j029j256
2790h80l52j66M60J005J227L63o90r27n58p84l42J193Q56P56J1L9p31j448p55
2809a723O04N62R13R15O24r59j121r89n5J76N33J196J166k70j074m08j084p02
2827a696L91R75J201K70K50m32r59j194k43K77P97J071P30K32j039j063o40p7
2845a149J7P52J110R96k25p19q85q73o37N68J068N78N26L73n15j357j112P8P00
2864g06L76J338O40l46r50j110m65m78P03R47R73M46o54m34q29r30K1J024P27
$$ plain form
2735 1060 -281 -1638 -1497 -1116 -440 394 1844 1617 525 -454 -1089 -1470 -1530 -419 1067 1378 1124 691
2753 691 69 -1391 -1942 -922 -143 574 1496 1380 815 -538 -1328 -1467 -1132 -11 930 1937 1300 386
2771 386 -527 -1146 -1608 -1142 -78 1310 1125 1161 530 -568 -1691 -1744 -608 115 919 1642 1405 376 -880
2790 -880 -1232 -1398 -938 67 1294 1657 967 40 -518 -1302 -1644 -451 405 1161 1172 1211 480 -968 -1723
2809 -1723 -1119 -557 356 1271 1895 936 -185 -1174 -1229 -1053 -520 676 1842 1572 498 90 -994 -1696
2827 -1696 -1305 -330 871 1141 1391 959 0 -1194 -1437 -1160 -363 708 1438 1670 631 -432 -1072 -1149
2845 -1149 -1132 -380 730 1726 1501 782 -103 -976 -1613 -1045 23 601 1127 1500 985 -372 -1484 -1406 -706
2864 -706 -330 1008 1648 1302 352 -758 -1223 -1701 -998 -51 922 1368 714 280 -549 -1479 -1458 -434 293
2883B93O30L72J47j119j294k64L28L73R69N47O45n25j086o97n84p0P26R80Q48
2902A219K3l36n57j121n97j09J072O91P83L30k59j455r11L9K51L01R87J155j93
2921A313o61r52m24l93k93R75J182M04k2k53j027j332J83M55P73M58O93L55p19
2940G15j303n08K08n9L56J575P92o33r39m94q24l55K40J234P50M34qm61r48j270
2960a498L97L00O24P34P01Mj137j061j01j48L56P81J431J54o13l90r98p44j26
2979a334O75J127L61K03R0o76j218o01L54M22O06O68P12n93o93q62k71j50N93
2998e87J289M65N0l01p52q69o99K14R49P14L93N42m09j154o97j34Q4M15J169O27
3018A309J03o46r33q18m9k38P91J346O28m41m82n58r60o55O08P82L70P66M06o41
$$ plain form
2883 293 923 1295 1442 323 -971 -1235 -907 -534 435 982 1627 1102 16 -681 -1265 -1335 -609 371 1219
2902 1219 1242 906 349 -772 -1369 -1478 -406 285 1068 1398 1139 -316 -1227 -1188 -937 -636 351 1506 1313
2921 1313 652 -300 -724 -1117 -1410 -435 747 1151 1129 876 -151 -1483 -1300 -845 -72 386 1079 1434 715
2940 715 -588 -1096 -888 -947 -591 984 1776 1143 204 -290 -1114 -1469 -1229 5 755 1189 1181 720 -228 -1498
2960 -1498 -1101 -801 -177 557 1258 1262 125 -936 -1037 -1185 -829 -48 1383 1537 924 534 -464 -1208 -1334
2979 -1334 -659 468 829 1032 1122 446 -772 -1373 -1019 -597 9 677 1389 796 103 -759 -1030 -1180 -587
2998 -587 702 1167 1217 916 164 -705 -1404 -1190 -241 473 866 1408 999 -155 -852 -986 -902 -487 682 1309
3018 1309 1412 766 -167 -985 -1034 -1272 -481 865 1493 1052 570 12 -948 -1603 -995 -213 157 923 1329 688
3038F88j176m89l06M80O55J170P02m93q74o74n98k89K0J434P65J54l44m54n84
3057b13j261J77Q24N27M18M99J64n76j022n47j1K59P28R66N88o26p16k79o89n09
3077a299O74R25O69J61Oq06q70q25K80P19M38N77P93k70j286n43l29k38M54J119
3097C49P43M05p47n91o76n72j72R54Q65M22l1k5n67j258m28L68N75O74N82O09
3117A479q99p55m76n34K24M12J222N55l35l05n57p86m39K10Q19P39K01K62l05
3136G32j155n45n9M33M57P31Q24k09o86j061m80k40K15P46J033N29m10n6q91r33
3156a025j49N96R25K55K74M52j085r09n10K06M11L74Q41P35o42p03n96l13k71
3175a134N50Q25N61L50m40m90o88o85j38J083K47N93L29J08q25j180J23k3K30
$$ plain form
3038 688 -488 -977 -1283 -803 -148 1022 1724 1231 357 -317 -915 -1204 -1184 250 1015 1169 825 371 -213
3057 -213 -1474 -1297 -473 54 472 971 1135 559 -463 -1010 -1021 -762 -34 932 1520 894 178 -101 -790 -1299
3077 -1299 -625 300 969 1130 1136 330 -540 -1365 -1085 -366 72 649 1442 1172 -114 -657 -986 -1224 -770 349
3097 349 1092 1497 750 159 -517 -1089 -1261 -307 558 980 949 924 357 -901 -1329 -961 -386 288 870 1479
3117 1479 580 -175 -651 -1185 -961 -549 673 1228 893 588 31 -755 -1194 -984 -165 574 775 1037 732
3136 732 -423 -968 -1027 -594 -137 594 1418 1209 523 -538 -1018 -1258 -1043 -297 736 1265 855 799 -92 -1025
3156 -1025 -1174 -578 347 602 876 1328 243 -666 -1176 -970 -559 -185 656 1391 749 46 -550 -863 -1134
3175 -1134 -584 241 802 1152 712 222 -466 -1151 -1289 -206 41 634 963 1071 246 -934 -811 -834 -604
3194f04P77Q51L02n95r18m11k80k22P10P18P71j14m94m44p52p89N97Q75K23O77
3214H78K60k51q69q91m6K92M23P80R18o03l97q37n28n0j85Q22R06L06j10m20n80
3235a82n28o27P26Q98M6N91L47o57r29l17j48j85P49J069L79p57r1m93p26l95
3255a230R50M61N37K93r5j67j047p59K17M91N30O52L76o2j037n84j73m18L01J120
3275C56L94K85l01n51p83o63J49P67M67M57M20j1o64j130l15K94N29L28P62L49
3295A139m07q16m35l56j2M13Q51N73m0k63o87n23m79K49O93M20N01J52k43q41
3315a11p16m2K79P3R70N11L62j010o87l24j82k12J104M74M45k11j9p01r49q3M89
3336e40N07L85N43J28j85j335o57J24K67N67Q51M22l63m78o62k93k07N7Q08N57
$$ plain form
3194 -604 173 1024 1326 731 -187 -598 -878 -1100 -390 328 1099 985 491 47 -705 -1494 -897 -22 201 878
3214 878 1138 887 18 -873 -919 -627 -204 576 1494 891 494 -343 -871 -921 -1106 -284 622 928 818 398 -182
3235 -182 -710 -1337 -611 287 333 924 1271 614 -315 -632 -780 -965 -216 853 1232 475 384 -109 -835 -1230
3255 -1230 -280 181 718 1011 916 749 -298 -1057 -840 -349 181 833 1209 1147 110 -474 -647 -1065 -764 356
3275 356 750 1035 734 183 -600 -1263 -1114 -347 120 577 997 986 322 -808 -1123 -829 -300 28 790 1139
3295 1139 732 -84 -519 -875 -887 -474 377 950 910 647 -40 -563 -1042 -793 -100 320 821 973 730 -111
3315 -111 -827 -869 -590 -517 453 964 1326 316 -371 -695 -877 -1089 15 489 934 723 704 3 -946 -1029 -540
3336 -540 -33 352 895 1023 838 -497 -1154 -1030 -763 -196 655 1077 714 236 -426 -719 -926 -869 -61 496
3356D96N94j4o64p01q52K34M07N13K48R56l02n44r08j02m0J24O23P79L68l71m51
3377C93p51k79m50O18P28L07J56N5m69p76p57N08M67M08M76L37j66r38m61r0k36
3398i20M58R08M40l8m61k84n38o22K8O87Q80K0L66l6n65j146l07N71L44N33N23
3419H41J5n07n29p67O7Q3O50O63K92j45n9q89k34m48L04P84M05J70K27j98p79
3440e4r47L1N16L16M61N76n9o11m85o16q9J5J307L16Jk5l09m51q22o6L54N49N03
3463D11L74J75r06o55m4r0L02K31Q45N43m69q60k70k68k62L32R82N07J01l17n28
3484A34m19m83j72Q22N76m6P26k92q02p74j12P3M44O25M66J48o94l81k48n75K
3505i82O46P60L05O2j09o71m84k95K38L20N33L47K48k66p96q11m3L92J42P88N85
$$ plain form
3356 496 1090 1076 412 -289 -1141 -907 -500 13 261 1217 915 371 -537 -639 -679 -555 68 847 1215 844 393
3377 393 -358 -637 -1087 -469 259 566 722 777 308 -468 -1225 -717 -250 158 634 971 805 -133 -594 -684 -920
3398 -920 -462 446 886 848 387 103 -435 -1057 -1029 -342 538 558 924 888 323 -823 -1130 -559 -215 318 841
3419 841 856 349 -180 -947 -880 -797 -147 516 808 663 604 -285 -519 -967 -663 121 526 696 923 725 -54
3440 -54 -1001 -970 -454 -138 323 899 840 229 -256 -872 -961 -946 361 677 678 653 344 -107 -929 -995 -641 -92 411
3463 411 785 960 54 -601 -645 -735 -433 -202 643 1186 717 -143 -413 -681 -943 -611 371 878 979 662 134
3484 134 -285 -768 -940 -118 458 412 1138 846 44 -730 -842 -769 -325 300 766 914 220 -161 -409 -984 -982
3505 -982 -336 424 729 791 682 11 -473 -768 -530 -210 323 670 918 652 -144 -955 -998 -606 -464 324 909
3526I09o4m94n01n01k64K19M44J038j48J93k23p26q56j47M48N87M16M04K64o77
3546C21n56n75l3K15N88O67L17p5l96o58n97nM32N49K39O1K50l73q97l29Q4M12
3568c59N24M34L31j60o24n52k37j17J30J044M28j43k12m21k86q59M06N59L57M00
3588F43N9Lo09n84k37k33N00O18M39M38l74n58q40l9n1Q16J46P15k78j77k80n87
3610d70n16N5R52M59J09L20k82r46j49j00j51M54N65Q28j95m48n66k13m59j06
3630h59P63N62J65K65j95r10m37j26M91K83K62O87m73l38k41o86j0Q4L83J090
3650G60L7j08n84k23l29m60L38N78P32K42j30n63q30m09K26L56L03M88N70l56
3670F38k29j000J86m07L01M76Q03J08m59m23k53n00m2M17O53K60OK48p15l79n65
$$ plain form
3526 909 845 351 -150 -651 -915 -696 -252 786 638 831 608 -118 -974 -1121 -673 -86 330 734 998 321
3546 321 -235 -810 -843 -628 -40 627 944 869 473 -185 -782 -787 -355 194 433 494 744 371 -526 -855 -771 -359
3568 -359 165 599 930 770 146 -406 -643 -760 -630 414 842 699 487 66 -220 -1079 -673 -114 243 643
3588 643 702 705 96 -488 -725 -958 -458 160 599 1037 663 105 -735 -774 -825 -9 137 852 574 397 117 -470
3610 -470 -986 -931 21 480 589 909 627 -319 -468 -568 -719 -265 300 1128 933 485 -81 -294 -753 -859
3630 -859 -96 466 631 896 701 -209 -646 -772 -281 2 264 951 478 140 -101 -787 -797 -713 -330 760
3650 760 797 689 105 -118 -447 -907 -569 9 741 983 853 290 -540 -949 -723 -367 -64 424 994 638
3670 638 409 -591 -405 -812 -511 -35 768 876 417 -6 -259 -759 -801 -384 269 529 535 783 68 -311 -876
3691h76K34J78P08K86M32k40j087k84N6q2J57J033L21l07P0o90k60n94K0R26M76
3712D77K80k42J25p34m65l83L43K09P47M16Q1l49n70n99k61L06L40P72J82k86
3732C89J50n99n74j36J38N20N07M18j88m08n36o10J77L63L59L98N91j20o45m25
3752b31m83o8J80L75P80J08k7m83n77m15k74Q10N98K39L07o5o53k83n79m8M07
3773c82M44O94L59n06n75m84k60j34N72N55K70m0m9k62n07q01L96N77L87K12L74
3794H40p7r21l94k97L20NP26L36K88l83m54k16n80J49M05P82K21j19K6p09n49
3815f01k48K86N10L47M89L29m71n71p85rJ30J82R28L04o5n43j67m62m48L56O25
3836A16N41k1Ql31o25k32j59L17K72O21K60j4m44p42r8k00J16M77R16J64m34p2
$$ plain form
3691 -876 -642 -464 244 530 962 722 -365 -649 -593 -675 -518 515 836 529 599 -91 -351 -945 -925 1 477
3712 477 757 515 640 -94 -559 -942 -599 -390 357 773 854 505 -65 -664 -925 -619 -279 493 675 389
3732 389 539 -60 -634 -770 -632 -112 395 813 625 217 -319 -929 -752 -389 -30 368 959 839 194 -231
3752 -231 -714 -782 -602 -227 553 661 634 151 -426 -841 -1115 -305 293 532 839 774 121 -162 -741 -789 -382
3773 -382 62 756 1115 609 34 -450 -710 -844 -272 283 553 513 464 202 -305 -1106 -710 -133 254 466 840
3794 840 763 -158 -552 -849 -529 -524 202 538 826 443 -11 -227 -807 -658 -253 529 750 631 657 -52 -601
3815 -601 -849 -563 -53 294 783 1112 641 70 -715 -724 -594 -412 516 820 755 212 45 -417 -865 -509 116
3836 116 657 636 644 313 -312 -544 -703 -386 -114 507 767 753 309 -433 -531 -731 -615 -138 778 942 508 436
3858D36m52p56L9J41P98L60J65l7l93n69l69Q7L16K98L13M94l72m11n53K5k66
3879g06J61P27N17j5j79m08n07l85j59O81M63M00J99j58p55m35k21K05P9O16P02
3900H22r5l65l09o79J18r2L28N78M03O1m07l17n55l15J71K00O92L59M95n95n95
3921i7n52k1K23M1O39N20L08p66j21n20l40m5Q96J83M28m7p3j146l41n8K63M86
3943a40M32M21K48m77q98R6l91J83M30N69M53k71m31m29l90p4j0P19L92o4K91
3964F59m42n87n50L3O92K62L63M45k55m56o76j74j10P00L43O00j43k36n08m63
3984e03l95oO70M63L74m1J19m15n17o73L21J62Q12K27K77n54l55l14k03k23K95
4005d79O78O62N5l01p18m09k60J79K37P93K46l2M3r15n46K33N4Q6O51N61R6n96
$$ plain form
3858 436 -16 -772 -733 -592 206 566 731 694 301 -268 -637 -550 -234 64 377 871 499 88 -465 -440 -706
3879 -706 -545 182 699 684 505 97 -410 -795 -954 -273 190 590 789 631 -124 -559 -780 -575 -496 120 822
3900 822 727 362 53 -626 -508 -600 -272 306 709 770 363 46 -509 -824 -653 -453 239 598 1093 498 -97
3921 -97 -649 -670 -447 -406 233 753 1061 295 174 -346 -686 -731 165 348 776 729 656 -490 -831 -889 -626 -140
3943 -140 292 713 961 484 -414 -318 -709 -526 -96 473 926 655 224 -205 -595 -669 -679 40 432 368 659
3964 659 217 -370 -920 -887 -195 67 430 875 620 164 -512 -686 -796 -96 247 847 704 468 -40 -503
3984 -503 -898 -904 -234 229 603 562 681 266 -251 -924 -603 -441 371 598 875 321 -34 -348 -551 -774 -479
4005 -479 199 861 916 615 -103 -512 -772 -593 -356 437 683 651 694 -221 -767 -534 -480 -394 257 818 914 318
4027C18l75l42l60L7P31N34J97k22m0n07n17LK5N39L31J91K59n94m64m72k61P16
4049b73mN58L80n7m20m95k03j99L19K78Q46k70J9j50n35m91J09L87K13N73O8J46
4071G99m29o49k65k55L41N37K80K49J14n16m15m65l74M37Q34M93N8k58l19n33
4091c36m67K93J74M01N99K71k29n60n72l93N02J87K76L95R1l23m48m30j79k98
4111a046M47Q47K74N8j94m31o08N8N7L95N46L39j79k62m57j76j75n8M06L12N80
4132G33k08j35k78n59l89N1P24L25N72k54l04l31m08k61J6P18L22L53K58n47m72
4153g4n87M6R7L26P93M4J86l36m83l95j81N8O82K32J44r5k8o96m78K46K03L61
4175F5M09K08m5n85m49j68l28N05N20L23L88m08k26m26n29j43O49N66J69L55n06
$$ plain form
4027 318 -57 -399 -759 -722 9 543 740 518 478 -29 -546 -543 -518 21 352 543 802 208 -256 -728 -989 -273
4049 -273 -277 281 661 604 184 -311 -514 -713 -394 -116 730 460 479 329 -206 -697 -588 -201 12 585 653 799
4071 799 370 -279 -544 -799 -458 79 359 608 722 206 -209 -674 -1048 -611 223 716 774 516 197 -336
4091 -336 -803 -510 -336 65 664 935 706 146 -426 -819 -317 -130 146 541 632 309 -139 -569 -748 -1046
4111 -1046 -599 248 522 580 386 -45 -653 -595 -538 -143 403 742 563 301 -156 -332 -507 -565 -159 153 733
4132 733 525 390 112 -447 -836 -785 -61 264 836 582 278 -53 -461 -722 -706 12 334 687 945 398 -74
4153 -74 -661 -615 -518 -192 601 645 831 495 12 -383 -564 -506 176 408 552 457 429 -267 -745 -499 -296 65
4175 65 474 682 637 52 -397 -565 -893 -388 132 455 843 435 209 -217 -746 -889 -240 326 495 850 344
4196C44j89p50j22K73J95M69J87L68n73j32l86j89k85L73M96M80K6n1m70o35k53
4217h24J95O95J39N71j18k88l51n37j88K37J11P15M11o9n05k4m71l17M8M67N26
4238D23J31J32k11m91m48n63M21N57L68P7K52l78o14m97K00J74J47R52J38j59
4258F11n64k32k85l55K39O28M24M9l7k17l93l68r3M50M90l5N02j88o46j91l08
4279e19j92M64M02M68J87k56l18j71p01K9L19O24K3K57N2l65o24m74K52L39L22
4300A18L86L64m97k89n18k05K75OO64K12j11J36k53n37p10M00M10N01m9K79J38
4321G20n98p18N3j40J12O76M93J56n03j77l71j01q8J99P43o2K82l66k44m79l28
4342g41L68K00L73M10J75l97l24m35l16K68J97N01P60n53l55k50k64l57K53M95
$$ plain form
4196 344 155 -595 -717 -444 -249 220 407 775 202 70 -316 -505 -790 -417 79 559 585 534 64 -571 -824
4217 -824 -629 66 205 776 658 370 19 -518 -706 -469 -358 357 768 699 194 170 -301 -618 -570 -103 423
4238 423 554 686 475 -16 -464 -1027 -606 -49 319 396 648 270 -344 -841 -641 -467 -320 632 770 611
4258 611 47 -185 -470 -825 -586 42 466 515 478 261 -132 -500 -593 -143 347 312 814 626 -20 -211 -519
4279 -519 -711 -247 155 623 810 554 236 65 -636 -607 -288 336 359 616 668 303 -321 -795 -543 -204 118
4300 118 504 868 371 82 -436 -641 -366 -360 304 516 405 541 288 -249 -959 -559 -149 352 303 582 720
4321 720 122 -596 -543 -683 -571 105 598 754 251 74 -297 -398 -486 -287 456 394 676 310 66 -413 -741
4342 -741 -373 -173 200 610 785 388 64 -371 -687 -419 -222 279 1039 486 131 -119 -383 -740 -487 8
4362HO56j44p7k39o52l85J71K06M37N22O6J80m09n24l91j60K44J93R66n6k10l51
4384E1j98k90n29N26O45K53J07k59k24l01n24J13K76N24O80j30j58n39j58l49
4404d84k58L40O49L81N6m17Mp55j11J84K26N22k5L42j45m39n68j86P1L60M94K10
4426D51J44lo95j20l53kL12N30K84j99J39n10m46j14p3O68J48K97J37k5o23n26
4448e79M7O6L29L96M39k82j94l83k59j15n4N14P19j83j1m43j6n78j29K05P07j5
4470A81M08qj46p17l74j18L56L42N11L31k46k42m08m57j44K46N42M90Q8o0n09
4491F6m12k50%M16M21J02L10j77o67M4n68K66K51L40L12J66k90k54o09r7j08N15
4513b23L44L96K62l58k48n22l09K84K92J52L21K41j47n41n45OJ38J58N72O07k35
$$ plain form
4362 8 664 520 443 204 -448 -833 -662 -456 -19 503 569 749 340 -184 -575 -735 -491 -298 668 612 402 51
4384 51 -147 -437 -966 -440 205 458 565 306 82 -219 -743 -630 -354 170 850 720 562 23 -135 -484
4404 -484 -742 -402 247 628 684 267 271 -484 -595 -411 -185 337 312 654 509 70 -498 -684 -613 -253 241 451
4426 451 595 592 -103 -223 -576 -578 -266 264 548 349 488 -22 -468 -582 -655 13 161 458 595 570 -53 -579
4448 -579 -532 -466 -137 259 698 416 222 -161 -420 -535 -589 -75 644 461 450 7 -9 -587 -716 -511 196 181
4470 181 589 581 435 -282 -656 -774 -418 -76 435 766 520 278 -130 -587 -731 -485 57 547 635 575 66
4491 66 -346 -596 -596 -180 241 343 653 476 -191 -147 -715 -449 -198 142 454 620 330 76 -533 -630 -738 -223
4513 -223 121 517 779 421 173 -349 -658 -374 -82 70 391 632 485 -56 -601 -595 -457 -299 273 880 645
4534F45l46l19k69l31l9K96P16J07l11L30l54n00q9J26L23J76K88P0o7m56m77
4555d81j0m8M98N46L07m07j07k39n66k90L57K85L37M02K31o94m78k73j0M69K60
4576H9J80P9K64n77j64l9n79L58L01P49O0j51j98m85m98l48O16M54J89L59k05
4597D54j70n82l71J61J68M18M18J44j55n16l41p7j8K10N88O6K55k35l38l14m75
4618g10j12N56M10L06L44k71n44n55L4J55Q9K88O55k8l51n74j03N2l56M45N43
4639B73J76K30l45k36p13l39M20M45K47M54Ok92l95m99J41j51OR81L98j82k68
4660C57n03k41l96N78J83M30L6J03k11m43l13k77O21J45jO25j77l47m26m6k00
4681e03LL15P36K42l13j86l79l34l16M64K89J30K82k19n8n06l12m0J04P24L16
$$ plain form
4534 645 299 -20 -289 -620 -659 -363 353 460 149 479 125 -375 -464 -338 -15 161 449 519 452 -4 -481
4555 -481 -491 -539 -41 505 812 405 298 59 -507 -797 -440 -155 182 584 815 121 -357 -630 -640 -171 89
4576 89 269 348 612 35 -129 -168 -747 -389 -88 661 721 570 372 -113 -611 -959 -343 111 300 659 454
4597 454 284 -298 -669 -508 -340 78 496 640 485 -31 -372 -449 -467 -257 331 397 652 417 79 -235 -710
4618 -710 -822 -266 144 450 794 523 -21 -576 -542 -387 -298 -10 645 617 266 -308 -411 -359 -715 -270 273
4639 273 449 679 334 98 -615 -954 -534 -89 158 612 618 326 -69 -568 -427 -578 -572 409 807 625 357
4660 357 -146 -387 -783 -205 -22 408 444 547 336 -107 -420 -697 -76 69 68 693 516 169 -257 -303 -503
4681 -503 -500 -185 551 793 480 294 -85 -419 -735 -271 18 148 430 211 153 -353 -665 -705 -601 123 439
4702D39J91mr23j67O6j53m5P54L78M1j71k75m44k23J92L11L30J16J13N5n24l93
4724c36q0l3K20M62K99K78n64l66l8j87j21K25N53J35j71n2l0o66k30K13M14K93
4746B18K53K13l55m15l86k2M15j11N47K97Nl57m70k32l42J07N20M19K35j41O4
4767D62o62q4r5k08O07O42k2j71j38o57k96Q6K16K58M81J26R0n50m09j42m9K11
4789c04M57K84J5Q6j29m43o99l9M24M44J86M08k96k42n75j30k52K29P97M40j64
4810D97m05Q1k92l91k02N24N68K8J25j94k83l47k09O7L53K02R4M40j64o57j67
4831c32l32K73J02O15J45N9l61j87j80l51j03O42M36k34K87q7l85m31k9R3K74
4852h6K64K32L04k52n18m78K85j55J83O29K16j58n5n26m27P1J13K90L20L11k5
$$ plain form
4702 439 630 626 -297 -464 -398 -551 -596 158 536 577 406 131 -313 -536 -344 -33 297 413 526 581 57 -336
4724 -336 -416 -449 -229 233 532 810 246 -120 -158 -345 -466 -241 312 447 276 224 194 -472 -702 -489 -75 218
4746 218 471 684 329 -86 -472 -494 -79 -190 357 654 659 302 -168 -400 -742 -635 -115 304 539 398 462
4767 462 -200 -284 -379 -587 20 662 640 469 331 -326 -622 -536 -320 -62 419 545 635 85 -324 -466 -515 -304
4789 -304 153 437 452 538 409 -34 -733 -772 -348 96 282 690 394 152 -423 -553 -805 -576 221 661 497
4810 497 92 173 -119 -510 -712 -188 380 408 533 339 56 -291 -500 -433 -80 122 216 656 492 -165 -332
4831 -332 -664 -391 -289 326 471 530 169 -18 -198 -549 -652 -10 426 192 479 392 7 -424 -453 -360 -86
4852 -86 178 410 714 462 -56 -534 -249 -404 -221 408 624 466 411 -115 -542 -471 -358 -68 252 563 538
4873E38k81k53o59J12M0N54J88M75j54n84k26k72j44J73M46M33l0o5k41p1o29
4894f50k33O76J47J56L06J30m05j83l30j39J74M22L84M11k07p46O5n26m2K54M72
4915A36M45p9J91m56n97l88K94J73M77K50K37j48n50l34Kk27J45N44N34P6l51
4936C74m01k04j88k00O62J25N6J38k3r5n65l28M06K15K61L05L77p33l70j71K9
4957c30k46K86N66M56l40j4m26l17l56M41J94N07O4Q2l9o58m81K20K50J73K29
4978B61L42k50j20k50k10l9m12O04N14R0k94P5k17n02p6j0M95N56nJ11o24k79
5000b40k75j38M94N1M73L50j94m89l11k62J19L6M53J79J95P9m14m03j86r7M13
5021a67K16L99k39K45m08n85J51J00J22J22M71J58l17k08j68n39Q4K08O90K80
$$ plain form
4873 538 257 4 -655 -543 -503 51 239 714 560 -24 -250 -522 -666 -493 -47 386 356 291 50 -21 -650
4894 -650 -883 -207 -60 96 402 532 127 -56 -386 -525 -351 71 455 866 659 -87 -22 -548 -590 -336 136
4915 136 581 502 693 237 -360 -748 -454 -281 196 446 683 535 -15 -349 -347 -574 -429 115 649 725 374
4936 374 -27 -231 -419 -619 43 168 224 362 339 244 -321 -649 -243 -28 233 538 915 182 -188 -359 -330
4957 -330 -576 -290 276 732 392 378 -48 -365 -721 -280 -86 421 485 567 528 -130 -611 -391 -141 32 261
4978 261 603 353 233 -17 -227 -266 -678 -74 440 530 236 311 94 -408 -484 -494 1 557 552 663 39 -240
5000 -240 -515 -653 -159 -108 365 715 521 32 -279 -541 -422 -386 67 246 441 520 106 -297 -483 -580 -167
5021 -167 49 448 209 454 46 -539 -388 -288 -166 -44 427 585 268 60 -108 -647 -563 -355 335 615
5041F15J20m18k04m66l97L19L89J14L24J97j57m52n41j69L42J22L88M01M0l43
5061B24q7n03k46K53L56K07K96k82J24k65m66k02P9N60K96J08O6j94o54j37j17
5082e84J63K65M63J77j08j20k99l54m06J48O81K54K25k80N2o83k20K85J44K61
5102F4K51R8K64o00n16n1m0L06J91O92o4p4l95k62l31J68L5L60L17J36l09j39
5124A01n45Rj27M03L54J12M74k85n12m03l2j1L76J94K26P9o6l50m34n90O83N3
5146b91M82P0L08j5m96o53L24J63k6L28L63J5j94p59L3j46J19O8N78L68q3k49
5168C07l77k85nJ4J95K72L48K90m97l96k36qJ37K1O26l1J87l10o24j31j40M60
5190a83K45K92n7J57j86m11l17k42M18K9O34j72M26n45l03m04O2J90K89M35J0
$$ plain form
5041 615 735 317 113 -353 -750 -431 -42 72 396 593 436 -16 -557 -726 -384 -262 126 527 567 224
5061 224 137 -366 -612 -359 -3 204 500 218 342 77 -389 -591 -512 48 344 452 518 324 -330 -467 -584
5082 -584 -421 -156 307 484 376 256 -43 -397 -803 -655 26 280 505 225 277 -406 -626 -341 -197 64
5102 64 315 413 677 77 -439 -490 -530 -224 -33 659 595 521 126 -136 -467 -299 -264 96 413 549 240 101
5124 101 -444 -435 -562 -159 195 307 781 496 -16 -419 -451 -462 -86 108 334 413 347 -3 -437 -1027 -344 -291
5146 -291 191 261 569 554 58 -595 -271 -108 -134 194 557 572 378 -381 -348 -494 -375 -307 271 639 556 307
5168 307 -70 -355 -360 -346 -151 121 469 759 262 -134 -370 -378 -241 -220 406 375 562 252 -372 -503 -643 -183
5190 -183 62 354 297 454 268 -143 -460 -702 -284 -255 379 207 633 88 -215 -619 -557 -367 -78 357 367
5211C67Q7l27l46k2k05J36M54K93J46k48o0p06O0J1J93K61L35M6j54m54k12k12
5233e57J46K91L80K00J75l54k88m95R7n0J70P22n3J78l57j00o14j60P9L41L72
5254A23J30M46m83k39m54J23j28K11N00M58l29O1m72k34l66J27P98Q0J03o4o9
5275C22o40k00J90K3L02K91K07j79k00n55J1k2p4M87M84K16l22k89j44l79J24
5296c47J19L22J96m6J84M9p00m82L45J08M16J34K42k9o61k05n2k79N09P4O28L8
5318E63k55p0m82k22l1M14J07K85N18m56j94k70n31R0M23P0M54P0l81j17k57N6
5340b16m63L46N41K00J64k46k36n15k96L47M28N4M59lm97j03n51K99k60M89K43
5361A84L0L33l79l27q2j92J69L44N3L27N2j31m48m10j78J24N67K17Q5J04k46l15
$$ plain form
5211 367 454 127 -219 -241 -446 -310 144 437 583 335 275 -431 -371 -360 -167 94 429 475 321 -133 -345 -557
5233 -557 -411 -120 260 460 635 281 -7 -502 -405 -455 -285 437 384 562 205 105 -509 -669 -590 -249 123
5254 123 253 699 216 -23 -477 -354 -482 -271 229 687 358 419 -53 -287 -653 -526 272 352 455 391 322
5275 322 -318 -518 -328 -305 -3 288 495 316 116 -439 -428 -450 -524 -37 447 663 341 52 -92 -471 -347
5296 -347 -228 94 290 244 428 477 -223 -705 -360 -252 164 298 540 511 -150 -355 -407 -686 -177 -103 525 563
5318 563 308 238 -244 -466 -497 -83 24 309 827 371 177 -93 -624 -534 -111 -41 413 483 102 -15 -272 -216
5340 -216 -679 -333 208 408 572 326 90 -425 -721 -374 54 108 567 564 67 -36 -587 -288 -548 -59 184
5361 184 214 547 168 -159 -241 -433 -264 80 133 460 512 381 -67 -477 -655 -531 36 253 338 442 196 -119
5383a19l45n9M39j54O86K86l47l69k19l58j96N71J63M52M24k41k19o88j46n5J43
5404c51K82K28M01o8m70j38n62j62M03M92L47%R2m07l07l52o3K76P06L01j37o6
5426D45n13j05k76J28M6L34N21r9k48k57m13n9o0K9O76K36J34jm56k38n43m2O69
5449i2K46K33n4R2n27j65m5q5N14P1L10Qn16M9m13k5q2M50K07Q7K00j78l73l01
5473c89j78J79K68J52L47J30k64k75k88j32J33K95K38J98k21R6o89j49n1K82M85
5494A67R2K19Qk54n26n92M24L15K33K66K85j91j29m43k97k08K12L44M43P9k37
5515B10k17m24j9j74K93R1N59J68k9j60m12m65M2L28J18M66J15j54m71j82l67
5536f84J48M37L45L02M8l74j91l67r9j71L62M80J65P5Ok84l81l69O5M17J79L45
$$ plain form
5383 -119 -464 -523 -84 -238 448 734 387 18 -201 -559 -755 -184 -21 431 855 614 395 -293 -439 -494 -351
5404 -351 -69 159 560 492 22 -116 -678 -840 -437 55 402 402 494 87 -220 -572 -635 -359 347 648 511 445
5426 445 -68 -173 -449 -321 -275 59 580 481 233 -24 -437 -496 -556 -527 149 385 519 518 62 -176 -719 -761 -92
5449 -92 154 387 333 425 -102 -267 -312 -397 117 188 498 506 -10 39 -374 -399 -481 -31 176 263 463 285 -88 -389
5473 -389 -567 -388 -120 32 379 509 245 -30 -318 -450 -317 -22 216 414 193 289 -400 -549 -600 -318 167
5494 167 259 478 486 232 -294 -886 -462 -147 86 352 637 446 317 -126 -423 -631 -419 -75 368 447 210
5515 210 -7 -431 -450 -624 -331 -240 319 487 458 298 -114 -579 -537 -209 -91 375 490 336 -135 -317 -684
5536 -684 -536 -99 246 548 596 222 31 -336 -435 -606 -244 236 401 476 482 198 -183 -552 -487 -70 109 454
5558D54J71j93o90m1j51N7L51K56L52p7j37k77k28m40K95L91O2j3L24m07k54k49
5580d44q0K62M1K39M34K29l91m50J9l11J88J75K83L20k28L2n34j32j65J0O68J61
5602C26J08K0j41n21l44J1L11L29J56J86p4j94k10l13j78J88M51K01J81j37l75
5623a9j51l03l4M16J63M08m2J63n13m48k4L3K51k4M98K10l41n54R7k21r5K58L77
5646A05L23m3nk93m09j08K13P2K34L53j25n8l05l11k30J83K26L43K67j27k62q1
5668c8k20k72J76K79R2O24j58r0p16k66K12K63n4N20M0q6k22m01j2J64j73M46
5690A08J50L3K9n5o8n37l16L55M44O1J69j13k22q7l79J06L2M87K32L3k31j63j42
5713g4l32j7O7L87O20p9k59k35o4m88k73O19J86K32L0J14m75j95j21j68N10R3
$$ plain form
5558 454 625 432 -258 -299 -450 -393 -42 214 566 489 352 75 -153 -593 -298 93 155 142 466 59 -195 -444
5580 -444 -524 -262 -221 18 452 681 290 -160 -141 -452 -264 -89 194 514 286 318 -216 -348 -513 -503 165 326
5602 326 434 454 313 -208 -552 -541 -230 99 255 441 367 173 -37 -350 -528 -340 111 312 493 356 -19
5623 -19 -170 -473 -507 -91 72 480 438 601 88 -360 -384 -351 -100 -124 374 584 243 -311 -214 -435 -530 -272 105
5646 105 428 385 380 87 -322 -430 -217 -145 89 442 317 259 -46 -357 -587 -404 -178 165 432 305 43 -38
5668 -38 -258 -530 -354 -75 17 641 483 393 -323 -589 -377 -114 -168 352 392 306 84 -317 -329 -165 -338 108
5690 108 258 291 320 265 197 -340 -656 -301 143 204 373 260 38 -49 -428 -322 -290 197 429 462 231 68 -74
5713 -74 -406 -423 -356 31 651 572 313 78 14 -474 -747 -128 58 290 320 434 -41 -236 -357 -525 -15 78
5735G8K76M89o19k87M4m05j6k02R34J77J75l30l62k38k9j31L32K18L24J63k89
5756C02m05j92j38J20K25J72K23K41n23k21j13j25J37J32M94K20j24j21m60l82
5776e38k2K48M76KL77k18L5l73l65k22J52K81K69K02M3m40k88Ok89L47N32J23
5798C38J88k91j38k14l30M4J06j31P05O7K39l84m93p9rJ98J19N39l4j43k35n1
5820A1m16j8K42J16L83K23k02j77m55k16Q0L7P26K30J50n39m39j8k00l6L30K23
5842C5L87O7j42j69n22j63p4K92M02J03K57n7m97m07M1K79j50P01K4J85k57m21
5864h6j84j19O7K24N20P2J56n24k09k50j94R7L31K94R8J77M8o66j13j57p7L11
5886a84N07j4K87m12j71j26l09P0M48J18n6N11n66m2l16j27J16L34L20Q5K4k88
$$ plain form
5735 78 354 843 224 -63 -19 -424 -440 -642 292 469 644 314 -48 -286 -315 -446 -114 104 428 591 302
5756 302 -103 -295 -433 -313 -88 84 307 548 25 -196 -309 -434 -297 -165 329 549 425 304 -156 -538
5776 -538 -560 -312 164 166 543 325 360 -13 -378 -600 -448 -167 102 304 347 -93 -381 -375 -664 -317 215 338
5798 338 526 235 97 -117 -447 -403 -297 -428 277 344 583 199 -294 -373 -382 -184 -65 474 440 297 62 11
5820 11 -405 -423 -181 -65 318 541 339 162 -293 -509 -429 -392 334 564 714 175 -264 -282 -482 -518 -188 35
5842 35 422 489 347 178 -344 -507 -581 -289 113 216 473 416 -81 -488 -447 -168 -318 383 407 592 335 -86
5864 -86 -270 -389 -322 -98 422 494 650 126 -83 -333 -527 -430 -99 195 293 470 518 -148 -261 -418 -495 -184
5886 -184 323 309 596 184 13 -113 -422 -352 96 214 158 669 103 61 -255 -382 -266 68 388 473 497 209
5908B09n19r9J94k22N31O0M02k05o6o17o6Q3L44l4M60O4j47k09m96N7L06n5k05
5931b30N53J75j55l67l71k7K24j5K20N87j74k30q1k62m47K11J51K30N75r7l41
5952A29p9n27J8K52J12L90P9J46k91m08k62oP5L91K40J26j42r7k59k73j35n6O10
5975C3R8M57m7l01j50n37j61K96n6M80J52K90m81k71J82k27k1L42R9J60j89L3
5997A81l77o0l90N70O8L47K63m77R8n17n5j38L52jL25N34j10l98m94o4j0K69j0
6020i4M77r2O2l62j09m09j8O07J34R0L09k19l89k21l57K98mN42J66J14l08l73
6042a56j73k26L24J65L78R8n8j43k53k50j27J14J78N06r6K3L7l66m17Q2rQ7O12
6065C30l7K88k08l56j52l59K02O7N68j45J0L9k12l40m04N45J58K90K48Kk35m29
$$ plain form
5908 209 -310 -409 -215 -437 94 154 556 351 285 -332 -398 -315 29 -5 455 519 372 163 -333 -276 30 -25 -230
5931 -230 323 498 343 -24 -395 -422 -198 -213 7 594 420 190 109 -153 -600 -389 -238 -8 567 470 129
5952 129 50 -477 -459 -207 -95 295 374 520 229 -179 -441 -447 -372 19 259 385 243 146 -113 -386 -521 -577 33
5975 33 131 588 541 240 90 -447 -608 -312 -368 112 264 554 73 -198 -16 -243 -264 78 177 337 148 181
5997 181 -196 -256 -646 -76 -8 339 602 125 223 -294 -349 -487 -135 -136 189 723 613 215 -279 -343 -353 -84 -94
6020 -94 383 291 353 -9 -118 -527 -545 62 196 286 595 376 -13 -234 -591 -293 -297 245 411 525 217 -156
6042 -156 -329 -555 -231 -66 312 410 352 209 -44 -294 -421 -307 -129 377 281 304 341 -25 -442 -360 -369 -282 330
6065 330 293 581 373 17 -135 -494 -292 -225 343 198 208 247 35 -305 -709 -164 -6 284 532 534 299 -130
6087a30N5l59Q8L01M38J8l6k44k89l01j9K43K34J06J55O7j83j95o34M53M3L29
6109A40j09M20p6l04l60n3k09K10K94M95J1Q1n22l98K3k36N67K11J67K85l04k51
6131H2k92k16j10L81K79J57L37j78n53n8j88N2K52M35m0P2k08k60n4l44L51r7
6153b00N16J44k24J81k64p40J51J50R9L22K53K08l93j49m55P5q0M29K23P5o7j51
6175A03j33k34k48K25L09J70M05l28k12l13k66j1K29L02N8M72j47l52k06j02k23
6196e02L44L17M22p7M1k70l99k37q5K83pN52J37j47n5n47K8j58J83K19K98J38
6218D78qo49j4j17j61M63J67lj5Q4j26l67k89O2L34K35K08J20R2m46j88j96k7
6241c63Q3N21j1k39J52k41j30j69L0K79L1L91J18k90n3o43R3J34M46LJ85L59l37
$$ plain form
6087 -130 -75 -434 -346 -45 393 411 375 131 -158 -459 -478 -235 -1 105 260 327 144 -51 -685 -232 -189 140
6109 140 31 451 375 71 -289 -342 -551 -341 -47 448 459 540 18 -380 -357 -593 -26 185 352 637 333 82
6131 82 -210 -426 -536 -155 124 281 618 440 -113 -171 -359 -307 -55 380 340 412 204 -56 -110 -454 -103 -200
6153 -200 316 460 236 417 153 -587 -436 -286 -187 135 388 596 203 54 -401 -326 -406 23 246 321 254 103
6175 103 -30 -264 -512 -287 22 192 597 269 57 -256 -522 -533 -304 -2 56 528 381 29 -177 -279 -502
6196 -502 -158 159 581 504 545 275 -124 -361 -446 -163 -170 382 519 372 317 -230 -202 -360 -177 42 340 478
6218 478 470 -179 -193 -310 -471 -8 159 156 141 225 99 -268 -557 -495 -161 74 282 402 494 48 -140 -336 -363
6241 -363 -280 241 230 -9 143 -98 -228 -397 -367 -88 -57 334 452 162 109 -534 -441 -307 139 142 327 686 349
6264C49n64k42L7K16P6K96M88l86K55n33m47J75j6J82N07K2K01m45k73l15K26
6285a91j94M46K93m0jl66j44L8k40M89J4J97J40l10j22L5k79m45L61O12j39O8
6307B22L49l35j75l70J49j21M17M04k3l41k62j57j26o6l0P42Q8j49O7j29j65n18
6329e29J91J15M52j59L30l85m2r0j57J18j9L60J74k31k5o9k89l17j52P17Q5L46
6351D24Q6j16k94k57j8k01K82Q5P4K32k7j84l27j70K17J49j1M09L44l53l14j50
6373a20k31L5K38L75n5K26l69k30l16n5M15P2K5K55L1m2k05k43j74RK57K96J03
6396B97j79j2j40l46M3J99L19o6M53l83J36o64K31m07L67J62k6K97Pk36r6k01
6418b45K2rJ28N14k44O2n8m20K9k18K73K06K67Q1J00l48l26q9o9K65K43L25k20
$$ plain form
6264 349 -215 -457 -420 -204 -128 168 656 270 525 -8 -455 -280 -296 -114 393 415 616 171 -102 -417 -191
6285 -191 -385 61 354 314 313 -53 -197 -159 -399 90 104 301 441 131 9 44 -235 -680 -319 293 154 222
6307 222 571 236 61 -309 -160 -281 136 540 517 176 -86 -243 -369 -435 -465 277 365 216 283 154 -11 -529
6329 -529 -338 -223 229 70 400 15 -27 -117 -274 -156 -175 185 359 128 103 34 -255 -572 -724 -7 78 424
6351 424 510 394 100 -157 -175 -376 -94 -9 65 297 270 86 -241 -411 -194 -45 -56 353 697 344 30 -120
6373 -120 -351 -316 -78 297 242 468 99 -131 -447 -502 -87 -15 10 265 296 254 49 -194 -368 -359 -102 194 297
6396 297 118 106 -34 -380 -337 -138 181 115 568 185 321 -343 -112 -519 -152 10 -16 281 288 52 -44 -245
6418 -245 -223 -232 -104 410 166 228 170 -250 -221 -439 -166 40 307 388 488 140 -186 -275 -344 -79 164 489 269
6441B69J73m61j17j56n8K67J51L20j15l31J37o31K13J79J65K76J62k12j52j59
6461h0j76%k05L91M94j37j08k9j32j31j02k33K94L91K65L4l15k64k42j34R6N17
6483A94p4K10N0j94o2k93l59K67M3L93K96m6m53j13K3l13L5N13P0L33j61l25q2
6506d8m28m8K93K84K61j24J66m49j39p0j08J61J53M22k45K44n05k85l6J11r7N74
6528H7K79k4J62m61k79k6k89L47K20Q0K77p7m41p4n9r3K36L05J46K24m95R4l89
6551b50O2m38O08L59j82L20l92K8l55k95J42K50J93L23J9k43m03J31l55J26J99
6572a53K75J32M5p2k84k96j42K87M81j50K90K3l15m58l6J9J39K48J66Q8j04q0
6594A03k49j18J86k26J21M40K56l88L4j64m72k9L46L47Q5J48Qk69m90L7ro1M53
$$ plain form
6441 269 442 -19 -136 -292 -350 -83 68 388 273 -58 79 -552 -339 -160 5 281 443 231 79 -80
6461 -80 -256 -256 -461 -70 424 287 179 150 18 -113 -215 -448 -154 237 502 536 221 -43 -285 -419 -323 194
6483 194 120 330 380 186 124 -169 -528 -261 -218 175 471 425 -28 -141 -118 -431 -396 117 187 520 359 34 -48
6506 -48 -476 -524 -231 53 314 190 356 -93 -232 -302 -410 -249 -96 326 81 325 -180 -465 -501 -390 -487 87
6528 87 366 342 504 43 -236 -262 -551 -204 16 96 373 296 -145 -219 -278 -371 -135 170 316 540 45 139 -250
6551 -250 -188 -626 -18 341 159 479 87 115 -240 -535 -393 -143 50 373 392 149 -254 -123 -478 -352 -153
6572 -153 122 254 299 227 -57 -353 -495 -208 273 123 413 436 121 -337 -373 -354 -215 33 199 287 183 103
6594 103 -146 -264 -78 -304 -183 257 513 125 159 -5 -477 -506 -160 187 272 420 428 159 -331 -294 -303 -364 89
6617H9j21M82m8l98j42k25j74M17K6M89j06J4k21l35j80K07K8K62L26R9k48j77
6639F4Mn54J03J30K36J41J36J33k84l62j86J94J79L13L26q2l04q1l56o0M8J64
6661i8K33J54J61j92m08k7K0l5L04M2N35k83j21k76j99k72J50L27J69M7N1r4j18
6684G0m50j51M65j66O28K09k78j35j51m02j39L37K07k6M28l46J09k06j98RJ34
6705e2L53J75j08k53O6l05Pj21O2J89J86K74j49j32l03j17l1k5L17L12l5kj73
6728A35k99j18j33M76j05K79J03j78m3m09k50J24L47J03K54P0l52R2m57R9r1p0
6750d23O35L51m75n3j8j21k29j2N87j40K29J89k69k61j17p0J22p7K92K49m9pl86
6773e3q4l7l6K13k70O97j03k45K8l11j07N0Q3O23m2p8j1m38k18M2K77J9L88JO7
$$ plain form
6617 89 -32 450 402 4 -138 -363 -537 -120 -94 395 289 303 82 -253 -433 -226 -198 64 390 489 241 64
6639 64 68 -486 -383 -253 -17 124 260 393 109 -253 -439 -245 -66 247 573 491 187 106 -250 -310 -262 -98
6661 -98 135 289 450 258 -150 -177 -157 -192 112 154 689 406 285 9 -190 -462 -312 15 184 231 282 188 70
6684 70 -380 -531 -66 -232 396 605 327 192 41 -361 -500 -163 44 18 446 100 209 3 -195 -186 -52
6705 -52 301 476 368 115 181 -124 -117 -238 -176 13 199 473 324 192 -111 -228 -259 -284 33 345 310 308 135
6728 135 -164 -282 -415 61 -44 235 338 160 117 -292 -542 -418 -71 32 286 356 4 96 -361 -262 -353 -423
6750 -423 212 563 88 35 17 -104 -333 -345 242 102 331 520 251 -10 -127 -197 -75 -152 140 389 340 333 -53
6773 -53 -137 -174 -210 3 -267 430 327 82 110 -201 -308 -258 -175 448 406 328 317 -121 -339 -297 -20 -1 387 388 455
6798D55l50k29m8j88J11K49J59L2Ll8k66j15k49J88P4K63K21Q1m04j47Q6j93K9
6821b76K91L89k16J0k51j88J05m1n7M84j09J99O7k67j73r9k67L25K46N2qj39m3
6844C4k57j57K24j3K84J63K19n29J61k59q9j32L02J76J67M1Jl22m60J95p8J72
6866a57K80K32R3k83k08K32o86J58K20L69K6O8J6n24j48p2N4L41J01K37j87O8
6888B30l69m39J56J23J53J70K97q9q4k45j02K33j48J82P2L45J03l41m55l95L50
6909b53J15L44l7K16q4j77k25j14J56j53L00M04r1j11l27j74j37o6L14N8M45J0
6931D13k62j03k67l2j12M01j73M94L3o6l48l47J15N1k1K71K18L70m45k6l72j09
6953c17k13N74K90j08K5K62o09j33k03K50K14l8L42l0j09k83k34kK00J17K22L40
$$ plain form
6798 455 105 -124 -172 -360 -249 0 159 191 194 156 -110 -225 -474 -286 -212 51 272 353 -51 -198 -112 -305 -276
6821 -276 15 404 188 198 -53 -241 -136 -177 -234 250 141 340 407 140 -33 -132 -399 -74 172 224 216 77 34
6844 34 -223 -380 -156 -169 115 278 497 -32 129 -130 -219 -351 -49 127 294 335 336 14 -446 -251 -329 -157
6866 -157 123 355 448 165 -43 189 -497 -339 -119 250 276 344 360 -164 -312 -384 -330 11 112 349 162 230
6888 230 -139 -578 -422 -299 -146 24 321 232 148 -97 -199 34 -114 68 140 485 588 247 -208 -603 -253
6909 -253 -138 206 169 385 301 124 -101 -215 -59 -212 88 492 401 290 -37 -211 -348 -414 -100 -42 403 413
6931 413 151 48 -219 -251 -363 38 -135 359 392 326 -22 -369 -254 -203 -224 47 265 635 190 164 -208 -317
6953 -317 -530 44 334 226 251 513 -96 -229 -432 -182 32 -6 336 306 197 -86 -320 -322 -122 -5 217 557
6975E57l62r7j68j62k5O0K04L56L9j00j82k26l39J95l3M22m4K24J24n47k30L32
6997bl96J68M50J24k13L63j68l95m35L33J02J09N0M3J79p4n83J51q6K64J67m3
7019A08J43J3k72n1Q0l09J60L88R4j28J31k46k55k4o8J23L27p0K01j04j25j79
7041f3l97K14J53N9L90J47k22n70P4m2J36J79J10q7O5j19km22m5L83J05P6J15
7064B37J95k39j69l64P8J73j85M62P6j65K34l94q4r2l4J10L27J08j27J9O1l48
7086a21l53M50j65K58j24M02j58n12QJ70J27J63K59j51J79m43o1o3j75J75J02
7107c3J50K68Q1m72m8m10kL11K86Q4Q6j12j91k74l11O5L84K14Qq1J61j65j61j36
7131b98J19r4J60K92K49j62j32l47l8J05K11L3K56R1j01j24n55N8L0J76J85P5
$$ plain form
6975 557 195 98 -70 -232 -257 -197 7 363 402 302 120 -106 -445 -250 -283 139 95 319 443 -104 -334 -2
6997 -2 -398 -230 220 344 131 494 326 -69 -504 -171 -69 40 90 133 312 238 -345 -194 -280 -16 151 108
7019 108 251 264 -8 -59 21 -288 -128 260 354 226 357 111 -144 -168 -236 -113 214 144 345 241 116 -63
7041 -63 -460 -246 -93 -34 356 503 281 -289 -215 -257 -121 58 168 81 146 27 25 -397 -442 -59 46 122 237
7064 237 432 193 24 -340 -262 -89 -274 188 264 99 333 -61 -145 -237 -271 -161 166 274 147 166 227 -121
7086 -121 -474 -24 -189 69 -55 347 189 -323 -315 -145 -18 145 404 253 432 -11 -72 -135 -310 -135 -33
7107 -33 117 385 466 -6 -54 -464 -466 -155 131 215 301 189 -2 -276 -587 -522 -138 76 84 3 164 -1 -162 -298
7131 -298 -179 -273 -113 179 428 266 134 -213 -251 -146 65 98 354 445 344 220 -335 -277 -247 -71 114 189
7153A89k5Q1j24m35J63j38K49K75k8K05l45j41k38q4M77j29J31L17K7m45K07l82
7175a93j29J3Q8N49Mk5j52p6j78m54K98K46J90j05l7K8j64N9k93M0Q7M52M1N7
7199C46k96r3J5J3m32M30Q7K0K74j22k67j97k91K06K03L65K21j02m15k1m15J65
7221c06J63m4M71J26j19k06j82j52l00L86L56k18J87J15k48j95L2O0R8J46QK99
7243D77l04k07n4l91M01Q6J9L87k6N3l81j37k12l4K01K61n3L07k25j23k81m2k04
7266d82M98O5O1l9R5m21K4k03K75J53K2L21j98j59p4k92j46K53M91m3j45K26k1
7289B61k50l33m5K59k81M33L64Jk79m27J56N5p6K18K80j20k19J31k41j23j19L61
7311FJ88J27O4j71q3k49j33L4J70L67j52Q4J46n25o9p5O9j80M35O9J69j48j29
$$ plain form
7153 189 164 245 121 -314 -151 -289 -40 235 207 412 67 -74 -312 -396 81 -48 83 400 427 -18 189 -193
7175 -193 -322 -309 -221 328 332 307 155 79 -99 -553 -255 -9 181 76 39 67 -97 -38 -331 -291 -204 248 289 346
7199 346 50 -43 -28 -15 -447 -17 70 90 364 242 -25 -222 -513 -307 -104 261 482 380 -35 -56 -471 -306
7221 -306 -143 -187 284 410 291 85 -97 -249 -549 -163 193 -25 162 277 29 -166 -134 -74 24 170 178 477
7243 477 173 -34 -88 -479 -78 8 27 414 388 441 60 -77 -289 -323 -122 139 86 393 168 45 -236 -278 -482
7266 -482 16 81 142 103 198 -223 -199 -402 -127 26 48 369 171 12 -62 -354 -500 -247 244 201 56 282 261
7289 261 11 -322 -367 -108 -389 44 408 409 130 -297 -141 -86 -162 56 336 216 -3 128 -113 -236 -355 6
7311 6 194 321 385 214 131 -118 -251 -217 -47 320 168 252 398 -127 -196 -271 -202 -382 53 122 291 143 14
7334A4k09j31k5J52J79K18R5k17j42l5j95R9K10L5L31j95M3k60j35m8o4J48O0
7357g2L67l17J33L6m62O1j65M53J96K08k66ol02N0l18K15L40J19j08n4j30l24
7379c46l7L04j12Q6L10J07j53j30N7m44N8R3K04j23L11K88l34j87l62K43K55j71
7401h3J89O1K36j77j85r2j99J42K93J08k22J28p6j29j62j61K54K09J00L49l74
7422B09M5m51l13K15J28M17P7k94K26k19j67l93M67m7M20j18j88K48l75J32r6
7443g7o3j32M44Q9K9k06J09l34K6k13J74M83j28J14l62k49q7K21j39L50J45N8
7465B52O5j96k08K6m16K97K42N7K18Q4l87k48L26n40N6N24j27J68M4r5n8l69j20
7488d05L51lJ90K04j1k85k42J19j61L43m29N15R8k14P8m37Q4P1l3M05J1Ln4k2
$$ plain form
7334 14 -195 -326 -351 -199 -20 198 293 76 -66 -101 -296 -197 13 48 379 184 227 -33 -168 -216 -280 -132 -72
7357 -72 295 -22 111 147 -315 -254 -419 34 230 438 172 166 -136 -86 -404 -189 151 270 162 108 -22 -346
7379 -346 -383 -79 -191 -105 205 312 159 29 86 -358 -300 -207 -3 -126 185 473 139 -48 -410 -167 88 -83
7401 -83 106 167 403 226 41 -51 -250 -108 185 293 71 199 123 -6 -168 -329 -75 134 234 583 209
7422 209 254 -197 -510 -295 -167 250 327 33 259 40 -127 -520 -53 -100 320 202 14 262 -113 19 -77
7443 -77 -140 -272 172 261 290 84 193 -141 -115 -328 -154 329 201 315 -47 -296 -383 -162 -301 49 194 252
7465 252 317 121 -87 -61 -477 -180 62 119 337 421 34 -214 112 -428 -372 152 25 193 237 142 84 -285 -405
7488 -405 -54 -57 133 337 326 41 -201 -82 -243 100 -329 186 284 70 148 -289 -205 -134 -167 238 249 252 198 176
7512A76j62p0m00R3O70j62J24J3l17k39K13k15K28J45j4K09j08p6J44m85O0J1
7534a62K55L06l07J42m17R3k68K62k27M12L8M34k38n37J69l0j62P8M00j04K43
7555C80j80m94J69q6k68M81J60Q8j74M7J52k82O0j40o8K26L47o9k26j47k49K5
7577b48j05N86kP9k67m5J33k59j23J11J77J6K13l2n5j75k72o9N6J07M16q8j22
7600C2r6k65K20j75N4M24O3j17L9L7k57j97j2K29L93j84J29k41lm58K45M9M2J48
7624I9p9J49K07m56o3O6q5P3O3O0L07m7k05j20l30J79j32N34mJ63l83l7k46OQ1
7649b00J76Q2L05j19j77L9k97r3r1L43J28J67j05%J1j46n70m1N45l0L87N1k21
7672A44j83k18m7l0J08N00p9K1l67J08j49q6j28L60J80j36K83k44j97l78J26L08
$$ plain form
7512 176 14 -56 -456 -363 307 145 269 282 -35 -274 -61 -276 -48 97 83 292 184 108 252 -233 -173 -162
7534 -162 93 399 92 234 -183 -90 -358 -96 -323 89 127 561 323 -214 -45 -75 -237 -159 241 137 380
7555 380 200 -294 -125 -211 -479 2 162 250 76 123 275 -7 53 -87 -155 71 418 349 123 -24 -273 -248
7577 -248 -353 233 231 310 43 -2 131 -128 -251 -140 37 53 266 234 179 4 -268 -337 -281 -174 242 154 32
7600 32 -64 -329 -109 -284 -230 194 257 140 179 216 -41 -238 -250 -21 372 188 317 76 73 -385 -140 -91 -49 99
7624 99 20 169 376 -80 -143 -77 -162 -89 -26 34 341 294 89 -31 -361 -182 -314 220 216 379 -4 -41 -287 -281 -200
7649 -200 -24 58 363 244 67 106 -191 -284 -375 -32 96 263 158 158 169 23 -547 -588 -43 -73 314 365 144
7672 144 -39 -257 -304 -334 -226 274 195 216 -151 -43 -192 -278 -406 -46 134 -2 281 37 -160 -538 -412 -104
7694a04l7M20m4j97O9j07j75q0J22J17K87m9l7L4m03j20k58M22L7K67N00n10j57
7717cj76J56j36M7j77K51L71m43P3J06k23JN0J83L09j14Q8m22J51l27jR5J50J71
7741A80L2L1l95R0m65K37J78K57m0j20K07l32J2J2J89P1M69j32m67J24m35p2j05
7764d74K60K25LJ64J33n2l02k97J22j65K10M72O7j4l54j2j69l6q8K97J21J5r6
7787C0O9k61L6Q4k08L29M0J13k84K17k48k03J30j35L48J0J29k26q2J6k4J4o8K39
7811F5p1J8J17J88m08l68N0M66jK52j09R5j63l25j32K38m4J22J82J05j96l42j8
7834b79O8j79K74L26q5pj02l29N9J04J15k22M36r7J30J7j90j58j57J31O3O8J74
7857A60r1q6K03j34j55J94k16K76K55n83L31j97r8j78K54K40k20J69L29k81k71
$$ plain form
7694 -104 -141 279 235 38 107 0 -175 -255 -133 -16 271 222 185 219 -184 -304 -562 -140 -103 164 664 154 -3
7717 -3 -179 -23 -159 -112 -289 -38 333 -110 -37 69 -154 -153 -103 80 389 275 363 -59 92 -235 -236 -141 9 180
7741 180 212 243 -152 -62 -527 -290 -112 145 105 -15 192 -140 -128 -116 73 144 613 481 14 138 -297 -369 -474
7764 -474 -214 11 14 178 311 259 -43 -340 -218 -383 -173 299 366 352 -2 -14 -183 -219 -307 -10 111 126 30
7787 30 99 -162 -126 -42 -250 79 119 232 -52 165 -83 -286 -156 -291 57 67 196 -30 -112 -96 -120 -106 -174 65
7811 65 -6 12 129 317 -91 -459 -409 57 56 308 199 294 131 -194 -326 -88 -132 -10 172 277 81 -261 -279
7834 -279 -211 -390 -116 210 125 118 16 -313 -254 -150 -35 -257 179 82 212 229 39 -119 -276 -145 -82 -14 160
7857 160 69 -17 186 52 -103 91 -125 151 406 -177 154 -43 -141 -319 -65 175 -45 124 453 172 -99
7878i9j52k1J05K0L68R2o0j22l05q7k0J91j4K29J24L8k38n6o4M0Q8j15J00P2K68
7903C82m22O0m80K82M9J36J12j25K09j8k61o1o3k7J61J87P6j30J07k27k6L1j09
7926a57Q9L69P3k59k41k1j43K13Q7j19j25L04r8J58k80o4Q6MK88O0oj09k15L41
7950B35n75L88j68L92K4J95m04O8m20L8j15L67R9jN3k04j47o7K42l02K65N6L48
7973C67l54k5l0k93J47L1K32J27M5mj57J60l94j00J40K52J54m0j89Kk20lj76J91
7997a37K33L3J01p5j39l02K27j23k7L90P3K4m4mK4l94n8J27L23j4O2r0k55j35
8021a80K2R7M4p3L25j33j52L63m11M7j19L55j63L31p0k07M8J1k72j43M56j9J78
8044C35j91L21j78m04p7L9L37k14K24J47m1k14l45r8p1J88M63j21J40m5l25M2
$$ plain form
7878 -99 -251 -272 -167 -147 221 313 253 131 -174 -261 -281 -90 -104 125 249 287 49 -7 -71 -31 57 -58 42 114 382
7903 382 -40 20 -460 -178 -129 7 119 -6 203 185 -76 -137 -200 -227 -66 121 197 67 174 -53 -79 -48 -157
7926 -157 -68 301 374 115 -126 -147 -290 -77 10 -109 -234 70 -28 130 -150 -214 -128 -124 164 224 218 109 -106 235
7950 235 -340 48 -120 272 296 491 87 155 -265 -227 -342 25 124 123 176 -28 -175 -242 0 -302 -37 19 367
7973 367 13 -12 -42 -335 -188 -157 75 202 247 243 86 246 -148 -248 -108 144 298 258 69 71 -149 -152 -328 -137
7997 -137 96 129 230 155 16 -286 -59 -182 -209 181 254 278 234 230 254 -140 -198 -71 252 238 300 210 -45 -180
8021 -180 -158 -61 -17 -90 235 102 -50 313 -98 -51 -170 185 22 353 283 76 124 135 -137 -280 176 157 335
8044 335 144 465 287 -117 -194 -155 182 -32 192 339 298 84 -261 -359 -430 -242 221 100 240 195 -130 -88
8066h8n3j69J84J91K46j36l20J35j50O4J00M2K73j94j16J61k14k44J98o5M92k78
8088E9r2L24l88R6k14J72k29K76J67N0j55m6j03J51k41P4N6j68L97Ql02J14k96
8111b90r2L84pR4J08j58Q0m78J37j0lL56p1J50j36m9j31P6l10L08K03J07k71J76
8135A73m54L94l70M08j96K16m2p3K21m64M4l28O18k84J50J88Oj78l0jj4k95K16
8158i5J36r0M06j82j70k31j10P7K64o6J59J63j80k60J06j07N4J22q6K82j8j78
8180dk35Q1Nj09L35L22k99j5N6j79k07
$$ plain form
8066 -88 -141 -310 -126 65 311 175 -145 -10 -160 -96 4 46 319 125 9 170 -44 -288 -90 -155 337 59
8088 59 -33 291 -97 -1 -215 -43 -272 4 171 221 66 20 -83 68 -173 -99 -43 -211 186 194 -108 6 -290
8111 -290 -382 2 -5 89 197 39 119 -359 -222 -232 -235 121 50 200 64 15 -116 -40 -350 -42 161 268 -3 173
8135 173 -281 113 -257 151 -45 171 129 56 277 -187 -143 -471 147 -137 13 201 207 29 -1 -2 -16 -311 -95
8158 -95 41 -49 357 175 5 -226 -336 -259 5 -61 98 261 81 -179 -73 -180 -126 -4 -90 192 174 -4
8180 -4 -239 -158 -153 -262 73 395 96 81 137 -42 -249
8191b49
$$ Imaginary data points
##PAGE= N=2
##DATA TABLE= (X++(I..I)), XYDATA
0@%%%%%%%%%%%%%%%%%%Pj5J6j6J6j6J9k7L2l4M1m7N1n9O8p8Q8r7J10j26J40j55
40h2J73j91K13k36K62k91L19l50L86m26M70n18N70o28O92p67Q53r50J065j198
60f34J357j556J806k133K581l235M278o213J0979m4233o9315O7023K4729O647
74g919N8154L3907m5055l3450j9683k3160N031K1179P648L6710L0027l0072k8114
87E203n96m3950l5039M5608M4724k94K4399J4013n5798m9389N957N532J0982M4154
101A5506K8541l571j1062l0382l2038L296O230o31L8435M2247j3801k0602j790
114B0378l6337m3323J7961L7890J4933K3315J7524k6186l8953k2906j3064Q681
126d0087K9204K1774J8163J1909k2861l2236p048q808j2391K8639M2927O140l873
$$ plain form
0 0 0 0 0 0 0 0 0 0 0 0 0 0 0 0 0 0 0 0 7 -8 8 -8 8 -8 11 -16 16 -18 23 -24 27 -32 36 -42 46 -51 59 -67 73 -82
40 -82 91 -100 113 -123 139 -152 167 -183 203 -223 247 -271 299 -329 363 -404 449 -501 564 -634
60 -634 723 -833 973 -1160 1421 -1814 2464 -3749 7230 -37003 -106318 -39295 -14566 -7919
74 -7919 50235 84142 39087 5637 -14046 -37206 -32175 -10996 -3348 33362 63389 33317 5203
87 5203 4607 -39343 -74382 -28774 15950 15656 40055 54068 -1730 -51119 -45162 -39630 -28648 15506
101 15506 44047 40476 29414 -968 -33006 -29710 -23480 -24111 14324 56571 42770 22168 20378
114 20378 -15959 -59282 -41321 -3431 11502 34817 52341 26155 -12798 -35704 -48768 -40087
126 -40087 -10883 10891 29054 40963 18102 -14134 -21182 -29990 -42381 -13742 29185 35325 31452
139C1452K790k5752m0276o698J8015J7804K3095J9663j947k0136k9788k3958O83
152c5053J3251J1188K4038K4061j0078k6199j1540j5063j8773J3212L4204J9647
164B2895P126L773j4843l0270k1278o63J6860K2619J7606J3756P8k5655l0854
177a8850q844J880J877K1056L1621N907j5136j3068j7447k3083m919J9366K4459
190D819J6085O620k859j6059k6859j6932P633J7764J3509J8532J5964j0960k7156
203A01j5662n697n188J0751K7884J9249j846j1610j4186k0082j7087K210K1280
216i883K1281R129L823l414k2281k6837m468J1548J0626J6649K2875M750j8156
229A5642k0388j1603q626l13J8056K5944J2729m860j0847j3908k1644j3713J1160
$$ plain form
139 31452 34242 8490 -31786 -38484 -20469 -2665 20430 40093 38146 18010 -11778 -35736 -35053
152 -35053 -21802 -10614 13424 37485 27407 1208 -10332 -25395 -44168 -30956 3248 22895
164 22895 30021 33794 18951 -11319 -32597 -33260 -16400 6219 23825 37581 37659 12004 -18850
177 -18850 -27694 -25814 -23937 -2881 28740 34647 19511 6443 -11004 -34087 -39006 -19640 4819
190 4819 20904 27524 24665 8606 -18253 -35185 -27552 -9788 3721 22253 38217 27257 101
203 101 -15561 -21258 -26446 -15695 12189 31438 29592 17982 3796 -16286 -33373 -31163 -9883
216 -9883 11398 20527 24350 20936 -1345 -28182 -32650 -21102 -10476 6173 29048 33798 15642
229 15642 -4746 -16349 -24975 -25288 -7232 18712 31441 26581 15734 1826 -19818 -33531 -22371
242b2371K1955J2977Q648O863j1029k7425j6948J207O010J0919K1517J7326l757
255B5892j8466j5485j0673q504M263K2516K2257M552n825p061j6716k2104l422
268b8776J6653J6298J0261J1212J851j8584k3780r646K374N534J3770K1714J1102
281B9983j1356j7804j1669j1349q019J1896K5283J4772J18k394r063k2463j6868
294b8933N456J5838J2546J2712J1558m498k2289j8484m953O74N312J8466K0177
307B3582K408j2874j3011j1634j3305k417J7318J9970Q855J256k826j3871k1217
320a7766q918Q988J3167J1275J3630P583j1455k1256j2553k756N38J0075K1350
333A1902J4743m407j2109j1316j4024j1701M937J9977J5671N556J789n917j9133
$$ plain form
242 -22371 -416 12561 21209 28072 17043 -10382 -27330 -26123 -20113 -9194 12323 29649 25892
255 25892 7426 -8059 -18732 -27236 -22973 -457 21800 26352 20527 13466 -3250 -25354 -28776
268 -28776 -12123 4175 14436 25648 27499 8915 -14865 -24511 -22137 -16603 -2833 18881 29983
281 29983 18627 823 -10846 -22195 -30214 -18318 6965 21737 21855 19461 10398 -12065 -28933
294 -28933 -23477 -7639 4907 17619 29177 24679 2390 -16094 -21047 -20373 -15061 3405 23582
307 23582 25990 13116 105 -11529 -24834 -27251 -9933 10037 18892 20148 17322 3451 -17766
320 -17766 -26684 -17696 -4529 6746 20376 27959 16504 -4752 -17305 -20061 -19523 -9448 11902
333 11902 26645 22238 10129 -1187 -15211 -26912 -21975 -1998 13673 19229 21018 15101 -4032
346d032j8584k319R901J0366J2737J5312J565j6121j7140p696m362J031J5330
359d012K0644P466o345q269j1622j5914p070J0928J7123J0336N878J325j0845
372I623j9998j1979K340P844R911J5753J1215n980j6421j2523p544m228O913J8946
386C872J5598J932n756q873j4763j4723R1J3964J3861R260O891j002j5778j8882
400a4308o464L324O341J2685J6346O205r846j4095j0343q575k813J1005J8528
413G990J0211m40m331r952j6318j0281N321J3069J0194R678P106o968j8141j2630
427a5492k199K383P509J6002J3716j067j1978j1104r773q699J510J5213J5630
440A1651N361m72m487j3337j6557m607Q581J0901J0239J1616L104j1792j6526
$$ plain form
346 -4032 -22616 -24935 -15034 -4668 8069 23381 24946 8825 -8315 -16011 -20373 -19342 -4012
359 -4012 16632 24098 17753 9484 -2138 -18052 -25122 -14194 2929 13265 19143 20468 9623
372 9623 -10375 -22354 -20014 -12170 -2259 13494 24709 18729 2308 -10215 -17759 -21987 -15074 3872
386 3872 19470 21402 15646 6773 -7990 -22713 -22622 -8658 5203 14463 21354 20352 4574 -14308
400 -14308 -20772 -17448 -11107 1578 17924 24129 14283 188 -10155 -18730 -21543 -10538 7990
413 7990 18201 17761 13430 3478 -12840 -23121 -17800 -4731 5463 15141 22247 15279 -2862 -15492
427 -15492 -17691 -15308 -7799 8203 21919 20852 8874 -2230 -12003 -20702 -19192 -3979 11651
440 11651 17012 16540 12053 -1284 -17841 -22448 -13867 -2966 7273 18889 21993 10201 -6325
453f325r144k132K303J0741J7713R377n900j0546q817j1425p917P519J6559J0307
467A2313L187J516o718j6589j3036P97P940R191J1377J0661j973j4711j4153n844
481a6042j109L370J4238J5863L286p235q214r796j2040k502J1269J4048P403M704
495A7243J89j0967j6927q761L169P658R407J3428Q044p990j5602j0279m648j948
509a7984O914J6966J1375j273o029p202j1342j0969J812J2967J1180O712N034
522A8161k400j4293j5216m117M435P165J0858J2776K591j0475j2996p658n403
535a6572r6J0910J5202O918k306m915q874j3225p090O331J1783R146P363L929
549A8504p412j6164j0897m03M982P548J3390J0214k933j1644r715o804n329K708
$$ plain form
453 -6325 -15469 -17601 -15298 -4557 13156 22533 16633 6087 -2730 -14155 -22072 -14553 2006 12313
467 12313 15500 17016 10298 -6291 -19327 -18530 -10590 -1399 9978 20639 18666 3955 -10198 -16042
481 -16042 -17151 -13781 457 16320 19606 12371 4157 -5639 -17679 -20181 -8912 5136 12539 17243
495 17243 17432 6465 -10462 -19223 -16054 -8396 1011 14439 22483 14493 -1109 -11388 -16036 -17984
509 -17984 -11070 5896 17271 15998 9969 2767 -8575 -19544 -17732 -4765 6415 13127 18161
522 18161 15761 1468 -13748 -17865 -13430 -6265 4593 17369 19960 9485 -3511 -11169 -16572
535 -16572 -16668 -5758 9444 16362 14056 9141 267 -12958 -20048 -13717 -1934 7212 14575 18504
549 18504 11092 -5072 -15969 -16372 -11390 -3842 9548 19762 16829 5185 -4530 -11334 -16663 -13955
563a3955J3340J2553L480j444n589j2073j3047k398P961J0819R300P592J07j1181
577E465j4748o229J239L557R904J4122N633o905q610p477q618m201P608J2687
591C427Q696L016j910p741j2981j0256J005R841R319Q198O672l622j4148j0863
605a1347k910l54N709J3350J0993m3n410p902r684p957K31R289J2153P272J268
620A4658k110r068j4625o791N709P711P642J0832M689r422j2802o599m083P7Q694
635e488J2598P076q26o251q253q913o219K585J1620R980M574K083l504j3283j1814
650a4035r6N182N901J0524R615j531j0144r899o945l765K904J0632J1668M795
664A4806l292o390q299j0032m468P364J1161P094N428J989q280j3365o917O67
$$ plain form
563 -13955 -615 11938 15418 13974 8385 -3688 -16735 -19133 -11172 -353 8947 16539 16646 5465
577 5465 -9283 -15512 -14273 -10716 -812 13310 18943 12038 3428 -4049 -12667 -16868 -9260 3427
591 3427 12123 15139 13229 5488 -7493 -17749 -16744 -6903 2416 10614 17286 13664 -484 -11347
605 -11347 -14257 -14611 -8902 4448 15441 15398 9988 2086 -7598 -15555 -15324 -6035 6118 13390 14658
620 14658 12548 3480 -11145 -17936 -12227 -4516 3126 13958 18647 9225 -3577 -10176 -14259 -14182 -5488
635 -5488 7110 14186 13360 7109 -1144 -10057 -16276 -13691 -2071 7909 12483 14566 11062 -2221 -14035
650 -14035 -14131 -8949 -3048 7476 17091 15560 5416 -4483 -11428 -15193 -12289 -1657 10011 14806
664 14806 11514 5124 -3175 -13207 -17675 -10311 850 7944 13372 15361 7081 -6284 -13201 -12534
678a2534L610Q009J1284O621m055r830q192o452k989M558J1891R983J273l486
692I691n238j0003r770L48Q910Q341O280N551j665j0568j1025m436J703M357R572
707B048J0597L340o412r098p064o017j345P660J2557O644k7k816p249j1956o874
722a6012L809Q448O901O991M533m906j1641q848k119J125N323J0570J0194q96
736A3472p269o927o619o614J354J0412J0647L461m0k820r286j1080l036N518P075
751a752O688P308J901q028j1055o144j466J820P092J1374O410k909p061o769p680
766a0271m622M930J1079P950K984J82n546j0630q850J81N626O936P408O935j388
781A2904r612r347m434j497K689R477J0084K851m460n885o951q144k066P654R428
$$ plain form
678 -12534 -8924 -915 10369 16990 12935 3105 -5087 -11539 -14528 -9970 1921 11904 13177 9691
692 9691 4453 -5550 -15320 -14972 -6062 2279 8559 14110 12445 1877 -9148 -13584 -11881 -7524 2048
707 2048 12645 15985 9573 475 -6589 -12606 -13951 -6291 6266 12910 12883 10067 2818 -9138 -16012
722 -16012 -12203 -3755 3146 10137 14670 9764 -1877 -10725 -12844 -11719 -6396 4174 14368 13472
736 13472 6203 -724 -7343 -13957 -12603 -2191 8456 11917 11877 9057 -229 -11309 -14345 -8827 -1752
751 -1752 4936 12244 14145 6117 -4938 -11082 -12548 -10728 -3636 7738 14148 11239 4178 -2591 -10271
766 -10271 -14893 -9963 1116 9066 12050 12232 6686 -3944 -12794 -12613 -6987 -51 7357 14292 12904
781 12904 3292 -6055 -10489 -11986 -9297 180 10264 13115 8655 2770 -4181 -12325 -14391 -6737 2691
796B691N857K619j99p420j0820n538K259N449O691Q347M828m584r655o925m020
811a0420j527N192J0848P375J99m263o154q566o407J453Q287P965N247K794l098
826H925r068r492k449K490N395Q139Q208J411o542q478n721m003j12P825J0231
841F759M976j103l803o959q997m708M364P745O596N039K037n490r643p396m89
856a1072K488N503R038O671j423p370o520n799l548K904R110Q328K547r32l977
871E948q300q348j364N632O747N980N212K23q093r452m546n28K805O795R488M213
887A2412m113o248n964o325k354N685R539O311J814j003n574r298o322J330N588
902d522N901O160M777k658r220p087k964m06L347Q879P783R97m911m864o442n994
$$ plain form
796 2691 8548 11167 10968 3548 -7272 -12810 -10551 -5102 1589 9936 14764 10180 525 -6400 -10420
811 -10420 -11947 -6755 4093 11468 11667 7404 1250 -7316 -13723 -12270 -3983 3982 9229 12023 8925
826 8925 -143 -9635 -12084 -9594 -4199 3940 12148 13559 7017 -1461 -7182 -11185 -11297 -3472 6759
841 6759 11735 10632 6829 -130 -9127 -13835 -9471 -1726 4870 9909 11946 6456 -3187 -10583 -11072
856 -11072 -8584 -3081 5957 12628 11205 3835 -2685 -8484 -12032 -9128 -18 8310 10857 9925 5948
871 5948 -2352 -10700 -12064 -6432 315 6295 11507 11730 3637 -5815 -10361 -10889 -8084 -1289 8199 12412
887 12412 8299 2051 -3913 -10238 -12592 -6907 2632 8943 10757 9754 4180 -5118 -11440 -10110 -4522
902 -4522 1379 7539 12316 9658 438 -6649 -9613 -10019 -6672 2207 9990 10987 6076 1212 -5230 -11224
918a1224j45P634Q665M082P79j467p247r168l735L829M953N887P198K546n689
933F898q490n723k296n5N509R440N926j494m551m925p355n322K659Q159O461L565
949H406J775l035r124p806r72L796M576O706O877k5o917p227m077k345J215O819
965a358Q846K481j806l980n760p712k220M781P113N028L835P79n811r165n472
980a0421Q85L535N470P530N223k644q275n593l606k066K782Q964O944Q16k100
995G444m012p156o422l96N785O435M891L421p53p319q182l327J083L171O321P671
1011H655K554n073o384m559m127j338N924Q373M471j8k044m798p446m552K120
1026h242N952N569M625K513k885q931o252j531J476L571P901O434p80n466m847
$$ plain form
918 -11224 -11369 -3735 4930 9012 9791 8324 1077 -8091 -11826 -7997 -3044 2843 10041 12587 6898
933 6898 -1592 -7315 -9611 -9666 -4157 5283 11209 9715 5164 239 -7116 -12438 -9779 -1620 4841 8406
949 8406 10181 7146 -1978 -9784 -10756 -6960 -2384 4322 11199 11174 4257 -2970 -7047 -9392 -8177 -1358
965 -1358 7488 9969 8163 4183 -1577 -9289 -11509 -6728 385 5413 9248 10027 4216 -4949 -10421
980 -10421 -9536 -6001 -531 6999 12222 9578 1303 -4290 -7896 -9962 -7180 1784 8728 9544 7444
995 7444 3432 -3724 -10146 -10542 -4757 1678 6569 9990 9237 1918 -6264 -9591 -8508 -5337 984 8655
1011 8655 11209 6136 -248 -4807 -8934 -10272 -4348 4025 8496 8478 6434 1636 -5810 -10362 -8242
1026 -8242 -2290 3279 7904 10417 7532 -1399 -7651 -9182 -7706 -4135 3766 10200 9420 3954 -893
1041h93n255m184J571O780P084L191Q5k625o006p652k279L856N421M691N298J576
1057A0659n996p500m523j208J113N692Q156L557k222m866n235m860k650K914P455
1072D86N590J572O36l525p775o634Q27L868M212O118N166j951o679n874l365j593
1088h921K837O845P069J852l030m571n292n442j311N869O610L619J792Q2n771
1103B237p825l527J588K760N347O759K968l420p002m974k399j030L782Q226N483
1118H973o02k933l754o190n451K052O228M721L186K495j993p383o357j289J857
1133f440L140N622O201Q19n414n460l493l294M6O064P641K439j096j956m828o868
1149f877k981L656N636M370L183J838l846p900m548M2J869L244P158N034k050
$$ plain form
1041 -893 -6148 -10332 -8761 -1981 5103 8294 8379 5754 -252 -7904 -10183 -6327 -906 3785 9083 10659
1057 10659 4663 -2837 -7360 -8568 -7455 -1763 6393 9950 7728 2862 -2373 -7233 -9883 -6969 486
1072 486 6076 7648 8284 4759 -3016 -9650 -8823 -4955 -743 5375 10541 8590 1911 -3963 -7328 -8921
1088 -8921 -6084 761 7830 9682 6652 2081 -3211 -8653 -9964 -4095 2515 6134 7926 8008 2237
1103 2237 -5588 -9115 -7527 -4767 580 7339 10307 6887 -115 -5089 -7488 -8518 -4736 3490 8973
1118 8973 8371 5438 1684 -4506 -9957 -7905 -1677 3044 6230 8725 6732 -651 -7008 -8297 -6440
1133 -6440 -3300 2322 8523 9342 3928 -1532 -5025 -8319 -8273 -2209 5432 7871 6775 4819 -9 -6877
1149 -6877 -9858 -6202 -566 3804 6987 8825 4979 -2921 -7469 -7427 -5558 -2314 4844 9878 7828
1164G828n362m440m337k688K218O605N987J554o31k715n928o238j031M994M671
1179D87L496M155O57o410o780k091k47R79N815O651K334l245m734l932m163j844
1195h872L864P287M153M53r04l322o963n081K281M333L560M520L861k350o635
1210A85n108j732m97K674O244N798Q33l785m126m064m606k40O014O067K656P42
1226G055r91n209o805k241K756L085L954N167J883m039o418l668j266kL717P016
1242C994M006j271l252l651n098l308K297O432M102K226J171k690o766n101k15
1257g124K313L207N225M497o32n208n028k585j946O95N854O219J646j541k600
1272B992m336n372j736M393M771L424K569P77m423o533l463O57K309L490N608
$$ plain form
1164 7828 2466 -1974 -6311 -8999 -6781 -176 5811 7365 6734 4019 -1909 -8147 -9178 -4184 487
1179 487 3983 8138 8795 2385 -4395 -6486 -6733 -5754 61 6712 9046 5801 1067 -2865 -7028 -8872
1195 -8872 -5008 2279 6432 6885 5981 2659 -4304 -9385 -7104 -2771 789 5309 9170 6820 185
1210 185 -4923 -6655 -7152 -4478 1766 7564 8397 4612 486 -3578 -8184 -8424 -2410 3657 6313 7055
1226 7055 6064 855 -5950 -8191 -5435 -2350 1604 6771 8654 4615 -1803 -5471 -6737 -6739 -3022 3994
1242 3994 8000 6729 3477 -174 -5272 -8580 -6283 149 4251 6477 7648 4958 -1808 -6909 -7124
1257 -7124 -4811 -1604 3621 8118 7486 2278 -2750 -5335 -7281 -6586 -732 5487 7133 5592 2992
1272 2992 -1344 -6716 -8452 -4059 712 4136 6705 7482 3059 -3474 -6937 -6280 -3971 -481 5127
1287E127L198k431n028l613k985j775K625O471M411M24j377k860n369m614P35
1302g061M339M254L097K590r00n783n646j434P98J809N142N660J309l916m159
1317I9l147l418n90M515N976K501q0r09m035o012k839K404L780L518L639K300
1333G702l035o185l546o53J29K923N989M200j151l275l521l647l502J322N838
1348d12M521J403N02j552n620n383p04L093K845L754M159N96m766n004k341r97
1364e906N17M066O243K161j873l028l019m721j873K966N567L244R23J028k976
1379C319o075m243J344K598K526M571L387j535n039m187j848j263J621N561N348
1394F085M3k212k269l687m650m98M797M530K202J708k46m303n801k050J449K229
$$ plain form
1287 5127 8325 5894 866 -2747 -5732 -7507 -4882 1589 6000 6424 5047 2187 -3182 -7796 -7061
1302 -7061 -2722 1532 4629 7219 6319 536 -5110 -6544 -5746 -3937 1205 6865 8174 4258 99
1317 99 -3048 -6466 -7056 -2541 3435 5936 5856 4947 912 -5100 -7939 -5535 -1755 1763 5402 7702
1333 7702 4667 -1518 -5064 -5717 -5588 -2665 3324 7524 6373 3098 -423 -4070 -7572 -6250 -412
1348 -412 4109 5512 6014 4462 -1158 -6541 -7245 -4152 -1307 2447 6606 7202 2436 -2568 -4909 -5906
1364 -5906 -5389 -1323 4920 7081 5208 2180 -839 -5560 -7433 -4467 1100 4344 5267 6295 3319
1379 3319 -2756 -6999 -5655 -3057 -531 4040 7427 5892 853 -3334 -5182 -6445 -4824 737 6085
1394 6085 6128 3916 1647 -2040 -6690 -7188 -2391 2139 4341 6049 5803 1500 -4301 -6351 -4902 -2673
1410b673L483M466K139l225m723k536k144j231L009O123L288q06j480k576n094
1425c980l369J882M308L365K568J762j781n477m430o56J665J879M300M295M72
1440F803m134l684k358k657j44M792N304J595m80j482l887n061j248K391L793
1455d57K832K740J172l190n468l007L36O34K738N422L160j889l371k498l360k360
1471f566K453M968L420R79m09j930m785m181K16K962K939K844L215n62m382m529
1487c348j625j09R68M079N007J102k135k601l138l375r56L192M868K544P86m66
1503D793k721n530k635J596K610K172L665K243j920m989k942j022q74K406M996
1518A848L614j47k323k640l441l155P72M598L248J566J360n77m877m522q89J587
$$ plain form
1410 -2673 810 5276 7415 4190 -533 -3069 -5213 -6444 -3435 2688 5976 5170 3690 1114 -3980
1425 -3980 -7349 -5467 -1159 2206 4774 6536 4755 -722 -5152 -5808 -4143 -2264 2036 6331 6803
1440 6803 2669 -1015 -3373 -6030 -6174 -1382 3922 5517 5037 3555 -332 -5393 -6641 -4250 -457
1455 -457 2375 5115 6287 3097 -2371 -5378 -5042 -4408 -1670 3752 6912 5023 1652 -846 -4206 -6566
1471 -6566 -4113 855 4275 5254 4845 2915 -1870 -6051 -5835 -2873 66 2910 6125 5563 1181 -3348
1487 -3348 -4973 -5082 -4114 -35 4972 6074 3939 1338 -1800 -5175 -6131 -2939 1929 4473 5259 4793
1503 4793 2072 -3458 -6093 -4497 -1887 285 3950 6193 4273 -716 -3658 -4680 -5554 -3148 1848
1518 1848 5462 5315 2992 352 -3089 -6244 -5472 -874 2374 3940 5300 4723 -154 -4676 -5565 -3978
1534c978J963L738L819P31l402l972k453j612q6L477M986K453j706j612k605m104
1550d363k271K655L963K178K109J407k542m965k590l42J303K519L747L185m85
1565E508l889l366j935j508M11M877M373J13p86r47m384m217J0L328K762K443
1581B793K280k56l138m311k102K18J485K860M083K469k435l595k115k346j860
1596e970K742N144K488j50j97k455m366k756N73L040K912K244J846k97m566m046
1612c814n75L86R94L814M614k98k692k231k650l016L72L770L822J756M70j047
1628C675l252m092k011J851K967J875L157J675k705m576k148n34k63K400M695
1643B714K515j151k021k294l141k055J267L964L287J203j93r97m098l757M9K200
$$ plain form
1534 -3978 -2015 1723 5542 6273 2871 -1101 -3554 -5166 -5252 -1775 3211 5664 3958 2346 -259 -4363
1550 -4363 -6634 -3979 -16 2162 4271 5678 3136 -1829 -4419 -4761 -3458 -939 2808 5993 5508
1565 5508 1619 -1747 -3682 -5190 -4779 98 4471 4584 3798 2851 -1533 -5750 -5740 -2412 350 2793
1581 2793 5073 4817 1679 -2632 -4734 -4516 -3031 -171 3912 6381 3946 351 -1764 -4110 -5970
1596 -5970 -3228 1916 4404 4254 4057 1602 -2764 -5520 -4947 -1907 1005 3249 5095 4798 232 -3814
1612 -3814 -4389 -4003 -3009 805 5419 5121 2429 198 -2452 -5468 -5096 -1326 2496 4252 4722 3675
1628 3675 423 -3669 -5680 -3829 -862 1013 4170 5845 3140 -1436 -3584 -4118 -4381 -1981 2714
1643 2714 5229 4078 2057 -237 -3378 -5433 -4166 -202 3085 4288 4095 3098 -1000 -4757 -4708 -2508
1659b508J661K729L227J6l557l233j726j265N31L772M070J073j238k142k463k849
1675c902j648K617L627K077J204O64k628m720k156J235J065K288L527K207j643
1690C814l281k571j425j124J296M247L273J47j670j600k881l208K34L401K391
1705A043J755J653m21l713l636q58N55J372K947L690P19k193l137j961j824m13
1721d422K551L970J872n09n34k305l733k027J409K872K205J863J470j821l730
1736h69k570m49M28J871L472K866n26k563k223j998k136N96L771L043J084k61
1752C536r86l255l576m75J880K601K194K202K61k489l724j866j24N73K513L807
1768C072J644j182k343j996k808j496K087L929K128N20L1j535l958k278M23K064
$$ plain form
1659 -2508 -847 1882 5109 5125 1568 -1665 -3391 -4656 -4125 -353 3717 4790 3552 1410 -1053 -3902
1675 -3902 -5550 -2933 694 2771 3975 4639 2011 -2709 -4865 -3630 -2565 -277 3250 5457 3814
1690 3814 533 -2038 -3463 -4587 -3291 956 4229 4376 2706 1106 -1775 -4983 -4749 -1348 1043
1705 1043 2798 4451 4030 317 -3319 -4177 -3622 -2250 697 4387 5106 2913 -224 -2185 -4009 -4422
1721 -4422 -1871 2099 3971 3462 2928 623 -3110 -5137 -3728 -856 1349 3212 4682 2861 -869
1736 -869 -3439 -3888 -3460 -1589 1883 4749 4223 1660 -563 -2561 -4697 -4101 -330 2713 3797 3536
1752 3536 2550 -705 -4281 -4756 -2876 -275 1919 4121 4382 1893 -1831 -3697 -3821 -3248 -735 3072
1768 3072 4716 3534 1191 -805 -3613 -5109 -3022 907 3035 3555 3586 2051 -1907 -4185 -3762 -1698
1784a698J698K658J976n57l653k585r68j079J282L103L611P3j281j715k530k331
1800c996p46L345K762J640O49Pk841l775j278J114J648K061K617J577k034l231
1816d81j796j140n16J814L633K454n65j355j635k486k507J094K857K354R04J190
1832C819p06l429l097l07R81J462K763K450L27k654k336j720j237P2K926L540
1848B854J310r60j253k191l153j310K122K843J441J708O26k127l576j698J66L97
1864b801J913L371J711o76k967j606j658q68O82L370K678K27m87j438k828k231
1880c608n4K082K126J555J622j86k938l070q46K02Q97K401L072R03j662k178j350
1897a032k399n78J978L550J527K10m25j958l076j928J112J790J875K036J386j322
$$ plain form
1784 -1698 0 2658 4634 4077 424 -2161 -3129 -4208 -2926 177 3788 3861 2580 865 -1665 -3996
1800 -3996 -4742 -1397 1365 3005 3654 3661 820 -2955 -4233 -3119 -1471 590 3207 4784 2750 -481
1816 -481 -2277 -3417 -3933 -2119 1514 3968 3403 2048 413 -2073 -4580 -3486 -629 1725 2629 3819
1832 3819 3113 -316 -3413 -3720 -2739 -1277 1486 3936 4263 1609 -727 -2447 -3684 -3612 -686 2854
1848 2854 4164 3204 1951 -240 -3393 -4703 -2581 262 1703 3411 4037 1910 -1666 -3364 -3198 -2801
1864 -2801 -888 2483 4194 3518 551 -1055 -2713 -3581 -2899 471 3149 3376 2889 1451 -1377 -3608
1880 -3608 -3662 -1580 546 2101 3723 3537 599 -2471 -3317 -3115 -2218 183 3255 4158 2496 318 -1032
1897 -1032 -3431 -4009 -2031 1519 3046 3256 2831 873 -2203 -4131 -3019 -1229 646 2682 4068 2746
1913B746l118k060m24j18J034L260K234Oj816j693k145j767N03K751K341R05O33
1930C272p56k677k998m36J170J750J705K606K71k108k601j653o70J93J926L126
1946B120J643r45j444j756k461j336J570K548J926R43L19j485k790k050K40Q58
1962b100J751K229K152n38k497k133j476p36N35K938K624N08r17j151k187k415
1978c413k43K095K003J449J293P0k418k677j310M71Q64J871K322J169j264k345
$$ plain form
1913 2746 -372 -2432 -2856 -2974 -1940 1320 3554 3560 1744 51 -2094 -3861 -3358 -607 1734 2639 3272
1930 3272 2516 -161 -3159 -3595 -2425 -675 1030 3636 3907 1799 -802 -2455 -3125 -2932 -1006 2120
1946 2120 3763 2818 1374 -382 -2843 -4179 -2609 -61 1865 2808 3127 1642 -1148 -3198 -2958 -2100
1962 -2100 -349 1880 4032 3494 997 -1136 -2612 -3348 -2813 125 2749 3257 2340 1189 -998 -3413
1978 -3413 -3656 -1561 442 1891 3184 3254 836 -1841 -3151 -2680 -1816 55 2377 3546 2282 -63
$$ [...]
8191a91
##END NTUPLES=NMR FID
##END=
