##TITLE=1H_SR115_k3
 CDCl3
 8 sc, 
 8.07.2022
##JCAMPDX= 6.0         $$ Bruker NMR JCAMP-DX V2.0
##DATA TYPE= NMR FID
##DATA CLASS= NTUPLES
##ORIGIN= UXNMR, Bruker Analytische Messtechnik GmbH
##OWNER= root
$$ XWIN-NMR		Version 3.5
$$ Fri Jul  8 15:54:17 2022 Russian Standard Time (UT+4h)  she@DPX200
##.OBSERVE FREQUENCY= 200.1313499994
##.OBSERVE NUCLEUS= ^1H
##.DELAY= (6, 6)
##.ACQUISITION MODE= SIMULTANEOUS
##.ACQUISITION SCHEME= undefined
##.AVERAGES= 8
##.DIGITISER RES= 18
##SPECTROMETER/DATA SYSTEM= spect
##.PULSE SEQUENCE= zg30
##.SOLVENT NAME= CDCl3
##.SHIFT REFERENCE= (INTERNAL, CDCl3, 0, 15.7039)
##AUDIT TRAIL= $$ (NUMBER, WHEN, WHO, WHERE, WHAT)
$$ ##TITLE= Audit trail, XWIN-NMR		Version 3.5
$$ ##JCAMPDX= 5.01
$$ ##ORIGIN= Bruker BioSpin GmbH
$$ ##OWNER= she
$$ F:/spectra/data/she/nmr/H-F/1/audita.txt
$$ ##AUDIT TRAIL=  $$ (NUMBER, WHEN, WHO, WHERE, WHAT)
(   1,<2022-07-08 15:53:16.23 +0400>,<she>,<DPX200>,
      <created by zg, POWCHK disabled, PULCHK disabled
       configuration hash MD5:
       00 E9 B6 7A A2 85 ED C7 34 08 36 98 17 FE 4E 26
       data hash MD5: 16K
       23 EC A6 2A CA C4 CF CC 95 73 68 40 BC 22 AC 67>)
$$ ##END=
$$ 
$$ hash MD5
$$ D7 63 1D 5F C2 E5 03 01 93 1B 4D 1B 49 03 BB 87
##$RELAX= 
##$RELAX= 
##$RELAX= 
##$RELAX= 
##$RELAX= 
##$RELAX= 
$$ Bruker specific parameters
$$ --------------------------
##$DU= <F:/spectra>
##$EXPNO= 1
##$NAME= <H-F>
##$PROCNO= 1
##$TYPE= <nmr>
##$USER= <she>
##$AMP= (0..31)
100 100 100 100 100 100 100 100 100 100 100 100 100 100 100 100 100 100 
100 100 100 100 100 100 100 100 100 100 100 100 100 100 
##$AQSEQ= 0
##$AQ_mod= 1
##$AUNM= <au_zg>
##$AUTOPOS= <>
##$BF1= 200.13
##$BF2= 200.13
##$BF3= 200.13
##$BF4= 200.13
##$BF5= 200.13
##$BF6= 200.13
##$BF7= 200.13
##$BF8= 200.13
##$BYTORDA= 1
##$CFDGTYP= 0
##$CFRGTYP= 5
##$CHEMSTR= <none>
##$CNST= (0..31)
1 1 145 1 1 1 1 1 1 1 1 1 1 1 1 1 1 1 1 1 1 1 1 1 1 1 1 1 1 1 1 1 
##$CPDPRG= <>
##$CPDPRG1= <>
##$CPDPRG2= <>
##$CPDPRG3= <>
##$CPDPRG4= <mlev>
##$CPDPRG5= <mlev>
##$CPDPRG6= <mlev>
##$CPDPRG7= <mlev>
##$CPDPRG8= <mlev>
##$CPDPRGB= <>
##$CPDPRGT= <>
##$D= (0..31)
0 1.2 0 0 0 0 0 0 0 0.06 0 0.03 0 0 0 0 0.0002 0 0 0 0 0 0 0 0 0 0 0 0 
0 0 0 
##$DATE= 1657281195
##$DBL= (0..7)
120 120 120 120 120 120 120 120 
##$DBP= (0..7)
150 150 150 150 150 150 150 150 
##$DBP07= 0
##$DBPNAM0= <>
##$DBPNAM1= <>
##$DBPNAM2= <>
##$DBPNAM3= <>
##$DBPNAM4= <>
##$DBPNAM5= <>
##$DBPNAM6= <>
##$DBPNAM7= <>
##$DBPOAL= (0..7)
0.5 0.5 0.5 0.5 0.5 0.5 0.5 0.5 
##$DBPOFFS= (0..7)
0 0 0 0 0 0 0 0 
##$DE= 6
##$DECBNUC= <off>
##$DECIM= 32
##$DECNUC= <off>
##$DECSTAT= 4
##$DIGMOD= 1
##$DIGTYP= 9
##$DL= (0..7)
0 120 120 120 120 120 120 120 
##$DP= (0..7)
150 150 150 150 150 150 150 150 
##$DP07= 0
##$DPNAME0= <>
##$DPNAME1= <>
##$DPNAME2= <>
##$DPNAME3= <>
##$DPNAME4= <>
##$DPNAME5= <>
##$DPNAME6= <>
##$DPNAME7= <>
##$DPOAL= (0..7)
0.5 0.5 0.5 0.5 0.5 0.5 0.5 0.5 
##$DPOFFS= (0..7)
0 0 0 0 0 0 0 0 
##$DQDMODE= 0
##$DR= 18
##$DS= 0
##$DSLIST= <SSSSSSSSSSSSSSS>
$$ [...]
##$SUBNAM2= <"">
##$SUBNAM3= <"">
##$SUBNAM4= <"">
##$SUBNAM5= <"">
##$SUBNAM6= <"">
##$SUBNAM7= <"">
##$SUBNAM8= <"">
##$SUBNAM9= <"">
##$SW= 18.0517283424941
##$SWIBOX= (0..15)
0 0 2 0 0 0 0 0 0 0 0 0 0 0 0 0 
##$SW_h= 3612.71676300578
##$TD= 16384
##$TD0= 1
##$TE= 0
##$TE2= 300
##$TE3= 300
##$TEG= 300
##$TL= (0..7)
0 120 120 120 120 120 120 120 
##$TP= (0..7)
150 150 150 150 150 150 150 150 
##$TP07= 0
##$TPNAME0= <>
##$TPNAME1= <>
##$TPNAME2= <>
##$TPNAME3= <>
##$TPNAME4= <>
##$TPNAME5= <>
##$TPNAME6= <>
##$TPNAME7= <>
##$TPOAL= (0..7)
0.5 0.5 0.5 0.5 0.5 0.5 0.5 0.5 
##$TPOFFS= (0..7)
0 0 0 0 0 0 0 0 
##$TUNHIN= 0
##$TUNHOUT= 0
##$TUNXOUT= 0
##$USERA1= <user>
##$USERA2= <user>
##$USERA3= <user>
##$USERA4= <user>
##$USERA5= <user>
##$V9= 5
##$VALIST= <valist>
##$VCLIST= <CCCCCCCCCCCCCCC>
##$VD= 0
##$VDLIST= <DDDDDDDDDDDDDDD>
##$VPLIST= <PPPPPPPPPPPPPPP>
##$VTLIST= <TTTTTTTTTTTTTTT>
##$WBST= 1024
##$WBSW= 4
##$XGAIN= (0..3)
0 0 0 0 
##$XL= 0
##$YL= 0
##$YMAX_a= 106445
##$YMIN_a= -95133
##$ZGOPTNS= <>
##$ZL1= 120
##$ZL2= 120
##$ZL3= 120
##$ZL4= 120
##$ABSF1= 10
##$ABSF2= 0
##$ABSG= 5
##$ABSL= 3
##$ALPHA= 0
##$AQORDER= 0
##$ASSFAC= 0
##$ASSFACI= 0
##$ASSFACX= 0
##$ASSWID= 0
##$AUNMP= <proc_1d>
##$AZFE= 0.1
##$AZFW= 0.1
##$BCFW= 1
##$BC_mod= 2
##$BYTORDP= 1
##$COROFFS= 0
##$CY= 11.3945322036743
##$DATMOD= 1
##$DC= 2
##$DFILT= <>
##$DTYPP= 0
##$F1P= 2.36226072786647
##$F2P= -0.459571619588291
##$FCOR= 0.5
##$FTSIZE= 0
##$FT_mod= 4
##$GAMMA= 1
##$GB= 0.15
##$INTBC= 1
##$INTSCL= 1
##$ISEN= 128
##$LB= 0.24
##$LEV0= 0
##$LPBIN= 0
##$MAXI= 10000
##$MC2= 0
##$MEAN= 0
##$ME_mod= 0
##$MI= 1.114404
##$NCOEF= 0
##$NC_proc= 0
##$NLEV= 6
##$NOISF1= 3.799351
##$NOISF2= 2.8
##$NSP= 1
##$NTH_PI= 0
##$NZP= 0
##$OFFSET= 15.70392
##$PC= 1
##$PHC0= -18061.08
##$PHC1= 14.40068
##$PH_mod= 1
##$PKNL= yes
##$PPARMOD= 0
##$PSCAL= 0
##$PSIGN= 0
##$REVERSE= no
##$SF= 200.130013532006
##$SI= 16384
##$SIGF1= 3
##$SIGF2= 2
##$SINO= 400
##$SIOLD= 16384
##$SREGLST= <1H.CDCl3>
##$SSB= 0
##$STSI= 0
##$STSR= 0
##$SW_p= 3612.71676300578
##$SYMM= 0
##$S_DEV= 0
##$TDeff= 0
##$TDoff= 0
##$TI= <>
##$TILT= no
##$TM1= 0
##$TM2= 0
##$TOPLEV= 0
##$USERP1= <user>
##$USERP2= <user>
##$USERP3= <user>
##$USERP4= <user>
##$USERP5= <user>
##$WDW= 1
##$XDIM= 8192
##$YMAX_p= 0
##$YMIN_p= 0
$$ End of Bruker specific parameters
$$ ---------------------------------
##NTUPLES= NMR FID
##VAR_NAME=  TIME,          FID/REAL,        FID/IMAG
##SYMBOL=    X,             R,               I
##VAR_TYPE=  INDEPENDENT,   DEPENDENT,       DEPENDENT
##VAR_FORM=  AFFN,          ASDF,            ASDF
##VAR_DIM=   8192,          8192,            8192
##UNITS=     SECONDS,       ARBITRARY UNITS, ARBITRARY UNITS
##FACTOR=    0.0002768,     1,               1
##FIRST=     0,             0,               0
##LAST=      2.2672688,     0,               0
##MIN=       0,             -95133,          0
##MAX=       2.2672688,     106445,          0
$$ Real data points
##PAGE= N=1
##DATA TABLE= (X++(R..R)), XYDATA
0@%%%%%%%%%%%%%%%Nj3J6j6J6j6K4l2L2m0M8n6O4p2Q6r7J09j24J41j59J80k03
37a07K27k54K82l14L51l89M31m77N29n86O46p11P84q64R49j046J155j274J408
56G40j561J736j940K178k460K803l231L780m516N562p181J0044j6658O2579L1600
71H3475n4639j4121n1238O097O1254M8933j2173k5627n6459n2934J5957P1901
83B0426L3153r329l8245o3284l7854M6119O6250K0338j2868l3267n9313j7809
95h5683N9513O7129J5127j9894m6769n1759J2452P6492M6177j4036l3062m0458
107a4771l3871K3757O4292K7407k8255m3104l7082q545L7614M4579L519k6239
119I301l1506k9680J041M4169L7585m890k4021k4522k2858Q298M7735L5079j0515
$$ y = [0, 0, 0, 0, 0, 0, 0, 0, 0, 0, 0, 0, 0, 0, 0, 0, 5, -8, 8, -8, 8, -8, 16, -16, 16, -24, 24, -32, 32, -40, 46, -51, 58, -66, 75, -84, 96, -107, 120, -134, 148, -166, 185, -204, 227, -250, 279, -307, 339, -372, 412, -452, 497, -549, 606, -668, 740, -821, 915, -1025, 1153, -1307, 1496, -1735, 2045, -2471, 3091, -4090, 5954, -10704, 51875, 83475, 28836, 14715, -36523, -30426, 30828, 79761, 67588, 41961, -14498, -67432, -51475, 20426, 53579, 44250, 6005, -57279, -95133, -49014, 17236, 37574, 24706, -8561, -67874, -85683, -26170, 40959, 56086, 36192, -10577, -62336, -49884, 26608, 72785, 58749, 25687, -14771, -48642, -24885, 39407, 66814, 38559, -4545, -41627, -50172, -12558, 32021, 35540, 9301, -22205, -51885, -50844, -6675, 30910, 26020, 1999, -22523, -45381, -37083, 10652, 45731, 35216]
132C5216k9434k6220j4779J9892M5524K0542k1142l1684k3747p185K5463L9885
144C2331P689k7133k9036j7888J533L0570L4140k15k8659k7207j3367J2783L8163
157A3704K6319j4887l2990j9100q88J9547L4190J2835k3902k8489r288M720J9051
170H22K6638K855k6649k2940m463O888J9629K0647n569k5379j4086l1P712K0130
184F204J8674q373k2886j1237o7R946K4441J5756j5412k5975j0262L444J7113
197A366K4987M158k5731k4122l082J0375J9804J8128q501k8460j4616N737J3468
210f489J7378R308j4709k2650m586J0194J1735J3429L713j5148j5276J293P572
223d236Q849J1946J198j4491j2174k39N537J0074J2091k187j7914j2587P43Q494
$$ y = [35216, 5782, -20438, -35217, -15325, 30199, 50741, 29599, -2085, -25832, -33017, -7554, 32331, 40020, 12887, -16149, -34037, -32504, -1934, 32206, 31991, 3332, -23875, -37242, -24459, 13704, 40023, 25136, -7854, -26954, -27842, -8295, 25895, 38730, 14828, -13661, -22949, -18229, 822, 27460, 30315, 3666, -19274, -23737, -16849, 2780, 23427, 17858, -7521, -21607, -21638, -13926, 6204, 24878, 16505, -6381, -17618, -17685, -7739, 16702, 32458, 17046, -8929, -19191, -15747, 1366, 26353, 30511, 4780, -19342, -22424, -12049, 7755, 25883, 17382, -11078, -25694, -19957, -6489, 10889, 20197, 5488, -17162, -21748, -11554, 181, 13610, 17323, 2175, -13101, -11808, -4236, 4613, 16559, 17757, 3266, -8908, -9147, -3610, 6464, 18555, 16368, -1546, -14133, -13390, -4896]
237d896J3900R265j0288k0468q354P044J3075J3196J883j5131j6731m10J1386
250f529J2719Q449l274j5403j0283M095J1235R919M085o811j3097o068N748R760
264D545P027J036q666j1103k753N958P694N254o85q955j0097j065O959P836N034
279H019k158r776r032J936R291Q698K711m681j0162n921M229R697P559L35p679
294C066r820l097O312R815N907l149r926q519Q83Q689Q506J634o365r450n914
309a1428M704R525N024k573p095o277r39O075P019J833l611m724k488L88L435
324a132M786K848j964m958l978P8M542N208K047l235o011m078J135N223N917J068
340G496n264p875l857M517Q821M223l956q128m865J539O246O398J079n933o574
$$ y = [-4896, 9004, 18269, 7981, -12487, -20841, -13797, -722, 12474, 14357, -774, -17505, -17915, -6529, 6190, 14639, 11365, -4038, -14321, -10226, 1009, 10928, 15013, 8202, -4895, -10963, -5215, 4545, 11572, 12608, 3942, -7161, -9914, -3956, 3738, 8992, 8307, -648, -10745, -11810, -4851, 2985, 8019, 5861, -3915, -12947, -11011, -1720, 6978, 9689, 5008, -5154, -11075, -6846, 2851, 10410, 10745, 3066, -6754, -9851, -3539, 6276, 12183, 9034, -892, -9411, -8528, 161, 8667, 10301, 3936, -5514, -11428, -6724, 2801, 7825, 5252, -1843, -8120, -9059, -2984, 4035, 5868, 2257, -2467, -4955, -4567, -1132, 3654, 6502, 4538, -420, -4398, -4320, 222, 5430, 7477, 4242, -1769, -5847, -4712, 511, 6428, 7496, 2232, -5643, -9500, -4983, 3838, 8061, 4105, -4023, -8888, -7349, -1103, 5295, 6374, 441, -6133]
355f133o90M560N312K948j230n338l722J173M444L196K30j992k925j518L42J008
371c35J960K233p73m391l300L80K818K789K223k852m844k081J865L721M223J145
387D781m879n427J21M744L969K494j566n827l371L181N235J876l12k741m636q98
403c256L348L038L25n98l347m036R29L619J117m90o57k918k538K006L252M81K43
420E18K4k377j945K227K822R55P81k88l482j270K867J887L85J316j229m988p22
437b519L598J786l5J8l402m445J331M321P91n62j374l890k526M565M410j124j422
454d79m53k993N03N013K197k001p60j319j095K134L425r30k437P26k54k143J172
471C06K338j836j168J458j360k778P79J650M22N11l74l616j453L527K479l04N14
$$ y = [-6133, -6823, -2263, 3049, 5997, 4767, -571, -4293, -3120, 1324, 4520, 4750, 2758, -167, -1685, -1343, -335, 1625, 3858, 3085, -1306, -4606, -4226, -1408, 1381, 3604, 752, -4092, -6173, -4308, -587, 3636, 4781, -98, -5525, -5404, -660, 3309, 5803, 4237, -1590, -4961, -1780, 3455, 5331, 5019, 2278, -2358, -3256, 92, 3130, 3455, 2857, -490, -4526, -3597, 22, 1139, 649, -8, -2926, -5464, -3458, -206, 275, 518, 542, -1835, -3780, -1553, 1269, 2224, 3005, 2717, -765, -2035, 832, 2719, 3104, 4420, 3191, -1797, -2519, 1079, 2865, 2830, 2848, -554, -4999, -3668, 653, 1444, 882, -492, -4382, -6908, -2343, 2067, 943, -479, -932, -3925, -3422, 1591, 3788, 1787, 1027, -292, -1387, 747, 4172, 3242, 805, 1531, 1277, -866, 306, 2644, 808, -360, 1098, -262, -3040, -2261, -611, -189, 322, -52, -3668, -5121, -1594, 885, 581, 1095]
488A095j512l393R38N089K015j724j466j848j015K986L448q75k473j670j246O82
504i69L293P95k903k295L23pK44J811J3j644r68P18J75M55J060l41m6O98K67j147
524d68M42J743R10o17n79q24j141Q44K056J18j628j922p06L1J534J250r08k352
542b217q54J11P20K080J271j429k122M29J420J156J884O21k553j225J372J312
558A976M89J216r60k765r3J460L2m37M42j585j944M11N70n96j72J004j113j193
576c258J234M00p11J628J538j360o03J693M80j71J957M54j857n40J333m56L67
593B128J456j154l142M8J463q16N94K65k867k303J657J436p55M98jk131r2L091
611f25N72p85Q54K85q82J076J837n52j72J495k28j427N20M08j148P18P81j897
$$ y = [1095, -417, -3810, -2872, 2217, 4232, 2508, 1042, -806, -1821, 1165, 4613, 3738, 1265, -405, -1651, -969, 2324, 3119, 216, -2079, -1756, -1763, -1519, 292, 305, -1339, -2307, -1589, -1414, -959, 101, -240, -286, 412, 679, -468, -26, 1717, 2627, 2010, 1431, 607, -534, 310, 2366, 2484, 856, -1066, -1772, -1741, -207, 1043, 135, -2217, -3071, -2960, -2240, -160, 1111, -318, -2440, -2011, -591, 565, 2449, 3070, 517, -708, 664, 1976, 2465, 3681, 2721, -44, -137, 1323, 1355, 918, 1360, -225, -2169, -1758, -1188, -1784, -1956, -952, -2065, -3258, -2024, -1624, -2335, -707, 831, -529, -1132, 561, 1041, 870, 2827, 3281, 1424, 884, 2217, 1761, 2128, 3584, 2430, -712, -664, 799, -17, 577, 842, -2025, -4328, -2671, -1235, -1990, -1492, -1493, -3624, -3716, -625, -53, -838, 16, 301, -581, 495, 2332, 1780, 1608, 3103, 2875, 1448, 1968, 2376, 1228, 1946, 2727, 830]
629H30j838N10K7o81Q43j02k297q77J268K51K97J157p14j833P43K140M01P23M11
648A259r63o48J745J343j30k05m75p39m7R03P1j178k51l26r70j03p0k34p45N00
668a263j1p79m73P09K87N89L66k67k68M03Q52O29P56M0p22k90O00O97N64k48p28
689A443j129n50P54R21n34j028q75m66R6N03M04p43p81j31M59N38O72M50m44j96
709f37l9O50O77M97k30j32J69L5q1L76P8n88J4J32l12j048K47K32m4l23p4j041
731a442l40P64O36p2o08n06j71O43J143N86p71m12p7M71J251O75m86n84l60K85
751F25L18P40k49j027p42L81K34k66K07l52p61k06N32%l14j04N6M5L26o8M1J26
773d58M22K12L41o5m87N6Q57M26j50n40M4j76J07O26j10m50p43l49K56L81j16
$$ y = [830, -1008, -498, -471, -1152, -309, -411, -2708, -3585, -2317, -2066, -1769, -612, -1326, -3159, -2416, -276, 125, 848, 1259, 296, -352, 1393, 2736, 2606, 2401, 1926, 1187, 1140, 2043, 2114, 936, 685, 359, -611, -714, -784, -1018, -1763, -1263, -1274, -2053, -2526, -1817, -1530, -941, -575, -842, -1110, -707, 145, 774, 1530, 1570, 848, 558, 1158, 1855, 2419, 2171, 1443, 314, -236, 518, 1439, 905, -123, -998, -1464, -1368, -865, -461, -1204, -1985, -2116, -1657, -1119, -447, 3, -441, -637, -676, -26, 651, 1148, 918, 786, 955, 990, 909, 1285, 1363, 775, 789, 921, 609, -439, -192, 40, -4, -327, -401, -1442, -1782, -1018, -382, -454, -1062, -1568, -1739, -1096, 47, 633, -138, -550, -627, -156, 1095, 1770, 1284, 700, 340, 625, 943, 1683, 1434, 407, -335, 46, 280, 14, 221, -131, -892, -1098, -566, -566, -880, -984, -928, -883, -557, -625, -584, -458, -36, 176, 517, 452, -35, 21, 878, 1304, 1154, 614, 658, 482, 589, 1215, 1105, 655, -88, -437, -181, 200, 84]
794H4j22p10m80K89J95M16j87l14k62j9O04M53J26k38J74j73K44M28K13J72l62
815E31J1K99Q6l89J95j30K03k41n94q3j32Q9J74j98o27k55j08M47K3L23k90j53
837h19j17M12O28L72l3l48j34J45P37L60k24k27n61K64K80J90j82n05j21l08J56
858c5J21j17j66n41rR4k8j10J01k51J98M06q7j17J54O67J62O5p0m7p9K77K54K68
882A110l74j41l51j67M57l18k46j74l91k71N37K60n75j16j27j0K31M56R7m23l76
903i12N22M93j7O44k75k38L31K3K40j63l3O9k13q0J3r5l77R5o0j75L3n09j43M04
927d23j09N9m03J11k08Q1O90L29k69r5KL61J80J35L18j29k92R6L21O7j46k15k33
950B28j11J14J54j28m41j93J6l63J62M81o06m2k6J33J17J46k09O4M67o5j10J73
$$ y = [84, -38, -748, -1228, -939, -744, -328, -515, -829, -1091, -1110, -506, -53, 73, -165, 9, -164, 80, 508, 721, 893, 531, 542, 841, 927, 538, 733, 603, 806, 565, -29, -112, -244, -155, 19, -179, -806, -1061, -1169, -722, -699, -376, -666, -819, -936, -524, 104, 476, 443, 95, -39, 106, 843, 1203, 979, 752, 191, 455, 735, 925, 743, 238, 117, -191, -35, 86, -31, -197, -738, -747, -653, -681, -791, -690, -941, -743, -337, -424, -541, -387, 280, 442, 507, 437, 390, 311, 588, 842, 1110, 736, 595, 244, 77, 534, 216, -30, -204, -595, -866, -329, -69, -644, -760, -887, -897, -666, -210, -113, -536, -912, -390, 103, 86, 730, 455, 217, 548, 571, 811, 648, 615, 684, 471, 391, 404, 309, -68, 27, -33, -208, -175, -684, -827, -423, -532, -473, -876, -765, -973, -892, -202, 127, -142, -237, -235, 126, 306, 441, 759, 630, 338, 434, 755, 822, 676, 461, 228, 117, 231, 385, 257, -184, -377, -361, -724, -562, -81, -687, -729, -755, -622, -505, -359, -568, -504, -37, -102, -212, -39]
972c9O44k03j51M97K21l92k7L71n08K67j0j94m73j44J7J6K5k0m77n37O16j31J55
995d77j80j54k42M32L61M0J62K77j36n01R16L56o43L13L48l60o2N16N5p16J81
1016D86m2l20J48Q9m56l11J87j05m67L95Mn51K71J02j10kM08m6o5L61L31m78M53
1039B82N47o3l42L92L5k91P6J37j83k3j75p8l04L9j02n00P1J23p9l35Q4j51%N56
1063b84k56q0K61K78n8J98M44k57k81Q25k07l1N50k39k40n1L11j11k08N8m56m71
1085c05J23j5r3l61J15n83P7M73k89J55n9j14L55N09J9j81L14M34j08J34J53n0
1107G03l97P55N8m58n2K04o73M3L80m88k47k4p1n45J72K49m58j26J19r0J73N46
1129b27j12l92L93K22R5L51L25j55j36L98K33J0P4k37l86m00P18J7o88N5m47l04
$$ y = [-39, 605, 402, 251, 748, 969, 577, 550, 921, 413, 680, 670, 476, 3, -141, -124, -108, -83, -103, -580, -1117, -501, -632, -477, -657, -811, -1053, -621, -260, -220, -58, 219, 83, -418, 498, 854, 211, 524, 872, 512, 450, 966, 1021, 305, 486, 444, 124, 272, 361, -95, -406, -219, -324, -791, -396, -392, -943, -672, -570, -680, -682, -274, -320, -385, -24, 307, -171, 282, 829, 766, 424, 816, 851, 560, 636, 773, 590, 567, 392, 314, 10, 49, -53, -553, -482, -359, -438, -773, -689, -840, -840, -284, -540, -620, -359, -81, -139, 59, 503, 246, -35, 790, 583, 552, 1102, 863, 623, 572, 883, 772, 564, 622, 166, -305, -182, -197, -290, -651, -536, -1119, -1042, -569, -858, -703, -762, -876, -521, -12, 7, -174, 140, 574, 466, 600, 753, 703, 306, 1061, 1119, 661, 609, 813, 140, 183, 563, 75, -172, -196, -267, -812, -640, -391, -849, -975, -856, -946, -773, -227, -339, -731, -338, -116, -21, 330, 655, 500, 364, 762, 995, 1005, 1079, 842, 456, 56, 774, 791, 103, 158, -289, -593]
1151e93K5N27m88k91L41m87K23K94N9l71K36M11j00J68M57k29j68N11K70k05q
1172E82K00j84K01J28j25n27R9l94j59J10J2l28n61L88k56J48J57R6k65L6K77
1193c65p2J99K99lo8O11r1oJ70J02k86L3J19R6l89q4j26j98K70q6n03r7K86k72
1217d61l5j93K05j25j71M72j08K42M0j62J03M33kQ5Q1r2J35P4k8J78j56K02k84
1240D33q8m8M0l84m2l7j94j9R3k43Jr5L7K5L3QK1R4N46k34J90K08q0J69K0L22
1266G76k60j93J85K9j44Q0l54Q4J1k58Q4j91J25l94P0L4k19k9M0J54j82Q2J39
1289c31r2J38J35oK20K20K5J10j66K91j83RK74k03j12j19L29j81k14j4j90j42
1311b02o1P7k73q0R3m2K53j10P0j55K90J9m9J51j13J36J82K73o1j27j8J80o3N7
$$ y = [-593, -568, -41, -529, -820, -479, -966, -743, -449, -390, -761, -525, -114, -214, -46, 411, 182, 14, 525, 795, 590, 582, 782, 598, 799, 927, 802, 275, 374, -20, -179, -69, -57, -385, -946, -558, -814, -666, -509, -413, -678, -642, -365, -437, -238, 61, 58, -10, 601, 510, 504, 674, 776, 490, 523, 642, 738, 349, 265, 139, -59, 211, 125, -378, -475, -189, -461, -496, -689, -484, -609, -780, -308, -416, -174, -134, -296, -193, 240, 238, 323, 404, 312, 447, 521, 493, 671, 515, 717, 433, 345, 297, 337, -47, -89, -126, -320, -339, -246, -489, -488, -583, -546, -521, -488, -480, -459, -365, 181, -53, 137, 345, 265, 434, 454, 776, 516, 323, 508, 537, 393, 473, 119, 203, 214, -44, 40, -151, -26, -420, -350, -316, -535, -564, -524, -370, -552, -470, -331, -423, -285, -150, -156, 64, 284, 309, 419, 253, 544, 361, 370, 644, 441, 329, 210, 539, 358, 144, 130, -60, -202, -263, -186, -459, -539, -446, -488, -235, -345, -275, -430, -140, -121, -170, -19, -132, 4, 186, 459, 398, 271, 253, 433, 370, 427]
1335D27q2LJ88m10K9q7n3p6o6q6J40o30K58J50j14k27L9K20L4j36M33m7j9O6J93
1360A47qL08k25J76J47o7J25m1M6j49p4m3k04QM2j83k67j47r7J69j15M9q0m7r6
1385f26J03L20l7P8j09K36J85L5J51j2J31Q1k45O1MK07k48J8O2j11j58o1j02p9
1409a16j23L0j4n3j00J88k92J35K60j13j58J84j86K03M12j18K08k03L0K19q0J9
1431C32n4J49k6k2j96j95K87k39k8j18M2K9k12R1k09R5J16j20J1rJ49k26K58j48
1455b43J51J43l6K8M3O8J57J05k17l1K04K0k69J9M5j52J30k84L5K21j05m19K02
1478a85j33j64P3jj37P0L43J30k86N53j70j33J94L70k45J26j75J18Q8k6K3l10
1500A23K63m5j76J57Nm55j91L76k07J25R5j98m64P4n6K08N0K24j95k4K15K69o1
$$ y = [427, 345, 348, 536, 126, 155, 68, 15, -61, -127, -213, -73, -703, -445, -295, -409, -636, -597, -377, -343, -479, -46, -93, -112, -46, 147, 139, 447, 222, 398, 545, 478, 603, 562, 608, 459, 385, 342, 138, 146, 188, 5, -262, -409, -506, -337, -452, -403, -483, -530, -626, -523, -203, -240, -162, -271, -35, 150, 185, 336, 324, 455, 536, 291, 352, 356, 563, 315, 333, 395, 284, 126, 65, -37, -116, -239, -209, -223, -276, -376, -188, -480, -345, -85, -198, -356, -172, -358, -155, 257, 139, 347, 144, 174, 393, 313, 332, 278, 427, 401, 379, 183, -12, 275, 36, 8, -110, -68, -39, -251, -160, -369, -274, -158, -278, -267, -276, -127, -353, -95, -243, -92, 51, 15, 43, 86, 154, 311, 416, 199, 168, 372, 392, 123, 142, 187, 35, 165, -119, -84, 137, 32, -387, -185, -318, -482, -409, -410, -547, -477, -134, -4, -290, 263, 93, -40, 154, 524, 279, 405, 230, 348, 436, 410, 433, 123, 386, 341, 165, 322, 327, -128, -319, 57, -150, -25, 70, -128, -592, -518, -574, -366, -316, -92, -287, -311, -96, 173, 112]
1523A12N7K17O2k61M60j23j86Q5J17k33j07R7j00k1m47J05k47J95K24n67J38K
1545d21m6K89k5j17j62K03L48q4m6K20l56L83K92l5J06l4j68J60Q5Nl66m4K9j46
1569G0j79j3kn24K17M4k35J53J76k16n6K63J09J25j02K09j20J27K91K3j27J58
1591C91K19k15J38k6Q4j67J66m36k0K74n20k05J19ok07k40N68n95j6M12j92q5
1613e59K83J01j05k5O83r3J9K98k77J40M3L34l35j21K59l10m9K66k23m23J61K2
1635H9l88j54L22j86m45J96MJ36K85n2j73P1K89k6p7L38N0n4R3J36J41k49j2j21
1659B13M5K31q1k67N4n5lj56Nj76j07J86l84N1J40J32l45J27J47J21N9K36j85
1682a2l2J2L66r5K88k7j17J84j05k09p2j44J20j56L6o2j76j31J62Om48K90o2j11
$$ y = [112, 169, 386, 448, 187, 647, 524, 338, 423, 540, 307, 200, 297, 197, 176, -271, -166, -413, -218, 6, -561, -423, -421, -467, -178, -203, -320, -482, -279, 69, -15, -61, 159, -197, 186, 478, 443, 549, 515, 347, 507, 592, 597, 231, 187, 216, 70, -109, -122, -124, -648, -431, -387, -622, -469, -293, -509, -565, -302, -193, -68, -170, 39, -81, 46, 337, 360, 233, 391, 610, 395, 533, 507, 591, 424, 590, 154, 134, 408, -112, -317, -198, -204, -411, -651, -83, -678, -694, -282, -474, -559, -276, -175, -280, -305, 378, 285, 304, 602, 325, 465, 508, 842, 507, 386, 645, 335, 286, 552, 329, -94, 67, 89, -299, -453, -131, -317, -762, -566, -562, -426, -141, -193, -366, -295, -6, -32, -109, 229, 279, 225, 318, 454, 595, 346, 334, 213, 258, 489, 408, 141, 195, 140, 137, -19, -14, -190, -297, -111, -495, -444, -304, -172, -517, -390, -243, -122, -63, 173, -12, -44, -32, 334, 239, 527, 500, 383, 567, 462, 253, 181, 37, 157, 1, 37, -25, -201, -332, -170, -164, -612, -322, -384, -495]
1706d95K04l59L27J03K72k69Q6J47J13j30J73O8J15J7M8n0j95M91k82q1k39P8
1728A42N2k55J98k22k84J48j06j52J6P3J67J07j34R7Q2k14K66RJ48J41j10PK27
1751D03k03Q1K2l47L05J30r0k21l2R8p2j28l9j32q4P4n5J38j44k8NK9n3M11k15
1776a47L11k27P0J51l3J94j90M8L5M5QJ3J8j84J27k72qK2m1Np3Rk3j39l0Q9o1
1803b83J4o3n9J52Q3J32k20K89j75K47K00k55J24R3j44K42n1m5q2k07J37q8m6
1826eJ35j04j69l17J96O2j4M3l33J07K35j06J91l21L97N9o2oJ35j6J92r9n0J34
1850B84PM8j65J17j65Q5j01J46k36j20k07J57N4o8n1j45k82K42K30r2O4J56j25
1873a67q2J72P8J21Q7p4R7J94m11J36J49Mj18P2j38M1j42J77q2j03N9p0l82J28
$$ y = [-495, -291, -650, -323, -220, 52, -217, -131, 16, 129, -1, 172, 240, 355, 372, 420, 370, 175, 666, 384, 303, 64, 142, 194, -61, 137, -85, -369, -221, -327, -479, -463, -390, -223, -116, -250, -153, -71, -285, -19, -10, 138, 279, 169, 176, 403, 200, 281, 303, -44, 261, 391, 301, 80, 48, 146, 74, -54, -93, -225, -309, -235, -290, -152, -296, -324, -319, -290, -343, 68, -147, 164, -63, 7, 158, 125, 319, 129, 177, 212, 257, 265, 278, 296, 112, 239, -33, -41, -19, -60, -55, -128, -119, -142, -281, -311, -222, -283, -269, -332, -391, -239, -156, -24, -244, 45, -130, 117, 317, 62, 186, 279, 135, 377, 326, 281, 199, -8, 129, 41, -5, 130, 26, -143, -460, -264, -202, -216, -173, -506, -399, -164, -270, -79, -400, -3, 56, -6, -12, 123, 107, 299, 200, 150, 284, 291, 339, 174, 291, 126, 211, 110, 256, 20, -100, -307, -150, -96, -164, -215, -360, -642, -400, -170, -262, -198, -42, -167, -249, -77, 1, 122, 209, 135, 232, 426, 15, 151, 300, 304, 186, 258, 120, 161, 19, 196, 114, 11, 70, 0, -382, -254]
1897b54k08mJ75j51m3K13K04p1N1J76O9l09L79J5q1J83n5j71J94o8m4o3L66k38
1921B65j37q4j02p7q6J73J23l43K46k71K9K8k22J3L76j32K25n9j4K09n9l8O4J94
1945C21J64l7k34P2j63J64N0j90j45O4q9J37j96O8k75O0R6p0On4j8N1q0N3L66
1970A21M3j36q8J21j28K55J60j91N6q6o5J32K50k52K0k9m9K6q3k12J97l99P9J31
1994a27j44q7J8K58q3n3M83m42J61P7p3K49o3RPj02J67j66M5K3R1j81J09n6j92
2019g2J67M5k55J48m7k72J27P2k59j81N70k91j6J00o4M5K29k17n2K25K31m03K2
2042a48K21J94k00J69k5j32L6J74Q9k52j4p7j33N1p6n5J36j5k29J46k6j37J34
2065a69JK70r6J56n3j25J42l1Q0P4q0j86J09K15O2l61R8J7L0k12J93k2r1j06n5
$$ y = [-254, -462, -466, -291, -442, -485, -272, -68, -139, -88, 88, 157, -152, 227, 242, 161, 344, 289, 118, 312, 244, 200, 137, 503, 265, 128, 44, -58, -135, -221, -48, 75, -268, -22, -293, -264, -236, -458, -445, -69, -201, 24, -35, -49, 160, 101, 63, 127, 321, 485, 448, 214, 286, 123, 287, 337, 147, 2, 66, -23, 114, -82, -14, -289, -229, -133, -203, -197, -251, -269, -218, -298, -245, 121, 164, 28, -60, 61, -67, 188, 348, 157, 213, 127, 62, 194, 444, 192, 212, 183, 134, 160, 77, -135, 62, -337, -258, -127, -271, -358, -340, -82, -165, -218, 265, -177, -16, 61, -12, 237, 174, 183, 190, 88, 255, 89, 134, 157, 248, 67, 176, 120, -72, 95, 140, -115, 33, -14, -286, -159, -87, -346, -527, 43, -248, -264, -164, -228, -183, 46, -171, -223, 2, 233, -170, -148, 73, 267, 67, 236, 211, 79, 115, 289, 378, 126, 112, 35, -98, -47, -123, -178, -42, -57, -286, -140, -166, -303, -169, -168, 102, 6, 162, 109, -16, 126, 95, 175, 249, 169, -17, 92, 307, 369, 8, 106, 123, 153, -59, 134, 112, 21, -85, -140]
2090a40j34o4J59J40j45j93K05Qk38K87M1p4O6J35j05%J54J7J95j31l7o4O4K8
2114A74j2k73J58J51l91L7l0J77j96J11j2j80J28n3M4m6k87N32O9j07q4K62j34
2137C8p9K68r0J03k50L13P4k9Lj68q2J24k36K54j67m09J40j14J78J58k35j86K30
2160a62j22J1J2J21J62o1j03J44J23J21nj78K30k33Q7J07p1m6j61J98L7l3l8j24
2184A6o0m5j19P1Q6j88p6Q9oL5j00K40k98M57k35K11K7n4r0J97K6J39j62J75l29
2209GL08l50J51k1r2l5J41l55J76j87n4M0j0K06pj55l3K70k41J99j91K72L2J7
2233H8o7P1J20j04O9P0m1L0k12J03j09n9Q9k36P3J01R3k69l9j90L61j51J28j98
2257b79P4q1K42n9J73j55K16k20L37n9K36m09K35O0j26J53j12n8m3j37m4J08n5
$$ y = [-140, -274, -338, -179, -39, -184, -377, -172, -164, -402, -115, -74, -148, -82, 53, -52, -52, 102, 119, 314, 183, 146, 82, 146, 174, 162, -111, 47, 198, -193, -156, -186, -9, -205, -94, -106, -286, -158, -211, -167, -213, -500, 32, 101, -6, -90, 172, 38, -41, 227, 137, 240, -10, 303, 377, 348, 351, 183, 101, 225, -11, 243, 76, -333, -193, -307, -129, 29, -206, -392, -162, -284, -273, -261, -140, 22, -39, -142, 2, 125, 246, 241, 63, 293, 60, 147, 254, 183, 137, -24, 174, 211, 178, 140, 16, -44, -89, -208, -137, -51, -239, -315, -226, -232, -197, -297, -57, -355, 102, -133, 78, 105, 51, -39, 158, 184, 323, 161, 336, 7, 315, -35, 116, 95, 3, -32, 109, -246, -70, -257, -311, -271, -281, -75, -82, -237, -270, 0, -241, -42, -233, 39, 71, 88, 21, 92, 212, 108, 177, 247, 206, 236, 24, 127, 18, -41, 48, -188, -115, -14, 79, -190, -229, -419, -58, -209, -81, -279, -205, -286, -44, -103, 70, -85, 131, -89, 248, 189, 425, 16, 251, 311, 185, 338, 226, 168, 125, -12, -56, 52, -3]
2280cn5nj35k0J05k15J35J66k36O2j2L0k49N21j62K54j80j6J56j87L55j24r0N7
2304A52P7k67L11j18J42n22M74l41K6K42l11mK2j52Q8J09J65j34j12K00l67L60
2326D0k28L07m0M5j38J98k0j75K32k21K84P0j94O7kj21j19J36K1l60j94L38J54
2349H0j25J29r9j66q9J30m3r0M09k68j5J81j6J72k21L21N5rk52J58j36k0Q5j36
2373C5m3P3j18r9r7M38l50J54J1j55J62l53K62l3J52j86j7J77K1k28K72J15j69
2396B4J15L3o1J02j21J66j66J72l64J19k98L48jM4%m30R4O2K03k54J10j54J07
2419a50J25k25M2K32n3l02J48J99k9l51O04m2k36K25k3j8j97K6M2k6Q9j33q5L39
2443B01l69L96k76Q0j99o6N1K77j5o5j21J13O9l22J80J05J30k00O5N3p7Q0j46
$$ y = [-3, -58, -63, -198, -218, -113, -328, -193, -27, -263, -201, -213, -183, -432, 89, -73, 181, 1, -15, 141, -46, 309, 185, 95, 152, 229, -38, 273, 155, 297, -225, 249, -92, -66, 176, -135, -139, -117, -269, -181, -72, 93, -41, -153, 47, -320, 40, -188, 119, 79, 124, -14, 184, 164, -11, 221, 0, 284, 354, 160, 227, 225, 104, -15, 121, 142, -218, -412, -74, 80, -45, 84, -15, -181, -270, -140, -183, -273, 136, -132, -147, 34, 18, 190, -31, 290, 345, 336, 84, 242, 106, 86, 171, 35, -8, 65, -53, -152, -249, 189, -161, -7, 4, -151, 11, -342, -80, -113, 39, -147, -164, 13, 34, -194, 78, 193, 24, 139, 172, 111, 213, 92, 258, 92, 264, -100, 19, -279, 69, 68, 112, 112, -318, -224, -162, 41, -213, -103, -257, -150, -25, -250, -208, 24, -29, -331, -183, 16, -13, -364, 240, 198, -38, 187, 164, 146, -51, -25, 17, -9, 80, -53, -138, 201, -168, 228, -48, 32, -167, -233, -182, 95, 80, 15, -106, 7, 76, -246, -66, 39, 169, -31, 34, 87, 10, 90, -56]
2466e6K74J57k93j02K44j6m25J08J78j17m8J35K6k65M3Rm3M8R4Pk8l6J12n2k6
2491g2K32J2m0J2l0j37K01j58lL2K38l11N5R6j10l2K8P7j92j4J56o3k1r9j53J95
2517a01M2j51J1J51J29N1j32k2K96j75Q9m1j01P7R7j34j04jj7k8J60j40O6k01
2541a79L09j72l03J76p3K51O7q8l76K83K86k46p3K31j8r4j00J36j9J7q2K78K2
2564B33Q4p6j60K83j53kj00o7k38K43j75o7M3lk4k2J47O6j83O6J64m6j8q0O5l0
2590e0R6J7P2j27K63j52n9R5q3q6J08N3k34l1J73m21L05J06l49J30k00K11J60
2613cj3r2J02j18K83k3j34k51L31j78J77J09P6k55Q3j26k5K87k07k12L06k39k2
2636a44K05p3J19m41M34q1r7j25L73j14k94J70n4J40j03M5j76M81j92pJ97k64
$$ y = [-56, 218, 375, 82, -20, 224, 208, -217, -109, 69, -48, -96, 39, 65, -200, -157, -148, -191, -143, -49, -42, -70, -106, 6, -46, -72, 160, 172, 132, 144, 114, -23, 178, 20, 17, 49, 287, -24, 31, 127, 17, -15, 13, 90, -102, -116, 40, -23, -44, -143, -296, -101, -59, -210, -199, -48, 81, 132, 0, -22, 274, 99, 188, 147, 46, 123, 220, 86, -18, -19, -36, -64, 96, -44, 22, -179, 130, -42, -345, -169, -242, 9, 76, -12, -388, -105, 181, -65, -138, 93, 75, -19, -119, 17, -2, 15, -67, 211, 233, 317, 241, 81, 364, 211, 209, 109, 42, -196, 47, -128, -195, -152, -155, -179, -201, -54, 12, -171, -105, 59, 13, -5, -85, -20, -50, 46, 63, 135, 8, 271, 119, 60, 155, 72, -14, 94, 147, -87, -118, 55, -366, -61, 45, -304, -174, -374, -163, -3, -16, -108, -6, -124, 159, 136, 2, -249, 82, -96, 81, 190, 266, 11, 94, -32, -57, 230, 23, -189, 117, -122, -144, 61, -12, 107, -334, 100, 19, -78, -203, 170, 56, -238, -68, -122, 18, -85, -40, -216, 265, 73, 66, 263, -1]
2658aL37k21J0q3j54K00o3J36k52M19l75J1o2P8Nj26n5R2MR9k57j63N31q9j1J54
2684A64L8m55L5L69j25K17j90K4P0k97J77Q4j15m0Q2q6K07k46q1Q6l7O5J11k2
2708C5J14m3k27J58k77K24J6pp3L20k95K47K29l83l61O16j00n1k8k8qJ6j27l3
2732f6K55l24J67j60L8M5p9P9j34J74l1J24M6j61K0O0j09K74k68N0k8J97m4l6
2756H9K07k00N1J27j49J92j13j13j01k34J64r0J99k50R3k1L3N7j16m2K56o7q6
2779a14K4j13K74R5K4r8n4J1j81R6o6J99k9J10r8j75K05j87R2P2j04j6J5J00p7
2804Ej71O5J46j29j8m7J22J43j58mj49L92k33n6K84j06r5K44k28K19q7o3O5L5
2828A76n3j08mn6N9o8N1j80l0L04j94k49J01K73l9j54N2lJ63j4r4J56r4J46k14
$$ y = [-1, 336, 115, 125, 42, -112, 88, 25, 161, -91, 328, -47, -36, -98, -20, -15, -141, -196, -104, -100, -1, -258, -421, 110, 21, 10, 164, 202, -253, -218, 151, 26, 243, 53, 77, 147, -150, 27, 111, -4, -44, 38, -48, 159, -87, -168, -82, -119, -54, 57, 35, 149, 106, -121, 37, -240, -16, 0, -7, -80, 240, -55, 192, 421, 38, -323, 293, 193, 142, 114, 86, 78, 94, -33, -66, 189, -135, 32, -128, -90, -45, -124, -45, -179, -5, -36, 88, 134, -27, -7, 53, -56, 218, -50, 0, -28, 169, 125, 89, 296, 96, 147, 274, 125, 317, 204, 91, -10, -244, -80, -170, 29, -221, -128, -149, -116, -59, -175, -217, 39, -28, -114, -90, -203, 71, 166, 190, 92, 38, 49, -132, -36, -102, 97, 68, 178, 80, -95, 110, -77, 15, 87, -17, -33, -18, 82, 5, -166, -101, 45, -84, -102, -149, -27, 116, -42, -46, -195, 197, -36, -92, 192, 86, -9, 235, 7, 226, 139, 76, 141, 176, 123, 15, 11, -45, 14, -54, -3, -183, -213, 91, -103, -352, -251, 22, -17, -171, -119, -122, 41, 27, -67, 89, -5, 141, -73]
2853g3J56l7OJ32k24J0M4J86J38l78j10J16P5j2k26K72j98J64o1R9k33l2J99j41
2877a28L7J26K12j51L6j59K91j67j05j98K63Kr7L05l50J57j83K27q0k47K51M4
2899H6k35O3J1J75j19k37L21N0l38J88J39k06L5K16lj15q3K19q7J78j90m3J70
2922A95j16m8l0m0o0L18l63R5M0j27j02K37m2O8J3m7j43P4k9o1K55j17QK85r9
2947A64J27k48J55k16J28j5JMl39N82k58q9M2m6JL1j30K11j07o2K5j68J27j07
2971a87J94q3J23k51K61JK53l09J43L8j01k3rJ62q0j22R4j74M1R6J25j52k65J34
2995i1j3J63Kj90J72k74J56p1N7o9O4P3J52l34K6L99m24L41k57J24P6m6Q0J02
3019B18K7N3k43J12k86MK00k33N4K5J0L9M8L9q3M5L1Rq7n3J41m0P0J32k39%Q3
$$ y = [-73, 83, 46, 52, 184, -40, -30, 14, 200, 338, -40, -150, -34, 41, 29, -197, 75, -123, 41, -20, 79, -154, -186, 13, -128, -91, 35, 247, 96, 132, -27, 264, 97, -8, -206, 57, 59, -38, 267, -83, 74, -109, 118, 38, -209, 42, 86, -149, -86, -75, 100, -19, -256, 65, 115, -223, -35, 104, -102, -67, 149, 146, 31, -52, 167, 80, 258, 68, 25, 195, 79, 31, 1, -39, -99, 219, -144, -49, -9, -136, -238, -1, -43, 25, 38, -9, -152, -78, -107, -168, 87, -30, -22, 263, 164, 291, 43, 198, -18, 110, 95, 96, 100, -239, 343, 85, -4, 38, -8, -7, 24, -106, 105, -2, -64, -39, -207, -80, -187, 7, -76, 47, -204, 57, 58, 311, 2, 145, 183, 82, 59, 50, 212, 132, 10, 104, -70, -29, 67, 192, 40, -225, -91, -104, 59, 61, -129, 43, -231, -75, -146, -89, -158, -94, -21, 131, -203, -177, 222, -202, 139, -118, 6, 82, 36, 116, 218, 245, 298, 55, 167, -119, -115, 85, -148, -94, -69, -59, -20, 28, 67, -16, 29, 60, 69, -18, -71, 70, 30, 100, 232, -7, -7, 76]
3046G6J02K5K6j85k6KK06l99K52j0o5m3P5j36J11K0J1k18m5J13K3J37j72P5O6
3071B1j8m4L38k82j36QK56p1p6L00l48J51o1J2j07M9k5j02R4j57M0R2J22l3ok6
3097il29K82J71k47J81nr1n2M6K05k09J15k25K88pk08K9J44Q9p2j32O4O7k14K78
3122A59q8n1l4k6l2q8K5J35k01K60O4l02J87l3n8J32K87j02j3L4j25m9p1kJ16
3147A24J31k36n1RJ95n6n1q5j44K7j12J69J44j38o1N5K16L0j53O4k19j1L30k48
3171g1K99q2m7o6JK31m19K5J05L2m3M7j7L1n0l0P0O7j54J5J8j53K27o8m9K13O
3198A38k07K21j31k7pJ04K45k44q5m2J80j9l7j85k8L92k65n0K9L0j33R5J25j18
3222a9m2j28K93m02K47j78L66k08L77m41J03j03k6M4J78l0o7K52k56j0K5K90l36
$$ y = [76, 178, 203, 229, 44, 18, 20, 226, -173, 79, 69, 4, -39, 36, -100, 11, 31, 42, -176, -221, -108, -85, 52, -120, -45, 21, 3, -41, 297, 15, -121, -113, 143, 72, -4, 296, -52, 99, 38, 50, -57, -8, -33, -135, -41, -198, -158, -66, 56, 23, 17, -9, -338, -56, 115, -132, 49, 44, -47, -99, -53, 152, -57, 58, -167, 121, 114, -94, -65, 79, 168, 96, -36, 28, 95, -119, 159, 71, 20, -14, -40, -72, -160, -135, 0, -201, 59, 123, -179, 8, -25, -83, 49, 336, 234, 221, 255, 130, 81, 10, 8, 124, 255, 19, -32, -23, 172, 116, 65, -20, -164, -137, -249, -80, 64, -74, -135, -80, 136, 166, 13, 77, -142, -153, 177, -71, 228, 146, 99, 33, 34, 265, -154, -129, -24, 8, -35, 12, -5, 26, -24, -54, 16, 83, -71, -56, -38, -191, 36, -32, -81, 132, 138, -69, 152, 21, -6, -13, 91, 336, 92, 7, -35, 145, 126, 89, -96, -124, 268, 3, -47, -18, 12, -121, -26, 99, -19, -61, -189, 104, -298, -51, -229, 137, -71, 306, -135, -32, -135, -161, -117, 61, 31, -36, 216, -40, -50, -25, 265, -71]
3245g1o0L82k72N7J27l18m9L65j17O0k49J78n4R7o7O0k47N3J49J55j42p6o0R8
3269aJ58o0K5j60OJ88M5k47lJ55j78J42p6J6k50M57k24j89L0K60O4j42m7N4m8
3294b5M7m7o9K12j71K36k14L5M3KN1J25k89K66j10N3K1K6k66QJ34k34J65j50L9
3319a12J49j17K27r7j60Q1J00k01K81j42k2kJ00P2Q0r9J70j57q0j05J57qJ9k05
3343g1n8K02J06kj77Nl8m8L8p5j33K72j34Q0J1p0J48k80L74k12K44k20Oj32L07
3368A43j05l8j22L4K71j8j43k22L2K39j68qK1K6K30j15p9L4j56p4MM08l13K19
3392A00k23J63k15J73n2j63K80P8j6p3L43m21K17q7M5K18l26j22j13K29k20J28
3414e7M7Q0o3k79L39J86k12j78M0J45j17j60L12k56K45r5k3k29K00M8J84j34k2
$$ y = [-71, -131, 251, -21, 36, 163, -155, -204, 161, 44, 104, -145, 33, -21, 76, 9, 69, -178, -125, 24, 179, 37, -39, -99, -1, 157, 97, 122, -38, -32, 156, 201, -46, -49, 106, -72, 70, -6, 10, -240, 217, -7, -196, -166, 94, 158, 16, -31, 23, -25, 22, -25, -94, 118, -53, 183, -31, 4, 47, 49, 100, 225, -64, 202, 92, 145, 166, 192, -74, -66, 68, -166, -1, -151, -112, 37, -80, 147, 50, -110, -29, 71, -130, 151, 9, -13, -15, 85, 157, 237, 138, 308, 151, 71, -34, 123, 115, 134, -71, -129, 73, 179, 177, 0, 5, -33, -81, -43, -118, -251, 21, -113, -33, -22, -92, 56, -224, 150, -62, 182, -38, -32, -164, 143, 38, 0, -122, -88, 183, 165, 22, -200, -168, 71, -97, -105, -84, -58, 172, 57, -22, 12, -144, -218, -214, 194, -119, 100, -123, 40, -175, -2, -54, -217, 63, 141, 125, 52, 395, -26, 191, 104, 149, 367, 41, -81, -194, 35, -185, -57, -10, 70, 7, -272, 67, 253, 41, -137, -97, 48, -69, -229, 83, -173, 72, -23, -46, -275, -75, -27, 157, 23, 1]
3437APJ74j04l85J89J70j56K5Q1j33j02Q1K04j92N5O6J50j35Mj21n1J47K9J11
3461A15j37P1M2j84J05J41r6l4j76J56J35n4J73j36j57j18LK68j26J36j40j66
3483a79O6j9M4r1J37K96k57l74M78j12P0ml22K82J22n4k29J37J72j44L9N4k07
3506i5j35K93J0p1k18Q9j1J71J69m43K13L8j18q6J67j28L40j85m0J57P1m2k05
3529e9J06J05j91J45q9j73L8Q4K26k38j09L75k20J88k74J56k02Q3j73J89k83k6
3551c42L92J06m55J78K73k27J58k26P1K9q3j8K86q8j74Q5RnL2j18J33J29j5j61
3575c1J04k23K54k9r8m0K51k25Q9J7l6j8P2r5R5j52J09P7j80m4J30L4Q4j14J85
3600B16j49r6o5J64J12k64J23J23m51K05J47m53K56J37L5k48L16j42q4k2J43J5
$$ y = [1, 8, 182, 78, -307, -118, 52, -104, -79, 2, -131, -233, -152, 52, -140, -85, -19, 131, -4, 0, -121, -172, -25, 4, 115, -22, 49, 91, -93, 12, 153, 57, 23, -153, 3, 138, 84, 257, 121, -36, -154, -151, 117, -9, 127, -13, -179, -113, -132, -88, -179, -42, 254, -3, -377, 101, -11, 59, 55, -267, 15, 137, 83, -146, -9, 163, 19, 58, 112, -95, -230, 63, 73, 2, -216, -127, -138, 33, 202, -241, -28, 10, -108, -194, -27, -155, 185, 0, -40, 117, 188, 146, -59, 47, 152, -39, 106, 17, -156, -118, -34, 192, -46, -155, 220, 0, 188, -86, 70, -132, -49, -222, -33, -316, -342, 50, 156, -299, -121, 152, -75, 83, -143, -72, -43, -126, -144, 142, 54, -120, -35, -26, -31, 1, -117, 16, 145, 130, -31, 73, -150, 104, 75, -23, -63, 188, -37, 52, 69, 33, 15, 87, -8, 87, -65, 44, 121, -59, -103, 27, 61, 145, 31, 216, 67, -29, -94, 70, 182, -82, 41, 164, -287, -82, 65, -388, -132, 5, 40, -208, 108, -34, -118, -140, 3, 18]
3622A8K30l0k24N3m04M68j05n2L4m3R0N1k42L25M8p4J2%j98K36m11K86j47J33
3646E4j07o6J05L8j73J79j38Q8R9k4QK13k49l9o0K01k11K1O0P4oj56K13n7J01
3671A68k84K04j47j74J16J01m0J16j0j64n9J85M7J40k33J03j42J61j86r1L16j01
3693B6J40n5k54K07k12R7K13k44k9K74l77K67J1j92m6K44j31kJ21Np9K1J61k57
3717i1L4N4J8n6N2j27J91l30M33j09k9k9nQ2Q5j63n1j19J94j46j0k2K08j04M7
3742Gk0J51j64k33j00L66J34j64J32j53J46j10J01k38K48j90K06r1j12N2J4J73
3764A55k89K30j3J13N3j94m4O1l1j8k1J14P6q0j76N6r9K91k79Q1K49j66O5j4J7
3789A37j40J14j41%J47j26lr5N0L61k33r9j06lK66j88l1J47K7j26m8N0J5Lj4p0
$$ y = [18, 248, 218, -6, 47, -357, 111, 6, -46, -12, -55, 35, 86, -156, 169, 217, 143, 155, 155, -43, 193, -218, 68, -79, 54, -53, -119, -14, 24, -149, 30, -108, -20, 79, 55, 63, 276, 27, -12, -72, 129, -82, -61, -1, 73, 67, -89, 124, 67, 168, -116, 88, -59, -233, -117, -16, -56, 60, 50, -114, -173, 12, 59, 199, -34, 69, -73, 88, -98, -189, 127, 26, 166, 111, -143, 64, -148, -51, 162, -82, -111, 163, -214, 53, 64, -128, -174, 70, -61, -63, 58, 63, -16, 5, 166, -91, -57, -3, 15, -41, 11, -116, 75, -255, 178, 69, 40, 11, 6, 88, 173, 10, -41, -160, 34, -112, -122, -144, 64, -40, 7, -13, 138, -26, -259, -359, 7, 141, -23, 109, -44, 102, -8, 93, -145, 103, -87, 119, 28, -84, -32, -18, 155, -134, 96, 83, 196, 249, 55, 11, 72, 41, 23, 2, 116, 192, 112, -64, -8, -107, 184, -95, -14, 235, 69, 134, 120, 137, -3, 111, -30, -30, 117, -9, -12, -107, -57, 304, 71, -28, -134, -137, 129, -59, -90, 57, 84, -42, -90, -40, -25, -22, -36, -106]
3815a06J98m5J74k52J04k30L22j30J29j52J87r2k52J62K2N5K12l48Q3j37L42k13
3837C3J15p3k1k19kJ10J56r1k34K55k10J98n5m5Q0o2J67K4k20L76k22J01L7j63
3861C5M6o3J32j57J00j96J51oML9j07J25l12K21l34K21P0pM3J12j63n6J5J58k34
3886a63l0J53J00J47j54K5J57K7k01qJ76m13j1K21o8nJ5j09R4n8l4K30O2j31K9
3911E1r7J13j90k7J65J07J30j75rl86K08J38j32J23j25P0K69r3p1l7j9j45K9O8
3935c5J7j52M1J26K61j00q1m9n7jKn1J61L9l1k6j23J64j51j4K49j76lJ01j76r2
3961a57L19j28P5k41K77k74N0Rn5J58J23j45p9R8Rj46J4K49k0r0j2q6r0J60m6
3986b8L3n6J15J04q9k7J8L0j01P5k35O5L12r2n2P5j91k43M87k48L9J09o2M4k90
$$ y = [-106, 92, 47, 221, -31, 73, -157, 165, 35, 164, 12, 199, 107, -145, 17, 39, 94, 306, -42, 41, -96, 246, 33, 148, 75, 54, -165, -167, -57, 99, 8, -226, 29, -181, 17, -38, -83, -3, -65, 102, 126, -94, 282, 60, 161, 198, 35, 81, 18, 150, -7, 93, -103, 48, 42, 46, 85, -22, 103, -209, 12, -322, -101, -31, -38, 5, 117, -46, -102, -87, 71, -163, -193, -40, 60, 207, 53, 78, 235, 262, 61, 53, 229, -184, -195, 26, -42, -47, -32, -141, -47, -105, -139, 91, 153, 22, 51, -46, 67, -123, -150, 15, 122, 252, 77, 68, -318, -110, 28, -104, 19, -106, -36, 233, 140, 69, 32, 13, -132, -103, -35, -18, -170, -129, -3, 258, 158, 77, 28, -29, -30, -28, -79, 82, 121, 90, 64, -59, 105, -46, -60, 189, 13, 10, 111, -65, -157, 162, 34, 109, -132, 145, -129, -79, -70, -125, 33, 156, 11, -68, 30, 39, -107, -93, 156, 136, 46, 34, -52, -142, 18, -28, 5, -51, 64, 168, 79, 52, 70, 100, -1, 74, -161, -96, 216, 124, 72, 147, -44, -287, 200, -48, -9, 100, 38, 82, -208]
4011b08K06J2r1J21J2k8J72k56K04J80k76P3l5k7L4j06J26O4n1r2jk03J56ol3
4036e3mJ00m3n3N8p3M00j48k59J71l0J23j99k3n3P6r2J04O7LP6l31L04K4j6j12
4062A7m3P2k49K28K15l86K90J76l63KR1j26l3n4n5K00Rn0J58j72J16N6nk84K95
4087A05n3n3M7j68K30k27k9J95j97J60l1K8Q2k20J51J03j33j31P1K9Q8K5n5J14
4111A31L3k71L40l11K15mk10M8L6l7l9J16O8Q4j58N2k95J37N0l6J61j72J13n4
4135cJ4Pj85J30J10J04k45k6J51r8K47k49K08k46l8M6k00J38J46k4o4Q7J29j13
4159B6N7j60n3L71m29J41J6J46J0r9j75K3j8M4N4J07k17K78j75K5m0P6j2oj07
4184a17N6M9QM5k99L09j17l5K03r3J03k53K46j63J33j28P8j3j3J81l29J35R6k9
$$ y = [-208, -2, 10, -81, 40, 52, 24, 196, -60, 144, 324, 48, 121, 86, 59, 93, -13, 113, 177, 126, 34, 33, -170, -14, -20, -53, -57, 43, 0, -53, 5, -68, 332, 184, -75, 96, 66, 189, -10, -33, -86, -10, -102, 2, 69, 72, 148, -183, 121, 145, 129, 17, -26, 46, -203, 25, 240, -146, 144, 320, -43, -41, 50, -76, -109, -163, -218, -18, -9, -59, 99, -73, 43, 99, 94, -190, 105, 52, -1, 46, -122, 108, -119, -148, 47, -150, 10, -21, 7, 89, -131, 20, 123, -10, -141, -70, -41, 47, 72, 17, 131, 164, -107, 233, -78, 137, 133, -77, -29, 7, -30, -69, 47, 115, 199, 41, 93, -202, -65, -15, -51, 110, -62, 51, -3, 11, 18, -167, -37, 73, 177, -68, -94, 57, -41, 206, -43, 165, -81, -119, -73, -273, -135, 11, -13, -77, 10, 139, 26, 83, -77, -130, 241, -188, -47, -31, 115, 125, 26, -149, -126, -144, -100, -46, 61, -156, 122, -53, -28, -68, 8, -4, -10, -117, -61, -12, -4, 41, -258, 51, -66, -101, 102, 9, 112, -141, 105, -58, 75, -53, 25, 12, -1, 180, -149, -14, 82, 53]
4208E3O0m6M4j7k27L46k3j37P5L7L5j18k86k4K76N1m7K69l46m5J09J70j1j04j49
4233e5p8K13j72Q2K34k68j60K02L5K56L8m49J49K01m41K14q5p0K00QK20l25JK05
4257A55J7k85J20R8o5k8O3k15O2p5J81P7n1k0j65L41j07j88J31O2j58M7r6J03
4281Dj80J79k1J53lj83J59J7l92K98p7Q4Q4l37P1K4J06p9J06L8R5j42k8J69l01
4306a56O8J95j99Km4L06k96K82k37J93k41L79j92J53k10L6j4J30k27m6J83k77
4328b12J7K86R6j32j39J18j57M7n8K11o4n5J29r9k3r9J12L1M6m0j2qq3K44j77
4353b1j28K34P1l1j06k0O6k34J40P9K04m42P2K70j75K38l57J75M1k23J48j53K62
4376A10r9j3k00L80M2m01K54m8J96j76R9j50K74j00k55P89p21L19l47j12L99m39
$$ y = [53, 113, 67, 111, 94, -133, 213, 190, 53, 128, 165, 200, 82, -204, -228, 48, 99, 52, 321, -25, -70, 39, 209, 198, 94, -55, -133, 80, -92, -10, 224, -44, -204, -2, 33, 289, 327, -122, 27, 228, -213, 1, -84, -154, 46, 54, 274, -51, -50, 155, 172, -113, 7, 105, 40, 12, 75, -140, -78, -153, 28, 105, 54, 34, -131, 210, 103, -85, 46, 108, -50, -3, -99, 4, -176, 3, -18, 135, 132, -51, 108, 125, -267, 31, -46, 38, 122, -215, -144, -120, -14, -93, 13, 51, 146, 4, -24, 145, -156, -88, 107, -92, -90, -134, 172, -124, 158, -79, 114, -127, 252, 60, 213, 3, 39, 25, 155, -72, -118, 65, -212, -195, 91, 187, 55, -84, 34, -123, -76, -134, 77, 13, -42, 87, -12, -35, -134, -22, 9, 55, 15, 3, -5, -88, 156, -21, -149, 85, 156, 125, 19, -1, 65, -169, -29, 50, 254, -188, -116, 154, -21, 217, -140, 35, 76, -147, 1, -152, 110, 11, -2, -202, 178, 220, -181, 73, 25, 221, 45, 144, -6, 268, 168, -87, 702, -19, 300, -47, -159, 240, -199]
4398a99j88O83o93N46l17M10M29o32n8k29K94l3K3j8mJ58l27j27J37j40L32R6
4420A43n54m64L02K10K03l18N16K55q08J89M08n14M86r0J8k73K62O0j31M71n97
4441b26L60j41J21j34q6Q6K1M1j27O4J37l00L08J8j20p5J55j6l5J18j19O5j33
4464a8L0Q0P6j19M1j57oJ45k8j47J83nj20j48K65M8R5j02k00K03Qn2O0k06J75
4489A01J0L7j42R6k15Q3m7N6K4K11l45j54K47J9R1j06l4K06nj81K2o2p0J52N2
4514D6r8L1j61N3k0K2J7j59J47K37k99Q1%n7J82K58k41l0R5k6j32m5K19r7q0L80
4540C23n95K13k89M40p2j6J74l19L09j06O8k20J90j77O9l8Ml0J29m5j1J18O5k00
4564a6m9J87l15K93k93K0L08m13L68n1j45J42J7j73J90J61k41r1j72K3J61l8J92
$$ y = [-199, -387, 296, -397, 149, -168, 242, 671, 39, -19, -248, 46, 13, 36, 18, 14, 172, -155, -282, -145, -285, 47, 143, -411, -875, -573, -363, -160, -478, 38, 293, -515, -326, 82, -432, 54, -36, -18, -291, -29, 31, -100, 371, -226, 134, -7, 114, -20, -106, -20, 1, 42, -85, -21, 116, -184, 124, 142, 22, -53, 102, 86, 51, 169, 50, 115, -18, 12, 92, 168, 49, 90, -67, -73, 72, 44, -103, 80, 75, -45, -193, 72, 120, 215, 113, -87, 116, 124, 72, 132, -74, 101, 111, 148, 6, 102, -113, -30, -77, -21, 3, 214, -131, -285, -38, -19, 72, -34, -68, 138, 133, -48, -26, -88, -158, -6, 46, -52, -21, -182, -129, -149, -127, -110, -269, -122, 115, -184, -103, -103, -160, 22, 280, 39, 9, 104, 78, -54, -99, 120, 23, -57, 323, -272, -59, -348, 92, 20, 4, 178, -141, 168, 62, 130, -90, 100, -77, -8, -46, -42, -72, 57, 12, 1, 119, 184, -16, -65, 122, -193, 100, -193, -173, 135, -278, 90, 39, -106, 36, 53, -120, 70, 231, -10, -101, -273, -250, -89, -127, 65]
4587F5pJ96r6k99K4J61N4j18Q3m5J68k94O7M9p7L38r9rn5L4k19K18m2p4K35k70
4613a2R3j16K12j59M7J48m64O0J65M7oL7l48K20K42l38J98R9j2k97K58L7l1n1
4637B9j57p6K49k00k25M55l2j70J99j26Q1o4P7N8j2M4r6k10K81PJ83j48l86J30
4661a09J7K29j36j3J23o6J7r4M4N3J45n85L21P6r5k3l1J95j17J07j0o8kJ5N6q9
4687d0P3K0l87N29l9j58O9k10J72J32j60m4O9q0L40p1k41J1L4J47l45K60j70N1
4711c8J00Q6j61K7K26k79K88k70k47L76k6j86J79R9m11L25J15q8j2r6K8j04K17
4734A48l17L4K9K18k9k62J04K83k31n0j27J14K24k42L11j03j46J4R3j20j30P4
4756a11Q3Q4q1J9J28k27K26j12o1n3J68r3L0J30k22j62L07l19M70j41j70Q7K7
$$ y = [65, 58, 254, 158, -141, -117, 44, 98, -20, 63, 18, 186, -108, -41, 8, -69, 269, 170, 161, 106, 140, -79, 139, 97, 23, 258, -12, 81, -35, 177, 18, 65, 213, -251, -191, -26, 21, 15, 52, -296, -76, 166, -172, 26, 125, 113, -184, 74, 111, 80, 29, -128, -204, 45, -155, -380, 75, 43, -127, 72, -54, 27, -37, 40, 98, 86, 130, 34, -176, 105, 112, 295, 147, -239, -109, -92, 137, 1, -12, 111, 45, 62, -32, 12, 65, 210, -375, -54, 22, -73, -96, -127, 68, -49, 58, 48, -20, -22, -7, 49, -40, 33, 53, -334, 195, 156, -2, 67, -143, 29, 161, 1, -43, 26, -54, 286, 215, -26, -15, 19, 166, -179, 81, -89, -38, 62, 148, -13, 14, 240, -39, 249, -21, -268, 108, 82, -104, 75, 174, -237, 88, 203, 115, 103, 7, 35, -69, 148, -169, -135, -106, 112, 83, -179, -75, 208, -23, -73, -200, -86, 138, -104, 207, 104, -42, -28, 65, -55, -185, -111, -28, 56, -25, -6, 122, -105, 121, 9, -52, -105, 63, -30, 0, 130, -92, -254, 53, -266, 204, 63, -107, -20, 7]
4779GN4N4k13J33j53J1J51k42L23r2Rj02P8J11j14J52j70J74k77k13L75J7l62
4802b89L22J06j48j7j89M42k48N3P5l37L38M3k02L02k88r9P7M0J04M8k50N0K9
4825c8J82J97n72K88mm8J7j61J39r7p2K15k52M55k55j0J48j86r6L17k13O1j17
4848a02J12m9j47R1J61l12M76l19Q0J81k16M9J53o2P4m2j72J1O4m2J52k78mk6
4872a67K48j81q3L47j50L9j62J7o7J79k08qJ29m3J04N0J1n3Rj5k0P1m5O2J9k07
4898a24n6L54q4k01J59j88K74k23K5K68k86J31pO2r9J4l9K9J11j76k7L7J01%r0
4923c5p1K61p0j17K08k23J44p0N4j46J21K29l35J15j7j04K42k83K29j13Q4o3j4
4946B6R7j64q3L6j79J18J00o7K06k4J2p6j52N2l5L07j10n5K68j97L1O5l56L02
$$ y = [7, 61, 115, -98, 35, -118, -107, 44, -198, 125, 33, 42, -60, 18, 129, 15, 167, -3, 171, -106, -319, 56, 73, -289, 33, 139, -9, -26, -215, 227, -21, 32, 107, -230, 108, 151, -51, 251, -37, -136, -59, -19, 85, 133, -117, -67, -38, 144, 341, -231, 57, 53, 5, 22, -139, 0, -97, -169, 46, -206, 249, -6, -16, 132, -54, -150, 167, -46, 15, -102, 10, -39, -186, -95, 66, -246, 230, -89, -9, 172, -44, 5, 158, 96, 170, 128, -44, -33, 31, -11, 141, -137, -141, -167, 81, -100, -183, 164, 14, 53, -109, -92, -159, 20, -188, -196, -67, -110, -6, 44, 55, 2, 11, -4, -24, 47, 2, 64, 83, -124, -180, 174, 90, -111, 48, -140, 134, -89, -64, 204, -82, 49, 42, 104, 5, 19, -20, 9, 120, -56, -83, -46, 55, 55, -35, -106, 155, 85, -32, 176, -47, 97, 27, 81, -65, 56, 285, -50, 65, 48, -56, 186, -97, 132, 19, 103, 40, 26, 123, -41, -124, -88, -267, -149, -49, -116, 90, 66, 78, 2, -150, -98, -133, 174, 64, 9, 277, 80, 111, 176, -180, 122]
4970A22j13P7j72m2K44j06j41K11o8qM4N9j03m6r1K05O5p5L3k30J58J86k63K66
4994B12k14q5Q6p3O4j84J76M2K77m74O1K42J0j86J3j8j1K5j35L86l14K32p4k26
5018a68K76j30P3Q7k15o5J50q0K62k24NJ66k26L5n6K17m6nJ20l09K60l74M08o4
5042I7q2J06j61J71j39N0k0N5j02L7n6n1J26j06M6J39j95K57j61j75PQ8o3j32
5066b64J36L12j69k11K15j56P6J7O1J59j81j32P0n3K39r3N3o6o3q0m2R7L6M3J7
5091B1k40J29K48j43K2J8J34k76R5m7L3r0R0R4k62J90j62J08k07K88N0j64J83
5114A12K8j67J18j95J50k9r2J99r4r6J0k2O1rm2K6j49J24l2K66k27K00p1Mr6R4
5140G1o6pq4P4L5J02j9l03K24j09K46j67j54K72j21RJ53l06P8K68j01k74M04l19
$$ y = [122, 9, 86, -86, -128, 116, 10, -131, 80, 12, 4, 48, 107, 4, -42, -133, 72, 137, 62, 95, -135, 23, 209, -54, 212, -2, -87, -1, -74, -10, -194, -18, 24, 301, -173, -112, 130, 140, -46, -33, -51, -62, -37, -172, 214, -100, 132, 58, -168, 108, -22, 51, 138, -77, -142, 8, -72, 190, -34, -29, 137, -89, -54, -110, 107, 61, 56, 176, -133, 127, -247, 161, 97, 15, 121, -40, 131, -8, 42, 22, 77, -25, 12, -44, -95, 31, -75, -29, 110, -85, 172, 11, -164, -157, -69, -132, -264, -128, 184, 15, -196, 19, -137, -61, -44, 17, 176, -5, -137, -67, -120, 119, 26, 79, 13, -50, -130, -172, -75, -39, 4, 21, -219, -90, 158, 15, 37, 55, 189, -87, 8, -39, -6, -96, -6, 88, -174, 16, -146, -38, -245, 43, 93, -71, 112, 140, -27, 91, -104, 46, 17, -75, 124, 30, -66, -56, -78, -17, -26, -68, -42, -191, -67, -99, 167, -60, 140, 69, 73, -23, 71, 5, -2, -86, -12, 23, 125, 106, -197, 27, -82, 164, -3, -157, 115, -6, 3, 156, -150, -72, 196, 95, -179, 225, -94]
5164i4J89j92j1m5Pj5K33m8l6P7k5M3o0K6k5L0n5J67k25mJ5o1M21j26k48J25j31
5191f8M5q8K20j10K8J04j1j53J36Qk31J26J00m02J14L49J08l26k2j94K81J01k43
5214a28R4K80r6j26K01j55O2j32L1K50j99j22o9j09Q2L81k00k56L19l8J16l04
5236a18J46r9J85n8o6J79k52J20nj0N9j98L24k9n0l10J16L55k86m39L09N8P9j74
5260a64j19R8K26j1j13L19j37p3%j4j04k39L08J82p7j93R0K18j73k5j73K23l1
5283A8p8m1J75m7R2k6K4J39m38J4N7K24R0l05p8N7L61l47P6Q7pQ1o5l76L01K15
5309B03L0l65K29%j94O4J12j28K35k65O1r8j28J26J18J06O0l25K5L39l4k47P0
5332fO9k35M38k97N9j63O1j0K3J54O0k43K4k19L54r2L5R5k63J54q3J49J6q7L4
$$ y = [-94, 95, -97, -108, -153, -146, -161, 72, 24, -12, 65, 40, 83, 23, 49, 24, 54, -1, 166, -59, -63, -48, -109, 312, 186, -62, 63, -68, -23, -111, 109, -1, 27, 131, 120, -33, 103, 111, -120, 6, 106, -296, -182, 167, 275, -51, -73, -267, 14, 115, -128, -34, 246, 150, 24, 225, 70, 132, 0, 31, 281, 82, -40, -109, -218, -136, 245, 45, -211, 108, 70, 186, -118, 28, -71, 114, 56, -10, 169, -83, 37, 32, 22, 81, -117, 207, 178, 128, -182, -66, 289, 3, -436, -127, -69, 10, -164, -283, -185, 41, 30, -83, 236, 99, 26, 26, 12, -92, -331, -23, 159, 82, -111, -21, 197, 24, -1, -174, 49, 18, -60, -101, 74, 27, 119, 93, 117, 256, -182, -168, -111, 113, 203, -102, -180, -123, 238, -109, -33, 54, 47, 128, 63, -313, -12, 203, 233, -132, 97, 97, -97, -33, 79, -49, 186, -79, -18, -116, -244, -118, 0, 106, 166, -159, -134, 205, 171, -76, -6, 63, -172, 266, -31, 28, -135, -74, -84, -61, 93, 153, -90, -66, -285, 69, -23, 12, 107, -156, -2, -85, 64, 80, -7, 27]
5357B7l79K41J55j79K72o5N0l1J58j88p1l4J01j23Q7J72j16q0LO4m5NQ9p9PM3
5383H4j00j32q5L20M2m0j23K09l31M7K22MJ08j32j98o3K76k13N8K3q7J90M0k1
5407I8k55K33j7J9j06r2J56j72j3J66q6m5K61k19J20l57L04l2P9k37J48K8N9P5
5431A15j89K0K78m21L49j94q3J76K6oj73L5J93r5MK3J87k93K26j60n4J7R7j18
5455d0J37j03R2k88K60k15K8K22O7j07o3q0p2Q4J05J2J81j17j59Q6J08Q5p0j64
5479a1J68k3k77L5K1J33j09r6J12r8L38j45m9j25MK77k83K03J15j44l2j56K63
5502A21J16k81Qq8n8J42Q3m6k47J39J72M1j80Q6qL8m9klJ63N4l61N0R5J52m6j17
5529b6j32J1R0j43J35K00j38P8k8j7J63j21n9Q2QJ15k47J44j98L18k13j76J21
$$ y = [27, -352, -111, 44, -135, 137, 72, 122, 91, 249, 61, -10, -44, 57, -66, 21, 193, 77, -3, 0, 64, 19, 24, 113, 34, 41, 84, -16, -148, -233, 87, 129, 89, -34, 175, -156, -109, 113, 117, 225, 93, -105, -168, 108, -105, -47, -24, -111, 79, 119, 98, -157, 76, 59, 78, -28, -120, 36, -136, -149, 17, -69, -114, 147, -72, 48, -309, -5, -37, 42, -195, -47, -19, 40, 115, -74, -54, 224, -197, 152, -42, -125, 51, 77, 71, -102, -67, 126, 31, 35, 58, 245, -48, 178, 18, -36, -19, 78, -40, 97, -6, 86, -202, 58, -157, -129, 93, 160, 53, -10, -90, -162, -78, 27, 39, 220, 103, -56, 30, 138, 223, 153, -11, 157, 134, -143, -108, -87, 46, -63, -159, -47, -145, 193, 48, -1, -126, -122, 155, -128, 75, 190, 46, 14, -142, 121, 237, -44, -36, -124, -182, -40, 43, -3, -250, -111, 61, 102, -78, 8, 0, 38, -11, -13, -16, 147, 201, -160, -110, -15, 137, 91, -26, -158, -147, -57, -200, -65, 135, -3, 75, 47, 30, 193, 72, 13, 95, 103, 218, -29, 115, -83, 235, 22, -154, -33]
5552c3j34L78l17N4J76r1J9r3Q1J1m3j3q5J7j2K62j82J77j3j33q2qK57k64k2J21
5578B8J4l1j37q4K34L36l22j16J33qp1r8J04j08J40L1k1l6kJ03o1P7l25L17j64
5603f7L10m40J52J77k29j45L44l7k80K09M0q3j23L13j59j81L49j97L1J11l19N4
5625a70J60J1R1r4O7j98J80r7j90K81l77K55kJ04L7J9j66L34l73j5K50R5J9j0
5649B11j86qM9Q2q7k0j79k6J83J97k46KJ10n4L22j28k46LO5j54J14j18l4J07J26
5674H5k92J84k27J47n7J94r9J16Mm6J8j37J59Rj63Q5JK9o7L42j94K6j50k9%K16
5700A54k41j58M11p9j25J01k9n1Nn5J45P7j05k27M7m4K01j6Jj23j02J88q4K00
5724I1k90J3K89J16l67J86j8r3L2J35m7p1p3J22K96l90K9L7j75J46K56k16n3K76
$$ y = [-33, -167, 211, -106, -52, 124, 33, 52, -41, 40, 51, 8, -5, -90, -73, -85, 177, -5, 172, 159, 26, -56, -64, 193, -71, -93, 28, 42, 11, -126, -210, 24, 360, 38, -78, 55, 47, -24, -122, -18, -126, 14, 45, 24, -12, -14, 89, 28, 105, -220, 97, -67, 243, -197, -45, 132, -97, -242, 102, 65, -215, -6, 34, -49, -172, 141, -18, -199, 150, -47, -16, 95, -224, -170, -10, 1, 92, -2, 65, -133, 47, -50, -240, 41, -336, -81, -83, 21, 58, 77, -89, 245, -128, -143, 107, 202, 221, 211, 25, 17, 66, 148, 61, 41, -138, -164, 19, 216, -30, -28, 82, 28, 350, 222, -24, -21, 44, -110, 4, -114, -148, -41, 85, -207, -23, -250, -103, -160, 34, -65, 51, 55, 9, 27, -110, 49, 58, -105, -20, -19, 10, -57, 285, 91, 117, -33, -62, -62, 154, -87, -245, 166, 87, -38, 63, 34, -17, -12, -67, 78, 155, 50, -177, -130, -174, 27, 11, 12, -111, -213, -25, -109, 91, -199, -186, 103, 219, -148, 38, 20, -73, -41, 94, 47, -24, -97, 25, 321, -69, -40, -3, -178, -32, 224, 8, -45, 231]
5748B31j65M6p6m1q3K52j07Qj00O7J51k30m9J32p4J33p4m6J33o8J30n8k52j7J46
5773a1J05q1J64Qk61K39n9j33J6j3o5K46j11p5Q0O5j53N5J32j98K56j52M0j24
5797c0m5L1l9Q1k5o0j6J39j62J49j06L15l26K79j81J94l15o1J75j04J43P5p1j70
5821a30j6j7K77ok12M1N8o9kN0K12j37o8P0M8j73J37k6NLq1J38j53kN9J9L9r6
5849c2J89Lk20j00J90k59Q3J75p1K79l69n6K20L0j3pO8j76J46K3j41M3j00K74
5873A79j81J8L0O3M0j05O6j3k87L29l48K91K34m81J58K15k72K57j48j37J54k07
5895a45J02r9P3o6J41J33O3k18k3l8j67J86p6N6J01L4k94K81j49M94m99K7j25
5918b08M03j93p3J45j09p7K56l05J43J00lj38J54r2j0L71k80J48j91N6Mm6j23
$$ y = [231, 66, 112, 36, -5, -88, 164, 57, 65, -35, 32, 183, -47, -96, 36, -38, 95, 21, -25, 108, 40, 170, 112, -140, -157, -11, 94, 13, 177, 185, -76, 163, 104, -29, -13, -26, -91, 155, 44, -31, 49, 114, -39, 16, 148, -50, 206, 54, 94, -30, -75, -44, -83, -2, -27, -87, -103, 36, -126, 23, -83, 232, -94, 185, 4, 198, -117, -178, -3, -107, 36, 111, 40, -130, -146, -163, 114, 108, -104, -63, -5, -74, -76, -26, 186, 49, -19, 51, 99, -74, 63, 37, 42, 45, -36, 102, -51, -53, 6, 25, 64, -32, 157, 160, -60, -160, 30, -229, -146, 29, -42, 237, -132, -188, 32, 62, 49, 42, 110, -66, 80, 103, -38, 5, -95, 179, -2, 16, 46, 109, 149, 44, 110, 97, -190, 139, -209, 82, 316, -165, -7, 208, -64, 193, 45, -92, 62, -145, -43, -142, -69, -135, 6, 139, 202, -16, -39, -77, -244, -58, -134, -78, 23, 57, -237, 44, -105, 389, -110, -83, -208, 195, 2, -71, 74, -35, -112, 144, -161, -18, 82, 79, -59, 95, 3, -7, 364, 84, 232, 41, 97, 101, 55, -68]
5941f8O0J19j2m0j62J18K72k26p2n7oJ07j34J6R9K93k53j98%J06J28j35p5K10
5965I0k68k4R7J57j94M74k63k34K79j78O7k8J98j64l25K25K09j35J55j66q1K04
5987I5q2k50K13O3J37j36j54K90k68l9M7K20J8k30OJ38r9O5k7K29k22K0O4L9J04
6012B41l71J64J17j61J60j56q3L9p0%J99P0j34L0J57k33K1J00k9j46O2L2PJ49
6036A65k04J07m1J64k15J8k22K03J02k75K37j3r0n9k6J85j42o7J40n3P1n2M1n3
6060g9P5J49j49j16J19J48j69Mj0J0j6J77j24nj82O9j22PK80J14k44r2J37K48
6084B29k68J34j38l7N5J90L4p1K3p2k8L8m7K32k32J1j97K55j79k20R8L55l4l08
6108a77K78k16L27l66K74j01m9P8j9M9o8j39K56j45j5l6J36J0J6k88K55L1o3j72
$$ y = [-68, -8, 111, 99, 59, -103, 15, 287, 61, -11, -68, -74, 33, -101, -85, 14, 307, 54, -144, -144, -38, 90, -45, -120, 90, -178, -202, -105, 52, -142, 332, 69, -165, 114, -64, 3, -25, 173, 9, -316, -91, 118, -17, 138, -28, -109, 95, 13, -237, -24, 39, 176, 40, -114, 176, -92, -131, -84, 136, 154, -76, -70, 68, -31, 34, 7, 236, 14, 34, 98, 137, 241, -130, 34, 151, -10, 150, -6, -89, -50, -120, -120, 79, 149, 15, 45, 202, -31, -10, 90, 61, -85, -23, 9, 16, 165, -39, 68, 27, 191, -24, -6, -228, -25, 77, -198, 39, 26, -64, -123, -149, 36, -106, -173, -33, -86, -15, -67, -26, -79, -4, 145, -4, -120, -1, 147, -22, -18, -28, -18, -34, 143, 19, 14, -168, -99, -221, -214, 66, 180, -64, -156, -19, 229, -39, 95, -43, -80, -25, 165, 199, 128, 151, 79, 51, 89, 42, 274, 42, 53, -144, 111, -68, -288, -190, 165, 131, -177, 101, -115, 212, -154, 120, 19, -30, 48, 29, 78, 10, -129, 127, -18, -33, -69, 67, 77, 93, -195, 60, 91, 28, -144]
6132a44M2J96j4p0K0k42K74o5k00L62j23Jm7R5L6r8j14J36P5j41M8k91R2L59M5
6157B32j49k59J81j11J64j29R5j2l3R9R0k70J59q1N3J63l32J92l19L06J83l50
6179a28K17j46J06r5J62O0l22Q7J82j57K55k82j3L16j51j90R4l7r5J99q6K85k77
6202a6k21K63j52J64k2k87K24L0J26j09O0o9k4j54L12k53J51K16l43J86o8J07
6224A21K0j6j43n9J90O9j66O4M6l13J62K7J75k06O5k34L48M1k69o8Q0j21P2K02
6248H7l9j09K95m07J13J34r9L6K41l08JQ9j59l0J24J48k45J8l2J56J82k11J9o
6272bj84L17m3L3j88q2J37M1j3RJ38p7q2m7p3J86J53N9j68q8j79K56n7j25J69
6297I0po2j60J33J2P1j6K3J23j75r6J08M8k49J57j5J42m5j56M1P2j24N2J02Rj86
$$ y = [-144, -102, 94, 80, 10, 30, -212, 62, -3, -203, 159, 36, 37, -10, 85, 121, 23, -91, 45, 120, -21, 27, -264, -172, 187, 232, 83, -176, 5, -106, 58, -71, 24, 12, -21, 78, 168, -102, 57, -24, 29, 192, -140, 52, -267, 39, 222, -128, 89, -57, 49, -46, 116, 176, -146, -59, 123, -34, 221, -61, -74, 242, 91, -99, -5, -42, -137, 62, -24, 261, -16, -237, 26, -126, 38, 16, -271, -47, -17, 109, 0, 60, -9, -33, -187, 125, -128, 23, 239, -104, 82, 14, 121, 141, 125, -18, -77, 113, 182, 16, 80, 126, -187, -25, 2, 177, -29, 36, -198, 150, 191, -78, -146, -66, -187, -115, 87, 48, -61, 234, -173, -60, 74, -25, 11, 252, -56, -55, 34, -125, -155, -31, 117, -128, -110, -142, 14, 196, -15, 4, -2, -186, 131, 88, 121, -67, -149, -12, 29, 16, 25, 163, 86, 4, -43, -116, 70, 223, 282, 114, 26, -153, 103, 46, -79, 90, 83, 21, -139, -6, 6, 77, 61, 84, 207, 32, -64, 44, 92, -157, 0, -15, 127, 82, -74, -33, 39, -85, -33, 69, 78, -108]
6323a08P2R8r5N0M7n2r3J48j79J85j4l45M19l28J61J24n6N4k7j17J27J13o2j77
6347e5R6O8j48K1j20L27l85L68o7J46j16j31J90k14J85jl27L0j53N70k16l48J40
6370a40Q6j64J17J97M9O7k02j48J87K7k29K98j86J07n7p0J8L6rj99L16j27J59
6393A33k28L08q9j95M8R7k19J64m25M77j87J63l5j8L4k04J86k11J57K40l26j8
6415a48L21J33m67O6K23k67%J54j84K28j35Q1l6k02R3Q7K10q3Q3k04j09p9R9P4
6439f2R8o0j72K97j56J00j98J08R6n7J00j01j99L10J1j61o9L43p6p6k65L01R3
6462B05k13q3j65J73O6kk68M98k18r9L6j84K06K14j01j5k25K6J94O0O5l43K75
6485A02j6j82J97k40o3J77J68k54m0J65MMj55M01k03M5j87P8j9j58K69l60K38
$$ y = [-108, -36, 62, -33, 17, 64, 12, -81, 67, -112, 73, 59, -286, 133, -195, -34, 90, 34, 88, 61, -56, 71, 184, 122, -55, 41, 109, -39, -18, -138, 189, -196, 172, 105, 251, 135, 4, 194, -20, 165, 164, -163, -133, -286, 284, 68, -280, -140, -54, -218, -101, 96, 145, 212, 10, -138, 49, 76, -153, 145, -41, 66, 9, -61, -43, -7, -16, -215, 101, -26, 133, -95, 213, 124, -71, -23, 74, -145, 19, -406, 71, -116, 47, 12, -6, 28, -176, 10, -201, -44, 196, -130, -148, 173, 306, -161, -95, 128, -139, -139, 15, -169, 59, -76, 5, -31, -233, -140, -53, 157, 74, 157, -47, -156, -235, -136, -62, 36, -24, -196, 101, -55, 45, -153, -45, 51, -6, 94, -7, -206, 104, 115, -46, -115, 228, 152, 76, -189, 112, 205, -8, -91, -256, -83, -17, -19, -287, 211, -7, -106, -70, -254, -48, 166, 65, 50, -175, -149, 45, 105, 170, -173, 102, 86, -96, 101, -139, -202, -25, 143, -111, -151, 14, 18, 22, -133, 268, 65, 110, -77, 1, -18, -176, 93, -267, -29]
6508b9K1J08j77m5J37J5K51n21L20j87J09J4J29j45k57L58j28L1n8q6P2m4M13
6531C01l00R2j38K48j09k01R9j00J14K64j00j84l1N4k55J9J44J06K0j62K88j34
6553C5K8m2J6J26l6j56R7j64J21q1O1kl9K18k94Q6J06o6J60k53Q0q2J54l12K62
6578B3m0l9J28j9k04K90Nk59J35R1k95J18N5K25l36J07J83l02J81o5LR7k7j34
6602g9N4j52J12M6R2j57J84j87K13j22l22K46KP0j63l0J97j19J18j79J82N1J2
6625F9r0j6K3K21j56j24J06J60k64m5K76n9j51k29K40L5jk46L10j30J32k3k34
6648a96L62k12R4q1j5J49Q7k14N4K4j84J78j07M3rn0n1K59j04j07J16J70l55J73
6672B4J22k68J73k74K14j29J23Q1k4k00kJ45qJ30pj25J25j70j4j23J53N2Rk9K5
$$ y = [-29, -8, 100, -77, -122, 15, 30, 281, -240, 80, -107, 2, 16, 145, 0, -257, 101, -27, 4, -54, -140, -68, -112, 301, 1, 93, -45, 203, 94, -107, -8, -108, 6, 270, 170, -14, -45, 9, -246, -227, -83, 23, 43, -119, 169, 35, 63, 21, 37, 163, 127, -29, 68, -96, 25, -56, 5, 3, -36, 182, -112, -26, 80, 14, 174, -79, 1, -81, 73, -239, 23, -17, -56, 72, 53, -151, 139, 144, -115, 20, 111, -184, -66, -11, 214, -122, -15, 168, -134, 47, -18, -15, 82, 55, -79, -25, -177, -65, -19, 73, -84, 100, -87, 126, 4, -318, -72, -70, 0, -163, -193, 4, -115, 3, -176, 6, 57, 69, -21, -37, -14, 207, 51, -73, 33, 193, -71, -116, 160, 101, -50, -279, -39, -4, -5, -251, 59, -71, 61, 38, -196, 166, -46, 48, -33, -48, 101, 188, -26, 28, 52, -132, 46, -61, -18, -27, -77, -128, 131, 27, -80, 36, 206, -149, 24, 146, -122, 51, -223, -9, -138, -15, 66, 42, -158, -160, -15, -23, 107, 100, -25, 100, -70, -84, -207, -54, -2, 7, -22, 3]
6697Cj4K3N9J87l06o6l9J40j25J51q6J4J92k96K39o4L2m6q3K38J10l42J35j98
6721a42K1J28J06j50J90l68J34P1j74K53q4j39M3J69m4J02n7L6L1k3k3j10k2L7
6745a5J75k6k74m2n6L54o0o9n0O2j23J92m7p7j0J46p8N5K7j79r7K33j93nJ44k6
6771c9K58j67j65K35p6ML3j74k4J98l6M7p9l07N9R6J90R5P6k36O8Q3J38j58k11
6796i2l0R8J6kJ76k95J33K29m7m22J91M2J66n6k7k4J00J80m02J07k0j59J88j01
6820e1J4J09l2j38m5J09L8j09L02k82Q8J43l19K22OJ6k70J81N4Qj11O4k23K64
6844C8j85RJ64j69R3N8P8k02J71r7k1k0O9m6K5K14k84K34n5o8J17n3J50k19j5
6869a4J6J38m9L3pj28n3L5J26j37r0R0Q1q8p8L2oJ50J6k92K61j64J00J79k31j46
$$ y = [3, -11, 12, 71, 258, -48, -114, -153, -13, -138, 13, -73, -59, 133, -163, 76, 12, 44, -2, -85, 153, 263, -79, 56, -142, -121, 7, 113, -37, 153, -215, -81, -10, -184, 69, -15, -154, -111, 58, 14, 116, 59, 95, 126, 103, 80, -30, -52, -15, 160, 134, -140, -182, -238, 116, 56, -13, -63, -1, -124, 68, 21, -56, -66, 80, 2, 57, 84, -95, -192, 41, -152, -157, -13, -39, 219, 52, -113, 122, 46, 50, 83, -91, -115, 83, 47, 94, 15, -292, -233, -137, 53, 148, 224, -12, 56, 139, 277, 119, -92, -122, -24, -8, -10, 166, -129, 4, 233, 186, -236, -45, -3, 163, 107, 80, 56, 156, 336, -66, 41, 21, -138, 50, -51, -37, 72, 40, -98, -143, -34, 4, -105, 197, -85, 3, 146, -173, 49, 55, 71, -199, -18, 36, 44, -67, -3, -226, 38, -147, -138, 26, -143, -50, 8, 86, -116, 55, -42, -63, -83, -14, -60, -35, 179, -105, 129, 74, 6, 123, 70, 220, 1, -14, 2, 140, 91, 124, 117, -11, -64, -29, 97, -40, -130, -40, 41, -47, -125, -93, -99, 51, 67, -225, 36, -128, -28, 151, -80, -226]
6895b26L1O7J03Q7k41J62J57O4m10N2L41l8j44O5o3j38MK34j13J8j11K57o3n8
6919C7K0p0J8k94K52J67m6k32N6J37p4J40l35J65M3j4N4np0R8J2k06K41j83J6
6944g3l3j28O7J88J98k04j28lK23o2l20J69J34o3L8K4j29J16o6j22K62j02j79
6967a93J86j74pL35q4k9j32R8k1kJ06K6j65Q4pj37Q3K14q3j17J35j73p1L24m7
6992A49j34Lqj31O2k36K84q1J11k10L58j18o9N7j8K5n4j95K06J37k96J75j35P0
7016d8O5R2p8j02Q7Q1l19K98j7Q3j56J9j75K71j03N2J50j79o7P4K26q3k76J32
7040B7j77R8Q5J73l12K91k73j40L70l33jK02p0J44j05R9l33K16J07n2k6k35L62
7063A17j18P6n4q5J05j84J38P8j34J34n0l5K06k30K11k75N1j07J39o4N2J17k71
$$ y = [-226, -195, -128, -25, 62, -179, -17, 140, 204, -206, -154, 187, 149, 5, 70, 7, -131, -127, 107, -6, 12, -99, 158, 95, 37, 57, -13, 5, -289, -37, 130, 84, -148, -92, 45, -29, 111, -224, -59, -16, -30, 24, 19, -51, 47, 59, -147, 94, -89, -73, -106, -234, -167, 21, 219, 15, -113, -116, 107, 45, -275, -106, 28, -35, 3, 27, -102, 14, -52, -174, 88, -14, -193, -7, -181, -188, 147, 63, 34, -98, 0, -21, -23, 83, 109, -56, 28, 21, -116, -33, 181, 98, -19, 116, -57, -128, 196, 149, 15, 18, 10, -121, -59, -295, -11, -92, 19, -191, 167, 49, -20, 37, 19, 44, -10, -205, 1, 138, -158, 17, -118, -48, 17, 109, 31, -71, 16, 97, -222, 76, 59, 142, -14, 5, -170, 101, -2, 50, 200, 21, -46, 28, 254, 171, -105, 27, -150, -52, 33, 206, -106, 185, -88, -228, 142, -191, -192, 10, -60, 84, -21, 78, -255, -39, 68, 16, -10, -245, 117, -1, 75, 21, -64, 41, -143, -5, 73, -61, 73, 23, -12, 194, -36, 175, -100, -49, -156, -17, -81, -29, 88, -183]
7086a83J50J13j46P4J21k10N3m3J7j27J39L0l8N7p1k8n1Q0L02m2j13k37K45q7
7110Eo8J38k72K09pK5J73j50l0K49l38N8J20p9n4j13K15n0l0J68j34j34M0L9J35
7135A15J07k52Lm1j75L40L1p9j43LJK50j96O5lJ01q9j6L5j54j77J97N0P5j55o4
7161a71J74j62K60j73n6P0mr2k7L09m7J76k23L0J45j96%J08J4j90Lj68K10Q8n4
7186B4o9J39J2m7pk49K26P6l50K32m9J19j31n0R9O8o7K25k24J74o9J04j50n4J97
7211A79k63J28O8q4r8K78K3k74J84l6k38r2L95j0r1j8l6k02L95n8j20J16l37J93
7235Bk2j08mJ8j81L87k26L2q7K91m0q8m7K7o7K52j01r8R4l0K38O0j89l9j37J98
7261A35ok04Q9O5m9M4r7p0M3R3j11M2Q3j41J07r4Q9R6J3j51O5J44K8j02j20J46
$$ y = [-183, -33, 80, -66, 8, 129, -81, -28, -71, -54, -181, -42, -12, -50, 7, -64, -92, -143, -63, 239, 197, 84, -153, 92, 5, -63, 75, -197, 12, 5, 30, 203, 53, 23, 272, -66, -8, 112, 33, -21, -134, 81, 31, 1, 169, 35, -99, -59, -20, 115, 222, -30, -27, -68, -243, 97, 128, 49, -94, -91, -90, 160, -36, 29, 26, 127, 38, 22, 57, -97, -274, -77, -27, 48, -107, -171, 3, -159, 101, -72, -128, -58, -62, -154, -181, 128, 81, 257, 34, 64, 209, 13, 13, 121, 135, -55, -52, -220, -10, 78, 24, -45, 94, 106, 59, 52, -197, 29, 105, -245, -13, -62, 57, -74, -124, -25, 43, -24, 201, -23, 151, 82, 186, 36, -18, 179, -84, 44, 112, 28, -70, 208, 231, -43, 141, 105, -133, -225, 170, 160, 69, 51, 15, -187, 208, 150, 30, 146, -191, 2, -20, -128, -132, -114, -295, 92, -134, -102, -189, 102, 62, -26, -73, -46, -113, 139, 38, -60, 34, 4, 242, 302, 113, 74, -63, 135, 129, -75, 14, 79, 30, 74, -23, -93, -50, 43, -68, -26, 57, -84, 23, -71, 18, 114, 127, -24, 41, 185, 213, 111, -9, 137]
7287A37j90j12M7l62M92j1j83J76N9p0k4o9L32k67j16kM2J79L7R3k24K35j64k34
7311a99K37R1k17O0J68k27j3R2n2K1K0j74M20n23J45R9j00J88O0j81J51N6j90
7334f8L9j50J21J1J76j47q1K6J39Lk34R9k2J28O5m0j80l3J50J31j71J69j75k1
7358f5J12k2N0n3j14K40n6j75J26Rj45K79j53O8l56L50M9o2l9j09J7l04N55k66
7382f4J38j1L2o8j67M0J77L8j93J7o9O2J65k1j43K4j78j2K88j34P6J14j0q4O2
7407G9k11J69o4l7j83J38K71j79J70j60j38J84q1J2n1J03p1J64j14O2J5j11M7
7430A4l3j48M7J95j21p5K08Q4p6k1J14j94Q4O8j41mK02j27k44L26L3n2j35j45
7454a41j9J96O3l91J92R3K4J05j95Q4K40k74J45l3j57J29M8N6k3q9r4j75K83j34
$$ y = [137, -53, -165, -118, -480, 12, 1, -182, -6, 53, -17, -41, -110, 222, -45, -161, -163, -121, 58, 95, 188, -36, 199, 35, -199, 38, 129, -88, -28, 140, -87, -100, -8, -60, -39, -19, -193, 227, -296, -151, -52, -152, 36, 96, -85, 66, 122, -68, -29, -179, -58, -47, 129, -18, -99, -73, 66, 69, -165, -66, -88, 40, 105, 65, -115, -148, 2, 133, -38, 131, -44, -65, 47, 25, 75, 22, -92, 148, 92, -83, 43, 52, -93, 186, 33, 101, -255, 95, 144, 82, 43, -66, -49, -353, 202, -64, 74, 63, 95, 27, -140, -100, 77, 115, -78, -61, -130, -68, 97, 76, -67, -43, -221, -233, 55, -79, -3, 111, 101, 17, 79, -132, 37, -27, -64, -247, -109, 162, -17, 153, -7, -145, 39, -42, -30, -81, 22, -49, 115, 1, 63, 78, -33, 14, -19, -167, -120, 75, -46, -121, 87, 171, 95, 74, 188, -6, 78, 146, 5, 1, 203, 76, -168, 158, 191, 139, 4, -141, -160, 36, 99, -292, -100, -7, 17, 122, -73, 11, 251, -23, 122, 89, -68, 61, 109, 165, 142, 53, -41, -216, 67, -67]
7478f7j96K67l5J13k87j8K38rJ06j81J50j82J11m3Qj5l0Q2o9P1J94j78l7n9J58
7503I2R1k41K16q6Ol58J10J12J04R7l6n9j65M6K43lj37J81k04oK32l93P0K82l00
7528a06J62J3l51K49M2j0J23k14J75m0n4M9k8J00k28o6K35k23K50K6N9n8r8k04
7552a97L45k09rO2l1P6O3R1j15K8l90J38K14n4J47o5k61J92q9K88k84J51j53K75
7576B13k07J3r9J45L0j44k3P7K21m20J65j21k7J94k79K93n8P6J24j54m6J90k27
7599f4p5Q9j4L1J01q5LL0J02k6J43k97P7M7R0j81o3L7p5K91j88K2MJ20j42P0R7
7626A44j04M0NJ92k44r7K31l24O2J86L3k40M60k68j12J19J57j88P7j89J27j71
7648a04J03J05O4o4o1k94J58N2J47J5j50K07n9k3j16n6L4J4m0R5n7j8N0rp1P7
$$ y = [-67, -263, 4, -31, 82, -205, -223, 15, 6, 112, -69, 81, -101, 10, -33, -25, -40, -70, 12, -57, 14, 208, 30, -7, -66, 92, 183, -58, 158, 72, 78, -280, -170, -58, 46, 143, 107, 48, -117, -71, 172, 169, 32, 213, 9, 3, 235, -158, -88, 194, -106, 56, 69, -282, -33, 9, -1, 122, -92, 83, 43, -11, 38, 10, 110, -118, -184, 51, -172, 78, 104, 163, 105, 7, -197, 148, -61, -70, -8, -39, 37, 100, 191, 76, 104, -286, -148, 66, 12, 159, 94, -167, 25, -64, 224, -60, 91, -62, 213, 6, 19, -80, 65, 95, -49, -72, 5, 226, -194, -29, -150, -177, 17, -262, 31, -27, 49, 173, 19, -27, 163, -64, -139, -50, -64, -33, 68, -17, -14, 16, 118, 92, 235, -62, 15, 62, 152, -29, -92, -55, -130, 161, -27, -5, -1, 119, -23, 47, 144, 40, 80, 85, 277, 33, -64, 167, -157, -95, 91, 124, -116, 344, 76, -36, 83, 240, 52, 129, -60, 67, -104, -1, 104, 168, 104, 43, -251, -93, -41, 106, 121, -29, 178, 119, 96, -20, -76, -42, -28, -68, 27, -30, -48, 2, -7, -78, -1]
7674aj7J06Q6k19L2r4K25j45J6L3r8L8J86mk14M22l79j99K93k40J32L3N9Q3j60
7699b6m5J33k39R0L36k46K8K7n4k34J78k5K03k30K80j47n4J83l34L18q9J29j58
7722B4J69j87R2j56jk4P4n5R0o8J73j48j04j92K78J2n1mJ01m2l6K26j92J19p1
7747B7J09L0l25K29K1j97o2J67M6k8n9J56j73j81J92k0j07M29k44j17P3Kj2Q1
7771C7k1r8l4pJ53j37P7l6J61m7j3k24K67j65R4K54k95j31L10k39n0Q5J22o9l
7796iR6Ko4r1O5k6Q5j01k8Q9qL21l90J50k93K00l3j23J72j66L92K1k60j90R9J71
7822H1Pj4j21k9L4L3r5m0o5K52j38J2N0L2k2J53k28L7J15j06P0p7J24k1j53K13
7848A04Q5M9k88N5j07j2q6Q5Q4J2o6J50j86qm4k8R1K2M8q7K12J37j74P2j39o1
$$ y = [-1, -18, 88, 174, -45, -13, -107, 118, -27, -11, 22, -76, -38, 148, 144, -70, 352, -27, -226, 67, -173, -41, -8, 51, 134, -26, -71, 62, -177, -87, 249, 3, 31, 58, 4, -230, -52, -77, 126, -104, 176, 29, -25, 158, -176, 142, 53, 182, 24, 193, 6, 98, -58, -59, -83, -9, -64, 26, -42, 131, -17, -121, -313, -35, -23, -74, -78, 23, -19, -55, 171, -21, 98, 27, 136, 166, -159, 70, 91, -106, -168, -1, 45, 17, -42, 114, -59, -240, -48, -68, -175, 254, 10, -107, -34, -32, -44, 37, 16, -82, -116, -123, 30, -107, -30, -66, 95, 48, 35, -189, 78, -87, 7, 261, -34, -165, 145, -94, -144, -59, 63, -6, -9, 87, 89, 25, -66, -1, -27, 58, -43, -71, 18, 10, 331, -59, 91, -202, -2, -35, -158, 14, -152, 240, 261, 1, -189, -90, 81, 88, 74, -47, -76, -42, -9, -104, -144, -209, 43, -95, -83, -33, -1, -23, 130, -98, -61, 54, -52, 18, -59, 65, 44, -109, 104, 189, 238, -50, 5, -102, -114, -200, -115, -31, -19, -85, 65, -121, -129, -173, -201, -110, -88, -40, -127, 85, 222, 48, 120, -19, -80]
7874h0k4L24k00o8j72NQ7K17m4j41K30j68J93k41J28Q5j49J70r8j26%J56l10K46
7898B0l11K92J01k53J51k12J32J29l5p2j16J75l4L5j12J50j34n0mK2J72o7J12
7921I1r9j58J62R6j28j38N6j07K32l1Q1r0K84l78J71J51k84m3K3J90J20j80p0
7944d9J05J24j76Q9j97K99k33J7j16O7J08o0J14q7J21k74lNq6M09j58j05J29j83
7968a40K14j47o4J71k17J41O3j61J95lj58o1jP3k4L72k23R2p1j51J67l78K82K06
7992A77n3n81M01J07O6p5j36J17k9M0j5RJ1n7J63p5J7Q4l30J1L06r4q1J55k4j22
8018hJ39p9j88J07j56J45M2R1j15j8P8J6j91qL46k89J72j71J30k7J09k1J7j40
8042a9J40j43M4k03O8K3K46j72R4j23K8P4o9L3j53R3L32j95J35m5j65k03r8M05
$$ y = [-80, -104, 220, 20, -48, -220, -215, -128, 89, 45, -96, 134, -34, 159, -82, 46, 131, -18, 152, 54, -72, -72, 84, -226, 20, -291, 1, 102, -151, 0, -212, -80, 49, 14, -58, -174, 1, -33, 2, -110, 40, -94, -144, -148, -126, 46, -21, 91, -8, -166, -4, 92, -36, -174, -118, -225, 7, -24, 57, -33, 251, -127, 44, 195, -89, -132, -109, 81, 201, 21, -49, 56, 180, 4, 93, -104, 195, -38, -21, -137, -70, 38, -22, 92, 5, 126, -148, -151, -146, -232, 177, 19, -86, 43, -140, 74, -73, -137, 34, -183, -42, 21, -140, 55, 52, -106, -167, -168, -95, -119, 253, 30, 122, 51, -100, 67, -311, -29, 177, 124, -457, -56, 51, 117, 42, -94, 23, -6, 34, 19, 28, 39, -18, 145, 70, 87, 171, -159, -148, 158, 64, -17, 138, 114, -8, 131, 52, -136, -29, -185, -40, 2, 93, -22, -40, 38, 54, -137, -145, 201, -88, 84, -87, 43, 16, 125, 104, 121, -19, 121, -22, 22, -181, -113, -90, 156, -16, 78, -45, -17, 57, -12, 21, -132, -39, 293, 98, 233, 188, 23, -180, -278, 127]
8066A27l58L6K05K64m77J92J49l7m7j24J67j13J55j35N1m7J02j0J67k88m4K4J35
8089I4q2M3o4K24k93K5P7K2j55lJ78k11J03Q3p5j51J13L4J49j66J97j21n4J09
8113G6o0J1r2J01j28k8J84k6n7M1l0q3L99l28M7j49J99m1n6o7K62j90jJ84qk10
8139e0QM5m8n2k27L17P1o5k32J28O0o3Q1R9J25j62l1j03m5L14j78Q2j06Kj16l2
8165a78K37j32M7j00J04lL33k67r8n8R7m4r3%L87k35J02q8J16j2p7K2j06l1P3
8190dj79
$$ y = [127, -231, -195, 10, 274, -203, -11, 138, 101, 54, -70, 97, -16, 139, 4, 55, 8, 110, 100, 267, -21, -65, -41, 94, 12, 55, -9, 215, -78, -53, 24, 46, -109, -112, 66, -145, -42, 41, -34, -185, -72, -38, 111, -55, 142, 21, -33, 76, 16, 27, -65, 36, -92, -120, 64, 38, -19, 22, -8, -91, 308, -20, 27, -122, 77, 36, -20, -87, 175, -15, -16, 168, 160, -50, -42, 3, -45, -97, -324, -7, 64, -1, -233, -105, -45, -108, -27, 72, 197, 35, 4, -99, -144, 170, -8, 74, -32, -30, -146, -178, 59, -73, -26, -126, -22, -25, 308, 41, -57, -115, -18, -62, -155, -155, 232, -3, 99, 11, 127, 115, 38, 60, -46, -77, -4, -183]
8191a83
$$ Imaginary data points
##PAGE= N=2
##DATA TABLE= (X++(I..I)), XYDATA
0@%%%%%%%%%%%%%%%qJ6j6J6j6K4l2L2m0M8n6P1p9Q8j04J20j36J54j77K00k25K54
37A34k84L18l54L94m39M86n36N93o57P24p98Q81r72J071j180J302j436J583j750
56i20J942k160K412k708L063l496M033m725N660o992R057j2727K1210p9815j0259
71g6425J48904J1504o0682o8554k4896J6201R3513O6880k2604o8836m1221k0333
83d6549L5216P3346K8705m9789n4812l6404r397M5555P0084j50n9476m5080j4514
96f3265R040N1784M8132j6483m7671k4629j1883J0208N5819M7694k1603m8314
108a1171k2441j515K2498N2129L1641k5347m6679l0427l074L6296N1887O581m4251
121A6127m4170j9201O956M2747M3580j0739m9445l0950J61J9951L9355K8978j9092
$$ y = [0, 0, 0, 0, 0, 0, 0, 0, 0, 0, 0, 0, 0, 0, 0, 0, -8, 8, -8, 8, -8, 16, -16, 16, -24, 24, -32, 39, -40, 48, -56, 64, -72, 82, -95, 105, -120, 134, -150, 168, -186, 208, -231, 255, -281, 312, -345, 379, -419, 462, -510, 561, -619, 683, -753, 830, -920, 1022, -1138, 1274, -1434, 1629, -1867, 2166, -2559, 3101, -3891, 5166, -7561, 13649, -66166, -76425, 72479, 83983, 23301, -45253, -70149, -53948, 39565, 106445, 83841, 15005, -26216, -46549, -11333, 62013, 90718, 40929, -13883, -50287, -59684, -14129, 55955, 55805, -3671, -48751, -63265, -54225, -2441, 45691, 29208, -18463, -43092, -54975, -44767, 11052, 58746, 37143, -11171, -33612, -35127, -12629, 39500, 71141, 45794, -885, -31312, -34386, 1910, 53797, 60378, 16127, -28043, -47244, -40288, 2459, 46039, 35300, -14145, -45095, -44934, -24983, 14372, 43350, 24258]
134B4258m2778j9227P193K3903L5825J6523k8372l8481j0187J3147K6146L0302
146C8252K950l4933l2947j943J8511K5284J9629r895l4366k1521M659J5736K2083
159A1499J7924j1592l3358j6178Q996J9107K4166J4117j9550l3834r893J5154
171a3442K1119K0929L383k7130l0200j103J8293K0645J6395o855l3091k2942J0179
184b3820K2534J7608P340j6043l0934q607J9309J9910J0085Q27j7004k1823J896
197a8722J8058J2469P303o8j6811j7961L480J3982R491Q360k676k0694j7041N701
211a5129J4348J1793P434r063k4277j1880J1686J7363J2217K191j6066k3241j951
224b4575J8801J6795P396n111j9344j5172Q826J9525J0207J33r155j6555o365
$$ y = [24258, -18520, -37747, -30554, -6651, 29174, 45697, 17325, -21156, -31343, -18196, 7950, 38252, 41202, 6269, -26678, -28621, -10110, 15174, 34803, 24908, -9458, -30979, -26320, -10584, 11499, 29423, 17831, -15527, -31705, -22709, -3602, 20564, 34681, 15131, -18703, -28596, -13442, 7677, 28606, 31989, 4859, -25341, -26444, -8151, 12494, 28889, 22034, -11057, -33999, -23820, -1286, 16322, 23662, 7619, -23315, -31922, -12613, 7297, 17382, 18209, 1205, -20618, -18722, -664, 11805, 19108, 19040, 2229, -15732, -12252, 1730, 11221, 19581, 16905, -3789, -20830, -15129, -781, 11012, 18446, 9383, -14894, -26774, -15088, 2275, 14492, 16683, 617, -22624, -24575, -5774, 11021, 18417, 13306, -6038, -21210, -12384, 7141, 17348, 17481, 8326, -8229, -14594]
237a4594J1537J3423M158k115r310j3530l413J0097J0137L786k027r701j3173
250a4725j293J1586J0321M005l543j1854j1237L136J3438J0078J959p062j2603
263g794o861P174J4173P404j413r948j2200k249J1251J1993L105o222j1185r159
277a1931K614J1544Q728j578p984r331m843N100J0549O073k956q140p468j304
291a0927P220R002L558m412p253n497J107P630O659J101l988o263m558J339P482
306B200O021P2m826n966m285J668P548O469q08p505p556k927N020R110M956m842
322D349j0064n641L047Q560P096M6o903p277j998N904P810M141l217p333m922
337f402J404O318N316L6m672m291j220J615K623K561J368k258m694k417R29K995
$$ y = [-14594, -3057, 10366, 14524, 12409, 3099, -10431, -13844, -3747, 6390, 10176, 8149, -1552, -14725, -16018, -4432, 5889, 9894, 6351, -5503, -16740, -13604, -166, 9912, 11871, 4809, -7794, -14655, -7481, 6692, 14096, 12683, 2735, -9465, -11714, -463, 11530, 14635, 8413, -2772, -11931, -9317, 2227, 10955, 9377, 1393, -7938, -12781, -7681, 2868, 8941, 5985, -2155, -9623, -10927, -3707, 5295, 8853, 4441, -2812, -8309, -7202, 428, 7087, 8188, 4200, -2063, -6621, -5282, 2200, 8221, 8293, 3467, -2499, -6784, -5116, 2432, 8901, 8093, 588, -6968, -9895, -4875, 4235, 9191, 4349, -5715, -11356, -8309, 251, 7347, 7393, 490, -6787, -8785, -2881, 4929, 9070, 5853, -1480, -6402, -4998, 1320, 6636, 6672, 2000, -2291, -3511, -1896, 727, 3288, 4656, 2398, -2296, -4713, -3784, -789]
353g89L146J644k633n804k855K575N270L590L61m513n971j008N219P033K595l280
369D580p136l944L866P014K966j654m668m913n82M246M512O00k410l962l484J112
385c857M019K589j338j729j983k470Q37L769J396l51l55j969k377O80M236K677
401C774j10j382l305j973K948L861J119j079j749m289j287M291L559j036k332
416A010k739l458P33N563K260k541k786k625j224L335M729K35l079j457j333n09
432c886M450M151j756k761j36p29K23L614J897k743j573K2j052J21K799qk816
449a83J71l09k601L61L261K35k422N7j256k151K113M036K59j632j091k128o7M797
467A450L366k509j936q87j301J750M969R53m430k558O4N69K461K206k646l715
$$ y = [-789, 2357, 4001, 1368, -4436, -7291, -4716, 554, 4144, 4505, -8, -5979, -6987, -1768, 5265, 7860, 4580, -2556, -6500, -2634, 4380, 7346, 5692, 1024, -3889, -4471, -225, 4287, 4887, 2477, -1485, -4969, -3857, 162, 2751, 1413, -316, -2299, -4769, -3932, -163, 1233, 882, 527, -1442, -3819, -3139, 1097, 3774, 3664, 2282, -1023, -2996, -48, 3813, 4932, 3853, 2104, -2185, -3472, 819, 4378, 3342, 1010, -1729, -5187, -4454, 1109, 3369, 828, -1958, -4583, -5807, -2472, 2257, 2492, -587, -2044, -3377, -3886, 564, 4715, 2959, 198, 62, -667, -444, 3170, 5067, 2324, 751, 773, -279, -158, 2641, 2633, -183, -12, -321, -2922, -2561, 700, 935, -1487, -1430, -2686, -4837, -2724, 1312, 1571, -61, -1152, -3280, -3347, 1450, 4816, 2307, 371, -516, -1817, -67, 4902, 5855, 1425, -1133, -1069, -500, 1961, 4167, 1521, -2194]
483b194j9P63j95J831J121l230j752J673J019q24R79J117q18j22Q92r04q0K462
501A719R20j151k82l50j641J038L377N77l061j942m40J9J654K233j217l282j669
518c498L03J510K738N48l013k248R12J755J617J296m75k560n88J912J691K84K72
535B456p85j480M1J177K97m90j80o66j386l77P90p6n15J46k49j457K63J037l7
554a491K72J459l89j546O33J141O56R85J295j818j380J252J356k9Q15l30k840
571D1j118K024Q77j249J94j510k390j28K454k66o83J68j108j534J958K304o60
588f26m29R97p75l67K728J472j436K74Q61j301J7J777n90j300Q34R9k410m94Q32
607A63p65k70J172j899k648Q69J901j56J16L76j872p61K815J583m41L01M3r74
$$ y = [-2194, -2213, -1450, -1645, 186, 1307, -1923, -3675, -2002, -983, -1807, -828, 289, -529, -651, 241, -663, -743, 1719, 2639, 1488, 1206, 856, -785, 253, 3630, 4207, 1146, -796, -1236, -1217, 437, 2670, 1453, -1829, -3498, -3195, -1685, 1053, 1601, -1412, -3660, -2748, -993, 624, 1920, 1445, -1115, -1703, 209, 1900, 2184, 2456, 1671, 191, 232, 1409, 1706, 1216, 1036, 370, -1016, -1393, -603, -679, -1194, -1048, -1297, -2754, -2491, -1454, -1491, -1219, 240, -149, -1695, -1062, 79, 735, 1720, 3015, 1197, -183, 1069, 2425, 2396, 3211, 2881, 41, -1077, 947, 1824, 575, 769, -741, -3131, -3259, -805, -1071, -1754, -1586, -2694, -4228, -2270, 34, -626, -1055, -58, -833, -1200, 1528, 3000, 1564, 1838, 2699, 1398, 1415, 3192, 2602, 1302, 2136, 2235, -175, -669, 163, -602, -872, 300, -1599, -4247, -3378, -1477, -1633, -1517, -1141, -3013, -3774, -959, 624, 183, 484, 527, -447]
625d47R92K450M1j220N57l12j025J024J073j052j021Pj187r23Q70M55j718n97
643b033P29q97p77J085J21l91Q19P05j181k7J658P03N23N84m36j176R26J930N4
662B919o89m86j050n94J252R22j262r12p27q29L34P43k50p23p82m7J3Q07M74J08
682g79l07J33L07K98P29K63K64k59L42K03K81k37L73L65p74k19l88m80k18M32
702C29L02j265n53j25r8J72O20m06k03n97L78L44R41L70m19n76M44M39O13J104
722A814Q7j614l10J016L88LK35o35j356L00P12j77o69L6m27n07K24K40j74k98
742a112lr5K70J68Pr3P33M53l55K01J96k39M15Q02P7l89n32n0L63J39K85n14r05
765a78n82N62M64J75n07j216l18M06O93L99k34o62m80O49N13J22J37n5J89l20
$$ y = [-447, 545, 2995, 3036, 1816, 2373, 2061, 1036, 2060, 3133, 2081, 1060, 1067, -120, -1043, -173, 282, -1436, -2033, -1304, -2201, -2978, -1893, -1772, -2163, -1344, -639, -1820, -1847, -189, 514, 1037, 1621, 1185, 9, 935, 2865, 2919, 2230, 1744, 694, 100, 1352, 2274, 1012, 100, -627, -1456, -1122, -379, -629, -1352, -2134, -2181, -2168, -1361, -887, -779, -1086, -953, -646, -348, 381, 644, 908, 649, 991, 1194, 1475, 1238, 1611, 1976, 1202, 983, 595, 115, -103, 329, 631, -634, -1187, -1312, -1410, -1238, -618, -1024, -1227, -1824, -1446, -1102, -161, 209, -210, -786, -342, 97, 710, 1814, 1901, 287, -23, 993, 1381, 1384, 1619, 984, -372, -72, 640, 463, -206, -170, -597, -1104, -880, -640, -814, -1112, -1115, -1210, -940, -772, -765, -858, -125, 328, -27, 174, 370, 131, 546, 1348, 1425, 1036, 504, 454, 817, 956, 1241, 727, -178, -760, -198, 266, 441, -66, -1282, -1600, -1194, -501, -102, -336, -998, -1478, -829, -316, -194, -57, -112, 77, -243]
785b43M27L54K62o6j54K74j30L0O4l35J1L08k07j83m05k72n4J60m0l60m46j41
807a146M73M51r2j88n66K06K99O17L00m9n77q8M93P37K57l94j46k0J31R7K57l63
829F89j95l85m8k06K26j82j26m48j03K04k68RJ61k44J81J60Q1J27k29M36K90Q2
851B12J99o0q2K73M46l9Q7n12k59R2K50J86l07p28k55m6M40r4o8n32m61K55K66
874g37M12P4j31k41O6J29O30J28j1L4M6j17O22o7j4j40k63M43q5k49l55l7j17
897B0J23n20M5m01j08M86L3m05k66P8K05N21L1J25l15M3N04L55j05O4J89l13J19
920E08J45L06j40k09n34J89J00M3l8l17l46k53J27K28l30l55J32K14l25J61J80
941e14J89J00O0J28J44K0j4N54L5J40M2k44m31N45l8K43k63l37m16j62K09L19
$$ y = [-243, 184, 538, 800, 734, 580, 854, 724, 754, 818, 483, 494, 802, 595, 412, 7, -265, -319, -159, -199, -559, -1005, -1146, -673, -222, -314, -502, -1068, -862, -563, 54, 354, 305, -272, -360, 133, 870, 1127, 733, 587, 567, 698, 795, 1052, 689, 494, 109, 61, -145, 81, -101, -227, -675, -778, -574, -842, -833, -672, -916, -735, -575, -494, -367, -596, -160, 130, 212, 411, 351, 269, 542, 988, 949, 1036, 524, 265, 357, 607, 793, 486, -242, -497, -543, -103, -197, -265, -797, -1258, -1003, -737, -325, -251, -382, -623, -557, -428, 202, 330, 319, 353, 399, 282, 904, 837, 823, 683, 420, 863, 778, 529, 174, 137, 20, 143, -377, -332, -733, -841, -355, -322, -727, -993, -915, -710, -189, -158, -33, -348, -305, 199, 554, 449, 513, 702, 389, 508, 653, 959, 819, 610, 76, 265, 365, 408, 370, 53, -293, -546, -419, -191, -521, -876, -744, -530, -855, -694, -514, -325, -225, -165, -37, 107, 127, 113, 667, 702, 842, 884, 640, 209, 754, 716, 959, 696, 359, -57, -219, -10, 309]
963C09p1n67l46l9J25K18m4l92K90l50K8P32J09k84j41K87J27%P34M7m85R0O00
986I77l95K25J40n77j80J70P6m61N4k9m04J05k6l80m5J31J66j95qL65m32n1N85
1009a89P3j90N11J76l76L14L80k6j10L70k61l77N55P5l54l55K11n74K24J93k64
1030Fn17K24j76o46K43N93m52j20K66j62j40O29M99o90L46M94l18K37N18O4k64
1051F34L27l8o07L27L99n44k54j45J65m66J85n6o22R5J43k52k24N90k98l36J89
1072g88K59K9K21K88j07o8L58J92M6L42Kj61K84R1k53Q0j91k05QK8m10m27oJ79
1096b09l07n0l2l39l0K13J14N0L55m63J24N29K08OJ66J83j91O1M68Q0m16K40j97
1119E63k81L29L03n48l42K04n37j58L08j04q50J39L81k50j49M08k73p4N05M69
$$ y = [309, 238, -329, -675, -714, -589, -371, -415, -807, -517, -867, -839, -107, 2, -282, -423, -136, -9, -9, 725, 772, 287, 377, 977, 582, 807, 947, 370, 190, 360, 436, -25, 29, 0, -404, -299, -325, -705, -750, -619, -453, -648, -656, -291, -723, -774, -189, -116, -306, 205, 381, 5, 319, 699, 673, 563, 933, 672, 295, 850, 925, 571, 216, 427, -147, 77, 270, 6, -511, -287, -463, -1109, -866, -273, -725, -845, -579, -741, -881, -252, 247, -443, -97, 397, 79, 316, 834, 898, 634, 961, 923, 316, 643, 1042, 498, 244, 99, 264, -202, -17, -73, -695, -600, -457, -709, -933, -343, -641, -977, -788, -529, -500, -279, 9, -98, -166, 192, 384, 430, 772, 774, 613, 897, 988, 735, 815, 624, 419, 427, 455, 45, -382, -388, -209, -516, -566, -598, -937, -967, -754, -640, -590, -235, -698, -574, -45, 163, 169, 335, 518, 327, 388, 856, 936, 520, 760, 563, 282, 611, 914, 366, 24, 228, -309, -467, -159, -263, -1113, -974, -593, -843, -992, -584, -857, -931, -426, 43]
1139D3l61L11N12l94P6N72J53m33O5L06j21N7N68r27m21K26R2m35J59j91n05N1
1161e97J41o4q3K69k04m95M18M30k37J94K50j00k8O95l4k13K60L38l62J78K60
1182A016l88k46o1J14l73K89n07m25L02O4l40k67J57K64l43J78J30k10OK76K12
1203a52K39L51j24l06K59O5K50p8K83j65k98R5K76j69k95R2o24J07m5m6j88K7
1225d46m19P2K20K18r5n6K7o0L67J05J31p7K56jJ26L26R2l75J82J41r3j98Q1k09
1249C15j32j70Q5l87j90J82k12r1J12Pj72P0%J91O7L5J5K94k31L09JJ43K25j69
1273B97Q4K76l22K43N5J6j76M8j60k66K24k90j56J26k83K1j98J73j68o6K18k34
1295e38J16J65K0M8K9M0J47O2O8J24J89k96K76J25j68j08l2J98k43J16l30J03
$$ y = [43, -318, -7, 505, 111, 187, 759, 912, 479, 544, 850, 729, 786, 1354, 427, 6, 232, 324, -111, 48, -143, -648, -597, -456, -520, -603, -334, -538, -1033, -615, -185, -422, -228, 22, -78, -106, 589, 555, 342, 602, 940, 578, 756, 1016, 628, 382, 321, 435, 62, 351, -156, -581, -279, -215, -555, -822, -665, -401, -744, -566, -436, -646, -640, -364, -152, 87, 438, 314, 8, 267, 332, 582, 504, 787, 622, 324, 419, 695, 526, 231, 323, -301, -194, -239, -285, -473, -446, -865, -793, -573, -355, -450, -506, -479, -539, -172, -67, 64, -13, 243, 242, 368, 694, 786, 411, 593, 734, 641, 443, 524, 315, 183, 13, 98, -289, -479, -297, -509, -600, -488, -481, -653, -583, -583, -392, -325, -290, -275, 19, -212, 97, 98, 241, 466, 297, 381, 657, 335, 578, 633, 649, 473, 521, 361, 95, 319, 29, -127, -1, -284, -263, -461, -288, -456, -522, -304, -538, -422, -257, -237, -189, -160, -120, 27, 89, 157, 281, 470, 174, 450, 575, 407, 299, 267, 465, 222, 338, 8, 111]
1317A11j91k23Oj48J99j25m6j07J30l47L11K24k06K27p7M5pK84J07M7K9K87j5
1340E15k7j00K03j2j43J36j32j61j34J5k34j15O2q2k38K85m21M8K1J32o8LL38
1363a09ML0L7J0J85J9O3L32j47M7J06P9l00J61j27p5J0kj30l74K52n9j88j0l90
1388e76K67r8L2k0j33N3qK34k08L83p4J82q2L60ol9K39k10J80Q7k23r4J56j58
1412B44k07K73k12Q2K0j28k45J7j55j24j44K22J8o3o6O8K66k83M58R3M0j65M42
1435D51m42K16J90J12k54L38p3j48j64m3k49J00p8J25j44k26K53k24P4j53r2n9
1457d90j1J08Q0J6n1Q5M58j86j33K39J25j77L01Q0M9k15R8o1j06J1J54m90Q6J72
1481A42l46j33J59nl76K39pL5k9L17j44m57N77n2j06L53J16k35j10J88o5K66J10
$$ y = [111, -80, -303, -297, -445, -246, -371, -417, -524, -394, -741, -430, -206, -412, -185, -262, -217, -224, 60, 167, 214, 243, 530, 515, 488, 388, 591, 579, 436, 572, 440, 279, 145, 160, -74, -189, -127, -209, -447, -162, -583, -535, -514, -382, -450, -447, -109, -105, -75, -38, -28, 157, 176, 239, 571, 424, 471, 577, 656, 356, 517, 390, 315, 325, 323, 193, -181, 71, 12, -176, -186, -576, -309, -407, -375, -395, -528, -475, -483, -249, -457, -74, -148, 34, -48, 312, 306, 267, 506, 296, 476, 563, 340, 246, 402, 244, 37, 310, 98, 180, 200, 72, -173, -156, -311, -435, -579, -357, -339, -402, -468, -400, -134, -417, 41, 134, 174, 9, 451, 9, 225, 415, 527, 273, 611, 538, 390, 226, 183, -66, 34, -44, 81, -63, -289, -36, -260, -186, -339, -431, -490, -501, -393, -313, -297, -348, -263, 195, 9, -124, 115, 240, 63, 364, 444, 493, 278, 376, 315, 209, 220, 374, -116, -30, 142, -204, -337, -178, -183, -559, -320, -327, -292, -321, -4, -148, -605, -28, -80, -186, 167, 283, 48, -62, 126, 61, 327, 437]
1504D37l2k33K29o2p0j89k%o8J4Q1k68K8p5m34O05l18rQ3j1j63J82L52J16m62
1529b69L71J82k28L25J56j30r6K73j82j43O6K10m33j72K74k67Ln1j70j87K48J9
1551b01K5k38J40j96j89K25L19j25J25K14L2O2J76k22K77L4N5m29L97J71l32m3
1573B77J89r3k43qk48j07j66L46k73k5j12lj26L46j98j30J62M31j14J58%Q1p3
1596G1L53J5j28M07j03l67n9M61k86Q0M6k29l70J16J45m10j98L5P1l53L03j37
1618e37k91L73J53k67K43L16k54O1L09r0J05L49K59k29j07O5o6J9O2p2k75M0k50
1641h4J0k8K1k03k16J00J02m09M02j06l40L60L62j44J88l1k32K16M03r2r5N3L92
1664F29k40m9L23o7l27K16O4m14k44J70j25j91K23l77jo0%n6n5K20j54J77q4J64
$$ y = [437, 405, 172, 401, 339, 269, 80, 78, 78, 10, 24, 105, -163, -135, -210, -644, -39, -357, -366, -283, -294, -457, -275, 77, 193, -269, 102, 284, 56, 381, 537, 407, 311, 584, 402, 259, 325, 535, 102, -70, 204, -63, -60, -111, -281, -468, -220, -201, -176, -414, -274, -470, -659, -434, -115, -240, -115, 99, 131, 193, 369, 147, 424, 458, 513, 84, 481, 652, 320, 277, 466, 373, 130, 122, -126, -233, -399, -53, -326, -351, -463, -466, -592, -246, -444, -574, -412, 19, -95, 63, 63, 144, 71, 424, 439, 311, 718, 615, 248, 189, 650, 364, 444, 490, 261, -109, 7, 152, -258, -456, -421, -350, -703, -400, -537, -828, -455, -302, -569, -326, -10, -264, -203, 106, 16, 121, 470, 729, 500, 393, 458, 392, 411, 473, 401, 126, 166, -84, -74, -102, -81, -284, -500, -400, -298, -707, -305, -411, -751, -391, -29, -173, 15, -16, -248, -32, 371, 279, 184, 237, 629, 389, 340, 663, 596, 269, 485, 549, 135, -109, 61, -64, -255, -32, -409, -410, -470, -470, -526, -581, -361, -515, -338, -422, -258]
1688b58K59R5O0j92J27L78q4j28J58k88L45j73p2Mj71K44k66k51K24j81j31L22
1710B1k45k11J98N3j59rJ38ok34N08j44k91M65K3p3J88K37O8l51N32m20k75L88
1733D01j39l0m9j82J53l31j61L93j60j5k45K24o3j9o6PN3J93j32M9L08k10J55
1756A34P5O8p7J14k2rJ1J29j58Q6J20m49K00j54mj12j46j60J42j06l7M1k07M73
1780d8k02j40J47J20j66K77J40j19p8J77K00k7L5j10J07J61k78N5L7j5l21J32
1802H4J14j69R1j45k58J42r9m2J49l23K81kn2N0J01J51M7m2j4J81o0j20K09M6
1826C20p1o5K7p1o1N9k20J14M7k9k21K00k27j59K35k10Q7J40J1j15J25k02J23
1849a63j3L52j10j02L06R3p7j74J46J04j36Q1l22K51r0m8k1j49Q4j3L8j69L6j
$$ y = [-258, 1, 96, 156, -36, 91, 469, 385, 257, 415, 127, 472, 299, 227, 231, 60, 304, 38, -213, 11, -170, -301, 21, -224, -435, -237, -184, -343, -352, -214, -220, -454, 54, -90, -381, 84, 107, 34, 222, 459, 527, 176, 708, 288, 13, 401, 262, 232, 183, 1, 154, -177, -338, 55, -105, -120, -365, -141, -204, -223, -289, -282, -229, -36, -168, -119, 189, -21, 134, 209, 277, 200, 314, 292, 283, 294, 423, 265, 351, 471, 22, 222, 68, 64, -48, -194, -354, -212, -318, -355, -314, -521, -48, -250, -390, -243, -123, -289, -12, 128, 9, -69, 108, 308, 281, 316, 206, 313, 474, 196, 251, 288, 273, -48, 84, 198, 29, 120, -25, -283, -141, -240, -282, -133, -456, -175, -177, -229, -179, -78, 73, 120, 78, 64, 245, 185, 65, 274, 320, 249, 184, 211, 140, 79, 138, -82, 32, 79, 50, -171, 29, -198, -357, -122, -332, -245, -105, -94, -209, -84, -286, -163, -176, 176, 66, -36, 270, 363, 286, 112, 258, 362, 226, 307, -15, 236, 146, 98, 77, -72, 12, -1, 37, -132, -96, -97]
1873i7j01l12L02P2j72p6J26K50p2K2J25k8r4L2J17K4J55n5J62k29J1J68o6j00
1897A64K2j08j57J2j08p1K22l98K69m4j07K07Rk23l8K76J5Q4Ll1j64O9L01j00
1921A04J25l0J02l2J00j46M6j90J29Pj73j61J48l39K15L0n6k18K10k57j4M5L18
1944c7j35J12o6P2Q4Q8J84r3j23J17K47m02K04m5J18r7l9R5O6n07P5j1J16k71
1968b48Q0N0l28J60K52k99J55J48k56J14J4K59j37J1J33Pp8k4K35k85K98ok66
1991a1J66Q7n2l36N82n11R4M0j20M7m8o9j46r7K26n0Q7m1n3o9J98j14J97J18J4
2016A39r5K5J96J31k86P0J77m5m23J79o9K64p2k28K6k5J02o5k46r4O0r6K29j70
2040c16L1pN9K3J11J07l1M5J62n8J87R3j10k54N6K8k11pK93J44m30R7j65jJ51
$$ y = [-97, -198, -510, -208, -136, -308, -384, -258, -8, -80, -58, 67, 39, -55, -23, 94, 118, 273, 218, 380, 151, 162, 330, 264, 164, 186, 78, -79, -67, -175, -246, -24, -422, -153, -197, -304, -97, -88, -311, -349, -73, -58, 26, 29, -2, -166, -97, 204, 104, 229, 199, 301, 269, 369, 223, 269, 79, 208, 215, 42, -119, 29, -310, -95, -65, -121, -339, -129, -386, -400, -355, -37, -172, -60, -126, -54, 30, 118, 302, 209, 86, 203, 450, 48, 252, 207, 325, 228, 189, 284, 350, -157, -82, -93, 23, -248, -168, -118, -446, -286, -34, -333, -178, -30, -286, -172, -158, 101, -36, -25, 108, 115, 37, 13, 248, -37, 261, 255, -11, 155, 242, 190, -146, 436, -75, 19, 59, -61, -14, -62, -131, -277, -374, -148, -198, -111, -152, -205, -274, -76, -190, 7, 125, 139, 44, 69, 265, 396, 110, 180, 357, 312, -111, 68, -1, 263, 191, -37, -11, -36, 66, 1, -245, -339, -279, -375, -146, -316, -285, -292, -233, -210, -99, 8, -23, 22, 184, 126, 313, 406, 296, 42, 98, 126, -85, -92, 201, 345, -85, 12, -153, -154, -3]
2065cK72m75R3j07j22Q7n8L21k83L1K30n1k8QJ17M9J6KJ80qj38k97L43N2l1o9
2091A31M7j3l71J49K26k32R4k37O7k7K75r8l85K91M4j08M4R8r1l06M13J29O5J9
2115B24K3R3k55L41o5j75N4j90L0l9q6m0n2J38j43j58K87k16k12K75l8k8K57k48
2139b23J30k57N54l83K26o2k1K68K1J2N6j92K03m6j57n4N6J0j00r1N5J16l38J16
2163a01j00o0J36M5k91K87n6q5r1R8L30k43k9K80jp0L57m17L17l53K37o1O7m7
2187A49O7j85o9j22M6J7j57l7K63J7l06L74k64rK29r3q2j11L79k6p7L00k61J70
2211B12k02M9j62M00l6j4J92j42j34l11J95L8j94o6L77l23k8Q0j7m02M46l83J27
2234b98N8J87l19L35J71L3J66p6k09K49J50l63J27k0J50j31n1m8o7J03j43N8j69
$$ y = [-3, 269, -206, -113, -220, -342, -255, -313, 8, -275, -244, -14, -65, -93, -85, 32, 81, 97, 99, 279, 271, 133, -164, 179, 231, 200, 131, 178, 165, -206, -57, 169, -63, 31, -206, -139, -166, 109, 11, -374, -83, -39, -147, -103, -5, -96, -402, 11, 140, 205, 224, 247, 340, 85, 426, 361, 186, 240, 50, 80, 41, -45, -85, -137, 1, -142, -300, -13, -229, -441, -166, -204, -232, 25, -223, -93, -350, 204, -179, 47, -15, -36, 232, 253, 265, 321, 129, 332, 286, 129, 75, 131, 141, 41, -50, 5, 121, -217, -101, -201, -261, -125, -80, -371, -84, -140, -225, -316, -218, 112, -131, -160, 120, 119, 49, 406, -11, 306, -47, 190, 129, 196, 149, 216, 31, -38, -160, -114, -97, -254, -291, -28, -11, -317, 57, -207, -216, 13, -80, -162, -273, 106, 80, 3, 303, 42, 212, 10, 59, -103, 297, 261, 247, 439, 297, 163, -148, 47, 85, -109, -175, 202, -121, -149, -69, -86, -488, -42, -425, -298, -240, -53, -372, -37, 134, 167, 333, 257, 48, 297, 447, 84, 211, 191, 341, 210, 159, 111, 44, 147, 4, 62, -107]
2257a07k4J20l5j62m0j41J53J05J5m5J21N6j57J41J44j64R0J21j7j40j80K11O8
2280A33Pj8R0k06J6K26k87p0J22j65P5j61J9Q5j87O4L6j58J48Q4K7J19O3n1P8
2305H9L2j7Jl6K26Q9j44J53q6j42P8k05J78j16l62L78nk73O3q2P5p9k9P4P7l9
2331a02r1J04Q2m9Q1j54J84QJ10r8J95k44l5J33J82k32jQ8j77l0K28K8m38P3J62
2356Gl9r6pl7L0l08J95K81k30q8M05j91K30N7j10r5K94m94M18o4J61o3j35J05
2380B26j27O3k01J99k4Q4j44k86K3K50n05L22k3J75j71j75M18p1R6j98J00J02
2402A33p8K93k26L6O9k07L82m59K12q9k65K63j44J34k05J98l12J92j21J95k00
2423a99K6M28k52l9n5j53j11M28PK4n3p0K24k18L50j96J8k6n7Q8k7m3k2l18K02
$$ y = [-107, -131, -11, -46, -208, -248, -389, -236, -131, -116, -161, -40, 16, -141, 0, 144, -20, 70, 191, 174, 34, -146, 65, 133, 140, 122, 212, 6, 22, 248, -39, -109, 13, -152, -77, -238, -219, -134, -321, -257, -221, -379, -231, -147, -120, -1, 62, 11, 89, 121, 104, 105, 69, 295, 384, 240, 393, 307, 165, 243, 38, 216, 100, -262, 116, 111, -162, -99, -181, -106, -185, -214, -140, -63, -102, -193, -89, -7, -56, 25, -129, 55, 63, 173, 75, 270, 26, -9, 124, 306, 74, 73, 161, -16, -46, 182, 210, -228, -155, 7, -32, -128, -135, -172, -142, -450, -255, 26, -204, -292, 113, -78, 152, 209, 99, 4, 298, -196, 222, 158, 319, 256, 121, 226, 99, 162, -39, 160, 136, 220, 76, -210, -187, 63, -442, -120, -143, 32, -139, -314, 104, 33, 129, -69, 31, 133, 55, 348, 122, 158, 227, 20, 402, -57, 155, 66, -199, 64, -80, 54, -151, 47, -265, -73, -194, 1, -199, -173, 255, 3, -36, -91, -244, -355, 73, 80, 104, 51, -19, 205, -13, 337, 141, 159, 133, 76, 164, 137, 94, 72, -246, -44]
2448d4J45j09J75j40j54n3J05M3K8O5l5k20K27l29K76k76L39J17k30K01M0n7k4
2471I0J04J6j33k59M50j34K2k73K32j18j34l2mL43j87j09o6m9J92n5j00L98k72
2494g8j9J98j58m7P8K97q0p9k8n2pJ59J3m4r4N0n0j95J81j4P6j43j66R1j86L20
2520B3J21l47j07L14j65j10J69l1J3J8J79j17K08k8q0o5K40o0n0j03J02J72n1
2543B45j6j83n4p4o2qQ3j3M7j59r8J15J11p8J90j56j56K26R7j86K66p3o1P1M7
2568A21K18j62j13J57R5j27k06O1n0M6m5J62l2O9m54K17J0j90J07R9j73J4J86
2591A0m8j27Q2k6q9K69J23m08L74J8j60J72K10l76j1P6j0M4j09O1j61m7P2j3j7
2616i1J17r8j93J18r0j48K02J49Q1j2k28L45m0j66m4k8J50J58k64L23O6k07p0
$$ y = [-44, 101, -8, 167, 27, -127, -180, -75, -32, -4, 61, 26, -194, 33, -296, -20, -296, 43, 160, -70, 131, 171, 114, 90, 194, 210, 77, -182, 268, 134, 156, -117, 115, -3, -137, -169, -173, 170, -17, -126, -192, -241, -49, -104, -204, 194, -78, -97, 101, -57, -104, -26, 271, 191, 112, 84, 32, 25, 184, 197, 153, 59, 109, 59, -136, 45, 31, 107, -36, -202, -111, -297, 23, 144, -203, -310, 4, -161, -271, -102, -133, -120, -102, 77, -40, 168, 140, 60, -5, 235, 175, 125, 22, 124, 296, 245, 229, 46, -8, -82, -144, -152, -69, -82, -35, -194, -292, -177, -66, -144, 46, -110, -266, -40, 57, -129, 137, 64, 3, 74, 121, 339, 177, 64, 221, 316, 189, -17, 44, -6, 40, -5, 157, 125, 194, -260, -43, -33, -223, -116, -17, -190, -176, 10, -38, -165, -83, -109, -198, 71, 194, -214, 160, 178, 18, 190, 400, 24, 13, 89, 79, 123, 14, 75, -86, -133, -61, -74, -91, 26, -72, -265, -147, -237, -385, -183, -34, 47, 35, -193, 152, 112, -54, -98, -126, 24, 182, -82, 241, 307, 100, 30]
2639C0J40k04K8O1j70J08r5l3J3j0l0J2l8J09o1o9j18L98j30J06M1p2p6L07j15
2664A32j35j0K24j30p5R8n5K8P0j9r2J50l67R3j67J50j59K88k32k1M8K0J31j12
2688a42J86L8j56R1J9P1o1K51j14k73L93n1k5M1j61j21j99K82k2P5k07R4n5n1
2712i7P0R2k43l8O7j49L6J46M2r3J17J03K46k84rR5j64j9J83p9RjJ92j44J00l5
2738A43l7L5m7j52P7J75l16m4O1J15j48K6L78m91M27j59j06j04J86k57M16o8K7
2761A37j32l6N5j08K39M1qk75Q5K3K32m11R3j60K10Qr5J26j14j3K27k23k6pn2
2786a84L28k73M5J66l1Mn0j33K50j36J45J0r3j74N6N2J41n6Jj81K23J21j96q4
2810d9J2q1JK10l85L52k34J3R6p7L77l03O8j88J97mK22k45P6Q1j57N7K32j80k
$$ y = [30, 170, -34, -6, 55, -115, -7, -102, -135, -122, -132, -162, -150, -188, -79, -140, -209, -327, 71, -59, 47, 88, 16, -60, 247, 132, -3, -13, 211, 81, 6, 104, 49, 77, 147, 128, 36, 186, -181, -88, -255, -105, -264, 24, -208, -229, -181, -161, -30, -142, 44, 82, -74, 17, 36, 107, 46, 297, 183, -90, 303, 252, 227, 268, 107, -14, -213, 69, 47, 122, -85, 9, -46, -97, -27, 65, -178, -216, -149, -298, -262, -116, -74, -167, -50, 53, 299, 15, 6, 101, -63, -82, 101, 22, 31, 30, 222, 78, 178, 143, 106, 141, 94, -58, 19, 194, -122, -166, -105, 10, -138, -112, 266, -225, 202, 43, -63, -167, 19, -238, 178, 110, 137, 5, -31, 24, -84, 155, 196, 188, -87, -2, 21, 253, -158, -65, -225, -15, -7, -102, 24, -90, -103, 124, -99, -125, -132, -184, 144, -129, -84, 82, 51, 55, 5, -128, 122, -14, 131, 141, 48, -126, -70, -18, 123, 67, 68, -113, 110, 231, 35, -49, -37, -118, -117, 93, -292, 60, -174, -161, -65, -142, 235, -68, 0, -188, 9, 5, 227, -18, 58, 139, -18, 39, 271, 91, 89]
2835H9J1m5k6nJ1n5K7k01P6j35N1J60k25K6O3k0J41j9pJ16j86l8J40M47k59j49
2861a2J7Q2l1m5j31M0K91j02j49n8J68j94Q6k15K15J1L7j12J74l24l3K57lP3j56
2886a14J4R3j00K44k59K49J49k35K05j48j82J82n2k5j07O6j6n6om9K36k23M2l7
2910a29J2Q5j52L51k7k58J8J52J32k50K0L26l31J61m5o7K30k32PL5J81j78J2K21
2934B74m70R9NL3j41L79j90j24R3j34J83j7l9L1k12K3J66P4KK49p3j31k3R2m4
2959A05r3M0o2K15j45Om3Q0j34J57j61O7k30M86l16P5j53J01M6j28J08Q3p8o0
2983c4LJ3J03J64j23o5K53k24r2R4k09k3J52j8n6r3L07j82o7J7J10j3Q4k56K08
3008E3j66M2P6Q3p0q3J24j70J02j52L01O2q8%L24m08J07J16m51M97l63n2R6K30
$$ y = [89, 100, 55, 29, 24, 35, -20, 7, -194, -118, -253, -202, -42, -267, -241, -178, -198, -57, -76, -83, 33, -153, -191, -51, 396, 137, -12, 5, 87, 56, 11, -120, -80, 211, 109, -40, -98, 70, -124, -38, -253, -38, -27, 10, -102, 72, -252, -285, -28, -31, 42, -114, -100, -7, -107, 137, -122, 127, 276, 41, 246, 98, -84, 98, 46, 21, -86, -20, -36, -92, -98, -147, 89, -134, -92, -129, -117, -32, -184, 167, 140, -118, -100, 52, 184, -66, -46, 280, -51, 110, 65, -2, 228, -4, 3, 38, 219, 41, 53, 274, -196, -97, -92, -59, -200, 179, -11, -135, -42, -176, 7, -10, -49, -18, -230, -207, -41, 33, 35, 284, 211, 80, 57, 149, 105, 12, 52, -10, 205, 60, 66, 23, 103, -31, 126, -35, 32, -198, 288, -28, 47, -106, -5, 41, -87, 21, 104, 26, -34, -31, -18, 85, 249, 126, 61, 314, 90, -2, 92, -117, -140, 12, -6, -62, -155, 152, -30, -97, -80, 30, 17, 101, -155, 53, -113, -71, 5, 88, 18, -65, 59, -111, -9, -161, 140, 202, 114, 114, 438, 30, 137, 253, -198, 299, -64, -116, -20, 210]
3032B10l40n8J98n8J77j65l1K08j90k4Q0j7n3L03l79J3K29j55p2p2L46o6N9j63
3056b0K92j68j74K28l04K53q0o9K34j69k3j43K33q4j35O6m6q2L14k92J44k7o6
3079a18j14J15K07n1L3j12N07l59M1k46P9j00K05j90K9m7J27O5j11j2O3j13Q1
3102b1K26k84J14J53j47k97L79j85N6L12m02J76k6j37j8L86l09l9K21k0l8m0m8
3125A2O6q1O6k24J60j84K92N6l66K41j30K22k64L60j69k53N1K55k02K67N1p3l0
3148A23P3j58J62q4mJ16j73J22k7j17L8j14j3j0NJ3k4K39r1j67j86O7K47k19J65
3173a7n6K34j08j8P0k56J23K61j77m9r5J07J58k09O3K39l20L4L0M5k05K73k70
3196a43MR3j05O8J30j17r4K49o0Q0j50j34J53L3L6r6K0M4O1j8k16M41l79J41p1
$$ y = [210, -130, -188, 10, -48, 129, -36, -67, 141, -49, -73, 7, -10, -63, 240, -139, -126, 103, -52, -124, -196, 150, 84, 143, -20, 272, 104, -70, 158, -146, 107, 27, -42, 192, 23, 0, -143, 90, 6, -129, -63, -109, -191, 123, -169, -25, -52, -118, -232, -117, 90, 39, 72, -40, 467, 108, 149, -97, -18, -118, 87, -103, -74, -121, 6, 71, -40, -52, 11, -102, -21, 205, -79, 35, 188, 41, -256, 123, -62, -6, 306, -96, 80, 54, -83, -101, 285, -24, -63, 158, 138, 100, 60, 12, 78, -3, 63, -161, -1, -185, 107, 163, -203, 38, -92, 130, -134, 226, 57, -196, -145, 110, -92, 175, 226, 153, 123, 196, 38, 200, 116, 112, 228, 55, 177, 150, 33, 71, -43, -56, -66, -61, -48, -72, 167, 76, -91, -277, -210, 37, -182, -17, -73, 161, 53, 35, 105, -151, -28, 233, 56, 7, -88, 19, 177, -32, 31, 270, -50, -16, 14, 59, -146, 127, -143, -139, -46, -151, -83, 47, -70, -164, 85, 25, 105, -45, -179, -26, 7, 43, -53, -33, 11, 72, 54, -162, 279, -100, 41, -30]
3221c0Q6j42J05J8k65M8J41L19m93K93m6J38l75K11l8m9K8j57J13K21J1k43L7
3244f9J61J19l35R4k0kJ08j3k8k50K47J94j74qp9N8J05l31J74M2rk48J3K63J1
3269B3k8j45K82q4m7J03J37m21N30k15j40M01l84j63M18m54K54k05N2Q4j46k7
3291a75K45J01o8k09K12j88o2O5Q2J72k72L0K04M0p5r3r3K18k47L21o1j6qK6j90
3316d1J04l2j2k8J84k12k30N27m35K03k51K18o3J70l32O2K2J25o5p3P8R8l2M7
3340C2J05j89J63O2n5q5Q7j8N0J34j68r3Q9k5j32J41l6j15K93l83qL04k09j66
3364b22J91l7K0k5m2J69j6N9j31q0K24o1J16j76O4k6L43n21J17J93l2j00j13m5
3388a31Q8N9j19q8O8M7m3L16j03r4O5j36m4O7J05j59K27j70J57r0O7Pj5j81J17
$$ y = [-30, 56, -86, 19, 37, -228, -180, -39, 280, -213, 80, 34, 172, -203, 8, -30, -79, -51, -208, -95, 126, 137, -106, -69, 92, 211, -124, -30, -50, -52, 56, 43, 15, -235, 12, 206, 32, 24, -55, 3, 108, -223, -49, -7, -16, -264, -251, 12, 23, -5, -150, 132, 48, 1, 104, 241, -180, 350, 135, -5, 396, 12, -151, 267, -187, 67, -138, -86, -2, -148, -175, 70, 171, 103, -106, 106, -82, -144, -79, 3, 175, -97, -67, 137, 177, 102, 9, -84, 134, -113, 208, 147, 131, 123, 149, -41, 63, 31, 19, -9, 175, -37, -267, 260, -175, 28, -223, -5, -68, 102, -230, -168, -146, -21, -86, -159, -81, 17, -15, 32, 137, -52, 111, 173, 118, 33, 120, 102, 152, 286, 118, 25, 114, 89, -43, 98, 62, -53, 240, -143, -151, 153, -56, -222, -31, -68, -48, -73, -115, 54, 38, 97, -34, -114, 110, 49, 165, -11, 53, 27, 370, -151, -34, 159, 127, 27, -86, -131, -43, 16, -103, -191, -123, -76, -119, 197, 94, 0, 65, -71, -115, -48, 57, -102, 125, -45, 112, 22, 89, 96, 81, -100, 17]
3413A7O5j87K04j2R9k71P6LK3Qk32K60j58K25k89r1K68j79J70m04L37j31K42m0
3437Cj1j45J37q7L89l42R3L3j17J19J20l8j64Q5j6l4j50n1N5J3LJ27j66K25n9
3462B2m30L31n0J91j40N8P2j98R5M4N1j68K5K19O6l22P4K08J37j80J06o3j09J88
3486B27m01L1j0K51l09J40k3J24j68j00K52p3J11m6k59L25j20j14K58k6j14K05
3508A61j84K5K90k30M7r4J3RN7k9O5l60K99m21M64n2k01J23j35K49j00j4J29j90
3532g9j09L9Q1j9J31j43K26lm0j69P2L8k45L04j69O0k4M5M8lo4k09O3K47j72P1
3558b3J25O8k18J13K14j94j9pj52J71M1j76K75l61K05K40l39N7J32Lk28P4j67
3581a66J53o7K15m84K83J26j2o6k56K23j04J70J5N5k85K40j05J25J4K2j2p3P3
$$ y = [17, 82, -105, 99, 87, 186, -85, -9, -6, 17, 25, -207, 53, -105, 120, -169, -260, 8, -171, -1, -405, -68, -199, 43, 3, -8, -153, -16, -103, 286, -56, 37, 70, -47, 72, 192, 154, -10, 75, 59, 25, -125, -176, -121, -108, -105, 22, -144, 81, 22, -408, -77, -127, 64, -76, -18, 54, -144, -49, -5, 46, -122, -97, 122, 188, -134, -60, 148, 285, 105, 211, 148, 39, 227, -174, -143, -153, 98, -211, -71, -94, 30, -138, -238, 14, -59, 52, 6, -253, 72, -48, -162, 96, 70, -44, 161, -23, 2, 292, 62, 109, 15, 28, 37, 94, 65, 130, -230, 69, -352, 112, 60, -141, -18, -153, 96, -4, -18, 111, -79, -188, -149, -68, -87, 44, -99, 127, 124, 84, -85, -13, 25, -220, 84, -85, -25, -49, -4, 44, 41, -23, -232, -169, 78, -94, -23, 102, 170, -48, 65, 279, 85, 66, 59, -93, 78, 119, -57, 218, -143, 62, 302, -37, 20, 152, 155, -73, 1, -166, -13, -80, 135, -349, -66, 60, 48, -18, -274, -51, -155, 15, 30, 85, -200, 40, -65, 60, 74, 96, 84, 11, 84]
3604H4p8j17L93m75K92o0J87k40K8K9J4m7m4ol9J20R3l45L4J01nJ53j89j08K23
3629bN9l15L87j25roJ79k39L10k54l1J51m8Q6l04L00k14K24n6J31j93j32J25M4
3653F8j22N8j5k92K54K00p2J24k67P0R0L2l33K21jR9j13K21l9j19k12J32L1j15
3677a00J67q8M8o4J92p5j32r5J06J05j08j4K4n5K5M7l9J32k08K37m9J88q6Kk5
3702A35j39jJ14J35k22O0J7r1J0P8j98R9Q2J3j76M8k03J74j20K10r0L72m99K71
3726G9J29r6L3o1nr2J24p8m2n6K46j84P6k9k00K02j66J4K33j90O4J90j78O4k99
3751b22J16J7l5O2J00J5K5j23L2o5K08p9p5L4j55M15k52L1J70k41R9j50O8kM5
3776C8k00J53j46K31q7m1Rn6L1N3L3N5j55m2K27l30L06j9M5Qj35j75J49Q2l4N6
$$ y = [84, 6, -111, 282, -193, 99, 39, 226, -14, 14, 43, 57, 10, -34, -40, -79, 41, 134, -211, -177, -76, -81, 72, -117, -225, -2, 57, -258, 129, 4, -5, -11, 168, -71, 239, -15, -46, 105, 57, 143, -161, 139, -75, 149, 93, 224, 31, -101, 24, 68, -54, 4, -11, -303, -49, 151, 79, 203, -64, 6, 96, 128, -205, 16, 15, 114, 1, 222, 183, 64, -148, -16, 15, -100, 67, -21, 27, -37, 155, 80, -52, -147, -41, 64, -44, -58, -34, -89, -64, -17, -56, 76, -132, 105, 56, 244, 158, 160, 135, -4, -5, 109, 244, 22, 82, 99, 8, 18, 96, -102, -3, 79, 92, -84, -36, -239, -65, -185, 25, -65, 307, -192, 79, 208, 112, 145, 84, 79, -13, 111, 33, -9, -65, 181, -3, 73, 44, -156, 46, -120, -106, 127, -63, 1, 191, 13, 77, -222, -106, -89, -124, -62, 38, 53, 78, -45, -13, -78, 130, 51, -24, 10, -145, 270, 18, 49, 219, -22, 77, -73, -5, -7, 38, -162, -9, -155, 76, -11, -52, -43, -99, -68, -15, 18, 73, -82, -124, 103, -227, 79, 60, 105, 113, -22, -197, -48, 34, 0, 56]
3802E6O1j49j32j2J19K61N6k71k2l8J19k4k92L15k37J62J3j33K53P0j10p4n6R
3826e6P5J26o9k8j58J2J81k24M09k43k37K41n8j98K32j49L53j6k83o4J66j55k6
3849a69J86l5j05j0L65k65N1P2q7M7k4l9M7j49j17K09J40j27R0No2l8J32l87P8
3874a92K97l14J05P6N8K8N5j11n4l4J16O6k00J32Lj1J6J0O6l3q9J11j19r2J73
3899F3q9j51K18j24j65J61K79k08J99j15j22R8o1j26N0L6J06j17O3J33n9k10L08
3922A67k14J26j59K29o0j29J85k95J32j0LR5k66K65l4j13L4RQ6j88j0J62j21o1
3946a67L10j22r2K53k05K2J98k07R4k45J98J93j33m7J8j04M1l0P8J02j61MO6k6
3970C8j33J18K5M0j00M0l1l0K6qK16P5k56j04R7j30Q9K2J46j01p9J55j87K14j48
$$ y = [56, 117, -32, -164, -176, -57, 204, 260, -11, -33, -71, 48, 24, -268, 47, -190, -28, -15, -148, 105, 175, 65, -9, -65, -56, 19, 145, 76, 48, -110, -98, 83, -141, 268, 25, -212, 29, -29, -227, 5, -144, 209, 193, -90, -154, 12, -143, -169, 17, -18, -123, -133, 232, -33, 18, 90, 3, 50, 26, -13, 34, -115, -232, -23, 117, -10, 80, 85, 23, -15, 117, -270, -192, 105, -209, -104, -28, 30, 58, 113, 2, -52, -86, 30, 96, -104, 28, 31, 20, 36, 46, 112, 79, -10, 101, -18, -110, 63, -26, -177, 41, -83, -248, -87, 192, -16, 183, 68, -54, 44, -17, -143, -93, -57, 49, -68, -5, 128, 69, -141, 167, -47, 79, -80, 149, 89, -40, 145, -150, -18, -28, -25, 70, -196, 69, 35, -78, -44, -35, 51, -137, -147, 15, -106, -167, 143, 21, -71, 182, -23, -1, 197, -10, 84, -161, 37, 230, 97, 50, 68, -36, 5, -25, 53, 155, -6, -2, 64, 38, -95, 23, 48, 88, -12, 28, -3, -33, -7, -15, 201, 276, 20, -84, 13, -117, -28, -6, 140, 39, -40, 115, -72, 142, -6]
3995fM8q4k9J67j39J46j58O5o6J32j83J21j1L3J7j4j59N8J16q9J4k5J94j24M18
4020D42k41j64P5m5m0l3NK8j8k65K64PM6j77J37q2K46j32L7j15l8J53J55j49j7
4045G9j64K22l11J09J13j87p3K24N0j79O5pJ56k50L7K66j71J63j18O9%q8j8J07
4069I4j48q6J92j54k1QQ9k11K08m0QO7K9k72J26Q9J02n9J11j79J70J8j38p3N5
4094a5j46K6L4j99L86q0j22J34o5P0K7j96M2J21r8J07j77J53O4k27J96J3k0J33
4118A61j60R4j61lj6J59j03o8J89o8j1p5R7j74K58j3L3r6j70J25l2N2j3J86q1
4143A10p9mN7m07M00o9j2Q1j17N8l0K51k64P3n3P8P9r3j50Q0k15K33l4J37l27
4168b17M25n02L25K60j39k80J55J9r3j63K78n9j7J09p8q0l5J9K00j29j62P9j10
$$ y = [-6, 42, -42, -71, 96, -43, 103, -55, 10, -56, 76, -107, 14, 3, 36, 53, 39, -120, -62, 54, -35, -21, -46, 148, 24, 442, 201, 37, 112, 67, 27, -6, -1, 27, 9, -256, 8, 15, 61, -116, 21, -61, 185, 53, 90, -25, -63, 90, 245, 96, 79, -85, 137, -174, -65, 48, -139, -212, 12, 62, -117, -52, -59, 97, -153, -116, 150, -21, 142, 24, 93, 93, 5, -13, 94, -54, -140, 52, -102, -123, -115, -26, -237, -29, -69, -61, 6, 35, -237, -111, -22, 80, 21, 132, -47, 123, 141, 3, -70, -15, -161, -135, -101, -300, 86, 6, -116, 18, -47, 23, 50, -146, -104, 17, -81, 26, -151, 2, 66, -161, 35, 48, 28, 161, 1, 95, -66, -69, -85, 74, -29, -97, 92, 24, 13, -62, 35, -139, 119, 106, 139, 43, -127, -2, -34, 18, 5, 191, 110, 31, 27, 84, -323, 77, 8, -4, 77, -40, 18, -12, 239, -25, 48, -5, 73, 152, 59, -91, -11, -226, 7, -27, 110, -217, 208, -294, 31, 291, 152, -128, 27, 46, -47, -210, 68, 9, -8, 101, 23, -57, -92, -73, 127, -2, -164, -85, -195]
4191a95L91j04j39N5p7J45ql02J56O8j69J72n7j88K91r3M1Kj44R7L9N3rk61L67
4216A31Q5l52K79k40k3L0K81j71l4pM3p5O1j15J98j31q3p0J11K68l23P3J2j74
4240b26L93j06j10M2JKPO5j60L94m29O0J38k05J81j51O8N1K06n4q9k38K29r4k81
$$ y = [-195, 196, 92, -47, 8, -69, 76, 68, -234, -78, -10, -179, -7, -64, -252, 39, -54, -13, -11, -155, -58, -19, 34, 25, -236, 131, 216, -136, 143, -97, -120, -90, 191, 20, -14, -21, 22, -53, 8, -107, 91, -40, -123, -193, -82, 186, -137, -64, -52, -226, 167, 61, -49, -7, -6, -4, 3, 68, -92, 302, -127, -67, 71, -134, 47, -104, -36, 15, 221, 167, 78, -160, 69, -25, -306]
$$ [...]
8191h2
##END NTUPLES=NMR FID
##END=
