##TITLE=1H_SR115_k2
 DMSO-d6
 8 sc, 
 7.07.2022
##JCAMPDX= 6.0         $$ Bruker NMR JCAMP-DX V2.0
##DATA TYPE= NMR FID
##DATA CLASS= NTUPLES
##ORIGIN= UXNMR, Bruker Analytische Messtechnik GmbH
##OWNER= root
$$ XWIN-NMR		Version 3.5
$$ Thu Jul  7 14:56:35 2022 Russian Standard Time (UT+4h)  she@DPX200
##.OBSERVE FREQUENCY= 200.1313499994
##.OBSERVE NUCLEUS= ^1H
##.DELAY= (6, 6)
##.ACQUISITION MODE= SIMULTANEOUS
##.ACQUISITION SCHEME= undefined
##.AVERAGES= 8
##.DIGITISER RES= 18
##SPECTROMETER/DATA SYSTEM= spect
##.PULSE SEQUENCE= zg30
##.SOLVENT NAME= DMSO
##.SHIFT REFERENCE= (INTERNAL, DMSO, 0, 15.7039)
##AUDIT TRAIL= $$ (NUMBER, WHEN, WHO, WHERE, WHAT)
$$ ##TITLE= Audit trail, XWIN-NMR		Version 3.5
$$ ##JCAMPDX= 5.01
$$ ##ORIGIN= Bruker BioSpin GmbH
$$ ##OWNER= she
$$ F:/spectra/data/she/nmr/H-F/1/audita.txt
$$ ##AUDIT TRAIL=  $$ (NUMBER, WHEN, WHO, WHERE, WHAT)
(   1,<2022-07-07 14:55:10.21 +0400>,<she>,<DPX200>,
      <created by zg, POWCHK disabled, PULCHK disabled
       configuration hash MD5:
       00 E9 B6 7A A2 85 ED C7 34 08 36 98 17 FE 4E 26
       data hash MD5: 16K
       F4 F6 F8 C4 E8 DE AE 30 EA C9 67 23 34 BC FE 04>)
$$ ##END=
$$ 
$$ hash MD5
$$ 10 02 8F 4A A3 2F DB 93 61 49 87 F3 0A 74 F7 51
##$RELAX= 
##$RELAX= 
##$RELAX= 
##$RELAX= 
##$RELAX= 
##$RELAX= 
$$ Bruker specific parameters
$$ --------------------------
##$DU= <F:/spectra>
##$EXPNO= 1
##$NAME= <H-F>
##$PROCNO= 1
##$TYPE= <nmr>
##$USER= <she>
##$AMP= (0..31)
100 100 100 100 100 100 100 100 100 100 100 100 100 100 100 100 100 100 
100 100 100 100 100 100 100 100 100 100 100 100 100 100 
##$AQSEQ= 0
##$AQ_mod= 1
##$AUNM= <au_zg>
##$AUTOPOS= <>
##$BF1= 200.13
##$BF2= 200.13
##$BF3= 200.13
##$BF4= 200.13
##$BF5= 200.13
##$BF6= 200.13
##$BF7= 200.13
##$BF8= 200.13
##$BYTORDA= 1
##$CFDGTYP= 0
##$CFRGTYP= 5
##$CHEMSTR= <none>
##$CNST= (0..31)
1 1 145 1 1 1 1 1 1 1 1 1 1 1 1 1 1 1 1 1 1 1 1 1 1 1 1 1 1 1 1 1 
##$CPDPRG= <>
##$CPDPRG1= <>
##$CPDPRG2= <>
##$CPDPRG3= <>
##$CPDPRG4= <mlev>
##$CPDPRG5= <mlev>
##$CPDPRG6= <mlev>
##$CPDPRG7= <mlev>
##$CPDPRG8= <mlev>
##$CPDPRGB= <>
##$CPDPRGT= <>
##$D= (0..31)
0 1.2 0 0 0 0 0 0 0 0.06 0 0.03 0 0 0 0 0.0002 0 0 0 0 0 0 0 0 0 0 0 0 
0 0 0 
##$DATE= 1657191309
##$DBL= (0..7)
120 120 120 120 120 120 120 120 
##$DBP= (0..7)
150 150 150 150 150 150 150 150 
##$DBP07= 0
##$DBPNAM0= <>
##$DBPNAM1= <>
##$DBPNAM2= <>
##$DBPNAM3= <>
##$DBPNAM4= <>
##$DBPNAM5= <>
##$DBPNAM6= <>
##$DBPNAM7= <>
##$DBPOAL= (0..7)
0.5 0.5 0.5 0.5 0.5 0.5 0.5 0.5 
##$DBPOFFS= (0..7)
0 0 0 0 0 0 0 0 
##$DE= 6
##$DECBNUC= <off>
##$DECIM= 32
##$DECNUC= <off>
##$DECSTAT= 4
##$DIGMOD= 1
##$DIGTYP= 9
##$DL= (0..7)
0 120 120 120 120 120 120 120 
##$DP= (0..7)
150 150 150 150 150 150 150 150 
##$DP07= 0
##$DPNAME0= <>
##$DPNAME1= <>
##$DPNAME2= <>
##$DPNAME3= <>
##$DPNAME4= <>
##$DPNAME5= <>
##$DPNAME6= <>
##$DPNAME7= <>
##$DPOAL= (0..7)
0.5 0.5 0.5 0.5 0.5 0.5 0.5 0.5 
##$DPOFFS= (0..7)
0 0 0 0 0 0 0 0 
##$DQDMODE= 0
##$DR= 18
##$DS= 0
##$DSLIST= <SSSSSSSSSSSSSSS>
$$ [...]
##$SUBNAM2= <"">
##$SUBNAM3= <"">
##$SUBNAM4= <"">
##$SUBNAM5= <"">
##$SUBNAM6= <"">
##$SUBNAM7= <"">
##$SUBNAM8= <"">
##$SUBNAM9= <"">
##$SW= 18.0517283424941
##$SWIBOX= (0..15)
0 0 2 0 0 0 0 0 0 0 0 0 0 0 0 0 
##$SW_h= 3612.71676300578
##$TD= 16384
##$TD0= 1
##$TE= 0
##$TE2= 300
##$TE3= 300
##$TEG= 300
##$TL= (0..7)
0 120 120 120 120 120 120 120 
##$TP= (0..7)
150 150 150 150 150 150 150 150 
##$TP07= 0
##$TPNAME0= <>
##$TPNAME1= <>
##$TPNAME2= <>
##$TPNAME3= <>
##$TPNAME4= <>
##$TPNAME5= <>
##$TPNAME6= <>
##$TPNAME7= <>
##$TPOAL= (0..7)
0.5 0.5 0.5 0.5 0.5 0.5 0.5 0.5 
##$TPOFFS= (0..7)
0 0 0 0 0 0 0 0 
##$TUNHIN= 0
##$TUNHOUT= 0
##$TUNXOUT= 0
##$USERA1= <user>
##$USERA2= <user>
##$USERA3= <user>
##$USERA4= <user>
##$USERA5= <user>
##$V9= 5
##$VALIST= <valist>
##$VCLIST= <CCCCCCCCCCCCCCC>
##$VD= 0
##$VDLIST= <DDDDDDDDDDDDDDD>
##$VPLIST= <PPPPPPPPPPPPPPP>
##$VTLIST= <TTTTTTTTTTTTTTT>
##$WBST= 1024
##$WBSW= 4
##$XGAIN= (0..3)
0 0 0 0 
##$XL= 0
##$YL= 0
##$YMAX_a= 261118
##$YMIN_a= -294081
##$ZGOPTNS= <>
##$ZL1= 120
##$ZL2= 120
##$ZL3= 120
##$ZL4= 120
##$ABSF1= 10
##$ABSF2= 0
##$ABSG= 5
##$ABSL= 3
##$ALPHA= 0
##$AQORDER= 0
##$ASSFAC= 0
##$ASSFACI= 0
##$ASSFACX= 0
##$ASSWID= 0
##$AUNMP= <proc_1d>
##$AZFE= 0.1
##$AZFW= 0.1
##$BCFW= 1
##$BC_mod= 2
##$BYTORDP= 1
##$COROFFS= 0
##$CY= 11.3945322036743
##$DATMOD= 1
##$DC= 2
##$DFILT= <>
##$DTYPP= 0
##$F1P= 2.36226072786647
##$F2P= -0.459571619588291
##$FCOR= 0.5
##$FTSIZE= 0
##$FT_mod= 4
##$GAMMA= 1
##$GB= 0.15
##$INTBC= 1
##$INTSCL= 1
##$ISEN= 128
##$LB= 0.24
##$LEV0= 0
##$LPBIN= 0
##$MAXI= 10000
##$MC2= 0
##$MEAN= 0
##$ME_mod= 0
##$MI= 1.114404
##$NCOEF= 0
##$NC_proc= 0
##$NLEV= 6
##$NOISF1= 3.799351
##$NOISF2= 2.8
##$NSP= 1
##$NTH_PI= 0
##$NZP= 0
##$OFFSET= 15.70392
##$PC= 1
##$PHC0= -18061.9
##$PHC1= 9.00068
##$PH_mod= 1
##$PKNL= yes
##$PPARMOD= 0
##$PSCAL= 0
##$PSIGN= 0
##$REVERSE= no
##$SF= 200.130013532006
##$SI= 16384
##$SIGF1= 3
##$SIGF2= 2
##$SINO= 400
##$SIOLD= 16384
##$SREGLST= <1H.CDCl3>
##$SSB= 0
##$STSI= 0
##$STSR= 0
##$SW_p= 3612.71676300578
##$SYMM= 0
##$S_DEV= 0
##$TDeff= 0
##$TDoff= 0
##$TI= <>
##$TILT= no
##$TM1= 0
##$TM2= 0
##$TOPLEV= 0
##$USERP1= <user>
##$USERP2= <user>
##$USERP3= <user>
##$USERP4= <user>
##$USERP5= <user>
##$WDW= 1
##$XDIM= 8192
##$YMAX_p= 0
##$YMIN_p= 0
$$ End of Bruker specific parameters
$$ ---------------------------------
##NTUPLES= NMR FID
##VAR_NAME=  TIME,          FID/REAL,        FID/IMAG
##SYMBOL=    X,             R,               I
##VAR_TYPE=  INDEPENDENT,   DEPENDENT,       DEPENDENT
##VAR_FORM=  AFFN,          ASDF,            ASDF
##VAR_DIM=   8192,          8192,            8192
##UNITS=     SECONDS,       ARBITRARY UNITS, ARBITRARY UNITS
##FACTOR=    0.0002768,     1,               1
##FIRST=     0,             0,               0
##LAST=      2.2672688,     0,               0
##MIN=       0,             -294081,         0
##MAX=       2.2672688,     261118,          0
$$ Real data points
##PAGE= N=1
##DATA TABLE= (X++(R..R)), XYDATA
$$ [...]
1682B74J25m58K61j64J10Ll23J32L18O9o40o4K97M9m3n1o5P7J02L3k42K24Q6j92
1706h2MQ3R6j80n9J75K5J27k72k3M41k16K2k49J80m1J27k66M4J68k12j22J58K76
1730B04k26l09K08L41q5r8k21J57J21O1l86mO7K05K8O9J91m56K42j64M96j14n22
1753a95k06L54M74n05L9j07M05p8k88N0K55j43l41J25K35j77N0l10L87M62m14
1774G2m48K27K37J8l09P6K76m2m0j24J77J60l74J22J26K94l30k05K79OJ99n01
1796a04J08J31J48k92k35L53j04j23m4K03J04j59l75Q6M10j64l17l5M55K72l87
1817f9l10J38K42j41l9J15K05J8k94R8L39j73l60K99M10l58j35K9k3L69On82J32
1840h4R7P9p0j65M21k74k07m7N70j61m81K75J54J91j99l63L7L94j36j69LL45J17
$$ y = [274, 399, -59, 202, 38, 148, 151, -172, -40, 278, 347, -293, -357, -60, -11, -54, -105, -170, -93, 9, 42, -200, 24, 110, -82, -78, 5, 101, -79, -138, 37, 62, 189, -83, -106, 335, 119, 141, -108, 72, 31, 158, -108, -64, 104, -108, -230, -72, 204, -22, -331, -123, 218, 133, 35, -186, -29, 92, 153, -233, -237, -170, 35, 63, 132, 323, -133, 109, -55, 441, 327, -195, -401, -47, 427, -78, -39, -146, 259, 181, -107, -57, 198, 55, -286, -161, 74, -103, -53, -363, 24, 486, 72, -376, -149, 88, 106, -203, -127, 149, 107, 67, -57, 120, 280, -94, 28, 154, 448, 118, -87, 192, 198, 397, -104, 4, 135, 283, -9, -244, 109, 5, -118, -162, 41, 145, -14, -389, -303, 107, -57, -374, -409, 46, 318, -69, -379, -241, 1, -140, -179, -64, 141, 159, -135, -37, 302, 129, -231, 68, 478, 120, -15, 14, -9, 360, 366, -216, -84, 13, 92, 22, -143, 278, 4, -203, -250, 320, 159, -322, -47, 107, 298, 99, -264, -227, 167, 31, -138, -135, 210, 327]
1863C27m18k0K60J78l09j05K15K48k63k04J14K06J09m85j08J11M89m68n4K21p4
1884c0J16l34K62K09j25l47o4O60j10n58Q1K78L43m13k72J65M10mm54Q8L62k88
1906b5l4J55K47j8n68Q9J46K85j52n46L36K79o1l40K0M71J5o37K06L67k35Jj75
1929a74J91M30m20m78L64N52k66l08j82L68J47j42k72J65M10l72k06L06J54l29
1949f2l15j3O15l1m50m9L10L41l20k52M7M23p3m72L50K71l48l56M51m5O1j24o6
1972a07L92K55o15j72J00N49r0l90o8M40k6m72K21K9L37m71q7L78lk31k89mO28
1995C04m35j26k1L44L22l15m60M31J98j95j95K52K50l37n9J25K76J6o35m1L86
2016H5K15l12l46K73L84j94l77J11L92n1k80r9N74l41m36K10M32P2n04m2n5O92
$$ y = [327, -91, -111, 149, 327, 18, -87, 128, 376, 113, -91, 23, 229, 338, -147, -255, -144, 345, -123, -177, 44, -30, 86, -248, 14, 223, 98, -249, -313, 347, 237, -321, -240, 38, 381, -32, -304, -139, 271, 267, -187, -99, 263, -25, -59, 96, 343, 325, -243, -154, -8, 277, 125, -421, -85, 194, 133, -207, -187, 284, 299, -338, -132, 235, 0, 1, -174, 17, 447, 27, -451, -87, 465, 199, -109, -291, 77, 224, 82, -190, -25, 385, 13, -193, 113, 267, -62, -377, -390, 225, 194, -256, -305, 5, 346, 26, -226, -179, 244, 171, -301, 49, 320, -28, -384, 67, 22, 83, -41, -107, 285, 540, -75, -247, -147, 402, 312, -78, -146, 294, 268, -204, 17, 46, 383, -88, -175, 203, 200, -31, -320, -324, 304, -131, -257, -278, 66, 388, 73, -387, 44, 242, 47, -148, 104, 354, 17, -42, 83, 359, 375, -260, -301, 85, 300, -12, -358, -85, 299, 105, -272, -161, 231, 180, -100, -199, 375, 34, -402, -192, 240, 312, -192, -234, -289, 403]
2038D03m86k56J09L56K14m95J56K70R7o93J26M71O1l92k66K54N71k72m95R2K16
2059D1K00l71k60M19J38k40k12K06N1Kl98K39N86j85l39k88M76K36l78j54L32
2080A01L70l79l21K90oK32k77k35M50m3k78k69N88q1m11N7J93J13O1l54P9O6Q6
2103C2j64L2J0J00p8r3J67K23l05M5m8O02m96j91J57L84j26k25j76K78Q8J29m86
2126a41J10K12kl73J98J13j16j86q1L20J65m53k93L05O33k24m19K63J23ok59N6
2148e5RJ74k65R2Q0J41l47j79M81K89j19k26l01N09j69q8N6j46L02m22r8L77m2
2171E3j44j54m2K62j1j20k86P24m47J52m16M79j6J90m38K28K70j77l50R0K93n4
2193H6q8l2K68n2k96m8J74K12j81k70K00J35m3l31O4K29K13l70M8K1Q8k29J23
$$ y = [403, -83, -339, -230, 126, 340, -155, 1, 271, 368, -325, -199, 272, 333, -59, -325, -71, 500, 228, -267, -175, 41, 241, -130, -390, 29, 167, -73, -285, -79, -28, -26, -424, -185, 401, 216, -123, -411, 65, 301, -77, -231, 101, 471, 92, -229, 61, 55, 287, 10, -225, 225, 182, -96, -365, 223, 142, -269, -212, -19, 94, 155, -199, -120, -54, 32, -132, -100, -90, 10, -68, -161, 6, 229, -76, -31, -79, 523, 27, -164, -7, 377, 251, 26, -150, 128, 216, 345, -141, -31, 181, 179, -194, 4, 117, 1, -185, -266, 54, 219, -234, -527, -222, 411, 187, -232, 31, 154, 148, -111, -55, -46, 128, -137, -45, 35, 176, -171, -350, 131, 420, 301, 75, -226, 283, 114, 26, 82, -64, 238, -184, -282, 95, 53, -91, -245, -287, -25, -36, -156, -442, 282, -165, -13, -429, 50, 34, 224, -214, 14, 284, 107, -243, -153, 140, 86, -2, -34, 234, 182, -114, -162, 12, 224, 43, -227, -27, 108, 65, -266, -202, 27, 240, -130, -82, -61, 27, -202, -79]
2216g9J27n4k5J20n1q0L4j18o0K72k33L74m36K36n7J20j5k19L27m58L65k03J97
2239H4J27m73K57r0K84k61j39Q4L16j05l4J06l07J94l8J66k48J64o7P3j13Q3J05
2262A68k18K17k02O2o3o1r5L12l37L75q0k0R1j51M1M69m01l24J18pN6p4j1Q4J34
2287H3j20o8K22l01L76k70kL36k02l45M07k12J49q9M5J6n8L83k51j24r4J93p2
2310BP8k22P3o6J38j15M4R2j5P7P9l14O4M4J07p4J21m4j02M2J83p5o2r4r6RK25
2337I9R1j81j65R8K42l7j55k13K71K4J89m23Q5J4j51P7Q6j15k2J81J02k1M5k14
2361i3J43q4K52k82J48l7j23K9m2J09m1P8j55J05J05j48n3J58p3Q0k02Q0l1L2
2385d5k15K46J41k28L0j46J01P1j45k2L44j25l1K5j26J38M3J63l74J25R4R5N8
$$ y = [-79, 48, -6, -31, 89, 38, -42, -8, -126, -186, 86, -147, 227, -209, 27, -30, 90, 75, -144, 183, -275, 90, -113, 84, 211, -262, -5, -95, 189, -72, -211, -127, 189, 84, 50, 156, -151, 43, 5, 171, -77, 87, 20, 93, -20, 63, 168, -50, 167, -35, 27, -36, -97, -192, 120, -217, 158, 78, 58, 149, -2, 39, 508, 107, -217, -99, -106, -50, -124, -135, -51, 83, -37, -105, 117, -184, 192, -78, -80, 256, 54, -291, 116, -96, 53, -36, 9, 25, -33, 350, 99, -25, -119, 74, 2, 80, -142, -69, -135, 3, -112, -68, 24, 9, 86, 165, -149, -85, -41, 66, -8, 113, 69, -33, 9, 192, 117, 55, -39, -135, -126, 99, 190, 9, -156, -58, 184, 147, -8, -221, 50, 74, 263, -160, -75, -61, -212, -135, -49, -164, -186, -5, 97, 76, 121, -93, 50, -34, 218, -64, 84, 47, -76, -47, -89, 20, -21, 57, -98, 7, 112, -36, -89, 69, -4, 76, -126, -46, -77, -45, -260, -14, 127, -101, -71, -217, -116, -45, -190, -212, 132, 7, -24, 1, -125, 13, 56, 219, -155, -30, 64, 159, 217]
2408B17o9n5R0k71J86j60J55M5k32o3J12K8J54Jj23L53n26J29Kj31J03k8K34l90
2432b39K38l73L65J22l2k01j08J12K02l12O4L62l6j98j17J80K18j61p6L7j18L6
2454c5R2J12k60J07q4Jj9K01L6k36k20O06j45j90M6n7J48l58o4L78k2j39n8J46
2478a4J10j38K29k58o5J84j7j27J70L0M0j52M8Kn1nJ64m9J81l13K06j10M6m25
2502c14J86N4j0J57k85O7R6J71k16R3N2j29l2J05L15k37j90J21M5P9j12j11K51
2525A56j80k06J57J67k74K34n6j33M4j17K29m3j2K28k56O0j43L28J55m47%l0R7
2548d2L54l53J3K27Nk55L1J71p4l28K97M9J39q1j35L9j21J00k31L53l3j18j26
2571a19J75k8r3R5n3o6K25j5k19J4J83j75L07r4J06j25o9j1m6o4J06L2O1j62J27
$$ y = [217, 148, 93, 183, -88, 98, -62, 93, 138, -94, -157, -45, -17, 137, 138, 15, 368, -158, -29, -27, -158, -55, -83, 151, -239, -1, -374, -9, 113, 81, -120, -228, -116, 86, -226, -162, 200, 164, -34, -151, 29, 247, 86, 10, 47, -71, -35, 57, 169, -91, 16, -68, -67, -86, 115, 151, -85, -305, 301, 156, -34, 12, -45, 103, -255, -319, 59, 37, -102, -160, -14, 96, -42, 187, -71, -136, 48, 31, -96, 74, 104, 144, -8, 40, 42, -9, -14, 150, 101, 282, -31, 175, 65, 111, -314, -128, -74, -84, 73, -212, -145, -49, 122, -94, -1, 51, -78, -110, -5, 310, 73, -117, 4, 49, 128, 16, -95, 156, -24, -230, -73, 94, -180, 54, -2, -135, -91, -208, 21, -22, -34, 194, -62, -2, -145, 183, 338, -109, -109, -139, -42, 312, -41, -28, 199, 204, -51, -20, 151, 77, -251, 46, 95, 234, 153, 18, 57, -64, 36, -195, 158, 125, 7, -119, 56, 28, -65, 30, -23, -89, 136, 121, -98, -84, 99, -76, 231, 137, 243, 118, 49, 38, -8, -72, 34, 66, 127, -35, 92]
2596I2J14j01j02k8L6j28L63k34j78N0J43j79J36k0K0O3r0M3j94K43j63l2K39
2619I3p3O8j37j4K7P1j97J56nR1op7m4j9J41Q3j85l47K23K66o5j75M22k17l6P9
2645A23j31P8p2K33q7j05j93J3J58m1j63J60o5J15q0lK0K25l1q6q7Q4J69l15M0
2670d1k79L97n0Lk99J31J8o2R9P7j4j19Rm2p6O9L1q6L57J4l2o3J6j60Q6R5k38
2697a59O7j35Q5J35K75lj96k49J70J10j33n6P9K8P4r8j58K51p8M8P0k80J80J51
2721A78m2k92O7N4rJ05N6j39p7qL29o6l03JJ98J16j7q7j26K98l49J98k02P3J49
2746A05m6J20q8r7j28MK07Q1k31J47j52o2J17j01J17p7m0L1J44j49J89k09K73
2769A55j06j60P1k9%mo9R2K33j94M6P6J06m04K35n6J07L19l81j33K92k89J10K6
$$ y = [92, 206, 105, 3, -25, 11, -117, 246, 12, -166, -116, 27, -152, -16, -36, -16, 47, -43, 0, -194, 49, -114, -146, 93, 20, 88, -49, -63, -36, 35, -162, -6, -11, 80, 74, -3, -47, -66, 75, 158, -27, -374, -151, 115, 50, -125, 297, 80, 44, 123, -8, 70, -2, 231, 144, 39, -154, -141, 17, -24, -187, -27, -92, 23, -57, -60, -40, 185, 154, 68, -19, 65, 234, -81, -41, -320, 77, 27, 30, -269, -138, -120, -182, -83, -6, -20, -139, -130, -172, -248, -179, -148, -234, 123, 137, 105, 42, 58, -102, -16, 79, -159, -92, -227, -142, -7, 268, 265, 69, -180, -10, 100, -33, -89, -10, 18, 92, -6, -164, 87, 9, 57, 127, -153, 27, 178, 136, -156, -89, -35, -44, 61, 117, -22, -99, -107, 222, 156, -147, -146, 52, 168, 151, 64, -62, 236, -113, 85, -117, -44, 105, 59, 179, 91, -6, -134, -130, 77, 158, -73, 74, -78, -140, -23, -124, -7, -84, -124, -93, 51, -98, 91, -118, 155, 49, -111, -40, -69, -69, -73, -142, -50, 183, -11, 35, 111, 217, -187, 48, -8, 99, 418, 37, -96, 196, -93, 17, 43]
2793D3r3Q1J45j88P0J06k34j17%K48J77l57J54n3q1K15M1q2p7J08j64J04j40J14
2817B0o7o7j15K60k05K43J67r7m32K26j39L09j85o7K72k27J82k55L82m3l45o1
2839b44K01J63j04o2O6J17l29o2K75o7k02K73m2l9N7K76m08J82K20k49k4L3J26
2862A57j35n7j41J72j52P5lLr2J27K26k64K94l14OP2J51L0j1k60Q8l8K62k63J7
2887e0K06j47N2j58J65k9j91J26J04p5J07k66J63Mj19QO6j12P3K9J54r7q4j9K1
2912f9R4j6j08q5L23J36q1J3j80k4N6J37j16r1j5M1L23k99k10J58J00r4K5m2q4
2937a08J70J74j94r7K38l04K70j36r3j02R7L72m02K28r3n4P6j67K09jlM7j97J20
2961E0l23J47J69k58J17J01J46k03O6o8J62j22j50J38J05j26j99N94o51R6O3J97
$$ y = [43, -50, 31, 176, -12, 58, 164, -70, -187, -187, 61, 238, -119, 35, -18, -99, 116, 157, 75, -2, 106, -58, 46, -94, 20, -47, -114, -229, 31, -174, 69, 236, 139, -293, -67, -206, 103, -82, -149, 123, -104, 78, -177, 205, 162, -183, -244, -43, 120, 16, -46, 20, 137, -192, -254, 21, -46, -248, 25, -17, -56, 1, 277, -131, 51, 271, 22, -2, 31, 157, 22, -35, -176, -4, -156, -81, -84, -81, -173, -46, 180, -84, 210, -104, -98, -26, 125, 155, 144, -116, -28, -66, 196, -67, -50, 156, 9, 61, -97, 68, 39, -152, -26, 78, 3, 110, -156, 7, 11, -108, -100, -34, -146, -73, -44, 110, 13, -71, -90, -69, 25, 9, -99, -184, 139, 275, 194, 207, 27, 3, 59, 196, 80, -11, -26, 15, 338, 39, -171, -13, 87, -7, 18, -24, -108, 62, 236, 42, -55, 183, -121, 149, 13, -80, -182, -85, 287, -115, 113, 20, -34, 42, -125, 84, 83, 80, 127, -70, 50, -273, -126, 43, -215, -98, 3, 149, -54, 12, -56, 106, -16, -166, -28, 77, -49, -248, 346, -305, -209, -146, 51]
2983E1k01J09k2k64L96j06j45Q5L1M04m67Q1J46j7j87J49r3r3K28k80P4O0K37
3006A76j86q9P8K32k70J71j02j6K69l64L7R6k06K64j83J96j36P5k6R5J79j75o7
3029D8KJ90m57nJ76J43M2j06j15J39J24j55r5OK81k77P5nJ12k47O6J78m1O6j10
3054C5l3j99J80l2k5P0j12J18m2l0O9l7m7J32Lj3J78r5k26N5K83l51J7M1l6R1
3080fj32J67R9k91L91m33K74J73k04J58N3j11j23r3N1k8L8O6L5k2m7O0J05j97
3104a7N9j08J66l7l37K57r3j7J24J9N1N1l67M30k96K5M4J4J9k6j28J14R5pL5P9
3130A49K9r5l11J90J61j76J41J8j19J43k05J35j44Q9m7K31k46J84m2r9L9k2n5
3153e2K05O4k06p7K15k87L05j14k12J89pq2J12J1k5O8k66K57lJ41j22o9J00j62
$$ y = [51, -150, -41, -63, -327, 69, -37, -182, -97, -66, 338, -129, -48, 98, 81, -106, 43, -50, -143, 85, -195, -121, -61, 176, -10, -99, -21, 211, -59, 112, 10, -6, 263, -101, -64, 32, -174, 90, -93, 103, -33, 42, 16, 111, 290, 115, 48, 50, 240, -217, -222, -46, 97, 139, 33, -82, 57, 181, 26, -69, -63, 218, -59, 16, 11, 123, -124, -58, 120, 79, 145, 35, 2, -197, -17, -49, -74, -4, -116, 2, -40, -70, -1, -38, -85, 47, 50, 37, 215, 120, -106, -51, 232, -119, -102, -61, -97, -6, -138, 29, 128, -163, 228, -205, 69, 242, 38, 196, 249, 138, 15, -78, -27, -55, -17, 49, 84, 62, 15, 75, 180, -17, 42, -66, 100, 63, -274, -17, -110, -127, -3, 16, 67, 118, -249, 181, -115, -90, -46, -32, -13, -39, -167, -53, 42, 35, 70, 149, 178, 83, -228, -38, 123, -53, 88, 106, -13, 130, -75, 60, -84, 5, -42, 189, -57, 127, 85, -14, 25, 3, -52, 153, 217, 11, -66, 149, -138, 167, 53, -159, 30, 23, -59, 53, 64, 39, 107, -159, 98, 95, 236, 114, 45, 145, -17]
3177a7l0k3j75K75J01qk83K60N5J46k54q2J73j46j01k01L81j1o2k60L76o7O5k75
3201a63J04l4J01k4o5jJ17J05k38J78Mk2p9J48r0R7j98R5k37L04q0R0k63J07J68
3226A24n6k84NK75l5q5r6J32J22j79J32Q9N5j48J39j38l2j00N1n0J94k18M7K25
3250A69k42K17j08oj0J7j90K53k02l8J09o5K05k03P1k2M8J10k37K04j12J18p7
3273IO4k40J54j37J97j7J80k59k7K6n5r6L07j24J35n6r6Nn1K18j79J89k77L1J46
3298D7j4m7J16k04J46j62J47k32K41j88K12k00J57Q1j37j22K49J79r2M8j25J13
3320B13j82J13k24p3n3J51m8K0K47o8k27K04J01Rk22K4K8J99j23j76K35k56P8
3343c0j22L94l06j2M9j40J28%PR3k12L87l49L7J72o1M3j49J77k30J73L8r0j58
$$ y = [-17, -47, -70, -245, 30, 131, 123, -160, 100, 155, 301, 47, -35, 138, -8, -109, -310, 71, 60, -2, -262, 114, 47, 112, -163, -59, -93, 8, -16, -81, -82, 35, 140, -98, 80, 84, 62, -17, 131, 41, 138, -60, 35, -202, 102, 22, 112, -151, -44, 124, 68, -216, -211, 64, 29, -56, -152, -20, 102, -77, 55, 144, 199, 51, 190, 52, 20, -80, -29, -79, 115, -103, -56, 169, -73, 144, 36, 30, 20, 37, -153, 100, -102, -140, -31, -96, 109, -94, -23, -45, 3, 113, -124, 80, -32, 86, 9, 73, -167, -13, -150, 47, 30, 210, -49, -76, -50, -105, -201, 106, -18, 117, 61, -35, -30, -81, 137, -42, 147, -130, -99, 47, 33, -14, 102, -102, 44, -118, 29, -203, 38, -150, 62, -138, 19, 100, -37, -159, 90, 269, 177, 225, 100, 213, 31, 144, -80, -153, -206, -55, -103, -83, 164, 96, -131, 73, 174, 183, -39, -15, 13, 212, 89, -87, 148, -108, -30, -152, 242, -64, -76, -27, -167, -39, -39, -32, 61, -151, 236, -113, -76, 96, 35, 78, -71, 106, -124, 49, 87, -3, -161]
3367a61K35k30K70J11l8j50M0k74K46j00p3J84n8n7J84L1m2k18P4l9k7J24o8N5
3391A9R5J0j02n5n0L88k52K0M7l12J85J8Q9p8l36M29Lk64K70j83R2m5K32j58l4
3416B8r8J24K28j77m1j34j52K6M40j21m8q8J81j41r8J32K58l65pJ52Q3k55L8Q6
3440E1o2K7%j50J45j24J87j11j96K96K1PN1m8m21N2R0L43l06j9j2J4J58L2j04
3465g9J38k45J66R7p1K84k61j4Q3j28r1K94j04n4K01j29K0k19K32K2k04M4J27
3488A09J26j49k72K12j41Q6k3J31m4N0M3m7j00L48k41k88K41l26K90l3j83K68
3510E7P3l58Q6J45J00j98J18j3Q2N8j78R3k35K91o3j48K21K0Rj31J02k49M9k47
3534c16M46k07Q0k2O5J59j06j67nn9J01O0K29m33K2J75o3J12j46K1K4L2ok3K7
$$ y = [-161, 74, -156, 114, 225, 187, 37, 77, -197, 49, -51, -124, 60, 2, -55, 129, 160, 118, -100, -26, -65, -92, 32, -36, 19, 114, 124, 22, -33, -83, 305, 53, 73, 120, -192, -7, 11, 100, 22, -314, 115, 118, -146, 124, -59, 33, -12, 220, 62, 28, -70, 54, 282, 105, 64, -70, -222, -196, 244, 123, 75, -13, 168, 27, -71, 61, 319, -46, -53, 99, 182, -73, -35, 51, -11, 16, 16, -134, 11, -113, 74, -37, -233, 63, 84, 91, 142, 94, -327, -275, -185, 158, -148, -167, -179, -165, -7, 25, -79, 59, -186, -20, 77, 6, 290, 29, 15, 98, -30, -121, 173, 69, 15, 216, 87, 107, -112, 120, 142, -62, -18, 109, 235, 86, -186, 26, -115, -29, -52, 79, 35, 85, 128, 81, -19, 329, 88, -200, 41, -285, 5, -28, -211, 57, 130, -228, -142, 3, 103, -95, 23, 10, 92, 150, -28, 65, -170, 121, 58, -90, 131, 151, 160, 29, 131, -118, -69, -316, 130, -77, 3, -19, 46, 205, 99, -68, -73, -132, -31, 29, 258, -175, -153, 22, -41, 71, -75, -54, -30, 2, -4, -27, 0]
3559@k34Q7j5j00K64j69L20p8O4j82K05q7j51J15j47K01j30k16L7K00r2M7J39
3582G8m5j94L8q4J47q7J41l4J2rJ66k05Q9l2N3j62N8J41j22qO3j06J98N6q2l7
3608C3jj46J84j34L7J05j21K23p9n4J63k85J01n4j33n4J73J49n1jrn8R4M7L8j83
3634a6L6J63j91P3K63n10K24l9rK3j69J98L3N1j66J30r6p8j27K92LJ2n0k4J03
3659A29j51o6L7q5J07j1J21l30M3O5K23l42p7J68J3J15k07L59p2J85j76j05M8
3682iJ2J3n9N8q3K01k79J42Q0j00N0J02k36k4L4Q6L9K76l92K11j62j01K71l95
3706b65L23j35K3m6J5J3K0l4P4J67k03J53j01K68k77m4K39k88K08r3Qj07j7p1
3730a70J56j07Q6R8o3J35L4j03k75J53Q0J4L2j99P7K6K14j46o1J3L08l17J32Q9
$$ y = [0, -234, -147, -162, -262, 2, -167, 153, 75, 139, -43, 162, 75, -76, 39, -108, 93, -37, -253, -216, -16, -108, -61, 78, 33, -161, -123, -207, -60, -147, -6, -40, -28, -37, 129, -76, 13, -19, 34, -128, -70, 71, -51, -59, 4, -102, 96, 152, 70, 33, 32, -114, 70, -64, -27, 78, -43, 180, 101, 47, 210, -75, 26, -28, -161, -215, -42, 107, 56, 55, 46, -12, 82, 129, 167, -16, 20, 183, -8, 65, 328, -182, 42, 3, -6, 17, -152, 46, 79, 130, -36, 94, -2, -80, -207, 85, 88, 100, 50, 26, 129, -22, -88, -51, -136, -29, -40, 81, -249, -206, -141, 82, -260, -337, -169, -156, -41, -248, 111, 39, 224, 48, -57, -9, 3, 16, -43, 15, -68, 133, -146, -4, 76, -24, 26, 128, -108, -132, -98, -12, 27, 303, -89, 122, -40, -141, 130, -265, 58, -77, -54, -100, -85, -72, -52, -86, -12, 155, -48, 105, 4, 272, -5, -49, 190, -98, 110, 17, 25, -82, -99, -170, -14, -121, -35, 63, 0, 135, 169, 66, -209, -56, 24, 38, 70, -129, -52, -26, 188, 42, -19, -6, 302, -15, 117, 206]
3754B06pk69j55J82K8J8O1J46k76n5J74k2J17j46NJ60j47j87qJ66j8p2j92M69
3778A78N5l61J06p6R0j55L48r2L7j33qL5n6K13j15j14K8P6J15o5l01J79j96L43
3802A31l1j86N7R7p7RL3J09k28K72k76L45j68J31l23J45L9j9j36j00L43k24l3
3825i0J50k1K15k77O1Q9j08M5J3k55K46j30K25l49K60J15k11J42j70N0J38l37
3847a99K4J60J15j45r0J26Q4O1j29P3k10K7O0J05k00K50j77P5J1O8k43pR2J00
3871C1l3q2k7k4M0K74j69l6J18k63J82K54j42r0k83L56l74K90l7j0r5Q6L4M4J41
3896A85J25m03q7J84q5Q3J27L8k19J93o1l32L49j05j74L15k84K02j82J81n3k0
3918b3R7j25K29k95q7R3J34J04j71J34q5R9j69J41oJ73l58j25L74j97K03k04n7
$$ y = [206, 199, -70, -225, -43, -15, 3, 64, 210, -66, -121, 53, 31, 148, 2, 7, 167, 20, -167, -175, -9, -27, -99, -291, 178, 233, -128, -22, -98, -8, -163, 185, 93, 130, -3, -11, 24, -32, 181, 66, -48, -20, 56, 171, 106, -195, -16, -212, 131, 100, -86, -29, 68, -9, 0, 33, 142, -86, 186, -90, 255, 87, 218, -105, 40, 79, 60, -76, -176, 167, -57, -90, 60, 39, 254, -23, 38, 127, 19, 64, 77, -178, 68, -62, 163, -186, 74, 189, -22, 120, -50, 0, 138, -199, -175, -15, 100, -45, -135, -9, 75, 136, 7, 80, -130, -103, -43, 62, -138, 112, -65, 10, 21, 89, -154, -161, -69, 31, -2, -84, -111, -135, -95, 179, 10, -26, 92, -171, 11, 265, 123, 33, -250, 106, -268, 22, -15, -25, -120, -34, 0, 44, 185, 310, -93, -180, 4, -81, 2, 129, 167, -52, 141, 80, -252, 97, -8, -182, 133, -151, 51, -131, 50, -3, -23, 74, -51, 178, -117, -204, -111, 23, 127, -44, 90, 5, 104, -65, 76, 70, 243, -115, -240, 134, -63, 140, -64, -121]
3941a21J04N8o4j82L21m3k45K3M87k15k80L44j02j34J03j77K4M9%R4j46K49p7
3964G0j67J54j21L21k48j01N0Q2j11K9j84L48j65J0l9J23j3j23M8j40J40L2O9
3987F4J52j89k4J95k67R9M3j99k46L43P7J49j42j26l00O32j35k21K88j6j30J7
4009F4j06J32j03J8JJ87j11j87L81l71K69p6J6Q4N9k60K0J08j31r7J68N8j58o4
4033i9p1O9m1J31J3j25K1N3o0PM2J58R0l56L33l49K84l66J95o2M9J48k73J35K53
4058A79j48j29K33j74L51k49j42N1J04Np9J20J18j35J89j10l98M31k86J23j34
4079h0K62l25j11K04k7j8K0J72j43p1j41M57j7l51J90J22J61o8j13j77K77l53
4101a30K10j21m4J80k1k02k2O0l0J28O0qJ73k53K8p0J96j8j82j57P7J35R1j19
$$ y = [-121, -17, 41, -23, -205, 116, 73, -172, -149, 338, 123, -157, 187, 85, -49, 54, -123, -99, -50, -50, 44, -102, 147, 70, -97, 57, -64, 257, 9, -92, -42, 40, -71, -42, -226, 122, -43, -33, -72, 51, 38, -85, -37, -177, -37, -5, 64, 216, 27, 3, 198, -69, 30, 73, -126, -372, -29, 48, 197, 55, -71, -371, 261, 126, -95, 193, 177, 47, 64, -42, 90, -13, 5, 6, 193, 82, -105, 276, -95, 174, 98, 114, 198, 257, -3, 17, 125, -6, -103, 65, 123, -35, -99, -170, -101, -142, -11, 2, -123, -102, -49, -109, -102, -60, 98, 188, -168, 165, -184, 100, -266, -71, -133, -84, 64, -209, -74, 179, 31, -98, 135, -39, 312, 63, -79, -28, 76, 81, 2, 122, 240, 105, 294, 184, -214, 217, -69, 54, -80, 182, -143, -254, -50, -77, -95, -75, 97, -46, -117, -258, 199, 182, -169, 21, 143, 304, 236, 123, -54, 223, -130, 80, -41, -85, 95, 74, -128, -150, -90, -120, 8, 68, 60, 233, -20, 8, -62, 134, 116, -66, -223, -146, -11, 80, -39]
4125c9O5M8k26J4k9K50l6j52P1OJ05n5L0m2j16K09k7J7k8j15J76l17K60o2J21
4150A28k6k2m9N8j53J74O7j03j12K16q6j48%K85j44k50L14j82r6K86p4j46J80
4173A17M4m6l13N9L00k12K34l87J86jK04r5k09Q0N3o6J54j88J00r3M7J41k3J45
4197B31m64P2K50r3J75j00l2j67J84l8j41o6K07j31R0j12K33m3q0Q8j86P0m5J31
4221C3nl7j69J76m6L6J14Q2j75R3j05K04k17R5m2o3L5nK7l7J97k57L2J17p6L1
4247C8p9J92k34n4L13%k56K5J29p5O5l11J12L5L13j41k68O1KJ86l41L66q6n9K30
4272A63j84J2j95L08k62Q5k3K66j6j87o5J40P3K7j4k26M2o1J73M6pp7J9J80k19
4297bK2l9J51l16p5L98l70L70j87J04J2k6q1n6J61k62K2K84j31R4n0rL5j50j1
$$ y = [-39, 26, 74, -152, -138, -167, 83, 47, -105, -34, -28, 77, 22, 52, 10, -106, 103, 76, 93, 65, -50, 126, -191, 69, 7, 128, 102, 80, 31, 89, -64, 110, 177, 74, -38, 178, 92, -56, -56, 229, 85, -165, 149, -33, -129, 157, 83, -63, 117, 161, 115, -198, -139, 161, -51, 183, -204, -18, -19, 185, 90, -119, -39, 14, -52, 102, -86, 14, -79, -32, 109, 86, 231, -233, -161, 89, -4, 171, 71, 39, -128, 56, 18, -123, -189, 18, -113, -23, -135, 98, 55, -25, 63, -123, -53, -98, 33, 28, -9, -178, -2, -48, -12, 102, 184, 9, 102, -3, 201, -16, 79, 37, -26, 9, 4, 31, -6, 191, -66, -34, 83, 7, 38, -41, 151, -83, -137, 176, 176, -80, -55, 74, -1, 64, -247, -135, -100, 213, 72, -196, -135, -133, 53, -288, 78, -8, -67, 163, -21, -9, -204, 104, -158, -73, -96, 170, 154, -33, -98, 42, 115, 142, 128, -98, -56, -117, 56, 102, 95, 18, 37, 217, -2, 20, -19, 132, -184, -259, 139, -231, 139, -48, 56, 68, 42, -39, -95, 66, -196, -174, 110, -21, 73, 23, 14, 49, -101, -112]
4322a12qK4J90RPj37r4k6K05J38j22J02j39J6j5K59l54P9qK44k95J06L9l07L28
4347A29r0j27J13j15J81k26R1J35j70M56m82K77ol65L47k01JO8l8j65K20Oj5O3
4371H7j19K2J08J26k88m4J40N4R7p1k85J55j26L33j09j61R4R3j9k6k53N3J31j47
4395a55K64k53KJ81J56k54J91j23L0m0K12k16k0L8J50j57ML4oj05J14N8p3M0j49
4420g7o1K09j77o7L41o2j01m9K55j96KNj75J07Q6r3J76l35J14J12J7p6P3o8j75
4445b15M03j42M8j38n0k01N0M59j34p4n7J06Rj06k00J48P4M6q8K08k03M0j8MO6
4470C5j84J43p7K45m73K30K60k30P1p0r3J80j77J48q1N9J31k69O2K9K41j43Pj04
4494f0J77j73R1q3o3j7Pk4L97j87j35J47j87k7J60k71J87M3J70k32N1K22l73L37
$$ y = [-112, -120, -96, 94, 103, 110, -27, -121, -147, 58, 196, 74, 176, 37, 53, 38, 297, -57, 22, 14, 258, -37, 69, 108, -199, 129, 39, -88, 25, -90, 91, -135, -44, 91, -79, 377, -105, 172, 166, -199, 148, -53, -52, 16, -22, -187, 33, 39, 24, 87, -32, -10, 98, 224, -64, -108, 32, 86, 183, 112, -173, -18, -144, 189, 80, -81, 13, 106, 87, 61, -192, -139, -8, -155, 109, -144, -142, 39, 195, -59, 132, 9, 39, -1, 211, -5, -25, 13, 163, 6, 10, 44, 38, -67, 47, 105, 32, 72, -77, -138, 71, -106, -173, 168, 106, 5, -44, 211, 15, 17, 22, -153, -46, 40, -53, 123, -212, -98, 14, 31, -45, 28, -40, -215, 188, 46, 94, -44, -94, -295, -245, 214, 80, 6, -51, 55, 64, -42, -242, -94, -20, 26, -62, 146, -57, -17, -35, -31, 35, -149, -6, -83, 162, -311, -81, 179, -51, 20, -50, -143, 37, -140, 8, -73, -14, 117, -152, -90, -61, 180, 37, 44, -60, 117, -56, 35, -48, -111, -128, -121, -145, 252, 65, -70, 77, -110, -137, 23, -248, -61, -18, 152, -80, -29, 193, -180, 157]
4518A57k61K15k40J44j81n9K19L7m7m5O6l7oJ93k21R6r7K06j0k08N3K8Q3j51P5
4543Il1q3m0L81j03k0Q1j77j28p6M80o3m04K25J07j33j29k5K20j25j95K35N2K67
4567C25l69J59j8l8k90M83k35qK22k13j56l5K17j01J53l24J95K22j48M5N5k59
4589a18QJ5J37j68J9L65k03j5J20j80NM4N1J0j23j5n8R7l9K31k60J38JJ36l79
4614a81K30J7q2j31Q1J81j85R8p5Q8p1J71n4j60P2K55k76j79NL33r0k26N7K42
4638A20J0o9L4r3J93l11K97q6j63L6J5K2j19J50j03L9O9k58L07j99K07j59L09
4661B48j27l09K21L2j14O3J25j5L8j70J07j00R9j22N6m3q6J42j05j3N4k3J49j06
4685Aoj7K01j33N3j49j68J67j21K77j66j26N3J89J02k27J34P3k32OJjr3k7K87
$$ y = [157, -104, 111, -129, 15, -166, -225, -6, 31, -16, -61, 5, -32, -38, 155, -66, 30, -67, 139, 129, -79, -26, 2, 85, -66, 9, -22, -105, -145, 236, 133, 113, 194, 17, -111, -187, 293, 230, -174, 51, 158, 25, -104, -129, 91, -34, -229, 6, 58, 325, -44, 115, 97, 59, -231, 252, 17, 9, 231, 18, -138, -173, 44, -57, 96, -228, -33, 189, 41, 86, 141, -118, -110, -95, 42, -126, -107, 258, 55, 40, 160, -20, -15, 29, 80, 90, -33, -48, -106, -9, -48, 183, -77, 61, 62, 198, -181, 49, 66, -16, -147, -66, 115, -70, 28, -47, 41, -30, 141, 87, -73, -1, 254, -22, -201, -196, 137, 47, -179, -122, 120, 130, 61, 95, 2, 195, -116, 181, 95, -68, -32, -17, 5, -114, 36, -67, -28, 41, -217, 90, -109, 98, -61, 248, 121, -188, 33, 65, -49, 14, 139, 124, 162, -8, 99, -1, 98, -24, 32, -11, -97, 45, -60, -73, -19, -42, 107, 1, -5, -22, 179, 46, 99, -50, -218, -51, -172, 105, -61, -187, -134, 55, 157, -70, 64, 137, -95, -89, -88, -89, -182, -209, 78]
4710G8l4j2J25j07J66p8m7k40K16R7j63J71j76LQ2j58J0R1K8k36J13j12K57k74
4734b00J63LJ8k5L1k92J09J91J02j72K0k3j51M10L0k57j7P4R0m7P5j06Jq9K52
4759A90j29k31J25N3N7j65j6J21J03j24pQ3J19k48J27j81l0jJ03Mk48J86R7K62
4783B50j32k20m4J27K24l74K02J59j07r9m4O5K9J4K03k86K3J99l92M47l64J36
4805A6r6J5K6J41L8q4j3j47J86K55m52O4m6J48J93k07j68lJ85j13J2K21j37J04
4829A38p0K00k12K1q4K6J23m9P1l26J90P6j81M15m51p6J61K99j39r1j73R0J81
4852A39m07K61op2K04k20n3O6J43j11L8J37r6O2L5k51J98m1o7k9K14j12l6R1m3
4877D4j52J07J05j9j47j33R8NJ51k53J42L5j1l24L55r7j00L66j77L3j72J68k1
$$ y = [78, 44, 32, 157, 50, 216, 138, 91, -149, 67, 164, 1, 172, -4, -1, 81, -77, -67, 24, 52, -184, -71, -183, 74, -200, -37, -34, -16, -41, -10, -302, -193, -2, 100, -72, -52, -75, -226, 184, 214, -43, -60, 14, 104, 57, 132, 26, 27, -62, 190, 61, -170, -45, 8, 65, -100, -116, 5, 108, -16, -23, 60, 179, -69, 58, -123, -153, -154, -51, -47, -295, -109, -12, 250, 118, -102, -146, -19, 205, -169, 33, 192, 85, -14, -58, 7, 36, 50, 253, -33, -10, 189, -203, 244, -120, 16, -80, -65, -39, 102, 140, 56, 43, -104, 82, 337, -115, -51, -97, 51, 244, 37, -131, -134, 51, -62, -50, 171, 34, 138, 68, 268, 56, 77, -7, 19, 142, 93, 164, -162, 28, 104, -77, 338, -113, -189, -28, 271, 132, 41, -132, -42, 139, -268, -7, -13, -85, 119, -101, -154, -88, 55, -56, -18, 119, 23, 85, 120, -131, 67, 26, -41, -70, 144, 32, -4, 87, 44, -108, -1, 104, 85, -62, -195, -97, -92, 59, -194, -52, -17, -28, -352, 3, -94, -194, 172, -5, 28, -144, 24, 3]
4900CJ13L7k16R2q4p3m7j2J54J33k59J99k87L84j87J40k59K2K05J69l12j02J39
4923d8j83M92m77L08j67M7J01k28K49j35j04K71k84r1K20J69k91J88J20l67L71
4944A61%j94J55k73k3k6K92k04N4K35j17R6k69J47K5j53MQ4q5j5J14r8j65J36
4968a19K55kk16jj27K37N3k96J72K91k63R2p0J3k00N4K62N0j01n1j17K16N4k76
4992i0j42L49j08K09j40L8j70J64k59K35o5j88J97j48K02j01J93j02J72k73j49
5013a76K76J02j36j10J90Q5k83l4P1j38k8K81p6K93k64J91k59O5j34J89j25K96
5035B76j54j72J10p8L5K96l67J4L22k37j14J37l1L0k2j45J11M0O2J29l24J28j5
5058C1pk4l7j55J61J76l33J22K10n4j25J94l20L50j19J20m7l44J94j7l25M57m9
$$ y = [3, 116, 153, -63, 29, -55, -128, -175, -187, -33, 100, -159, 40, -247, 137, -50, 90, -169, -147, 58, 227, -85, -187, -48, -231, 261, -216, 92, -75, -28, 73, -155, 94, -41, -145, 126, -158, -249, -29, 140, -151, 37, 157, -210, 161, 161, -33, 122, -151, -174, -200, 92, -112, -58, 177, 60, 156, -113, 34, 59, -94, -90, -6, -91, -106, 8, -90, -255, -119, 136, 134, -82, -83, -210, 27, 80, -216, -44, 247, -16, 76, 6, 19, -181, -127, 135, 185, 84, 33, -84, 132, 186, -90, -232, 117, 9, 218, 78, 116, -54, 110, -149, 86, 21, -167, 30, -118, 84, -17, 176, 74, 246, -27, -176, 100, 202, 66, -44, 146, 231, -52, -86, -15, -153, -181, 100, 24, 317, 53, 244, -15, 50, -84, 105, -20, 276, 122, -50, 60, -18, 17, 313, -54, -40, 282, 45, -69, 68, 37, 67, 45, -100, 11, 51, 113, 242, -82, 46, 31, 24, 0, -37, -192, -31, 145, -188, -66, 144, 90, -35, 159, -161, 189, 70, 190, 143, -201, -7, -24, -349, 108, 59]
5081E9j16J31j59J77j20O3p4j15J88p3J27k41R8K34j29r9K4N4j52K81J08k83j23
5104a40K5N6m1Q2LN7m4rK88l02N7j16l6M4K29p7m8R9j13n5J38j06k35J49K10l13
5130a98J5K58m3J19o1k17j0J61J56j25k7O8o9P1k03J35J09j26K6J4K7O1k96JK26
5155G2j23l0R8J13k42J45j38J49P6j42J21J96n17J09J24R8j30j00m4K67l2j26
5177e6Q5K2j83o7K82k05o5J06K19J13m00K29j18k7J27J1no7N9j23J67j70R7K5
5201E6j32J63j15j27K49j3j15K85m51K05K2J46jj81J06j64N2J04J25o1k44L06
5223B15l95J61K9j83J39M3n0p8K53j46P9j07q1J56K0l0O0j21J44n7L7J4k03k8
5247a29j44L86m5Oj70j10J13j4L3J17l6j2j7M5L7l4o4O4j95M77j17j29J21j04
$$ y = [59, -57, 74, -85, 92, -28, 35, -39, -154, 34, -39, 88, -153, -55, 179, 50, -49, -25, 29, -123, 158, 266, -17, -140, -115, -59, -100, -18, -15, 42, -2, -11, 277, -25, 32, -84, -120, -76, 153, 76, 28, 127, 14, -41, 97, -9, -244, -95, 115, -198, -183, 75, 32, 151, 90, -127, -137, 24, 180, 55, 28, 96, 27, 98, -105, 30, 139, 13, 39, 53, 80, 141, -155, -154, 72, -51, -81, 17, 130, -112, 33, -105, 44, 120, -22, 99, 295, -222, -113, 11, 109, -21, -121, -165, 102, 70, -56, 29, 51, -132, -199, 83, -122, -187, -81, 138, 251, -149, 80, -38, -65, 62, 73, 68, 1, 60, -63, 104, -66, 31, 56, -76, 87, -28, -155, 94, 81, -34, 251, -200, 5, 27, 173, 172, -9, 97, -67, -15, 89, 214, 153, -91, 215, -180, -19, 10, -173, -34, 9, -41, -119, 134, -12, 67, -40, -121, 35, 55, 25, 85, -36, 108, 51, 88, 102, -101, -129, -273, 113, 68, 74, -96, -206, -93, -107, -74, 43, 7, -5, -22, 23, 60, 26, -38, 26, -169, 308, 191, 62, 183, 79]
5271G9l3j41J68j87J6J72L4j25j22K52p3k47J02J24K10j82j05J38k11L69k64J08
5293H2l18K62j53Q7m2N6R4j49J41j24R6J3q5J46l1j97K48k49K34J1j51j52J15
5316f6K36k11J5J84l25L80J28l97J58m1j23M9L7J31j74j84K25j9o4J55r4k3Mk50
5340b69K69J3J8J29k80M3l8L12n7k03J07k46R7J69q9O7j39K73n7j09L5m7M3k44
5364b03J26p8M91k07l23J27K04m76K67j60K37j1j55K32k15P0l3K07l0p3j35J07
5386c1l11L34M6R0J29m66k7L30j09j00N0K10k37j65K68j11K14N8k02R4J1R1j47
5409A9k57J15J75l25K30J14j67m9K38j00k0rK3o0k34K74m7K05j01m5j86L98o9
5432A22k19j09K76N2l06K05L3j79J39j20n0M7K5mL8O9J2m5q7J63N4j85q0J03J77
$$ y = [79, 46, -95, 73, -114, -98, 74, 108, -17, -139, 113, 40, -207, -105, 19, 229, 47, -58, 80, -131, 238, -26, 82, -236, 26, -127, -40, -82, -26, 68, -81, 60, -64, 32, 45, -40, 106, 75, -122, 126, -123, 111, 122, -29, -181, -66, 170, -41, -26, 158, -167, 213, 341, -56, 102, 61, -62, -13, 24, 155, -19, -203, 22, 3, -61, 94, 0, -23, -19, -269, 0, 13, 31, 160, -120, -77, -115, 197, 140, -63, 44, -202, -105, 64, -25, 42, -97, 176, 119, 10, 45, -2, 41, -203, -77, -155, 336, 129, -194, -67, 137, -339, -72, -232, 5, -6, -161, 71, -144, -74, -107, 100, 70, -3, -138, -31, -342, -8, 38, 128, 257, -209, -236, 94, -15, -115, -65, 145, -92, -257, 11, -100, 114, 172, -30, 64, 75, 166, 19, -238, -123, 52, -273, -43, 71, -96, -145, 93, -7, -27, -36, -13, -73, -307, -33, -80, 125, 24, -21, -207, 191, 122, -97, -206, 70, 122, -184, 21, 54, -125, 14, -106, -156, -109, -84, -88, -50, 19, 31, -14, -101, 62, 116, -69, -149, -46, 131]
5457A31r8j18j18L3PJ90r0J40J12K5j75m4J0J28r8O6l5J14p8j42J19j45Q1q8J16
5482D3k12J49J54k2m4j07J2N7p8Q9Q2j85j18J98j32q0M7K02o5r4J68l6J06o7M7
5507A14j00p7KR3J29n9j16o7l0J22m2Q2J42j85K50j34j25j08j63K45J82l74J95
5530b4K22j62O8J60k95n3J77m8J84j03j2j59j95K66K4o6r9P6k5j9L23j62j24K19
5554A73k44k7Q5p5K47m11l1L88j28M0j04j2lJ83j61j71K24K61l8k67j15J10j61
5577b37K95p5K05j22Ol41M25k0j49p9J18k2K77k54l71M93j45k4N2o6j5J0k1m8
5601a08J41K8k75J19J01Q6j98m9K07j98J98k7r1j22O1K02mQk60K83l73K47Mj43
5625a63K97j25l2m0K7J61j55K9jj0l62N93j83j2L7J4j35o0K70Kj98M2M4J94l17
$$ y = [131, 33, -85, -203, -170, -163, 27, -63, 77, 189, 214, 39, -5, 5, 133, 35, 101, 66, 180, 102, -40, 79, -66, 15, -73, 43, -169, -20, 134, 112, 68, -39, -27, 30, -48, 41, 123, -62, -180, 18, -114, -194, -147, 55, -10, -104, 64, 28, 134, 67, 114, 14, -63, -61, 32, 161, 102, -14, -81, -111, 11, -31, 51, 193, 8, 258, 124, -1, -109, -272, -27, 155, -219, -24, 198, 36, 104, 264, -31, -84, 93, 45, 229, 126, 114, -45, -240, 26, 50, -16, -115, -39, -64, -83, 240, 78, -46, 173, -71, -98, -13, -88, 159, -252, -283, 105, -23, 17, -87, -99, -102, 81, -80, -251, -27, 234, 196, -71, -186, -76, -237, 58, -17, 188, 66, 72, -269, 156, 136, -13, -92, 26, 4, 281, 27, -344, 149, 4, -20, 32, -34, -49, -39, -60, -108, 33, 61, -214, -95, 6, 92, -106, -155, 52, -146, 52, 25, -66, -188, -127, 75, 71, 79, -181, 102, -271, -24, -20, -163, 134, 9, -23, -63, -36, 125, -30, -1, -2, -12, -374, 219, 36, 24, 61, 75, -60, -120, 150, 152, -46, -4, 40, 234, -83]
5650h3J37Q4l73K72L2j75M7K8o1J66J9K0o4K08k98j5j79K02O7k7O1l14K34q8l9
5675a39J59j3j10K79j58kQ1j80J0L9l8K75k24k6J19j76M46k07o6o7q7J73j73O1
5699b4j77J14J9K1k40L85j81J13R0k09L0J67J22k17Nk8M5kp5q2J94q9K24j47l41
5724b83M35P8l36J68l08J26Q7J06k10J15j5J12J93l90J91P3l1j14j01J46J28m5
5746A25j33q7k4P9RK5j0J41j67L2J93j67o5Q7L5q9L2J21j44j02L4J31o6L7p9o9
5772a21kk5J24N0p3O5Q9k00k5P6k0LJ13L5j79J29j44K04j57O7J49j32J84j66m7
5797cm7L87l65K35n2k16J35J15j93L7N5k4k32K2J2K19j16j38M1jJ70j25J72j47
5821e9K1j12J42J20j0k40Q3k3J49j49Q9J66l46P1J29J28j45o5J38P6l10n1N21
$$ y = [-83, 54, 138, -235, 37, 69, -106, -59, -31, -92, 74, 93, 113, 49, 257, -41, -56, -235, -33, 34, 7, 68, -246, -12, -100, -139, 20, 7, -103, 176, 18, 16, 97, -83, -73, -34, -72, 203, -21, -47, 72, -104, 342, 135, 69, 2, -85, 88, -85, -24, -201, -87, -68, -47, -287, 98, -83, 30, 120, -89, -59, 108, 230, 13, 18, -10, 35, 33, -42, -124, 70, -19, 205, 58, -283, 152, 230, -106, 62, -246, -120, -33, 73, -137, -22, -37, 75, 268, -122, 69, 142, 111, -3, -104, 42, 170, 125, -8, -95, -119, -40, -31, -6, -16, 125, -42, -10, 183, 16, -49, 38, 73, -16, 16, 137, -7, -109, -75, 56, -10, 27, -52, -121, -123, -148, -24, 26, -47, 18, 107, -93, -118, -42, -62, -59, 54, 89, -90, 39, -105, 99, -58, 9, 158, 26, 210, 44, -3, -50, 337, -28, 207, 155, -61, 74, 189, -4, 33, 88, 64, -168, -146, -134, 85, -31, -169, -128, -129, 41, -84, 88, -59, -38, -150, -8, 112, 102, -138, -55, -78, 71, -78, 11, 177, -169, -98, 31, 159, 14, -51, 87, 163, -147, -198, 323]
5844C23k81q3l14M04l3r8KJ77j82J31o0J57j95Q1k2j45K3K26o0j44k0R6O6j76
5868a27J95j05J20p6m4R4j28J62k96J97J03N9k46L19N0j87k2J87l91K04K22n08
5890b18L00k46K09j04N7m6j51J28l7r6J80R2R4o9nl2j57K09p5Qj6j05R6j09J30
5915C7op9m5J51Q3n0j13pQ2q8R5j3Q0k61KN9O8J26j94j2J39k01L26j16o1j64j8
5942a80K89J4k01R3n3M1J01n9M0j24j08K18n2r4O1q4K21j71l3R1m8m6k2J05n4
5967e5k25L25J58j45J3n7oJ0K63l80J6J06O1q8j95J82p6J08R7N1j40J50o5k03
5991i5K36k01K59k10J15r7M8J7k4K5j55J43j38j7K56k63J40k5k0O9k6P3j19oK53
6016B38l27J98J56k63J34j44J11k80Q8J72q3N2P9M6l8l6k82J32J51o9m1M3O2m7
$$ y = [323, 42, -41, -355, 49, 16, -82, -80, 97, -85, 46, -14, 143, -52, 29, 7, -138, -115, 111, 51, -93, -113, -17, 49, -127, 68, -37, 83, 7, -37, 57, -71, 91, -205, -8, 95, 154, -92, 227, 277, 90, 68, 255, -136, 68, 290, -218, 82, -164, 45, -59, -2, -48, -199, -71, -108, -204, -24, 68, 162, 93, 88, 56, -101, 108, 33, 41, 25, -80, 16, -93, 37, 31, -48, -93, 58, 141, 91, -22, -29, 53, -35, 60, 47, 127, -134, -132, -73, -5, 121, -73, -85, 54, -147, 179, 63, 2, -162, -180, 109, 123, -78, 15, -38, 3, 104, 45, 85, -39, -147, 71, 19, -75, -14, -98, 123, -48, -81, 10, -38, -84, -106, -1, -55, -280, 45, 203, 58, 71, 14, 8, 18, 281, -99, -83, 23, 84, -4, -199, -17, -93, 15, 112, 163, 23, 173, 108, -95, 141, -60, 199, -11, 104, 7, 55, 72, 48, 73, -82, 61, -77, -94, 162, -101, 39, 14, -6, 63, 37, 110, -9, -15, 238, -89, 109, 265, 2, 136, -8, 103, -177, -89, 83, 0, 52, 131, 177, 139, 103, -179, -47, 104, 35, -6, 37, 99, 52]
6040E2k14K39O6l32L7J07L9N0J3R8k74Q9K19j46k69M58j86k83J49k7q4K40L0k72
6064b01K92j04J1Q5k32L2J50O6k22J63J48k61M3N4j58M4Q2m5k1L19k15p2l5K57
6088A80jj83k5L7%R5j29P0O1k3r8K5L2l8J35p1j41J6j0Q9J68m0j12o5K7l2k3k3
6116g9j8j0J98Q1j69J9J3Q1l4J20k07Jl8J59j25J3N2k37J76j91N2J94k1k6k46
6141b42J06J41j53J55J21q8J60k07l1K58m35J91K12k45J86k43J25j53N1J38p6
6162b9J07J04l07mJ11j67Q1J59j12Mm1N1O2o7M2O3J25k13R7np0Q3J2p1Lj30Q1
6189c1J06k33Q2J52l0k7k28M19l20MK70j48J3OP2j96J82J17j34J43j52j70J77
6212G4k6k31Q9N4jm3j4rJ50P8n9J0k05R4J01L1L3k25j07K60j24J1K03k18J03J7
$$ y = [52, -162, 77, 143, -189, -152, -45, -6, 44, 57, 155, -119, -30, 189, 43, -226, 232, 46, -237, -88, -115, -199, 41, 71, -201, 91, -13, -2, 83, -149, -117, 33, 99, -123, 40, 188, -73, -30, 24, -134, -90, -8, -53, -74, 245, 30, -42, -77, 180, 179, -4, -29, 8, 8, 103, -26, 44, 105, 82, -16, 9, 41, 3, 138, 67, -74, -58, -68, 21, 189, 149, 37, -28, -1, -33, -56, -79, -97, -107, 91, 172, 3, 22, 35, 116, 82, 202, -5, -4, -42, 117, -8, 5, 57, -180, -4, -195, -143, 51, 30, 4, -242, -136, 5, -148, 7, 128, 40, 200, -7, -38, 220, -215, -24, 188, -57, 129, -114, 11, -142, -91, 47, -29, 78, 182, -125, -129, -18, -185, -104, 55, -57, -53, -94, -43, 19, -48, -6, 57, 182, -31, 66, 61, -9, 74, 86, 15, 18, -112, -31, 75, -158, -76, 76, 46, 19, -209, 210, -110, -106, 164, 16, 29, 35, 107, -89, 93, 210, 76, 219, 67, -103, 74, 48, -183, -94, -40, -41, -84, -98, -107, 43, 121, 62, 72, -133, -39, 62, 93, 126, -99, -206, 54, -70, -59, 144, -74, 29, 46]
6238D6Kk9l01K19K55k81R0J47k81K64q8R7j70k70l9J11K54n7J17j42j66Q3J09
6261c0nl3O1M2l8p0O5l5j44K51k30M77k60J07lk48K05o5n9QJ06j52j51K75m3j
6287C0JM3l0m6J00l09J57K20l44K74K4j51rm8j3K47n5k30Q7O0Q2j10lj27J07K43
6313B00k85J99j13p3N5r5L33k80M0P5n6P3L0k9j78K08k00O3J66k39n9O2P8Q8J64
6338B27m03J65l0k1m9Q6O6K18l94m7K93j15j53R5r1K57j46J73k17Q7oN4j00K47
6362A96j97J42j37r5j35L40j19K5k6k94N93l38K62m22J02P4L41l54j17j2K28K7
6384H4j48N2L4pQ6N9k53J61m09M92j40lK6j32K28R4j41k5J27j53j87J32OJ9N1
6409E3q9j31Q9J7J65L7n9K3j11M8J49l22L4J93o2Oo6j06K91l03N7r4J51N8r0J
$$ y = [46, 48, 19, -282, -63, 192, -89, 1, 148, -133, 131, 43, 140, -30, -300, -339, -228, 26, -31, 86, -56, -222, -139, -30, -35, -68, -7, 35, -3, -73, -8, -43, -187, 64, -166, 311, 51, 158, 155, -93, 112, 47, -12, -4, 102, -50, -201, 74, 31, 30, 31, 74, 44, -2, 98, -211, -54, 166, -178, 96, 120, -31, -40, -88, -101, 146, 91, -139, -52, 8, 90, -20, -23, -150, -43, 200, -85, 114, 1, -72, -17, -112, 221, -59, -19, 56, 0, 73, 103, 74, -104, 104, -96, -33, 133, -106, -165, -103, -25, 63, 227, -176, -11, -41, -62, -111, -25, 41, 259, -135, -182, 111, -4, -157, -62, -153, 104, -42, 131, -86, 1, -5, 49, -51, 196, -1, 141, 4, -91, -226, 114, -5, 20, -6, -300, 293, -45, 217, -205, -103, -29, 312, -42, -159, -171, 57, 84, -64, -12, 22, 15, 101, 160, -93, 68, -341, 151, 11, 8, 34, -98, 130, 224, 83, 58, 185, 32, -155, -23, -17, 2, 53, -36, -167, -78, -61, 104, 141, 82, 105, -6, 42, 191, -131, -97, 96, 34, 40, -26, -132, 159, -144, -87, -181, -30, 28, -62, -61]
6435f1K26l02K03m7j04j43l0L96k67J07K53k23M1k41pK70p1k0o5J89j53k4L2j49
6459a90O0Q3M8j38J3kK30p7j78J30J04o7J14o4n2M0o0Q1k01J51M0k63L84r0j05
6484ij17J41q7J77n6n3J64k18J11q9l1J5m0J3J69j21J80j95K69l17KK16j42j14
6508a32J22j73J57Q0jj96J42J78j53R1r7k60Q7P6J35o6o5J41k64L50j13J88k24
6531CK01l99K90q8J59l81M4K06L7M2r7l1R5p6n5J51o7J3m1J9j7j09K80j09o8P0
6557G2p3o6K35l00P3p4K02P6o4N1j68J94k32K95m41K83k81Q1J32r4N3J32n8j34
6581a06j74L52O2j7j17j70K70k56L25n6k38J46L17k90K1j18L5q3O5p7J8K10J29
6604B48l55K02j88K09j12k23L14l4o1J38nk77K35j03J28k28J21J32q7j30M2K11
$$ y = [-61, 165, -137, 66, 19, -85, -228, -258, 138, -129, -22, 231, 8, 49, -192, -199, 71, 0, -20, -85, 104, -49, -73, -41, -190, -130, -47, 1, -137, -124, -126, 104, 27, -151, -21, 83, 16, 130, 66, 14, 54, -6, 75, -126, 25, 65, -198, 186, 96, -9, -126, 15, -72, 105, 49, -4, 160, -58, 53, -36, -67, -52, -92, -79, 90, -31, 149, -46, 223, -94, -92, 124, -18, -132, -10, -183, -26, 54, 53, -143, -1, 177, 24, 115, 18, -242, -155, -79, 56, -10, -75, 66, -198, 152, 39, 227, 3, 204, -195, 95, 7, 166, -215, -171, 35, 72, 114, 17, -14, 81, 5, -50, 101, 34, 47, 6, 25, 8, -101, 179, 70, 2, 72, -1, -67, 168, -132, -59, -133, 69, 145, 81, 132, -36, 158, -74, 221, -220, 63, -218, -137, -5, -99, -46, 86, 28, -106, -280, 72, 134, 117, 0, -170, 100, -156, 169, 113, -125, 21, 338, 48, 69, -49, -14, -97, -32, -109, -91, 119, 248, -107, 95, -93, 116, 4, -219, 95, 61, 0, 138, 133, -144, 91, -12, 116, -112, 9, 141, 54, -76, -34, 177]
6626A77k12j40J89L7k1j78Q2J21J15j35j38M7n4l2Q0R0J61l40L22j39j92K63k02
6649i9j17J57J58k53J38j39K61m5l18N49l21oL5K9J15Lo7n7K1N6k42J59j9J03
6673A01m2P0l18j0L26j39k5m5J53j20rj76Q2m2K04r7J52k4j25K36j26j43L19m82
6697b80O0L09j47P2K1k20J71N4j35j05K29l8k8p6L27j80L2r3j84K90j24j24M7
6720a22J10R5k13j00J17J40l5K4q5p3p6K47j21K20j57jJ02Kj35O2k86K31J3r8
6744a39K54j60p7J11J6j5P0j28J79o4L95l94N2n1q6q8J82k29J40J29j4o0q1K61
6768B03Pk10j97K08J40k2j38K8pj17K42J10l89J48Q5j48q6K66k8j53L2J1K3J24
6792A32k73R6J49l13L60k99K57M3j36Q2j82j00L23j43O9j69R0j19J11j68J40N1
$$ y = [177, -35, -175, 14, 51, 30, -148, -66, 55, 170, 35, -103, -56, -110, -142, -62, 28, 189, -151, 171, 32, -160, 103, -99, -216, -59, 99, -154, -16, -155, 106, 61, -257, 292, -29, -35, 0, 29, 144, 147, 80, 23, 44, 100, -142, 17, -2, 101, 59, 129, -189, -199, 127, -12, -37, -82, 71, -49, -58, -234, -152, -194, 10, -87, 65, 41, -84, 152, 26, -117, 202, -280, -220, 89, -58, 14, 35, -185, -14, 40, -95, -200, 29, -9, -37, -113, 214, 34, 66, -27, -211, 79, -45, -169, -122, -12, 83, -130, -230, -113, 27, -8, 16, -69, -142, -218, 29, -92, 128, -29, -30, 72, 74, -61, 1, -285, -54, -41, -139, 115, -45, -122, -11, 5, -10, 60, -68, 111, 47, 442, 48, 100, 49, -37, -125, 57, -172, -32, 97, 83, 23, -58, 203, 210, 0, -197, 11, 151, 129, -9, 19, 12, -105, 137, 247, -142, 6, 91, -57, -143, 123, 95, -58, -26, -15, 8, 132, -141, -45, 104, -209, 151, -148, 109, 152, 16, 98, -84, -184, 139, -4, 65, -104, -14, -133, -22, -190, -50, 1]
6814Aj50K12j50n1L7PK17K1k91J98k10J96j60j49L79k28k5Q9P0j15J95j31P8J17
6838A57k95O3K54j30j16J20j59O2l9J05O2Qo2j04N0R7l0j8j45q9K11j51J72j02
6862g9P0J13j81M4J71l00M0O9N7k48J85J1Q6M6k16J82N8k33L17l46J24n9oP2J2
6887a1J36j8k28j95L39m7J03m7j41L53k26K8n6oj65K60k17M3RL00p6j33j05j31
6911b31L35k18j00L73k37n5J7K6k4J95P9k65J63J40k48J12k26N40o13P3L22k29
6933g1j34J66J66j36N5j20Q0K2n2o6J99m71L27k0M1N1j04q4N1M6M7p1J36j58n
6958a05J38j14J2K01m4j34L0R6J21l23J92K5k37K32j29k45r2L06J52n4qOl8o1
6982g3K74k18o1J8k14K53p8M3L5j49L1J45N5j11PJ3o2k4K7pJ68m17K43K13l0q8
$$ y = [1, -149, 63, -87, -138, -101, -94, 123, 144, -147, 51, -159, 37, -123, -272, 107, -121, -146, -57, 13, -102, 93, -38, 40, 157, -138, -75, 179, 49, -67, 53, -106, -44, -83, 22, 84, 92, 30, -74, -24, 73, 43, 25, -120, -209, 2, -149, 23, -79, -9, 104, -77, -33, 138, -162, -122, -53, 4, -244, -59, -48, 38, 84, -132, 50, 108, -125, 192, -154, -30, -89, -95, -23, -11, 125, 107, -121, -316, 23, -24, 79, 32, -109, 244, 18, 46, -10, -16, -181, 79, -138, -95, -86, 214, 138, 5, -100, -231, 104, -114, -214, 159, -78, -133, -116, -90, -114, 81, 160, -105, 58, 198, -50, 62, -164, 376, -237, -164, 158, -71, -205, -39, 127, -9, 46, -74, 6, 28, -24, -90, 109, -362, -35, -55, -14, 37, -67, -151, -100, -54, -7, -78, 58, -100, -105, 33, -81, -69, 132, 88, -46, -16, 80, 201, -122, 70, 95, -142, 90, -39, -284, -376, -70, 82, 28, 20, 26, -12, -73, 201, -17, -78, -60, -274, -21, -99, -56, -21, -170, -139, 6, 61, -50, -43, -30, -92, -116, -89, -96, 72, -345, -102, 111, 81, -7]
7008gR0j72J99nn00K30J31J38k38L40j63o0j69J75NP3Q6l19p8M40j39j70K38l16
7032a91K26j44N9J74j3k14K14j5j30m1J77k14L1K71k14J04J43j34J44p6j03l5
7054A9r3N7O1k40K90k27J78j41J88pOQ1j03j50O1LK92j35r9q0R8p4j86J98j13
7079a16L8Q8J93k37m9j87J31K38j60K31J3l10J10P1q1n0M16l15P3q6Q3o8j75j22
7103b71K94M8n5j18J06J49l65L55J8k99K57l51K33J64k16n1J70j89K69k45J57
7124F0O3l08L17qj98k13J25J04m9J70l1Jk53j41N65mj53o3J5RP6k58J68k1k0k1
7150f8J8J42N9j49m3p1M58l90J15K22q2j21j88J62k09j61M15N8k33J53N6j50N1
7173D4j60L8J09n2m2J07q2K03p7j36J87q1k64L70k55nM5q8n9Q6k24M47N7l41L50
$$ y = [-7, 83, -89, 110, 105, -395, -165, -34, 104, -134, 206, 43, -17, -186, -11, -6, 67, 153, -166, -244, 196, 57, -113, 125, -191, 35, -109, -50, 124, 111, -103, 111, 96, -34, -75, 102, -112, -81, 190, -24, 80, 223, 89, 233, 157, 54, 19, -74, -17, 44, -196, 94, -133, 45, -96, 92, 85, 91, 172, 69, -81, -20, -17, 275, 140, 41, -39, 59, -15, -201, -3, -116, -78, 10, 203, -34, -83, -270, -139, 99, -61, 170, 183, -127, -17, 54, -27, -77, 339, 24, 97, 11, 94, 26, -149, -271, 23, 71, 16, -102, 4, 153, -212, 143, 161, -138, 119, -232, 1, 165, -51, -102, 68, -121, 148, -97, 60, 123, -185, 132, 124, -74, -287, -162, -58, -107, 63, 32, 33, -220, -361, 204, 200, 47, -16, -1, 8, 84, -174, -6, -27, -47, -68, -50, 92, 151, 2, -41, -112, 346, -44, 71, 293, 211, 90, -98, 64, -145, -306, 109, 167, -66, 87, 143, -7, 44, -116, -78, 31, -21, -63, 44, -38, 165, 88, -48, 139, 58, -206, 164, -91, -96, -51, -139, -198, -112, -336, 111, 168, -173, 177]
7198A77l34J37P4o1jJ48j2k03j2P6J4J29J01l63J60J1p1o4P3m0k5J37j42l6L4
7223i3j44J2N39l09p7J24j24J55j48n0K19k31L0J5P5J07k35K44J29r2Qk33P2Q5
7247G8k26J77K37j45j63P0j3j05j21q9K16r6K11j37J3J12k4J23m5j54J38p9j07
7270a29K28k12K17qN3j05K9j58j1q6J26J33mj18O1O1p0K7nJ29k36N6M6K6j19J95
7296A26k03j08K99l47J03l1R4k18l0K60qN5k79K26j9M4L0RJ02ok19K04j39Kl1
7321h4J07m7J40J27k50L3O8j4j39q9O8J25r4j3J54j26L4J6k3o2j67J39Q5N3j9
7346B2k07K20n5J06O0j95k84M65j11Q8l72L45jJ50k23k3k4j36R2M4K81r8j87O1
7370A8kO0j8K2J5j32m4J33j23Q3M1K0oJk64J47J86j67n7J12J28M1qj32j66K88
$$ y = [177, -157, -20, 54, -7, -8, 140, 128, -75, -87, -11, 3, 132, 233, -130, 30, 41, -30, -94, -21, -61, -86, 51, -91, -127, -93, -237, -225, 314, 5, -72, 52, -72, 83, -65, -115, 104, -127, -97, -82, -7, 100, -135, 109, 238, 146, 154, -79, -7, 78, -148, 29, 266, 121, -42, 28, 15, -90, -211, -300, -84, -180, 31, -106, -93, 19, -5, 118, 73, -81, 57, -22, -129, 99, -113, 104, 96, 149, 44, 73, -85, -96, -182, -56, 77, 73, -45, 16, 77, 7, 34, 29, 158, -78, -22, 24, 50, -69, 126, -77, -185, 114, -233, -130, -161, -67, -285, -315, -55, -63, -8, -287, -61, -80, -36, -6, 3, 105, 99, -120, 84, -55, -53, -84, 23, -24, 116, 243, -7, 26, 94, 80, -59, -148, -80, 45, -49, -62, 92, -34, 0, 16, -7, -69, -236, -97, -12, 41, 22, -185, 35, -20, 86, 146, -49, -333, 132, 21, 109, -263, 82, 81, 231, 8, -15, -39, -175, -83, -39, 242, 144, -43, 18, 16, 76, 58, 80, 95, -37, -81, 52, -71, 12, 53, 73, 67, 68, -196, -49, 137, -30, -87, 25, 153, 194, 186, 54, -112, 176]
7396A76j45L4l1K42k70J05j79j3J37Q5j17j19Q2j20J57j16N4K2J53M4j55R1l0
7419H7j83K66k68Q5OQo4R0j15J32j5j21L05l41K51M8k72l8J22pK99l58K21j94
7443e6n7M7J59Pl34q1L22J16p8J86l53K29k9q8o4J97r3J1k06K40j90m3L19K7r1
7468I7ok88L49qj74p0M7j1J09k05J5J31J51j77o0Q6J20j04Q3K7j51J27l2l2k26
7493b02J91R1m3jpM9k19M45l73r8J72M5J36l29J63jj05k01K74j05MJ60j04R7j55
7518a16L15k19P6k75K20J78k83O4K88j53j45J29m6k5j67p4M69r5q2K4j59K05J35
7541B64m22K44k22o4J53M9J58J3j23j89j06P5L37k43J26j1j26M7n4L09k20M0n6
7564b1J03J8o1J45l70J07Q3p5J07K11j21j03m2L2l4j11P5J08k19J82m3R6N8N9
$$ y = [176, 31, 65, 34, 276, 6, 111, -68, -81, 56, 141, 24, -95, -13, -133, 24, -92, -38, -16, 137, 181, 26, 117, 87, -96, 170, -98, -13, -7, 1, -63, 27, -88, 44, 29, -92, 213, -128, 123, 171, -101, -139, -17, -24, 275, -83, 138, -56, -113, -66, 93, 100, -234, -315, 7, 123, 45, 231, -122, 107, 78, -10, -74, 123, 30, 41, -165, 75, -115, -158, 161, 188, 97, 91, -197, 152, 144, -30, -100, -53, -64, 45, -160, -145, -14, 137, -40, -100, -14, 106, 2, 85, 112, -39, 88, 56, 24, -202, -11, 80, 37, 36, 29, 78, -141, 304, -69, -167, 5, 50, 186, -143, 20, 19, -86, -287, -13, -118, -114, 46, -58, 39, -116, 199, -20, 56, -219, 1, 179, -104, -40, 248, 95, -50, 79, 33, 8, -159, -233, 236, 141, 59, 83, -76, 129, 264, -158, 86, -136, -200, -47, 2, 160, 173, 50, -139, -245, -170, 167, -76, 50, 39, -87, -40, -94, 215, -5, 35, -21, 82, 100, 39, 184, -186, -79, 4, -71, 36, 247, 126, 23, -19, 13, -21, -132, -57, 51, -168, 14, -29, 67, 125, 184]
7588A84j49J09l17J98p1K6Nr4KJ79j45n4K64j58j9K96j91j67Q9n8Q9k49L03r3
7612b1K0j39J69k1m5j9L8Q0Pj6j85J87J97j85j19K8k9K31k86LJ43o5j7J77lk73
7638a43J24N3N5r0k3L93k67P6k18j18J75j20Q2j26J08l3k1l4J85r5J91k83L86
7661B57l61J88j29Q1O7n9k24K80K2k0q9M4R1q5k10K47j92j09J74j13K26j60N6
7684a8m3O3l96K58K48n2j09J59j98J55J48j26j39M1M8j46J69P3o9k0l9N1o8K09
7708A99o4L3j26M3j58K42j23L7j08j4j9p3jJ29j63P0M3jO2m5M7MR9k43J98j99
7734a31L36j24r0J21j65P2j04m2J37j18O0jN5M0O0j07q1O2R8j03j66L53k77R2
7758b3O7j63Q5j13K06Nr9r5J82J53l95N0K57k45K23m3j72P5j9K60Rj78K1%K8k7
$$ y = [184, 35, 144, -173, 25, -46, -20, -15, -109, -107, 72, -73, -127, 137, -21, -40, 256, 65, -102, -13, -71, 18, -231, 72, -21, -1, -140, 29, 8, -37, -56, -18, 62, 69, 53, -132, 55, 252, 67, -52, -24, -53, 178, -108, -105, 38, -27, -44, 133, 130, -143, -19, 34, 89, -1, -24, 369, 102, 178, -40, -158, 17, -103, -21, -147, -39, -72, -93, -127, 58, -37, 154, -129, 257, -104, 84, -45, 36, 103, 44, -180, 100, 122, 102, 13, 57, 148, 63, -147, 100, -92, -201, -27, -140, 86, -74, -18, -61, 2, -394, -136, 112, 60, -49, 110, -88, 67, 215, 89, -50, -9, 39, -107, 62, 135, 66, 46, 7, 58, -10, 199, 135, 168, 42, 85, -73, 169, 46, 83, -25, -39, -58, -131, -132, -3, -166, -96, -53, -54, 8, -37, 10, 14, 113, -130, 68, -131, 205, 81, -9, 112, -53, 19, -85, -127, 10, -108, -48, -49, 6, 46, 106, -1, -82, -20, 78, -25, -191, 162, -115, -23, 44, -119, -34, -147, 59, 64, -35, -130, 52, 205, -190, -140, 117, -128, 95, 52, -120, -45, -64, 196, 205, 27, 48, 48, 76, 49]
7784D9j70J07L8Lk06K58q4n7j62M11j99N6M7j38m7q5J49j02K34k43Jl2L07k54
7808a19p5L25j30j05k3J43j17P8N6N8o1j13L3j67J48q3p5L27p5K3J1k40K19q4
7832d6J10n3J02j2j32r6J7K42p9p1l8K57l60J67j40K23p0J00k20j20K79j30K41
7855A71j23J02k18R4j11M9J16q0%j14L18l58J56R2r5l3J19j25j3N0J18r9J05j51
7879c0J28j80J13O0ol7j07J06J9o8j36L99m28J8K5J6J89j68j63M22k18K12j94
7902b8j5L4o7J76O7j74J02m5p5K06r2j98J12k34J96J38p9j16Q6J23j23J89k97
7925a14N5j51J78j08K68r0q4j75J01K18o7j10r2K47k21O1K3J18j71K41j33po3
7948g6R6K02k00P4K0m4J77l42J07K14j91p5j1K03k31J12j72K62l9j23J67q7j9
$$ y = [49, -121, -14, 24, 27, -179, 79, -5, -62, -224, 187, -12, 44, 91, -47, -94, -179, -30, -132, 102, -141, -140, -172, 135, -119, -194, 131, 1, -104, -127, 16, -101, -23, 33, 91, 30, -83, -50, -217, -69, -152, -227, 100, 25, 48, 59, -181, 38, -46, 64, 11, 113, 101, -31, -127, -110, 132, 53, -18, -56, 201, -159, 8, -132, 91, 21, 121, -99, -219, 60, -70, 171, 48, 150, -68, 26, -85, -36, 80, 0, 0, -114, 204, -154, 2, 94, -1, -34, 85, -40, -53, -3, 115, 16, 121, -30, 98, -82, 31, 91, 85, 48, -59, 47, 66, -2, -138, 261, -167, -149, -124, -108, 81, -87, -250, 172, -46, 166, -28, -43, -9, -76, 100, 167, -7, 95, 50, -25, 181, 89, -109, 3, -231, -35, 103, 24, -92, -6, 117, -6, 183, -114, -59, -210, -32, -140, 128, 38, -46, -221, -120, 98, 31, -79, -171, 76, -145, -84, -61, 57, -114, 127, -6, -13, -76, 20, 222, 22, 96, 116, 72, 249, -93, 14, 228, 37, -38, -49, 154, -77, 35, -137, 125, 86, -37, 130, 43, 24]
7971B4j03J10Nl2r2J02K04k86k01J91J37Q2j34Ro8K25J2j3j87j83K85J5Q1k13
7995c0k1J46J03j69o6n4l7N9k5J61q9J69o7q0L5k01o4K26k2j69nL64k85J84k37
8020a74L00j71NJ60k3j45N6j17k1K27o7l5M5P9K1k22m2J56k0j65J72o1P0j56k
8045a30K05j21P6k8Jj62J18L3O2nn1m4r2J63Jj94P8j3O4r0k2J29j42J73j22PJ73
8072F7m6j71J37m2rK11k52R8QP2O8j86oj05Q8P5P4j86K69m0l0j20k14K21R5j04
8098b8j12R5Q0J8p2M2M0K0K9j00j01P6m4J45O6M0j86J59nQ2j97j82J76P1P6l15
8124a27J90Q8n8o5M2j39R6j35K04j74p6K42k31R4N1K12j28j33m2K2j8J69j52J4
8148e4J68J34k02r7J06p6J07l9j42K51q7jk35j7k5K28o2m6J85N9k84K6J86m8k7
$$ y = [24, -79, 31, 36, 4, -88, 14, 218, -68, -269, -78, 59, 141, 7, 16, -52, 173, 185, 172, -15, -198, 87, 102, 183, -30, -51, 95, 198, 29, -37, -91, -128, -69, -94, 67, -22, 147, 80, 0, 35, -166, -230, -4, -26, -195, -200, 164, -121, 63, -174, 126, -45, -40, 120, 97, -48, 8, -109, -130, 97, 30, -5, 40, 119, 140, -82, -124, 32, 12, -153, 19, -42, 28, -128, -130, 75, -46, 30, 2, 3, -159, -41, -8, 54, 49, -2, -46, -138, 25, 26, -168, -90, -103, -39, -129, -151, -22, -164, 9, -113, -106, 67, 21, -150, -13, -55, -64, 147, -105, -7, 1, 73, 141, -45, -51, -156, -68, 7, 81, -105, 164, 124, 94, -26, -240, -19, 76, -28, -140, -45, 35, 53, -19, 23, 63, 83, 112, 12, -89, -13, -57, 88, 154, 194, 8, 167, 162, 244, 47, -135, 41, 112, 188, -127, 63, 151, 93, 28, 70, -69, 27, -108, 96, -78, -154, 88, -143, -49, 2, 214, 86, -47, -89, -67, -85, 84, -68, -54, 114, 248, 46, -51, 55, -21, 86, 47, -95, 156, 69, 68, -167, -184, -209, 19, -43, -89, 96, 155, -129, -103, 83, 35, 8]
8173Hk2k54M02j04k02J82P1j96J65kK42l07LJ05M9p0n2J15
$$ y = [8, -14, -268, 134, 30, -172, 10, 81, -115, 50, 48, 290, -17, -14, 91, 140, 70, 18, 133]
8191A33
$$ Imaginary data points
##PAGE= N=2
##DATA TABLE= (X++(I..I)), XYDATA
0@%%%%%%%%%%Qj6J6j6K4l2L2m0M9n7P2q8J05j29J52j76K08k41K81l23L66m20M82
33B57n47O19o99P85q82R91j105J231j372J522j687J870k070K287k523K781l064
50a606L375l717M096m515M979n501O091o761P532q427R479j0742J2293j4246J6792
65I122k0270K5335l3518M9636j37513K58342j40687k11383M55038l53732o3060
76a62690M23808l48804m6688L94895l85481N5759L06106l99174J34149K76107
86B47987m46994J85847K33705m09877K11841J46703l94132K96333Q9436l97038
96b36189L03360N6695l39752L18570k3185k90188L38515q2749k48946L53441j23051
107B6521k02942L22549j70367j14948L27107k43754q4098L31498k50300m3819
$$ y = [0, 0, 0, 0, 0, 0, 0, 0, 0, 0, 0, 8, -8, 8, -8, 16, -16, 16, -24, 25, -32, 40, -48, 57, -72, 80, -96, 112, -129, 152, -171, 195, -225, 257, -290, 329, -370, 415, -467, 524, -581, 650, -722, 800, -887, 983, -1087, 1200, -1323, 1458, -1606, 1769, -1948, 2148, -2367, 2612, -2889, 3202, -3559, 3973, -4454, 5025, -5717, 6576, -7670, 9122, -11148, 14187, -19331, 30305, -107208, 151134, 10447, -200936, 254102, -99630, -162690, 261118, -87686, -134374, 260521, -124960, -69201, 236905, -162269, -28120, 247987, -199007, -13160, 220545, -189332, 22509, 169212, -224920, 71413, 160849, -236189, 67171, 123866, -215886, 102684, 79499, -210689, 127826, 45077, -203869, 149572, 26521, -176421, 146128, -24239, -139187, 187920, -55834, -139932, 191566, -58734, -102553]
117a02553K86455k70058J8394K51561k94105O8220K24535l07886R4183J91893
127A60639k81656J25414J16010k73449J92255Q4363k84530J94093N3149k31138
137a44850K15427j8261k09594K50687n4353j93704K59614p6462j61007K41722
147A09219j14312j06556K50951j57994r4860K45901j52415n6232J99100j78428
157e5626L634J86551k06996K8336J69705k04545N3573J29547j97261R9247Q7805
168I3970k15024J34907Q3896k09052J29604M5288j74193J63258K408j77206J79184
179E7040q177j56951J71230l4525j20545J68349p2642q8830J81094r8300p9470
190h1727J68822j01008l7800J44139j37443k377J51316j51474N692J33073j47896
$$ y = [-102553, 183902, -86156, -67762, 183799, -110306, -42086, 182449, -125437, -31254, 160639, -121017, 4397, 120407, -153042, 39213, 123576, -160954, 33139, 86288, -144850, 70577, 52316, -157278, 93409, 39056, -154648, 104966, 28504, -132503, 109219, -5093, -111649, 139302, -18692, -113552, 132349, -20066, -76298, 122802, -55626, -51992, 134559, -72437, -44101, 125604, -78941, -25368, 104179, -93082, 6165, 93970, -121054, 13853, 97749, -111303, 18301, 63589, -110604, 52654, 55062, -122144, 57040, 48863, -108088, 63142, 28617, -91928, 76421, 3779, -85051, 96043, -2257, -81727, 87095, -13913, -51713, 92426, -45017, -47394, 103922, -47552, -41860, 91213, -56683]
201e6683L3393J06580j53685O3028Q7472j63849P8137Q1346j48873P8841M1602
212D7309j29005J14490J5594j36333J19624P043j11453J18359k5591r0142J31255
223F1150n1720p8181J39453o4128p0047J27899p0800l6652J17384j02120k0760
234d8522J26178j01638j4555J00994j00586J6243Q4302j13266L6327P5026j16905
245e6402M6718O3042j05844N8184L2380j02644Q6766K2700j10209Q4438J3562
256C2691q7015R0166j4999p9565J02688k6036p2451J01248l5832n8306R3020m7854
268b245l3829R1984p1898k5957R6641o7100j6291P2957p6188J3524P1122r1181
280c8461J9121O6610q6547K9364N1037q3036M3812L3524q4882N9907K9213q5990
$$ y = [-56683, -23290, 83290, -70395, -7367, 80105, -83744, -5607, 75739, -73134, 5707, 47309, -81696, 32794, 48388, -87945, 31679, 38722, -72731, 45628, 20037, -70105, 61150, 9430, -68751, 70702, 6574, -63473, 64426, -6374, -43026, 74358, -27762, -48522, 77656, -23982, -38537, 62457, -38129, -21886, 62416, -50850, -14523, 60503, -56402, -9684, 53358, -52486, 5698, 38078, -64566, 22200, 44900, -65309, 19129, 32691, -54324, 35842, 20843, -58722, 43966, 17930, -54521, 46727, 10895, -47411, 45609, -2245, -36074, 55910, -15988, -41945, 54696, -12404, -28695, 44262, -31926, -18402, 52720, -38461, -19340, 47270, -39277, -9913, 41124, -41912, 1900, 35424, -49458, 10449, 39662, -46328]
292d6328N6220J7458o6656O5841o669o6371P6649j0859n9772P2875k2601m5937
304c6150P2004l6468l1850P5388m9820k8800P4969m7132j5688N9737n9921L140
316b0591O3577o7094M348N4495o1615J7648M2054o4492K9688L2447o7037L9900
328C328K9121o5678L8564J6385n2506N1357n67n8548N8048N26m9891N2321j3761
341H699l7699N7140k5267l1751N9748l1809k8140N6570l2783j4903M8488m5632
353a7339l123N3907m8918l091M4542m5087J0746L6007n1627J8609L2088n1951
365b5237K4842K6995m9677K6292J4613m2553L9496M566m8829M0613M986l7861
377b1754L9251j0610l2712M7471j5738l0887M6609j9903k5325M4252k3273j5290
$$ y = [-46328, 9892, 27350, -39306, 26535, 19866, -46505, 30144, 19285, -40487, 32388, 9787, -36150, 35854, -614, -32464, 42924, -6896, -35696, 39273, -7859, -23547, 36190, -23731, -20591, 42986, -24108, -19760, 34735, -26880, -9232, 32822, -31670, -1982, 30465, -36572, 3328, 32449, -33229, 5335, 21720, -30786, 20571, 20004, -38544, 19504, 20030, -29861, 22460, 8699, -29000, 28140, 2873, -28878, 30870, -939, -29079, 27491, -5292, -20195, 28293, -17339, -20462, 33445, -15473, -18564, 25978, -19109, -8363, 27644, -23983, -5374, 26714, -25237, -395, 26600, -23077, 3215, 17828, -24725, 14771, 19337, -29492, 11121, 16107, -21754, 17497, 6887, -25825, 21646, 5908, -24979, 21630, 1727, -23598, 20654, -2619, -17909]
389a7909M0365l3248q384M4680l3541p572L4094l2261P083K9624m0864J1080K8247
402B1394l8671J6422K1241l8559K0982J3281l7104L0885Q967m1311K8885P543
414A3955l1609L0137m969k9343L6697o629k8135L3016j1011j9651L2896j6986
426a632j3517L2060k3953q781L4843k4471o506K6670k6426N641K7229l4462N048
439h257K6242k9551R371J9068l0976J4443J4843l0255J9634J0913l0978J8356
451B853P621k2963K2169l731k4033K8357l217k2179K4693r126j5364K8425j4226
464g21j3923K8470j7302j1219K9150j6659q418K2616j9570K57K4052k3627r43
477g837K0052j8916N877J3281k3060J0968J1921k3776J4534Q396k3774J5640M943
$$ y = [-17909, 22456, -10792, -19176, 25504, -8037, -15609, 18485, -13776, -6693, 22931, -17933, -6853, 21394, -17277, -855, 20386, -18173, 2809, 16090, -21014, 9871, 18838, -22473, 6412, 13955, -17654, 12483, 7514, -21829, 14868, 8239, -19896, 13120, 2109, -17542, 15354, -1632, -15149, 16911, -7042, -15823, 19020, -5451, -11957, 14713, -11713, -6072, 21157, -13305, -8257, 17985, -11566, -2195, 16873, -14103, 340, 15183, -15072, 4562, 15475, -15503, 2853, 10474, -12489, 9680, 5949, -18084, 10273, 7056, -15123, 9570, 444, -14920, 13505, -721, -14644, 13826, -3476, -14695, 14455, -2204, -10622, 11994, -7576, -7319, 16733, -6894, -7837, 12215, -6701, -824, 12457, -10603, 365, 12286, -11490, 3044, 11440, -12334, 3306, 8249]
490H249k0093J9841p62k3548K2873J578k0302J8630m647j5062K2689p536j4528
503a2618K0679q467j0079J9169j0340n449J6008j5132N64J8617j8134l34J4933
516I417j6039O727J2415k2280Q204J3419k0300R310R864j9751J0229P097j7512
529i200J3156L081j8344J3304M090j3967J2277l763j0988J7221n148j1013J4996
542E702p496o326J6589j0428n309J5966j2686k301J7247j3423k823J3585j2603
555d306L182J1959j6316J907J2301j2505M063O781j4085P945N099j2972R964K092
569E109j4101J1127J850j1278J1893l765j1163J5851k019j2085J1985l748o532
582f876J3552o678o801J2431p167l339J2252q478k499R340q922K773Q964j2446
$$ y = [8249, -11844, 7997, 7235, -16313, 6560, 8138, -12164, 6466, 1819, -13243, 9446, 1910, -12618, 8061, -406, -10485, 8684, -1656, -7105, 8903, -6229, -5665, 12952, -5182, -5516, 9417, -6622, 105, 12520, -9760, -1556, 11863, -8437, 873, 10737, -9014, 1215, 8312, -9200, 3956, 7037, -11307, 1997, 6087, -7880, 4397, 634, -10354, 6867, 1719, -9294, 5702, -1794, -8120, 8469, -1959, -7268, 8698, -3988, -6289, 10958, -2465, -5288, 8297, -4306, -1124, 10835, -5481, -3574, 8727, -3778, 285, 7066, -7019, 926, 6025, -6947, 3017, 5109, -8992, 2135, 3985, -7293, 4600, 835, -10328, 5523, 3504, -8581, 3404, -344, -6876, 6676, -2, -6803, 5628, -1539, -4878, 7374, -1104, -3603, 5737, -3185, -412, 8552, -3894]
596c894K110Q117r761N394M605j4021P640O858j2934O721L996j2314P996L835
610D348j0449P822J52r855R900J032p782O464k734l636J0386n417n286R098n596
625a553j120R346q627j203R218q526Q56R452j0715J72Q911q166J720O343j0675
640d567K433P801q108K163K600p568N613K514p171N194p75n683P495k02o389P122
656B472l355m169J0197l981n892Q185l540k799Q938o056l751Q317m232j611O389
671E112o438r56O332n301J264L714p139K178M821o123L025J519p364N720K954
686C318p344M068J084o290O742M46o203N395m85m706P082j207n152N242j461j915
702a386N867m296k675O013l451j51M419o144j39N889n394P03M048o501J414M776
$$ y = [-3894, -1784, 6333, -3428, 1966, 6571, -7450, 190, 7048, -5886, 835, 4831, -7483, 513, 4348, -6101, 1721, 1873, -7982, 1918, 2950, -4832, 1632, -1102, -4738, 5648, 231, -5055, 4043, -1553, -2673, 6673, -1954, -3157, 6061, -2465, -1609, 7843, -2872, -2700, 6211, -1955, -235, 6108, -4567, -2134, 5667, -2441, -278, 2322, -5246, 367, 2881, -4290, 904, 129, -5554, 1941, 1739, -4650, 2472, -883, -5052, 5145, 1164, -4728, 3457, -83, -2882, 6056, 0, -3751, 4566, 334, -1277, 5112, -1326, -2282, 4050, -1251, 13, 3727, -3412, -1234, 3587, -2536, 489, 2008, -5356, 364, 3318, -4026, 42, 1126, -5164, 1578, 2024, -4179, 1216, 731, -3975, 3107, 1900, -3252, 1990, 529, -1386, 4481, 185, -2490, 3523, 72, -79, 4340, -1804, -1943, 3946, -1448, -745, 3303, -3198, -1784, 2992]
718B992n193J172K540n702L181L610n204K077R65l971M714P43m649L356P9k538
734a828M614j580l266M509k082k010O032l633l006M978k384j016M271m754j315
749b470N369l073q95K970m348N66L820l590Q84J635m129K363K585l516J722L25
765B18l360M305Q01m338K813J33k377M340j030l788M033n94k447M224k021k241
781a329L148j342r66L263l148j628L876k122j72J805l689Q41L091l085L46J857
797G46l667K000K086l229J679J021l293L027J854l605J677N75j801L152m97l149
813a424K593j6j394K700j529k380K825p79j118K455k571j421L001j268j44J677
829A207l097P0L063j871l54J124k478J883K038k808O26J039j972K044Q46k434
$$ y = [2992, -2201, -1029, 1511, -4191, -1010, 2600, -2604, -527, 438, -3533, 1181, 1924, -2725, 631, 710, -1828, 2786, 1206, -2060, 2449, 367, -1643, 4389, 756, -2250, 2728, 344, -672, 3599, -1155, -2470, 2899, -174, -1069, 1901, -2447, -1881, 1939, -1651, -767, 868, -3261, -898, 1687, -1829, -107, 218, -3142, 1163, 1964, -2374, 439, 572, -1805, 2535, 1505, -2283, 1750, 1156, -1291, 2933, 912, -1329, 1819, 477, -489, 2774, -374, -2002, 1874, -248, -420, 1385, -2304, -1463, 1628, -1457, -1111, 746, -2921, -921, 1165, -2064, -385, 636, -2657, 370, 2224, -1381, 296, 871, -930, 2222, 1725, -1424, 1169, 1153, -241, 2459, 930, -1450, 1375, 596, -522, 1933, -638, -2059, 942, -326, -470, 1207, -1890, -1820, 1243, -628, -982, 142, -2336, -453, 1585, -1223, -597, 442, -1530, 514, 1360, -1074]
845a074J336L35j806L084j78k816J769K88j141K218j209j975K502q79p91J626
861A289j671q54K207j534l90J785k424j19K488j638j6J091k237J378J972j960
877f33j65Q86r57J624P21k090J176M46j358J781q4k093J568l41q33K126j366j990
895a582K096j34j018J253j431j066K676r57r50J373j522J15J480o09k27O05j305
912a203R91J720j748L4L42r07J607Q05k250R80M44j124J671k06j945J198L47j257
930e01J676k28k126J073N39n55O06j178o06J462k69o45N02r15L72J660j600J04
948f29J128j413O36J421j334M04L72j405J430J263k105M3R22m92Q57n9j528L41
966a48N86n88N20k92o92N06k87l4P82j087p78J425p2l01M73j240M12J650q52p56
$$ y = [-1074, 262, 597, -1209, 1875, 1697, -1119, 650, 938, -203, 2015, 806, -1169, 1333, 454, -337, 1289, -382, -1236, 971, -563, -953, 832, -1592, -1711, 777, -861, -877, 214, -2023, -645, 1327, -633, -798, 88, -869, 755, 1476, -614, 562, 1008, -350, 1431, 1347, -746, 822, 481, -352, 1774, 408, -1582, 514, 380, -638, 615, -816, -1882, 794, -163, -1113, 260, -1262, -1147, 333, -276, -503, 102, -1203, -212, 1508, -240, -206, 136, -771, 836, 1641, -609, 371, 815, -309, 1362, 1156, -789, 409, 756, -501, 1175, 947, -1179, -106, 433, -122, 484, -694, -1300, 162, -107, -752, -250, -1165, -793, 867, -733, -629, 499, -914, -278, 1143, -191, 213, 585, -820, 610, 1873, -232, -189, 733, 241, 1098, 1039, -489, -148, 438, -150, 370, 78, -614, -108, -395, -429, 353, -734, -1512, -87, -159, -460, 13, -1227, -815, 835, -17, -773]
986g73R89n85P4J238q69k51P78q56P42R62j216M9jk06J117n17j412O59M88m30
1006b0O03p02r42J305j65p68P06j76q82O40L00N8k1j153L87J491n17o35L44j23
1026b70O83Q25j456L27P77q85M13Q51j108j52O48q95R13M72j646j42Q33j23k29
1045a64j07o12M64O20n56o6m00N47K78m92L2P41r99j00J365o4k80K0p65N79J478
1066A519j093o73Q41k99l17Q35q90J73K78j95j02L35m11n46K48M17K36q41n37
1085a022O47L61m26K98q30J11J171m03n30J070m46p68J221J17k87K6l43j91J092
1104H68j13r98N21Q9L26k5o87Q1J80l42K18M8l98K1j80K2O89n55p86K50Q18J95
1126B42k21o32p5Q94m3k67K1r9M0P08k10MJ64p26K48P73%o50pK4J43L51p61n92
$$ y = [-773, 216, -369, -295, 943, 74, -177, 601, -255, 487, 1449, 233, 282, 281, 75, 1192, 675, -737, -78, 410, -20, 583, -119, -1061, 244, 79, -689, 17, -159, -1041, -401, -101, -43, -64, -1217, -830, 661, 144, -491, -147, -270, 413, 1238, -218, 109, 886, 1, 414, 1265, 157, 5, 653, -242, 671, 1143, -503, -645, 188, 65, -164, -271, -883, -419, 201, -355, -421, -821, -274, 4, -488, -456, 285, -714, -814, 551, 487, 207, 227, -538, 41, 1519, 426, -247, 594, 295, -22, 813, -77, 96, 374, 179, 77, 412, 1, -545, -297, 120, 356, -485, -1022, -375, -14, -440, -142, -972, -861, 310, -93, -623, 447, 1, -767, 454, 571, 284, 310, -33, -224, 868, 755, -243, 278, 367, 693, 668, -19, 62, 242, -100, 118, 166, -232, -211, -391, -369, 320, -235, -1021, -771, 47, 242, 21, -611, -686, 208, 165, -102, -81, -180, -140, 568, 358, 362, 526, -200, 48, 821, 821, 171, 164, 188, 331, 682, -79, -671]
1150f71O81L10l60Jn77L15N0k3J01J3n08J86N0P08J27q95l38J163n5l84L21n17
1172c02K12R87k78p49M64J6l26O66j02m87J47Q0j59M30l64r85K85O90J11n63n43
1193g70L92P4J82J44m61m07N79K2R1N41l97p31N79O40k41k07q8r6Q43J9m98k10
1215@L41n4M14k19n91J78l1J68M8k21l15j45K59L35P8r28k2P69p3j01lp46O02
1238b57N15p51M32k8j33K45J50J4j26j9K3L23L38n47p3j10L32K14j86n05M5J56
1260E2N0M1m28l4k6K12K4k09k3j40K25j6N63n50l84M83M21J8j69l09J13K26K55
1283C95j62M8k1l28N23R8l11j52p7R6M12l14m38J43J11M03j51m81m99N46m1K51
1305E1k14k46k0R1J65J82k85k8Q7L01J67On11j49O55K44k17l55l6J72K59J27l96
$$ y = [-671, 10, 320, -40, -39, -616, -301, -251, -274, -173, -160, -668, -482, -432, 276, 403, -492, -830, 333, 278, -106, 215, -302, -90, 897, 619, -130, 334, 350, 24, 690, 588, 101, 248, 328, 169, 599, 235, -750, -465, 225, 336, -227, -770, -378, -304, -122, 22, -439, -846, -267, -245, -154, 387, -10, -741, -162, 478, 237, 30, -58, -154, 689, 708, 210, 0, 341, 287, 701, 482, -109, 69, 38, 206, 254, 33, -282, -427, -168, 167, 245, -683, -705, 64, -9, -110, -113, -859, -257, 258, -493, -61, -89, -222, 23, 173, 187, 61, 42, 65, 388, 726, 179, 106, -4, 328, 542, 356, -149, -104, 52, 102, 143, -285, -319, -345, -133, -109, -318, -341, -481, -256, -272, 291, -259, -643, -160, 261, 279, 110, -199, -86, 140, 395, 233, 281, 260, -68, 455, 553, 242, 90, 13, 109, 521, 207, -231, -88, 23, 426, 275, -206, -705, -159, -200, 51, -163, -409, -429, -338, -173, 9, -276, -304, -217, 84, 251, 257, -254, -403, 252, 496, 279, -76, -112, 60, 319, 446, 50]
1328E0J56j45J30j9q3l4l69J57M69j26m94j86J37L86j51L0m15pK79J08o2J62j44
1351a71J6K75K26j52j15k05J78M36k35j39j82L76K44j74m59J75O8P2m1P7k71l0
1373c1ql1L04j24n62M8K70K13j35m55J58K12K51j47j01O2J12J64k25K38k06l60
1395c53M88M46k83m7l59J18L69M8l56l70M24K2J03l44N0q3N3j14K33n0n62K17
1417c50J42K36k52l79J13N04M21m82l33K38K51L29j27k57j9K16j89kL19n2k13
1438A14n4M68l1l65j20n0K53n8j34l00K3L91j36p4l67J33K50l0J37k04m8j33L20
1461a5L08j82K2m29K87M45p6l96k00J55M68k54J35k71J40Q3k9q0j32k7l25K37
1483a36M26k12k72q0J48K62j37l32j62L04M43m75m6J18R2P2L54l67N7j05n4L00
$$ y = [50, 206, 61, 191, 172, 89, 55, -314, -157, 312, 186, -308, -494, -357, 29, -122, -92, -507, -514, -235, -127, -189, -27, -171, -155, 120, 346, 194, 79, -126, 52, 488, 253, 114, -68, 308, 552, 378, -81, 94, 162, 234, 193, 270, -1, -31, -39, -70, 234, 110, -452, -404, -134, 79, -56, -511, -353, -141, 110, -37, -138, -76, 36, 200, -25, 213, 7, -353, 135, 581, 298, 251, -108, 10, 379, 427, 71, -299, 125, 147, 250, -94, -44, -127, -74, -188, 45, -5, -567, -350, -208, 28, -224, -603, -490, 14, 435, -47, -380, -142, 109, 438, 311, 54, 35, 251, 62, 60, 379, 327, 114, 60, 528, 497, 132, 12, -38, 215, 157, 23, -277, -254, 137, 1, -73, -440, -307, -57, -87, 50, -154, -202, -335, -15, 293, 111, 133, -296, -9, 436, 360, -36, -236, -81, 387, 133, 268, -3, 137, 220, 191, 111, -21, -48, -373, -136, 290, 78, -194, -274, -126, 136, -1, -333, -495, -191, 252, -223, -269, -151, -59, 13, 367, 0, 57, -48, -102, 198]
1505A98M23n23l39M45R1K90l88l18J93K40n8k64q1K19k41q5L10j42j12j87R9K88
1527E8l06K26l54L81L63l25j50q2J86J99Rop9P9l00K14J50L3m96Q5K60K64j90
1550B19l22k50O78J83o48j44K27K75j92J41k70j59K4J07oJ60Jl22K46J82R3j48
1572G5l36J80L40q9j49j05K33J10o5l03M42k65Q2OL24k27l98k62L55L92m38k25
1594c23L31K67l14j41j2M7R8J8j47L07q7l40r8K41N00k19l06m9M16N6j56k45L46
1617A90J96j92l06J28J42m3J18j56N7j07l34R4N53r8n13r9L48j19k3j16j01L93
1639A2R4j46j11L83j87j72q2M44K93l00l77L40J88j49l36J23K22K5l72J99j0l7
1661D4J26j36j69K43k60q0J40J38j58k86K32K61K92m73m24L20J99j24k52L30K52
$$ y = [198, 621, 98, -241, 204, 295, 585, 197, -121, 72, 312, 254, -10, -91, 128, -113, -198, 112, -30, -142, -329, -230, 58, -248, -22, -376, 5, 368, 43, -107, -189, -3, 196, 205, 199, 120, 199, -101, 113, 263, 296, -200, -115, 145, 409, 219, -103, -353, 325, 508, -140, -284, -57, 218, 26, 167, -103, -262, -238, -131, -137, 23, 24, -298, -52, 130, 223, 75, -261, -81, 259, 170, 21, -84, 149, 259, 194, -109, 333, 68, 150, 156, 480, 253, -145, -407, -52, 340, -98, -323, 8, 275, -39, -180, -192, -145, -47, -29, -176, 131, 44, -296, -394, -153, 347, 128, -178, -227, 189, 245, 89, -156, 190, 386, 194, -112, 16, 158, 115, 233, 77, 134, 27, -307, -213, 340, 242, -271, -370, -22, -141, -164, -280, -381, 12, 106, -40, -151, 232, 45, -127, -209, 235, 528, 228, -149, 191, 379, 230, -106, 17, 239, 264, -108, 91, 81, 44, 170, 34, -135, 108, -152, -232, -92, 46, -112, -398, -166, 95, 387, -86, -510, -190, 9, -115, -367, -37, 215]
1682B15o9j20J77p6J8k41j02M59J32n54k1L58M00o82j15L23J60p2j13K3j85J58
1704G3l06l6L41%p1j74k52N18p3n34K70K77J65l39o9M50N9k99p5P6N1P0k47L84
1728B59K60l14n43L12L41rl99j15J98K75P4o04K97Q2j33k64K26N4j31n1j53L89
1750E1L32q08N9L39J49Q1m64K76O3p1J26k9L04l06l5j66L40l3l64j36M14J67l46
1773e7k53L49OJ29l55J07J33n6j77J8L17j8j89o4J84O3j94k24L59K96l52m08L12
1796g4L23O4k96M9P8M6J2k38K84j33j45j22M82k37J3k94r7K96M10n24m41O66J56
1819B78k71l51K08K40r1o3k6K22k7m83J87L70K52o10j16L00K33k95k04J95J34
1840H2Rl8k1J22m5j85M7J50l0k95o1L65o7l6m75J20N93l53j28j61K59J18k81j0
$$ y = [215, 146, 26, 203, 127, 145, -96, -198, 261, 393, -161, -182, 176, 576, -106, -221, 102, 262, 190, 77, 100, -85, 73, -233, -269, 72, 72, 1, -173, -425, 93, 20, -514, -244, 33, 198, -141, -210, 240, 299, 0, -75, 1, 52, 122, -125, 259, 519, 205, -338, -26, 315, 306, -93, -208, -10, 265, 339, -265, 32, 114, -19, -283, -57, -3, -134, -185, -338, 51, 383, -425, -366, -27, 122, 203, -261, 15, 78, 7, 133, 104, 408, 102, 67, -99, 241, 208, -156, -292, 122, 289, -57, -310, 39, 45, 174, -181, -74, 59, 3, -174, -156, 161, 143, -46, -110, 74, 137, -57, -281, 78, 374, 22, -386, -74, 249, 313, 17, 66, 144, 190, 202, -36, 248, 115, -30, -152, 330, 93, 106, -188, -285, 11, 421, -103, -544, 122, 278, 7, -344, -136, 104, 13, -50, -76, 146, 119, -364, -177, 193, 445, -165, -281, 19, 252, -43, -247, -52, 82, 91, 53, 32, 154, 109, -76, -29, 121, 91, -204, -265, 100, 33, -3, -478, -358, 235, -118, -246, -407, -148, -30, -311, -321]
1864c21L80J93l10j5J24M8j07k85K09P22l38l02j17K43K15m32m8J5K48o7k08P7
1886g6K68l92j57J74M48p7m52j72N41J72k18k53O6N33l04l89J77N39l67l15j8
1907b72N41j01l17kN12L1j87n48K45M05k25m93J10J92J98p7l29M45R9n79K7J23
1929b02L17n05o6M44K88k44l74O4M14K06n84j52M48K55k62l53K63M73m25k02J44
1950e3O42j48o91J7M09K22k67o11M55K28l12k89L21J31N2n51K23L65O5m53P8K93
1972A26J55j41o23N00L12k54l08N4N49k26l95N5L04J15l88%L72J62m61l04N49
1993A53K76l36m18O9M42j23k83j95K81J79J35m46L06r7o1n1J25L60j52l35P7N77
2015D83j98n37K4L66K70l48l39N64j79o8k12L1K54J68o36J84L52K43m06l59K10
$$ y = [-321, 59, 252, -58, -73, 51, 99, -8, -293, -84, 638, 300, -2, -119, 124, 339, -93, -141, -126, 122, 55, -153, -76, 192, -200, -357, -183, 265, 188, -264, -436, 105, 277, 59, -194, -128, 405, 101, -288, -111, 428, 61, -254, -272, 269, 168, -149, -151, 361, 392, 205, -343, -98, 307, 82, -411, -301, -109, 89, 12, -317, 128, 227, -352, -325, -202, 115, -390, -456, -12, 276, 32, -342, -278, 136, 342, -242, -394, 54, 309, 47, -306, -43, 430, 5, -197, -53, 589, 441, -250, -233, 176, 398, 131, -480, -25, 203, -109, -398, -77, 54, 106, -445, -222, 143, 208, -245, -167, 126, 281, 140, -483, 17, 329, 75, -233, -179, 370, 144, -251, -196, 108, 223, -165, -165, 207, 369, -92, -396, 153, 429, 93, -325, -256, 186, 63, -220, -415, -134, 45, 180, -266, 40, -57, -118, -169, -44, 316, 164, -171, -94, 483, 285, -252, -228, 138, 408, 60, -279, 285, 106, 38, -174, -143, 111, 279, -357, -173, 179, 422, 16, -343, -133]
2036a33M10j76o16M44K56Kk33j37K75J9j5q0K56K3j96n63M77L05k01m41J42N81
2058C99o8n54L9L90L2j48j35N2K73k55k00J02K19J57n79K92m9L78n78k26N80J90
2080C11k49n50L41M08j17j23j31N1K87o02M9O24O4m21m9MK86Jl77J74K32R4m03
2103i6l33M44J26k49J8J26L5l05o4K23L33k61l25K13L65p8l42MN6L34j85j61J30
2126HJ95j52k07J22L77l45o3L5K34n9k66l27M14M11l60k96J11K09j55J25j8j04
2148a11M1k1j86K38L64n65Q0K50J62j41l77P3K43J27j15k07N01n7k84j75M16R9
2170C55l78N5q2K42p3j70m9J76L1l44J37L14k68m6j35K43N2j13j14n8L81j90l
2193c7n8J42K27l75K54l02K42j7k80J82J31j5j58r9K45Rk29Q9P3K21m58n4L07
$$ y = [-133, 277, 101, -515, -71, 185, 187, -46, -183, 92, 111, 96, 16, 272, 295, 99, -464, 13, 318, 117, -324, -182, 399, 331, -223, -184, 206, 238, 90, -45, 7, 280, 25, -175, -73, 146, 303, -276, 16, -33, 345, -233, -459, 121, 311, 62, -488, -147, 261, 144, 21, -110, -59, 228, -374, -325, 299, 363, -58, -107, -103, 183, 184, -193, -19, 213, 307, -96, -429, 15, 141, -108, -90, 36, 71, -234, -298, -75, 258, -3, -328, -115, 250, 172, -170, -166, -110, 224, 39, -122, 8, 203, 51, -156, -34, 343, -2, -65, -30, 204, 145, -121, -448, -34, 377, 17, -279, -168, 41, -114, 11, -7, -111, -70, -91, -277, -39, 325, -240, -160, 90, 252, 111, -266, -193, 50, 177, 62, -145, 356, 299, 15, -160, 256, 355, -23, 32, -50, 192, 119, -51, -100, 76, 107, -237, -100, 214, -54, -100, -235, 8, 60, -53, -167, -225, 156, -34, -37, -95, 47, 274, -101, 153, -149, 93, 76, -204, -22, 109, 94, -64, -163, 82, 91, -138, -49, 24, 245, -213, -267, 40]
2216D0O2n9l22K80r2J16j96j64K18K53l03L3J09k8m8K25r5J05Q9k38K7n5K59k27
2240a1k72N66P0l23q1k89M50k89J75N8Q3j10L5j60K15r6N1j24q1K20k12J54K3
2263E2J16j46r8J45J68k11p5m3J25J61k19j19J97R4k52j25K04J54j41J7k02k0
2285b18K56r2J3j43j58K83q4J62r3Q3k04R9J07k01J96k38N81k13k23L2j0L76j98
2308A13m9p1Q4l49L31j14J07K10j85j7J34l7k39r8R3J31j67K13O5p5R2k63L5O5
2332Ik42L07j34J67J00j76l6J34q5j44j8N8J2J37j00n2M50m33LK65l39K94j60
2355A7J22q5J98l12K7PL5L6l63K58K43k34P7J47j72k19K8K07R7M9k19p3Q9J79
2379A39j03k78K73K15j50j77N1K04Mj54N0j43L37l12J88k47P4j37J57r4J27L0
$$ y = [40, 102, 43, -279, 1, -91, 25, -171, -335, -117, 136, -167, -134, -25, -53, -101, 124, 29, 134, 223, -15, 12, -43, 216, -11, -283, 283, 353, 30, -51, -340, 110, -179, -4, 54, 137, 27, 62, -98, 117, 21, 72, -52, -133, 87, -125, 29, 52, 168, 22, -76, 69, 237, 26, -49, -92, 33, 194, -25, -144, 53, 147, -105, -230, -26, 128, -13, 4, -198, -218, 38, -54, -41, -184, -342, -59, -143, 19, -74, 9, -195, -96, 11, -190, 6, -232, 349, 136, -87, -55, -65, 311, 113, 64, -7, 77, -272, 59, -55, 52, 262, 77, 60, 194, 157, -82, -180, -87, 44, -123, 90, 155, 80, 172, -91, -56, 9, -233, 74, -60, 107, 207, 31, -5, 129, 44, -100, -118, -60, -48, 89, -11, -63, 387, -46, -43, 222, -117, 177, 17, 139, 54, 252, -60, -33, -26, 9, 45, -318, -60, 183, -51, 26, 173, 1, -218, -190, 17, 114, 163, -56, -129, -40, 139, 36, -242, 31, 246, 96, -81, -30, 174, 178, 24, 74, -69, 268, -44, 144, -103, -29, -166, -9, -103, 24, 54]
2401E4j51J36R8o7k07N0j31L56n5r9J00k49K01r1P4o6p9J42k5J23Q7k57J12q4
2425b8K15k93M2j28R4K7o7J9J55JM4M1k59L03k32k07M48r3Pk02J09p3Q6l2r9J06
2451a6K45l29K0K03k29K76m16J51L75l07n1KJ82P8k62j86J1J44J29j46L3M7K24
2474A78J6j24j35J53l51K50nJ68r0M1k64Q4N4r8J85k20L55l46J31K8l4j2R6l8
2498B2k0J81l62J90K12j72j56K10N8k3m8k30K0K1n5O9J41o8l1M4j06J69J6k00
2522a18J17J36k5J65l15J61j55J29j33K00J5k14j03R2J7J94j30N4k05K76k63n8
2544a63L14M4o7O8k28N8J89l21L1m2J49j70J49J64K3k76Q2p0K19L3k08o1O7r5
2568a11K86k15j24L17P3k90r5J79j3j63N0Q4j5j70jj7O5J37R3k55K13Q5k59J13
$$ y = [54, -97, 39, 137, 70, -137, -87, -218, 138, 83, -16, 84, -165, 36, -55, 19, -47, -126, 16, -9, 114, 201, -56, 56, -28, 187, -106, -64, -192, -98, -71, -138, -119, 36, 37, 81, 122, -137, 166, -66, -273, 175, 82, 89, -113, -4, -77, 9, -23, -122, -16, 229, -100, -80, 123, -106, 170, -246, -95, 280, -27, -78, -76, 106, 184, -78, -264, -253, -109, 20, -126, -93, -46, 178, 194, 70, -65, 88, -263, -13, -18, 150, 60, 101, -163, -79, -25, -123, 62, -158, 197, -149, -18, 10, -24, -36, 60, 22, 2, 183, -179, 11, 223, 51, -105, 105, 163, 140, 92, -138, -118, -97, -152, -83, 58, -10, -41, 3, -103, 66, 82, -118, -1, 135, 110, 275, -40, 121, -34, 95, -38, 162, 177, -37, -140, -48, -31, 163, 33, 87, -118, 158, -105, -163, 151, 195, 128, 196, -32, 26, 215, -106, -75, -117, 32, -138, 11, 175, 198, -78, 4, -66, 153, 186, -22, -83, -16, -111, 175, -40, -164, 153, 226, -64, -159, 20, 7, -156, -106, -22, -37, -207, -208, -225, -160, -23, 70, -185, 28, 113, -146, -33]
2592c3O0p2r7m9N8L09n4j75K8J59j56O9j51j5J22j09Q4r6K29K34m31mj11L66l28
2617a63J76J9j3P3q5j08K97j93q8J0rK38j93Q6j8p0Q4j75J10J92j85M8J40J03
2641B76j42k31J21J07k25j10K75l2m8k0j82K49J04k53Q8l9J60N0k53r4K74j28
2663e3K1j2r9n1J75k17J52K12j51J32l0m1p4n0J24P9p8l59L92j43J43j21Q2M8
2687H1k38K12n4J36j58K6R7j67J99j34l2J4O1J58k30P3k51J40J5L3q2r7J40NJ46
2712I3O7m24K77O0O1k93J25P9j33qL7J75j04l2K04k86J9J98j29p0R0j16K60k43
2736i3K79k22nO9q0P1r2k6J86J79n43K98r8J42k13J74l35J66J50j53M2K13j35
2759b6j12J43L6l1N9L0q8K01k19o4Q1J52j42J5q2k6M2k93M20k45J80L5j48K02
$$ y = [-33, 27, -45, -142, -191, -133, 176, 122, -53, -25, 134, -22, 47, -104, -119, 3, -106, -22, -118, 111, 345, -86, -90, -201, 165, -163, 13, 32, 19, 92, 7, -101, 196, 3, -85, -75, -84, 154, -39, 47, 29, -41, 43, -132, -22, 170, -15, 33, 173, 276, 134, -97, 24, 131, -94, -204, 71, 39, -9, -29, -211, 38, 142, -111, -23, -62, 98, 148, -105, -199, 75, -53, -32, -44, -143, -194, -19, -236, -84, 128, -23, 109, 79, 38, -36, -86, 38, 117, 39, -320, 72, -71, 72, -49, 33, 81, -157, 55, 1, 137, -21, 5, 102, -65, 134, 0, -32, -18, 43, 201, -29, 44, -207, -67, -52, -19, -101, -198, -58, -53, 93, 160, -264, 13, 73, 134, -159, -34, 45, -88, -96, -59, 116, 12, -20, 184, -102, -83, 115, -14, -84, 6, -110, 150, -93, 186, -36, -41, 28, -52, 19, -73, -99, 87, 266, -277, 21, -77, 65, -148, 26, -309, -143, 7, -146, -104, 109, -26, -138, 5, 41, 10, 69, 99, 11, 212, -7, -71, 10, 162, 20, 35, -47, -73, -31, -324, 96, -149, 31, 66, -82, 120]
2783A20j86K76k9J8l06M1J37n1J46k42pK05k88K80q0j31J4K03l7J09j33k41J36
2806d6J75k33PM3J94q6l31N16m49J80n7J32q5q5J45J83k72N3J51l8kj48r9K02
2830E0r4j03J43nJ38k34J42m4j46m3J51m2Q4O1J5J74l23J6L63j63J62j94n2j49
2854i3R9J01M6k02j12K08j44K57j81J62n6K7N8j96K50j29j05L1j89P7Q2P2Qj12
2878d1M4K46l65J79o4k45J98j49K40j3J44l75OK13O4k33J98O6j17L3j33K56k46
2901i4J34Mk24K54Lk61R1J23p5n7K14k9jl37J04K20N8k05j26L29k4j45l4M6J41
2926A09j83O6r1K18qj05L3m9R3qj96L6K6Q8pL6j16Q4j3J6J2K3j03K83j42k30q8
2953b16M09j59pJ00k12K39k29J46j07J33q0n1J02L5j65q9K74q7J80l80J73q8J
$$ y = [120, -66, 210, 181, 199, -107, -66, 71, 20, 166, -76, -83, 122, -166, 114, 34, -97, -83, 120, 83, 192, 59, -182, -46, 129, -104, -97, -54, 140, 54, -277, 239, -210, -30, -87, 45, -40, -125, 20, 203, -69, -16, 135, 97, 95, -53, -152, 50, -44, -147, -4, -9, 129, -105, 37, -7, -153, -196, -45, -87, -3, 58, 73, 247, -76, -60, 303, 140, 302, 108, 56, -93, 6, 107, 153, -49, -161, 47, -97, 160, -21, 141, 85, 112, 170, -26, 224, 95, -10, 21, -168, -91, -9, 63, 71, -41, 3, 249, -116, 63, -1, -246, -48, -197, 43, 30, 174, -201, -195, 18, 82, -151, 47, 113, -4, 29, -104, 152, -94, 40, 44, -180, 74, 77, -184, -93, 30, -45, -102, 112, 83, 82, -255, -151, 69, 127, -78, -204, 125, 101, -44, -78, -32, 109, -74, -8, -99, 119, 111, 6, 39, -10, 83, 75, -121, -85, -59, 29, 22, 58, -58, 26, 13, 29, 41, 64, -39, 244, 102, -128, -216, 193, 34, 27, 127, -85, 154, -75, 71, -36, 97, 17, -34, 68, 103, -62, -151, 123, 36, 216, -164, 9, -79, -78]
2976g8n2M2K12j08j31J49J36l47K33P3m73L91O2k66J20J12l26K60P2q6Lj65K13
2999D6j8j27l4J14j85M00j61q7J26k30J79J73rj30N7P5l26J60j10J16L2j86K53
3022A28K1Q5j24q1N3k54K03lj25r1oL25k02m6L32j63o2Q4L7m4k49J40nJ74J25
3047B52l27K39k7l1j72kJ87p1j18j6M2K25jm0n4J0r5Kj80K91j71J63j52L1J70
3072A55k4Q1l69J76o1J5L0k12L51l14J84o2J06m2k00J02Q5o7K38l8j49Q7o0Q1
3096I3q2K29j51j3k79J69J7j18J10K8J19q4n1L2k5J75k28l9J25J1J11l1j91j49
3120b22K10J74k46J39k96j3M07k30K83k55K18p2n6Q8k09j97K23r1J85k45J94j
3142a2j77P4o8P3K62k19k7K3j04J12j68K93j44J13L1J9l2j26J69j56p0J86J21
$$ y = [-78, -130, -88, 124, 16, -115, 34, 170, -177, 56, 129, -344, 47, 109, -157, -37, 75, -251, 9, 81, -5, -2, -167, 46, 28, -99, -133, -19, -204, 196, 35, -52, 74, -156, 23, 196, 187, 57, 114, 189, -137, 23, -87, 29, 61, -125, 128, 149, 234, 110, 29, 82, -172, 31, 28, -97, -188, -194, 131, -71, -117, 215, 52, -10, 74, 111, 67, -182, -42, -47, 127, 252, -75, 164, 137, 106, -66, -68, 119, 48, -70, -86, -44, 181, 180, 140, 86, 96, 1, 3, -177, 114, -57, 106, -46, -15, 155, 131, 212, -157, 19, -42, -27, 3, -209, 142, -172, 12, -50, 56, 14, -186, -84, 1, -66, 172, 134, -15, 72, 12, 93, 11, 240, 89, 76, -203, -34, -17, -135, -25, 3, 122, 38, -13, 19, -6, 169, -59, -98, 27, 38, 149, 118, -73, -222, -12, 162, -84, 55, -241, -254, 153, -77, 206, -49, 169, 97, 41, 129, -80, -277, -54, -145, 40, -205, -11, -12, -189, -115, -183, -110, 152, -67, -94, -71, -175, -63, -231, 62, -82, 31, 62, 81, 49, -77, 92, -64, -134, 52, 173]
3165A73J23l25O5J19K0o7k14J40%k39L83j86p6K90p7K0l6j05N8Rj66j48K68J01
3189A30o1l37L20P0o6K4J32K0j65J36j20k30J29J09l3r5J30l16K45j70J05k9n9
3212a31P3m4J11l7k0N3K4j4J99l41O8K4o7L01l9j23q5o6K48j06k5J06j58Q9k66
3237b26j9K10K7L4M3O2l67K27l3J2J94J78n73K57j10J22Q4j51k9O2p7L1L7l0K8
3262gk14N54l33L7J50j63j30J11j10J66k69j06K26R5m0J33k61M09j73j31NL00
3284B49j49p5m0J51l42J55K20l05K84m02L46j56J91j51P5m7N0O4j4R6j86j98O2
3307a22K9N2L2j06N3K8J52p3m5n2J52k14J58J21n0n3J3j18j8K22j51Mk1J74j78
3332a1J00k38J71p6K74j10j25J36J0k68J2K45l5%j2Q9k70J24p8J52n4m7o3K05
$$ y = [173, 296, -29, 36, 155, 175, 108, -106, 34, 34, -205, 178, -8, -84, 206, 129, 149, 113, 8, 66, 75, -91, -239, 29, 130, 69, -268, 52, 122, 56, 80, 212, 232, 67, 203, 83, -147, -18, 91, 58, -37, 93, -223, 22, -148, -43, -72, -131, -58, -102, 9, -28, -48, 5, 29, 15, 214, -127, -59, -35, -102, 199, 160, 37, -48, -114, 134, 28, 3, 109, -49, 40, -226, -245, -35, -8, 26, 69, 131, -236, -9, -42, -30, 164, 342, -231, 26, -84, 38, 122, -29, -58, 4, -73, -42, -5, -35, -7, -221, 333, 0, 37, 187, 24, -106, 5, -105, 61, -208, -314, -88, 7, -33, 100, -161, 248, 75, -56, -51, 249, 100, 25, -15, 136, -206, -51, 169, -136, 148, -254, 92, -64, 127, -24, 51, 4, 54, 118, 104, 200, 14, -184, -122, -93, -41, -9, -115, -62, -34, 118, 45, 0, -52, 100, -114, 44, 165, 115, 62, 75, -43, -61, 161, 10, 14, -7, 167, -11, 89, -149, 22, -54, 220, 110, -15, 121, 131, -137, -125, 120, 85, 85, 73, 162, -108, 16, -62, 90, 36, -11, -74, 131]
3356A31p7m5J9OJ56l01k5K79j70m0J76j28J52J00r6j2m9m8l55L97R1j83J9K27
3380B24k99j3L59k57l19K39l4L2J33M4M6N1j66l7Lk51L25N8k91K21kn0J7o7Q5
3405E1n7K84r7n04K42O2q4J7K28rl08K15O6k01L92l84j1L8L2J45l24L30p1j63
3429a11j3J34j43K62l34L75q6j25O1j35n7J87K00k43K7M2j31J43j32J10k16J89
3451DK68j83L8Qj12J86j51k2j81O5M1J86k01k1m8l2J76RM6l50J53L5k7J88k9n9
3477a3K45j61r7J06R1j88K08m75J55j7K1K4q3l9L52p0k60n6L56p2N8k62N4J90
3501F7j01R6l72J49L09k81K52Ml5j10r7J63j91J2R1k40J86J8J05om2J88q4N7k05
3526f7j52L39k03J1K47k31R5q7J42J14l94K28jp9m4M2J36K02j96rl9o5K2j5j62
$$ y = [131, 54, 9, 28, 34, 190, -111, -136, 143, -27, -67, 109, -19, 133, 233, 137, 125, 76, 28, -327, 70, 161, -22, -3, 224, -75, -88, 271, 14, -305, -66, -100, -68, 65, 109, 155, 206, 40, 3, 6, -245, 80, 138, -153, 68, 66, 16, 33, -34, 51, -6, 278, 181, -323, -81, -19, -103, -86, 142, 133, -175, 40, 106, -95, 297, -87, -98, -60, -28, 117, -207, 123, 52, -111, -124, 10, -133, 129, -205, 170, 84, -41, 20, -115, -172, 15, 215, -28, -1, 41, -90, 53, -79, 31, -185, 4, 272, 89, 127, 135, 23, 209, 58, 36, -145, -80, -39, 147, -54, -75, -123, -155, 21, 30, 76, -274, -121, -86, -113, 75, 46, -13, 232, 71, -26, 80, 171, -17, 191, -284, -129, -146, -125, -101, -184, -223, 129, 59, -201, -257, 99, 27, 85, -177, -123, 67, -34, 62, -310, -161, 148, -133, 119, 123, 88, -22, -119, 44, -147, -135, -44, -284, -98, -80, 25, 19, -23, 165, 81, 138, -67, -219, 120, -83, -72, 175, -56, 39, -48, 94, 208, -186, 42, 41, -38, -82, -40, 96, 298, 102, 93, 54, -11, 11, -4, -166]
3551a66J04q6J36K61l29K38k46K6J7m0J03j91K99k7l8j01K50k64J77j77k57K64
3573d7r2P0J59p1n0J24k13l3K19r3L1j53L21j07j10R8r6N9p8J50j03R7j0k40P9
3598h9K56j25j33M2j40K01MJ12j06OJ1q9K20k17m3K45l39J99O4j33J16k19P3J45
3622F1m6J44k88J83o4rk8m9J82l9j9j2J54k16J21K4l87O2O1L16k43L40l43J29
3646C4O7k8k7q9K4J15k71K23J4j67M8j96L10j10J7KK75o9j9j08n5J9l9k56nK94
3672Cl5k6R3n0p4Q4L8q8J74o3J72j76l26L84j0j97jJ91K1o1j38J30J99k21rk30
3698b16L96j16q2M2J06q6j55L58k44L8J1j31K8J04J7k19K03nK3j14p5o2J66j60
3722a73OR1J76k41J87k68L04O0j21L8k13J61N6K9j87N4K38j38k64J42L91l94Q7
$$ y = [-166, -62, -148, -12, 249, -80, 158, -88, -62, -45, -85, 18, -173, 126, 99, 61, -40, 210, -54, 123, -54, -311, -47, -139, -69, 90, 19, -31, 93, -120, -153, 66, -27, 4, -149, 172, 65, -45, 53, -43, 16, -62, 88, -15, 82, 72, -168, -89, 167, 42, -91, -49, -189, 12, 16, 128, 22, 28, 39, -50, 170, -47, -90, 155, -184, 15, 79, -54, 62, -157, -84, 61, 15, 159, -129, 54, -10, -19, -47, -96, 86, 47, 28, 16, 170, -46, 75, 99, -288, -226, -165, 151, -92, 248, -95, 34, 101, 73, 46, -43, -19, 96, -175, 48, 62, -105, -57, -253, 57, -53, -36, -34, 241, 172, 153, 45, -10, 9, -30, -286, -291, 3, -32, -58, 35, -15, -89, -5, 33, -55, 119, 56, 228, 52, -274, 110, 100, -97, -98, 93, 114, 53, -85, 45, 244, 23, 14, -216, 180, 64, -18, 24, 130, 44, -111, 247, 3, 41, 52, -79, -51, 53, 70, -149, 54, 49, 72, -42, -117, -179, -13, -173, -167, -76, 100, -141, 46, -222, 82, 142, 21, 59, -154, 7, 63, 92, -95, -41, 197, 59, -205, -63, 328, -66, 21]
3745B1j23J24R5J21l02j77K1K05l2j58J67j63J57J57j38J38j55k01K05m9j45J75
3767e7m8N7o5r0J42J54j24j33O1L35l02L69l84N1J3N4J02N0k13l8L6j7r7J8n7
3792a83J58J9n3L6k0R6J77k23J24k56n5K50n8J2k49J81j0k2q4j23L69p8O1j6j7
3817C6K30m42J21q0J11rl5k5R8M2j14j53J53J21m9m5K02n4j82K52m8K1k03m1J37
3842D4M2j6j00p4J3rQ9n8J53m5n5k73M42k44J46j67L84j98L4j66Q9J02j82K10
3866A61rJ67k64R2l89OK54k70J55J29L4j35J6r3J78m4m0j33K63p6J18p9j38L28
3890B31k55r7k1J20l9J96k82L01j52Q1k97K17j3l4N6k26K37m0n2k9O2M3m0J25
3914I2K4k4j45n6K45j50j09j60K85o5J11K0k58J34k3J13O4k54K15n3r0L4P0L7
$$ y = [21, -102, 22, 117, 238, -64, -241, -220, -15, -47, -205, -38, -201, -44, 113, -25, 113, -42, -243, -38, -87, -232, -57, -105, -48, -113, -203, -61, 93, -31, -164, -103, 232, -70, 299, -85, -34, -21, 33, 135, 185, -28, -66, -30, -47, -144, -126, -183, -25, -6, -59, -23, -43, 53, 230, 7, 131, -125, -180, 70, 12, 24, -225, -44, -54, -76, -160, -283, 86, 8, 69, 53, 36, 266, -176, -55, -135, -24, -33, -68, -93, 5, 47, -67, -220, -67, 54, 5, -40, 162, 108, -74, 178, 130, 151, -52, -93, 44, 86, 70, -30, -104, -91, -100, -11, -69, 84, 39, -16, -289, 153, -91, 55, -112, 272, 74, 108, -58, 31, 133, -49, 161, 152, 319, 55, 147, -242, -236, 18, -252, -97, 32, 66, -69, -53, -146, 32, -12, -52, -185, 78, 2, 120, 41, -97, 231, -24, -121, -142, -22, -61, 135, -147, 154, 2, 83, -214, 3, -10, -44, 12, -214, 23, -17, -69, -98, -36, 7, -33, 92, 116, 92, -53, -109, 136, -14, -123, -283, 2, -63, 48, 68, -190, -56, -79, 34, 98, -156, 59, 6, -84, -50, 20, 57]
3938E7n2j28J36k29K2L45k92L86j91j08j70Q6M13j51k09K54o7q9Q4l4N1m2l93
3961c21K74J24o3m7P6K4l6O6R2j21j38K01k29M3%K07k04j32L33j50J58k24L4K
3985c1P8j80J71k11L21l20L69p2l57L93k30l7m0J73n6kJ46k24p1K67o5Jl8RM1
4010C5R8l38K62J01k90J75r2K75k93l9K29j21j0O4q2rR9Rk77J89k57K91j73K95
4034A41j83O4m2j68J47J36O3j29j91k1r6M29j69j55L91l24o1R4Q9j94J69p0m5
4057a25L0j8J07n5R5j49q1J57N6R0j03l1R9q9J79j46J61j47p7J20J24k59J1K01
4081A50j81N7N7N6l04L30k42m8J45l0n6J47m7l31L18j08J54k02m0n5J79J76m2
4104H3Jj60M0P7n8P6n0P9n8Jn8n9J08j99K13Mk0j54K33j8j53J17l0M3L1K07l56
$$ y = [57, 5, -123, 13, -216, -194, 151, -141, 245, 54, -54, -224, -138, 275, 124, -85, 169, 102, 13, 97, 63, 114, 72, -321, -47, 77, 14, -33, 43, 67, 31, 97, 189, 68, -70, 131, -98, -55, -55, 152, -52, -184, 149, -1, 157, -67, -33, -31, 47, -133, 38, -173, 148, -172, 197, 125, -232, 161, -69, -106, -146, 27, -29, -31, 115, -109, -180, 87, 22, 23, -15, -6, 35, 133, -205, 57, 158, -132, 43, -49, 226, -67, -106, 123, 2, -8, 56, -26, -35, 64, 73, -204, -15, -272, 19, -154, 141, -42, 22, -20, -188, -41, 95, 158, 29, -162, -183, -279, 150, -19, -174, 217, -107, -168, -74, 15, -179, -10, -80, -125, -95, -113, -6, -61, 34, -115, -196, -39, 17, 107, 4, -27, 72, -17, 162, 16, 177, 30, -47, 73, 197, -62, -51, 150, -31, 26, 83, 139, -165, 165, -77, -125, 20, -10, -66, 81, 34, -297, 21, -87, 67, -135, -175, -230, -51, 125, 83, 84, -76, -36, 41, -17, 59, 9, 88, 30, 31, -27, -86, 22, -177, 36, 40, 20, -134, 99, 81, -72, 45, 15, 58, 89, 296, -60]
4131f0J92l5o5K29j38q2J12j20L6l7O1k35Q3J17J51j44K8k10Q4k6j2K60r3K4l73
4156b53J60K5K6K8J17k30P9K1J00k06J51O8p4P2k93K57qK08l28P2N3P2j68K10
4180A59l53J41k7L37m31J79Q6l37L01O5j51k21M46k08k2K58M8l04J26j34J76j32
4202Br3J17j96J39p7k9n4J80j5j72J15m6L33k04J9j9l3P1K6k96K37j36K60j46
4226a7nj0j23K94m3Nj78N8q6K48Lj8j45l15M17r9K11k94Q5J68j3j80O8l1Q5k54
4252a69K89j50k2K02N5j84qp4J37L0j46j50P1M9m0N4MQ9q7J69k0J11k51K3q1n3
4278a52J65m6N0R5q7M9Rq2k29kK01L8K88m51J61m2J50n2j76J56k2j71K40N7j94
4303d7kJ3n9J53m2j45L62k3j40nk22j10L82j03k1k3L2j02l9L31l00R0k42K76K
$$ y = [-60, 132, 97, 32, 261, 123, 41, 153, 33, 69, 32, 93, -142, -59, 58, 209, 65, 93, -117, -33, -59, -71, 189, 96, 120, -253, -93, -68, -42, -14, 103, -127, -48, -27, 73, -133, 18, 86, 12, 84, -209, 48, 40, 248, -80, -8, 45, 117, -51, 159, -194, -53, -80, 257, -174, 5, 91, -246, 55, 120, -31, -252, 194, -14, -36, 222, 270, -34, 92, -42, 134, 2, -91, 26, -170, -31, -108, -137, -191, -11, -26, -198, -83, -129, 204, 0, 19, 0, -33, 38, 64, -232, 5, -131, 129, -17, -22, -32, -155, 139, 96, 101, -77, -19, -105, 143, 146, 128, -17, -332, 85, -14, 197, -97, -12, 156, 143, -37, 31, 0, 85, -169, 120, -30, -52, 150, 205, 21, 13, -61, 76, 106, -40, -190, -119, -70, -110, -56, -52, 37, -50, 119, 99, 210, -41, -18, -99, -152, 13, -33, 17, 112, 25, 74, 83, 1, -228, -230, -29, 9, 297, -154, 7, -35, 115, 63, -113, 43, 21, -150, 90, 147, -47, -49, -36, -95, 58, 16, -129, 233, 210, 70, 65, -157, -267, 115, 12, -9, -32, 0, -102, -141, 190, -110, -20, -262, 14, 16]
4328A6j1jj88J78j79M28k69R0j27J28q5K4J18j75o4PK19m22M57l05J52k8j42K67
4352H8M1j51q5K35l11N13k32l1J7j23J7j52R4J02p1q6J52n2km2R2J8P7q4m2r0
4378a08L19l45J82K04k99Q1J60l5n08K64P5R4J7m26L41J75j0j01j08R8k28O0K73
4401A75J06l62J44j76J50J0j22J60j51J9K36k16J34p5r3K44j75j14J98Rq4j18
4423a01J20K02j13j29o4K15M7l29P9M0M8q3K84l89L07r0R4j78j18L00j52o1J00
4446B9J09l79K88O7j77k64O05l55K41k60J06Jk12J38Q7j44Q1L8l7P6j04J98j56
4469b4K20p2j3j08k58K01m6K83j21m5Q3n1k2j97L57l16K52j07J88l76J88j39K76
4492A53j69J78L4p4k19Q3m0j77K55k31K49J01k87P2jn3O9J3J5j39J03K63q1j90
$$ y = [16, 5, 4, -184, -6, -185, 243, -26, 64, -63, 65, -20, 4, 122, -53, -117, -110, 109, -313, 144, -161, -9, -37, -179, 88, 129, -22, -107, 128, -183, 330, 98, 67, 84, -39, -22, -174, -80, 22, -49, -135, 17, -35, -37, -79, 13, 31, 108, 24, -18, -108, 211, -134, 48, 252, -47, 34, 194, 159, -349, -85, -10, 84, 101, -325, 16, 191, 181, 80, -28, 70, -158, -98, 175, 281, -81, 63, -113, 37, 47, -75, 85, -66, -47, 189, -27, 107, 32, -61, 183, 8, -106, 92, 101, 17, -101, 19, 221, 108, -21, -85, 130, 177, -152, -73, -33, 15, -68, 216, -173, 134, 44, 138, -40, -158, 142, -10, -71, 29, 138, -241, 47, 114, -63, -327, 278, -77, 164, -96, 10, 11, -201, -63, 24, -120, -39, -1, -38, 38, -66, 132, -24, 196, 124, 111, 3, -255, -54, -100, 183, 62, 17, 100, 49, 27, -170, 187, -129, 123, 16, 204, -172, 16, -123, 153, -16, 162, 196, 122, -97, -14, -54, -231, 24, -207, 42, 143, -144, -72, -73, -126, -57, -44, -29, -168, -65, 198, 117, -73]
4516g3J37K6m7j30K44k33J95o3Q3k24J91K25m10J97N0j21k3p1J76j32k43L93l4
4539A13M0k78L24j87j08K94j93n2J60l37K58j67J1K68p8J1j84P7qJ57k28j1J31
4562A3j32K36J11k90J43K8j19K27k82J42n6j17J31j41J05n5J78k11J62k14O6O2
4584a3J62k84Q8K28q2m8p0P8M7j31j05L23j23k02P4J62k3r8N4Q4r8l40K92M3k6
4609hO8j92J76p2O7r0K19j86J14l02L60j4k59K81j85j26L2O0J66m61L29q1J83
4632G9j12J54J2r9m4J60o0j19P4k25K34j0M5m06M63j62j31J93k6jpj73K68l25
4656b18K99j47J02Q8j23J07j27P7r8P9o1P3k03K69j19j05J88j23j12L99l34O4
4678b5R7n9k18J49J67j3k37J14j08M5R8K2N4O5j96O9k7J53L7k03J23l49P3J75
$$ y = [-73, 64, 90, 43, -87, 157, -76, 119, 56, 139, -85, 106, 331, -79, 118, 168, 47, 24, -47, 129, -3, -246, 147, 113, 153, -125, 199, 12, -96, 198, 5, -47, 113, -224, 34, -133, -122, 146, 68, 79, -105, -28, -36, 121, -107, -118, 13, -119, 117, 228, -62, 81, 109, -10, 217, -65, 77, 21, -96, 35, -106, -1, -56, 122, -89, 73, -141, -75, -13, 149, -135, -47, 181, 99, 51, -19, 59, 106, -25, -130, 193, 70, -132, -58, 104, 81, -17, 37, 121, 23, -317, -25, 18, -8, 60, -132, 44, -28, 39, -51, 168, -18, 96, -206, 154, 140, -119, 162, -23, -149, -117, -57, 109, -352, -23, -104, 79, -33, 121, 133, 34, -10, 150, 90, -29, 45, -180, 54, 44, 89, -317, 146, -16, -147, 46, 20, 19, 12, -161, 107, -218, 81, -66, 36, 124, 1, 108, -19, 58, -40, 39, -22, 51, -152, 117, -2, -107, 81, -42, -154, 245, -89, -25, 72, 13, -205, -56, 111, 98, -139, -25, -133, -88, 10, 32, 86, 151, -45, 24, -3, 150, 187, -16, 107, -242, -169, 6]
4702FM9J40k4q1p9k1J16j24N7j30Q5J0M1L27m45j80K80J0O0j08Q3JO9q7o4j32
4728a41J80m2J39p9l43J75J38q0J15j34K19r0O7j01j1j15J44mj50J43j95L19j20
4751C4o9P1n1L4j4ok68J63N0NK34k11k8k2J38j73j6K21p4q9N2l19J37L17k59K86
4777A43k82O4J92k43J35N5n5J63j39K97l19J03k3J7m9m3j46K37j47O9q3N2KJ36
4801A36k61J68O3k51L50k73J51l9j04p4J21n8N5J82k89K88k06n7J15J86k71J21
4823E3N6j73J80r2o5K80n42L78QL15l46M1j6j40P7j59J19p3K4j24K44N4k32L46
4847B13l20O4j44K89j33p6M9R1Qn0j15j72K35J05k8k9k08J63j2q1l1M09k20l14
4871c07K53J27J2k56R4R7p3Pj19N3J97K9k81J73Nj38O6K8J24j07K3J6j98J81J18
$$ y = [6, 55, 195, 171, 90, 11, -10, 106, -18, 39, -91, -6, 4, 45, 372, -73, -253, 27, 37, 97, -11, 72, 73, 142, 55, -9, -141, 39, -3, 136, 57, -286, -111, 27, -53, 62, -72, 147, 57, 124, 23, 12, -103, 41, 37, -113, 30, -165, 154, 34, -35, 36, -15, 19, 5, -1, -269, -106, -56, -51, 183, -28, -56, -78, 60, -113, -129, 92, 18, -71, -19, -338, -201, 116, -143, 143, -139, -75, 117, -126, 9, 64, 9, 172, 33, 330, 11, 114, 91, 108, 59, 16, -130, 107, -40, 29, -54, -2, 0, 136, -125, 43, 106, -145, 205, -68, 83, 44, -60, -134, -13, -71, -16, 166, -123, 165, -41, -98, 17, 203, -68, 53, 109, -64, 116, 24, -41, 239, -303, 75, 83, 398, 52, 93, 77, -63, 14, -145, -26, -99, -75, -199, 45, 99, -133, 213, -107, -43, -187, 102, -31, -107, -58, 33, 41, -9, -124, -296, -61, 44, 16, -13, -221, -58, -70, -151, -182, 227, 7, -307, -54, 73, 85, -171, -77, 20, -53, -46, -165, -112, 85, 114, -167, 6, 11, -127, -61, -33, 91, -16, 7, 23, -175, 6, 124]
4896A24j21J62J9k40J25N2k27M12m82L13m4j23p3j4J46J31j53k3j31J44J33m8
4918H2N7k61J38J08k40Q4J28j62KJ4n9K66j85Q6O6j89K37j96J43k57K54N3j01
4941F8j14R8j78Ro8N6K26o6q6J02R2k30K14m09O6L15M2j27m9J0l4O7j30J86j52
4966i2J73l3k55J89k2N7K30j04j39l21K20L5J9Q4j77M16m08J3J49J89Qj38m6o7
4990b0o2M8J10k3l0O1r9J18KK6k81OL70l81J09O6K5k32K57J10l20k9J18k1j54
5015b26P7J07K53k82kM7r5K02K8kj70Q5k0pp1j29L73n6j08j5kL09k31j14L74j01
5041B24l86L18l30Q7K90q4j91J74K4j56J02k91K32p0J43J18j68k1j80K12p3m1
5063f7J80j38O4J20l82R7J36J99l16K47k2r5o6Rn5M6k8R8O7j91O1o1M9ml1M11
$$ y = [124, 3, 165, 184, -56, 69, 121, -106, 306, -176, 137, 93, -30, -103, -117, 29, 160, 7, -16, -147, -3, 130, 82, 139, -122, 16, 124, -116, -32, 96, -66, -64, -50, -109, 157, -28, 58, 124, -65, 172, -24, 119, -138, 116, 169, 68, -46, 52, -126, -117, -185, -129, 97, 31, -55, 47, 139, -91, 123, -286, -220, 95, 137, 10, -39, -29, -63, 4, -126, 60, -92, 81, 48, -207, -18, -40, 17, 247, 143, 4, -317, -97, -62, -43, 41, -136, 280, -128, -115, 34, 223, 231, 93, 47, -20, -82, -34, 76, 53, 23, 84, -15, 103, 105, 131, -150, -144, 226, -155, -46, 20, 45, -187, 70, 180, -140, -169, -51, -72, -226, -149, -42, 211, -71, -73, -26, -121, 81, 109, 107, -63, 22, 2, -5, -76, -205, 168, 112, 4, -11, -13, 296, 65, -49, 325, 224, -162, 156, -174, -87, 203, 119, -72, 102, 126, -30, 72, -219, 13, -57, 86, 204, 36, 15, -165, 47, -26, -67, 113, -25, 39, 159, -223, -126, 10, 209, -107, 140, 118, 23, -43, -34, -89, -43, -71, 27, 94, -97, -36, -97, -48, -52, -83, 328]
5089C28k15n1%o0Kq7l1n5K53j43K67k59po7j7J36R5O6l6o3Mo7M7k77K96J82j23
5116A18n5P1k05O0J37j15n4M6Q5o0k7k06J12J66k70J0R5L18l96L60q3j61K8n7
5140h3Q4j71R6J57l8o0L1k7r9p0K36j50K00j34O1N3L1l7j92N7l3N9J36N0j69L5
5166B3m1J89j55n1j7Q6m5l1j43K7L00j3j66m7J53J30l19J75m6%j46K56p9k36J95
5191ao2J04N2L5k3k40L37p8l5l83K45j19Q3M6p8Q9n0l3O7O7o8j22K01M4k66L28
5217A40k54O4L8P3L6j13r8L14l08J05M6j54P9J93j74m2j2k1K62k52k1N7J89j82
5241c5m8R4k07J72J20j52N1J4rm5L13j55j40J44j74J0L4P8j41O9q4R3M3Pj37k6
5267a11R4J50N3k29J15j10k9K50p1n9j56K26l12J06O0k93K57J51j92J97n6K49
$$ y = [328, 113, 62, 62, 2, 4, -83, -114, -169, 84, -59, 208, -51, -58, -125, -142, -6, 89, 155, 119, 56, 60, -7, 40, -237, 59, 241, 118, 63, 134, -71, -11, 126, 11, -43, 3, 88, 28, 1, -205, -93, 73, -197, -187, -92, 226, -170, 190, 107, -54, -26, -83, 1, -170, -74, 83, 45, -15, 16, -11, -110, -180, 56, -94, 106, -28, 33, 86, 117, 80, -112, -55, -88, -29, 107, 157, -12, 23, -18, 171, 16, -35, -52, 34, -11, -42, -185, -158, 142, 129, -37, -84, 69, 199, -120, 55, 9, 9, -137, 119, 40, -196, -1, -63, 41, 93, 128, 105, -135, 202, 124, 89, -294, -49, -168, -85, -39, -117, -28, -78, -111, -44, 23, -45, -167, 34, 78, -188, 140, -114, -50, -12, 61, 97, -16, -114, 200, -108, -3, 43, -111, -32, 161, -13, -55, -67, -88, 174, -78, -99, -42, 147, -35, -83, 11, -196, -24, 96, -56, -5, 9, 0, -45, 268, 113, -27, 117, -57, -47, -13, 65, -76, -7, -91, 2, 45, 52, -85, -111, -17, 133, 186, -43, 72, -38, -67, 183, 112, 53, -103, 123, -189, -83, -23, -316, -59, 92, -100, 97, 41, 290]
5289B90m04j34N98m02O4K13l17j38K41k5M4r3J59j07J77j34l3J14Ml5j76L08k14
5312@k72K01J06N9j95K22j38k17K10J8K70l90K42l5o1j09O3j95K1K57j68J01q
5335a8r9J72k33K29o7k13L57k55J05j2p0K4j4J84k1mq6O5J7J5j17o0N3P9j32l9
5361a40M8K37k15o4K31P6k89L33k37N1k30O1PQJ70l7O7j8M6k39o4J74M1j47J35
5386Em0K46j13m8oK0N2k33OR3Q6R4j46r5J5m2J9K30m5P3k00NM5m2J12K1M0k83
5414a31M9J52J19l93M77k86k4p7O5K2N4O2mj79k7K4J38j33j91L05q7n5q4M63m23
5439a64J64j76K20j38K35j36K40k43l3J20o8j35K45k61J28k5l4J65J83l55J20
5460E2m0%J78k42j49K16r0Q9oJ08O1l29k8J81K44k03m3R9p2p6K27j14j6j55K55
$$ y = [290, -114, -248, 350, -52, 12, 225, -92, -230, 11, -14, 30, -63, 96, -11, 166, 32, -1, 113, 117, 82, -94, 214, 0, -272, -71, 35, 94, -101, 121, -17, -234, -24, -6, 264, -126, 116, 81, 20, -89, -26, -221, -200, 57, -111, -10, -18, -117, 55, -178, 51, -16, -229, 128, -127, -22, -34, -104, -80, -94, 90, 69, 65, -21, 44, 61, 76, -41, -101, -48, 31, -101, -140, -92, 145, -70, -134, 97, 173, -116, 217, -20, 31, -199, -138, -131, -123, 47, 10, 77, 59, 105, -134, -198, -24, 17, -130, 5, -35, 211, 98, 50, 44, 64, 116, -117, -111, -18, 68, 162, 16, -79, -64, -106, -87, 143, 98, 171, -29, -24, 21, -21, 91, 112, 152, -131, -82, 70, 189, -204, 273, -13, -37, -114, -49, -27, 27, 89, 85, -94, -121, -97, 41, -92, -283, 22, -65, -120, -204, 259, -164, 0, -176, 44, -94, 141, 5, 245, 2, -31, 89, 21, -114, 131, -130, -2, -27, -61, 104, 287, -68, 52, 12, 12, 190, -52, -201, 15, -75, 14, 8, 116, 177, -152, -180, 1, 245, 42, -1, 98, 26, -50, 177, 63, 47, -108, 147]
5485A47j52LL8L5n3N1O2o9m6P2j34R0k70K80j57q5K29j5k89L20j66j13K88r2K3
5510cK5LJ6N1j32lJ42j43o8M38l77M7O3o9Q4j3J22j26j1P3J04o0k42J80j82L29
5536B48k39N4N9l26J48kK62q9j58k6J78J20k63j64N4L4N8K16j86j09P0M24m29
5559f6j37L03J22j97p0k06N21l03K33l5k23O5j34J15J99j71J37j83o5L23j73%
5581E5j55K35Q5k0n6r3r1K6j16J45M4R9k43M4N4j35J63j47J42j6m6J71k63J35
5605A7o0L4P9j32J03J5O4p8p1J6Q2j70k8m6Q7J40N6j25r4K19r5o8M4q4k1K63j59
5632a2m5N5J38l57J42J5J51j01M4K8j90K99l82qL17j13J66r3l5k54M04j88o0M9
5656c0K57m41J91O1K9K40l84J29j50K14L7j13K5o5l4P4J02r1l6K8k35K53j42j09
$$ y = [147, -5, -2, 36, 71, 18, 69, 131, 62, 16, 88, -46, 44, -226, 54, -103, -188, 41, 26, -263, 57, -109, -222, 66, -26, -3, 22, 25, 41, 92, -40, -43, 99, -44, -112, 326, -51, -4, 59, -10, 74, 61, 183, 57, 46, 119, 223, 163, -79, 101, -81, 248, 9, 63, 122, -204, -56, -58, 204, 115, -43, -69, 109, 229, -34, -198, -144, -110, -52, 164, -22, -131, -61, 363, -66, -203, 100, 222, 25, -45, -251, 270, -33, 200, 165, -58, 7, -127, -12, 187, 16, 153, -30, -95, 228, 55, 55, -100, 135, 220, 200, 144, 51, -40, -14, -130, 15, 59, 158, -85, -41, 13, -122, 41, -106, 36, 20, -26, 145, -118, 17, -43, -9, 70, -62, 41, 56, 120, 42, -29, -13, 69, -101, -129, -175, -88, 52, 108, -17, -111, 108, 13, -55, -11, -95, -116, 147, -12, -57, -2, 136, -221, -79, -64, 87, -14, 30, 58, -132, 167, -215, -223, 94, -19, 147, 54, 19, -235, 169, -19, -79, -30, 227, -214, -23, 38, 67, 307, -77, 52, -98, 116, 153, 40, 65, 0, -34, 40, 142, 51, 15, 43, -192, 61, -81, -190]
5680a90J96J40j93o9J23o8K8K6k38J21J65p2J6O6N8R8k54J06l48J99P6J07p4N8
5704G7J41k46P9l24J11P1O3k71K74l9K56rk01PJ04j80R6J63j18l3P6k36J76P5
5728A12J9j3j87K8LJ96j54K19k86j68L30j2j77K28l37K74k2m9K12k66r1J69j38
5751a10j5Q6j03J20j5k29J28R5J77K5r3p9j95N10m55J72j24J3q3p6K75K55l25
5774d6M1j46K01j53l7J65MM1q8p8N6J25J9j39J47k19R7K4j67K9J71N9M4j89r0
5799a29M4J41P9j32q2r4J38J04N9j07J1q7jJ32J02l26J72ML3N7k08J3L1Q6J12
5824A52l59K48J26k28J90j9j54J62k30K28j13L2j3j89j1J02m2J74n2L2J66l56
5846a54J27p1L8q4L65k10j8Q3J4j19k30K93K2m1n9J94j1j01l7Pp0j22K80k73l7
$$ y = [-190, 6, 146, -47, -116, 7, -61, -33, -7, -245, -124, 41, -31, -15, 51, 109, 207, -47, 59, -289, -90, -14, 93, 19, 77, 218, -28, 51, -273, -162, -91, -28, -299, -25, -64, 192, 183, -18, -11, 93, -87, 9, 172, 54, 21, 97, -139, 37, 112, 131, 118, -69, -41, -38, 158, 4, 223, -63, -231, 99, 87, -90, 138, -199, 75, 53, 4, 216, -50, -141, 28, -110, -125, -39, -142, -22, -37, -266, -138, -43, 134, 159, 66, -13, -208, 302, -153, 19, -105, -92, -175, -251, 24, 279, -46, -5, -151, 50, -103, -140, 25, 29, 70, -18, -96, -40, 85, 104, -35, 112, -107, -10, 14, -153, -124, 47, 106, 150, -39, -129, -85, 56, 135, 3, -79, -173, -35, 69, 128, 21, 32, -55, -56, 76, 178, -148, 24, 28, 61, 118, -90, -77, -46, 40, 152, -207, 41, 167, -61, 129, 110, -44, 118, -112, 116, 3, 35, 22, -167, -178, -76, -118, 56, 4, 36, 202, -154, -27, -98, -60, -144, 221, 11, -7, 76, 90, -29, -259, 34, 56, 15, -44, 150, 139, 38, 1, 8, -62, -184, 96, -177, -214]
5871b14P2J71J10q7n5q4N0Rp7j60M32R1m01L67j26n6L2k82J7J87L7j02j57J89
5895c7M4J33j31pJN2M2k8o0o2j35K41O3k62J95r8K30k68J3J46j06K83p9r6m6j70
5921a42J19P4j36J62p0l6K73k31JQ9k43K4K79l09L16m4j37j09L0O2R6N0o9k2K2
5946D9m3M8P2l98K29K2r4J96r0O5j04J56mL9j90J39K2o4J70j95l8P9j58J11k4
5971ek00J17Q3Q2j0R3j34R0j38k20J63Q7J30k52L9K18m6jr3M1j93J47r0J58r0
5996b4R7o3J41m24K44%Q6j37r1M34j72j02l19M19p6J38k65L7J97j70J03j59p0
6019a76K41J02q7P7k25l4J34J36j67j6l6j44J11K48Q5l79J87k21J43j06O5j99
6041b61J76K5p3K50n1P0j28P1j96K23l41Q8r0O0J36J98j46j82L82r2j37j05k4
$$ y = [-214, -142, 29, 139, 52, -3, -87, -37, -28, -105, -265, 167, 258, -143, 224, 98, 42, 74, -208, -191, -4, 33, -69, -226, -37, 7, 140, 9, 2, 3, 55, 97, 69, 9, -53, -188, 53, 116, -146, 49, -49, 181, -87, -74, 72, -34, 249, 170, 74, 28, -142, -23, 51, -85, 77, 7, -29, 244, 13, 14, 103, -140, -116, 163, -146, 170, 126, -11, -120, -90, -28, 68, 118, 49, 27, 49, 6, 54, 126, -272, -43, -21, -115, 81, -9, 56, -48, 108, 104, 143, -47, 92, 114, 50, 220, 25, -13, 66, -92, 19, -5, -205, -88, -5, 77, 67, 160, 26, 116, -22, -242, -79, 8, 138, -114, -75, 143, 97, 96, 3, 44, -149, -2, -92, 66, -24, 73, 10, 151, -273, -29, -29, 57, -80, -171, 263, 91, -11, -330, 89, 13, 151, -114, -77, 120, -50, 53, -106, -176, 65, 167, 80, 157, -68, -102, 32, 168, 1, -15, -51, -195, -84, 164, 249, -130, 57, -164, -21, -127, -62, -261, -85, -60, -133, 117, 66, 136, 8, 79, -117, 106, -235, -147, -237, -177, -41, 157, 11, -171, 211, 119, -18, -123, -147]
6064a47N1p3J72J98k87j49K97L5k05K46K2k26R2k44K15j19J72q7M5p8N5N2n4j63
$$ y = [-147, -96, -169, 3, 201, -86, -235, 62, 97, -108, 138, 160, -66, 26, -218, -3, -122, 50, -37, 8, -70, -15, 37, -17, -180]
$$ [...]
8191B3
##END NTUPLES=NMR FID
##END=
