##TITLE=1H_SR115_k
 DMSO-d6
 8 sc, 
 4.07.2022
##JCAMPDX= 6.0         $$ Bruker NMR JCAMP-DX V2.0
##DATA TYPE= NMR FID
##DATA CLASS= NTUPLES
##ORIGIN= UXNMR, Bruker Analytische Messtechnik GmbH
##OWNER= root
$$ XWIN-NMR		Version 3.5
$$ Mon Jul  4 14:47:12 2022 Russian Standard Time (UT+4h)  she@DPX200
##.OBSERVE FREQUENCY= 200.1313499994
##.OBSERVE NUCLEUS= ^1H
##.DELAY= (6, 6)
##.ACQUISITION MODE= SIMULTANEOUS
##.ACQUISITION SCHEME= undefined
##.AVERAGES= 8
##.DIGITISER RES= 18
##SPECTROMETER/DATA SYSTEM= spect
##.PULSE SEQUENCE= zg30
##.SOLVENT NAME= CDCl3
##.SHIFT REFERENCE= (INTERNAL, CDCl3, 0, 15.7039)
##AUDIT TRAIL= $$ (NUMBER, WHEN, WHO, WHERE, WHAT)
$$ ##TITLE= Audit trail, XWIN-NMR		Version 3.5
$$ ##JCAMPDX= 5.01
$$ ##ORIGIN= Bruker BioSpin GmbH
$$ ##OWNER= she
$$ F:/spectra/data/she/nmr/H-F/1/audita.txt
$$ ##AUDIT TRAIL=  $$ (NUMBER, WHEN, WHO, WHERE, WHAT)
(   1,<2022-07-04 14:46:14.65 +0400>,<she>,<DPX200>,
      <created by zg, POWCHK disabled, PULCHK disabled
       configuration hash MD5:
       00 E9 B6 7A A2 85 ED C7 34 08 36 98 17 FE 4E 26
       data hash MD5: 16K
       BD 61 1A DC E1 F9 E6 28 35 21 74 6C 6B 6B 9D 2A>)
$$ ##END=
$$ 
$$ hash MD5
$$ C3 ED 36 FA A4 30 75 B5 A6 11 37 10 26 79 7F AC
##$RELAX= 
##$RELAX= 
##$RELAX= 
##$RELAX= 
##$RELAX= 
##$RELAX= 
$$ Bruker specific parameters
$$ --------------------------
##$DU= <F:/spectra>
##$EXPNO= 1
##$NAME= <H-F>
##$PROCNO= 1
##$TYPE= <nmr>
##$USER= <she>
##$AMP= (0..31)
100 100 100 100 100 100 100 100 100 100 100 100 100 100 100 100 100 100 
100 100 100 100 100 100 100 100 100 100 100 100 100 100 
##$AQSEQ= 0
##$AQ_mod= 1
##$AUNM= <au_zg>
##$AUTOPOS= <>
##$BF1= 200.13
##$BF2= 200.13
##$BF3= 200.13
##$BF4= 200.13
##$BF5= 200.13
##$BF6= 200.13
##$BF7= 200.13
##$BF8= 200.13
##$BYTORDA= 1
##$CFDGTYP= 0
##$CFRGTYP= 5
##$CHEMSTR= <none>
##$CNST= (0..31)
1 1 145 1 1 1 1 1 1 1 1 1 1 1 1 1 1 1 1 1 1 1 1 1 1 1 1 1 1 1 1 1 
##$CPDPRG= <>
##$CPDPRG1= <>
##$CPDPRG2= <>
##$CPDPRG3= <>
##$CPDPRG4= <mlev>
##$CPDPRG5= <mlev>
##$CPDPRG6= <mlev>
##$CPDPRG7= <mlev>
##$CPDPRG8= <mlev>
##$CPDPRGB= <>
##$CPDPRGT= <>
##$D= (0..31)
0 1.2 0 0 0 0 0 0 0 0.06 0 0.03 0 0 0 0 0.0002 0 0 0 0 0 0 0 0 0 0 0 0 
0 0 0 
##$DATE= 1656931574
##$DBL= (0..7)
120 120 120 120 120 120 120 120 
##$DBP= (0..7)
150 150 150 150 150 150 150 150 
##$DBP07= 0
##$DBPNAM0= <>
##$DBPNAM1= <>
##$DBPNAM2= <>
##$DBPNAM3= <>
##$DBPNAM4= <>
##$DBPNAM5= <>
##$DBPNAM6= <>
##$DBPNAM7= <>
##$DBPOAL= (0..7)
0.5 0.5 0.5 0.5 0.5 0.5 0.5 0.5 
##$DBPOFFS= (0..7)
0 0 0 0 0 0 0 0 
##$DE= 6
##$DECBNUC= <off>
##$DECIM= 32
##$DECNUC= <off>
##$DECSTAT= 4
##$DIGMOD= 1
##$DIGTYP= 9
##$DL= (0..7)
0 120 120 120 120 120 120 120 
##$DP= (0..7)
150 150 150 150 150 150 150 150 
##$DP07= 0
##$DPNAME0= <>
##$DPNAME1= <>
##$DPNAME2= <>
##$DPNAME3= <>
##$DPNAME4= <>
##$DPNAME5= <>
##$DPNAME6= <>
##$DPNAME7= <>
##$DPOAL= (0..7)
0.5 0.5 0.5 0.5 0.5 0.5 0.5 0.5 
##$DPOFFS= (0..7)
0 0 0 0 0 0 0 0 
##$DQDMODE= 0
##$DR= 18
##$DS= 0
##$DSLIST= <SSSSSSSSSSSSSSS>
$$ [...]
##$SUBNAM2= <"">
##$SUBNAM3= <"">
##$SUBNAM4= <"">
##$SUBNAM5= <"">
##$SUBNAM6= <"">
##$SUBNAM7= <"">
##$SUBNAM8= <"">
##$SUBNAM9= <"">
##$SW= 18.0517283424941
##$SWIBOX= (0..15)
0 0 2 0 0 0 0 0 0 0 0 0 0 0 0 0 
##$SW_h= 3612.71676300578
##$TD= 16384
##$TD0= 1
##$TE= 0
##$TE2= 300
##$TE3= 300
##$TEG= 300
##$TL= (0..7)
0 120 120 120 120 120 120 120 
##$TP= (0..7)
150 150 150 150 150 150 150 150 
##$TP07= 0
##$TPNAME0= <>
##$TPNAME1= <>
##$TPNAME2= <>
##$TPNAME3= <>
##$TPNAME4= <>
##$TPNAME5= <>
##$TPNAME6= <>
##$TPNAME7= <>
##$TPOAL= (0..7)
0.5 0.5 0.5 0.5 0.5 0.5 0.5 0.5 
##$TPOFFS= (0..7)
0 0 0 0 0 0 0 0 
##$TUNHIN= 0
##$TUNHOUT= 0
##$TUNXOUT= 0
##$USERA1= <user>
##$USERA2= <user>
##$USERA3= <user>
##$USERA4= <user>
##$USERA5= <user>
##$V9= 5
##$VALIST= <valist>
##$VCLIST= <CCCCCCCCCCCCCCC>
##$VD= 0
##$VDLIST= <DDDDDDDDDDDDDDD>
##$VPLIST= <PPPPPPPPPPPPPPP>
##$VTLIST= <TTTTTTTTTTTTTTT>
##$WBST= 1024
##$WBSW= 4
##$XGAIN= (0..3)
0 0 0 0 
##$XL= 0
##$YL= 0
##$YMAX_a= 43110
##$YMIN_a= -72104
##$ZGOPTNS= <>
##$ZL1= 120
##$ZL2= 120
##$ZL3= 120
##$ZL4= 120
##$ABSF1= 10
##$ABSF2= 0
##$ABSG= 5
##$ABSL= 3
##$ALPHA= 0
##$AQORDER= 0
##$ASSFAC= 0
##$ASSFACI= 0
##$ASSFACX= 0
##$ASSWID= 0
##$AUNMP= <proc_1d>
##$AZFE= 0.1
##$AZFW= 0.1
##$BCFW= 1
##$BC_mod= 2
##$BYTORDP= 1
##$COROFFS= 0
##$CY= 11.3945322036743
##$DATMOD= 1
##$DC= 2
##$DFILT= <>
##$DTYPP= 0
##$F1P= 2.36226072786647
##$F2P= -0.459571619588291
##$FCOR= 0.5
##$FTSIZE= 0
##$FT_mod= 4
##$GAMMA= 1
##$GB= 0.15
##$INTBC= 1
##$INTSCL= 1
##$ISEN= 128
##$LB= 0.24
##$LEV0= 0
##$LPBIN= 0
##$MAXI= 10000
##$MC2= 0
##$MEAN= 0
##$ME_mod= 0
##$MI= 1.114404
##$NCOEF= 0
##$NC_proc= 0
##$NLEV= 6
##$NOISF1= 3.799351
##$NOISF2= 2.8
##$NSP= 1
##$NTH_PI= 0
##$NZP= 0
##$OFFSET= 15.70392
##$PC= 1
##$PHC0= -18067.85
##$PHC1= 26.60069
##$PH_mod= 1
##$PKNL= yes
##$PPARMOD= 0
##$PSCAL= 0
##$PSIGN= 0
##$REVERSE= no
##$SF= 200.130013532006
##$SI= 16384
##$SIGF1= 3
##$SIGF2= 2
##$SINO= 400
##$SIOLD= 16384
##$SREGLST= <1H.CDCl3>
##$SSB= 0
##$STSI= 0
##$STSR= 0
##$SW_p= 3612.71676300578
##$SYMM= 0
##$S_DEV= 0
##$TDeff= 0
##$TDoff= 0
##$TI= <>
##$TILT= no
##$TM1= 0
##$TM2= 0
##$TOPLEV= 0
##$USERP1= <user>
##$USERP2= <user>
##$USERP3= <user>
##$USERP4= <user>
##$USERP5= <user>
##$WDW= 1
##$XDIM= 8192
##$YMAX_p= 0
##$YMIN_p= 0
$$ End of Bruker specific parameters
$$ ---------------------------------
##NTUPLES= NMR FID
##VAR_NAME=  TIME,          FID/REAL,        FID/IMAG
##SYMBOL=    X,             R,               I
##VAR_TYPE=  INDEPENDENT,   DEPENDENT,       DEPENDENT
##VAR_FORM=  AFFN,          ASDF,            ASDF
##VAR_DIM=   8192,          8192,            8192
##UNITS=     SECONDS,       ARBITRARY UNITS, ARBITRARY UNITS
##FACTOR=    0.0002768,     1,               1
##FIRST=     0,             0,               0
##LAST=      2.2672688,     0,               0
##MIN=       0,             -72104,          0
##MAX=       2.2672688,     43110,           0
$$ Real data points
##PAGE= N=1
##DATA TABLE= (X++(R..R)), XYDATA
0 0 0 0 0 0 0 0 0 0 0 0 0 0 0 0 0 0 0 1 -8 8 -8 8 -8 9 -16 16 -16 24 -24 31 -32 39 -41 48 -56 63 -71 79 -87
39 -87 96 -107 120 -131 146 -162 179 -198 219 -243 266 -292 322 -356 391 -433 480 -533 592 -661
59 -661 741 -841 959 -1109 1299 -1560 1930 -2509 3544 -5991 27401 -8370 -28855 38265 43110
74 43110 19922 7703 10160 14720 23335 3576 -5298 15122 11127 -24334 -16064 13224 1706
87 1706 -25237 -21994 -8834 303 -4483 -25141 -25871 5437 9383 -18422 -17844 5434 4214 -4530
101 -4530 1230 5947 6361 5558 -3089 3579 26255 16378 -16585 -5015 30013 20997 -5496 -2113
115 -2113 8866 7211 6318 3768 -1943 -3 -2844 -11812 -3019 7667 -11601 -28069 -8121 8612
129 8612 -6309 -21246 -14459 -210 6291 -1561 -13571 -3855 14846 8536 -5396 4521 15842
142 15842 5996 -898 9234 16544 11077 -903 -6609 7473 20237 2968 -18555 -5696 12444
155 12444 1110 -13390 -7276 -1086 -4895 -8245 -7087 -1903 2372 -8798 -16262 1921 14862 -3964
169 -3964 -17463 -657 13400 5897 -4475 -5390 2982 12009 5890 -5067 2521 12578 1424 -5074
183 -5074 8312 11451 -2287 -6951 1610 7840 5409 -6349 -12965 66 10717 -3652 -14869
196 -14869 -3385 2952 -5171 -7119 -1255 -900 -3502 -4927 -3128 5693 6548 -6985 -9041 9572 15027
211 15027 -547 -6625 3120 10043 7394 1142 -2419 3028 6945 -544 -3354 4971 3750 -8368
225 -8368 -6314 5587 4483 -6090 -10188 -4510 4143 3461 -7792 -10745 1445 5407 -3584 -4717
239 -4717 2142 1487 -2944 -338 4995 5755 474 -4554 1012 11627 7400 -6404 -4899 8160 9016
254 9016 -634 -4674 -540 3102 1828 -1925 -2643 269 -1856 -6241 -2090 4151 -1875 -9911 -5432
269 -5432 4239 3815 -4128 -8049 -1839 6086 3847 -3783 -3039 4506 4386 -772 894 5210 2879 -1864
285 -1864 -121 5658 6275 -912 -5691 571 8235 3308 -5975 -4880 2325 2535 -2678 -3833 -1722 -1164
301 -1164 -2931 -2735 549 260 -4897 -6249 1098 5711 -65 -6352 -2477 4834 5798 129 -2954 836
317 836 5389 3461 63 1455 3223 1006 -697 2553 4508 103 -4522 -2081 3940 2771 -4327
332 -4327 -6708 -800 2969 -596 -4831 -3598 204 -661 -2717 -677 2025 -685 -4096 -765 5132
347 5132 3666 -2337 -3287 2369 6530 2671 -3031 -1270 3854 3921 184 -222 1271 1101 -419 82 1785
364 1785 865 -2591 -3667 1020 3544 -1789 -6995 -2730 2711 1508 -3480 -4404 -1230 1242 381 -1565
380 -1565 -758 798 -852 -1199 3058 4886 -416 -3342 1289 5575 4122 -387 -2213 1200 4216 1755
396 1755 -2338 -864 1479 -268 -1790 150 89 -2656 -3252 -1028 1043 -94 -3876 -4730 1093 4280
412 4280 -1352 -5100 -759 2624 1629 411 -186 -318 1126 1756 1378 2292 2171 -2014 -1644 4363 4639
429 4639 -1518 -3387 106 2455 2158 -983 -3666 -1314 2009 -668 -2593 -81 -237 -3314 -1481 1708
445 1708 -483 -2768 -2283 -808 2255 2554 -2949 -4206 2535 4750 -188 -1393 1111 1356 1484 2572
461 2572 1003 232 564 -390 460 3737 1787 -4281 -2430 2514 1917 -1632 -2824 -2735 -54 1387 -1575
478 -1575 -3630 -681 146 -2048 -66 1920 -1206 -2728 592 2430 1478 527 -1497 -531 4012 3574
494 3574 -1761 -1590 2285 2189 422 806 427 -1067 -30 708 487 177 -1430 -3559 -652 2753 -518
511 -518 -4513 -2390 448 898 -290 -1844 -2220 -20 1765 -31 -418 1029 108 -943 2079 3302
527 3302 163 -1386 685 2647 3081 1211 -1647 -1120 2783 2517 -1433 -1764 -112 -952 -1098 362 -911
544 -911 -2929 -2030 -995 -419 524 -1357 -3819 -1028 2894 399 -1824 -665 283 935 2648 1157 -1177
561 -1177 551 2551 873 1645 2448 -616 -1259 2507 3095 -773 -1461 -1035 -261 1507 768 -3391 -3103
578 -3103 695 -49 -2043 -422 -1237 -2829 -707 1351 -658 -1190 -841 -941 1487 3219 -413 -2272
594 -2272 1319 3135 1515 1534 665 -611 1661 3634 517 -714 965 -100 -943 1702 1181 -2747
610 -2747 -2213 135 85 38 -1221 -3654 -2105 1861 504 -2729 -1833 -66 -407 978 1243 -1247 -966
627 -966 1280 1581 1383 1824 198 -661 2283 3168 560 -420 284 226 1593 1822 -1164 -2292 266 859
645 859 -656 -666 -1195 -2507 -1015 595 -803 -2078 -1591 -1178 -203 1086 -303 -2101 -672 1623 1290
662 1290 278 492 -263 553 2396 1905 291 15 682 1099 1814 1424 -576 -1312 959 1638 434 -1034
680 -1034 -1596 -1432 0 -2 -1725 -1989 -1153 -580 -324 175 -707 -1720 -864 974 786 27 -376 -535 541
699 541 2297 1435 -601 -47 1494 1961 1461 726 -471 -199 1244 672 6 161 -714 -1133 175 1082
717 1082 -1184 -1931 -762 -44 77 -215 -1682 -1779 225 805 -431 -758 -420 -461 423 1291 254 -553 418
736 418 819 938 1636 878 -900 359 2086 1063 -139 -274 -218 488 1081 -91 -1294 -856 -279 -377 -246
755 -246 -421 -1806 -1593 -57 609 -643 -1141 -1093 -158 1198 662 -647 -559 752 1323 1029 828 266 -264
774 -264 1015 1412 1105 353 -457 -619 723 1227 16 -1351 -976 -30 506 39 -936 -1507 -343 417 -308
793 -308 -753 -948 -673 -43 417 299 -790 -1054 117 726 1089 250 -767 153 1273 1156 602 -266 178
812 178 906 1058 641 -210 -331 -234 142 661 -5 -1078 -1100 -472 366 -140 -1278 -1378 -817 126 317 -501
832 -501 -1016 -381 512 847 407 165 -261 197 1249 1226 374 -249 -16 918 1463 577 -672 -566 200 888
852 888 228 -740 -1058 -428 49 48 -395 -726 -1043 -302 97 107 -319 -1091 -519 689 841 -73 -682 -321 522
873 522 821 578 -174 -126 391 932 539 331 76 144 431 1161 710 -355 -680 -9 536 334 -651 -1413 -608
894 -608 272 232 -962 -1109 -835 -316 -22 -167 -357 -529 -461 173 878 644 -257 -572 380 1376 805 -24 -329
915 -329 379 1140 982 2 -448 64 321 131 303 -179 -817 -528 451 584 -434 -1098 -873 140 656 -350
935 -350 -1029 -488 337 325 -153 -70 -382 -354 500 784 86 -7 -348 -42 936 1203 -30 -835 327 1016 738
956 738 -36 -484 -300 597 481 -280 -612 -354 -512 -154 446 7 -930 -755 -218 227 410 -578 -1228 8
976 8 1304 183 -591 -241 181 370 684 574 -256 20 622 202 580 811 -537 -752 710 1124 -503
995 -503 -922 -346 150 577 270 -680 -710 210 203 -254 207 -587 -828 136 602 417 -304 -725 -686 869 1044
1016 1044 -453 -1107 128 779 416 297 -152 -412 444 718 25 -125 -161 -316 -250 948 497 -978 -851
1035 -851 173 439 256 -411 -1001 -197 538 3 -504 -523 -56 -80 217 490 -199 -687 -281 468 853 -25
1055 -25 -785 -322 800 1031 119 -496 -259 491 505 378 -138 -641 -344 127 181 246 -241 -954 -298 485 827
1076 827 -572 -1066 -68 683 295 -12 -504 -148 622 548 109 2 187 -271 324 1113 -76 -527 -151 259
1096 259 604 477 -229 -991 152 589 156 -469 -494 -84 233 568 101 -837 -153 5 156 501 274 -842
1116 -842 -533 549 399 -58 -309 -180 84 949 295 -619 -258 216 202 391 412 -715 -542 355 496 156
1136 156 -102 -650 -404 538 643 -547 -860 220 89 111 110 -423 -903 241 503 -76 146 20 -275 301
1156 301 705 80 -430 306 336 513 524 -175 -726 2 643 57 4 -270 -252 -198 549 45 -452 -391 -185 32
1178 32 512 -100 -802 -344 299 269 82 -391 -312 170 458 20 -428 -151 -36 460 569 381 55 -322 135
1199 135 434 301 -432 -236 -143 223 518 -156 -408 -155 429 133 99 -432 -386 -51 218 168 -319 -355 -289 -17
1221 -17 164 397 -362 -444 105 482 76 -29 -120 5 534 408 -123 -388 -50 -48 303 313 87 -342 -31 219
1243 219 622 -34 -353 -513 -26 450 221 -668 -189 27 338 39 -138 -211 -174 214 80 229 168 -245 22
1264 22 343 570 -73 -440 -128 220 376 78 -342 -286 224 204 -117 101 -194 -253 242 231 -305 -289 -223 -38
1286 -38 132 71 -190 -484 -183 413 215 -470 -318 -191 362 462 96 175 45 -121 232 400 48 -477 -129
1307 -129 253 421 40 -301 -489 145 389 1 -305 -488 -101 -11 157 120 -302 -200 -105 233 76 -109 -111 -488
1329 -488 212 347 61 -346 -124 355 524 175 -341 -301 152 264 233 35 -99 -254 173 354 159 29 -506
1350 -506 -218 597 84 34 -424 132 221 445 -20 -318 0 13 353 210 137 -84 -145 -133 163 235 -244 -324 192
1373 192 421 177 -204 -262 -104 366 199 39 -59 -151 -66 186 142 -167 -202 -150 78 464 69 -271 -260 385 494
1396 494 173 21 -15 83 154 69 -63 -252 312 88 59 205 -200 -384 -30 446 262 -41 -563 -261 153 40
1418 40 -219 -271 117 58 354 99 -77 -41 11 79 90 39 -152 -397 68 403 200 -338 -77 165 360 164 -222
1441 -222 -124 162 220 -236 33 -83 -63 -43 340 325 -241 -187 -300 213 347 58 -510 -253 130 520 -148 -181
1463 -181 77 49 138 184 193 -214 42 -93 299 438 75 -463 -134 212 378 -193 -238 -17 127 242 87 -379
1485 -379 -111 85 6 70 -59 -109 -473 74 209 310 -295 -287 -84 495 236 -372 -329 283 92 -51 24 -198
1507 -198 -94 108 278 114 216 -189 -358 291 438 -42 -290 -464 -154 110 206 -272 -450 454 338 -36
1527 -36 -125 5 -319 81 76 234 73 -183 -178 292 527 23 -508 56 245 165 -87 -392 -34 107 145 -157 -96
1550 -96 -34 -266 -131 208 159 -197 -292 -98 362 -78 -279 -392 25 509 93 -327 -127 204 56 172 241 -9
1572 -9 98 -147 227 523 -73 -350 -540 192 253 -109 -319 -422 258 373 115 -179 162 158 51 73 -91 -73
1594 -73 -318 148 234 221 -296 -258 -31 264 -61 -51 25 -27 5 154 99 -135 -31 115 215 72 238 -318 -494
1617 -494 303 -3 3 -320 -356 -28 304 345 -276 -110 -81 196 -37 -90 -210 -371 79 226 255 -49 -351 -82
1639 -82 439 292 -304 -139 -47 205 -26 61 -183 -212 206 54 135 165 -316 -295 221 283 -79 -253 -52 -54 86
1662 86 -13 -129 -429 156 47 108 136 5 -318 -161 69 257 65 -154 -167 210 361 -24 -215 -149 336 0
1684 0 -106 89 -215 -13 138 71 74 -319 -565 -240 269 305 -221 -279 296 170 188 -390 -362 14 385 114 -147
1707 -147 58 65 -125 -1 218 117 -336 55 244 383 3 -118 -396 490 173 -93 -46 -19 -135 15 128
1728 128 -71 -25 -117 -434 172 282 -7 -344 -52 329 -49 -242 -120 152 254 97 -9 -1 487 -168 -172 155
1750 155 237 -36 -182 -151 305 71 -325 -230 287 266 -48 -326 -220 132 341 -273 -188 142 143 -164 -204 371 180
1773 180 -317 -116 183 128 164 -298 224 494 64 -462 -344 30 216 -271 -47 244 273 -185 18 210 270
1794 270 -174 -403 -201 506 177 -253 -232 110 555 -274 -395 29 461 70 -279 -43 465 131 -575 -27
1814 -27 504 328 -593 -364 123 434 -86 -636 91 435 270 -129 -106 212 -23 -266 -128 479 157 -118 -315
1835 -315 307 286 -31 -717 -215 389 -35 -377 -245 304 -62 -17 -339 17 117 -174 -369 311 408 -165 -287
1856 -287 -114 607 505 -512 -364 429 360 -154 -286 197 313 -88 -155 129 331 -129 -354 -196 363 327 -303
1877 -303 -426 327 590 -248 -269 148 498 44 -432 -10 305 173 -314 -128 184 210 -243 -355 242 453 -94
1898 -94 -540 -91 305 222 -292 -183 361 148 -345 -212 165 -49 -106 -206 63 336 -201 -315 113 427 12
1919 12 -174 -274 344 336 -498 -352 120 493 -48 -288 121 278 -74 -520 -249 639 154 -339 -240 347 289 -102
1941 -102 -404 235 467 24 -506 -11 345 338 -180 -184 100 8 -257 -204 179 252 -126 -377 57 511 118 -428
1963 -428 -201 476 92 -192 15 312 121 -225 -311 281 260 -216 -128 195 444 158 -361 -100 129 406 -246
1984 -246 -461 89 301 53 -190 34 444 -123 -240 -70 264 164 -331 52 314 196 -305 -338 73 271
2004 271 -158 -441 -80 121 -56 -171 -172 261 217 -233 -145 229 251 -137 -270 80 292 22 -127 -299 242 402
2026 402 -244 -117 12 52 -59 -207 -10 255 -445 -142 -11 410 234 -485 -221 350 276 -238 -265 -11 186
2047 186 120 -53 -40 142 -140 -206 -15 211 -27 -318 52 262 230 -81 -321 265 323 -154 -286 -68 245 214
2069 214 -15 -177 258 92 -93 -157 166 163 -38 -369 82 415 -207 -399 23 138 277 -105 -227 231 226 43
2091 43 -157 108 3 -136 -101 254 190 88 -228 -45 309 165 -149 -29 79 210 -67 1 -22 53 9 6 -145
2114 -145 233 39 -380 38 284 54 -138 -336 -8 184 24 -90 -99 276 101 -221 49 178 95 -227 181
2135 181 62 -81 -165 -256 135 218 -150 -302 404 206 136 -54 -195 152 107 34 61 108 -130 -32 -376 294 148
2158 148 -195 -225 -8 233 -36 -12 -243 473 130 -53 -14 139 241 -191 117 12 126 -211 -29 105 212
2179 212 -140 -15 -158 17 86 -377 -99 -120 238 -27 -113 62 211 -24 42 -142 28 -19 -133 180 85 -30
2201 -30 -228 -89 -75 62 -31 -223 107 105 41 -277 -46 143 -97 -187 125 192 -210 -40 -248 -28 123 -183 -424
2224 -424 167 -80 224 -33 -46 -36 132 82 -114 278 71 -320 -42 49 192 131 -210 -7 29 157 -367 -48
2246 -48 274 462 -271 -186 107 58 -190 -286 87 10 -81 -273 -247 348 206 -223 -238 133 216 81 34 107 390 -183
2270 -183 -299 57 219 -125 -293 -196 -65 198 -298 -133 173 65 -100 -156 71 206 -69 -145 -24 -68 327
2291 327 -51 -91 39 122 102 -44 170 124 163 -9 30 148 194 -153 -177 115 323 73 -249 74 59 96 -77
2314 -77 329 142 -115 -205 -71 106 296 -87 -58 261 192 -49 -69 116 38 69 76 -155 91 330 -216 34 -34
2337 -34 -43 -119 -27 -55 105 -148 -361 -51 268 -27 13 89 24 104 168 -133 73 70 75 -108 19 51 -16 -175 16 193
2363 193 139 -127 53 135 290 -104 -50 24 279 30 -93 51 -31 52 -108 -40 132 154 -197 159 176 75 123
2386 123 -43 -348 -42 -9 12 79 -95 -11 -176 50 -153 -44 -84 -15 62 22 132 -327 155 224 181 207 -67 -39
2410 -39 232 -14 29 -130 -90 -141 -15 165 -63 43 -183 94 55 246 45 11 -52 88 61 0 83 7 85 -111
2434 -111 -172 -169 -69 0 -24 12 226 -133 -158 13 174 249 -75 -188 100 163 -220 -128 106 194 -91 -75 -75 242 54
2459 54 -157 -14 181 160 186 -128 235 -47 -71 18 99 72 181 83 -8 147 83 148 6 -108 -25 -269 27 161
2483 161 112 16 -227 -73 74 104 43 16 73 94 116 114 -54 96 199 -46 190 -41 100 133 78 33 98 -38 -2
2508 -2 34 91 21 -190 -70 -51 118 24 -16 -170 104 69 -14 -110 -47 -263 -132 196 1 115 -156 -141 88 223
2532 223 77 -172 -124 -41 6 71 14 -161 67 -54 98 114 -10 -62 -292 -41 -68 135 15 18 16 -70 79 -117
2556 -117 -151 -68 -42 144 271 -178 -131 19 95 195 -69 -53 -27 0 -72 17 -341 44 193 81 -21 -276 153
2579 153 191 -64 -103 52 169 278 -95 200 271 147 191 62 87 38 -202 47 31 153 206 119 -131 -2 -18
2602 -18 -82 -132 -38 116 -40 75 195 -45 -84 28 -125 39 -147 -133 149 -108 207 -183 -169 -95 94 103 169 -247
2626 -247 -20 67 -132 48 -31 64 -23 -98 129 142 56 -64 -42 204 -25 -201 -55 -56 80 108 33 88 -16 -35 27
2651 27 -62 -43 169 -16 -10 -31 -186 4 -93 194 41 69 -75 28 112 -152 64 93 57 -171 36 68 43 -9 -28
2676 -28 -44 -61 40 -120 -125 47 -127 25 -131 97 43 -86 153 99 -107 -220 -87 87 -120 55 296 70
2698 70 -124 167 -110 -21 -224 -221 26 134 -106 32 69 -115 97 -114 5 -129 155 35 62 1 -179 106
2720 106 -2 -144 -79 -22 114 -5 -74 70 21 -315 -135 4 -56 -77 -115 21 213 75 8 31 32 103 120 11
2744 11 -67 -108 -196 37 70 55 288 3 -81 -219 91 134 156 -54 -162 103 67 -121 14 69 -140 -69 84 63
2768 63 150 -127 15 10 89 253 -152 -81 -44 244 99 -111 -127 171 -88 -60 -24 19 78 136 66 -166 101 -15 172
2793 172 85 -148 -170 163 -127 53 -178 27 145 103 154 207 -14 -94 56 -67 -61 -127 -123 -4 -84 100 -211 -17
2817 -17 11 -87 213 47 -185 -32 75 -32 -274 -71 198 45 -1 202 22 -65 5 -27 -63 -28 6 -170 25
2840 25 289 7 -44 73 -14 -3 -66 186 -274 87 65 61 -39 38 292 -91 -245 14 146 145 58 -174 -175 183 -109
2865 -109 248 449 46 181 -2 52 75 -123 -88 74 -85 -103 -149 76 -129 -58 25 -228 -99 188 85 137 -4
2888 -4 -46 196 -236 152 14 -62 180 125 89 166 -149 69 -48 75 -241 74 -180 -166 297 275 -53 -86 97
2911 97 -50 56 120 -83 -7 -103 -291 -9 -21 -121 -26 -21 40 100 -164 35 -8 21 -80 -227 -33 188 -208 46
2935 46 -84 -5 77 -152 -51 -65 -81 10 -112 -69 72 -190 -144 -101 10 -27 67 27 -11 -38 87 85 204 110 -50 29
2961 29 -19 42 150 -93 -152 48 189 -78 95 94 113 1 0 -131 12 -120 -123 151 80 -78 124 -222 -27 41
2985 41 -144 152 31 57 274 -121 -121 119 89 92 -91 144 111 -75 50 19 64 61 129 -130 -283 -94 -54 89 135
3010 135 -28 46 52 86 -153 120 -171 138 -35 200 -76 -178 44 22 53 15 17 133 -17 -181 48 205 -139
3033 -139 -40 36 -225 17 19 133 15 45 -92 -128 161 -143 -222 -183 72 33 111 84 -80 231 212 -111 3 142
3057 142 -187 -162 -135 219 -99 46 -39 101 -146 -48 -84 -52 -60 83 16 90 -212 -107 -57 -54 29 105 -117 -126 -64 110
3083 110 -45 -44 -62 -28 117 115 47 -41 37 43 84 -241 -148 -24 139 -81 -163 -72 7 88 -17 -21 -76 180 -98 53 -267
3110 -267 -7 -11 111 96 135 170 -183 35 -124 -179 168 77 0 -134 62 249 43 98 -280 131 -45 -118 -63 -104
3134 -104 -18 24 -53 -71 91 178 236 -232 263 69 -106 -14 132 -49 4 46 162 19 -163 91 -69 -100 69
3157 69 181 -122 216 -32 178 -1 -125 42 63 -31 -67 129 124 -50 -83 -268 32 -79 26 136 20 26 53
3180 53 -138 -110 222 96 -95 -72 8 146 36 208 34 79 101 -24 200 -185 -105 94 -27 -105 -70 93 -222
3203 -222 -28 -67 144 19 60 89 -65 63 120 51 1 78 38 124 -5 143 72 -175 49 -207 10 -32 1 32
3227 32 -121 -127 -63 -46 -112 58 172 14 -121 384 -140 83 -207 64 65 -29 35 144 33 27 -143 188 -114 -40
3251 -40 170 -47 -145 -68 -89 -162 -176 17 125 139 33 72 -54 177 198 77 21 137 201 -139 45 -185 81 68
3275 68 -214 98 -220 -57 126 -45 -250 -168 13 -133 -87 15 -75 -68 -57 -207 100 -55 -37 41 -110 -105 -191 -199 233
3300 233 33 -39 -162 -60 267 26 -158 293 0 284 -141 -16 9 13 103 -207 -4 184 -62 11 -65 -125 -93
3323 -93 -62 177 96 25 -18 -53 -32 225 -69 5 -92 -339 -150 -115 -133 -184 139 73 -55 310 142 -60 -42 -52 191
3348 191 250 -16 160 -54 -41 95 -151 80 -4 36 67 -3 74 118 -283 139 21 -55 -15 54 120 -45 -215 12
3372 12 -180 -45 -156 10 212 194 99 204 -232 183 280 0 44 -90 -256 -43 -124 -111 46 -40 -117 -201 -19
3395 -19 107 40 -165 83 -76 89 -111 90 -54 -6 -141 48 109 100 119 245 -34 91 -276 -16 -88 209 16
3418 16 -64 -77 -116 -23 174 -79 12 17 -29 -272 56 1 -83 -43 15 -83 -86 -74 196 -187 -109 73 54 45 151 48 1
3445 1 309 -129 329 9 49 51 -120 48 30 -40 239 161 131 87 112 248 -137 25 18 -2 -117 20 -1 -120 -187
3470 -187 -89 27 -96 38 -47 -98 109 -98 -33 100 229 -141 -85 -149 -89 1 124 150 187 184 -27 180 73 -34
3494 -34 -111 213 7 65 -102 80 89 13 64 52 -188 148 -44 16 -123 -7 10 53 -8 -21 -70 193 142 -78 54
3519 54 32 13 -328 206 -20 -1 -21 73 146 87 -42 47 21 39 -159 199 -217 -138 -99 -76 -56 -178 229 -37 164
3544 164 -42 13 102 -20 171 -93 -157 230 98 27 55 -72 149 117 -248 108 -108 104 -44 -13 60 -51 85
3567 85 150 154 17 129 -85 99 41 31 -140 29 111 137 11 -50 -87 118 -74 -61 -67 0 -23 162 104 -98 32
3592 32 -141 -62 -40 245 -307 166 61 22 -255 127 174 133 -98 -113 42 -146 -161 108 -60 33 -179 17 26 -94
3616 -94 140 137 278 112 -109 -12 -138 -56 163 -56 -76 183 56 28 319 65 -12 113 14 24 -117 -92 65 -242
3640 -242 139 157 31 -99 -100 -137 12 59 -87 -121 -81 44 -76 60 -150 112 -19 -39 -21 -110 39 -13 145 68
3664 68 -28 247 -113 4 -60 55 27 137 -202 -38 -7 51 144 -78 159 -94 -41 3 69 116 171 -2 -76 128
3688 128 -184 76 26 54 140 67 -66 -12 3 229 -45 143 128 -143 76 166 69 211 -4 -140 182 -49 -70
3711 -70 433 221 36 56 -107 -136 76 -15 174 -308 130 -125 91 37 -132 56 -77 138 -53 136 80 112
3733 112 147 -225 -51 137 -15 67 -37 123 109 -87 -43 112 -112 7 134 65 74 -237 -8 -114 -82 -13 -48
3756 -48 249 -308 74 35 -189 -45 -85 -90 -112 133 62 -70 73 30 -13 -51 -120 -258 -135 -137 -126 16 333 -47 181
3781 181 -156 -57 -29 -74 74 -74 50 -75 30 -58 -143 69 -51 242 8 -18 45 47 -113 -44 236 113 131 58
3805 58 68 -75 -311 14 25 71 13 176 -249 66 11 -149 117 -60 -30 -124 120 -149 -154 -34 80 169 -95 -48
3829 -48 121 -114 -61 -111 -110 35 91 208 -47 -46 -167 -135 -186 74 -132 108 23 86 57 67 -9 -81 15 -184 -136 -182
3855 -182 300 -101 -47 24 -86 13 -123 116 -106 -51 -200 19 -90 -212 -28 172 144 -89 -352 126 71 24
3877 24 22 -188 75 -51 21 -50 50 -82 -6 69 61 -53 35 193 -19 41 -31 125 24 -112 -209 4 54 -210 -145
3902 -145 30 116 74 -2 58 144 -78 19 4 -140 302 -4 -113 -70 206 12 139 -29 245 40 82 70 -240
3925 -240 -105 -186 188 184 96 -119 119 47 123 51 -89 -164 22 14 84 -91 -73 139 -183 165 110 103 -143 118 138
3950 138 -76 -111 227 24 -129 -42 149 29 -167 233 -166 155 109 -28 -88 9 -14 17 194 78 -6 -74 33
3973 33 -184 -31 -108 -69 -106 -162 141 -13 85 -93 -132 58 3 77 -104 -61 -123 -198 66 181 100 246 -171 -140 -170
3998 -170 -144 203 84 -138 109 -77 -17 4 -22 -62 -53 -256 135 -31 72 29 154 -142 -168 34 35 140 6 16
4022 16 -91 179 -43 149 -158 -39 -19 50 -2 -238 -99 -14 264 -187 173 -69 19 -86 27 -49 -9 -103 -40
4045 -40 -140 30 -48 141 -10 -88 191 -54 -111 53 -242 -19 250 -8 -41 54 124 -2 18 -39 68 12 -4 -120
4069 -120 4 -5 61 102 -13 -164 94 110 70 40 -293 17 -118 170 14 14 207 -31 35 -159 43 36 -26 242
4093 242 22 179 -75 -131 -22 55 22 -95 165 52 -164 -100 -144 -6 108 -133 -79 100 126 321 -9 109
4115 109 141 -101 79 -38 -158 -46 18 -45 72 -3 119 -87 -9 64 90 169 162 -9 -56 110 258 315 -51 -100
4139 -100 -65 123 73 27 149 55 -71 -16 -238 -80 -135 150 134 -87 140 0 295 229 -9 -51 -71 -243 53
4162 53 -265 -133 296 -13 40 -56 -188 -106 -88 48 57 224 -122 -19 67 -23 134 -178 25 122 1 132 25
4185 25 -159 162 69 157 -10 86 128 -131 -23 52 -178 -65 -17 -30 -160 211 -125 55 -176 -189 -55 72 45
4208 45 171 -81 0 21 -280 77 11 163 20 46 11 146 37 131 -27 -64 -61 101 58 -60 214 -71 -51 -107
4232 -107 113 99 84 -145 289 48 39 6 -132 97 -72 133 -63 -73 54 -31 -3 -7 -112 130 5 -24 -46 61
4256 61 112 53 7 -44 -22 -57 -162 -9 -102 320 76 -44 45 73 -125 -16 315 21 25 -28 -62 -135 117 192 158 148
4282 148 114 36 -21 95 -244 112 -92 150 173 -2 31 -104 45 16 222 244 -132 104 -176 -91 250 -152 -112
4305 -112 84 17 -34 -126 -30 -93 151 7 74 123 68 -9 180 74 -41 -93 131 -60 -76 -99 -33 98 -155 -15
4329 -15 47 -89 -126 -61 142 73 23 64 14 -129 46 -60 -194 80 149 69 48 -69 -194 65 -37 55 -92 -56
4353 -56 -161 59 -69 169 97 -112 115 29 140 127 -252 219 -157 14 147 133 10 -122 40 -95 57 -156
4375 -156 -34 -37 60 -93 -16 -26 -137 -233 142 -113 359 -94 -187 -91 -256 126 -69 47 23 21 -170 99 53 -120
4399 -120 -126 89 -98 -19 53 88 123 86 37 -40 -341 -61 -145 29 163 113 46 -154 188 130 -343 61 39 286 -44
4424 -44 94 -128 -191 -70 -210 75 -107 139 -39 248 -37 89 65 -109 -30 -126 93 -80 -138 194 49 -102
4446 -102 -42 -40 -70 -240 85 19 -21 16 -81 3 -157 -38 57 -199 95 19 14 159 -105 -94 306 -154 -252 154 -134
4471 -134 -91 18 -68 23 -66 96 155 -34 -27 -2 -21 -148 168 222 44 -21 -306 219 -76 -98 236 107 -52 21
4495 21 91 -185 -97 -155 40 40 136 -51 122 -44 -84 231 -242 94 15 -16 43 -27 -3 43 68 -217 -61 -43 -24 45
4521 45 105 -106 18 -142 -44 -18 117 280 -68 187 -179 110 -101 -254 -41 117 50 -18 226 -74 235 5
4543 5 112 -76 200 155 32 102 4 30 -122 201 38 -57 45 88 35 212 68 79 -147 35 -61 9 130 -29
4567 -29 -41 57 -170 -14 189 -121 -160 303 -32 165 -208 93 46 -26 -254 3 180 136 -37 -131 164 66 458
4590 458 220 35 -181 23 83 9 15 -6 48 -19 -219 50 127 -84 14 -85 -283 30 -47 209 -92 -86 45 64 92
4615 92 -47 55 -126 249 13 75 227 104 -156 138 -61 69 136 -28 40 23 -308 264 208 100 169 36
4637 36 -31 62 -129 -130 -6 60 -133 140 2 123 -223 144 -13 -110 48 81 112 -49 -49 130 -67 -132 111 -82
4661 -82 111 46 39 168 75 -145 -170 -66 65 9 -69 -84 9 101 -148 33 123 -69 -37 32 -127 -130 46 74 124 46
4687 46 -111 -33 -19 43 -29 108 -90 -193 138 -90 85 37 78 -75 -67 171 91 105 157 92 -11 -58 59 157 10
4712 10 181 -91 95 -20 -170 -181 196 28 0 82 65 -65 -106 143 55 162 -155 -150 -69 76 -26 -53 53 -45
4736 -45 25 219 -79 83 127 -30 -43 27 36 163 -200 175 -58 143 -17 98 69 -39 -153 -81 148 67 -85
4759 -85 -1 27 14 31 -234 25 -174 -54 38 -109 -132 -74 66 59 -129 -104 -101 -42 -51 -168 128 -9 -54 120 236 283
4785 283 159 30 176 -8 -106 55 47 67 -116 287 153 -166 110 194 12 56 -95 -74 157 43 -152 -62 -69
4808 -69 -20 33 -53 42 163 -48 5 -83 -198 -95 89 12 -92 -23 -40 -22 37 -89 53 164 65 47 74 -10 -113
4833 -113 -55 -293 -94 -69 14 -84 27 -26 129 125 -123 66 119 -48 -44 64 42 11 -127 19 -99 -5 45 44 47 199
4859 199 108 19 85 -97 -61 -6 -78 -60 -13 212 16 -45 -92 -51 80 -60 -17 12 -68 -202 -2 31 -91 13 -55
4884 -55 -97 34 -82 -66 -72 36 -142 -139 44 -108 24 264 -186 -124 22 22 -40 39 11 144 -209 -43 -10 103 117
4909 117 128 94 147 -62 -182 13 -24 -12 -222 73 128 157 40 119 181 -191 33 82 72 92 77 222 371 189
4933 189 -234 277 -25 -72 -24 -66 95 26 103 -73 120 80 -46 -27 -52 78 6 -83 -34 30 -63 -85 38 -60 100
4958 100 -136 -24 -171 -73 234 249 315 -44 -152 4 66 39 -9 35 -133 18 -65 67 190 43 26 -17 -135
4981 -135 230 -103 25 39 -140 85 -261 -56 -76 -13 4 78 66 -25 -20 179 -51 -217 46 218 126 63 -112 182
5005 182 131 97 -122 -129 -39 -15 6 -116 -146 46 -5 -30 -179 -81 6 -132 36 -320 -36 -186 -6 -73 -86 89 192
5030 192 -255 -58 20 -9 131 77 5 -158 -76 -17 50 95 -176 -54 -63 -130 217 -88 205 -22 -232 9 -79 213
5054 213 -229 -209 -3 -88 86 30 -27 -38 -95 -102 -194 -31 -151 57 18 -370 68 -288 -165 -200 -39 52 -51 -28
5078 -28 13 -74 84 -29 -164 43 43 133 19 221 173 -246 23 -9 -24 -104 27 -7 -105 28 -122 235 -64 -28
5102 -28 -41 94 -229 -276 -168 -280 -182 108 52 125 -105 162 37 -71 -15 -106 38 112 -43 -81 -125 -236 -96 101
5126 101 -132 41 -89 202 134 36 -187 12 -98 -197 -180 -107 65 -103 -177 -220 -24 -199 9 91 -105 -3 365
5149 365 -47 160 -202 -50 48 3 -20 295 10 0 110 106 153 164 -7 47 -78 35 53 83 214 -29 -10 -209
5173 -209 -5 -156 -79 -120 18 -7 -74 -191 -117 143 112 -50 -19 -72 -100 189 -197 26 -64 215 116 63 16 -99
5197 -99 -106 -84 -25 61 137 246 -28 80 138 69 136 -4 3 269 -51 -165 -140 38 143 0 -37 30 130 100 181 -172
5223 -172 18 -112 -114 -3 -122 137 161 37 146 18 41 -273 109 21 -8 163 -38 82 -36 82 -147 68
5245 68 171 -72 147 71 -218 -105 -145 -67 199 -105 151 81 -49 -1 -163 166 -75 65 23 -44 -156 104 -127
5268 -127 -8 -156 -65 39 -155 58 -3 128 -45 102 -151 9 67 -166 -304 -99 -121 43 165 98 -184 14
5290 14 -1 -10 88 0 35 65 -48 -8 323 -56 -115 -120 29 94 -29 103 185 -60 -113 145 28 -11 54 30 14 -14 2
5317 2 204 15 -201 307 -72 -33 -53 -6 38 -25 -25 -141 -13 147 106 -175 -5 83 -116 214 24 -1 -141 0
5341 0 -171 -221 233 -153 25 -2 -128 57 10 2 -55 -113 81 -84 -181 36 205 6 3 180 44 -26 24 57 63 175
5367 175 -88 -15 -99 21 -116 128 -41 59 -33 -60 78 -181 -25 -48 -50 24 -32 62 -47 -129 56 9 249 -89
5391 -89 4 -239 122 -136 -197 124 -45 208 106 144 54 156 -17 35 266 -36 -94 77 -75 -58 104 -97 -125
5414 -125 -90 50 99 85 -2 86 118 -39 34 31 87 177 93 -20 -319 12 -50 36 120 154 163 102 98 -182 154 -61 -136
5441 -136 16 -83 -107 104 -100 -97 -31 18 67 -200 198 62 -152 -36 -140 129 -39 64 -10 -48 -141 169 170 -109
5465 -109 96 -65 114 -41 61 -223 118 66 50 42 -21 -12 236 -125 23 -35 2 -49 -162 -169 60 167 58 55 79
5490 79 208 75 70 -219 71 -11 -27 -209 118 -46 -76 158 -46 58 -53 88 -48 64 -5 62 -92 -2 47
5513 47 43 -113 -25 201 -99 -173 -244 -90 -27 -189 155 -104 -45 164 196 -196 161 75 113 202 9 -241 164 -43
5537 -43 54 89 3 -178 -112 -61 97 63 26 -41 31 126 57 153 69 77 57 -131 168 195 111 -55 -239 -308 214 71 79
5564 79 61 -43 -40 -81 105 -60 -73 -38 11 40 -119 149 50 104 -48 -153 -99 -201 -68 112 246 36 -217 -99
5588 -99 45 159 -270 159 59 -67 -28 -159 16 -133 -196 3 -140 43 194 251 17 -59 -131 96 -53 -66
5610 -66 93 171 15 29 -121 39 -7 -16 0 215 257 -212 -261 13 -6 -9 179 -19 -110 -9 -65 -57 -6 25 93 64 -30
5637 -30 -11 -59 38 -54 104 -43 -20 -78 -116 99 103 10 92 -94 85 -9 -298 -40 265 51 161 -62 29 51 105
5662 105 -113 -148 150 -43 126 -101 -56 164 -138 78 33 -68 -112 -26 52 -1 -19 -60 131 100 -159 -24 110
5685 110 104 -28 -17 12 -55 118 143 39 -23 20 130 268 47 -155 -169 -170 240 -29 -193 52 -105 -4 1 14 -13
5710 -13 -75 -170 -1 95 -20 -33 16 34 51 15 -55 -109 -70 77 -114 -41 -76 18 -104 -53 103 32 68 24 17 67 353
5737 353 85 -49 -37 5 -40 -63 -136 -28 27 2 -54 -80 -161 -104 218 52 -18 14 -128 79 81 -57 60 -246 77
5762 77 75 81 -2 -193 18 46 55 -13 61 93 -106 -112 -190 7 362 -148 188 54 44 39 39 -119 -234 392 110 -40 12
5789 12 133 -20 101 -55 -154 119 -70 -40 -32 108 274 8 211 314 145 116 -66 16 -62 -165 -187 231 19
5812 19 151 215 101 -147 5 43 113 110 231 167 -83 -143 131 92 -177 -2 -190 -208 -73 19 -89 91 -121 242
5836 242 151 -185 -1 95 -125 10 -12 48 -46 86 10 99 146 32 250 -117 240 -106 -108 -130 -46 -208 -88 -164
5860 -164 304 43 48 -102 90 -93 24 -11 41 24 154 -25 43 -75 -230 -146 6 172 -32 -57 123 -83 -74
5883 -74 12 -76 -87 35 17 -46 44 -18 117 196 -200 -105 105 64 108 -9 10 34 124 -20 -72 83 104 -219 62 23
5909 23 57 -120 -45 -18 -67 158 6 129 -117 38 56 -66 -98 74 -64 55 -17 -39 -59 -147 -61 -107 -84 -37 -89
5934 -89 -130 -123 39 68 -42 276 -75 -150 30 -272 113 130 40 -11 52 23 94 -24 77 129 56 -152 -8 29 -72
5959 -72 -92 308 51 -128 -67 -56 -6 -202 -10 -105 54 -21 -91 119 86 49 -215 -156 89 -116 265 -6 -191 64
5983 64 256 78 25 55 49 -243 -66 73 -23 103 -31 147 134 160 -256 -49 4 -34 30 54 -5 -2 67 84 218 -110
6009 -110 229 -90 -77 192 20 -114 -120 239 -53 103 28 126 102 -61 156 11 -2 152 1 -120 -25 -34 115
6032 115 -212 211 -68 -133 -179 109 -103 213 -17 3 120 -87 87 260 53 -47 -177 94 -143 -7 -131
6053 -131 -4 10 44 79 -206 34 62 -111 55 -62 -45 -13 -33 -43 179 -15 112 18 50 40 45 151 -69 181
6077 181 -148 -77 13 96 8 66 -229 -235 72 190 50 -58 -43 -180 14 -18 -84 117 -25 -234 40 97 8 12 58
6102 58 -92 -98 20 128 243 -32 65 -97 14 -80 47 -17 -14 -125 -73 -91 -59 -77 48 -182 37 75 191 -28
6126 -28 -127 -11 -94 115 112 -134 105 -41 144 134 -213 65 49 -71 -26 30 -39 -20 -57 139 76 76 -159 -129 31
6151 31 46 104 143 12 -85 -54 136 17 86 119 -39 53 -257 -87 19 -62 -194 -350 -98 221 59 254 -156
6174 -156 62 -15 58 -189 154 -46 53 -57 124 -207 9 -79 -135 148 39 12 -128 10 -73 -144 75 -151 -279
6197 -279 -24 -114 -181 -122 -301 -113 145 138 -70 -17 -95 2 25 50 128 -66 116 -40 35 -23 154 97 -116 242 -48
6222 -48 101 -115 138 12 102 -101 8 -99 -35 262 92 -183 14 172 76 161 -56 -271 31 241 -12 6
6244 6 -208 -204 -53 -97 43 83 144 210 -18 56 126 84 213 147 184 -136 4 32 -6 60 -149 -75 -113 11 182 -68
6270 -68 -25 -19 -72 137 23 -230 -183 -176 -80 68 -278 -105 -2 -96 -143 73 103 -37 -34 16 95 -200 256 -17 -157
6295 -157 -261 -19 -169 -70 291 -66 -3 158 110 135 96 92 -81 -92 -41 125 -25 -38 113 5 -39 -48 99 26 52
6320 52 113 266 -1 119 127 67 -113 144 1 -185 -65 176 -44 2 121 80 -50 -196 30 131 -100 57
6342 57 91 34 -92 18 66 -30 35 -247 -87 -111 121 38 -68 -103 260 106 31 45 45 126 40 18 -77 35 -206 25
6368 25 -179 -60 107 -290 15 46 -124 61 -217 -92 84 -170 98 266 105 279 38 -321 -4 -126 -112
6389 -112 -123 -114 -51 -130 11 94 158 12 29 85 5 -68 19 130 70 120 81 -9 -36 -139 5 167 -156 -134 18 -28
6415 -28 -117 52 -162 -128 8 89 129 -94 56 -28 206 113 -41 20 22 85 54 -376 9 40 -35 60 -37 3 28 -142
6441 -142 -70 -85 97 193 53 -60 -86 146 -47 133 185 -23 28 -45 -26 217 -131 -162 -56 12 32 96 92 102 14
6466 14 166 50 -212 26 231 70 -35 -242 -316 5 -47 -55 134 -94 -95 187 -115 -260 -73 5 -54 -97 152
6489 152 -37 302 -209 -32 115 3 -13 -150 42 -195 180 -86 261 41 52 34 -162 -261 216 16 -145
6510 -145 -79 -39 26 -63 63 -24 -53 79 137 -50 74 -94 128 90 -14 -12 117 -49 155 -54 -185 -17 -243
6533 -243 272 281 36 -36 93 34 -300 66 -167 -39 69 -81 -73 36 -220 -53 11 258 4 -227 160 202 238
6556 238 -104 86 58 38 -8 -27 -18 141 -49 -87 67 -71 111 113 -107 -190 -28 -104 -93 130 118 -153 52 131 -104
6581 -104 56 149 273 -12 -21 -52 -68 18 -73 -217 -62 -88 204 48 163 -80 89 -67 -174 127 -160 -129 -114
6604 -114 112 -79 -165 17 29 31 112 75 100 -190 75 -237 -133 87 -31 11 -117 -88 -261 -58 27 -173 -118 136
6628 136 24 -140 123 43 14 -20 -32 -62 280 76 60 19 -104 88 150 -40 0 101 104 244 16 -1 92 -180
6652 -180 121 105 144 88 -16 160 205 -50 -83 -119 -44 -194 -94 31 -94 -215 -149 -50 10 -40 -22 8 230 136 210
6677 210 5 -102 77 -192 -67 31 -243 -51 -55 -63 138 -96 197 -222 -102 101 -123 -28 41 -97 -61 11 -181
6700 -181 -121 34 -236 -190 138 87 15 137 -135 30 187 -94 87 -47 -76 -16 12 -117 99 -93 99 155 -135
6723 -135 -50 52 -164 -24 40 108 -177 -44 -115 269 169 -32 -15 95 23 25 -20 337 -181 18 49 59 158 -107
6747 -107 -56 189 66 -130 -29 -291 5 61 12 14 32 51 -48 46 -96 82 42 -43 -56 166 30 -34 -135 -83 80
6772 80 -215 49 -7 95 -125 141 74 26 -137 128 -33 -19 214 78 271 102 130 314 -10 51 -29 70 54
6795 54 -82 -60 -200 95 81 -57 -3 -1 -38 22 45 -66 236 115 -74 -91 -3 52 -106 -133 123 96 150 -19 134
6820 134 -53 -38 -8 37 -83 -33 -16 -96 68 -178 -27 61 181 4 -102 -203 210 314 235 38 -105 -21 105
6843 105 -149 32 -47 123 -17 161 177 109 -214 82 88 22 -37 117 186 1 180 -21 -11 -120 34 -201 246
6866 246 -180 -4 -143 55 121 79 215 17 19 -254 54 -110 -31 -316 -8 18 43 48 -20 47 -101 68 64 3 -112
6891 -112 -92 -36 40 -39 97 -48 -73 72 174 -137 -32 -53 -143 -214 -84 14 -101 252 3 62 32 72 -83 -47
6915 -47 75 -74 -122 -189 79 -96 -115 13 149 -57 40 -110 36 46 -25 59 95 20 229 148 -31 -242 130 153
6939 153 -122 -36 299 -62 -110 52 -308 -88 99 -64 60 -137 90 -98 68 144 78 -35 140 100 -39 -150
6961 -150 -22 -97 -8 -141 -246 -57 28 231 -143 16 45 189 156 -49 -67 -37 19 166 -67 149 -18 64 -79
6984 -79 -73 71 111 21 69 -50 -25 102 -55 21 -169 105 5 150 -51 141 -97 -151 110 203 14 156 146 46
7008 46 18 97 253 215 -78 -8 -152 278 199 -51 93 -138 6 -143 -226 -58 174 82 170 16 67 -18 -22 -7 84
7033 84 -163 -11 86 -105 -108 301 81 142 -218 -124 97 -48 72 -74 -128 -64 -61 -167 203 79 -180 92 147 114
7057 114 -57 22 24 -112 110 54 -14 -133 -28 -93 -108 -168 155 98 5 123 81 37 -163 33 179 -84 -79 -81 0 -85
7083 -85 27 129 -3 261 -63 -227 46 202 81 35 26 28 50 7 7 -101 86 133 -45 -18 87 -51 68 -94
7107 -94 42 130 53 -36 126 -67 -91 -102 -233 9 -189 -59 -59 60 17 -6 47 38 26 1 -52 -63 36 -171 80 -68
7133 -68 -40 -103 -67 117 118 -99 34 66 40 -61 4 -195 46 -116 62 4 380 132 -166 -139 -195 23 -64 -186
7157 -186 -57 17 -288 -216 -15 -74 -40 -21 -74 108 126 -71 183 2 -106 117 -54 -6 132 -276 79 -38 -84
7180 -84 -191 -62 -102 59 -28 -29 -51 79 -116 -98 -21 -197 -122 -132 10 -159 58 92 12 194 134 -63 23 297 -38
7205 -38 81 50 203 60 -116 -90 42 34 185 -137 73 -86 219 111 -15 224 109 42 128 84 -89 -112 32
7228 32 -17 23 -127 -124 97 10 214 -77 34 -52 81 -247 -23 -187 67 43 -104 -52 -35 -68 -144 -205 -42 70
7252 70 -156 -61 16 -54 104 -177 -192 -100 104 -31 63 0 80 70 151 -98 -50 138 -53 105 79 -131 -128 -22 43
7277 43 232 215 109 166 209 -124 -136 183 -165 100 -28 -82 58 95 51 -12 91 -28 -120 -135 -68 31 115 266 34
7302 34 -48 18 -144 -44 -11 126 -100 -113 -16 -136 -62 245 -59 62 129 138 -237 101 65 -156 -101 2 -170 129
7326 129 67 137 -130 -21 -144 -2 214 77 -96 -163 -68 156 -93 65 -51 -25 141 25 136 -77 -6 -174
7348 -174 -41 47 10 -91 -77 41 121 168 53 189 103 71 15 -112 -32 222 -31 -161 65 303 92 -24 -150
7371 -150 80 86 62 55 -206 31 -219 -28 170 167 -105 -124 136 82 37 37 -61 -35 -149 -213 46 -150 9 -72 223
7396 223 -80 112 -110 -14 -14 15 -103 -118 48 175 126 128 197 -14 172 -45 -104 -2 -295 -41 37 17 101 -62
7420 -62 93 94 -40 -88 -143 -218 -131 -89 77 122 108 -195 -76 215 57 71 251 51 185 -255 16 61 166 142
7444 142 41 5 62 -96 36 138 29 126 10 4 60 -34 -205 -32 74 -42 53 -96 68 49 -39 32 164 249
7468 249 19 57 -67 -47 -50 -29 -127 -135 54 112 -62 109 -26 -148 -77 80 -45 10 -98 -231 115 192 207 -56
7492 -56 -74 50 -84 132 84 -259 -9 21 260 20 155 -6 166 -132 -199 37 118 22 -48 96 -53 -56 -74 148
7516 148 -79 43 92 -79 -107 128 202 103 154 -87 62 -103 -259 -91 -39 -212 20 95 -69 -134 55 -19 113
7539 113 121 115 -42 -2 72 7 10 49 162 -89 -212 47 218 -186 -175 -34 -469 -52 265 12 74 -71 50 114
7563 114 -5 -308 -118 139 -171 49 -233 -12 78 131 -92 0 43 112 -165 225 -68 -132 -232 43 42 -32 -177
7586 -177 102 143 -119 -108 -168 65 -110 77 46 209 99 6 -56 61 -97 -84 -68 -56 -17 -93 -88 79 77 -150 20
7611 20 -99 -69 114 87 10 223 183 34 79 145 -47 48 -151 37 147 27 -132 -82 249 -59 49 -113 -17
7634 -17 -59 -291 171 -27 -60 -52 -92 57 -7 -107 -67 80 10 12 -154 53 51 36 -69 -140 94 -103 54 243 -62
7659 -62 86 52 -12 -267 31 -227 -207 88 60 -131 95 120 -62 -143 -79 124 4 57 -120 -142 -9 183 3
7682 3 57 94 -173 -72 33 -104 -227 -126 36 -80 130 58 13 -18 -223 -123 142 -53 114 68 -125 -123 56
7705 56 -59 -119 -65 80 154 -34 136 -80 66 -24 41 -37 41 8 -11 234 -63 -30 161 -54 135 86 -48 -385
7729 -385 224 20 51 -110 -110 0 122 -108 -23 291 260 70 -112 -55 -75 -18 -108 107 129 -61 113 11 110 -93
7753 -93 -67 -20 -123 188 -87 54 29 126 -171 -115 75 -133 2 -46 77 83 -57 -100 -50 88 -67 -60 -2 -153 -125
7778 -125 63 -72 -105 -138 94 25 -137 74 37 20 157 -33 68 144 81 2 21 94 -59 15 23 77 -60 182 -59
7803 -59 -30 31 112 133 33 273 125 -38 -43 -41 131 13 -142 -117 -4 32 43 -447 27 37 -135 -27 142 61 -125
7828 -125 39 -72 178 -8 -59 332 222 44 113 -8 44 -70 -86 173 -112 -153 -305 -156 111 217 -58 56
7850 56 -72 29 96 -1 -226 -37 19 124 211 -310 151 72 -31 2 213 -78 -279 149 -121 -257 68 119 -100
7873 -100 81 100 -43 109 23 2 40 -24 16 -160 47 -34 49 -247 -126 93 16 207 -180 -37 106 50 -156
7896 -156 -36 41 -186 -77 -25 5 -108 -85 190 -40 -304 -102 131 -96 7 58 11 -5 -223 36 -104 -91 0
7919 0 -60 -8 6 83 145 -234 -113 -157 23 -179 73 9 -75 40 -71 90 206 -119 73 190 -9 -111 -54 -135
7943 -135 -8 -166 -163 -172 81 -75 112 -91 -108 -69 58 83 -35 31 -121 -97 -61 170 27 -22 -186 35 69 235
7967 235 -141 84 167 -15 -63 -125 -49 152 -1 105 73 -44 193 30 -28 -68 158 29 62 230 -136 -57 -25
7990 -25 88 51 6 -174 -147 -10 19 -67 193 -34 -62 33 -93 71 188 -22 13 129 -49 302 -107 55 80
8013 80 -35 58 -14 -47 117 47 104 54 54 228 -145 82 -117 -149 -95 -32 -51 -57 103 92 -145 -14 71 222 -14 121
8039 121 -115 -120 -69 -30 -63 -169 -184 86 -221 123 22 90 71 -161 38 15 -22 65 -41 91 120 141 310 77
8063 77 35 62 1 -38 -30 -268 55 -127 -209 42 -71 -102 -112 -47 -6 13 87 24 -84 56 -181 71 167 -13 -84 -162
8089 -162 3 -75 -20 18 -19 -40 85 -37 196 96 -218 83 229 -146 -205 243 190 32 98 129 -21 211 38
8112 38 -81 7 54 10 -125 -7 63 -214 5 41 -190 25 -168 -70 3 109 80 161 78 141 51 18 -71 17 -87
8137 -87 -165 -59 3 55 233 -83 -53 118 -86 139 -172 101 245 92 -283 -10 60 240 362 4 -145 -93
8159 -93 73 -56 18 -92 -170 -5 31 -39 94 -97 -128 -52 -154 9 66 -67 -41 -68 137 10 197 114 -41 -19
8183 -19 179 -127 -32 -38 -179 145 169 181
8191A81
$$ Imaginary data points
##PAGE= N=2
##DATA TABLE= (X++(I..I)), XYDATA
0 0 0 0 0 0 0 0 0 0 0 0 0 0 0 0 0 0 5 -8 8 -8 8 -8 16 -16 16 -23 24 -27 32 -36 40 -48 55 -61 68 -77 87 -98
38 -98 108 -122 134 -148 165 -184 203 -224 246 -272 302 -331 365 -402 442 -489 542 -599 665 -742
58 -742 830 -936 1062 -1217 1415 -1675 2031 -2558 3416 -5037 9235 -46940 -72104 20449 25703
73 25703 -7503 -16344 2835 10641 21751 10127 4271 23477 28134 -2530 4186 34610 22885
86 22885 -9238 -2241 14913 15460 3478 -13402 -15414 9940 10594 -20495 -24145 1644 138 -16010
100 -16010 -12659 -6019 -8520 -9055 -11590 -6591 10025 2894 -24882 -12369 24211 15076 -15245 -7962
114 -7962 12641 11747 7830 7839 4958 7778 10518 5055 10297 18653 2182 -13284 5081 19774 -53
129 -53 -18429 -9166 3526 1986 -10270 -20989 -12730 3943 -3111 -18817 -9777 4337 -4227 -11771
143 -11771 593 9036 2703 -5326 -3447 10798 21440 5780 -11849 3824 23889 11291 -6127
156 -6127 1391 9955 3417 -1840 -371 2353 2894 -5995 -12490 1756 11523 -8001 -21552 -3100
170 -3100 11260 -937 -13078 -9648 -16 5577 -770 -10999 -3270 8477 -59 -7596 5511 10527
184 10527 -2708 -5521 6468 12079 6741 -2525 -5432 7243 15969 1435 -10274 1874 10311
197 10311 -460 -5189 622 335 -4367 -5493 -3266 1238 534 -11021 -12505 4517 8472 -8478
211 -8478 -13471 530 7735 2570 -3381 -3756 2989 8200 1981 -1390 6572 7053 -3441 -1354 10255
226 10255 8134 -3683 -5297 2242 8369 4335 -6969 -8739 2818 6270 -4719 -7966 -269 -78
240 -78 -5496 -3856 918 247 -4595 -6841 -668 7761 3068 -9134 -5787 8997 9300 -2194 -4913
255 -4913 2504 6553 4306 413 383 3537 2797 -1160 1728 6330 196 -7328 -2610 6069 3009 -6215
271 -6215 -8294 -1648 4594 274 -7883 -6238 1996 1711 -4250 -3192 1700 140 -3747 -1095 4775
286 4775 4675 -2105 -4576 2819 9138 3659 -4909 -1698 6668 6279 73 -1669 1495 2463 254 -346
302 -346 1649 830 -3787 -4693 1219 3874 -3091 -8865 -3994 3407 2222 -4575 -6509 -1256 3054 487
318 487 -2774 -845 1880 888 -354 2630 4440 1046 -2019 1632 7091 4698 -2277 -3081 3156 5752
334 5752 999 -3445 -1562 1976 630 -2749 -1552 641 -2227 -5063 -1674 2997 313 -5588 -5000
349 -5000 1268 4155 -567 -5118 -2376 3568 3067 -1222 -1322 1394 1871 848 1343 2614 1789 -780
365 -780 -842 3557 4838 -243 -4388 195 5358 1915 -3893 -3735 130 1473 -124 -2912 -2500 -851
381 -851 -2082 -2766 466 1641 -3147 -5515 31 4220 1486 -2981 -2577 1986 4635 2054 -1590 594
397 594 3663 1982 98 2030 2472 -307 -853 1706 2363 406 -3193 -3116 1733 3639 -2266 -6340 -1441
414 -1441 2561 -193 -2648 -2273 -1779 -467 400 -453 -177 350 -2101 -1280 4087 4144 -2162 -3134 2042 4326
432 4326 2447 -618 -1844 1046 3954 1244 -1795 723 1419 -1441 -479 2711 -59 -3030 -1817 -114
448 -114 1045 350 -3741 -4680 1465 3269 -2808 -4238 -361 848 16 884 -117 -1073 307 678 943
465 943 3382 1677 -2642 -463 5066 3559 -1131 -1342 154 1963 2648 -505 -2856 -217 1248 -1519
481 -1519 -1399 766 -1814 -3617 -328 1345 -870 -2356 -2582 -987 2625 2325 -2990 -2641 2226 2550
497 2550 -357 214 908 278 1098 2187 1217 734 176 -983 1193 3636 597 -3488 -1165 2194 1295
514 1295 -1134 -2204 -2107 -276 1012 -1149 -2391 -863 -912 -1902 313 1313 -1546 -2955 144 2049
530 2049 1596 -151 -1518 -217 3895 3249 -578 -692 1998 1929 971 1952 807 -1024 -420 1086 360
547 360 152 -1303 -3240 -883 2318 -667 -4096 -2167 -378 -588 129 -754 -3152 -1175 1702 -72
563 -72 -689 1118 -427 -1285 2854 3473 -466 -956 1705 1805 2674 1937 -1428 -973 2890 2129 -1289 -323
581 -323 20 -1758 -277 1354 -1028 -2523 -1634 -1452 -432 936 -2337 -4208 -268 2050 -571 -1408
597 -1408 -584 -868 1167 3226 369 -1274 1528 1789 584 2511 2510 -1202 -558 2596 2111 446 -254
614 -254 -1641 -541 2353 874 -3277 -1891 438 -685 -795 -585 -2334 -2450 137 80 -874 -724 -1196
631 -1196 -1635 1317 2321 -476 -1381 619 1088 1823 2247 -177 -685 2057 2832 581 14 461 -69 650
649 650 1916 82 -1734 -921 -185 -410 205 -1017 -2995 -1447 566 -458 -1756 -1550 -1272 -576 928
666 928 430 -1281 -864 355 757 1117 1097 -322 -232 2236 2575 895 -89 348 959 1864 1937 -226 -1088
685 -1088 295 865 81 -299 -835 -2042 -928 529 -155 -1767 -1777 -1237 -409 969 -81 -2171 -1311 763
703 763 1074 307 -114 -422 240 1635 1314 464 425 532 492 1737 2134 -51 -960 344 1402 540 -316
722 -316 -1231 -1284 649 915 -1142 -1630 -649 -757 -627 214 -920 -1905 -486 265 -6 40 -454 -1194 254
741 254 1836 1128 -419 -264 516 1248 1652 798 -585 354 1291 1051 487 422 -699 -585 856 761 -746
760 -746 -1589 -1219 -305 176 -398 -1934 -1683 -176 428 -296 -513 -800 -777 938 1217 298 -129 175 118 1195
780 1195 1623 333 -798 2 1357 1180 -19 -382 -405 567 1078 -34 -997 -797 -424 33 211 -95 -1010
799 -1010 -1138 -232 174 -113 -914 -1462 -464 704 831 -683 -978 -61 639 971 408 -137 -165 783 938 1067
819 1067 482 -233 70 975 1202 210 -813 -561 199 627 198 -1150 -1446 -667 -151 -156 -823 -1265 -880 -249
839 -249 163 292 -416 -677 14 1130 1418 -8 -590 255 1191 1425 445 -459 -16 831 908 397 68 -517
859 -517 -236 287 439 68 -682 -1054 -557 542 516 -563 -1393 -757 430 236 -687 -770 -745 195 513 -229
879 -229 -305 -296 -260 349 850 840 -123 -348 776 1277 1007 -67 -651 540 1468 618 -541 -575 -48 210 142
900 142 -122 -904 -797 -273 -218 -122 -347 -900 -1134 127 814 -11 -831 -435 260 962 464 -5 -111 678 959
921 959 390 573 187 -141 -41 1044 700 -231 -547 -125 692 863 -238 -1276 -652 644 263 -561 -489
940 -489 -533 -711 319 194 -745 -487 -383 -218 367 717 -602 -1006 308 1259 230 -344 -253 120 730 961
960 961 49 -46 115 -28 292 704 3 -865 -375 509 412 70 -704 -1522 37 1138 -299 -1436 -622 139
980 139 -27 251 39 -1009 -472 468 100 120 528 -333 -326 1117 1307 -565 -657 96 593 715 137 -489 -462
1001 -462 748 507 -296 -25 -387 -822 9 722 -238 -675 -673 -532 412 588 -842 -1212 268 858 77 -336
1021 -336 -146 -391 463 767 108 -350 119 -32 133 933 317 -871 -498 846 743 86 -357 -559 207
1040 207 672 204 -462 -651 73 -66 63 108 -311 -807 11 347 544 -387 -973 -292 785 857 -243 -775
1060 -775 -108 625 422 394 -5 -60 30 422 256 -98 -189 -454 44 943 562 -831 -688 255 756 20 -556
1081 -556 -594 -335 474 256 -392 -466 -159 -244 276 472 74 -662 -204 672 318 209 -205 -426 461 1188 212
1102 212 -658 -119 93 311 530 -178 -747 -249 461 -237 177 -182 -861 -382 909 396 -674 -578 -150 31
1122 31 450 276 -770 -335 591 237 127 242 -496 -592 460 841 -95 -140 -325 93 595 875 -544 -618
1142 -618 762 562 -131 -112 -339 -321 132 575 -452 -346 -194 -464 -51 669 -337 -995 -239 365 371 284 -85
1163 -85 -457 321 825 284 -402 -220 -186 267 519 268 -459 -240 173 186 380 57 -502 -311 274 254 -250
1184 -250 -621 -428 99 254 222 -523 -250 393 46 -18 -181 -338 -362 317 520 227 -111 -254 -106 685 606
1205 606 -137 -344 62 591 618 -193 -413 6 384 243 63 -153 -389 -286 68 370 116 -428 -505 44 226
1226 226 -61 -620 -262 -15 432 392 -42 -479 59 283 337 256 -71 -149 10 371 215 20 -199 -176 451 343
1248 343 123 -710 -346 327 197 107 -384 -269 -98 177 -138 -71 -112 -224 -252 302 488 -277 -392 42 431
1269 431 361 -13 -179 36 465 258 8 -70 58 -1 -44 309 106 -97 0 -71 337 117 -83 -564 -59 496
1291 496 286 -493 -547 -153 368 168 -339 -131 -440 199 373 413 -88 -449 109 296 347 -265 -402 -202 119
1312 119 530 29 -396 -27 212 284 115 31 -23 -115 -142 165 153 -272 -323 -301 39 215 -222 -633 -140 390 292
1335 292 -283 -268 -227 -3 187 17 28 107 -52 213 393 121 -292 -162 41 370 133 -226 -299 240 432 37
1357 37 -94 -306 -99 112 75 -10 50 -167 23 224 437 163 -175 -184 376 233 3 -165 -194 171 512 256
1379 256 -211 -125 120 244 34 -166 -278 -341 100 201 274 -188 -398 -27 362 123 -293 -489 -57 294 100
1400 100 -116 -353 35 291 219 -15 33 -173 -317 51 389 459 -282 -501 -3 562 20 -114 -231 -154 -54
1421 -54 54 -139 -161 -52 93 112 -163 107 -131 -65 -142 266 -212 -321 -201 284 252 88 -238 13 212 228
1443 228 173 -124 -80 84 192 -11 215 9 -227 -33 80 383 -43 -231 -258 138 372 -105 -462 -24 108
1464 108 112 -85 51 59 23 152 -31 417 -91 -543 91 362 174 -246 -387 114 286 95 -161 -215 60 272
1486 272 -30 25 -79 -93 -323 14 494 48 -228 -393 94 471 309 -334 -217 76 24 263 -132 -241 -157
1507 -157 136 278 110 47 -94 -149 338 380 -74 -405 11 381 300 281 -426 -243 393 237 -53 -243 249 -236
1529 -236 -106 414 60 -283 -293 -68 241 476 -116 -352 140 443 -75 -167 -61 -3 329 -18 151 -224 41
1550 41 -25 24 207 267 -363 -157 331 429 54 -244 -360 195 301 45 -333 -278 36 129 -18 22 16 -111 -146 166
1574 166 314 -166 -283 6 333 418 -36 -173 -131 438 192 -258 -103 -181 -110 1 8 242 -64 -188 135 341
1596 341 43 -233 -386 22 231 -77 -308 -455 213 148 100 -208 20 7 137 362 -21 28 -136 -89 542 406
1618 406 -82 -236 -26 297 256 74 -172 -177 90 75 -85 -58 -418 -271 -43 -82 -141 -63 -197 -221 286 187 -214
1641 -214 -169 170 277 78 -165 -147 11 200 339 -79 -58 -122 -401 116 497 -6 -466 -157 178 299 98
1662 98 -314 -526 20 41 -110 -258 132 -93 16 207 46 -319 -166 -35 101 296 -76 -482 80 504 67
1683 67 -248 -24 222 -51 134 -215 32 -358 -12 -37 330 199 -412 -325 103 422 -21 -271 -211 -27 244
1704 244 34 -443 69 22 59 -34 11 -276 -277 -107 305 451 -4 -349 -119 359 221 -163 -145 -5 345 74
1726 74 -146 -18 -59 -73 -21 -11 182 -130 -377 -33 391 108 -530 -3 67 225 -44 -167 -88 171 -153 -121 172
1749 172 179 -111 -250 -28 212 8 -319 -63 252 280 -245 -392 140 250 20 -67 -176 286 -150 -338 -108
1770 -108 155 142 -480 -173 394 296 -137 -326 -50 506 389 -408 -301 256 478 -132 -155 -20 121 -34 17
1791 17 200 381 100 -565 154 222 212 -708 -519 152 387 -137 -134 308 580 40 -85 78 238 -117 -186 52
1813 52 251 126 -277 -343 260 246 -62 -497 89 398 -83 -287 -146 166 117 -101 7 282 151 -210 -399
1834 -399 197 395 -318 -526 -63 423 23 -409 -190 -100 20 -220 -268 166 246 -410 -372 -16 357 -41 -268
1855 -268 64 496 187 -683 -168 480 389 -203 -375 -58 253 -41 -209 160 325 223 -408 68 322 20
1875 20 -563 -146 330 387 -205 -416 89 601 30 -277 -26 157 128 -388 -140 304 126 -138 -40 197 164 -270
1897 -270 -290 -97 545 -234 -460 -87 316 80 -260 -330 234 242 -133 -233 136 436 -105 -417 132 459 -18
1918 -18 -464 -384 546 220 -315 -240 19 290 -271 -365 55 363 -59 -340 49 505 443 -551 -310 383 189 -239
1940 -239 -497 -145 290 -106 -415 -204 190 79 -392 -227 310 208 -294 -71 343 308 -265 -550 -5 425
1960 425 83 -265 28 400 80 -181 -443 98 118 -74 -114 -109 394 -194 -386 -37 521 27 -399 -8 240
1981 240 3 -104 -493 98 67 -190 -202 -68 206 -87 -426 33 175 3 -289 -45 376 301 -140 -629 80
2002 80 414 43 -449 -37 135 46 -221 -339 272 101 -255 -114 67 347 -275 -268 323 380 106 -477 -103 236
2024 236 306 -287 -110 -73 189 24 -28 140 245 -152 -177 46 249 1 -309 -28 136 112 21 92 87 86 118 -291
2048 -291 -32 135 -191 -327 -22 293 -185 -359 -37 307 -33 -239 -229 78 348 98 -411 -102 164 9
2068 9 -80 71 37 -61 -67 -82 87 43 -339 -319 231 181 -104 -181 -79 230 218 -28 -379 170 193 46 -106 67 56
2093 56 -303 -40 60 248 140 -89 77 463 324 -108 -234 -109 177 36 -267 303 50 131 -197 -48 95
2114 95 -271 -300 -103 359 21 -285 -408 282 214 56 -164 255 122 139 -210 -14 165 -36 -266 170 307
2135 307 -77 -241 39 265 192 -291 -78 -18 182 110 -101 -45 80 331 25 -232 71 24 -206 -152 86 -200
2157 -200 -330 -266 149 89 396 -175 -71 323 162 -73 -147 390 449 -172 201 41 224 -230 -74 112 292
2178 292 78 -242 -4 378 295 -112 -95 146 50 -112 -315 122 12 39 -263 96 235 -77 -80 53 302 211
2200 211 14 -96 77 310 -182 -268 28 110 38 13 -66 -22 -268 -92 166 296 5 -124 -214 222 167 -48 35
2223 35 133 83 -159 -13 144 51 152 32 -316 207 -47 -179 -76 208 222 -128 -109 28 306 295 -235 -115
2245 -115 148 210 -92 33 -138 52 -229 -58 64 -2 80 70 -21 309 69 -306 67 239 96 102 -179 107
2267 107 106 59 -216 158 140 -169 -260 234 60 -97 192 -67 181 63 75 -170 60 231 52 -401 -192 -80
2289 -80 21 -135 -175 -103 229 -72 -12 -82 223 -134 -155 45 96 98 -196 -188 180 104 -151 265 178 -117 4 41 120
2314 120 -31 -11 -228 253 481 71 -128 9 102 19 42 -145 100 211 -77 -258 32 197 135 31 -27 54
2336 54 72 -134 -131 118 57 175 -92 62 214 236 -136 70 51 175 -126 -21 -162 -60 136 -105 33 29 -40
2359 -40 -178 -119 139 184 -180 -24 171 318 44 -249 -54 167 -245 -204 31 307 50 -63 16 314 155 -77
2381 -77 -55 220 11 36 -80 211 -76 -236 -103 -12 -120 116 -48 -230 56 -65 20 -287 154 -9 -64 -45
2403 -45 -21 105 5 -248 -96 100 173 -117 -73 37 65 -26 236 16 74 131 15 51 123 15 -111 -93 -67 15
2427 15 -1 -238 190 99 -191 -110 116 71 295 -18 -107 137 7 -132 -228 -30 219 -96 -60 -262 -81 157 -118
2450 -118 -60 -129 12 50 -1 171 -10 72 -52 143 173 -139 106 -71 -8 37 -24 -156 -22 78 -222 -62 2
2473 2 191 183 120 57 191 -98 -84 -135 44 24 71 -161 193 -20 39 7 154 -89 28 155 14 -99 33 -17
2497 -17 -162 -319 -36 -50 38 124 -27 -177 -76 -112 -155 27 73 43 -40 54 -99 -45 -166 -23 -91 151 -227 238
2521 238 121 -146 -79 275 -36 -129 57 -52 35 57 75 20 -81 -283 85 -210 -39 -71 -251 31 9 -38 22
2544 22 -141 38 144 -23 -55 -69 89 -4 43 177 112 37 -40 22 29 99 85 -85 -237 20 41 -125 -171 -160 250
2569 250 -1 18 -36 -49 -73 117 -235 -207 95 -206 -5 -57 -113 62 61 -143 -155 147 7 16 3 169 32 -32 36
2594 36 9 214 -73 55 110 186 26 -158 -5 -199 -148 -387 22 -34 26 -179 -67 -13 -118 -385 -14 -56 -177
2617 -177 -94 -36 82 -73 51 -123 -47 81 59 58 156 -88 24 -131 -81 65 123 138 -304 -141 -69 249 164 176
2641 176 -39 99 127 -244 130 20 -120 -55 -112 -216 -25 -107 55 -46 118 -1 142 -51 -2 -31 70 127
2663 127 -133 -203 -95 -50 -143 -18 -140 -264 76 218 -36 183 -125 73 30 98 -88 -257 249 -12 -125 137
2685 137 -72 -137 94 68 -108 83 55 -40 -8 47 -69 83 -160 -68 -23 -180 -78 69 -159 -27 -9 27 282
2708 282 239 -78 245 -72 -68 -4 107 178 345 7 2 37 55 201 -176 -153 78 -44 235 -5 -204 142 64 -22
2732 -22 162 46 95 166 178 55 -52 -148 -70 -8 27 -67 -50 476 10 17 -160 24 -82 115 126 81 55 -21 -34 103
2758 103 85 -54 -24 98 -16 24 -79 246 -62 24 158 166 -52 33 149 15 38 11 148 194 -263 -5 -59 -13
2782 -13 -149 -73 14 29 -164 -244 -138 25 55 -183 -147 -119 110 76 68 85 -123 -196 -102 -201 36 -202 -226 -139 -27 131
2808 131 -104 -37 -32 44 -55 -149 -132 -24 -55 81 110 65 137 -27 -74 209 80 312 -219 73 -89 -268 -152 188
2832 188 16 -172 50 -28 45 -24 15 -137 91 -72 -186 70 -46 28 125 31 -78 78 136 23 -132 63 42
2855 42 -62 -78 6 -15 -34 -38 15 182 -53 35 124 -108 89 -182 -8 -35 77 -250 41 153 91 11 -115 -21 -181
2880 -181 -1 -25 100 -55 36 216 -108 54 -52 5 241 -173 -121 -34 15 -103 -17 -11 250 -13 40 103 107 82 28
2905 28 55 -171 24 -167 158 0 144 -23 -29 17 102 115 -111 75 25 14 -87 67 258 -405 -82 175 115
2928 115 89 -153 -428 153 93 -24 -48 197 25 -83 2 21 16 67 40 132 124 115 -31 124 -155 -93 -190 31 -112
2953 -112 -121 -51 11 -125 40 -70 -193 201 151 -116 168 111 -125 190 -61 -61 87 -39 227 -123 95 -68 -24
2976 -24 -22 30 419 -168 -6 29 -59 -78 22 154 -208 139 -51 70 -237 53 131 84 -223 11 7 17 115 17 -81
3001 -81 -45 9 -138 74 -44 -229 -2 -119 -156 15 -73 24 -75 105 -146 98 28 -3 -97 -90 -170 -51 -3 8 -109
3026 -109 60 185 27 95 53 -26 4 131 51 55 -120 121 -67 25 170 -115 29 386 -139 -18 143 250 -116
3049 -116 157 -237 63 70 52 133 22 -207 104 -168 -1 90 52 -146 -57 102 -44 -107 -155 126 40 -239 -208 -11
3073 -11 -117 -46 -9 -271 -175 -191 148 -26 -173 11 -127 80 62 -72 -152 40 258 -69 120 24 -67 -148 116
3096 116 -16 -163 -26 188 -71 86 48 -122 -227 42 -56 92 -40 72 -106 46 298 37 -271 -218 119
3117 119 257 -13 9 -22 -18 169 78 69 -85 -53 -26 -83 -103 -165 -48 -61 56 -294 -130 -53 94 1 224 22 -16
3142 -16 -179 113 111 40 48 -148 129 4 -63 71 -60 -244 49 36 -32 -5 -33 -94 17 11 80 189 37 -123 96
3167 96 96 217 -129 146 -50 109 15 -60 -61 -261 -86 -250 -123 74 40 -1 -38 58 -53 -136 139 79 147 47 58
3192 58 47 60 109 0 -35 -35 -162 60 198 50 -105 22 -21 18 -120 -111 -131 -74 95 295 91 -30 24 188 -51
3217 -51 85 22 -48 -85 28 224 10 -48 -30 135 176 88 -143 -132 -35 40 235 185 -28 4 -11 0 62 -137 44
3242 44 37 15 -62 131 175 10 -9 10 104 18 -66 -28 -52 -128 -163 -49 28 -228 -153 -145 -105 -202 6 43 -220 -42 -29 -88
3270 -88 17 -70 -18 54 -291 -20 24 -102 155 -161 277 47 222 -175 108 106 96 86 81 30 -230 -125 -4 -47
3294 -47 -116 127 -8 155 74 15 44 75 222 30 -137 -135 114 171 -31 89 -354 99 24 -242 2 -100 -155 16
3318 16 203 15 -66 -67 60 -195 -78 77 168 -73 -118 71 -9 -350 118 166 -63 -13 212 136 -7 -93 -47 17
3342 17 -25 -23 -109 8 -100 -190 84 -210 -28 79 35 97 106 211 248 193 -5 81 62 64 106 -135 -160 195 -152 -206
3368 -206 -1 -217 111 61 -172 -23 167 -87 248 26 112 133 36 110 123 -173 3 98 96 19 -3 -53 -77 -245
3392 -245 -41 -33 -255 -277 -117 90 -110 191 51 21 156 -31 4 -64 -11 125 -127 158 11 -93 -183 103 47
3415 47 -86 -90 178 132 -21 -96 116 -72 -105 -125 89 255 -144 -37 -176 79 146 -3 75 -161 71 46 373
3438 373 -68 -31 -67 -100 62 54 -98 -23 150 86 -70 -106 60 -74 -159 15 165 68 -166 16 -77 -149 70 67 164
3463 164 -13 36 35 -217 118 -82 -166 -77 -57 33 120 47 12 113 -1 -180 -95 0 2 -123 89 -174 -254 -174 -130 -103
3489 -103 -142 143 8 133 -12 -31 -77 -79 -124 114 62 -100 -4 -91 151 58 175 -2 190 -31 -71 -130 29 157
3513 157 -40 24 -101 -274 -110 -1 112 136 156 -85 117 -120 -226 -117 43 68 43 130 104 26 109 151 121 44
3537 44 226 -170 -80 -94 -230 -205 221 -90 150 69 163 104 -313 -156 -201 -40 -90 82 -8 -154 137 165 222 -32
3561 -32 -148 16 161 -92 -8 -54 -332 180 -50 107 -31 125 -219 -146 226 34 -35 -152 31 70 -32 -25 -190
3584 -190 -195 188 -56 -134 -24 73 -24 122 11 30 -130 161 -83 129 137 -67 206 -146 214 143 146 -23 -64 -51
3608 -51 148 -116 -156 -148 -183 213 187 -102 55 204 172 -28 -117 -11 -93 197 -78 94 85 85 220 -77 -105 134 249
3633 249 -107 -36 134 24 -5 154 -10 5 163 -104 -39 -8 -36 -140 -206 -92 -111 -263 -70 -77 150 -111 70
3656 70 73 -16 224 15 3 46 73 -222 112 127 47 119 63 200 35 239 -2 -224 15 183 64 15 -2 -25 108
3681 108 8 89 191 -91 114 -9 -2 43 151 -88 -93 90 69 -78 -100 -161 -209 -23 -93 26 -22 -26 69 59 287
3706 287 120 -161 19 -219 174 91 143 -137 -6 -105 26 33 -22 -166 95 119 176 122 -220 103 -72 262 -27
3729 -27 -76 229 -31 -151 -16 127 -147 0 -173 38 -123 -78 188 12 4 -130 -97 -316 42 -82 -64 -43 257
3752 257 106 -6 -17 215 121 159 20 100 -67 31 -30 -32 42 65 105 4 -230 58 -113 6 268 29 93 136
3776 136 -165 217 80 -21 -235 17 104 -126 -57 -189 218 12 -66 190 -120 -121 -76 -205 -12 157 -215 -41
3798 -41 -136 10 2 -128 -115 180 187 22 60 138 147 -24 -210 -51 -135 116 -70 -105 70 -100 -25 -142 -32 135 86
3823 86 186 -143 -31 247 60 171 -188 -32 96 -72 -67 46 11 118 54 38 11 -123 -177 154 316 -227 274
3846 274 197 147 88 110 -46 -68 73 -53 -121 71 8 -59 -202 -213 -140 101 139 111 20 125 -117 78 87 -29 28
3871 28 -96 170 -38 -61 114 -74 10 41 -53 -58 6 -419 30 -6 75 -89 76 125 116 216 -177 -128 -9 95 234
3896 234 104 123 192 112 154 96 200 70 13 -188 59 200 -61 -98 -23 4 -25 55 -119 165 17 -170 154 29
3920 29 177 -43 85 -114 41 164 187 -63 -83 -109 -46 -71 -46 28 -149 -122 0 -82 149 18 158 -168 29
3943 29 18 -94 106 205 -167 -183 147 112 -72 53 -68 -23 -196 -39 70 61 62 -73 111 46 125 -53 76 -52
3967 -52 75 37 -121 46 288 2 114 -203 -85 -7 -101 -57 16 -94 134 16 -138 107 105 -112 140 55 9
3990 9 37 -41 -98 291 311 101 116 -17 57 -104 62 177 127 26 -29 102 -36 -18 -82 -89 54 100 97 -23 66 20
4016 20 81 -75 95 -248 140 71 30 106 2 -36 20 -69 136 0 -68 -98 -75 -37 -119 116 107 -229 -215 -19 -166
4041 -166 269 164 12 58 70 -225 85 92 -53 -113 -109 92 -79 159 -150 96 -243 57 -5 149 -35 -280 -62
4064 -62 233 -66 -36 55 -192 -102 177 -239 35 12 183 -126 -11 41 -114 11 -83 225 -174 44 -109 -166 18
4087 18 -43 139 -91 28 142 -58 33 -35 -14 -67 130 -26 5 -46 -167 75 174 24 -6 -18 -87 -88 -48 51 -2 187
4113 187 -306 78 132 107 -191 -166 111 71 -307 104 -23 -40 135 -38 45 -96 132 -90 -2 114 27 -34 -64
4136 -64 -38 -32 299 -66 -92 -44 -85 3 199 107 135 92 -39 74 -235 112 -36 33 -81 -114 361 103 -7 114
4160 114 64 -96 49 113 101 19 -54 -214 148 -168 7 -143 -222 113 -135 159 -25 67 -39 -7 -43 -17 34 -74
4184 -74 -286 -103 -21 1 -144 -86 19 10 -126 180 77 209 -23 40 109 -45 176 -61 129 42 204 66 129
4207 129 -57 69 98 119 -41 -157 -15 -171 59 201 -128 -40 63 3 104 81 -24 -25 -288 108 53 59 147 -143
4231 -143 -188 24 0 -22 -7 -122 105 -24 -90 29 267 26 -14 -216 34 -136 -286 16 -7 228 -80 197
4253 197 -68 132 91 -86 -131 126 -78 47 168 93 -45 50 -64 188 -13 -77 -61 -25 -174 -113 262 -128 -50
4276 -50 -69 -23 62 -38 -228 23 -123 25 -133 12 -197 56 -104 -43 106 70 87 -45 182 276 78 -52 -45
4299 -45 -161 180 -7 9 -16 98 6 76 50 -94 108 12 -85 -124 202 89 83 77 66 -35 192 207 4 155 95
4324 95 -60 -99 -34 -13 -182 252 -99 169 -33 202 182 -58 -43 -125 41 -16 156 106 54 100 92 20 -119 -117 96
4349 96 28 -20 -150 -77 -38 20 147 -97 -137 -59 107 39 -71 -120 -43 133 90 -134 91 134 116 -11 28 -275 -111
4374 -111 -46 5 -78 -20 142 -64 -37 72 116 165 -13 90 24 39 134 61 -50 131 -196 10 -122 119 -18 -103
4398 -103 16 -103 185 39 57 22 6 3 -100 -354 -181 -195 76 159 82 -66 8 51 -140 -39 162 100 -42 -27
4422 -27 -230 -134 -31 64 96 113 188 -127 86 -22 -89 -114 114 -256 122 54 -110 -86 241 -130 -84 117 -183 135
4446 135 -164 85 12 56 -230 -36 107 178 24 72 0 -195 125 4 -88 11 24 -135 93 78 153 204 -49 -169
4470 -169 -34 -63 -58 67 11 140 -47 -127 126 65 91 64 -6 148 -169 57 115 184 -59 -80 45 68 4 39 -127
4495 -127 291 -63 -48 -29 51 241 -37 -166 -79 116 -72 171 54 93 144 -208 174 -43 54 24 82 -121 -130 227
4519 227 -71 29 83 -71 148 -132 -199 11 70 -90 152 -131 13 -15 -145 -23 74 17 -97 -37 -10 -164 -2
4542 -2 -35 -40 -56 -34 -72 275 -330 -157 7 -11 -202 88 -7 83 -115 -106 -239 7 57 -21 113 110 -186 415 2 -47
4568 -47 -8 -40 85 -106 115 -12 115 -176 -40 -194 242 -37 45 -52 -47 116 -1 -73 -125 -105 111 -146 95
4591 95 330 -70 -155 22 224 -115 139 -80 162 -110 61 116 -39 -206 -69 180 4 53 22 112 -184 249
4613 249 -39 82 -121 270 -54 62 -121 -48 -50 -29 38 61 22 -149 -95 40 -15 59 33 -219 -174 100 161 -23
4637 -23 159 -122 -42 -43 141 119 37 65 -75 117 -11 97 119 -4 -57 -88 53 -43 43 -151 7 -181 274 -22
4661 -22 -281 80 122 -17 107 2 -16 -174 93 -127 184 63 59 4 -5 65 -194 -143 9 -38 -105 -17 -136 -7
4685 -7 -127 -194 8 -65 154 47 -122 170 6 -45 -19 -17 3 -87 -35 -172 -223 -25 -49 82 -1 -81 -168 40 72 10
4711 10 -258 -103 -22 -90 12 -168 -181 159 -22 -11 -111 -99 -156 43 180 259 -265 -205 -31 -10 -25 193 237 38
4735 38 -90 180 122 135 67 110 -127 -131 49 -23 159 0 163 39 -89 -130 22 -291 -158 221 204 -72 32
4758 32 -289 -48 -174 -93 40 49 -215 -33 186 100 -137 -285 73 -168 127 108 219 -20 -22 1 -86 9 328 -23
4782 -23 -132 29 -21 -121 -15 -91 -39 -186 -30 60 -129 28 86 -163 -5 160 170 0 -166 -131 -156 -181 -45
4805 -45 -296 136 -4 25 158 -240 117 12 -110 168 8 118 20 -93 -46 83 176 434 191 -6 57 -45
4827 -45 36 -51 -20 -78 113 -192 -214 47 132 -22 -76 90 -156 -16 -171 9 -95 -68 142 42 162 -136 167
4850 167 107 -170 231 -122 38 -107 -100 -134 95 140 176 -51 25 -1 -133 66 27 101 116 -66 22 131 64 32 -24
4875 -24 -125 167 34 -77 65 149 155 28 237 -46 43 -41 -13 -224 -22 16 3 -28 29 77 70 5 -171 135 56
4900 56 79 191 -5 -152 -45 154 160 47 -67 -201 121 67 -197 74 -135 -107 85 84 11 53 -141 100 -36
4923 -36 64 173 66 -158 128 -11 -23 189 -41 -155 -101 96 -151 173 52 -106 -14 -197 -91 108 47 -135
4945 -135 108 -220 38 -108 -180 24 -53 -38 -61 20 -107 -32 -22 -90 -14 129 175 -39 22 -362 -233 -115 64 20
4969 20 10 46 187 103 -195 27 54 74 -39 55 -101 6 134 -23 -19 -257 123 -101 236 12 118 -134 -13
4992 -13 197 187 135 -262 -89 164 31 291 -112 161 9 -50 52 -71 140 258 80 275 44 202 -6
5013 -6 -158 -19 141 -212 10 -20 -50 56 -104 -138 -44 -6 29 143 -139 -26 -58 24 159 -51 -47 -25 -4 -13 -54 291
5039 291 -64 105 103 -104 -156 94 -45 23 129 151 -63 -234 -71 95 -110 29 -111 -44 -245 -107 52 -143
5061 -143 -214 -17 -12 -63 174 5 -35 24 22 114 -57 60 65 195 0 -102 -97 42 66 -111 -83 -147 -136 104 27 -6
5087 -6 -39 -129 -83 -204 133 -144 140 8 -7 96 235 27 -121 93 -27 -119 15 -83 -91 -100 147 115 -8 -65 -14
5112 -14 21 27 88 2 182 -25 24 -82 -55 34 -6 -68 -53 113 36 -132 5 -186 77 161 -120 -122 44 166 -93
5137 -93 24 7 194 19 -196 76 -167 168 60 196 -171 22 59 -102 105 -37 -196 -66 123 52 81 148
5159 148 83 -170 51 -20 -133 71 -119 -90 -90 237 96 2 -193 -160 98 -71 -101 88 -233 256 70 148 -58
5182 -58 200 -70 181 -73 90 7 -52 99 -290 38 -23 -32 97 -178 -131 -260 46 -80 84 -145 25 77 86
5205 86 76 -81 -45 -123 19 28 -191 -56 38 -78 9 237 -171 -98 -77 -42 -62 -111 111 27 93 -9 49 -264 -176 -160
5231 -160 101 -249 -133 146 217 85 -276 64 -111 -122 104 -205 34 -101 -50 71 24 78 -85 22 89 -56
5253 -56 -114 -82 -104 62 -16 50 -277 -81 -135 160 -11 61 -78 -42 27 87 -18 33 77 -155 90 -243 -106 103
5277 103 49 -65 75 206 255 51 35 -146 10 -114 -63 -37 73 13 62 126 128 -30 -58 -203 -117 -154 57 128 278
5302 278 50 -18 56 -176 30 -49 251 207 -111 73 48 -189 -52 24 111 87 61 54 -142 187 -224 39 169 265
5326 265 -237 -133 139 -119 -15 -132 -38 -15 -102 -5 -106 -105 -172 130 157 -19 86 34 119 -54 -71 -39 254 187
5350 187 -102 40 -65 118 -82 -114 -9 72 -201 12 38 -83 -23 -41 21 52 85 -98 161 109 79 -274 -78
5373 -78 24 8 23 61 216 128 -108 35 -68 -154 142 -95 17 40 -134 6 -14 -46 -138 -130 -96 -8 49 168 44
5398 44 38 166 -20 -65 10 -237 -53 -181 68 -298 114 -32 -80 146 212 -49 -141 135 90 224 106 -65 1
5421 1 -69 -70 82 -97 -95 -111 30 -121 84 79 -234 -134 -196 80 134 28 236 106 116 8 -97 62 -50 77
5445 77 195 145 27 -58 145 195 166 39 22 44 -243 18 -14 -81 -150 11 70 -188 -29 -77 -80 -162 -103 -206 55
5470 55 114 -76 100 156 15 11 -140 42 97 -29 -48 35 151 -47 101 -10 -72 40 43 62 -131 108 -98 -75
5494 -75 -55 -15 77 -25 -86 64 -81 39 -177 -5 -104 151 -48 -77 126 152 -19 -136 -134 176 120 28 -50 -101 24
5519 24 -13 23 129 -134 5 92 93 -4 -158 41 59 -131 20 166 -102 186 173 -133 -48 31 -144 -71 104 -90
5543 -90 16 -187 18 -29 -123 47 -107 23 -120 95 -190 -13 346 148 237 -154 -80 118 207 34 89 -145
5565 -145 -77 136 72 52 -84 -12 117 28 124 116 25 -250 -94 43 24 81 64 -154 -85 -104 -2 191 -36 -90 -30
5590 -30 62 -49 344 9 190 -16 78 51 -191 -4 -148 268 21 12 -9 -57 41 -37 -91 108 83 105 16 -59 -4
5615 -4 16 89 -156 -21 65 -131 -110 -33 -152 -224 -26 39 164 127 -105 150 92 213 30 -43 -78 57 125 -57 -72
5640 -72 -95 51 -159 -15 -28 -2 -38 -115 5 8 -6 -87 33 217 -46 14 -20 -143 -56 30 -554 115 47 -26 -166
5665 -166 -101 287 195 -206 150 95 64 42 -56 138 91 -48 36 -290 -59 -38 -81 -84 -228 -223 86 -37 194 -180 -106
5690 -106 18 -228 -16 -139 43 -47 -16 2 -38 131 54 -175 211 -32 61 -252 -62 101 -121 78 -163 9
5712 9 -57 -72 31 -108 -31 -104 -123 -49 90 53 173 -156 -12 -157 -129 -31 36 41 18 235 -25 -124 -23 -19 -159 -9
5738 -9 57 80 23 -210 160 -13 57 1 142 23 -127 214 -84 37 -184 35 -204 -7 -6 113 14 25 269 -26
5762 -26 -20 130 188 119 -174 -40 -11 -64 -83 57 -7 -67 66 -27 -7 -137 -90 80 115 -56 -95 20 -187 -5 174
5787 174 70 90 -200 62 -9 -102 -9 -148 163 122 -104 122 -122 -89 29 79 -145 -49 1 13 80 27 -88 43
5811 43 108 -83 11 -54 52 -2 -53 -195 157 -51 -182 -112 14 -94 11 196 -2 -104 112 184 -10 226 122
5834 122 2 -97 228 -5 -9 -39 18 -56 90 65 -92 113 -202 26 -56 -17 7 -86 63 251 -54 -31 92 -29
5858 -29 -243 180 89 -219 88 190 283 337 143 4 16 -64 -252 -45 -9 128 28 4 -74 166 73 48 -130 -54
5882 -54 -202 2 -169 106 -22 -2 31 21 -114 -16 -106 -88 -62 54 -11 -57 -171 -224 -134 67 35 165 -40 434
5906 434 78 -149 161 -77 -103 28 174 -64 -42 104 36 120 -129 59 -68 -55 -84 126 -144 63 137 -16
5928 -16 -59 28 -32 -103 21 33 147 -67 49 -165 33 212 171 48 -17 125 218 -74 109 100 12 -109 36 212
5952 212 -22 -161 127 29 0 -80 20 9 46 -164 93 -59 35 38 -71 73 -7 94 -16 -103 -45 37 -214 140
5976 140 -67 -5 6 134 -28 -232 -44 86 -50 -149 143 179 125 110 45 -2 -93 -66 115 -86 84 88 -193 -200 187
6001 187 145 -169 27 54 -10 -75 -178 6 137 -27 130 149 21 -113 30 -108 -94 -56 66 22 -44 -32 -87 -137
6025 -137 40 -23 -147 -59 95 220 153 71 -52 -1 -80 -77 14 9 122 23 -225 -73 11 49 -158 112 183 202 -161
6050 -161 -9 -2 170 86 152 128 286 -64 -89 145 -48 -83 -323 7 9 -134 75 73 -65 -183 -151 -37 -122 121
6074 121 201 299 -68 5 -61 -49 215 35 -46 -59 -170 101 -82 98 17 -158 163 -1 -30 -70 -57 128 107 -3
6098 -3 51 -32 -15 67 75 -15 -107 -189 -185 11 12 -156 -24 -59 134 -68 162 -153 -124 -102 -134 80 -137 263 -256 86
6124 86 9 48 -158 86 -23 -50 -17 16 308 31 176 -25 -222 -39 -65 71 111 41 -239 3 -134 163 -160
6147 -160 -157 -3 55 -246 -43 -297 106 -115 218 -89 -88 98 25 -114 -122 -196 168 265 -281 -30 47 -12 218 -84
6171 -84 -62 88 30 143 38 121 -108 108 251 32 1 -5 -196 33 -57 4 -174 65 -3 15 364 -76 236 90
6195 90 -106 122 -16 101 -144 -157 55 -25 -107 -41 -47 4 18 -7 51 -167 -237 -13 -154 -31 -165 16 94 98 -326
6220 -326 60 116 29 1 -150 -35 -8 100 131 -78 44 -7 234 64 164 -150 49 43 -117 238 -76 118 -204
6243 -204 -86 -7 72 -121 33 -135 -35 78 185 -34 -41 13 93 62 98 -58 67 166 114 23 20 -162 -17 -220
6267 -220 -86 -206 -56 101 -39 126 -104 59 -101 59 -154 -35 38 -139 -40 -87 -49 51 -86 54 190
6288 190 -42 -13 -152 0 114 149 113 11 171 80 107 -112 -71 -113 190 177 -95 -65 24 -1 -147 136 254 95
6312 95 62 -173 -124 -81 -49 75 231 -86 192 -97 30 -51 -150 -87 9 87 110 128 -140 168 -133 -10 -32 77
6336 77 -16 -106 -31 -179 -44 52 49 -127 66 -19 -152 4 -68 157 -183 -179 -292 103 1 -171 39 34 189 -12
6360 -12 49 -22 -17 -198 115 -43 5 33 88 -105 116 -184 0 -51 176 23 71 0 111 -354 -278 -160 -228 -16
6384 -16 154 36 31 -1 133 -50 9 -8 -76 56 106 8 120 245 63 -74 182 -44 4 -134 -340 -47 134
6407 134 70 59 24 -219 -116 142 84 -200 -187 33 -189 22 29 39 -115 19 23 -8 45 291 141 -100 -222 -74
6431 -74 58 109 104 -214 -36 26 -24 -45 83 34 174 -39 -63 -238 -317 -23 -214 -26 -1 -154 -40 46 267 -74
6455 -74 70 8 -8 225 -40 136 -84 129 -34 87 -63 -222 -50 133 -178 -159 239 -189 -239 -139 -180 99
6477 99 262 -154 -132 -93 44 -80 72 45 -16 250 12 227 -54 -177 180 124 -132 166 119 -114 113 202 -157
6500 -157 49 115 -85 71 148 -55 11 89 -170 -271 -104 201 -147 157 -25 -36 131 37 215 35 -63 -260
6522 -260 -1 -118 99 -132 -89 -52 -155 -8 296 -69 -39 39 -113 96 0 -24 -76 208 45 -242 -37 12 88
6545 88 77 -102 37 39 -97 62 159 -156 56 69 -49 65 35 35 14 85 130 -90 211 104 85 55 13 280 61
6570 61 -141 -32 -298 41 -155 -177 -38 88 250 98 -115 26 -22 -135 31 9 -119 10 50 153 81 -48
6592 -48 146 -53 128 -38 -141 97 144 7 -85 -113 -118 -44 93 20 -4 87 -34 -17 -156 -92 -39 18 98 -113 43
6617 43 66 -100 -114 51 -102 -15 20 -228 92 -10 24 121 -191 26 71 249 16 29 22 -52 76 61 137 -8 -4
6642 -4 2 -91 -46 102 16 -109 9 93 57 58 11 -49 17 20 72 -172 -41 -113 59 -26 65 73 93 -41 27 87 -30 -74 152
6671 152 -231 234 13 31 57 -202 -239 73 -70 101 39 144 -221 -19 -138 -129 15 -69 18 -52 141 70 -66
6694 -66 -81 134 98 151 -45 -139 -14 -12 -1 -51 85 -84 -211 -63 -110 -168 -160 -243 -162 -61 -84 124 88 60 166 -102
6720 -102 19 90 42 67 18 -157 34 -1 67 -108 -136 64 -194 51 22 200 128 -181 314 223 142 -171 -144 -112
6744 -112 -147 59 153 -100 15 -58 59 111 -10 142 -83 -180 11 22 -95 -90 -7 38 -16 106 -120 191 -24 -22
6768 -22 178 143 -37 -49 65 -30 6 7 -73 96 1 -50 24 5 132 150 -36 8 113 87 52 177 77 -49 69
6793 69 10 73 -82 -21 122 47 107 160 -128 -176 -44 213 35 -82 131 10 33 -210 -69 -16 114 106 -159 124
6817 124 94 143 -9 15 -19 -229 160 -147 86 282 11 107 96 173 -35 123 -59 93 -185 -16 15 8 134
6840 134 -8 107 205 -103 47 20 -84 -157 -63 -136 48 -50 -29 10 2 41 -70 -110 212 -129 -34 -174 119 179 -196
6865 -196 -159 -25 155 -28 97 -68 107 -236 -41 47 111 -6 107 10 101 -143 199 -185 -154 14 -62 -17 150
6888 150 103 96 112 140 -162 73 -41 -7 253 -109 53 100 -65 100 59 137 13 -67 110 74 146 -178 159 81
6912 81 23 53 -44 -68 103 -5 6 107 -75 199 -52 -178 153 -13 185 -1 -98 -69 98 -46 39 335 46
6935 46 63 -77 135 137 -109 -149 -47 256 120 194 147 50 -111 100 235 9 76 -128 -31 32 186 -40 110 64
6959 64 57 -31 9 23 96 56 -84 -82 64 -67 -107 -23 69 -274 263 470 170 65 -97 -37 164 228 -98 -7 50 83
6985 83 -79 -21 -86 58 118 -82 112 97 83 13 1 -40 -62 138 110 -67 -295 -56 -129 13 -81 138 96 31 -114
7010 -114 14 -34 -71 74 -40 -121 -37 71 -194 3 289 -66 -116 -63 9 -37 37 214 -22 110 182 -273 -80
7033 -80 134 62 139 56 78 -6 42 221 -268 -227 -128 -93 89 55 18 -169 -119 82 -9 -109 -13 -43 -147 23 -221
7058 -221 114 57 -45 161 209 32 82 71 14 94 -70 -94 -178 17 42 30 121 -55 -44 15 -2 -267 119 134 150
7083 150 15 140 -306 56 117 -98 -39 39 -4 -29 -51 -60 -170 45 -140 -113 -43 -57 -4 35 1 217 -154 1 164
7108 164 -108 83 -63 316 139 88 124 -53 -136 -39 28 67 -183 -119 81 -188 36 -171 -2 148 72 -53 -120
7131 -120 -139 -42 127 -60 26 55 158 -49 186 -49 -201 46 24 -73 14 -73 37 -180 -59 -89 92 49 -89
7154 -89 189 157 -13 95 122 -100 -255 -86 63 -236 -41 -123 90 -151 84 155 262 -122 244 76 131 126 -92
7177 -92 75 -151 336 -95 6 146 374 177 -205 -56 127 -155 -259 177 -78 166 9 22 215 -53 7
7198 7 -35 388 52 66 62 31 -39 125 -111 -46 -9 -47 80 -22 135 162 168 88 29 -3 70 -88 -140 80 -48 -56 -239
7225 -239 57 14 -33 161 69 106 81 -14 -91 225 -96 -68 193 -23 62 -47 -83 -88 -71 12 -134 -244 -83 -9 -234
7250 -234 314 17 -107 -59 -47 -99 -21 -191 -118 247 -171 -113 -84 -34 -5 44 46 12 -7 32 -73 142 112 50 -75 -87
7276 -87 42 -118 167 -308 -272 -237 12 18 35 -41 40 -12 379 106 -29 -55 14 251 42 -81 -159 -9 35 -94
7300 -94 -72 -100 90 108 59 -126 -198 50 -61 -49 76 -153 -83 -29 -39 152 -85 136 -3 -16 44 -135 68 121
7324 121 -1 -102 86 -184 0 -31 -89 -19 1 130 73 -168 229 170 -63 -80 26 66 -13 144 62 -39 229
7347 229 -45 197 82 -35 35 -62 116 -72 121 -25 -161 12 89 137 -43 -185 -69 -190 113 -21 -33 -196
7369 -196 42 57 85 -11 -141 -42 12 159 81 -67 136 135 126 91 -113 -31 -105 91 -188 115 48 -130 -237 -105 -43
7394 -43 -88 7 -72 75 13 18 99 30 158 -105 -17 174 -16 3 -108 -63 -106 167 7 152 103 -27 172 -196 -70
7419 -70 5 7 9 159 78 51 -2 96 77 230 92 -15 6 156 39 270 -261 175 -56 -225 20 -29 11 -178 54
7444 54 31 -205 16 9 65 117 63 -175 88 8 -3 -44 38 -3 143 -52 -78 94 -67 62 144 76 74 157 -19 172
7470 172 -201 58 39 256 61 -97 197 -253 -37 -161 -121 41 127 -37 -200 -49 -59 119 -291 49 -296
7491 -296 100 181 136 -12 154 -107 -18 -8 -90 -53 2 22 41 120 -44 -72 175 26 277 -20 -123 -5 4 -7 -42
7516 -42 -107 -105 -226 -110 -6 -126 135 -46 -211 -67 40 121 -323 115 -1 48 55 -4 -109 -291 12 69 -12 -218
7540 -218 -74 -235 -58 -70 -177 67 53 -68 77 61 29 -37 -38 -31 -120 -122 -9 -82 -63 4 -88 -196 -112 30 -3 -34
7566 -34 230 -92 -34 20 17 93 60 5 -23 -143 234 106 52 -65 4 138 -63 244 -45 240 10 -179 113 -63
7590 -63 -40 205 97 49 -98 -121 -92 61 28 19 69 126 -102 -138 125 -89 162 166 -107 205 75 -74 -196 78
7614 78 -210 214 -113 31 154 151 -55 174 -52 -186 -40 -54 54 -16 43 -142 79 -208 182 -23 223 -22
7636 -22 95 197 25 2 51 156 74 -119 18 77 118 7 95 -128 -129 -300 41 55 -96 80 -317 -322 98 46
7660 46 236 -7 63 208 -364 61 154 116 163 119 -12 35 19 -22 -197 -128 -86 200 -53 36 -137 31 123 133 -126
7685 -126 181 9 2 -123 -106 58 76 148 -24 124 103 38 14 -17 190 30 13 -128 -39 -154 -6 84 -177 160
7709 160 -279 15 34 -163 -76 -244 11 -113 57 85 244 102 27 236 -61 147 120 50 -83 21 152 -37
7731 -37 -155 -179 123 100 -44 129 -163 5 -202 57 -67 -119 145 -107 254 33 -41 48 -112 -160 -142 -56 -69
7754 -69 -1 -92 73 -42 -171 30 -4 -145 289 -4 -19 -28 20 93 -63 145 -85 222 300 0 97 183 -71 -3
7778 -3 171 -11 -23 111 -256 -108 -82 29 104 -104 -19 170 191 111 -101 134 -17 166 -12 -21 -116 7 -12 41
7802 41 -180 96 124 -136 13 0 184 165 91 -198 2 39 -79 -150 -36 115 -264 110 43 389 155 -56 -59
7825 -59 -40 -48 18 -155 0 31 145 126 69 -92 -8 -12 51 174 -93 180 -108 -315 182 41 127 53 122 -28 -163
7850 -163 8 -174 124 -67 112 -56 -142 -141 88 68 69 -15 137 75 -330 -64 -150 -121 -19 -138 124 133 60 -59
7874 -59 30 80 -66 250 -77 -227 -35 -81 157 -46 98 51 -100 114 83 -55 -38 -7 159 113 75 160 9 79
7898 79 38 10 -43 -19 -88 165 211 115 -80 118 269 -136 -139 -46 -37 -39 25 79 -75 167 175 -67 -90 42 199 -93 116
7925 116 74 8 66 -122 -120 -63 120 -214 167 220 -167 -23 -4 219 -32 61 -25 -49 -99 -161 157 -32 -62 -26 131
7950 131 -64 43 49 118 61 153 200 57 -48 124 -166 158 210 47 -2 169 87 141 206 123 47 6 14 63 -34 229
7976 229 -19 106 186 21 -74 48 239 43 168 -48 -156 13 19 -10 -163 -6 -227 -9 36 -18 -32 -150 0
7999 0 141 23 -83 66 -74 155 -22 -187 24 -18 39 -123 258 -248 46 77 -188 -54 -122 -7 28 246
8021 246 -77 -85 77 8 209 117 103 -84 -118 -21 2 -194 76 -112 170 72 9 -59 -120 -46 200 -163 -101 149 95
8046 95 298 55 41 114 4 -23 50 74 81 -234 -284 -5 50 -83 71 305 36 198 95 -34 139 29 -140
8069 -140 -47 -180 -104 -127 6 -64 -75 -94 184 151 -188 -116 52 -222 -148 230 -27 161 -106 -17 -41 125 143 -93
8093 -93 170 12 -22 60 239 90 118 56 102 40 89 -108 145 -5 62 74 -104 230 59 -29 -44 146 -23 73
8117 73 -142 53 83 -146 4 174 79 -45 -20 -72 109 51 75 137 161 222 6 144 125 -86 -32 -143 47 -111
8141 -111 -118 164 156 -201 86 151 193 -205 203 72 -47 197 -61 -1 7 -23 118 9 119 -22 -81 72 -26 -119
8165 -119 139 37 84 121 50 -19 -150 2 -68 5 -85 -26 -164 79 -214 -193 -132 -59 24 -173 -264 -131 -74 139 -196
8190 -196 106
8191A06
##END NTUPLES=NMR FID
##END=
