##TITLE=1H_SR114_0
 D2O
 8 sc, 
 15.04.2022
##JCAMPDX= 6.0         $$ Bruker NMR JCAMP-DX V2.0
##DATA TYPE= NMR FID
##DATA CLASS= NTUPLES
##ORIGIN= UXNMR, Bruker Analytische Messtechnik GmbH
##OWNER= root
$$ XWIN-NMR		Version 3.5
$$ Fri Apr 15 14:10:50 2022 Russian Standard Time (UT+4h)  she@DPX200
##.OBSERVE FREQUENCY= 200.13135
##.OBSERVE NUCLEUS= ^1H
##.DELAY= (6, 6)
##.ACQUISITION MODE= SIMULTANEOUS
##.ACQUISITION SCHEME= undefined
##.AVERAGES= 8
##.DIGITISER RES= 18
##SPECTROMETER/DATA SYSTEM= spect
##.PULSE SEQUENCE= zg30
##.SOLVENT NAME= CDCl3
##.SHIFT REFERENCE= (INTERNAL, CDCl3, 0, 15.7039)
##AUDIT TRAIL= $$ (NUMBER, WHEN, WHO, WHERE, WHAT)
$$ ##TITLE= Audit trail, XWIN-NMR		Version 3.5
$$ ##JCAMPDX= 5.01
$$ ##ORIGIN= Bruker BioSpin GmbH
$$ ##OWNER= she
$$ F:/spectra/data/she/nmr/H-F/1/audita.txt
$$ ##AUDIT TRAIL=  $$ (NUMBER, WHEN, WHO, WHERE, WHAT)
(   1,<2022-04-15 14:09:44.96 +0400>,<she>,<DPX200>,
      <created by zg, POWCHK disabled, PULCHK disabled
       configuration hash MD5:
       00 E9 B6 7A A2 85 ED C7 34 08 36 98 17 FE 4E 26
       data hash MD5: 16K
       3A 0C 21 84 55 4F 33 B6 86 EC E8 64 15 C6 D6 99>)
$$ ##END=
$$ 
$$ hash MD5
$$ E9 4D A9 E8 BC A0 A7 93 A7 6E 7B 06 90 DE 8F 5F
##$RELAX= 
##$RELAX= 
##$RELAX= 
##$RELAX= 
##$RELAX= 
##$RELAX= 
$$ Bruker specific parameters
$$ --------------------------
##$DU= <F:/spectra>
##$EXPNO= 1
##$NAME= <H-F>
##$PROCNO= 1
##$TYPE= <nmr>
##$USER= <she>
##$AMP= (0..31)
100 100 100 100 100 100 100 100 100 100 100 100 100 100 100 100 100 100 
100 100 100 100 100 100 100 100 100 100 100 100 100 100 
##$AQSEQ= 0
##$AQ_mod= 1
##$AUNM= <au_zg>
##$AUTOPOS= <>
##$BF1= 200.13
##$BF2= 200.13
##$BF3= 200.13
##$BF4= 200.13
##$BF5= 200.13
##$BF6= 200.13
##$BF7= 200.13
##$BF8= 200.13
##$BYTORDA= 1
##$CFDGTYP= 0
##$CFRGTYP= 5
##$CHEMSTR= <none>
##$CNST= (0..31)
1 1 145 1 1 1 1 1 1 1 1 1 1 1 1 1 1 1 1 1 1 1 1 1 1 1 1 1 1 1 1 1 
##$CPDPRG= <>
##$CPDPRG1= <>
##$CPDPRG2= <>
##$CPDPRG3= <>
##$CPDPRG4= <mlev>
##$CPDPRG5= <mlev>
##$CPDPRG6= <mlev>
##$CPDPRG7= <mlev>
##$CPDPRG8= <mlev>
##$CPDPRGB= <>
##$CPDPRGT= <>
##$D= (0..31)
0 1.2 0 0 0 0 0 0 0 0.06 0 0.03 0 0 0 0 0.0002 0 0 0 0 0 0 0 0 0 0 0 0 
0 0 0 
##$DATE= 1650017384
##$DBL= (0..7)
120 120 120 120 120 120 120 120 
##$DBP= (0..7)
150 150 150 150 150 150 150 150 
##$DBP07= 0
##$DBPNAM0= <>
##$DBPNAM1= <>
##$DBPNAM2= <>
##$DBPNAM3= <>
##$DBPNAM4= <>
##$DBPNAM5= <>
##$DBPNAM6= <>
##$DBPNAM7= <>
##$DBPOAL= (0..7)
0.5 0.5 0.5 0.5 0.5 0.5 0.5 0.5 
##$DBPOFFS= (0..7)
0 0 0 0 0 0 0 0 
##$DE= 6
##$DECBNUC= <off>
##$DECIM= 32
##$DECNUC= <off>
##$DECSTAT= 4
##$DIGMOD= 1
##$DIGTYP= 9
##$DL= (0..7)
0 120 120 120 120 120 120 120 
##$DP= (0..7)
150 150 150 150 150 150 150 150 
##$DP07= 0
##$DPNAME0= <>
##$DPNAME1= <>
##$DPNAME2= <>
##$DPNAME3= <>
##$DPNAME4= <>
##$DPNAME5= <>
##$DPNAME6= <>
##$DPNAME7= <>
##$DPOAL= (0..7)
0.5 0.5 0.5 0.5 0.5 0.5 0.5 0.5 
##$DPOFFS= (0..7)
0 0 0 0 0 0 0 0 
##$DQDMODE= 0
##$DR= 18
##$DS= 0
##$DSLIST= <SSSSSSSSSSSSSSS>
$$ [...]
##$SUBNAM2= <"">
##$SUBNAM3= <"">
##$SUBNAM4= <"">
##$SUBNAM5= <"">
##$SUBNAM6= <"">
##$SUBNAM7= <"">
##$SUBNAM8= <"">
##$SUBNAM9= <"">
##$SW= 18.05172834244
##$SWIBOX= (0..15)
0 0 2 0 0 0 0 0 0 0 0 0 0 0 0 0 
##$SW_h= 3612.71676300578
##$TD= 16384
##$TD0= 1
##$TE= 0
##$TE2= 300
##$TE3= 300
##$TEG= 300
##$TL= (0..7)
0 120 120 120 120 120 120 120 
##$TP= (0..7)
150 150 150 150 150 150 150 150 
##$TP07= 0
##$TPNAME0= <>
##$TPNAME1= <>
##$TPNAME2= <>
##$TPNAME3= <>
##$TPNAME4= <>
##$TPNAME5= <>
##$TPNAME6= <>
##$TPNAME7= <>
##$TPOAL= (0..7)
0.5 0.5 0.5 0.5 0.5 0.5 0.5 0.5 
##$TPOFFS= (0..7)
0 0 0 0 0 0 0 0 
##$TUNHIN= 0
##$TUNHOUT= 0
##$TUNXOUT= 0
##$USERA1= <user>
##$USERA2= <user>
##$USERA3= <user>
##$USERA4= <user>
##$USERA5= <user>
##$V9= 5
##$VALIST= <valist>
##$VCLIST= <CCCCCCCCCCCCCCC>
##$VD= 0
##$VDLIST= <DDDDDDDDDDDDDDD>
##$VPLIST= <PPPPPPPPPPPPPPP>
##$VTLIST= <TTTTTTTTTTTTTTT>
##$WBST= 1024
##$WBSW= 4
##$XGAIN= (0..3)
0 0 0 0 
##$XL= 0
##$YL= 0
##$YMAX_a= 213711
##$YMIN_a= -306614
##$ZGOPTNS= <>
##$ZL1= 120
##$ZL2= 120
##$ZL3= 120
##$ZL4= 120
##$ABSF1= 10
##$ABSF2= 0
##$ABSG= 5
##$ABSL= 3
##$ALPHA= 0
##$AQORDER= 0
##$ASSFAC= 0
##$ASSFACI= 0
##$ASSFACX= 0
##$ASSWID= 0
##$AUNMP= <proc_1d>
##$AZFE= 0.1
##$AZFW= 0.1
##$BCFW= 1
##$BC_mod= 2
##$BYTORDP= 1
##$COROFFS= 0
##$CY= 11.3945322036743
##$DATMOD= 1
##$DC= 2
##$DFILT= <>
##$DTYPP= 0
##$F1P= 2.36226072786647
##$F2P= -0.459571619588291
##$FCOR= 0.5
##$FTSIZE= 0
##$FT_mod= 4
##$GAMMA= 1
##$GB= 0.15
##$INTBC= 1
##$INTSCL= 1
##$ISEN= 128
##$LB= 0.24
##$LEV0= 0
##$LPBIN= 0
##$MAXI= 10000
##$MC2= 0
##$MEAN= 0
##$ME_mod= 0
##$MI= 1.114404
##$NCOEF= 0
##$NC_proc= 0
##$NLEV= 6
##$NOISF1= 3.799351
##$NOISF2= 2.8
##$NSP= 1
##$NTH_PI= 0
##$NZP= 0
##$OFFSET= 15.70392
##$PC= 1
##$PHC0= -18390.27
##$PHC1= 5.00074
##$PH_mod= 1
##$PKNL= yes
##$PPARMOD= 0
##$PSCAL= 0
##$PSIGN= 0
##$REVERSE= no
##$SF= 200.130013532006
##$SI= 16384
##$SIGF1= 3
##$SIGF2= 2
##$SINO= 400
##$SIOLD= 16384
##$SREGLST= <1H.CDCl3>
##$SSB= 0
##$STSI= 0
##$STSR= 0
##$SW_p= 3612.71676300578
##$SYMM= 0
##$S_DEV= 0
##$TDeff= 0
##$TDoff= 0
##$TI= <>
##$TILT= no
##$TM1= 0
##$TM2= 0
##$TOPLEV= 0
##$USERP1= <user>
##$USERP2= <user>
##$USERP3= <user>
##$USERP4= <user>
##$USERP5= <user>
##$WDW= 1
##$XDIM= 8192
##$YMAX_p= 0
##$YMIN_p= 0
$$ End of Bruker specific parameters
$$ ---------------------------------
##NTUPLES= NMR FID
##VAR_NAME=  TIME,          FID/REAL,        FID/IMAG
##SYMBOL=    X,             R,               I
##VAR_TYPE=  INDEPENDENT,   DEPENDENT,       DEPENDENT
##VAR_FORM=  AFFN,          ASDF,            ASDF
##VAR_DIM=   8192,          8192,            8192
##UNITS=     SECONDS,       ARBITRARY UNITS, ARBITRARY UNITS
##FACTOR=    0.0002768,     1,               1
##FIRST=     0,             0,               0
##LAST=      2.2672688,     0,               0
##MIN=       0,             -306614,         0
##MAX=       2.2672688,     213711,          0
$$ Real data points
##PAGE= N=1
##DATA TABLE= (X++(R..R)), XYDATA
$$ [...]
2225C546j116k962k706J0O26J601K818J773o61j267j900k305r11O08K312K185
2241A651J957j97j739k182k554r77J530K408K094J335J45j982k515j688n71O30
2257b655K211K492J241j57j782k652j409n79Q65K255K786Q55p29j663k459k032
2273c412k1J630J893K405J310j040k130k121j545j87J397K168K304J072j144k258
2289C21j973j516j0J590K676J790J63n73k162k115j452L14J722J895J919O27q43
2306B373k241k364q60L16J425K182K407r9j027k080j800j377K04J696K645J001
2322B401N56j119k103k227o92Q56J653K122J546j7j565j955j832k26K04J741K155
2339A498J598k92j419j815k029p44Q47K094K238P71j70j338j931k005k31R96J725
$$ y = [3546, 2430, -532, -3238, -3228, -2602, -1001, 1817, 3590, 2929, 1662, -238, -2543, -3454, -2846, -534, 1651, 3608, 3411, 1672, -510, -3064, -4041, -2511, -103, 1991, 3326, 3471, 1489, -1026, -2714, -3285, -2655, -444, 2048, 3289, 3132, 1350, -1302, -2711, -3290, -2425, -170, 2616, 3471, 2742, 1079, -1380, -3412, -3433, -1803, 90, 2495, 3805, 2765, 635, -1486, -3031, -3218, -1821, 347, 2651, 3723, 2579, 321, -1652, -3168, -3178, -1588, 1088, 2878, 3041, 2468, 306, -1809, -3261, -2947, -1225, 670, 2589, 3216, 2373, 132, -2232, -3092, -2776, -1351, 831, 3238, 3139, 2112, 32, -1768, -3145, -2941, -1245, 1400, 2401, 2957, 1838, -265, -2492, -3184, -2328, -675, 1447, 2993, 2976, 1411, -544, -2376, -2602, -2398, -657, 1498, 3096, 2804, 1385, -430, -2459, -3203, -2356, -262, 1976, 2747, 2577, 1239, -692, -2697, -2928, -1932, -207]
2356b07J999R76O2j687k499j139l67P75J773K379R44p13j462k100j583p2R63K527
2374E69J694O56n25j439k393j527J90J400K167J460O04p42j876j993p86j35J285
2391a391K032J823O02j322j608j431j410J2J716J944J653K07r06j733j931j424
2407c167Q29J502J673J625M40j075j984j749q86P76J122J885J892j14j386j608
2423b25j801r39P98J789J960J005R9j249k143j470o82Q42J694J802J126Q8j460
2440A234k214j328l76N41J725K160J073l00j637j451j907k31P00J876K001N26
2456B392k40j171k132j236j24R80J658J463R21m83j257j646j520k71J083J578
2472eJ952J151o69k440j103j572l90J864J998J509J14n54j776j899o28K32R45
$$ y = [-207, 1792, 2768, 2830, 1143, -1356, -2495, -2862, -2087, -314, 2065, 3009, 2296, 834, -1266, -2849, -2921, -1958, 569, 2263, 2919, 2394, 955, -1438, -2965, -2775, -1375, 792, 2252, 2856, 2114, 238, -1755, -2541, -2676, -1391, 641, 2464, 3066, 1744, 136, -1295, -2705, -2693, -977, 967, 2620, 2827, 1921, 188, -1743, -3167, -2338, -836, 837, 2462, 2902, 1827, -157, -1906, -2792, -2016, -894, 991, 2883, 2769, 1383, -225, -2026, -2965, -2167, -378, 1582, 2587, 2686, 1437, -706, -2176, -2858, -2016, -322, 1480, 2606, 2694, 1234, -980, -2308, -2684, -2143, -418, 1742, 2815, 2515, 878, -573, -2480, -2711, -2011, -135, 1866, 2392, 2152, 981, -1151, -2387, -2511, -1531, 127, 1590, 2511, 2028, 771, -875, -2395, -2666, -1583, -5, 1947, 3098, 2429, -11, -1114, -2686, -3076, -1212, 786, 2295, 2409, 1855, 79, -1820, -2448, -2216, -1271]
2489a271K163J268j2m21j412k052m81M05L59K229J506L47j195q92k311j097R77
2506a890J051J680J616J88j415j213j532j420P90K029J131J171P61j498k344q69
2522a764m52j70K138K162J56N0o25k448j204J22J99J129K597L38q94J82j362k550
2540b396k88J553K32J806K415j038j702q44j723j442K236J724M93J741j64k590
2556A3j523L9p87O09K866M02m88J028j177k475j64O5l84J713K583r0p04l0l227
2575a731j431J476R32R69K157M23j648j225l95k177M50K138N84M60J622j013j974
2592c83m98j232r21K343K325k79O78J1k502j511M22q4N31K554N36o02m4r29k364
2611a949j77R03jJ811K046n32j159p72k040j348J502J682J228J459j42k093j288
$$ y = [-1271, 892, 2160, 2148, 1727, 315, -1737, -2218, -1813, -1454, 775, 2281, 2628, 1433, 541, -1770, -2867, -1890, -839, 841, 2457, 2645, 1230, 17, -1515, -2935, -2145, -116, 1015, 2186, 2947, 1449, -895, -1764, -2216, -2386, -248, 1914, 2070, 2120, 1495, -953, -2157, -2035, -1836, -707, 1890, 2228, 1334, 1516, 154, -2396, -2684, -1131, -899, 907, 3322, 2284, 582, -262, -1985, -3427, -1191, 533, 1026, 2767, 2603, 13, -1510, -1471, -2258, -1649, 1217, 1619, 1131, 2159, 982, -1493, -1657, -1592, -1976, -263, 2320, 2230, 1526, 1496, -1731, -3162, -1686, -754, 215, 2372, 2795, 1147, -78, -473, -2650, -2200, -62, 522, 982, 2604, 1591, -383, -881, -2113, -3034, -691, 1634, 1355, 2033, 2044, -458, -1969, -1547, -1631, -1100, 1454, 1990, 1388, 1344, 415, -1949, -2126, -1223, -1224, 587, 2633, 2101, 942, 170, -1870, -3218, -1716, -34, 1194, 2653, 2511, 418, -870]
2628h70n91p58R28J850P82J46J99j011j420m07o15k25J397J963N37k3m46j850
2646d14k003R5R32J124J822O33m17j357j370j149J61J044J045J278N05n47j130
2663B52r54j001j52R63J374J117K78j23j356j460j296K76J051J602J012M18m90
2680A511j728j146m01p9J041J380J281L80r64j191j397o09J06J111J616R27j84
2697A654n42j226j713k23N85J118J089J079j87p95q31j297q92R27Q59R65J142
2714A712O42j371j551l17j354J94K076J577K26j54j077j216r33k51N40J192J411
2731A346L51j39p36j477r59K78Q2Q35J548J033l27j236p20j755p2J221R02J397
2749A572K25k82j170j206r24r8J048J440O50L25J62j626j167o01j03N31J600J219
$$ y = [-870, -1461, -2219, -1291, 559, 1341, 1487, 1686, 675, -745, -1152, -1767, -1992, -595, 1368, 1905, 1882, 1436, -414, -2417, -2322, -1390, -266, 1556, 2189, 1772, 415, -955, -2104, -1943, -899, 146, 1424, 1929, 1382, 252, -702, -1703, -1855, -892, 482, 1599, 1877, 1754, 398, -1062, -2358, -2082, -1031, 571, 1583, 2001, 1511, -217, -1363, -1764, -1843, -802, 578, 1859, 2239, 1275, 84, -1313, -1922, -1816, -705, 911, 1838, 1654, 1112, -114, -1827, -2050, -1465, -347, 742, 1821, 1634, 839, 8, -1289, -2181, -1254, -395, 570, 1712, 2354, 983, -568, -885, -2239, -2045, 31, 1608, 1834, 1680, 603, -613, -1546, -1797, -1257, -65, 1346, 1697, 1558, 822, -655, -1614, -1336, -1254, -419, 1129, 2162, 1835, 599, -121, -1876, -1948, -727, 175, 1572, 1797, 1515, 345, -861, -1785, -1883, -835, 605, 1255, 1580, 1742, 116, -1051, -1652, -1755, -1224, 376, 1595]
2767A595L27o11j077j313p24K21P36J229J279j0n62p97j268j010O38J074Q08R17
2785A452L54n17j521r00m71J01R62J202J065J4o24j411q75n43P0J314J209O09
2803A490j82j59r26j694m50Q47O70J019R63K23j075j144j097k7R0J490O97J103
2821A838l61r65j117p32k15L13J412R15M35k82m62j356q55j87P76P14J233O89
2839A793m41p78j323o64J90K23R91J161O99o43r42p36j079l21J195R66R69K19
2857A479k68j054p90j130J14R81J059N98P10k85j170j256m75J87M16J306R70J45
2875A537p22o57j047m15M4O99J164P33K34p71q25j091m42K85R91R67O32J74l33
2894A157j415p85k74L6Q78J303P26j57n32j030j098m79L11J273R62M29q8p94o89
$$ y = [1595, 1922, 1311, 234, -1079, -1803, -1582, -846, 383, 1662, 1652, 1090, 293, -975, -1985, -1347, -273, 535, 1452, 1806, 1289, -232, -1132, -1603, -1502, -540, 662, 1727, 1741, 1117, -294, -1169, -1712, -1642, -328, 881, 1490, 1308, 1149, 223, -1471, -1921, -1074, -404, 615, 1578, 1801, 726, -418, -1515, -1542, -1452, 38, 735, 1838, 1477, 512, -605, -1337, -1552, -1239, 173, 1088, 1523, 1241, 779, -577, -1432, -1619, -843, -129, 1104, 1793, 1352, 574, -749, -1413, -1223, -1000, -9, 1152, 1851, 1208, 266, -470, -1549, -1870, -675, 291, 1260, 1479, 1211, 157, -633, -1763, -1649, -668, 391, 989, 1699, 1414, 244, -1012, -1487, -1300, -884, 422, 1392, 1537, 815, 158, -889, -1304, -1260, -561, 603, 1336, 1570, 799, -26, -1117, -1559, -1274, -283, 684, 1316, 1490, 1157, -258, -1043, -1317, -1281, -403, 900, 1626, 1469, 937, -93, -1191, -1670, -1359, -86, 876, 1305, 1217, 423, -266]
2913b66j091j62M02R48R59Q05k00j023o13j060k05N39Q73R55P17n43o36q01r81
2932a383k29O93J253Q49j14K35j036r42n80q0M87J200N09O54n6j061j302n81K77
2951a207M01J158R25J01l23q26r85o79J42O97R93O43N28l91j023j070l17M0N45
2970f48J029R12J91l74j196o15o59K84N34J241N42J17o58q76n24p07K34J032Q03
2989F62L60L63n71p83j270oJ67P15J110O71k37k85j190r94k2K10Q57J199M83k66
3009A173p31l78j096n44P22Q60O46N42J25q00q85p80l64P86Q86N19M85K99j430
3028C5j141N15n02J78J068R18n67K53k23j058n11K63J56N21J125K01k14k41j034
3047b58j383K48Q48L65J241J028j175j482j85m01j72J426N43M1N21m03j118k46
$$ y = [-266, -1357, -1519, -1117, -169, 790, 1595, 1395, 372, -241, -1301, -1506, -967, -94, 861, 1578, 1035, 399, -402, -1383, -1612, -919, 334, 1183, 1069, 1304, 268, -674, -1254, -1334, -847, 353, 862, 1516, 1460, 399, -903, -1484, -1207, -806, 352, 1277, 1378, 1055, 229, -756, -1435, -1293, -596, 397, 1040, 1568, 1177, 154, -916, -1233, -1193, -648, 381, 1293, 1484, 1110, -86, -701, -1360, -1076, -542, 699, 1241, 1358, 700, -176, -700, -1407, -1173, -141, 662, 1022, 1385, 814, 31, -1239, -1245, -1078, -363, 747, 1418, 1181, 896, -294, -1288, -1310, -1100, -243, 956, 1439, 1173, 442, 64, -1032, -1576, -854, 6, 652, 1194, 1319, 519, -366, -1146, -1510, -724, 162, 681, 1166, 1465, 35, -1106, -591, -1093, -915, 153, 1071, 504, 757, 534, -524, -1035, -772, -616, -95, 1030, 1231, 1017, 776, -258, -1641, -1393, -545, -180, 1061, 2089, 914, -568, -753, -1154, -1326, 100, 643, 684, 1205, 802, -316, -562]
3065e62j93m40L98J338J23L18L71j039j414K7J75m7J317J061m36l84n75j166k55
3084a383N46O79L61J218k20q27k77m59r91J41J009N61L59M99o10j125k42l38l
3103a102J253O45k0Jl7j264o11M70m2K78J557K25p58M5o92j523K58P58O4J272
3123G77N84m10q45l65q77k70R06J019J70L26k69q01k36j72n88L65J097K84N8M28
3143A181n16j193m06j65J00J376O45J36j61r13r69o20O79N43M49Q89Q5p13l74
3162E3p39k85Q2M26O17O50M94m43r24n24n34J85O91P44K98J69m88q07k39l33j11
3183a018O10J069L60m1l50p50o79j50J37M68R91L66j51j94j020q55n7O60L75P53
3203E24N04m28m22k76q50K5M50K20O58M76j48k00j003r6o13M48Q75M65L62j50
$$ y = [-562, -755, -1195, -797, 541, 664, 982, 1353, 314, -1100, -1073, -898, -945, 372, 1433, 997, 613, 38, -1128, -1383, -837, -158, 203, 1421, 1201, 374, 97, -362, -1353, -1212, -203, 358, 717, 1216, 606, -519, -761, -1099, -1102, 151, 796, 776, 777, 740, -524, -1135, -665, -707, -429, 1128, 1353, 595, 640, -52, -1575, -1317, -559, -495, 777, 1361, 951, 106, -259, -1136, -1406, -500, 519, 689, 1015, 746, -55, -291, -463, -1051, -686, 411, 695, 753, 1181, 665, -528, -934, -1099, -999, 377, 1022, 1158, 997, 84, -885, -1505, -826, -283, 166, 1055, 1140, 427, 53, -686, -971, -889, -463, 154, 804, 1298, 855, -69, -593, -1127, -942, -251, 493, 791, 960, 472, -335, -574, -907, -1018, -408, 661, 1021, 980, 630, -120, -799, -949, -812, -344, 647, 1013, 862, 668, -352, -1207, -1264, -604, -229, 524, 1028, 600, 178, -98, -948, -923, -473, -253, 405, 881, 733, 533, -470, -566, -1179, -731, 144, 609, 971, 821]
3223H21r04p04J44n39N12J232K82P8k41n27p37l94L12R7N64P36J30k24l12q03
3243d77n54J63L33O59O84M16n61o27p82k85K17M55N16O80L9L7p41o26m34j40O76
3264c52N42O78K12l77n80q49n5P3L01P28M68L1j74p58o07l25M22K78O41N08L2
3285H37k52n59n99k68R2N09O45O49R1p12p13l86l78K62O71P61M9R0m53n69o25
3306h58N2Q6O09Q84%K6o20l82n92m9L31O05M62L21j78m24m82o10o0N22K60O82
3328E85K80j28o26k56m73j74M81P24J72N77m55l61q91n40L34L41Q59K29j06L12
3348H84p28q06k45J64L21L96Q81L8l63n02o20j89K17K77L30P91j48k66l72n29
3368d69l73J67N02O83K03Q4k05p59m80kN6L10O94M88k26k12p01l21j64O0N42P63
$$ y = [821, -83, -787, -643, -1182, -670, 562, 844, 922, 681, 154, -583, -977, -665, -568, -4, 732, 862, 638, 326, -477, -1031, -868, -535, 124, 808, 1224, 663, 36, -746, -1031, -814, -359, 157, 837, 876, 913, 172, -454, -888, -1028, -352, 190, 868, 1080, 703, 123, -726, -781, -708, -407, 321, 789, 820, 646, -112, -719, -1044, -622, -344, 297, 805, 837, 585, 26, -573, -841, -749, -240, 405, 1054, 1145, 433, -280, -666, -1044, -782, -111, 650, 699, 789, 336, -233, -858, -806, -720, -111, 773, 773, 799, 179, -203, -795, -844, -513, 92, 554, 875, 697, 273, -209, -819, -879, -357, -97, 585, 865, 737, 111, -145, -618, -792, -311, 413, 585, 1162, 707, 346, -545, -1085, -751, -410, 449, 678, 572, 884, 156, -650, -895, -731, -410, -14, 867, 905, 542, 40, -580, -769, -552, -275, 55, 846, 698, 432, 60, -469, -842, -675, -173, 510, 713, 797, 592, -167, -647, -649, -593, -283, 411, 899, 673, 461, -240, -561, -725, -665, -123, 640]
3390F40J92m0n81l08k67m25L09N14M50K49J42n57n91l34n9J91K99L64M50j74m04
3411F0n17j91p1M35N10L34L22o30n4n17n25K76J38M27M95M00j31q17k48o73K11
3432g66L41N09N62L69o14k38m30l90P5K20N44N13k2l39j75p65p9q7O88K62M71
3453F49J0n7o51n44jj16N00Q3O35J43q9o11k87k22J70K62N04j25M81j48q04o09
3475h27J26N2K94R21J13K9m96l81n82L90r8J58Q90K61j36m54n30j76j40j0M04
3496a92O62J0J1j31n28l67k25R1P29N14K12lo17o90k56L09J77K14P25J42l66l96
3518B5n1n98L5L15K99N48O6k30k29n24l95K52J98N85M0K11L5o16m95J16P7j07
3540d43M59O09k77O6j65l18n78K73M5L52N54K95o95lm95m86L01M71K57K08M55
$$ y = [640, 832, 792, 211, -97, -364, -789, -480, 34, 484, 733, 875, 318, -273, -607, -666, -475, -176, 188, 638, 464, 60, -457, -648, -719, -284, 226, 560, 882, 252, 198, -319, -844, -568, -430, -3, 492, 892, 761, -56, -304, -977, -766, -425, 84, 646, 1015, 401, 163, -267, -657, -582, -362, 182, 695, 673, 334, 159, -606, -685, -772, -84, 178, 649, 659, 602, -49, -593, -594, -710, -210, -127, 508, 651, 562, -49, -336, -558, -388, -126, 378, 253, 734, 586, -218, -827, -701, -649, -355, 566, 679, 708, 212, -169, -751, -361, -459, -301, 589, 850, 714, 260, -270, -446, -586, -596, -192, 470, 480, 491, 360, -168, -535, -760, -669, 60, 574, 786, 783, 166, -524, -780, -471, -294, -80, 645, 787, 421, 25, -26, -624, -589, -274, 25, 573, 639, 409, 180, -344, -739, -487, -289, 296, 336, 547, 582, -34, -529, -413, -336, -443, 16, 625, 348, 414, 249, -69, -647, -374, -329, 23, 577, 872, 177, 174, -321, -807, -506, -35, 222, 430, 885]
3561H85p22l03j59O6k95K68N13j1L28j76p16o5j67n8M10N72L00m09K13o12n15
3582f53J48L79r8M79P28n65k93k1n45j01L68Q3Q9P97k10o61q3l36l00K55O54L75
3604D89K04j30k85n91RO8M1l5N89j73L83l40m76j35j02p9O52K37jk89K52m70n77
3627g59J89N27K4K91J79k17l16j30k67P8K49J42J94K88k01k78j52n31J63J07N91
3648A71K60j48K22l33o05l2p5M68M14L11r4j95o89j89kJ9M32K36K19O0j36l57
3670d3j42j76O4L80Q5M28k62m5n54o9p7L10K72J17J54q9k68j87k46k47K18N70
3692A93Q7M0K98l92l89m28m0M43N9O10j96j38K5k17m12J69L24r1K25L78j33m7
3714C68n33k20j14L03n8N88O87o79j98k75k27o4J42M83J69J15m2m25l07p5q0J47
$$ y = [885, 163, -140, -299, -233, -528, -260, 253, 242, 570, 394, -322, -387, -554, -612, -202, 370, 670, 261, 474, -138, -653, -505, -126, -224, 255, 983, 418, 125, 104, -441, -542, -174, -91, -2, 795, 585, -76, -159, -495, -795, -540, 114, 489, 693, 563, 278, -313, -304, -236, -195, -230, 359, 186, 569, 229, -247, -382, -484, -563, 89, 326, 325, 36, 288, -182, -759, -570, -43, -19, 272, 451, 234, -82, -212, -479, -401, -152, -10, 184, 472, 271, -7, -159, -690, -527, -420, 171, 431, 283, 505, 172, -433, -465, -540, -72, 342, 653, 559, 364, -325, -514, -516, -497, -65, 171, 390, 450, 314, -43, -185, -361, -297, 83, 168, 596, 334, 289, -265, -334, -411, -101, 171, 288, 442, 353, 85, -102, -348, -595, -377, 193, 280, 320, 618, 226, -163, -591, -631, -188, -129, 481, 285, 147, 172, -45, -457, -288, 36, -55, 170, 548, 415, 368, -165, -385, -499, -196, -254, 334, 1021, 342, 144, -131, -358, -422, -280, 203, 372, 487, 445, 20, -287, -362, -442, -295]
3736b95N77J35r6nk94m05l5j2K22L80KL57l00j27k88l51K09K15K55K87m3k37m4
3759A07k54k73j17K98M01%K68L4r23Q5p4O9M45R0K64L0k60l01k58M1J2L08L30
3782C22N6j67r4j37l30J9J47J64N3L81L10p11k60j54j52L31M52J57PJ11m49j93
3804a37k39qJ84K16L88J28j34l96l01k32K00K6J41N51Lm9j15l55m57K11K12L54
3826A91K9L01j94k73k95n9q9K36J71L74J28l42k12l77M7J44K42k24O39l45R3j50
3848C5j88k73J39J07L00K50q6j74k22l17p0J63J36M48Q9k34r3j40k98J11Q4J05
3870a28J68N10k44q1k87j45p4K19j07M47r1N0j22k71j66o0k5L03M28K82l05M7
3892C48n89O0k94K86P6M23Q7Nl22j59j46J04j7J21K73L08k07l72j35l60J51R0
$$ y = [-295, 282, 417, 321, 316, 22, -383, -418, -430, -208, 172, 174, 531, 231, 104, -184, -535, -326, -111, 144, 431, 388, 151, 107, -147, -420, -537, -239, 162, 162, 430, 464, -459, -374, -448, -379, 66, 156, 420, 450, 190, -111, -369, -328, -316, -8, 322, 378, 211, 117, -20, -350, -331, -184, -20, 33, 414, 724, 13, -247, -401, -553, -222, 230, 387, 394, 505, 56, -137, -376, -384, -200, 16, 404, 532, 398, 2, -299, -531, -331, -305, -164, 387, 390, 341, 226, -129, -586, -375, -163, 191, 220, 521, 327, 54, -241, -300, -389, -153, 18, 392, 520, 178, -34, -411, -364, -220, 22, -202, 437, 92, 185, 35, -153, -426, -287, -180, 120, 370, 284, 110, -112, -429, -499, -336, -200, 248, 337, 103, 10, -130, -428, -317, -233, -128, 40, 550, 306, 225, -62, -207, -281, -62, -169, 278, 187, 237, 115, -156, -322, -382, -407, -104, 324, 606, 301, 348, -241, -181, -475, -189, -113, 310, 397, 402, 80, -79, -225, -121, -138, -17, 256, 564, 357, -15, -150, -510, -359, -269]
3914b69L31P9l9M26l19k31k93O8O6L39K4N3n1j66k56J16l75M68l2L60j0j19r0
3937H0n84J25k32P73l6J75j65L3k48l93L30j55J30M83J37j65l2l09j74j09M20
3958H4p8N2K55q8%j60k58O6l5J52J84J28j35M3k90k06J6J3J97K55R9j17j64j90
3982a77j04r4Q4J01M09J73l41R5k59l7k29J26L53L2K11q4L7o12R3o1j41N77j6
4005A36K41q8k45j59j27J08O1J58M6q9R4o0j73l6j04j0J02K17K47j36j53j58q1
4028b09Q0K53j11J43J07J10o24j59J88q8J48J69j15L04j1l03%L9j64NK48K47J39
4051C96k37j19k70k07L18K40J29K42j00l55l2j97k16K92K36j72J81no6k23J29
4072c6p9k37L52P6q8L22Pm31L9k88J92L4L41K12j33K83o59j29J07k21L60K4K09
$$ y = [-269, 62, 141, 102, 528, 209, -22, -315, -247, -181, 158, 182, 235, 184, 18, -238, -122, -497, -29, -61, 299, 289, 170, 80, -504, -379, -611, 162, 126, 301, 136, 169, -79, -472, -142, -297, -167, 316, 453, 288, 256, -53, -227, -336, 84, 6, 58, 313, 225, 225, 65, -193, -127, -162, -10, 174, 302, 167, 210, -80, -286, -270, -257, -60, 195, 294, 177, 13, -177, -281, -375, -291, -190, 219, 392, 51, 146, -113, -150, -379, -253, 100, 132, 343, 259, 296, -316, -223, -284, -425, 152, 136, 377, 289, 44, -115, -242, -134, -73, 85, 131, 42, 136, 76, -97, -133, -237, -247, -145, 72, 319, 183, 30, -128, -209, -129, 124, 13, 156, 263, 373, -251, -410, -222, -310, -162, 7, -108, 196, 185, -118, -118, -79, -243, -238, 10, 257, 396, 159, 40, -230, -437, -119, 121, 250, 492, 392, 37, 5, -192, -408, -116, 120, -52, 129, 124, 58, -165, -36, -115, -352, 0, 76, -12, 310, 317, -114, -75, -363, -171, -137, 204, 416, 283, 566, -93, -222, -115, -336, 24, 48, 257]
4095B57j25k91L5j30K2J46L1K92M0k78p6p4J42l04L16k16K48L37j72k02j70j41
4117c13j05K05K01L18J10j25j88l13n8J98K1K97M3k04O2j50j83j60K21Q7Q6J21
4139A71Q3n9k68L49n34R8NPM13P0j15l17o8j25J64k3L16p9K08k14L8j06k25J30
4163h1R4J52J5J3O1O6o87J61k14K91L44J81l53p1Q9k25K46l23R0M10j52L00l59
4186D8j09k69M2J68J88j67J46L82m82K35m07j0P1K76K11k13J0j8k02o1m6J49N3
4209eJ77J54l12pj59N7l40J15M79n4L23m21K65n22m4k4J48L92rJ60l12j96R4k83
4233c24N8K36J17J00J84l39J73k03j4j03k3M18l18L07N3k92k18m0Q2J69J0L74
4255D07n43O58o50N5m39K28K26M3m2K11k14J19k41j36J34K91k44M67r6j88m9j90
$$ y = [257, 132, -159, -124, -254, -232, -86, -55, 237, 277, -1, -77, -151, -9, -313, 3, -213, 35, 372, 200, -2, -172, -313, -418, -213, -12, 306, 416, 291, 103, -210, -268, -70, -49, 248, 291, 87, 149, -1, -184, -344, -123, -36, 50, 171, 254, 195, -73, 276, -258, -160, -155, -148, 265, 335, 220, -97, -165, -290, -126, -149, 167, 88, 296, 82, 120, 14, -211, -81, 13, 165, 180, 193, 254, 320, -367, -206, -420, -129, 215, 396, 43, -28, 61, -164, 82, -241, -151, 259, 107, 407, 48, -61, -330, -288, -120, 68, -99, 47, 429, -53, 182, -225, -235, -164, 112, 323, 110, 120, 102, -100, -161, -207, -58, -5, 172, 326, 14, 7, -152, -95, -435, -320, 159, 105, 428, 7, 272, -250, -294, -318, -170, 222, 213, 373, 61, -135, -41, -324, -266, -30, 87, 187, 371, 32, 205, 2, -12, -115, -138, 280, -38, 269, 322, 30, -188, -228, -146, 23, 33, 407, -136, 522, -128, -73, -512, -284, -58, -15, -57, 154, -60, 59, -182, -318, -184, 107, -137, 330, 234, 46, -3, -193]
4277a93J44l3K21l2L42k28j67p9j21j02k3K26K11m9M1m21K47n9j05N7L1j00P23
4300E31l57k8m26j0J21JM13J25l52J35j40M4j67O2M3r8M47l13J6j2j87k02J65
4323a89J28k4L44K83l83k33M7j32j48K96k21L92l6N0k98j00K08l95J84M18L5l6
4345A90J03k88l13N3J19j4O3J36J85l0p3j79jk00M8J06N66l51o3m5j52k7J21J35
4369H9k9P4K2q5j13m08J57J81J22K14j09k2l5o0k05O3O4K78j17j3K12l72J80l45
4393b57Q3O4L0k26N25l1j66l0j11j57k6L37M0oJ8L8l88J97k29J68qN23j95r8j30
4418c5J01k25j47L61k47L10n7j50q4J62l19J23JK27L15l68J69j12l06L40j71m3
4440a55J53o4K90r8k36k21J57J49j48K28K4N3n6j41n7l17K76n0M70n4k40J01q1
$$ y = [-193, -49, -82, 139, 107, 449, 221, 54, -25, -146, -248, -271, -45, 166, 117, 158, -263, -16, -75, -180, -123, -92, -192, 531, 174, 146, -280, -290, -169, -168, 245, 370, 18, 153, 13, 57, -110, -48, -5, -103, 344, 31, 47, 35, -152, -354, -189, -61, -85, 259, 542, 159, -74, -27, -159, -307, -11, -232, 160, 124, 174, -124, -224, -16, -411, -227, 191, 226, 190, 293, 5, -308, -255, -136, -150, -87, 49, 234, 204, 131, -48, -49, -249, -201, -95, 471, 120, 57, 12, -140, -167, -46, 89, 60, 134, 156, 71, -42, -450, -293, -112, 10, 224, 115, 93, 58, -2, -207, -144, -80, 198, 81, 68, 280, -92, 88, -257, -174, -110, -80, -306, 219, 188, 22, -8, -119, -276, -302, 35, 75, 69, 87, 125, -263, -66, -295, -127, -135, 388, 193, 95, -35, 66, -159, -306, 55, -192, 118, 61, -89, -173, -11, -330, -207, -206, 21, 336, -32, 137, 25, -281, 59, -112, -155, -2, -66, 224, 126, -110, -331, -174, -25, -173, 55, 79, 132, 76, -65, -122, -439, -163, -213, 257, 203, -37, 64, -17]
4463a7q0J05k2k2J30l0K20j04k35j20j31p8N73j60K09k23J83j40k44P2q7J64J42
4486A05j42J33l3j87K15m36K64J23l6J11j81N0P5l5m1mJ49L7l36L52m5o0j2l04
4510b38L32o0K4K36l2j79j0k55J62j21K37Q7k4j7k34j77M5j2Q3J56P4J94l08M2
4534Ej65j66K67k12J11L02m0NQ8m1k95j92L91j75J49j1K57m28j00K83j8r4M7L72
4558C40p3l24J27J36l35J48j06K7j8L23l42o2ll2O4K21r6J80Kr3k83n2J01J26
4582b4K13j20L0m9J22J67n32J12M1j34K48J27j5p1m1j78K13k01p1J67N0o7O4M
4606E5l22q1J75J82j67M18j9j96j68L11k10k19L04L6J14J51m63K31j22p1j90N22
4628B71L5j14q0J42m38l8J53J00J3K52j93j0j10J37o0j07J71j88L34Q0j20l63
$$ y = [-17, -97, 8, -14, -36, 94, 64, 284, 180, -55, -175, -306, -384, 189, 29, 238, 15, 198, 58, -186, -114, -201, -37, 105, -37, 96, 63, -124, 91, -345, -81, 42, 6, 117, -64, -14, 61, 26, -15, -19, 130, 167, -169, 183, 138, 78, 66, -238, 94, 34, 58, 294, 262, 83, 73, -182, -20, -141, 96, 183, 159, 142, -92, -269, -224, -236, -153, 3, 77, 271, -37, 5, -160, -326, -59, -271, -160, 142, 102, 107, 195, 154, -141, -333, 58, -117, 32, 21, 278, -150, -250, 33, 15, -79, -32, 340, 267, -57, 70, 206, -129, 19, -87, -60, -78, 245, -97, -159, -162, -194, -130, 91, -5, 175, 177, 84, -199, -251, -150, -24, 189, 69, 99, 50, 172, 339, -193, -81, -40, -174, 74, 201, 186, 115, 74, -104, 109, -92, -163, 4, 54, -13, 51, 55, -267, -348, -173, 9, -158, 260, 241, 45, -123, 188, -22, -241, 63, 99, 213, 364, -99, 132, 10, -61, -251, 271, 306, 192, 112, 254, -184, -222, -69, 31, 44, 296, 103, 93, -17, 120, 60, -47, 124, -64, 270, 350, 230, -133]
4650a33j02J68j19J11K83j88N3j52L6K8j66j32P4M08N0k82M9J60k21J05l61L47
4672A6J04M9q9j00Q6k64Q6P8pQ5M8P8k46M2K2o5n1N4J84J28k21n7k1l8j45L03
4698E9M1Q1j37J91j31k84J77o8L9J70M3j63L57r9n25R7m5m7J99M27k90k63K76
4721A05j17k83J45K08q2R5J17K28m72L26m43J7L87k94L19l06J37j06J40m61%N54
4743B14l6k24P7L15n04p1K25m9k36L20O4q8j14J32k8j02K3k33L05L06q0l36K66
4766A46j27k5k53J26J65q9L29n8k54j66l4L01J03j49J2K0K5k57K44j9j19L64j23
4789A62r2Q7k25k5o8P7L5J13j36l1J84k5k45J56N1k24J69J12j14K41j05j35m7
4812h5L6r9K84j29K42j61m32K24PK7l3O4J14j3j03o6N2j33J17j91L97j16J13L30
$$ y = [-133, -235, -67, -186, -75, 208, 20, 73, -79, -43, -15, -181, -313, -239, 169, 219, -63, -14, 146, -75, 30, -331, 16, 120, 169, 80, -20, 66, -198, -112, -34, -41, 44, 92, 170, -76, -34, -12, -77, -128, -74, 110, 238, 17, -40, -61, -99, -244, 59, 100, 181, 44, 235, 104, -180, -3, -71, -32, 138, 181, 18, 375, 276, -249, -152, -197, -244, -45, 382, 92, -171, 105, -12, -295, -150, 58, -24, 71, 188, 416, -56, 270, -173, -156, 231, -63, 256, -50, 87, -19, 121, -340, -340, 214, 178, -46, 31, 346, -158, -229, -4, -53, -289, 31, 95, 7, -107, 25, -3, -105, -82, -315, -10, 296, 216, -120, 146, 19, -6, -259, -133, 32, -57, 272, 214, -40, -206, -240, 61, 164, 15, 27, 47, 72, -185, 59, 40, -79, 285, 162, 70, 157, -68, -93, -161, -84, -49, 64, -72, -103, 81, 56, -189, -33, 18, -206, -37, 75, -39, 202, 97, -38, -85, -49, -148, 136, 7, 249, 88, -344, -120, -113, -86, -119, -55, 59, 46, -57, -123, -71, -204, -87, -278, 119, 3, 116, 446]
4836D46k99k56j81M95r4K7J0j63J71k13k9J3k15J94K95j51J60j52l9j81m9J06
4858a05j07K27k40L99j07j5j62J35m9J6N8J35K3k14J88k55O3n9J43k5K2L8j29
4881b0m6O9Q9k28o2K13k0K33o5j8k50k2k24K37K52j09J50j64k33J19q3J64Q3j44
4905g9J08p4K5j32K99k82J28j29R2K34l54J07O1Q2k66M4P3N5L34mm08LJ78l37
4929b42L28J18j25J64j75J14l22N5o2l8L02qJ19o5j82O9j64R3j43Q2L6R1J66j81
4953C0p1k51J81n4K40j51j8K92j40l06J41K55n8r5J83k08J05nr5k8r5Q1j25O8
4977a24J55J8q4o7m7j58L85q8J80J61k26k50r9J31k53L86k6k1J2K71k99q8L9J78
5001H6q6J83n5n4J9j21J75j58o8j60L30j82M44l62l06J96J60ON0j55L23j4r5n6
$$ y = [446, 147, -109, -290, 205, 111, 138, 148, -15, 156, -57, -86, -73, -288, -94, 201, 50, 210, 58, 19, -162, -211, -105, -212, 15, -225, 174, 67, 52, -110, 25, -24, -8, 50, 185, 208, -6, 182, -73, -10, -69, 74, 49, 71, 109, -20, -66, 3, 92, -136, -198, 15, -5, 228, 163, 145, -105, -127, -351, -114, 138, 29, 179, 15, -218, -99, -182, -18, 65, -79, 29, -45, -20, -152, 147, -135, -7, -136, -44, 190, -164, -57, 4, 86, -180, -136, -63, -8, 326, 322, -86, -83, 95, -242, 86, 204, 79, 243, 68, 182, -140, -85, -147, -185, 117, 109, 228, 163, -19, 50, -114, -21, -164, -82, -46, 45, 211, 30, -41, -292, -111, -165, 75, -76, -94, 198, 58, -248, -107, 148, 90, -5, 178, -30, 75, 70, -25, -53, -148, -67, -192, -124, 31, 49, -35, -102, -149, -307, 78, -10, 170, 331, 105, -145, -244, -113, -366, 20, -6, -27, -15, 256, -43, -131, -92, 86, 0, 183, 128, 74, 93, -28, 147, -11, -79, -239, 91, -91, 353, -9, -315, -119, 41, 47, 97, -58, 265, 251, 156, 100]
5025A00K6n17K18L32l8j80q1N6R4o6k35K6J96L29j2k01J48J64o00N40l89O3K55
5048B28k47M12l50r7j70J22R2L36j64k90l4q3J58K9J03o2L5K67m51J67J81j66
5070A6j23j84K12R2j11N3n4J22o3R7k55Q2L4K75l30R9k9M4j35J16k3J73r2J42
5094A58j9l46J2J53P3j98L83j09J9p0M6k16j95J51M0Q6R6K2k28R3K5q5M8L3J18
5119I0J32j16p4J90l89j93L77m4K31n5k47J03J00m64K40J70J9j9J7m6R9k8J5j98
5143i0j6O7N7o5m8J44j40J08l0j93J55m3L58j65k88P6k7j57J02K60J12j53L0P9
5167A33r3L0l7j89K91p3m3J03k82J35k8k39N2K45L29k66R0M4k23J6n4Q8J00k1
5191A08J71l57J13j50J06j38Q9L16k49j2J8o8j09K59j92J37k02J55K31k74J59
$$ y = [100, 126, -391, -173, 159, 121, -59, -140, -84, 10, -56, -291, -265, -69, 260, 248, 47, 195, 359, -241, 299, -90, -27, 228, -19, 393, 43, -54, -224, -102, -10, 326, 162, -128, -162, -245, -87, -58, 45, -17, 18, 285, -166, 1, 182, 16, -107, -291, -79, 13, -98, -45, -99, 23, -40, 57, -198, -116, -82, 193, -137, -38, -67, -23, -158, -42, -65, 108, 16, 158, 139, -207, -195, -42, 31, -167, 216, 107, 126, 56, 102, -114, -309, -158, -118, -32, 64, 86, -142, -49, -24, -109, -61, -28, 90, 222, 106, 32, 222, -167, -360, 17, -27, 204, 149, -98, 5, 105, -359, -119, 51, 70, 51, 68, 22, 121, 93, 108, -90, -106, -39, 18, -47, -95, 49, -91, 17, -13, -206, -51, -94, 264, 99, -189, -113, -140, -297, -195, 65, 177, 24, 54, 133, 40, 70, 33, -156, 135, 62, 19, 122, -160, -25, -53, -292, -240, 5, 334, 68, 158, 202, -21, -5, -59, 29, 129, 108, 279, -78, 35, -115, -9, -147, -58, 258, 9, -3, 15, -53, -162, 97, -95, 42, -160, -5, 226, -48, 111]
5212A11k18m5O0K6M45l17K06k21O1j19k50L17Ol0J4k5J4j00o8J29j50L14k87L15
5236A88n5k58K77j89J50k1J50r2r2L2J22k19l4K7j33L12k79K43j30k23J00O5l1
5259i0J80o2J70j86n4rjj88Q7J03K44K86n45J97k11M4j82J38n2R3J86J29j08k63
5283i4J18l51L72m6K60l24J08O8j21J08j80k20K77pK10Qj26j11M4k23J42J41O7
5306A20J81r7q4%k47m9K1J91q6qk3K1J75k79qJ20K2J82m4R4L4m12J6K41k38J16
5332d1M6K52k10J09k61J26k2j31j2K34J21j00j54N0r1k50L04O0K03lk65L1Q1j08
5356c1K7lK7k5l5Q7l1k72j8J74J82r3J1K54m21K88q9k55J45J02Mj7K12l02J32
5381E3j9j65J6J24k6K0p9R5j33L32n59J81L05k84K70R7j53P0R5l89J9K20lJ06
$$ y = [111, -107, -152, -92, -66, 379, 62, 268, 47, 108, -11, -261, 56, 62, 32, 46, 21, 35, -65, -133, -4, -154, 160, -127, 188, 133, -125, 152, -37, 113, 92, 242, 150, 58, 90, 212, -7, -41, -14, -147, 165, -114, 129, -1, -224, -124, -59, -90, 90, 28, 198, 12, -42, -51, -52, -240, -153, -50, 194, 480, -65, 132, -79, -35, -217, -79, -131, -38, 148, 277, 169, -94, 24, -327, 45, -1, 259, -65, 43, 111, -10, 98, -82, -302, -25, -32, 178, 186, 60, -51, -7, -230, -88, 53, 120, 301, 204, 120, 120, -127, -176, -155, 36, -50, -58, -81, -60, 115, -164, -172, -52, -30, 152, 108, 202, 236, -176, -160, 81, -157, -41, 5, 257, 47, 156, -105, 21, -1, -132, -144, 90, 211, 111, -43, 7, -84, -334, -30, 30, 233, 230, -35, -4, 77, -31, -4, -7, 20, -5, -40, 47, 16, -256, -274, -100, 82, -11, 0, 254, -167, 121, 32, -223, -78, 24, 28, 11, 223, -79, 53, 34, -131, -115, 9, -17, 3, -76, 19, -114, 218, -341, -160, 145, -139, 131, 228, 75, 145, 240, -149, -130, 90, 87, 193]
5405A93j86L9J70k59n5j5L23l59K68k12K17k48o8J14J30K4j7J41J63l81j39Q8
5427f9k66M46J9j59K36J35l57J04q2l7K02j01L26j95k62L04l04k5j64j88L12K55
5449A30m1J3j47K25l08p2K08j23J97k3J03k51l6J61m12K45J63K84k36L3j63Q5
5471C5l26J89j49J84K34j5k22J52j51q0J3K94j21L23j50j96L25l28j57k83K07
5492b22M13p1j66n8J86o7j61j19N0Q6K96L2M2l53J8j87j08M00k13K15l5K25j83
5515B0k0o0j09J32L3L4QJ49l49o3j75L64K28n9J02j50o7L3p6j71j31J61K05j54
5539a15QR7L6m5j33K1J54R7j45K6K13j81k51J28J87n7K0J73j03k02j27K30Pl34
5563b96K80N0J61p8k39j46J26j18J14J33R3Q8j91P5j56k6j7L48l49J65J36l00
$$ y = [193, 7, 46, 216, -43, -98, -113, 210, -149, 119, -93, 124, -124, -192, -78, 52, 76, 59, 200, 363, -18, -157, -69, -335, 111, 130, -29, 207, 342, -15, 89, 7, -30, 172, 71, 397, 202, -60, 244, -60, -85, -249, -437, -125, 130, 89, 102, -45, 180, -128, -200, 8, -115, 82, 59, 162, -89, -125, 36, -376, -131, 32, 316, 80, 113, -50, 35, -291, -102, -251, -67, 167, 152, -70, 82, -69, -149, -136, 158, 37, 360, 210, 14, 339, 11, -146, -429, -222, 191, 120, -46, -104, 82, 15, -146, -265, -215, -129, 167, 199, 241, -112, -94, -281, -389, 11, -202, 13, -22, 203, 20, 0, -60, -169, -37, -4, 30, 38, 187, -162, -225, -400, -36, 192, 133, 235, 85, 18, 51, -25, -196, -327, -166, 39, -115, -107, -10, 26, -19, -152, -131, 23, 120, -25, 1, 214, 33, -218, -90, 97, 40, 60, 233, 130, -72, -199, 31, 38, -296, -16, 34, 195, 117, -122, -268, -142, -260, -146, -13, 80, 168, -23, 52, -104, -130, -147, 201, -148, 17, 153, -147]
5585a47K23k18j77M76q8j8N8J40k10k18Q9J60k75K14j79K53j6J80o9j70L0j28
5607i0o3Q1L5n0k5J19j97J61K12k7j08J38o6k31J06k61J51j77J95K15j32K21p4
5630A33k26o7j05J82j8L15j20J27J5k48K6j62j41K36Q0mm6K22k37j14k0L07n3
5653H2J37l8j20p2r7j9J11J48k29K70q6J53k14k3o6j32L58p9K1P5Nj60j97J20
5677e2j13j9o4J49L40j13j90l00K42K1P5n3M45k41j63K09k80J70j9q3J57J81k88
5700A1J75l32lK7J16j31J67j7K2mlo3O6J15j10k58K00K26m73M12J28m43J03Jo6
5725a34K36j0J61k30L1l11R7J72J92o4l33J50J01l56J11J92j53P0L77l18k6Q7
5747D2j3j01O2Q8O2k6M8k66K07l34L49pj12Q1mk64R8k15L11j95K52l6J70k17r7
$$ y = [-147, 76, -142, -319, 157, 69, 51, 109, 249, 39, -179, -90, 70, -205, 9, -170, 83, 67, 247, 178, 8, 38, -90, -153, -72, -37, -87, -112, 7, -190, -29, 183, 156, 48, 186, 120, -111, -5, -266, -115, -292, -97, 118, -14, 207, 133, -93, -160, -265, -83, -101, 214, 94, 221, 236, -12, 14, -148, -289, -53, 27, 23, -23, 199, -38, -152, -172, 135, 82, 219, 181, 61, -11, -108, -127, -16, 132, -97, 173, 87, 240, 26, 3, -63, -195, 163, 84, 105, 180, 185, 25, -172, -52, -165, -184, -248, -99, 241, 128, -62, -362, -120, -99, -24, -77, 368, 127, -36, 173, -107, 63, 44, -39, 118, 299, 11, 186, -146, -149, -122, -6, -137, 30, 13, 35, 31, 28, -35, 31, 146, 36, -222, -22, 204, -269, 143, 271, -172, -69, -68, -134, 102, 92, 253, 23, 54, -257, -160, 12, 204, 140, -193, -43, 58, -298, -187, 5, -148, -78, 299, -19, -45, 42, 29, -72, -10, 78, 140, 114, 162, -104, 103, -231, 118, 111, -1, 80, 76, -188, -90, -305, 6, -189, 63, 27, 197, -20, -117]
5772a17l3m6J10N3J21J84k15O3M1j12k16J27M0qK30n09N57Om66K17M4l28K54k06
5796b09L03J78m6l22L2m69M34q8J72J12l8J96o7m91P8J56j55K94l01K67m5M0m37
5819d06Q6J53M4K05j00j50K69k23N0J84k29L4l3K22n1j03l4J84m00J77K38j58
5841d1K55j3k7j57j97j0L60k3q6l1j26J32oj13k09J67P9P5J21j87L13n19J08Q
5865a27p4J31l6L41k37q5k49K85O7j71K43J31jj41J7r7j45L68l02q8J72O0j29
5888f7l6M4m7k0L3K25p1j0O0j48j7K07k65J24J87k84j03K47m6K0j42J10q3N1K37
5913B06k65j62M1k5k24L43n5K08l9J47o3j53K5M6m3J7K85l19R1j79p2J24J32o8
5937bP8QM3j2j66J69l74K43k71K58k14M48m2l91L39j67k80K99k05L05L6J07m10
$$ y = [-117, -150, -196, -86, -33, 88, 272, 57, 120, 161, 49, -167, -40, 0, -8, 222, -287, 270, 276, -190, 27, 71, -257, -3, -209, 94, 272, 226, -96, -64, -533, -99, -187, -15, 97, 59, 255, 188, -303, -225, -69, -224, 70, -231, 36, -9, 31, -406, -320, -167, -123, 82, -18, -168, 101, -122, -72, 112, -117, -83, -116, 106, 55, -48, -82, 102, -298, -121, 117, -41, 214, 201, 174, 17, -180, -190, 170, 147, 61, 30, -96, 36, 30, -83, -292, -125, -46, 29, 150, -37, 276, -243, -135, -127, -201, -70, -106, 235, -2, -87, -336, -51, 16, -155, 88, 219, 218, 77, 94, -3, -148, 220, -82, -170, 2, 62, -67, -103, -59, -106, -126, -93, 132, 61, 51, 111, -37, -54, 153, -112, 12, 199, -85, -188, 59, 13, 33, -109, 1, -82, -31, 206, -59, -221, -180, -205, -429, -86, -141, 67, 28, 175, 112, -41, -16, 30, -13, 4, 289, -30, 61, -118, -190, -66, 66, -2, 76, 84, 127, 115, -51, 118, -256, -13, -284, -26, -240, 208, 166, -225, 114, -53, -333, -34, -239, 66, 102, 209, -201]
5960b01N5j5J13J70J01k40L34l94J67p7q3L6N3J41j77L4LOk21J78n2K0K10l4o3
5985F4k03J88r1J7O1J02k41L58k04q4k15O8m9K94j01K26j46q1J33J4j85n4K29
6008A00N0q1j19K37l91J72k8k04L90l4j95L55k90K53j58J37m68J23K64q9l1P5
6030F8L4m01L19l36L19K08m6j22J71l06O9Q7M6k56J39J27j50J91j75J16l40L7
6052b01J9R2J35K86j70k94O5J53l14L17k33J39K11P3l83j60J27m6J40j29L48k80
6074a05L73k61j94K41j61Q1q4L61k99Q0M2k4j64J39J5k68M74j08mj78k9k49O6
6097b56J06L53k81K48K4l32O2p2j75L07K29j20P8j4o3l32L21j36Q5o5J50l17L07
6120A07J6k70j56J58p9L90j3Ql33J6J98l46R8J79K92j37J02j38j69K24k50r0K01
$$ y = [-201, -146, -161, -48, 122, 223, -17, 317, -77, 90, 13, -70, -34, 19, 160, -17, 17, 20, 26, -195, -17, -69, -49, 161, 127, 64, -139, 49, -42, -25, 36, 138, -103, 255, 51, -33, -248, -180, -229, 65, -36, 190, 44, -37, 96, 110, -75, -129, 100, 150, 69, -50, 187, -204, -32, -60, -264, 126, 92, -103, 252, -38, 215, 57, 194, -274, -151, 113, 24, -7, 68, 102, -299, 20, -316, 3, 211, 165, 43, 214, -92, -23, 64, 110, -146, -7, 120, -30, 161, -14, 102, -238, -201, -182, -90, 45, 331, 161, -133, -68, 85, -229, 88, -145, -6, 205, 278, -105, -265, -138, -184, -44, -173, 175, -105, 268, 7, -187, 54, -107, -26, -110, 251, -48, 32, 74, 50, -114, 25, 40, -228, 246, 138, 134, -44, -73, -322, -256, -150, 203, -78, 170, 194, -138, -76, -148, -323, -16, 213, 93, 171, 157, 94, -238, 83, -53, 32, -33, 117, -200, 107, 123, -147, -303, -145, -224, 166, 153, 161, -172, -156, 42, -304, -206, -27, 265, 128, 230, 92, -77, 147, -103, -193, 8]
6143Hj4R3k5k28L27j87n8p1J12N5R4j6K1k52m5O6J73k02L75m71L55l1k51L39l25
6168a58J72j70J34j5L10l91K17m26K29K39m9j8J33K23o45pL75K1l26J23L20j42
6190A49Nk09j69J00P0Q2J08J64k50P9j29j83N3J36j33L04o4j02J17j49N4n5j5
6213c7n5K68j95K8l31K58R4pO5O1r5jJ5l9j96J54J02k24J90J65N2j94j39M0k57
6238b78K91l0O1J0K2n2n3K88n05J50N9j2J36l1J77l34Rq0L5K33J42j72j48L7L6
6263ij01J65j66k9K49M1q1Q1k61K3K3l8K49M2J16j74J5Nr1p2j91K29J69k26K13
6288A81k02p3o4L34r6m8n5p4O4J06o3k7p7J49k11J10q7K07K5l6k22rj3p1K84J08
6314A40j4j66K56r4k89K55k50M29j98q0N4p2l8K6j3J08J09l8j36kr2j29R5P8L
$$ y = [8, -6, 87, 62, -166, 161, -26, -84, -155, -43, 12, 106, 90, 111, -141, -186, -120, 53, -149, 226, -245, 110, 79, -172, 167, -158, 14, -156, -22, -37, 273, -118, 99, -327, -98, 141, 92, 74, 207, 430, -215, -222, 153, 174, -152, -29, 291, 149, 154, -55, -224, -124, -54, 28, 136, 300, 50, 129, 0, -183, -130, 6, -127, 177, 113, 11, 128, -21, 33, -22, -37, -92, 176, -19, 9, -322, -64, 30, 23, 88, 149, 54, 53, 68, 29, -167, -13, 89, -135, 55, 220, 272, 78, -61, -21, -278, 13, -17, 44, 54, 76, 24, -29, 259, -246, -96, -37, -49, 87, 56, 233, -101, -92, -172, -137, 96, 238, 66, -82, -45, -9, -110, 55, -111, -140, 109, 150, 69, 150, -111, -88, -65, -103, 146, 188, 304, 130, 145, 150, 59, -13, -204, 25, 194, -32, 181, -21, -94, -158, 176, 80, 32, -23, -97, -33, 73, 10, -17, -94, 55, -156, -46, -133, 74, 99, 63, -159, -168, -181, -252, 32, 140, 126, -40, 216, 122, -167, 88, -162, 267, 69, -11, 43, -29, -67, -41, -54, 54, 163, 125, -11, -13, -105, -234, -139, -61, -58]
6339e8pQ7J05J73m91J5Q9J3n9K8J54j10R3q9j11L27l14L11J99l94Q3J41k06k11
6363b32N8J13L92l25Q7J02j11l11J70j91K86J70k81lK06j73p2n3O9K88l15L7J67
6386G8J42j71j19J14j22k32J70L48k53J24j91J78l40J53J67Q5j43J48J59l69l6
6407a10J78j47j76O21j62j65J9p2o2m3J78k07K44m4K58j12m11J4LK28r9J24J33
6430A90m5l8J9l32J21J53r2J34J65k70K4Q8k07j27K21j58J06M08l89l0q6O9j90
6453b66K31K43k8l9J06n6k07j87J8J56J1j96j8L50j09k41QK16J47k23qR7J47j68
6477a6p8R4qk60K55q9L63j37j64n1M6k0K08k61J77R7j45j28J84q3j29K27j0N1
6501A23N9K5k14k87J11M60l35L79j51k30n6o3L0Q1L4J73j23K16k48Qj58O5q4K62
$$ y = [-58, -65, 22, 127, 300, -191, -176, -87, -74, -133, -105, 49, -61, 32, -57, -168, 159, -155, 156, 355, -39, 44, 185, -21, -232, -174, -61, 331, 6, 93, 195, 84, -227, -57, -248, 38, 208, -73, -76, 130, -43, -115, -168, -99, 189, -126, -89, 78, 220, 49, -70, 44, -78, -310, -140, 208, -45, 79, -112, 66, -274, -121, 46, 131, -12, 136, 295, -74, -110, 68, -79, -255, 366, 204, 39, 58, -14, -76, -119, 59, -148, 96, 52, 310, 198, -213, -199, -196, 32, -67, 57, 190, 145, 107, 126, -206, -85, 68, -24, 110, 275, 5, 29, 117, -90, -217, 4, -154, -48, 360, -29, -59, -145, -76, -266, -35, 208, 180, 141, 247, 191, -16, -203, -185, -29, -18, -214, -232, 118, 9, -232, -224, -8, 139, -84, -92, 5, 152, -16, -94, 0, -8, -268, -13, -102, 261, 124, -40, -91, -45, -65, 143, -118, 59, 156, 11, -117, 67, -16, -145, 82, 72, 123, 182, 207, -7, -294, -183, 277, -58, 321, 170, -60, -116, -179, -149, -68, -34, 139, 16, 232, -16, -8, -166, -101, -185, 77]
6525G7m2L1K27j92j89K12j15j72j35K89J98ok2L9k3j96Jp7J69J33j74n8r0l8N3
6550a00P3q1J65J79m7j16p7o5j13j65M23m0J93k46J32j9j44j3j77K06J28j85J97
6573A08N4k27j74J25M18l72J35j04J66n7j16n5J4j08J18P5K5K78m11K00J30m97
6595b75M30l79L01l4O2j46n1M4L8j24JJ91j02L19n7l41L1R7l40K68QK0j2J07j76
6620a20J67j93J11j23J12Q8l9j28M27k10kj40pJ55j94j91K37L06l76Q5J43k02
6642i4m4J56K13k22k15J15j6l1L58p1j51K52P5l39nR9j72K55j3J9k26j02J06l0
6666h3j69M2K91j10J14J0k16l3J96j33R6R2r7o0k7l1L8j4k7K27k29K07m9l1kO8
6692G0j30O0l14K31J98j38O8j29J61k22J57l5N3J03j99J13j25R7j6Q4N6J23r2
$$ y = [77, 35, 66, 293, 101, -88, 124, 9, -163, -298, -9, 189, 183, 161, 200, 177, -19, -18, -95, 74, 207, 33, -25, -115, -153, -100, -27, -108, 57, 236, 189, 73, -4, -69, -182, -347, 76, 36, 229, -17, 115, 96, -48, -61, -238, -32, 96, -89, 108, 162, -65, -239, -114, 304, -68, 67, -37, 129, 72, -44, -99, -85, -193, -75, 0, 25, 303, -108, 92, 222, -275, 155, -224, 77, 43, 105, -41, -92, -48, -10, -134, -133, 58, -44, 275, 218, -123, -92, 5, -335, -67, -59, -39, -51, 56, -120, 47, -146, -35, -158, -46, 42, 3, -125, 302, 92, 90, -50, -57, 98, -96, -287, -50, 256, -120, -35, 108, -94, -138, 18, 231, 9, -206, -91, -107, -138, 220, 149, -2, 250, 325, -14, -19, 80, -92, 163, 150, 169, -57, -159, -53, -83, -252, -210, 81, -29, 85, 95, -121, -154, 42, -91, 5, 97, 0, -60, -87, -118, -80, -94, -121, 106, -123, 84, 35, 4, 2, 70, -60, 0, -314, -83, 115, -23, 45, -84, 77, -145, 12, -23, 30, 133, -66, 47, -78, 19, 3, 87, 143, 266, 174]
6715A74k20K6J33q8m3j58J75J58p4Q0j51p5P4N5j17N0J34q6K6l4k70J16L5o0N0
6740i0L37m47L03j30j55J72p0k5N8J13J65k56o3L09m95N39l03O9l0J03k86J54
6762b8j95K14R0R9J9l75K62JL3k52q4K96k11K00J04p8j03Q3k21j67L11Q1r0K6
6786A5J39k09J51j75J09o5j14J24K37Q5j71J29l31O0j20P6K59j58k32K99l09m4
6808b45J93Q2J78k79K38m10K94m3j9L3pp6M06m12K95j19q4J2k08R7J70j87J58
6831F7J11j80q9j20L25j68J83k16K04Nj62m4M1l71L81J3K84l06O8o9K59k82mL22
6855B52m26K39k70J90Mq3J22k23J52K39l0O7j51K9j19L0j28J16j41K45k35K23
6877A02J4j77j01k8J13J48k5n9q0J64j82l8J30p0j9K59p9j21Mj07j66J42M32m11
$$ y = [174, -46, -20, 113, 25, -18, -176, -1, 157, 83, 163, 12, -63, 11, 66, -51, -1, 133, 47, 73, 39, -231, -115, -80, -140, -90, 247, -200, 103, -27, -182, -10, -80, -105, -47, 66, 231, -25, -88, 221, -274, 265, -38, 31, 1, 104, -182, -28, -223, -9, 81, 180, 199, -176, 86, 87, 120, -132, -216, 80, -131, 69, 173, 95, -8, 75, -146, -313, -2, 79, -11, 15, 154, -55, 96, -79, 30, -35, -149, -25, 212, 297, 126, 255, -76, -16, -136, -60, 199, 41, -191, 108, -201, -245, -52, 30, 208, -71, 167, -243, 51, 8, -11, 22, 15, -61, 345, -67, 228, 109, 25, 37, -171, -74, 96, -91, 67, 178, -2, -91, -211, 114, -54, 129, -87, 117, 122, -40, -84, -43, -414, -33, -20, 264, -42, 26, -43, 216, -66, -70, 252, -174, 65, -205, -15, -11, -94, 28, -195, -43, 196, 166, 233, 82, 111, -8, 22, -106, 10, -131, 114, -121, 102, 116, -61, -162, -190, -77, 71, 46, -13, -93, 71, -111, -149, -19, -89, -108, 151, 72, -49, -45, -152, -318, -176, 256, -155]
6901a55J72o0O1o9l2k4P6j84K31K6J39k90j5J84j58P9K16q2j88q9K51j77P2L7
6925B1j28J33K99p2l4N7l82j6L7k8K69%l35L50k00J06j22k53N5K02J42N4j8j81
6949d4K80j71j26j83K95J03m1q6k00K20q0k4K6Q2j0K33l73J15j15l93M04l1K16
6972I7J44j72m1n0l5Rj74O0K25J21j24n4j70j2L74k51K60o9n2j42o5J48L4k18
6996a57L24l65K34j0nL6o7J41j67j28J15J32l8K90l41p7l5q0L24J23j75Q9r5q3
7020a5j9p8j83K07J4jo3J04j1j12L2J72lrk3k8J60j73J70k83L9R2l3Q4mO8j99
7047i5N9j06P6n1NL53L2l59Q5J11j49J9O7jJ56k10K0L6k59L75l77J17L22l13K38
7072A51m14M9R1K00r1M9Qr7J60k56J75r9J27k45J54J0J76j90j6K27j79j4o1R3
$$ y = [-155, 17, -43, 18, -51, -83, -107, -31, -215, 16, 42, 181, -109, -124, 60, -98, -19, 197, 115, -73, -162, 89, -88, -16, 21, -107, 26, 325, 253, 219, 276, -106, -122, -85, -113, 156, 156, -179, 171, -29, 77, -45, -298, -243, -41, 101, 155, 137, -44, 236, 65, -61, -244, 51, 154, 113, 27, -173, 47, -33, -57, -31, 51, 41, 274, -99, 16, -99, -492, -88, -119, 97, 241, 69, 28, -22, -57, -48, -222, -162, 63, 184, 60, 6, -164, -176, 198, -53, 207, 138, 86, -56, -121, 27, 61, -157, 167, -198, 36, 26, 21, 57, -10, 131, -36, -164, -49, 83, 45, 335, -6, -83, -118, -198, 126, 249, 74, 163, 68, -15, -34, -112, -295, -88, -74, -75, -138, -34, -45, -157, -125, 47, 44, 35, 12, -16, 144, -29, 141, -142, -103, -11, -44, 40, 36, 104, -95, -36, -142, -66, -117, -112, 241, 273, -86, -1, 110, -39, -20, 47, 46, 202, -8, 12, 48, -211, 164, -213, -96, 226, -87, 151, -263, -214, -123, 77, -14, 35, 43, -54, 106, -150, 25, -74, 53, -192, -38, -28, 148, -42, -58, 169, -10, -24, -85, 8]
7096HR8j17r6J77P6l19N9O6o4J04P7J07l26J43j69l8K56J00k03m9L63m5l63j71
7120c26K56J43o7q6N9L1N7l5R3j20r9J36K03R4k81m6k53J36R9J66M1j25J44j53
7144F7j54j42K32L9K3J62k51j8J50k31M9J06j23KJ1J83qk1O7k53m8L13M6k55K01
7169A47j13J39k69R5r9r0K43p5PK13K4k03j16K5Q2k53O07k58l5k10M7J76M5P8
7193B07l12n7M44k42ok21J13k57L59J10O4q9o9J1Q7j13k5O0j35K59j32j8p4o3
7217i9J9L5J49k08K29j19K9N4l13J57J7o7J40k18L51j11j39K20k18J41j27R7N1
7240G0j8q4N2k18J70j81Q6P9O5J39j07K47m11m2J73J2k21K87n2n9k09J17J50K6
7264G1P5k72M92o8p3k90j97J55PL8j31M62n2r6K3m72K84r4K42M8k1m7j28J67p5
$$ y = [8, 106, -11, -107, 70, 146, -173, -114, -48, -112, -8, 69, 176, -150, -7, -176, -214, 42, 142, -61, -110, 253, 208, -155, -326, -70, 73, 6, -80, -21, 10, 67, 32, 125, 5, -94, 42, 245, 339, 58, 12, -241, -105, -6, 160, 201, 76, 220, 67, -87, -229, 3, 42, 65, 227, -24, -42, 108, -123, -74, 32, -91, -89, -78, 105, 97, 76, 143, -110, -158, 155, 201, -54, 147, 34, 173, -96, -1, -100, -190, 53, -22, -15, 198, 222, 19, -97, -72, 10, -243, 364, 106, 71, -139, -92, 84, 129, 207, -105, -162, 282, 40, 34, -187, -74, -331, 28, 138, 202, 113, 44, 55, 142, 29, 4, 64, -71, 188, 56, 38, -36, -99, -80, -45, 104, -104, 125, 6, 35, 89, -224, -67, -50, -117, 23, -195, 156, 45, -94, 126, -92, 49, -78, 19, 70, 52, -32, 20, -198, -28, -209, -123, -44, 21, 160, 53, 300, -111, -153, 20, 32, -189, 98, 46, -13, -222, -105, 45, 71, 146, -126, 366, 298, 225, -65, -262, -107, -100, -62, -193, 269, 217, 121, 144, -328, -44, -138, 104, 152, 131, 84, -44, 123, 48]
7289D8n3N3j24J1K29L4k61J25l09J45J16L6L9j6j4j27O3k10J85Q6r9P2P9N1j39
7314B0j31o5L81j90K29k13o8j60J06K81q7k37K47k30L53k29r5J1q7k7K68j1J15
7337A81p5j6q2J9j2j09k1K01K60n29L17m3P1m71M05k93JQ4k5R3K8K3l5m8K88j54
7363E8p8J74q5j25K70j45l79L37J97j19q4J58k15K2J14k93K29j4r4K2m4J78j05
7386b1k81K89K5o4K13J14m06L16k21m2m6K90p7q4L09k72O5j96j39J64K60j05j48
7409e7J13Q1k66K98j19j18K18j84J04J6j05j28J48q7m8J57M1p8Ml16L53M7k62
7432a88J65J02N7J29m9k19m1M9P0j05J55k23JK43nk40L5k6j14M25Lk16j48K59
7456A19j7k67l1K57j12L01Pj78l9Rj0J63o6o9l66K92O6j32L08n14J79j1K91R8
$$ y = [48, -5, 48, -76, -65, 164, 198, -63, 62, -247, -102, 14, 50, 89, 73, 59, -68, -5, -215, -30, 56, -43, 29, 108, 159, 20, -111, -176, 205, 15, 244, 31, -37, -197, -91, 190, 103, -134, 113, -117, 236, 7, -88, -77, -164, -191, 77, 66, 181, 106, 90, 8, 27, 15, -94, -115, 86, 346, -183, 134, 91, 162, -309, 96, -197, -196, -112, -137, -44, -16, 7, -28, -76, 212, 58, -20, 154, 69, -56, 214, 69, -310, 27, 224, 105, 21, 179, -36, -14, 100, -193, 36, 22, -72, -50, -94, 84, -21, -302, -13, 12, -52, 161, 275, -131, 185, -36, -78, -124, 166, 89, 5, 314, 42, 107, -89, -228, -64, 196, 91, -57, 56, 137, -129, 169, 50, -68, 150, -34, 70, 86, -19, -147, 1, -86, -134, 23, 64, -14, -10, -326, 27, 74, -188, -23, 79, 136, 265, 216, -3, -44, 5, 75, -30, 125, -98, -97, 146, 141, -99, -64, -90, -204, 221, 224, 8, -140, 119, 102, -165, -196, 61, -51, 250, 257, 79, 40, 49, 39, 202, 136, 67, -299, -7, 59, -73, 235, -279, -100, -111, 180, 278]
7480B78K1J05l85p8r1j23M5J82m0N6j09J02M7J0k01M4J73N0J01j1n2j80j84R6
7504a44O2k29L18J37P6m69K46J6k39J90M8j35K97l34K76k15J48q2j05Q9N1K04
7526B06p8N6l17j52R6J40J30M%R5k30j45P1j95K52K18oJ96j67l35k5J95j91K15
7550C3J62L6r1n4K53l38J04j29J9Q4N7j57k08L48l36J08J18J78j85N9R1k12J06
7573D6m60K69JJ27rK03p8M6k40J02R8j49P4J93j85J07l95L74j55k9N4l27M70l6
7597A01j61J49k18L3J72j55j38J81N70o48J01j91K90l51K30J15J34l60M80m79
7617a45j17K2M2L13k36O5J81j13r6P3r9J5N3J95R2j84N6k47j63K49n0J75j74J45
7641E2K35m20r0J28K01j42J24j01J99J00j71n1j41K9j45J74r1K69p7j81M8j70
$$ y = [278, 299, 404, 19, -59, -150, -273, -228, -46, -86, -30, -139, -37, 10, 20, -181, -137, 36, 86, 187, 176, 124, -56, -240, -144, -82, -311, 7, 144, 220, -249, -3, 13, -226, -36, 12, -123, 174, -160, 116, -99, 49, -33, -138, -49, 2, 206, 128, 184, -133, -285, -189, -49, 81, 85, 85, 180, -50, -195, -124, -319, -67, 151, 145, 341, 174, -161, -186, 9, -182, 33, 195, 231, 140, 86, 339, 1, 105, -24, -5, 79, 136, -21, -229, 119, -217, -109, 9, 187, 2, 61, 152, -60, 46, -414, -145, -144, -17, -26, 177, 99, 145, -95, 7, 105, -44, 30, 223, 38, 145, -250, 124, -31, -60, -6, -333, 137, 101, -60, 89, -129, -96, 76, -79, -217, -36, 534, -114, -13, -204, 86, -265, -35, 80, 214, -146, 334, -145, -262, -240, -198, 115, -121, -56, 125, 12, -84, -11, -110, -95, -42, 153, 245, 61, 117, -130, -293, -44, -94, 81, -93, 52, 287, -133, -223, -95, 106, -36, 88, -13, 186, 286, 115, 64, -77, -48, -193, -19, -110, 159, 82, -99, -51, -221]
7663b21L25m9j9K2l1m9K49l24oK18k51j4J18K02l28n0L75m17J82rl6K73m3K26
7687C43k04k93Q8k58K73M4J9j12K0R8J27o8l62J92o8N3J11K86k59j45J48K95k70
7710E8J6K41k74k1R9q7L1kk34J29K41k30J78J16m98O5J14Ml2K29J01k00o5l5R3
7735C7P0J25k24R9J96k97l1j59L3K19P1k1k4m8L4l7j18j24j23L68J5rj70L89l02
7760c1l80L20o9J50P4K07k68k54N4K69j12m4j6J4R0M6j3k13R1L1j38K11O5o2l7
7785a5O0k01J25P6J71j45k11M8n5J39J63l72K80q0r1L84k71m1J07l3O9k77N90
7808D20j90n2l74K83j81n8J56p6J71m24N56k68J61j87P7l32J15K44pJ68k97J14
7830A9J40j4k98l0J34K10k7k21N1j49K88k42R4J02R3Kr9nj60l3J26J25k61J13
$$ y = [-221, 104, 55, 36, 58, 27, -22, 227, -97, -103, 115, -136, -150, -32, 170, -158, -208, 167, -250, -68, -77, -113, 160, 117, 343, 139, -154, -66, -324, -51, -7, 12, -100, -80, 18, 145, 77, -285, -93, -161, -108, 3, 289, 30, -115, 33, 328, 58, 74, 315, 41, 20, 119, 32, 63, 61, -173, -44, 197, -33, 145, 261, -237, -172, -58, -54, -86, 143, 244, 44, -21, -56, 37, 107, 232, 8, 107, 303, 6, -25, -184, -151, 68, 139, 118, 94, 46, 80, 43, -75, -199, -322, 46, 61, 52, -118, 271, -31, -411, -91, -160, -10, 64, 271, 3, -251, -197, 72, -40, -84, -100, -86, 4, 50, 37, -176, -85, -54, -192, 19, 84, 22, -15, 45, -156, -31, 45, 216, 71, -140, -92, -147, -8, 155, -217, 63, -17, -108, 276, 5, -36, 71, 38, 107, -170, 420, 230, 178, -196, 87, -94, -152, 4, -72, 99, -325, 231, -37, 124, -63, 14, -318, -203, 41, 34, 202, -95, 19, 159, 145, -153, -183, -49, 161, 134, -87, -36, -185, 103, -139, -45, 57, 150, 152, 53, 48, -112, -145, -19, 106, -155, -42]
7854d2J99j3l66k3K69k8j73L0K81k99J11O7k14M65l37j10L4K03j41N4Q8j74M8
7877g1q9J32R7K03l64J96j76P1o5j51N4L19m3j48P3rJ4j25r0J30J26K64k54O6
7901A60k24r1k64M00r5P2J42q2K71r2l17K4m5J39o8K79j05j9j3j63%K6L9m0K24
7926A58j51K2N9J01q4j23K66l31J25j23K02R6k83R0J51J1k22P2O4J04j01k45J6
7949a26L6k0N7J28j66J59j00J77J08l46j76J55K46o2P3k95K16k00j5o5K3L88k44
7972d9M2N0k31K16k19K78K5k4K8k27oJ0j6K78q1J37k82P7J01l9k66O4RK35j24
7997a4J96k46n7J99n3qp3Q1P1O9p3o5q8R5Jm6R7j07J97j85R8ok0j56K07m7J9l53
8025b67M60k2l01Q5j03o2K25l1n2j90K97j25k8J12J85l43J18l9q8K68R5k35j91
$$ y = [-42, 157, 144, -222, -245, 24, -4, -177, -147, 134, -165, -54, 13, -201, 264, -73, -183, -149, 54, -87, -33, 55, -119, -71, -160, -28, 69, 272, -92, 104, -72, -1, -66, -217, -163, 156, 113, -35, 38, 29, 43, -82, -172, -42, 84, 348, 94, 160, -64, -155, -419, -19, -114, -42, 100, 18, 289, 197, -120, -96, -141, -2, -70, 209, 104, 85, 72, -91, -91, -65, -26, -66, 158, 7, 29, 88, 189, 105, -18, 248, -83, 42, -81, 121, 217, -66, 24, 175, 186, -36, 36, 100, 204, 103, -142, -126, -90, -110, -53, 75, -91, 68, -32, 145, 253, -93, -269, -114, 132, 70, 143, -152, 64, -136, -151, -216, -193, 195, -49, -7, 43, -188, 28, -191, 87, 112, 88, 116, -111, -117, -107, -123, 155, 74, 211, -71, 6, 107, 68, -198, -134, -125, 110, -14, 182, -64, -121, 78, 25, 17, -56, 25, 96, 165, 92, 27, -61, 34, 35, -11, 86, -21, 176, -9, 89, 83, 63, -93, 114, 67, 86, -267, 193, 171, -130, -45, -148, -210, 15, -16, -68, -258, 39, -86, -114, -2, 183, -160, -42, -81, -169, 99, 194, -41, -232]
8048b32R1J09j9k96M34k61o6K03O5O8oj82oM6J92l03P0J31j03L67k86K13k79J59
8072A09l65J8K81j3J51M9k15Pk19L21l1P1k05J15K5J29l84m2j02J11k3J24J55
8095F7j20J02r5m5K2K52m17K71R2j44Q8J9k9r7kN1j56K32p5N6k12K57j20j57K52
8120I2r3k21J96J48k38Q3J11k46J98J16j58n1J5Q4O5j29k8J62k0J28m4L4k15k58
8144b69J99P8J48j54J06j62R7R0j01k27kK74Q2j34qJ60j44m1J10k31K54j59N3
8167A9J58j57n2J35j0l71L93j14k10N62k42j58J4l3L7lL23j53k79J32j80N2j3
8190a50L38
$$ y = [-232, -141, -32, -51, -347, 87, -174, -240, -37, 28, 96, 90, -92, -98, -52, 140, -163, -93, 38, -65, 302, 16, 229, -50, 109, -256, -238, 43, 30, 181, 230, 15, 22, -197, 124, 93, 164, -41, 74, 99, 228, -156, -198, -300, -189, -212, -88, 67, -53, 49, -46, -91, -69, 183, -234, 37, 129, -15, 73, 92, 63, -34, -36, 15, -141, 91, 16, 72, -140, 117, -3, -160, 92, -1, -222, -26, 122, -116, -33, 78, -168, 30, 146, -12, -63, -48, 36, 101, -28, -56, 106, 86, 214, 170, 204, -11, -269, -70, 8, 156, 2, 108, -54, 43, 133, 32, -195, -197, 77, 159, 25, 17, 177, 33, -8, 102, -129, 125, -34, 19, 177, 20, -32, 103, 93, -278, 115, 1, -209, 353, 111, -47, -33, -66, -29, -32, 291, 138, -141, -9, -189, -137, -150, 188]
8191A88
$$ Imaginary data points
##PAGE= N=2
##DATA TABLE= (X++(I..I)), XYDATA
0@%%%%%%%%%%%%%oJ4j6J6j6J9k7L2l8M6n2O0p2Q5r6J09j25J42j62J86k10K37k65
36a39K98l35L73m17M64n13N68o31O98p70Q49r38J035j139J254j381J523j681J858
55I76k058K285k547K855l218L656m198M881n780P018q835J1762j7221L0725j23623
70a03322k03292K14459L8378L3930K33558k859k36102N673o711j44312Q9423J49552
82F8375r6746L2337J55827r7165r7234Q5056j05734j44604J46789J04605m4358
93G148J29087N8886k23848r9862O1278o4626M3370K15568P921r6983L7156p6995
105a900j47658Q2562P6984p8877P5054J25230q2290l3330O1789j23145j12941
116a58522R7493M0678Q51J46618L3981j51763m1388q899j02724M9263J52765m432
$$ y = [0, 0, 0, 0, 0, 0, 0, 0, 0, 0, 0, 0, 0, 0, -6, 8, -8, 8, -8, 11, -16, 16, -22, 24, -28, 32, -40, 45, -51, 58, -67, 75, -87, 99, -111, 126, -139, 159, -176, 197, -220, 244, -269, 299, -332, 366, -404, 445, -493, 542, -597, 657, -724, 799, -882, 976, -1082, 1203, -1344, 1511, -1707, 1949, -2249, 2632, -3148, 3870, -4965, 6797, -10424, 20301, -103322, -306614, -92155, -53777, -19847, 213711, 210852, -25250, -19577, -26288, -170600, -81177, 68375, -28371, 3966, 159793, 62628, -34606, 50450, -55284, -199888, -53099, 51506, 7148, 136235, 195121, -28727, -128589, -67311, -131937, -88567, 127001, 134922, 37939, 75095, -1900, -149558, -66996, 9988, -68889, 6165, 131395, 49105, 15775, 77564, -45581, -158522, -61029, -20351, -19500, 127118, 161099, 9336, -32052, -40951, -143675, -94412, 58353, 53921]
128E3921o499O5975q5165j13156M8291L806n6547Q5887P9519m5310J6702L1209
140G8633j00049o1511L4584j5316K2254J15953J9944n6127K090m6624r7072K5048
152g8193O8333l013M4450O7652m7336n6241O612m7834m7984N2433M5353J1038
164A5270O0751J9626p4369m7760k3816m8320K9530R5663L1373M739J7674n7269
176B3092q3186k315J3419J053N6645N4555j0403j0611j3919n9516l3845J6325
188d8706J0848L1729O2540J2688l0665j8721l9896n2938P304M2619K7721M1206
200D5729L3131k6754m9208l4498l3732n463M3422M5481L1489K5097j6774n6231
212A689m2069k4465j0197L9313O7310L4672L384j7419n3922n7026j3666J7638
$$ y = [53921, 47422, 113397, 28232, -84924, -36633, -32827, -89374, -3487, 76032, 30722, 47424, 78633, -21416, -82927, -48343, -63659, -41405, 74548, 94492, 38365, 40455, -6169, -103241, -78193, -9860, -12873, 31577, 99229, 51893, -4348, 2264, -45570, -93554, -41121, 4232, 15270, 76021, 95647, 21278, -26482, -50298, -98618, -69088, 26575, 57948, 62687, 80361, 23092, -60094, -62409, -48990, -47937, 8708, 63263, 52860, 42249, 28330, -31186, -65031, -48706, -37858, -6129, 56411, 69099, 38434, 19713, -20183, -73121, -65817, -23198, 4523, 45729, 78860, 52106, 2898, -31600, -65332, -70795, -27373, 18108, 49597, 74694, 57920, 1689, -40380, -64845, -75042, -35729, 31581, 66253, 69637, 52218, -1704, -58730, -72396, -54758]
224e4758L5575N3022L2755o666k5861m1229m6503j1922K2405L0438M1062L7041
236F5359m929l6165l5826l5671j9729K0390M2819L7986K7087p77l4651m3624l4871
249e2602j5397K0743M7728M0140K1858m61l5940n2690l2309n103J9193M4803M7995
262D7958K0287j2353l6389m7591l4227k013K7581M5548M2654J3651j9122l6149
274I835m1907k8912N192L3104L8014K9870J2437j7757l8225l5663j8638N076K7558
287b0016L6901K8542P546j8438l5523l2015j7280L868K7111L8136K6680N305j6059
300C4758l2610l6094k0055P021K8907L6592K8743P183j9308l7159l5820j6154
312e3996Q874K9216L7889K7783K702k3585l5877l1130j3635J1383L2084L4740
$$ y = [-54758, -19183, 33839, 66594, 59928, 34067, -7162, -53665, -65587, -43182, -12744, 28318, 65359, 60430, 24265, -11561, -47232, -66961, -46571, -3752, 34234, 61321, 60544, 25893, -17731, -52602, -67999, -47256, 472, 40612, 62470, 62009, 26069, -26621, -58930, -64033, -44840, -37, 47958, 68245, 55892, 19503, -28088, -62315, -64328, -36747, 8801, 51455, 65106, 45984, 9835, -32072, -60984, -55792, -22688, 15326, 45196, 57633, 39876, 1651, -34012, -52650, -47574, -20016, 16885, 45427, 52973, 34535, -988, -33003, -50283, -46415, -19304, 18832, 45512, 50817, 34758, 2148, -33946, -54001, -46980, -18073, 18519, 47262, 54445, 35137, -2022, -37842, -53996, -45122, -15906, 21983, 49766, 52468, 28883, -6994, -38124, -51759, -40376, -8292, 26448]
324B6448K0001k303k2150l1944k7407r204J4194K8637K8436J7251j191k1029l1285
337a1546k4534o903J1648K5503L0503J9063k634k1126l0404k6165j0075J1300
349c5370K8890L3153K0389k689k2235l3021l0989r838J7281L1406L2157K0783
361D9917l236k7821l6050k6316o695J7959L4018L1747J5988p673k9915l4215k0007
374d2299k347J7477L3793L0068Q244j0917k4016l2657k0807K725J8831K8393K8706
387C5194R871j2104k3938l1513k3524L062K2741K7243K9354J4888j6479l1302
399C493k8202k1786j121K7634L4463K4979J1048j5745l5303l0070j5836N49K8227
412a7670L9438K0520L133j3304l5995l4584p379J0334K3010L5702K3501n862k0102
$$ y = [26448, 46449, 44146, 21996, -9948, -37355, -46559, -32365, -3728, 24708, 41959, 40768, 19739, -11546, -36080, -42983, -31335, -5832, 24671, 43734, 41100, 19974, -10430, -36595, -46670, -35370, -6480, 26673, 47062, 44373, 22138, -10883, -41872, -51710, -34429, -3023, 29134, 49917, 46681, 18860, -17190, -43506, -50201, -32242, 1776, 33523, 49511, 41838, 11923, -22292, -42299, -44646, -27169, 6624, 36692, 44936, 34019, 10003, -22654, -43461, -40736, -21905, 6488, 35194, 45065, 32961, 9023, -22490, -46014, -42952, -20211, 7032, 36386, 51274, 34795, 3493, -24709, -46495, -47616, -19982, 14481, 39460, 50508, 34763, -540, -30610, -46446, -45897, -17670, 21768, 42288, 45421, 32117, -3878, -38462, -45841, -35507, -12497, 23205, 46706, 40844, 20742]
425B0742k8246l1001p297J7876K2843K8085K3163p243k7070k1303k3336j4816
437d7603J8433L1715K0874J6823K182k8192l0122j7029j1779J1864L6457K4782
449B8405R805L889k4264m0064j4777N29M010L1576L6328M516p913j2511l6642
462a7113k8153O638J5352K3362L7256R917k2188j7836k4292l0772Q772L3124J4467
475H534J8327J9161k1144l3085r974j3066p556K8951K7012M457J2276j945l5327
488c379j9769p55j2711J1710M2910J4137m724P154k4938m5138k829J4000K003
501b2329L1311L5665j1857j5868o474l6253k1727K4145J4152J1316L9904M606
513D6591l8899j2562r974l2183J3002M3744N202O773K1713k6017l8449K776p385
$$ y = [20742, -7504, -38505, -45802, -27926, -5083, 23002, 46165, 38922, 11852, -9451, -32787, -47603, -29170, 2545, 23419, 40242, 42424, 14232, -15890, -32919, -44698, -32834, 3623, 28405, 38210, 42099, 17835, -22229, -37006, -36477, -32467, -891, 35437, 39953, 32040, 19529, -17113, -45266, -38628, -23276, 86, 37342, 47259, 25071, 7235, -17057, -47829, -39057, -5933, 8534, 26861, 46022, 24878, -8207, -18181, -31247, -38803, -9852, 17160, 21617, 33893, 31948, -3379, -23148, -23903, -36614, -24904, 18006, 32143, 27419, 34573, 9635, -35503, -38332, -24332, -22329, 8982, 44647, 32790, 16922, 10448, -25805, -47532, -23387, -9235, 2081, 41985, 46591, 7692, -4870, -14844, -47027, -34025, 9719, 14921, 21694, 43407, 17390, -21059, -18283, -25668]
526b5668j1804L6418K9612j0415R585L314m4145k0810J4282j0885Q156N2399J3034
539D3073k1962K414k1485m9112M869L0409M329K5985L1986k5149k6898K153k6702
552b6090k0521L4256J8750m909L2283J1925m2385j5676Kl2072N791N1302J2542
565B5198L93J9899k8262n1810K08O853k577M2592L5019k2336j1142J85m0664j7026
579d3470L2159M395j712L8712R681k9580l122r770l8768L229L3170O462J8934
592B0320K9550k2975l6078m598j8188j4603L9445L1810n079J2100K115m3225k1707
605c1113J1257q128P019M1128J2538r930M278k2362m0923J195J5240M226L2828
618A7253L1068k1297k3540n420k7711j2800L1418J8983J373K0278J821k9034j2053
$$ y = [-25668, -37472, -1054, 28558, 18143, 27728, 31042, -13103, -33913, -19631, -30516, -22360, 30039, 43073, 21111, 23525, 2040, -47072, -42203, -11794, -7465, 18520, 50506, 25357, -1541, 612, -26090, -46611, -12355, 6395, 1486, 33769, 45694, 3309, -12367, -12365, -44437, -38646, 12656, 25198, 25591, 45490, 17228, -34582, -34374, -27521, -30098, 12494, 47513, 25177, 14035, 14220, -26444, -43470, -11311, -6916, -8628, 30084, 39765, 10185, 7063, -2707, -41475, -38246, -5076, 1386, 20320, 49870, 26895, -9183, -13781, -31969, -46572, -7127, 24683, 19604, 31704, 33819, -9406, -31113, -19856, -27984, -20965, 20163, 32701, 22771, 27049, 4687, -36236, -35041, -19801, -15575, 17253, 48321, 27024, 3484, -1936, -29647, -42447, -11029, 7954, 9327, 29605, 31426, 2392, -9661]
631i661m179j8049P340K7926Q714J0027J5299k0012l2602o861p400m358L2018
644a798L2745m72m659r821l2875j9316J1604J0400J4474K5128M073j3754p383
657H346j6139k2162L885J5673P884J9204J8873j2915k1519j0966j6442p869K1299
670a2848K3329J1139Q985o904k5547j7188o286j827J6717K4358P637M07j099j8381
684B492k2278l804K972N667K0428J9542J663q053j4626k0548j1636M191J2296
697a1694J9000J8896J290j1501j3838j8624j4484O691J8527J5606J3660N819j3183
710A6165k0911j5526p190N565J7029J8623J1872J277j4193k0792j2665m841M293
723b1294J8711K0712O729l721r011j7612j6512l529P616J4710J7494J0606p08
$$ y = [-9661, -13840, -31889, -24549, 3377, 12091, 22118, 37417, 17405, -15197, -22058, -29458, -33816, -1798, 30947, 30475, 25816, 15995, -16880, -36196, -24592, -14192, 282, 25410, 29483, 15729, 8346, -7793, -29955, -26070, -10397, -2513, 16691, 35564, 22649, 1130, -9836, -26278, -34147, -12848, 10481, 21620, 30605, 23701, -1846, -19034, -25320, -27147, -10430, 13928, 21565, 21972, 20873, 2492, -19786, -23590, -20618, -14951, 5477, 25019, 26682, 18629, 4003, -16545, -28181, -23990, -11694, 7306, 26202, 27492, 15991, 2153, -16471, -30955, -24264, -5737, 9869, 23529, 29348, 16165, -4746, -20272, -27462, -21897, -4868, 13755, 25627, 26904, 12711, -8081, -20746, -25587, -21294, -2583, 18129, 24858, 21137, 12126, -5486, -21998, -25527, -17911, -3201, 14293, 24899, 24191]
736B4191j1013j9652j6981l039R093J3636J8350J3745m060j5413j6309j4175o610
749b8237R655J9710J7113Q608m143j4923j8689j4026k314J3302J9567J3600O699
762B5922m364j7010k0249r458K449J0707J7507J6585M399r000j6037j6357r171
775b4077J564J2214J7406J4313K621p842j3474j6751j1568K622J4319J5648J3030
788B0025N424p828j7630j6457p800L037J2284J7287J4104K691j0442j6812j4657
801a6774p404L281J4792J8541J1368j096j0636j5946j5631n871P921J5477J5217
814A3239R438p11j1917j7291j2998k965P614J4262J5766R302l321j2837j4774
827g193j1284l656O820J4728J4788O913k166r943j5156j2882l814Q209J4349J3813
$$ y = [24191, 13178, -6474, -23455, -26494, -17401, -3765, 14585, 28330, 24270, 8857, -7452, -21627, -28237, -18582, 1128, 18241, 26849, 22706, 7783, -10906, -24932, -27246, -13944, 5623, 19223, 25922, 21558, 4548, -15701, -25159, -22710, -12003, 5504, 22089, 26488, 17488, 1451, -14906, -24077, -22513, -10299, 7107, 21420, 24041, 16199, 2725, -14026, -25594, -22972, -8653, 6995, 20025, 25449, 17621, -9, -16466, -24266, -21229, -8945, 8342, 22446, 25137, 14695, -2117, -16774, -24178, -20897, -6105, 12436, 23804, 22708, 12072, -3874, -19505, -25376, -17455, -1978, 13239, 22677, 21966, 10049, -7242, -20240, -23205, -15591, -1329, 14437, 23739, 20418, 7581, -7193, -18477, -22133, -15313, -585, 14203, 21116, 18950, 9007, -6149, -19031, -22845, -14636, -287, 13526]
841A3526Q140j599j2032j6457j1598j312P706J4091J5283P435m693j3328j5325
854a0163j0671j062J0314J6408J3066L818o048j2924j4510r328J185J1236J4356
867E677J1076M438n936j3900j4359o848J574R619J4343J1896K802o243j2823j3390
881a2074p414J044R679J4535J1948K214o141j2108j4785q317L434J1076J3287
894F378J1614L065q335j3682j3183o592L346J1786J4247J1384J196j0395j5047
907d218j1375n653M514J4274J4703P230r45r175j4563j2118k957N982J2541J3505
921A1745P780j467r557j4349j1015j686N311J0959J3820Q196k618r420j2154j1535
935a5990m549O683J2768J3449Q080k813j1435j3053j1042k913R413J4081J0612
$$ y = [13526, 21666, 20067, 8035, -8422, -20020, -21332, -13626, 465, 15748, 23183, 18490, 5162, -10163, -20834, -21896, -11582, 4826, 17892, 21710, 15662, 2738, -11772, -21100, -19915, -8679, 5677, 16753, 21191, 15255, 1355, -13004, -19852, -18278, -8659, 5684, 17580, 20382, 14139, 1316, -12074, -19488, -18444, -8765, 5770, 17718, 19932, 13791, 1683, -13102, -21419, -17985, -6909, 6378, 17992, 21057, 12722, -960, -14143, -20735, -17389, -5603, 8644, 20028, 21224, 10829, -4218, -15593, -21246, -16732, -2458, 12245, 19475, 18530, 9355, -5208, -17326, -20283, -14301, -1760, 11745, 19525, 18058, 8501, -5848, -16863, -18549, -13238, -2279, 11541, 19737, 17119, 7699, -4455, -15990, -20539, -13856, -1088, 12361, 20441, 17628, 6193, -6860, -17902, -20815, -11402, 2679, 13291]
948A3291O948l164j3869j3324p911r41R136J5053J0172K884l233j3077j3436n107
962a6578m52O174J5474J2172J285m087r904j6552q830M822R169J2600J3417P41
976A9451r724r657j1603q222N215J1647P164R722N310j0146j1405n442q244j898
990a7832J3044J1911M893O282l394j7609j1202k785j416J1882J9546N000l037
1003A5283l488j6460j5979M178P694M294J5670J0273r600p846n043j4548m443
1016b0015J2881O891N845J3552k241j5060m705p169j1457R024J7186K544N932
1029A3208P060j4537j6678Q48l358k479J7713J2599l360K986k756k1123p841O338
1043a1380j023R056K2004K90j2054r85j1067j7757P793J4102P76J1046J1539j3481
$$ y = [13291, 20239, 17075, 3206, -10118, -18029, -18970, -9834, 5219, 15391, 18275, 15042, 1965, -11471, -16578, -17030, -10856, 4618, 16790, 18075, 13988, 4084, -12468, -21298, -16476, -7307, 5293, 18710, 19451, 9727, 70, -11533, -19755, -14540, -2893, 4271, 13993, 19303, 9157, -2248, -7690, -15934, -17832, -4788, 7123, 12016, 18298, 14904, -2705, -13907, -16692, -18108, -6226, 13320, 18320, 15283, 11795, -4665, -20644, -16466, -8772, -4478, 11192, 21465, 11865, 4019, -1024, -15572, -20015, -7134, -243, 5602, 19154, 16913, 1853, -2852, -10021, -21478, -12454, 4732, 7276, 13208, 20268, 5731, -10947, -10099, -13457, -15936, 1777, 14376, 11016, 14002, 11246, -9877, -17718, -11380, -12403, -3347, 18657, 18947, 6893, 5908, -5159, -22916, -15123, -1021, -245, 10801, 22340, 8859]
1057H859j2171m97j1164m742J7769Q465o50J1842j554k0409n218J077j0894P914
1071a1373K2152K162k442N832j3952j9630L645M315j108J6415J3013q613k984
1084G432j496j8588p394J3035L605L203J8590O54j7196l385m085j4022N391J7190
1098B934K030N083R989j1950j5737m3o247m145J8004J2930l026M589q06k0945
1112g340r816O105j441O979K0496L330r454k526j0211j4190M692R918J453R620
1126G615R380q766p037M5j1275p810J0547Q363K484J1118L036j4443r959m140
1140a0842o880N297J6937Q239J864O30j2511j6246j154L032L719J3438J1116n191
1154A1448n477l173j0930o871N257N430N211J0378L794o385o784q578r264K370
$$ y = [8859, -3312, -3809, -14973, -19715, -1946, 6519, 5869, 17711, 16157, -4252, -9470, -8393, -19287, -11373, 10779, 12941, 10499, 16331, 2379, -17251, -13606, -9291, -10399, 6016, 19029, 10416, 7432, 5936, -12652, -20046, -7011, -3406, -203, 18387, 19041, 1845, -1540, -5625, -19647, -14256, 2934, 4964, 10047, 20036, 8086, -7651, -7694, -13941, -18086, -82, 12848, 9822, 14411, 13605, -7340, -17156, -11051, -12492, -5513, 14983, 18313, 8859, 6333, -3878, -18068, -13376, -3458, -2005, 7615, 16995, 8229, 1192, 1237, -10038, -17848, -7301, 1062, 3546, 14664, 17700, 3257, -6702, -10842, -17722, -12425, 4512, 12751, 14615, 15245, 2734, -13512, -14666, -11634, -7915, 5523, 16639, 11448, 5971, 2798, -8132, -15003, -9746, -4316, 895, 11273, 15067, 8682, 1898, -6680, -15944, -13574]
1168a3574R825P335P743N350p733j1376o123m111p82R746J1033M288K95l551r724
1183a359q541k279J735O723R680O248J9l997r551r927l080M392P387R512P277
1198A4239r19q235q940p230k587M266R104Q445M956j299o915q834p031k530M895
1213h615Q697Q088M284q90p016r403o565p00M794P410Q291M399k322p590p705
1228d843n436j993M581Q747P566L282k006o407q922o302o70N666Q905P402L005
1243A2575k264p825j0302n015J644N219Q865Q328K321n392p880p643m944R93O634
1258d686Q817O464J286m030p571p818m593J310P542P528N659J703l823q380p655
1273h247k604J186N735Q155O542Q01m788p605p384l634J847P004R082N417m97
$$ y = [-13574, -3749, 3586, 11329, 16679, 8946, -2430, -8553, -12664, -13446, -3700, 7333, 11621, 11916, 8365, -1359, -9900, -12179, -10444, -3721, 5959, 12207, 12226, 8229, -1322, -11249, -14329, -9937, -2550, 6962, 14239, 13320, 5085, -3855, -11085, -13672, -9406, -302, 8143, 13099, 11800, 4885, -3949, -10980, -13510, -8615, 82, 8170, 12454, 11564, 4548, -4855, -11420, -12120, -7326, 84, 8375, 12774, 10452, 2862, -4843, -10279, -12272, -7691, 1056, 8622, 11904, 9898, 3491, -5431, -11733, -12403, -6737, 2168, 9570, 12575, 10311, 2486, -7816, -12831, -11187, -5968, 2897, 11225, 13546, 8154, 274, -7369, -12313, -11320, -4686, 4131, 10595, 11881, 7851, 280, -7538, -12131, -10821, -3279, 4249, 9908, 11611, 7788, -592, -8247, -10851, -9665, -3930, 4225, 10767, 11568, 6780, -825, -8209, -11843, -9996, -2992, 6090, 11507, 11010]
1288A1010m936p589p993l508M314P189P945N037N2o034r099o762j505L457P525
1303h97Q365M873j604p124p583n669k016L755Q383P375L138j966n217p725o459
1318a0371n89M707O944O384L819j317o500p916n285l80M227O843P519L858l173
1333H770o974p139n095m92N081Q621O592J629k804o595q108n179J415O085P699
1348C506N870K010l648p594p607l390J917N127P640O084J039m853o744o138l511
1363a0292J186O183P620M466K38l505o564o654l235K547O116O262M280J475l969
1378F154q057n972k097K311N443P682M836n63n177p188n762k337K953O676P710
1393F612L524j251m731o730o957j410M590O729N846L965j019n933p281m888p46
$$ y = [11010, 6074, -1515, -9508, -13016, -8702, -1513, 6432, 11469, 11521, 5487, -3612, -10374, -11879, -8422, -897, 7468, 12341, 10737, 3613, -3970, -9639, -11655, -7900, 483, 7858, 10996, 9030, 3813, -3912, -10371, -10960, -6253, 691, 7075, 10894, 9577, 3077, -4839, -10124, -10504, -6277, 566, 8085, 11943, 8770, 1796, -5343, -10438, -10930, -5849, 2772, 9364, 10993, 8189, 1594, -6514, -11693, -10278, -4193, 3506, 9376, 11386, 7738, 144, -7463, -10853, -8936, -3809, 3831, 9915, 10954, 6101, -643, -6781, -10292, -9106, -2923, 4697, 9163, 9401, 5896, -668, -7322, -10557, -8010, -1894, 4368, 8648, 10123, 6154, -1903, -7875, -9972, -7661, -2218, 5464, 10300, 9737, 4560, -2628, -8390, -10727, -7774, -1098, 6612, 10136, 8885, 4154, -2576, -9533, -10943, -6353, 376, 6222, 10187, 9168, 3235, -4046, -8934, -9680]
1408i680L765O637N915L336j925o208o031l555j375L312P062N933J618j401m661
1423B742o980m547j98M244N860O159K118j549o091p028m366J086L750O218P214
1438H632K233m266o103o190m266L84N677P558N140J254l981o289n852l805J370
1453h504O343N923L772J673l084p533m973j689N64M426O628M353O40k797o286
1468e44o005k500J017M867Q270M673j675l558n641p217j845M311N032N178N123
1483I486j245n782m491n044k951M224N775L826M668J285o504o538k543l885J517
1498h202R109O291Q57Q04m866r489l512J634J552O578P493n89k347k047p395n442
1514i571L099L124K396P342M179n583m023k976o952o14P500M201K913N233l473
$$ y = [-9680, -5915, 722, 6637, 9973, 8048, 1840, -4191, -7746, -9121, -5809, 1253, 7186, 8804, 7403, 2742, -4238, -8785, -8983, -4739, 1121, 7280, 9398, 7849, 1758, -5270, -9636, -8550, -4800, 1418, 8632, 10865, 6599, 496, -5694, -9960, -9576, -3899, 3659, 8799, 10053, 6072, -217, -6069, -9874, -8504, -2161, 3762, 7534, 9207, 6123, -1410, -6383, -8072, -7508, -3082, 3546, 7899, 8539, 5742, -544, -6549, -9049, -8032, -3165, 5105, 9778, 8103, 4545, -1096, -8313, -10158, -5847, -815, 4363, 9486, 8241, 2459, -2032, -7076, -10027, -5803, -28, 3798, 8466, 9751, 3247, -3291, -5834, -9719, -8202, 907, 7198, 8055, 8859, 3993, -5496, -9008, -7374, -5822, 756, 8249, 7660, 5313, 3266, -4129, -9571, -6472, -3348, -952, 6390, 10569, 4986, 963, -2013, -8965, -9579, -2079, 2122, 5035, 10268, 6795]
1529F795q206k853k370l034N845Q388N29K113J881q772p641Q21r88Q93J0551O437
1545A0389l295j345m269j0271j425N733J939N234Q083l476o487m27m679o039N659
1560d676N939l48M497M128o529n531P4n128j437Q225N131J016M145k927j0883
1575d304l218O98j347O864J0020r12l251K5o694p387L094L363O10P329N101m719
1591E272l093k596p548j464O694L001K745O320j728p623k156k393n216M306Q583
1606C104J432J617K217o663p402L8r82R54P850M638j098K91l073q686k557L252
1622e068J348M482P219k05m855k078m063m720J660M523K241M641L513l219n026
1637C93l440n176l41O457N405K566K687k588p766m384n54J35M537O696K412j259
$$ y = [6795, -1411, -4264, -6634, -9668, -3823, 4565, 5094, 7207, 9088, 316, -7325, -6504, -7492, -6599, 3952, 10389, 7094, 5749, 1480, -8791, -10216, -4483, -2544, 2690, 10773, 7297, 810, 383, -4296, -10335, -4676, 1263, 915, 5412, 9540, 3011, -2520, -2446, -7574, -9011, -786, 4345, 5361, 9506, 6579, -4304, -7522, -6824, -8171, -1307, 8713, 7801, 4550, 4575, -2119, -9506, -6412, -3049, -2439, 4890, 9991, 5272, 2179, -417, -7965, -9429, -2735, 266, 3011, 9331, 7603, -20, -2176, -4569, -9785, -5479, 3104, 4536, 6153, 8370, 1707, -5695, -5657, -6639, -5685, 2165, 6803, 5705, 5996, 2923, -5763, -8320, -5068, -3720, 762, 7981, 7776, 2921, 843, -3220, -7940, -6280, -1757, 484, 5125, 8638, 5419, 393, -3047, -8223, -8564, -2107, 3298, 5864, 8551, 5963, -1803, -6187, -6741, -6606, -2069, 4627, 7039, 5780]
1653E780j998m909m748m68J855K727N007L533j362j762l765n488j871K663L563
1668a243L985M493l4m139n197l829j485K675M396M411L257q75l974m665l593j367
1684g184K144N066M769K414q31l667n376m288m14L319N185M188J732j344m842
1699H71m844k167M27K349M263M048J393j475l655m211l325J36K581M834M428J257
1715F910k031l908m691l472P60M289L958L587K062k734n108m239k015P52L910
1730a970M536L295Q01k674m388l824k107K8L811N506L011Q1j819m722n084j235
1746f754K013L763M152K807O0l107l960l693j601K052L313M117L182k61l964l515
1762a396l124j619J362M423M425J408M5k866m508l566q85J901M443L929K089l45
$$ y = [5780, 3782, -1127, -5875, -6343, -4488, -1761, 3246, 6779, 5417, 3655, -110, -5598, -7469, -4806, -1243, 2742, 7235, 7201, 3062, -2135, -5964, -7449, -4774, -378, 4033, 7290, 6415, 2441, -2224, -5817, -7184, -5040, 26, 4795, 7209, 6378, 2711, -2665, -6953, -7367, -4048, 1137, 5325, 7057, 5713, 871, -3973, -6140, -5713, -3364, 899, 4947, 6340, 4865, 1210, -3001, -6326, -6190, -3609, 1225, 5653, 6910, 4879, 971, -3720, -7192, -6432, -2143, 1815, 5402, 7464, 4730, -378, -4617, -6632, -5880, -1970, 2566, 5861, 6662, 3988, -400, -4224, -6331, -6303, -2492, 3014, 6025, 6106, 4287, -435, -5519, -6754, -4741, -978, 3174, 5981, 6041, 2934, -1026, -4719, -6320, -4268, -955, 3162, 6344, 6083, 2119, -1396, -4520, -6139, -4777, -354, 4071, 5479, 5524, 2658, -1850, -5416, -6301, -4400, 43, 3972, 6061, 5716]
1778E716l205n085l002n02K381L428M616K316j585l447l935l537l86K768M287
1793H28M003J142j410l592l742k936qL125L717K887J439p63l889m394j990K12
1809e371K598M051L630J045j924l782l607k189J66K832M471L029J106k125l470
1824D60m319k288Q73L559L930K944R61k400m260l751j352Q29L089M251K995K67
1840E788k789m017l068j847J680L195M072K584n47k531l798l595j086K278L328
1855c53L331K174j3k814m010l206l46J721L225L559K023k12l301l596k650j218
1871e686J745L967L512J665k12l199m066k957m07K314L894L433J554r59l395l902
1887b699k701K65K239L617L661J362j941l098l391k273L7K668L593L160P11j589
$$ y = [5716, 2511, -2574, -5576, -6078, -3697, -269, 4347, 6663, 5078, 1631, -2304, -5841, -6227, -3459, 828, 4831, 5973, 4563, 971, -2771, -5707, -5715, -2590, 1127, 4014, 5453, 4690, 801, -3593, -5583, -5371, -2773, 1278, 4908, 5953, 4029, 247, -3360, -5549, -5383, -2551, 1920, 4949, 6055, 3930, 460, -3859, -6147, -5274, -1715, 2215, 5159, 6120, 3720, -540, -4291, -5643, -4814, -1725, 2526, 5521, 5788, 2999, -1018, -4086, -5933, -4253, -1058, 3014, 5598, 5051, 2520, -1278, -4873, -5959, -3681, -353, 2978, 5152, 5139, 2325, -1685, -4891, -5237, -3516, -291, 3268, 5291, 5079, 1778, -1818, -4468, -5686, -3941, 26, 3538, 5203, 4991, 1792, -2274, -5231, -5638, -3324, 570, 4003, 5557, 4598, 1203, -2699, -5400, -5135, -2896, 721, 4382, 5744, 3803, 705, -2686, -4959, -4922, -2254, 1339, 4499, 5210, 3621]
1903C621l082l642k016M04K787L434K618J139j522l667l480j480N45K397L726
1918A782K731O13j884l305l564j528O31K730M117K645K1k095l344l383j571J600
1934c804K752L398K257K00k468l608k859o13J151L044L184K169j18k853l154k670
1950c992r31J260L674L207J627n60k614l283k797m77J938L243K604J436J42k823
1966A654l405k337o91J138L458L638J478n53k599m079k754K45J901L363L736Q73
1982E066j770k317l334k758O91L073J948K623J785j711l249j920k118r13L038
1997a866L226J899J690j085m108k775q90q38K235M871J831o35m0l008m212n89
2013d294J021J241L351L735q28j515k294m100j783K685J991K114L434K24l753
$$ y = [3621, 539, -3103, -5119, -4715, -1928, 1506, 4124, 5263, 3741, 74, -3406, -4886, -4341, -1944, 1782, 4513, 5126, 3242, -63, -3627, -5155, -4524, -1794, 2323, 4968, 4989, 2894, -450, -3833, -5404, -3804, -1052, 2346, 4603, 4803, 2335, -1273, -4132, -4745, -3594, -550, 2634, 4803, 4685, 1832, -1322, -3992, -4923, -3663, 11, 3218, 4845, 4285, 1671, -1612, -4409, -4886, -2948, 295, 2899, 4335, 4477, 1654, -1751, -4088, -4779, -3641, -183, 3455, 4933, 4380, 1781, -2298, -5052, -4807, -2906, 457, 4193, 5066, 3296, 979, -2355, -5113, -4422, -1349, 599, 3222, 5007, 3296, 47, -1873, -3991, -4904, -1866, 1360, 3259, 4949, 3864, -244, -3019, -3909, -4747, -2512, 2359, 4190, 3555, 3515, 507, -3705, -4294, -3273, -2032, 1319, 5054, 4226, 2711, 417, -3683, -5466, -2781, -790, 1324, 4758, 4982, 1229]
2028A229j864j516k983Q78M661J612J228J801k534m088j170j260n79M208M003
2043C626k41R09m34o090l355K075O02K034N529R08l585j136j553m256R60L143
2059h64K23K278L403k119k605k27l260k686L642K950L57L505J199n158l627k26
2075c215j904J322O022K071q79M52l146m775N49J338m03L383M068j847j397L16
2091A955m264l220K727J573Q90M116J570l727k061j128l389R40M211O01K038K467
2107E299k693m257j85j017k120L852L913M0O90N68m332l856L01J71J618N129J858
2124D979j844r07k672m085N50K935L50K100L109j477k529o09j788k742J633L308
2140C11J149K147O98k826k905j269j921J055M111K328M05Q61k504m346j086R54
$$ y = [1229, -635, -2151, -5134, -4256, 405, 2017, 3245, 5046, 2512, -1576, -2746, -4006, -4585, -377, 3626, 3385, 4294, 3860, -2230, -5585, -3510, -2908, -874, 4655, 5563, 1978, 842, -711, -4967, -4007, -864, -641, 1637, 5040, 2921, 316, 89, -3171, -5857, -2215, 735, 1092, 4597, 5796, 638, -2989, -3215, -5119, -3797, 2225, 4296, 3417, 3869, 723, -4052, -3503, -2165, -2568, 815, 4883, 3036, 1639, 1955, -2309, -5529, -2802, -1229, -339, 3777, 5347, 1620, -441, -1569, -4958, -4018, 193, 794, 2832, 5299, 2606, -1651, -1836, -2853, -4973, -1121, 2792, 2832, 3522, 4090, -242, -4098, -3797, -3626, -2008, 3121, 4979, 3135, 2228, -444, -4529, -3979, -1044, -694, 1406, 4515, 3038, 509, -100, -1888, -4630, -2997, 311, 1460, 3607, 4305, 1479, -1426, -2695, -4616, -3561, 550, 2878, 3283, 4144, 1640, -2706, -3792, -2838]
2156b838M40K474L389M7j132j208k491k264M53Q91J844L194J616j638j712k457
2172a392k352n24K898K109J790J346o89k753k661j362L4J600L140K272N64j497
2188B523k731k366j045M42J809K912K126lj382k404k542j327Q34K601J981J595
2204C023N21j077k527k196j028N30J118K889K326K81j379k962k322j342J241K185
2220g19K843J569n71j559k180k626n95J405K670J474J623K01k126k512j720n26
2236c349N82K775K333J160k62k012k719j516n00J091K829K320N40o67j265k839
2252a499j884LJ541K259J785J147m32j926k605j936P6J678J994K335R56j021k024
2269D47j960j698j77J693L021J283N41n20k018k846j045M66J534K202J955L40
$$ y = [-2838, -2398, 76, 3465, 3512, 2380, 1172, -1319, -3583, -3130, -2239, -395, 2799, 4415, 2777, 1065, -1392, -3744, -4268, -1370, 739, 2529, 3875, 3186, 433, -2228, -3590, -3556, -1956, 1184, 3456, 4020, 2523, -208, -2574, -3619, -3177, -1368, 1544, 3670, 3667, 2285, -119, -2661, -3988, -3154, -553, 1428, 3023, 3544, 2467, -60, -2256, -3284, -2754, -1636, 1253, 3579, 3860, 2481, -481, -2803, -4145, -2904, -719, 2124, 3693, 3122, 1563, -617, -3243, -3838, -2433, 237, 1711, 3334, 3535, 1409, -1103, -2823, -3349, -2767, 8, 2341, 3501, 3239, 1227, -1492, -3008, -3508, -2417, 412, 2732, 3272, 2605, 1340, -1499, -3383, -3380, -1839, 420, 2205, 3352, 2920, 994, -1611, -3547, -3471, -1793, 201, 2536, 3492, 2471, 447, -1513, -3211, -3388, -1695, 1326, 2609, 3150, 2630, 612, -2234, -3279, -2813, -1279, 923, 2878, 3218]
2285C218p79k560k073r87O43J330K427K073q0j400k143j768j106M78K041K097
2301A411J181K47r51k047k255p66N31J966J938J400M04j278k486j839l91L02K008
2318f25K556J337k66j559k133j823p61R92K188K260P95m66j457k047k007k33J568
2335a681J776J380J904p47j852k135j345k29J132J712K268J062q95j867j788j537
2351b842j89J441K070J692O14n98j453k003j967O54J110K242J428Q68p55j696
2367F16k299j152K45J144K242J700N77j116j884j799j350K59J939K049J364L66
2383B901j115j716k294q88P77J620J719J453N57j303k232j583o65O16J360J975
2399A182J592j53j257j817j353j405J078J743J664J144P4r02j864k192k40R40
$$ y = [3218, 2439, -121, -2194, -3181, -2538, -1208, 1219, 3292, 3212, 1812, -331, -2099, -3205, -2727, -686, 1411, 2592, 2839, 1888, -159, -2414, -3180, -2649, -683, 1255, 2655, 3059, 1781, -705, -2544, -2935, -2633, -625, 1931, 3268, 3002, 1443, -690, -2513, -3274, -2282, -94, 2166, 2961, 2495, 1038, -1009, -3016, -3249, -1681, 95, 1475, 3379, 2632, 780, -1355, -2700, -2929, -1797, -85, 2183, 3245, 2350, 483, -1305, -2842, -3031, -1590, 480, 2172, 2786, 2188, 735, -1268, -3235, -2581, -1471, 771, 2199, 3067, 2312, 616, -1683, -2835, -2590, -1446, 796, 2496, 3073, 1957, 73, -1726, -3076, -2817, -878, 1171, 2535, 2901, 1786, 70, -2224, -3112, -2335, -715, 1004, 2457, 3014, 1711, -521, -2104, -2769, -2153, -793, 1182, 2774, 2621, 1364, -453, -1806, -3211, -2133, -390, 1274, 2418, 2492, 1590, -274, -2466, -2706, -1766]
2415a766J506J763J243j81j460j935j483l26N22J816K257Q30m84j306j881j620
2431b505l22J064K072J713P62o61r75k438j383r0J220J659J724J128n87j965j701
2448a285j398k2J277J880J537P51p02j642j735j287pJ277K129J346L79o07j775
2465A16j494r63j95J635J749J121P47p64j497k413j008P47R38K360J584J69j458
2482A374j701j775n06M94J663J476J448j26j025j405j483j145P74J654R45J355
2498B017Q94j579k000p78j055N0K276J705O02L03j003k604r97J27j96J806K425
2515A993L38m41n67j776k241K74J421N66K039J528j065j693j021j633l42J879
2531g41J235O31J638p16k048r90l41j438J028K342N73Q38Q87j967k317o55l40
$$ y = [-1766, -260, 1503, 2746, 2565, 1105, -830, -2313, -2639, -2117, -301, 1956, 2786, 2302, 996, -885, -2505, -2827, -1763, 309, 2022, 2784, 2123, 1148, -1290, -2673, -2763, -1543, 116, 1840, 2968, 2381, 416, -1285, -2683, -2705, -1428, 452, 1989, 2740, 2038, 396, -1339, -2626, -2633, -1356, 773, 2119, 2498, 1891, 116, -1378, -2341, -2536, -901, 848, 1969, 2716, 1952, 455, -1958, -2966, -2219, -1281, 1079, 2663, 2832, 1374, -327, -2102, -2608, -2114, -451, 1025, 2473, 2347, 1322, -83, -1566, -2711, -1937, -283, 662, 2017, 2911, 1332, -668, -1446, -2501, -2451, -175, 1530, 2132, 2435, 1432, -1172, -2169, -2042, -2238, -432, 1993, 2331, 1890, 1323, -453, -2694, -2420, -999, -433, 1606, 3134, 2069, 376, -645, -2278, -2620, -741, 494, 1125, 2763, 2047, -1, -991, -1332, -2770, -1742, 600, 1173, 2011, 2898, 931, -1386, -2041, -2381]
2548b381M69K943J857p13o01q99k662q02J588N19R83J989m9j797j63j128j685
2565b532M86J601M71J225J848j608j764p80j377q35K572K208j33J087l93l025
2581i49j352N56k02J083K490N19n11k5j409k443K57M81N44J951K050j140j186
2598G14p63j932r59J896J154M52J573K90k172q83k07j586O61J866R72O42R28j621
2616A025k123n65o28P3K046K172K28k58r02k402j506Q95J233R51J918j68j091
2633H98l43r32j516MJ074Q78R16J242l97j222j121j446o98J341J570J291R48o68
2651A819j855j331r87L03J001J955R45P0m39j773j173k56L80L99J335J320M17
2668B130p26j445j212p23l7J492J404J322m60o17j036j237r87P55R37J380Q70
$$ y = [-2381, -1912, 1031, 2888, 2175, 1574, 675, -1987, -2789, -1201, -682, 301, 2290, 2241, 444, 281, -847, -2532, -2046, -445, 26, 1251, 3099, 1491, -273, -1053, -2430, -3265, -693, 1515, 1382, 2469, 2076, -949, -2301, -1745, -1947, -864, 1626, 2145, 1634, 1609, 200, -2243, -1986, -1505, -961, 990, 3040, 1900, 714, -49, -1981, -2940, -1044, 110, 562, 2135, 2425, 253, -630, -837, -2423, -1762, 104, 1076, 1718, 2646, 1025, -1098, -1663, -2291, -2218, -172, 2000, 2228, 1970, 1068, -1334, -2840, -1945, -712, 239, 2157, 1989, 898, 555, -377, -1893, -1889, -815, 63, 979, 2221, 1824, 602, -519, -1965, -2663, -1322, 248, 1539, 2487, 1819, -36, -1367, -2354, -2051, -1050, 905, 1850, 1920, 1481, -292, -1465, -1721, -1341, -942, 393, 1713, 2130, 1404, -41, -1253, -1976, -2013, -521, 883, 2205, 1745, 1128, 92, -1145, -2132, -1377, -440, 940, 1810]
2685A810J94o71j587j439l29P26J133J045R67N5j168j314r37m89N53J470J211
2702A230N74n49m72j339r04m15O83J030J246N66J62n59j839j607M13L94J270J493
2720A377Q61p64j241j126j302M78Q99J244Q93P89r06j050r15j028m17J269J431
2737D92N35Q24k85j165j638l02k88Q36J338J252O1l52j161j333o26J01O59J687
2755F35J217k22n97o21j432q35M71J148J022J066K81j114j160j132m42K05J162
2772c48J276P59J59j130j074p44n62J24J238J319O07o2m03j523j315j16L67J163
2790b65J101R62k18q17j128j164n9O49M71J388Q68k41j177r58o04o40P80J414
2808C62Q19L08J19r49j217r71j60N81J531O32P90k85j128j510m69j5M14J134J556
$$ y = [1810, 2004, 1333, -254, -1693, -2022, -1296, -163, 882, 1849, 1904, 736, -578, -1515, -2004, -1451, 19, 1230, 1804, 1255, 783, -556, -1460, -1875, -1192, -162, 1084, 1650, 1812, 1253, -586, -2193, -1780, -1386, -116, 1377, 2238, 1474, 233, -893, -2195, -1717, -818, 426, 1319, 2108, 1202, 152, -763, -1791, -2208, -939, 492, 1027, 1851, 1566, 401, -1237, -1539, -1827, -991, 347, 1599, 1660, 1308, 147, -1186, -1812, -1711, -1052, 635, 1852, 1630, 1033, 412, -1020, -1855, -1384, -236, 786, 1852, 2133, 1019, -141, -1273, -1715, -1510, -348, 928, 1687, 1846, 716, -358, -1102, -1664, -1540, -302, 1017, 1624, 1562, 1159, -364, -1679, -1795, -1428, -265, 836, 1798, 1580, 763, -365, -1529, -1588, -939, -468, 920, 1788, 1547, 370, -588, -1192, -1832, -1052, 362, 1181, 1489, 1608, 659, -558, -1529, -1689, -1108, 423, 1055, 1845, 1560, 432, -1078, -1547, -1562, -1148, -14, 1542]
2827A542K26m38j195m98j237j32Q38J225J109L70m83j055j089p73j25J084R55
2844C24R51M01n61j047j007o36L87L52J277J236K11j000p75j013o56L20Q12J358
2862I34M50J71o13r83j226m60L77J223O53J103J26q78j148j004j98L56O55J387
2880I25M77n9p09r42p68l63J49J209J293K57k20n40r76j003k80O34O61J120N95
2899A460j14n69j577n63q9M76J042R02O21j94r49j018o58j75M79R50J394J6K2
2918A456j012j299o63K91M53J110O97O26m48r48j031o00J30K33J125J271J06n93
2936I04p13r81n00J8P14P97O33M82k49j020r56p45L44Q37O21R70L38m28j112j274
2956a320l8N9P97J283O42j26n77o94o07p85K70J063O63M39J21k40j066j030j55
$$ y = [1542, 1768, 1330, 135, -363, -1600, -1732, -894, 331, 1440, 1810, 1327, 272, -817, -1590, -1715, -631, 324, 1275, 1676, 1115, 68, -939, -1575, -1188, -836, 441, 1677, 1888, 888, 113, -900, -1556, -1236, -424, 934, 1384, 1555, 942, -41, -1267, -1727, -1350, -127, 526, 1629, 1755, 877, -271, -1275, -1473, -1117, -462, 925, 1402, 1343, 634, -308, -1076, -1439, -1290, -81, 1212, 1469, 1249, 709, -267, -1270, -1550, -916, -255, 865, 1460, 1346, 777, -800, -1363, -1452, -976, 66, 968, 1589, 1395, 446, -572, -1230, -1405, -926, 24, 1418, 1434, 1456, 444, -855, -1518, -1227, -774, 336, 1033, 1659, 1211, 263, -768, -1368, -1238, -1005, 120, 1391, 1497, 904, 191, -790, -1290, -1272, -558, 239, 872, 1354, 1105, 85, -871, -1616, -1272, -435, 186, 1156, 1494, 1066, -46, -1320, -1358, -1299, -502, 781, 1423, 1297, 720, 26, -581, -1366, -1096, -33, 630, 1069, 1190, 950, -116, -1146, -1301]
2975a301K09P92P71J032j23o60q70j271K34L90O47J150O25n92o93p24l75q18P57
2994h20R12N06O33J9r88o20p62m21O60Q16R76N07J22j345r59k91R7J04Q24J061
3014A031Q2k8m68j310n39J35J72J200J025L71n98n74j315p53P97Q03M51M51M71
3033A404n71j063p9p73m8P27O59L68O83j15j443mo46p97J206R89L37L04J26j158
3053A06j782N85J95L78J427N47p92k14l86j007k45N73K93O05J080m60o95K00r23
3072e15j084O12Q71M51O10Q12j135j168k81l84Q4J434P21k63K58m44j372N2L11
3091d30o42Q60J214P9m67K33j103j042M47M49K74J072M68p26l23o17r27j02P35
3110e48O24L66R55q5j560j30k58p93N69J369O8P45Q6j201j196k49L6O52R07J146
$$ y = [-1301, -1092, -300, 471, 1503, 1380, 720, -150, -1421, -1187, -797, -150, 1000, 1625, 1033, 340, -384, -759, -1577, -820, 92, 598, 1231, 1250, 262, -358, -1120, -1541, -881, -65, 911, 1418, 1540, 195, -764, -1055, -958, -854, -30, 1031, 1113, 1085, 617, -693, -1232, -1097, -925, 275, 1300, 1671, 1073, 499, -816, -1569, -772, 31, 482, 933, 1404, 833, -230, -309, -1082, -1130, -403, 256, 624, 1307, 1192, -251, -255, -901, -1698, -492, 497, 834, 1138, 1264, 106, -1676, -1091, -896, -518, 909, 1456, 664, 450, 64, -943, -1188, -615, -322, 283, 1363, 903, 208, 408, -515, -1599, -987, -116, 335, 945, 1757, 622, -546, -827, -1211, -1127, 307, 1028, 765, 1023, 579, -793, -741, -430, -1072, -212, 1002, 1081, 614, 847, -256, -1298, -851, -402, -128, 944, 1412, 686, 363, -254, -1181, -1283, -548, 76, 442, 1397, 1312, -248, -378, -636, -1429, -860, 509, 577, 1322, 1408, 207, -989, -1238, -1202, -550, 357, 1503]
3130A503o04l18m41j227n7N30J53L20Q57M18n79q1p90r83K10J048L13P31L13q02
3150E14o05n18o83J60Q82P73K79L25n81j030k28k21J95N54R74j1L06m39r18m93
3170g65R4k42Q35Q65J25J40m35o57q12j85L12N60P46J94L4l91m74r76K2K82N70
3191a58R13M68j09q05o37n68l34O78N17R23M33l66n24p57l99p3K48O00O51L6J20
3212H57m07p45m34j28K17P60P13L95l51o85n80n53j68P52N98M03J23k87p01m55
3232f76l57L09O38L59O56K52n06p76l60k34l51P57Q66L07K6n07m09q61p9n1O09
3253c88J022K94j78k23o21o38j15L37L05O57M79J94q08l27o04p56O60P69K99L75
3273G33J34o55m75m43k29L45P29L84L07n3m74p72l75J9K5P17R04J19rn53p93m17
$$ y = [1503, 899, 581, 140, -1087, -1144, -614, -461, -141, 716, 1134, 555, 474, -316, -1299, -1089, -41, 272, 1003, 1316, 514, -91, -609, -1292, -1132, -250, 523, 802, 1127, 546, -484, -712, -933, -738, -184, 790, 779, 1085, 646, -272, -765, -671, -913, -78, 787, 912, 1052, 617, -40, -852, -1037, -725, -165, 581, 775, 809, 418, -56, -1032, -1010, -728, -158, 755, 1223, 1114, 309, -328, -896, -1230, -552, -35, 888, 1321, 955, 431, -326, -725, -798, -550, 50, 701, 737, 857, 450, -295, -729, -857, -640, 120, 833, 1228, 877, 192, -388, -941, -1109, -357, 241, 644, 767, 480, -221, -676, -1033, -724, -86, 273, 929, 1181, 675, -101, -461, -695, -1046, -289, 577, 884, 910, 403, -6, -867, -946, -997, -388, 634, 928, 750, 527, -94, -732, -847, -510, -205, 452, 931, 1125, 317, -10, -614, -1370, -710, 59, 358, 733, 867, 212, -263, -706, -935, -590, 139, 523, 830, 777, 303, -469, -844, -825, -800, -83, 821, 940, 931, 378, -415, -832]
3295h32Q4L16L20Q22K78k00o18m33o77K94P1N96M93K44k55l34n79k98N1J52P21
3316B16M11qJ7p92n94J11k36N67M25N10L04m00m55p66j3lK60P03M24K77n06m68
3338a6m03l87J74M60N22L65o8j9n20q04k87J56P44M61K33K97n40n96l37l30L14
3359e81M70O19L25oo14m61l23m82L84L66P71K06m4m18m50m34k22L86M43M17O18
3380I70q8p10l96l96j25J77O56M27L39m01j02o61m64p6L05N17N82J52J7k51j126
3401f54k06M98k54P94M98K6j58m37m08n43J10M68M04O42j04k16o10L0n80M9K05
3422d46O91N00j86j45m61n25j25J42K97N76K56K14n6q42l51k32K69K03M12N94
3442G85j00k93n77l01j82l9M92M90L06J72m24n13j57l89q8P23L80M06k52k22o11
$$ y = [-832, -748, -432, -112, 710, 988, 788, 170, -263, -940, -646, -575, 21, 514, 758, 503, 169, -410, -708, -657, -505, 216, 627, 619, 636, -156, -750, -639, -875, -308, 117, 627, 931, 531, 76, -690, -703, -706, -446, 257, 681, 958, 452, -16, -419, -806, -632, -172, 350, 715, 647, 628, 108, -696, -983, -827, -83, 378, 611, 908, 368, -228, -565, -895, -581, -111, 508, 833, 827, 213, -248, -571, -1053, -669, -303, 468, 674, 630, 212, -238, -672, -894, -508, -65, 352, 970, 882, 172, -224, -620, -745, -568, 88, 515, 854, 453, 351, -310, -774, -850, -545, -28, 554, 706, 723, 472, -654, -860, -362, -616, 178, 676, 702, 544, 107, -301, -844, -734, -266, 138, 780, 676, 460, -150, -120, -700, -651, -446, 245, 745, 559, 414, -47, -572, -697, -555, -258, 318, 574, 788, 732, -110, -461, -693, -424, -221, 191, 785, 685, 392, -185, -486, -668, -707, -215, 275, 581, 753, 329, -184, -341, -730, -818, -95, 285, 691, 439, 217, -394]
3463c94j11M4q3K73O59M41l60l21l51j97l05L63L89L06K43P1m40o58r5m4J7N66
3485A3M89P2j4j53p95L5k18J23L67N06M40m28j33n09m12j23N26L36J85L85k46
3506D46l97p74J37L15j1O92k96N02O5o32m93J03j91P0J008J57j03j55k71p30k44
3527h02K32N09K91N26k68m13P1n53n69N90J79K55M35L54p37k37M7o64R3M90K21
3548E0L85L47m46o65m46R8n1P76O99k47k78K38q80j9J1L50J1L07M29l22J2j26
3570B33p13k42M41j08L62O70j60m25k17p3o62L70Q80J1J19J49o56l76O5j26k1
3591d79N36K01J90pj19o70r5K38j37N64K40N2k90r1n09j65K22K15J80K84J92l87
3613A65j80J9n17j19L47J14L42P84m29p30n9n25K7P46O48k1k26j07l51l03J44
$$ y = [-394, -505, -461, -544, -271, 388, 829, 469, 148, -203, -400, -705, -342, 47, 353, 596, 667, 227, -431, -526, -570, -553, 13, 502, 574, 560, 407, -388, -353, -571, -448, -81, 425, 865, 437, 304, -205, -617, -740, -214, 122, 307, 692, 446, 49, -725, -588, -273, -284, 408, 112, 614, 679, 47, -446, -343, -534, -464, 544, 701, 598, 443, 172, -558, -802, -570, -61, 230, 756, 488, 75, 146, -407, -976, -386, -207, 48, 483, 837, 100, -137, -90, -754, -661, -171, 50, 435, 782, 336, -329, -775, -677, -728, 48, 747, 500, 222, 460, -420, -439, -428, -78, -67, 240, 669, 347, 359, 233, -480, -722, -281, -389, -27, 643, 483, 58, -159, -232, -894, -524, 356, 367, 486, 635, -21, -397, -332, -458, -479, 57, 258, 448, 441, 322, -348, -443, -205, -342, 222, 462, 514, 224, 133, -376, -541, -319, -104, 76, 360, 552, 165, -15, 4, -513, -632, -285, -171, 171, 955, 526, -204, -263, -788, -761, -15, 633, 612, 386, 279, -72, -375, -231]
3634b31m6K94J61J09o4K26l46k12m89J50J08O22L48o2j7o43l82j74J52N23L28
3655C55O4J4l22k57l27J66k7L26J86K40m8j67o03M6J24j84M97K76K40k66k67n25
3677d59J51l55L94K91L02J56j16o0m57l75J65O1L06M76o6O2l64m52j00k03M76
3698a67J34M29Q9j34m59j35j68n1J66M37L60j67K03o03l51J35j08L28L52K9Q5
3719D04Lm73k44l40L51oL05M27M5Jm84j42l57L37P4J97J88J48l29j0q1n39J61
3742c64M15L57J7m1l38j61l46K44j13K68L99K4j44M5m17k93p5J47L15L37N33l83
3764D26k47k28l40l29M21K98M92lk44m8m17k01j65L50M01m7M39m1m28j32k69j65
3786d77K70K03N90k72n2k12k96j06J20P5M70J62O6k78k10l13k36K61P4l3N46Q
$$ y = [-231, -277, 17, 178, 287, 223, 449, 103, -109, -598, -448, -340, 282, 630, 568, 551, -92, -474, -648, -496, 27, 355, 419, 433, 111, -146, -473, -307, -334, -8, 178, 418, 370, 203, -400, -354, -230, -414, 83, 359, 599, 333, 66, -459, -308, -663, -269, 22, 324, 480, 364, 304, -153, -528, -363, -302, 4, 480, 414, 476, 112, -340, -440, -643, -167, -33, 396, 485, 351, -108, -243, -411, -462, -296, 141, 501, 334, 537, -66, -417, -282, -390, -62, 290, 319, 404, 407, -66, -310, -650, -299, -305, 0, 427, 472, 473, -11, -153, -510, -173, -99, 98, 286, 434, 105, 95, 14, -525, -364, 51, 408, 425, 384, 46, -115, -461, -217, -330, -62, 337, 361, 217, 262, -155, -448, -523, -376, -61, 276, 809, 426, 179, -49, -389, -718, -297, 1, 493, 490, 246, 198, -219, -420, -585, -235, 166, 119, 558, 517, 89, -43, -312, -477, -207, -4, 586, 314, 262, 50, -246, -352, -232, -157, 313, 475, 541, 263, 53, -260, -496, -235, -161, -194, 352, 360]
3808C60j47k50k06q4j95K38M95J77K73k36l78k05N2j40J90M02J25k04n0k79k5
3829h7l98K08R3K50K77O3k32j63m48orL21L57J41J02q5k05n98PJ65K41K29m5K05
3853C83j30j35j75m40N49k5K92L2p1L8m88j26P7j35K40L86j3k68L39m71m4k89
3875d74J95K87K19J97o4l85j37j3m41L38J33K99J63j17j53j44r1k26L81J04L5
3896A06K01K12n54j18j44J68qK45J3J99L4l83j91l58L39J74R2J6K45l3m60p1j03
3919c79L10K5Q3J92K02k79k83J79n16J61Q7N94j82j08J62Q2p48J93j32M17L7J83
3941B80J85k90k01j07m09J00N04P3N11m01j0l87l40K38M6J82J36N6J33j52l05
3962a58j72L64k48L42N9J59m2r2k51j63J67k45J70M44J7j08m89K76k57m65P93
$$ y = [360, 213, -37, -243, -327, -522, -284, 211, 388, 661, 425, 47, -158, -106, -246, -56, 346, 471, 267, 217, -62, -87, -485, -277, -184, 66, 343, 406, 174, 11, -437, -443, -452, -131, 226, 367, 469, 384, 179, -419, -412, -247, -6, 223, 178, 383, 253, 118, -57, -497, 52, 27, 319, 351, 280, 318, -170, -296, -219, -354, -114, 272, 259, -9, 330, -141, -185, -474, -279, 8, 227, 424, 360, -25, -162, -175, -616, -278, -145, 154, 317, 200, 47, -97, -188, -414, -33, 71, 106, 307, 519, -35, -153, -297, -129, -137, 108, 121, 320, 354, -29, -220, -578, -239, -65, 27, 43, 288, 255, -205, -276, -379, -69, -44, 39, 231, 433, 154, -129, 50, -466, -305, -218, 376, 194, 86, 248, 330, -418, -225, -357, 60, 97, 280, 465, 175, -26, -133, -542, -442, 62, 135, 646, 245, 235, -152, -492, -254, -208, -26, 110, 166, 299, 147, -158, -330, 34, -214, 128, 187, 346, 304, 212, -39, -202, -35, -280, -110, 334, 351, 243, -246, 30, -227, -692, 101]
3983A01j35M09j48Q2l12j08j16m2K56R5P0J23p7j28j61p4k0J12K70j39N01j86
4005C73k76k42r5m6K48J01RL98k44m49N3r7L72j80J52K06o6K6k52k68Kj0K2N28
4029B65N1j08j01k61k77O7Q7K25J42J42r3q7J43k23k16j2M08l54N98J90o82L4
4051f2R2k60l08M72J12K44j04J6m16j43K49m5J48L96l19J42N5l71k27J34k25L38
4073h2P4L06Mk49m9k71NK29J24J61K28k12l47j94k6k34N26J16K90k31k7N4l79
4096a84j52O0oJ59L65j37J65j94l51kJ92J05k17L83L3j88K42k85j19nj47J29M35
4119B81P0j83j97j45p0qK65J15J09K10m63m44K49J95l58K44O29k74j07n1k18j8
4141a69M8L1K47L4J36j12J9l01k21J42q1J51L70o6J59m34J38j89L1k13K21L27
$$ y = [101, -34, 375, 227, 309, -3, -111, -227, -269, -13, 82, 152, 275, 198, 70, -91, -165, -185, -73, 197, 58, 559, 373, 97, -145, -240, -286, -38, 63, 72, 470, 226, -223, -170, -267, 105, -75, 77, 283, 217, 243, -9, -277, -275, -285, -263, 265, 316, 208, 107, -154, -431, -364, -277, -52, 90, 232, 139, 52, 195, -28, -244, -256, 152, -202, 396, 586, -96, -62, 30, -230, -538, -66, 46, 290, 186, 202, -214, -357, -108, -153, -5, 391, 72, 214, 269, -102, -329, -195, -420, -82, -8, 298, 302, 53, 4, -267, -262, -33, 91, 252, 480, 268, -79, -273, -299, -533, -7, 109, 399, 168, 141, 195, -184, -336, -276, -282, -123, 242, 105, 270, 76, -275, -277, -85, 20, -197, 186, 219, 31, 273, -12, -131, -136, -283, -154, 281, 351, 168, -29, -174, -244, -252, 13, 128, 237, 447, -16, -460, -211, -16, -374, -130, 499, 225, 118, 67, -151, -169, -121, -90, 157, 191, 327, 215, 234, -67, -288, -146, -227, -76, 294, 228, 387, -47, 91, -98, -67, -280, -59, 268]
4163B68J42m81K38k80k11K44N0j36R4L73J26l54j20j13p6K03j29M92r3L9j04j75
4185cj87j66J96L4J66L38k71j91J88k37j98K62j3P8J74J82l27j57n7K27J6M9j11
4208hK82k31j0j22k2j7O5L64k69K67j19k16J8j23K0q1K24M6Q1j46p7k13j9J69
4232a37M1J53J01K30l82j01K24l57K44r1r9K72J26k12N5j35k92J53K4K57j08K80
4254B46l25k50P7J03J61nJ15L1k80j17K04j17J4K37O3J66k00K99k22k23k86N56
4276B47j17K53k81J53k95j7k82K0N7M2K51K08J44k86J16j82j80K0k1K52J75j27
4298A50j57m7j47j21K26M6P9%J24n2m3j33m26L00K70P8J16j07j07J44l64j03k68
4321e42L71K05J8K15j75j57k7m4J44K0J14J29mj1l95p2J85Q2J10k44P3J45j0K
$$ y = [268, 410, -71, 167, -113, -324, -80, -30, -166, -72, 301, 427, 73, -47, -160, -236, -33, -162, 330, 237, 276, 172, -3, -190, -356, -160, -126, 40, 378, 107, -84, 104, -133, -331, -69, -82, -4, 170, 352, 25, -132, -189, 38, 54, 103, -8, 274, 43, 33, -89, -111, -128, -63, 301, 32, 299, 180, -36, -18, -141, -121, -202, 22, 68, 149, 3, -74, -287, -306, -137, -96, 57, 158, 388, 6, -95, 129, -228, 16, -75, -174, 98, 224, 12, 67, -68, -360, -207, -183, 74, -34, 246, -79, -329, -252, -149, 12, 7, 122, 153, -127, -244, -40, -157, -143, 94, 157, 323, 123, 422, 200, -23, -309, 247, 130, 383, 102, 255, -40, -57, -339, -319, -262, -220, 31, 239, 383, 97, 213, 31, -149, -129, -150, 102, 277, 150, -7, -54, -201, -322, -96, -50, 29, 29, 153, 101, 58, -75, -501, -201, 69, 147, 263, 156, 49, 193, -171, -274, -542, -171, 34, 52, 267, 92, -65, -92, -136, 8, 28, 142, 271, 267, 256, -139, -211, -26, 56, 166, -78, -5, 140, 130, 132]
4345A32l00j22N84j46L6J70k16Q9j31r9Q0J7kL25L2j03k17j67r9j27K98J8k0M5
4369G7K09k1m87J37m4M6J0Q6K5M7q5j16j32%m1J07L92j73Q9j94q5j55J15O0K91
4394A58jJ22k75K18j33j76j54J07L54m6J21r5k44p0R7l45L96J66j45K92l55M4
4416C6j48K31k42K87j73L03n1m94O45m73j06K38k01L99j74J85l17K3J9l17K97
4437c3J16k76O46m33j5k40QK46j80r0J95K20j15m8m7k46r7J82J01K08k08M26o2
4460B58l02l5k23L91K51j26l3k3K1l08J3j27K27j76K61J11q0m0o4j09k29K44r4
4483a92N03l25R8j65j83K8O7L59k94J51K43q0j16l28K83j81J81J43j9o8R0j16
4505G9nk13J26k39L04K24l12J67m10J23J56o3j33K86j91M75r7l30j20M2j49K83
$$ y = [132, -168, -290, 294, 148, 184, 354, 138, 227, 96, -3, 77, 94, 92, 417, 449, 346, 129, -38, -137, -264, 34, 52, 32, 77, 286, 265, -222, -85, -129, -83, -73, 13, 38, 85, 0, -116, -248, -248, -289, -182, 210, 37, 126, -68, -153, -308, -193, -133, 158, 157, 279, 4, 222, 89, -87, -241, -134, 220, 174, 295, 200, -44, -114, -17, -362, 34, 200, 55, 347, -8, 36, -112, 119, -123, 164, -9, 294, 243, -251, 394, -79, -185, 53, -148, 251, 77, 262, -55, -32, -13, -330, -33, 83, -193, 453, 20, 5, -235, -227, 19, -161, -251, -56, 164, 49, 1, -46, -292, -389, -207, -106, 102, -106, 320, 258, -44, -79, -302, 89, 340, 214, 181, 158, 179, -129, -116, -243, -16, -192, 69, 180, 100, 60, -4, -113, -342, -98, -192, 311, -14, 84, -81, -264, -236, -169, 190, -104, 47, 290, 210, 94, -234, 49, -132, 49, 192, 173, 105, 195, 79, 74, -139, -13, -252, 52, 276, -36, 131, -279, -156, 0, -63, -196, 90, -101, 374, 277, -53, -173, -131, -280, 3]
4527CJ02kj36K49j62j94o3J03j79K40O3O5K20k51j08J17p9O3r5L55O2n56L57n78
4551d04L21j4K12o1K66q1j22k45j2K0j11N02j63k69J92L1o3r0J47l26J25L78R
4574B42m09L36k46k53L2P4R3J40K64k09R8j74R4j03j14P5Q5k8m0QQ0j89J91k54
4598b07K96j1Q6J40m50r9J27m8j43M11q1J79m1l38J13j13O4K9O1J63j84J09j75
4621a12l4j40oR1J36J74J51o0k75k36L41n3r4L60q8K5j44L8k83J68Q9k95L23J7
4645I3N7K91m41n68K67Q4K80p4PJ92j33N2k88P0n4j0K22J34j42R8l33j4pJ10J70
4670F3k48N54m30j88N6L01l66K30J71q2K33J2j31l56J51L0N1PJ04p5k6q8j8o1
4694a06KJ5J81K69o6j52p4j03j93J90j16K97J5P8k20L7o6j59N4M0M13l04k4K78
$$ y = [3, 105, 103, -33, 216, 54, -140, -203, -100, -279, -39, 24, 89, 309, 58, -50, 67, -12, 51, -44, 311, 373, -183, 174, -404, -83, -97, 115, 54, 320, 239, 117, -128, -140, -120, -231, 271, 108, -161, 31, 62, -1, -91, 56, -270, -145, 233, 242, -167, 169, -77, -330, -298, -224, -131, 9, 273, 64, 162, -12, 82, -21, -135, -60, 25, -3, -43, -35, 45, -144, 47, -207, 89, 78, 164, 304, -146, -245, -118, -166, -309, 102, 21, 200, 159, -179, -66, -179, -115, -86, -25, 138, -46, 63, -112, -146, -286, -292, -201, -65, 109, 260, 200, -75, -311, 30, -23, -117, 243, 155, 180, 36, 74, -209, -41, 48, -247, 76, 93, 150, 441, 0, -568, -301, -217, 63, -11, -4, 188, 55, 107, -181, -111, -165, -175, 47, 181, 39, 137, -196, -210, -217, -107, 63, -185, 369, -61, -249, -193, 108, -258, -28, 143, 61, 294, 306, 175, -181, -30, 0, 51, 58, 162, 87, 61, -27, -45, -106, -104, -89, 92, 361, 295, 143, 69, -34, -227, -37, -153, 144, 159, 237, 17, 54, -12, -171, -117, -77, 336, 32, 8, 286]
4718B86k45R9l02O0J01q8K19j04j7R4j97j14J34P6j35L88k73r3M4J21j80J04j80
4741b02K36J48r3J27K2j58k13k9K23J72k96L1M2J1J56k92j47K01J78j66K11j56
4763Fj42M6P6j45L71k6j26R7j03m6j57L1K87l44J93R4m3j1n7j61n6K92k16K08
4787F8n9J57l25j25J80n7m7J12q4L34jl1l70J58o9k8K52pJ03r5j12J0j29k6K50
4812E9j80K72k26K47k24q8J99k68J08R3k00M34j08j02M4q1k6p9J64l2K2k82J10
4835a44K40m1k34J87rq9J2K91k73j72j11M49k33n8J97J06p8Pro7q2K50jq7J25
4860A76l78o0J24J46o1J70j47K67J25k54r1P2q1j40J22J01J2J24j35j70j25J20
4882h3N0q0K87l33K76j69j58K5J22j64K29O8Q6j49O1J28l77J26j43R8L85j18j45
$$ y = [286, 41, 140, -162, -102, -1, -89, 130, 26, 9, 103, -94, -208, -74, 2, -133, 255, -18, -111, -67, 54, -126, -22, -202, 34, 182, 89, 216, 238, 80, -133, -162, 61, 233, -63, -32, 10, 21, 177, -115, -262, -61, 117, -49, 162, 6, -136, -90, -14, -159, 212, 186, 60, 157, 54, 8, -149, -118, 169, -175, 18, 112, 69, 58, 1, -160, -216, 76, -140, 68, 9, 166, -159, -284, -104, -161, -208, -96, -180, 154, 153, 122, -248, -90, -159, -187, 65, 58, 161, 66, -46, -36, -165, -191, 59, -121, 151, -75, 172, -52, -140, 59, -209, -101, -8, -208, 226, 118, 16, 60, -21, -47, -126, 38, 6, 28, -254, -144, 96, 55, -179, 8, -1, -90, -78, 213, -60, -232, -343, 106, -127, -185, 12, 118, 40, 47, 38, -29, -111, 139, 138, 51, 176, -202, -262, -138, 8, -53, 117, -30, 237, 362, 108, 17, 89, 8, -132, -10, 91, 103, 227, 92, -78, -203, -83, -33, -113, 174, -159, 117, -52, -210, -185, -63, -227, 2, 70, 156, 7, 68, 196, -181, -55, -198, -100, 285, 167, 22]
4905B2O5k04M4R6K0O0J16r5j30q6J15J4J00l34K67p7J75M7k56Q4j80J63J77j27
4929G6J23j19J01j06m32M03k43J32NK63j54j99J80K12k40j31O9J05J35j11L21
4950C90o95N44l39L0J15P3j5K0m9Qp7K1J07r1N1n4k2j52J58l0j00j47L03O9j10
$$ y = [22, 87, -117, -73, 23, 43, 103, 219, 124, -6, -92, 23, 37, 137, -197, 70, -7, 168, 215, -41, 43, -137, 26, 203, 76, 199, 80, 181, 75, -357, 46, -197, -65, -60, 203, 49, -150, 30, 242, 2, -129, -60, 45, 180, 69, 390, -305, 239, -100, -70, 45, 118, 103, 123, 74, 82, 5, 26, 133, 42, 93, 39, 17, -135, 23, -7, -107, -254, 49, 118, 8]
$$ [...]
8191A59
##END NTUPLES=NMR FID
##END=
