##TITLE=1H_SR114K
 CDCl3
 8 sc, 
 12.12.2022
##JCAMPDX= 6.0         $$ Bruker NMR JCAMP-DX V2.0
##DATA TYPE= NMR FID
##DATA CLASS= NTUPLES
##ORIGIN= UXNMR, Bruker Analytische Messtechnik GmbH
##OWNER= root
$$ XWIN-NMR		Version 3.5
$$ Mon Dec 12 15:36:15 2022 Russian Standard Time (UT+4h)  she@DPX200
##.OBSERVE FREQUENCY= 200.13135
##.OBSERVE NUCLEUS= ^1H
##.DELAY= (6, 6)
##.ACQUISITION MODE= SIMULTANEOUS
##.ACQUISITION SCHEME= undefined
##.AVERAGES= 8
##.DIGITISER RES= 18
##SPECTROMETER/DATA SYSTEM= spect
##.PULSE SEQUENCE= zg30
##.SOLVENT NAME= CDCl3
##.SHIFT REFERENCE= (INTERNAL, CDCl3, 0, 15.7039)
##AUDIT TRAIL= $$ (NUMBER, WHEN, WHO, WHERE, WHAT)
$$ ##TITLE= Audit trail, XWIN-NMR		Version 3.5
$$ ##JCAMPDX= 5.01
$$ ##ORIGIN= Bruker BioSpin GmbH
$$ ##OWNER= she
$$ F:/spectra/data/she/nmr/H-F/1/audita.txt
$$ ##AUDIT TRAIL=  $$ (NUMBER, WHEN, WHO, WHERE, WHAT)
(   1,<2022-12-12 15:35:06.45 +0400>,<she>,<DPX200>,
      <created by zg, POWCHK disabled, PULCHK disabled
       configuration hash MD5:
       00 E9 B6 7A A2 85 ED C7 34 08 36 98 17 FE 4E 26
       data hash MD5: 16K
       A8 C3 6B B6 E4 9B 3D 60 9F 32 F5 1A E3 1F F8 7D>)
$$ ##END=
$$ 
$$ hash MD5
$$ 3B AE 3A 84 F5 FC F5 27 FC AF EE B4 E3 70 8C AF
##$RELAX= 
##$RELAX= 
##$RELAX= 
##$RELAX= 
##$RELAX= 
##$RELAX= 
$$ Bruker specific parameters
$$ --------------------------
##$DU= <F:/spectra>
##$EXPNO= 1
##$NAME= <H-F>
##$PROCNO= 1
##$TYPE= <nmr>
##$USER= <she>
##$AMP= (0..31)
100 100 100 100 100 100 100 100 100 100 100 100 100 100 100 100 100 100 
100 100 100 100 100 100 100 100 100 100 100 100 100 100 
##$AQSEQ= 0
##$AQ_mod= 1
##$AUNM= <au_zg>
##$AUTOPOS= <>
##$BF1= 200.13
##$BF2= 200.13
##$BF3= 200.13
##$BF4= 200.13
##$BF5= 200.13
##$BF6= 200.13
##$BF7= 200.13
##$BF8= 200.13
##$BYTORDA= 1
##$CFDGTYP= 0
##$CFRGTYP= 5
##$CHEMSTR= <none>
##$CNST= (0..31)
1 1 145 1 1 1 1 1 1 1 1 1 1 1 1 1 1 1 1 1 1 1 1 1 1 1 1 1 1 1 1 1 
##$CPDPRG= <>
##$CPDPRG1= <>
##$CPDPRG2= <>
##$CPDPRG3= <>
##$CPDPRG4= <mlev>
##$CPDPRG5= <mlev>
##$CPDPRG6= <mlev>
##$CPDPRG7= <mlev>
##$CPDPRG8= <mlev>
##$CPDPRGB= <>
##$CPDPRGT= <>
##$D= (0..31)
0 1.2 0 0 0 0 0 0 0 0.06 0 0.03 0 0 0 0 0.0002 0 0 0 0 0 0 0 0 0 0 0 0 
0 0 0 
##$DATE= 1670844905
##$DBL= (0..7)
120 120 120 120 120 120 120 120 
##$DBP= (0..7)
150 150 150 150 150 150 150 150 
##$DBP07= 0
##$DBPNAM0= <>
##$DBPNAM1= <>
##$DBPNAM2= <>
##$DBPNAM3= <>
##$DBPNAM4= <>
##$DBPNAM5= <>
##$DBPNAM6= <>
##$DBPNAM7= <>
##$DBPOAL= (0..7)
0.5 0.5 0.5 0.5 0.5 0.5 0.5 0.5 
##$DBPOFFS= (0..7)
0 0 0 0 0 0 0 0 
##$DE= 6
##$DECBNUC= <off>
##$DECIM= 32
##$DECNUC= <off>
##$DECSTAT= 4
##$DIGMOD= 1
##$DIGTYP= 9
##$DL= (0..7)
0 120 120 120 120 120 120 120 
##$DP= (0..7)
150 150 150 150 150 150 150 150 
##$DP07= 0
##$DPNAME0= <>
##$DPNAME1= <>
##$DPNAME2= <>
##$DPNAME3= <>
##$DPNAME4= <>
##$DPNAME5= <>
##$DPNAME6= <>
##$DPNAME7= <>
##$DPOAL= (0..7)
0.5 0.5 0.5 0.5 0.5 0.5 0.5 0.5 
##$DPOFFS= (0..7)
0 0 0 0 0 0 0 0 
##$DQDMODE= 0
##$DR= 18
##$DS= 0
##$DSLIST= <SSSSSSSSSSSSSSS>
$$ [...]
##$SUBNAM2= <"">
##$SUBNAM3= <"">
##$SUBNAM4= <"">
##$SUBNAM5= <"">
##$SUBNAM6= <"">
##$SUBNAM7= <"">
##$SUBNAM8= <"">
##$SUBNAM9= <"">
##$SW= 18.05172834244
##$SWIBOX= (0..15)
0 0 2 0 0 0 0 0 0 0 0 0 0 0 0 0 
##$SW_h= 3612.71676300578
##$TD= 16384
##$TD0= 1
##$TE= 0
##$TE2= 300
##$TE3= 300
##$TEG= 300
##$TL= (0..7)
0 120 120 120 120 120 120 120 
##$TP= (0..7)
150 150 150 150 150 150 150 150 
##$TP07= 0
##$TPNAME0= <>
##$TPNAME1= <>
##$TPNAME2= <>
##$TPNAME3= <>
##$TPNAME4= <>
##$TPNAME5= <>
##$TPNAME6= <>
##$TPNAME7= <>
##$TPOAL= (0..7)
0.5 0.5 0.5 0.5 0.5 0.5 0.5 0.5 
##$TPOFFS= (0..7)
0 0 0 0 0 0 0 0 
##$TUNHIN= 0
##$TUNHOUT= 0
##$TUNXOUT= 0
##$USERA1= <user>
##$USERA2= <user>
##$USERA3= <user>
##$USERA4= <user>
##$USERA5= <user>
##$V9= 5
##$VALIST= <valist>
##$VCLIST= <CCCCCCCCCCCCCCC>
##$VD= 0
##$VDLIST= <DDDDDDDDDDDDDDD>
##$VPLIST= <PPPPPPPPPPPPPPP>
##$VTLIST= <TTTTTTTTTTTTTTT>
##$WBST= 1024
##$WBSW= 4
##$XGAIN= (0..3)
0 0 0 0 
##$XL= 0
##$YL= 0
##$YMAX_a= 173880
##$YMIN_a= -197252
##$ZGOPTNS= <>
##$ZL1= 120
##$ZL2= 120
##$ZL3= 120
##$ZL4= 120
##$ABSF1= 10
##$ABSF2= 0
##$ABSG= 5
##$ABSL= 3
##$ALPHA= 0
##$AQORDER= 0
##$ASSFAC= 0
##$ASSFACI= 0
##$ASSFACX= 0
##$ASSWID= 0
##$AUNMP= <proc_1d>
##$AZFE= 0.1
##$AZFW= 0.1
##$BCFW= 1
##$BC_mod= 2
##$BYTORDP= 1
##$COROFFS= 0
##$CY= 11.3945322036743
##$DATMOD= 1
##$DC= 2
##$DFILT= <>
##$DTYPP= 0
##$F1P= 2.36226072786647
##$F2P= -0.459571619588291
##$FCOR= 0.5
##$FTSIZE= 0
##$FT_mod= 4
##$GAMMA= 1
##$GB= 0.15
##$INTBC= 1
##$INTSCL= 1
##$ISEN= 128
##$LB= 0.24
##$LEV0= 0
##$LPBIN= 0
##$MAXI= 10000
##$MC2= 0
##$MEAN= 0
##$ME_mod= 0
##$MI= 1.114404
##$NCOEF= 0
##$NC_proc= 0
##$NLEV= 6
##$NOISF1= 3.799351
##$NOISF2= 2.8
##$NSP= 1
##$NTH_PI= 0
##$NZP= 0
##$OFFSET= 15.70392
##$PC= 1
##$PHC0= -19119.48
##$PHC1= 17.80072
##$PH_mod= 1
##$PKNL= yes
##$PPARMOD= 0
##$PSCAL= 0
##$PSIGN= 0
##$REVERSE= no
##$SF= 200.130013532006
##$SI= 16384
##$SIGF1= 3
##$SIGF2= 2
##$SINO= 400
##$SIOLD= 16384
##$SREGLST= <1H.CDCl3>
##$SSB= 0
##$STSI= 0
##$STSR= 0
##$SW_p= 3612.71676300578
##$SYMM= 0
##$S_DEV= 0
##$TDeff= 0
##$TDoff= 0
##$TI= <>
##$TILT= no
##$TM1= 0
##$TM2= 0
##$TOPLEV= 0
##$USERP1= <user>
##$USERP2= <user>
##$USERP3= <user>
##$USERP4= <user>
##$USERP5= <user>
##$WDW= 1
##$XDIM= 8192
##$YMAX_p= 0
##$YMIN_p= 0
$$ End of Bruker specific parameters
$$ ---------------------------------
##NTUPLES= NMR FID
##VAR_NAME=  TIME,          FID/REAL,        FID/IMAG
##SYMBOL=    X,             R,               I
##VAR_TYPE=  INDEPENDENT,   DEPENDENT,       DEPENDENT
##VAR_FORM=  AFFN,          ASDF,            ASDF
##VAR_DIM=   8192,          8192,            8192
##UNITS=     SECONDS,       ARBITRARY UNITS, ARBITRARY UNITS
##FACTOR=    0.0002768,     1,               1
##FIRST=     0,             0,               0
##LAST=      2.2672688,     0,               0
##MIN=       0,             -197252,         0
##MAX=       2.2672688,     173880,          0
$$ Real data points
##PAGE= N=1
##DATA TABLE= (X++(R..R)), XYDATA
$$ [...]
1736d04J62k27O33M77k37r97L65j41QO58K42q4j6j96m64j7Q05m77L4K17J47p46
1758b58L53m26n4Q0O82j41n59M63k4n93j94O10j67j9O15k39l79J30j73j89Q55
1779C73L06l45l40N39n03l36M75R5J07j32j68k50k6j07n4j99M94J9K45l09O2l46
1801d00J91M1K84J98k30k3Kj95j85L45L42P1q4O6l21k59M2J45n3K49N0j68j27
1824a9k37NP6M1K82L5l26J63m39R6p0M69l9K24l46M2J33j51RK07LJ45j31j26R
1849E5j06K52j14j01J31M3nj86p7j01J84j4l27O14m57n6j00J83qK69j92J07j9
1872b5J78L0k65P7J09J58k15O3k7l5j52J76M0J07L2k70N2j78O9L9J67m70Q4L8
1896b18L8JQjK43k01j61K53rnj36L34L8J19k20M04m28l4K50j23pJ3J56m35L46
$$ y = [-404, -242, -469, 164, 641, 404, -593, -228, -369, -361, 297, 539, 455, 439, 243, -221, -238, 567, 90, 124, 341, 488, -258, 95, -331, -385, -305, 377, 236, -323, 140, 116, -477, -671, -61, -228, -247, 368, 129, -250, -120, -293, -482, 373, 679, 334, -6, 533, 30, -306, 169, 264, 371, 239, 71, -179, -205, -312, -366, -565, -71, -52, 193, -116, -54, -400, -209, -168, 116, 314, 84, 61, 63, -132, -317, 28, 370, 441, 357, 423, 102, -157, -115, 30, -23, 226, 276, 108, -19, -256, -251, -175, -134, 148, 183, -143, 20, -419, -323, -393, 76, 37, 261, -85, -43, 90, -61, -52, 155, 158, 303, 172, 46, 55, -51, 201, 87, -14, 117, 160, 155, -31, -108, -209, -25, -39, -366, 248, -209, -265, -365, -182, -190, 79, -113, -6, -25, 153, 183, -82, -5, 104, 262, 47, 110, 83, 48, -104, 72, 112, 219, 251, -19, 33, -145, -76, -37, 130, -340, -256, -218, -180, -179, -171, -172, 71, -130, -291, -38, -47, -52, -188, 146, 184, 303, 83, 487, 59, 25, 275, 152, 145, 158, 314, -121, 225]
1921B25j05j95M3J07r5k72L69k21k99K77P3k19J84J40l09J96N06m08j48N43l2
1942C60m12J66L19j88m6o3j84l31N74r3k96M16k52l31K40k1Q8j64K75N4o44M75
1964e8K08k57K38Qk12j91O56j52j95K46j29l71L38K68n59J61M76o21j52M88j88
1985Bk15M14O4o74p3O43o18J20M59k8o31N37O3n38M69L94n65nN27m29j78P17k04
2008B51o77M88K79o82K91M76l03m60N57j43o18P33Oo09L72M70r07p0Q16k88n45
2029e63O13k6o26N42L00l00j01P30n38n56P59N7n92O17K15n51j76L78m30R0P01
2050E43r5r18M78Kn36J52Q92o87m72Q26k05q52J122N38p43l66Q45o22j97Q99l04
2071C00m54M39j0o32M70M00m19rL24n76m18P12K66n48nL62r58J68J073p36j89
$$ y = [225, 120, -75, -32, 75, -20, -292, 77, -144, -443, -166, -93, -312, -128, 12, -297, -101, 405, -3, -151, 392, 360, -52, 114, 433, 245, 199, 136, -48, -379, 195, 102, -194, 222, -30, -361, -121, -142, -54, -218, 57, 111, -533, -58, 150, -107, 131, 139, -73, -264, 392, 240, 45, 291, 162, -209, 129, 397, -162, -1, 475, -146, -298, 190, 2, -213, 201, 265, -409, -482, 161, -457, -337, 122, 94, -537, 0, 63, -475, -6, 388, -177, -182, 345, -84, -262, 455, 251, -426, 62, 341, -341, -50, 426, 123, -337, 220, 77, -541, 192, 198, -411, -39, 431, -476, -546, 270, -18, -563, 50, 24, -602, -60, 240, -60, -161, 569, 31, -525, 234, 291, -301, 316, 531, -20, -196, 182, -248, -158, 543, 448, -470, 8, 10, -526, -374, 518, -169, -641, 185, -20, -872, 250, 788, 45, -321, 524, -98, -295, 604, 300, -154, 285, 275, -357, 113, 513, 94, 85, 409, -167, -585, 127, 393, -155, -160, 202, -756, -588, 485, -251, -440]
2092d40O96k72q39P69N57r11M87M25q47R9N48l42j70P34J78r78M13L09n45j48
2112b77Q99n05m69N83n57j99M66L13o13K1M56o20Q4O55k14l57M09%m23L44M30
2133D26l80j37L82j63k88K36L65n94K77K01o46N8O31k80m68P53m72n66K09N11
2153E5k12J98M40o17n96N78K07n60O49M69q61L68r1k36J77O60l28l22K53R0n19
2174a98K09M58p36J87M89k82n02L46m7n57K76L32o05N76K63m16nK56k63l38O32
2195G5K71m02P5K05m07lJ91L46k11K7o7n99K84K55Lj75M33m70OL93l27k16K92
2218b1mP8k90K65k11j17M58k19QK09O8j37J6M1k57n2K50J53P1J22k62m06L02m0
2242B5K04l18L34j68l48K74k43k37N42l5j02j1J24n6j61N8Q7K1J69j15k01J23
$$ y = [-440, 256, -16, -855, -86, 471, -440, 47, 472, -375, -276, 272, -70, -240, 494, 672, -306, 107, 416, -129, -277, 622, 117, -352, 231, -326, -525, -59, 254, -359, -338, 118, -502, -418, 237, 23, -334, 75, 75, -348, -4, 426, 46, -91, 291, 128, -160, 76, 441, -153, 124, 325, -321, -263, 368, 88, -380, 373, -99, -665, -456, 55, -157, 41, 481, -136, -732, -154, 53, -507, 142, 611, -250, 118, 27, -209, -32, 628, 300, -22, 231, 321, -198, 11, 469, -267, -80, 409, 127, -375, -29, -76, -633, -357, -25, -630, -54, 209, -207, -212, 44, -219, -557, 75, 346, -56, 19, 224, -183, -186, 5, 351, 140, 167, 100, -499, -215, 40, 43, -132, 301, -169, -163, 230, -97, -313, -21, -25, 53, -237, 28, -183, -300, 158, -61, -53, 156, 224, 87, 103, 144, -113, -165, 85, 238, 309, 431, 169, -237, 65, 25, 229, -89, 245, 77, -271, 3, -240, -477, 65, 30, -72, -83, 41, -15, -176, -118, -31, -10, 159, 44, -157, -34]
2264c4J86r1l15N60q4pq2j72M7J52l96L81k86K10k79J43l15J62l6K40J36m52K36
2287i6j03l4J80J95k77M4L5J67q1J34j74k31J00M28l73L84j99J0j82j6K67k34
2309e6J3p3K60l97O1J51no5j90M76m79L09j69k4K08M6K23k26o6P0n5J98o9l0J09
2334B20j24k97L65j27J11N0l63J82k5j64l6k07J5K19J50K28k26K65l66O0j12m3
2356b25K39Q8o5J25r1P3j04Pqm1Q8J67k22%l4j0q5J4J7p4J90k22J79j14J82k00
2382a26R1K02m22L23k73J55J33m77J67M18M9k23k27K70J85k75J43J38j80j15Q3
2403C9k9j21rJ00J19NLj36q8J79O8k85K80n5q6J1r5k6q6J97J64o5J17j08m54L38
2429b3K53L4m59L22j39j01J79j85J03r7L93l19K7q0k06J86P3j23K47M2j86R7j73
$$ y = [-34, 152, 61, -254, 306, 222, 215, 133, -39, 8, 160, -236, 145, -141, 69, -210, -67, -382, -220, -256, -16, 120, -332, -96, -199, -233, -53, 142, -135, -91, -56, 111, 30, 164, -10, -241, -141, 287, -86, 298, 99, 109, -73, -89, 178, -56, -43, -116, 144, -253, -192, -41, -46, -111, -301, 175, -304, 5, -164, -188, 20, 66, 289, 63, -3, 67, 12, 210, 141, 111, 220, 96, -201, 164, 37, 148, 198, -165, 17, -8, -172, -208, -415, -400, -181, -31, 197, -29, 236, -130, -70, -182, -225, 14, 102, 37, 162, 71, 144, 40, 47, 39, -2, 86, 253, 31, 31, -3, -13, -98, -84, -67, -141, 49, -173, 6, -108, 74, -126, -35, 167, -255, 68, -205, -50, 83, -394, -227, 191, 240, 17, -210, 60, 245, -30, 113, 251, 71, -44, 39, 10, -111, -120, -20, 99, 104, 107, -29, -117, 62, 130, -155, 125, 70, -16, -5, -100, -126, -212, -15, 149, 84, 201, 93, -361, -23, 230, 264, -195, 127, -12, -113, 66, -119, -16, -113, 280, -39, -12, -92, -298, -112, -39, -162, 85, 127, -59, 38, -135]
2452a35K88l18J09R9k5O7j93L19k00K14j67J96l04J02j73J4J91j16O1J63j46M7
2474I3k60m1J74l6J23K17l73j1J82j72P5J50j70RJ06O1k71L84n1j52k36K13k28
2497b14J36J56J3l45L30M7k46J72K24l40P2p9k26J93K65k6k67j47N06k21k31J69
2519e9n5L63o0k52K70P1o5j73j56M07j56j96K72j46k63j4L26k76l6M03j24p0J29
2542A40k22m68M91K6k8j44M10j81j21J92q7J4mJ88j93J34M4l82K54J44j26l5j22
2565g6J93j91P2J46q6k82L86l49K13qk42J3N3J88k25N60k46j41q6K82j75j63L66
2588B02r4n5K5J94k21l6m4k24K66M2j44k52M00J48m39M03j20j42p1K22o5l31J74
2611a62K53k97K47L8l79M14J10k0j79j2j4K39j69J9l36M02K31l95j86K44K4l05
$$ y = [-135, 153, -165, -56, 43, 18, 85, -108, 211, 11, 225, 58, 254, -50, 52, -121, -107, 84, -32, 29, 192, 46, 93, -167, -208, -34, -70, 53, 270, -103, -114, 68, -104, -29, 121, -49, -40, 66, 127, -144, 240, 189, 37, -199, 14, -214, -78, 78, 91, -254, 76, 123, -123, 49, 273, -67, 5, -74, -300, -107, 158, 132, -135, -282, 224, 3, -228, -59, -114, 249, 189, -63, 207, 278, 213, 40, -116, 291, 135, -61, 211, 65, -198, -212, 114, -162, -198, 205, 81, 11, 140, -82, -550, -59, -33, -61, -205, 205, 24, -97, 95, 8, 22, 18, 206, 13, 147, 191, -191, 63, 207, 81, 46, -76, 117, -74, -2, 144, 58, -224, 162, -187, 26, 18, -224, -211, -158, 30, -195, 365, 119, -22, -108, 174, -1, -164, 202, 108, 53, 78, 272, 51, 15, -29, -253, 13, 55, -89, -341, 59, 207, -232, 171, 51, -91, -162, 60, -5, -336, -162, 91, -206, 41, 79, -300, 114, 224, 204, 25, 13, -1, 238, 69, 88, -248, 154, 385, -10, -196, 48, 72, -233]
2633b33L16M9n74L17L09k04k69K37Mk08M4J84k07M34j45m6M9L0k4k06K65j56J92
2656A58j21L1j34L0K8N4j20O7j0j58RK38j98Q0r3N3J96n4J23l43L91k43j11j77
2680c04L99j78N8J34o9L3J53p2j41k06K92j44O9j11K43k79J82m9k2R9j23K43l79
2703a72J37j65J93L5j30O6Q8j64j08L97l5l3m5M7qj62J09M1k5j45k6K05j30kJ24
2728I2k27J37l9k2l0K96l11j07J27J29k67K80J05l44R2l7kQ8R1k70J29P4k29O6
2752a79K03K86l02o8L70l66k7J1j30J38O1l3k62L12q7M02l06l01J72M3J42K7J5
2775A21j63K33k26L02l03ml7K9K8J09J18j52n32L49J15J67j63j21K00k59L8L7
2797a14K40J76n99L24p6k86J49Q3j89LK26o1K42P5k86n2K42M1j2r5j83L2J92j26
$$ y = [-233, 83, 132, -442, -125, 184, -20, -289, -52, -48, -256, -212, -28, -235, 199, 54, 8, 57, 87, 63, -143, 122, -34, 158, 37, 68, -66, -36, -8, 46, -74, -7, -17, -175, -166, 72, -126, -46, -139, -86, 110, 56, 179, -164, 227, -16, -127, -304, 95, -83, -25, 109, 40, 73, 226, 154, 13, -193, 99, -45, 24, -87, 156, -123, 59, 10, -12, 87, -36, 207, -172, -35, -200, -7, 28, -102, -36, 52, -112, -220, 177, 142, 109, 64, 111, 103, -59, 50, 91, 66, -79, -105, 100, -30, -32, 92, -135, 2, -37, -59, -89, 207, -104, -211, -84, 45, -222, 58, 163, -181, -89, -126, -128, -40, 51, -219, -90, -16, -245, -179, 24, 310, 8, -60, 310, -56, -83, -72, -202, -64, -3, -36, -298, 14, -73, 329, 23, -278, -106, -63, 79, 106, 121, -42, 191, -35, 267, -36, -40, -77, -48, -20, 89, 207, 55, -477, -128, -13, 154, -9, -130, 70, -189, -151, -114, 126, 302, -297, 27, -49, -335, -186, -103, -292, -289, -63, -124, 118, 193, -93, -145, 97, 138, 126, 31, -152, -120, 72, -54]
2821e4J40q5K2L38l71Q5p9M2M8N3j33J38j41j03l16M15J24j4r4J47Lj47K15K6
2845B59r9j31J98k71l0p5L06j35mQ4k04J3J07Np4k20K62j54J11O2l5n7%j06K28
2870D0j21K4K55k13k10J18N9m7J13K9L0j18K5J67l66K94o0J1J5oj32k27M01k94
2894b13P5K46L9j76j00r2m2K1O60l58k5J94k70K2r6J68P6J19j49j01O8j79J31
2917A8j12K76j18P7m6M2k18J30l1q1N2j68K38o0J0k77J76M8K80j24j31O6j45J95
2941I7j83M9J57n4n6q2j6J19J62j22j12nK48l50K61j64q0K68J9k1l02J58j20L04
2965A75k37r4J43k44M47j25o6J59k43J62M5Rk15J81L7l7j34mj22K07M7l7r4N1
2989A1Lk14P3m9K83k8p1J43k64j93L97KR0l00J34K5o9J74R8p9j47K97j66J19k81
$$ y = [-54, 86, 1, 23, 361, -10, 75, -4, 38, 86, 139, 6, 144, 3, -100, -416, -1, 123, 109, 15, 162, 165, 18, 233, 259, 160, 29, 227, -44, -74, -149, 157, 22, 18, 102, -102, -89, 18, 23, -51, -271, -9, -163, -52, 10, -25, -82, -82, -188, 40, -81, -57, 198, -15, -225, -107, -48, -95, 18, 47, 77, -41, -16, 151, -215, 79, 19, 30, 45, 39, -93, -320, 81, -213, -138, 108, 147, -29, -129, -221, -263, -242, 418, 60, 35, 229, -41, -19, -115, 53, 129, 248, 99, -2, 66, -113, 18, -94, 182, 64, 141, 95, 137, -81, 49, 18, -63, -11, -179, 59, -1, 9, -268, -92, -44, 236, 112, -19, 47, -98, 97, -86, -37, 120, 66, 10, -72, -88, 31, 193, 71, -41, -46, 202, -148, 113, -51, -131, 137, 156, 135, -167, -9, -129, 175, -62, -156, -13, -257, 190, 65, -1, 158, -85, 77, 122, 131, -84, 97, 134, 97, -37, -41, -163, 44, 91, 54, -40, 11, 14, -200, -127, -176, 107, 79, 8, 151, -113, -306, 91, 93, 183, -117, 17, 42, -27, 147, 245, 166, 19, 316, 150, 269, -12]
3014a2M8l27N45O0j45k16J53k18K28k40R4j22o6K82o7j55J92Nr1K59l1P4j71j90
3038a11J42p7k4L64q7k0l59R0M8N8o3L16l70k13J88K91j27l77K58R1r8L03k66
3061d3k2J38m4k40L75j89J63r5o1N1k5k19K65k14j46N29k92J76L9j93M1j48J16
3084c8J52ml03qK46l5ro8k1k7J58O3J4l24J56O1j89K86l0j02J53q3J51k4n7m53
3110c35L33l1K50k35o1J49r6j99L51p5j73K13q9q6M8K78k58n7J79j06n3n9M79
3133C67o73K79K88j16j34j38P8Q1j12N2L2j59M18k00J60k6k22R7m7j19P0J13r4
3156eN1q1j98L68q9j20K28j30L4J63j18l6P3j85M9J30K7k05K64l99L12j97j13
3179a77J91j1J10k43M6R0N7M1l47L07j45nlJ32j78L82l77M1K95j29J65P9J5l11
$$ y = [-12, 36, -291, 254, 314, 169, -47, 106, -112, 116, -124, -30, -152, -218, 64, -3, -158, 34, 39, -52, 207, 176, 250, 79, -111, 31, -46, -70, 294, 207, 187, -172, -82, -34, 24, -39, 277, -93, -306, -118, 173, 46, -331, -73, 18, -80, 223, -43, -65, 73, 29, -211, 164, -25, 138, 43, -18, 33, 8, -211, 54, -160, -306, 223, -69, 107, 146, -47, -6, -154, -38, 114, 110, -193, -201, 45, 10, 1, -67, -88, -115, 43, 106, 120, -204, -48, 13, -176, 110, 80, -22, 131, 48, 199, 175, 118, -335, -2, -33, 217, -18, -79, 70, -26, -225, 126, 51, -122, 91, 2, -84, -36, 242, -16, -73, 106, 0, -53, -112, 367, -306, -27, 261, 145, 11, -127, -49, 32, -80, -28, 4, -155, 263, 63, 223, 197, -25, 72, 25, -94, -24, 89, -5, 46, -35, -233, 135, 46, -74, 154, 24, 58, 221, 103, 67, 140, -45, 4, 134, 161, -44, 220, -179, 133, -64, -177, 14, 3, 113, -130, -84, 6, 63, 104, -243, 64, -81, -86, -89, 43, -135, 247, -130, -89, 206, 77, 242, 321, 336, 25]
3203B5J06j15Rj10K28k51m7R8O6J15l28J30K49l42n1N1K14k13J07j63M4J2j25
3226b91J99L16k07J37J10l40j03K31O5P8j60J51j61j32j21M21m52K11K83k96K66
3247B05k77J69j98J15L3k43M5J3k3L22j10j01l6j13M2J69M9o8J32j99J11J18m6
3270A09N5j74k34L44j5k26J71j44J69J8k34o8M07j43k23Q7j00J95r2j59J22K31
3292I6q8K04k04J54j55m8r5K41k70K44j00M04m49l13N43j21J64l6j32L7K38j17
3314A97j91r0P6L8j45M9J56j19O7Q7m14J55Q8J77P7m3j44M5N7n1j27J01R1K2j01
3339E8m33N16j78M6J06o8p6K0K9L8j21K9O7j54K63j54K2K30k18k2J28J36l38j07
3363a81K26k60L29n8j89K89j38J60l81K06R7k96K87k9p4j12l30M17J08j78J85
$$ y = [25, 131, 16, 25, -85, 143, -108, -155, -57, 9, 124, -204, -74, 175, -167, -218, -167, 47, -166, -59, -222, -178, -166, -291, -92, 224, 17, 154, 264, -76, -179, 52, 117, 195, 35, 186, 25, -107, -228, 193, -259, -48, 235, -61, 205, -72, 97, -101, 14, 47, -196, -151, -138, -161, 161, 51, -50, -86, -199, -157, 12, 61, -7, 125, -74, 37, 155, 109, 164, -10, -244, 100, 85, -141, 30, -114, 55, 73, -161, -229, 178, 35, -188, -101, -201, -6, -98, -257, -135, 96, 8, 212, 8, 162, 7, -41, -136, 105, -165, 79, -21, 383, -66, -379, 164, 43, 207, 171, 39, 76, 314, 197, 6, -84, -8, 30, -115, -66, 90, -29, 38, 125, -289, -134, -46, 131, 208, 165, 21, 66, 123, 72, -55, 46, 137, 159, 58, -375, 141, -37, 9, 115, 47, -29, -9, 20, 58, -63, -34, 33, -121, 142, -12, 10, 240, 22, 0, 128, 264, -74, -181, 45, -215, 114, 56, -133, 156, 18, 178, -203, 3, 100, -196, 91, 62, -12, -124, -454, -37, 71, -107, 78]
3384G8N9k06p8P5j8m8J80j50n5K79j86M33n27L45q7o4J18J4j8k57P8K11k27J72
3408A21j91k04J18P8l5J35n1Q2J07k64L91l21J63k13J16q7O0J03J41k11l9J67
3430A66j21j12K21k01J06l4j04K41k53k8J14Q7j64J21L13l65Q4O2j12r2lk3J79
3453H2k36K17j10o3PK01p8M2m8L1J19j65Q9M0j05%j3n6K26p8k44K9K0m4J70j29
3479i6P3O9j89q6L03j46Q7O5p8j5k06K21M8l73k8M05j00OR0k78K12r1K12O4j72
3504cN8k3p9r3l0J19J83o2j6j77L78k30q6J00q4m1L78j59j50r1J33j81J6R4R8
3529E2n3J54j22nJ65l5j36k7j6J38j07P4n5J1p7N7q8m5K39J54l70P0P0j05j2j2
3555h1L4R6J07M1k13O6o4j2J43r0J02m8o3l3pJ2N2J08m53J15j03J54L73k21J04
$$ y = [78, 137, -69, -147, -72, -90, -138, 42, -108, -163, 116, -70, 363, -164, 181, 94, 30, 148, 162, 144, -113, -35, 176, -51, 121, -70, -274, -156, -78, -113, 22, -29, 53, 160, -104, 287, -34, 129, -84, 32, -55, 5, 108, 249, 38, -1, 166, 45, -67, 154, -47, 59, 25, -79, 162, -91, -119, -5, 82, -82, 39, 352, -13, 71, 133, 21, -71, -74, -97, 82, -154, 63, -47, -110, -103, 98, 20, 62, 14, 45, 164, -1, 88, 128, 23, 23, 10, -46, 180, 102, -142, -113, -93, -137, 33, -96, -23, 46, -143, -229, 74, -72, 15, 80, 2, -13, -219, 2, 50, -323, -351, 54, -46, -40, 50, -228, -16, -107, 105, 169, -3, 55, 32, -47, -140, -170, -51, 132, 70, 54, -123, 255, 25, -61, 39, -45, -86, 292, 133, -17, -108, 25, -156, -140, -46, 52, -1, 153, 31, 26, 191, 156, 20, -7, -23, 115, 8, 82, 27, 38, -39, 18, -70, -115, 124, 278, -92, -22, 48, -57, -69, -81, -47, 49, 156, 197, -16, 50, -14, -26, 117, 27, 129, 81, 18, -15, -22, -10, 42, 150, -303, -188, -291, -137, 236, 15, 119]
3580A19RL9k55J65k84K98m4n9j3J80j32j04K6j06L63l35K08l30Q0K63j51J30O7
3603A34l00K31o5j42K84j97o9J32j81L52j03k59lk0K41p1J55K6k83M00m09J60
3625A3L16l94Q9K68k6k37n6N0K8r6J08o7j11J43j57m4O8J23j32J02m0K0N3l4m5
3650e8J52j46L5j6p0J15p3J93l41K7J26p4K78p9J16m57J67N9K10k34O9J62mk75
3674a18K15jj95N6j35M09k98M9L65l77k05L61j63J75n7j57J85n7nj83R1J67j8
3697A04q5j45J37r5q2P9R2Q5r6M7j75J59l8M8k41K16j20K55J8q8Q1j51m0j60K18
3722B3p4K65k47m5J48P2j31J52j78K4Q3k91K26J80l84L10j2oj03j45J48k2p3P
3746g3L2K50j73Q3j23P7k22J11J88l45K65j68K53j53P8J2N2P3l00L5k6J54j26
$$ y = [119, 128, 167, -88, 77, -207, 91, 47, -12, -25, 155, 23, -81, -55, -161, 202, -133, 75, -255, -175, 88, -63, 67, 134, -166, 65, 0, -142, 142, -55, -124, 8, -173, 179, 76, -183, -186, -206, 35, -36, 119, 145, -138, 262, -147, 13, 329, -65, 24, 292, 266, 29, -27, 23, 51, -45, 63, -4, -115, 28, -129, -173, -105, 18, -114, -12, -52, -32, 21, -13, -58, 94, -52, -17, -33, -103, 12, -61, 132, -209, -182, -56, -130, 148, 69, 185, -272, -105, -46, 164, -70, -1, 161, 157, -118, 97, 96, -99, -43, -178, 231, -67, -18, 347, -30, -235, 126, -37, 138, 81, -76, 109, 52, 47, -136, -45, 122, 104, 19, -126, 11, -84, -166, -87, 5, 90, -6, 41, -134, 25, -13, 35, -206, 10, -110, 145, 163, 75, 156, 5, -35, -195, 23, -51, 214, -33, -78, 70, 142, 11, 163, -15, 9, 92, -199, 27, 207, -177, 133, 121, 115, 12, -133, 15, -7, -80, -73, -41, 209, 36, 119, -4, 73, -149, -38, 150, -195, 70, -98, 155, 2, 80, 92, 144, 217, -83, -48, -74, 80, -46]
3769d6K24l62J95J01j22p0J76l9k73J76N7M2k03p0L54j55j38R0L50m42J77l5r8
3792a11o9L59k17K26Qj69J16j46O5P4l43J77Pjn5Nl4J39J48l90M3M0O3j3P1O8
3818F1p0J77j15K53l89K90j70m67L71L5K1j37M4M9P6j0J88kp2k43P5OK3K2J3R0
3844A19k00Jm2K09m38N88k7J2P8p0j95j46J00M2J13m67J68M14l76K21j70R7m3
3867a2K2j29P2P1j93K38r1Q0k0r5J23J13l31RL6K61j53j69M6J91j19j47P2J96
3891G1N2j01L0j64L1L39j40k60L77l31J79q7N2l86L43J92m88j6M07j72J07M4k40
3914a61J83j77J1J51k7qJ88k83J01O5n6J55j15l13L58k4m2M0j16J64j30l66L97
3937el2j34M0mm4K83l8l3L3j09j09K41j28K9M4M2j66P4Qj04J43m7J15k60J28n0
$$ y = [-46, 178, -184, 11, 112, -10, -80, 96, 57, -216, -40, 17, 59, -144, -214, 140, -15, -153, -63, 287, -155, 22, -13, -111, -180, 179, -38, 188, 196, 27, 143, -3, 62, 136, -207, -30, -23, -24, -79, -74, -108, 31, 179, -211, -168, -128, -65, -78, -7, 61, -9, 168, 53, 306, -83, 207, 37, -430, -59, -24, -3, -140, -96, -47, 29, 19, 207, 205, 133, -110, -35, -29, -6, 16, 29, 119, -81, -80, -122, 87, -351, 237, 210, 222, 300, 230, 35, -111, -11, 31, 144, -323, -155, 259, -117, 104, -66, 31, -12, 10, -119, -47, 24, -169, 69, -22, 58, 38, -57, 66, 179, -152, -143, -107, 154, 1, -168, -122, 69, -50, -197, -125, 71, 123, 22, 52, -112, -81, 258, 118, -142, 235, -96, 83, -4, 48, -338, 5, 197, -291, -307, 100, -72, 35, 79, -161, 22, -155, -144, 7, -20, -28, 160, -123, -22, 43, -13, 142, 27, -286, 72, 48, 6, 46, -70, 94, -36, -402, -5, -37, -171, -131, -135, -179, 104, 66, 33, 66, -43, -152, 89, -39, -10, 34, 76, -90, -16, -8, -112, 31, -16, 99, -161, -33, -83]
3963h3J14j55O9K17j70j25K56j49K47j73o8J92j25J58l08M6J09p2J33P6k51L11
3985B49m23K07K81l50J11j88J52oR0m0r6J61j93j6l1J07q9j55Q4j83M48j12O7
4008G5p1m3k4N8K4qj50K73j51k41J88K08N4j78J45k28K70j57k35J86J80j32M9
4031I2j42j23K79m2k14J59j05k48K26J18P2j42K13Rl08K89m6J25l33J7n1L01l05
4054a59J52J52K5k93J35p3J83j32K0J11j67k2K9q7O5R1J60k32J25M8j58r1J52
4077C4j76R0l3K8J26J27l6j25K42r0p8k96K56j70M5m9j2n2K35k28K11j56J21o8
4101e4k93L61j6J11k94J63m2R8j21K4lK8rJ16j22l23M68j70Q9J01o2K2q2Q4r9
4126b5O5k4o3P0M9J4q2q2R1K7m6K09l52K32J8j71r1K7J57L28j62k66j92K79K9
$$ y = [-83, 31, -124, -55, 162, -8, -133, 123, -26, 221, 48, -20, 172, 47, 205, -103, -57, 52, -20, 113, 189, -62, 249, -174, 33, 314, -36, 75, -113, 39, 33, 123, 83, -13, 148, -45, -61, -92, 15, -74, -229, -145, -328, 120, 8, 75, 4, -39, -63, -5, 19, 11, -139, 134, -17, -258, -70, 138, 192, 14, 159, -69, 201, 44, -191, -5, 175, 43, 92, -50, -173, 106, 64, -150, 9, -96, -344, -118, 0, 72, -70, 143, 152, -156, 133, 87, 212, -121, -104, -155, 146, -159, -7, 145, 170, -123, 12, -61, 122, -10, 10, 121, -46, -68, -39, -126, -61, 30, 190, -42, 83, 131, -27, -118, 34, -142, -52, -85, -57, 69, 196, 160, 35, 277, 187, 109, -187, 69, -101, -56, -105, -117, -169, 66, -162, 49, -107, 14, -54, -347, 14, -2, 109, -185, -22, -64, 34, -87, -63, -66, -38, -47, 69, -53, -376, 92, -78, 11, 112, 50, 72, -10, 74, -25, 40, 16, -47, 23, 72, 86, 4, -78, 13, 40, -6, 203, -149, 83, 101, -70, -161, -134, 23, 351, 189, -77, -269, 10, 39]
4151C9n1j01J02N1j67J10Q4k18J02j02n6K16l3j50J19J5J44k53Rq9J31J26L5j50
4175h7J07o2j59M10j01k32J82j43J04Qj55K94j19J13l12K73j56nML46k76j43j63
4198b72L00j64J37J09q9j86J75Q1n2L72n32K8J72j60P1o8p9k5L32j59q2p1K36
4221G4k69K58Q7l52J55O3K52o0k14P1k23J29r4K68j82m7K18j31P4j31J76j06r
4244GJ6J97k03l26N04O1k10j6l76J42K56J05j29j70O1QJ93P4j30l6k3J15j60N4
4268A4J41o5n2o2J47j43J48j55j3m9j42M29m32Q0j6K73k82L25j95K52o5j34k11
4291b07J25K76j64n0O3P2l37K32k50K4J88M4J05k50K84J69j56j68R0j13ql8L01
4314B32k11n7J9J78r5M2n3p3r2K58k62pJ0k37K03j52p4L38j0j55J88QRn9K7O3
$$ y = [39, -12, -113, -11, 40, -127, -17, 67, -151, -49, -151, -207, 9, -24, -174, -55, -40, 104, -149, -140, -229, -98, 28, 63, -87, 20, -42, -201, 209, 108, -124, 58, -85, 19, 27, -128, 166, 47, 160, -152, 121, -35, -40, -36, 310, 34, -109, -272, 28, -136, 1, 110, 21, -165, 10, 91, 39, 411, -121, -93, 79, -81, -10, -78, -157, -182, 150, -9, -91, -162, 74, -195, 63, 150, -202, -47, 16, 268, 208, -6, 65, -158, -29, -123, 145, -37, -84, 134, 3, 77, -54, 122, 16, 7, 23, 220, 17, -309, 195, 256, 46, 30, -346, -204, 52, 157, 28, -142, -81, -73, 120, 194, 64, 28, 5, 120, -40, 14, 155, 90, 38, -24, 123, -20, 128, -27, -40, -89, -231, 198, -234, -154, -170, 103, -179, 146, -49, 203, 138, 4, -207, -82, 194, 30, -20, 43, 115, -222, 10, -240, -216, -28, 16, 121, -129, 155, 324, 168, 0, 90, -23, -31, -69, 232, 21, -36, -17, 161, 66, 108, 55, -18, -110, 148, -114, -121, -111, -348, -145, -297, -371, -33, -43, -198, -10, -2, 7, -52, -25, 38]
4340C8N1n0M0k89K38Q3K6Pj10l5m6O6J83k6m4P9N8l79o5M07j80j44K17J4Q7j28
4366I8L7n0O6l99K79k42K03R1k55J56j75Q3j51K37k20M03l35J59L14j88j41j24
4388a54K68Mj70J2K45l54K31l35qJ98K6J10j91J11J16J17m29N60n09r3K13L24
4410B92j29l42J71Km4K65n9j01j60OM56m45P4l4J14r8n4K42L3R3j63l21K02L5
4434C5J04n7j3N4L9m0l0N5k93K10o9k02R9K45Q2j00k17Q3jN5j34p6L01N1j26L7
4460I2M4k5j59J57j11k60K28J5l1K3N6o9Q6L2l1J06k11q1K52K34k70k8p1r7J32
4485A3p5J94l40M32R1l85O7M0l9k55J99J58j76N4J04k27K74l10K32j5M3l8L3j38
4509f4J3R6L5m43M30N6k59J69l11K57n0J18j84p4O5J32j15R2K3k33J27K25k71
$$ y = [38, 89, 39, 79, -210, 28, 111, 137, 144, 34, -1, -47, 19, 202, 176, 132, 211, 269, -110, -175, 232, 52, -92, 125, 139, 226, 98, 135, 85, 151, -248, 31, -211, -8, 83, -172, -16, -191, -108, -259, -22, -242, 161, -174, -15, 299, 111, -30, -154, 114, 118, -52, -40, 205, -149, 82, -253, -261, -63, -37, 73, -118, -7, 109, 226, -203, 357, -152, -245, -32, 292, 163, -179, -8, -6, -50, 215, 156, 55, -105, -99, 357, -88, -14, -48, 66, -32, -86, 156, 189, 282, 119, -202, 0, 35, 139, 82, 69, 123, 162, 122, 92, 147, -146, 64, -5, -207, -108, 137, 219, 119, -98, -15, -16, 39, -95, -171, 130, 181, 55, 92, 136, 111, -48, 109, -2, -262, -34, -19, -50, -27, 29, -40, 46, 78, 47, 153, -58, -139, 113, 347, 77, 49, -22, -119, 13, -62, 132, -208, 224, 315, -70, -3, 37, -2, -257, -58, 100, -76, -22, 82, -145, 129, -181, 51, 36, 79, 41, 74, -64, -51, 45, 80, -363, 67, 123, -136, 33, -278, -21, -71, 47, -137, -211, -146, -14, -129, -37, -14, -247, -120, 105, -166]
4532a66J44j56K20O9k9j95J27j30J01O9j10J46K27m70J96k71K63J09o7j06P4J05
4554A50l11K28m1j3J4M8k08J36l6m5K69l20J01J05R1o7j4k41K55K5j14J32J8J5
4578A77j51O2J1k57L18k23J10J75k09n1J29j20J42k08j23N97m45J67r7J00p6k19
4600a91J62K0J82j54q6J10k26J19j06K21m0j97J24k3M38j97l07k8K87k26K7k61
4622c52N21l56L4J19L7j26J04M9n6J32j74K16p0J38k33K2J7J4J06K52k39j04j36
4645h5J65M2m3PM4j22N9jj19M2m1J26l78M05k4n9j26L46l40j3J02k07K65K07j41
4670A11j44M6j68K17k52R5O9%k01J28K09k01J13J7j65L1N8R9K24k29k6k31K31
4693C1j78J53J81k39K31j15k21J31QM4m7o3K63j86P3p5O3j73K58k00j40K02J14
$$ y = [-166, -22, -178, 42, 111, 82, -113, 14, -116, -15, 54, -56, 90, 317, -153, 43, -228, 35, 144, 77, -29, 45, 150, -161, 67, 26, 13, 27, 75, -133, 3, -33, -78, 191, -129, -28, 77, 168, 101, 87, -154, 101, 126, 12, 144, 162, 177, 26, 88, 99, -158, 160, -63, 47, 222, 13, -38, 91, -29, 113, -95, -218, 379, -66, 101, 4, 104, 28, -191, -29, -9, 173, 19, -67, 43, -183, -64, -170, 51, 11, -186, -62, -85, 353, 156, -151, -179, 108, -118, -91, -352, 169, -187, -153, -34, 3, -123, -19, 30, -26, 106, -68, 148, 78, 216, -17, 5, 22, 36, 142, 394, 155, 51, -85, 80, 122, 79, 86, 130, 8, 67, 66, -53, -11, -52, 74, -304, 101, 77, 18, -108, 238, -102, -115, -13, -220, 45, 252, 111, -33, 13, -155, 62, -190, -95, -26, -26, -227, -99, 110, -91, 22, 39, -126, -95, -37, 62, 286, 57, 31, -200, 31, -147, 6, 187, -52, 179, 64, -157, -26, -18, 26, -21, -84, 179, -7, 66, -9, 54, -119, 139, -61, -201, 1, 115]
4716A15n6j17L9o2j72M31Kk0l91J35J2k1L48l84M4RK6j2K44k22o6j57R6K91q5
4741B7n1J8m0K75m43K55o7O1j95J53P6l0m2J53k11QJ84m1qj75L63l38M4J29k02
4766i7J76k4j96K14o1J60j52j18K34k24J69q9L3o9j7J1n9K92j60P0q0j15P7K89
4790B64k88j44M72l10j92L05p5j96l0M20j86j16L9J09p3K51j82m7N1o6k0j91J54
4813e1o1J22j06J58J22m19K08r4J05Q7j59K24j22k1n8N5j13J25J37J35j62K13
4835C25l22J2k4J93Ql24K05K2k53o6J19M01k88J25k27J07l47M07L2k00rj57M11
4858A50j6k33J85l4l9p7K08j44J72k75K60j92j54M10j3m49J93K60k05N7K26k53
4880C7Nj05qJ58j70J94J7k59K1J12k30M32j17P3j60j1o2J90j65m9L3J13r9o8K56
$$ y = [115, 59, -58, -19, -81, -253, 178, 180, 160, -231, -96, -84, -105, 243, -141, -97, -88, -62, -74, 170, -52, -118, -275, -179, 112, 27, -24, -6, -46, 229, -214, 41, -26, 35, -160, -7, 69, 39, -3, 150, -61, -53, 131, 90, 82, -93, 270, -68, -24, 105, -97, 79, 55, -141, 73, 12, 172, 20, -98, 136, -88, 81, -8, 25, -44, -61, -50, -109, 183, 23, 93, 13, -102, -25, 264, -24, -168, 304, -6, -198, 107, 32, -164, -194, 226, 40, -76, -37, 72, -1, 250, 68, 21, 72, 6, -14, -205, -51, -112, 10, -96, 62, 184, -235, -27, -121, -16, 71, -88, 136, 14, -7, -65, -10, -123, 2, 139, 274, 112, 325, 3, 15, -9, 184, 192, -132, 73, 95, -158, -224, -105, 296, 8, 133, -94, 13, -334, 73, 105, -95, -104, -261, 150, 134, -99, 86, 52, 13, -64, 144, 0, 172, -103, 157, -35, -189, 221, 208, -241, -48, 212, 7, 64, 290, 37, 42, -63, -71, 87, -83, 111, 128, -131, -110, 2, -228, 204, 87, 160, 0, -11, -73, 117, -48, -97, -64, 49, -50, -118, 138]
4905A38k51N9K17k21l7K59j06j44R0J01j48J06QJ44k61L8M4j4M0j32n1K03k5J73
4929B30k38j4J59l30L78n62L69Q6j29j0q1R8P8k08J25j08l9K12j56J69n5J44J0
4952A28j01P3J0j86K56j99j42L61j14J42k79J95j78P2n9k8k7l0J6J13p3J33j50
4975f7o4J61k58L56k17j48R7P3J15J95m27Q3K39R0L9k14Q5Pj50j50L09k96J06
4998c6L0K8j24K28j16j9r6j21J79j59L56k32j53N03k26M9k27L57k03J85k58j18
5020a73J34M41k42k29K25l36L00l41K74k9l5m6j64J99j55L13k91Q0j3J03k14N2
5042a47j5j09M6L41nk06O1K03r3m8J61m9Kl26J81MK1j21K01r5O1k00q1L4o3J12
5068a30NJ51J61k64j6J93k07P0J1L4j28N9K07p6k47K05K6R4l74K33N3j21m0J77
$$ y = [138, -113, -54, 163, -58, -95, 164, 58, -86, 4, 105, -43, 63, 71, 215, -46, -8, 36, 22, 62, -70, -121, 82, 57, 230, -8, -22, 137, -193, 185, -377, -8, 78, -51, -61, -142, -44, 34, -174, -49, -157, -196, 16, -140, 29, -26, 118, 128, 27, 100, 110, -76, 180, -19, -161, 200, 86, 228, -51, 144, -34, 38, -21, -49, -76, -106, -90, 23, -50, 83, -67, -131, 30, -228, 128, -89, -237, -140, -67, 48, 243, -184, -101, 138, 228, 267, 53, 138, 145, -5, -155, 154, -142, -36, -6, 22, -102, 126, 10, -9, -105, -226, -47, -206, 150, -82, -235, 268, 42, 91, -136, 221, 18, 203, -55, -173, -39, 402, 160, -69, 156, -180, 120, -221, 53, 24, -11, -57, -221, -22, -177, 136, -155, -75, -88, 15, -199, -147, -162, -271, -225, 116, 111, -95, -34, 169, 76, 28, 189, 140, 142, -184, -3, 1, 22, -99, 102, 7, 68, -132, -213, -179, -242, -130, -125, 26, 187, -77, -93, 100, -107, -37, -26, 8, -120, -61, 146, 70, -177, 28, 54, 148, -226, 7, 60, -61, -101, 76]
5092G6J20k66J42j47K07j01L5n3N4k19PM3J11k84K13R7k07M14j53k90L89l05k3
5115a40J27p7L3K71m9j98k15J36K11k35J97j20L2J2J20p3l9K12m06J68l9j14L20
5138A34o6j42l3R1J24J4j59L6O2l3L8J11j67J8K11m27O4J48K84k42N5J0m1J07
5162A97r5j06j01L3P9l3J96J2o6J28l24O8J54k08L15l10Q6j44j0J19j02L38j15
5185A11q9R6m1L7j88Q6J11k83r7M70l18J30K1J31Q3j63j49k8L33k79j78L81k19
5208d2k0j43K02j8J03j06j37K44pj95K00K33j49l00J83q3J04K10l28J93j31j21
5230a08J10j60K49j8j85J51j18n2o2K31R6KM0k23J42r5K7L6j17j38J15Q8j95K56
5254G2Oj05Q7J4k82P7J09J22j60l2n1mJ03n5J7M0j52M25n28M05L2l74J07J1J09
$$ y = [76, 196, -70, 72, -75, 132, 31, 66, 13, 67, -152, -145, -102, 9, -275, -62, 35, -172, 242, 89, -201, 188, -117, -140, -13, -90, -57, 214, 165, -33, -248, -112, 99, -136, 61, -59, -27, -15, 105, 32, -7, 205, -201, -33, -72, -186, 134, 68, -74, -107, -16, 108, 122, -37, -1, 61, 28, 66, 177, 10, 28, 239, -188, -124, 24, 308, 66, 121, 131, 90, 197, 102, -4, -105, -72, 7, -26, 170, 182, 116, 244, -80, -12, 142, -66, 249, -61, 25, -119, -129, -10, -112, 226, 111, 22, 118, 77, 114, -74, 12, 123, -160, -257, 213, -105, 25, 46, 177, 260, 97, -52, -80, 253, -26, -204, 177, -42, -62, -205, -3, -21, 82, -24, -161, 83, 76, -119, 81, 314, 165, -135, 48, -35, 69, 279, -49, 144, 13, -108, 2, -158, 91, 73, -112, 39, -79, -131, -193, 38, 134, 136, 176, -47, 95, 0, 27, 63, -54, -192, -77, 11, -184, 72, 78, -27, 60, 74, -208, -131, -22, 100, -60, -92, -143, -147, -44, -99, -82, -42, -194, 231, -297, 108, 140, -234, -127, -116, -7]
5279gK20j89J8j47J85j08oN9J28o6k08K27k69K37J46m89K07J91j53j22j93L93
5301E4j75l8K43O9l5k37J9K1K5R5N3j63K59l72K51o3N9m5J76m02M79k13l31K50
5325b1P1J46j31j50%k6K62k45j10M36j53j54K47l39K32j28J15Q9o4K2l29J61J81
5348A12l21K16L7k78K69R8l80K64j4j3L6K47k90n9N3K8j7J1k7l1O0k01J89J00
5372H9J00l05J03R8k41J56J57l68P7R8N5Q9R4m60M43r8M4n6k37O7J13J77o1j64
5396c0J03J8m8N4n0k55L80j67J46j36j60K65l2K19k25j75j4j14j16M76j66l1P1
5419A3m4N2J7j22m3K17j2p5L1k84J09J41kR2k17K00j45k8N8k8Q3J79j45K3J43
5444B13n8l94L66j96J62k19K60l24j3o2J08M15m51J73k47J92J90q9L28k42j15
$$ y = [-7, 213, 24, 42, -105, 80, -28, -34, 25, 153, 87, -121, 106, -163, 74, 220, -269, -62, 129, -24, -146, -339, 54, -121, -159, 84, 153, 118, -119, -100, -79, -54, 41, 94, -69, 190, -182, 69, 6, 65, 20, 196, -206, 273, 60, -271, -21, 50, 196, 65, -85, -85, -111, 151, -94, -204, 232, 79, -75, 172, -167, 65, -63, 52, 141, 77, 99, -230, -69, 112, -209, 7, 44, -234, 35, 133, -247, 17, 3, -10, 26, 273, -17, -76, -23, 5, -12, -1, -28, -59, 1, -200, -11, 89, 189, -116, -13, 85, -156, 0, 157, -211, -134, -36, 19, 108, 202, -258, 185, 87, 131, 75, -162, -95, 18, 195, 134, -30, 73, 91, 43, 97, 47, -208, 172, 5, 151, 15, -145, 120, 88, 307, 82, -93, -107, -221, -337, 139, -27, -58, 13, -31, 21, 38, -84, -127, 90, 78, 3, 34, -250, -141, 0, -2, 90, -127, 73, -72, -100, -42, -70, 13, 192, 47, 70, 213, 155, -239, 127, -69, 93, -126, 134, -190, -203, -265, -157, 258, -193, -20, -267, -75, 115, 26, 354, 112, -3]
5465cL7k35J69J87k32Q6O1J82m5k69K40L7p3j99L92k99q7l60M96k91L68k33j40
5488b11K66j17O5O5l5n6pL0J2j39K25k41J5K90n66K30M1M4k2L50l21j17J35J89
5512A25k66n4K46k16J33K02k4k10p0J84r6K45r6k2k29j4K23r4R9j27o0P9K09k66
5536i9N7k27M7K32j5J71k75M7J6n3J46M0k11K66j36R9j17j36K05j50j04O4K60
5559A27j47M7j76J44r2J79k99J65nP9j07l1J73j7n03M56k6K2j3J14ql5J03m27
5583b77M33k53J5j78N16n75P5J84Q9j54J64j75MN6lK48k78l1K46j14J02j43K91
5606B42j41o2J82l41J77k27K35k86j6J42P7K61m12J57K8O0j27P8Q9l02L04j37
5628a9O9j86J89k8l3M03k80p4K8j23N8q8M4R3l9J75k38r7K39k6M9k5l6rJ2r6k2
$$ y = [-3, 34, -201, -32, 155, -77, 9, 70, 252, 207, -62, 178, 215, 142, -57, 335, 36, -51, -411, 85, -206, 162, -71, -211, 55, -62, 3, 68, 33, -23, -30, 0, 12, -127, 98, -143, -128, 162, -404, -174, -133, -89, -111, 239, -82, -199, -64, 125, -141, -195, 51, -165, -32, 170, 146, -64, -134, 50, -46, 199, 103, 81, -148, -162, 61, -33, 66, -61, -121, -42, 167, -99, -42, -269, -222, 10, -5, 166, -109, -62, -46, -99, 47, 87, -124, 142, 6, 105, -12, -148, 57, -93, -197, -133, 127, -20, 27, -149, -5, -97, 82, -217, -52, -57, 22, -85, -116, 57, 40, -463, -7, -33, -11, -24, 90, 82, 47, 150, -277, 156, -97, -82, -260, 256, -319, -244, -60, 29, -125, 39, -136, -132, -76, -79, 169, -109, -140, 106, -8, 94, -49, 242, 101, 39, 221, -120, 57, -170, 65, -221, -237, -95, -18, 243, -169, -12, 16, 76, -51, 27, 116, -186, 118, -19, 50, -136, 53, 25, -8, 395, 115, 41, 69, -54, 4, -84, -40, 53, 14, 189, -49, -146, 93, 67, 116, 91, 55, 46, 58, -38, -60]
5655f0J24j96J30J3r6L17K4k11k17J23j18M37k90n4J83J12J0l64J28N1p1J33r8
5678A0J49o3N4k42p0M0j14M96k62k62L92k27j20K45K65l15j04K17j71L59m81J06
5700i8k21N73j19l51qL54k93J73%l7o4K15k61L56%m76K60l0m7K51j06j18J36j34
5724d5J04m3J52l23K53l0j98R8L89k68r4jK9j96K34Lj84L8M9j73O0K50k35L73
5748B42m53J89J20q6k4j60J01j30M1J09R6j01l1J4Q6j53P3J53l33N41l77L9n6
5771a00J93j10J30k40J09Q4J17j68k12J19J54j74K66Ok37J37q5P0K7k20J04K5
5793em4q1J24j62K3J75L6l7J80K3j63p6o3L16l22RO2j19o8K06J32J7l95K71K28
5818B67j20J07m3k15j38K09j21J15l09K75J11l0k24J25K57k26pp6lK4j05J68n
$$ y = [-60, 64, -132, -2, 11, -85, 232, 256, 45, -172, -49, -167, 270, -20, -74, 109, 221, 231, -133, -5, 46, -25, 108, 10, 159, 96, 150, -92, -162, -122, -236, 260, -2, -264, 128, -99, -219, 26, 291, -24, -128, 89, -82, 277, -204, -98, -319, 254, 135, -216, -224, 130, -163, 10, 10, -27, -91, 124, -137, 219, 219, -257, 3, -27, -74, 177, 71, -47, 89, -45, 59, 16, 168, -155, 98, 68, -130, -32, 357, 89, -5, -6, 23, -173, 61, 64, -120, -82, -33, -206, -146, 104, -131, 242, -211, -22, 98, 12, -12, -172, -71, -201, -160, -51, 45, -56, -87, -73, 13, -140, -67, 86, -247, 294, -83, -44, -100, 93, -17, 113, -127, -18, 66, 183, 15, -197, -78, 76, -98, 168, 174, -63, 74, -11, 59, 86, -134, -30, -5, -49, -130, -6, -168, -145, 30, 66, 29, 209, 232, 69, -7, -70, 246, -76, -67, -5, -124, -192, 14, 146, 163, -232, 39, 267, 147, 254, 211, -4, -142, 67, -54, 61, -248, 27, 138, 108, -116, 9, 266, 40, 33, -43, -46, -22, -127, 41, 36]
5841C6q0M0L7k61L22k07J57m3J02p8j12K79m50J06M2K12j92L74j68o0q9J12m9
5864C0J39j64O2j01n1K10k44K48j62M8j40J14J57l71mK55k75J31K38j29K2j12
5886i9L39k53j0J20Q5R8l84J55j43J7p6J03N7o8K2j06K05R6j65K06l82L5k43K71
5910a20J62j74J81n6J27k09J62m4P0n0m5%J2q2o6L04j32n7m5J06J93m10K7L29
5934A83l58L29l14K04j07L29k03j24l1PK09J24l0l50K30k9q6j03J94o8n0QJ89
5957A53K13n72m2R3n4J02J10J55j61j17P2O5l42L08j72L07j53l6J3n8r6O4K33
5980H5k26P8j2J38o6l9q9M35l19kKQ8j63P8j02M2p3lK38j09K89l26J21o0K4m3
6006a4N2j71J69o6P2J07Nk92J34q0O6J1R4j95JJ82L9K1q8j63K70j03l95M35j66
$$ y = [36, -44, -4, 33, -228, 94, -113, 44, 1, 103, 25, -87, 192, -258, -152, -110, 102, -90, 284, 116, 56, -33, 79, 30, 169, 5, 67, -34, -85, 125, -119, 129, -33, 15, -125, -11, 146, -225, -229, 26, -249, -118, 120, -9, 13, -99, 240, -13, -23, 97, 182, 280, -104, 51, -92, -75, -151, -48, 9, -59, -37, -143, 62, 158, -7, 199, -183, -148, -391, -120, 42, -132, 49, -7, 120, -89, 73, 29, 99, 49, 4, 4, 16, -66, -132, 172, 40, -17, -62, 44, 237, -173, -146, 183, -175, 154, -160, 44, -63, 266, 63, -61, -92, -85, 124, 248, 218, -132, 98, 69, -17, -120, 74, 6, -44, -36, 153, 366, -206, -248, -155, -209, -107, 3, 158, -3, -120, -48, 17, -325, -17, -189, 118, -35, -71, -58, -116, -212, -148, 85, -141, -63, -75, 63, -3, -42, -131, 304, -15, -17, -15, 73, -90, -12, -114, -72, -145, -148, 90, -19, 270, -56, 65, 5, 29, -14, 38, -133, 36, -30, 42, 149, 154, -138, -4, -84, -18, -7, 87, -108, -107, 75, 114, 135, 47, -116, 154, 51, -344, 91, -75]
6031g5k14K05M5j05K19J2r8j85K25J06k31j94L13j99N81l76K21k25rn0O7%k57
6054b24M0L46k65k6K31Q6l44l1K05J98m33p2K44n7q7J26J50j07j36N5M9m5J27
6077C0K36k46q9L15l02J37q5o8J17q1J00J1j81K04j66K45m56L67j69n6J32n3j1
6100f9l4K31P5m01K22j46P2j54K2K57K2k89J86R4m2j1n8K49k16j3J12Q9j47j5
6124C6J68k60M7j40L94l23J57q2J10j52J50q8J99l96l1L56q8k83K90j47LK79l14
6147a15L02l27J78q9p1J13j65j8J45PJ30m05L58J80m5J04j93j30j11R9K50j61
6169C6q9J47m6K6l06K03M9K22k3P1m31K8J90k97L07K8P7j24k04M6p1J36q5J09
6193al5K2o5N6p0K8N9j66L9j11L14j46J16j71j5j34K78L7j85K82J0o7q2P7kj7
$$ y = [-75, -289, -84, -39, -144, 75, 87, -11, -196, 29, 135, -96, -290, 23, -176, 405, 29, 250, 25, 16, -34, 33, 33, -224, -184, 162, -103, -129, 102, 188, -156, -187, 18, 216, -217, -289, -45, -102, -189, -63, 87, -20, -156, -101, -52, -97, 30, 266, 20, -69, 246, -56, 81, -4, -72, 45, -36, 64, 75, -106, 98, -68, 177, -279, 88, -81, -137, -5, -58, -69, -103, 128, 203, -198, 24, -122, -50, -204, -182, 75, 97, -192, -6, 88, 46, 35, -23, 226, 10, -3, 109, 198, 51, 36, 204, -56, -9, -149, 245, -78, 79, -3, 107, -45, 105, 17, 216, -180, -211, 145, 57, -226, 64, -83, -80, 199, -115, 187, -140, 38, -51, -122, -9, -174, -192, -47, -40, 90, -315, 43, 223, 178, 282, 89, -41, -152, -53, 197, 36, -53, 94, 48, 74, -232, -29, 20, 242, 219, 290, -141, -113, 77, -220, 87, 115, 192, 68, -136, -90, -161, -25, -110, -1, -36, -14, -79, -23, -93, -65, -6, -172, -133, -244, 70, -76, 40, -131, -146, -280, -2, 35, -150, 132, 142, 75, -7, 70, 68, 51]
6219E1l03J37J45R2l14R1P4m8R9k57J54K88k72J41J30m04K38o7J29j93J69K49
6241C29k89L6n7J93j16l25J45J01M3J04j35k24M10j73Kk8p4J82q9l1k09J20J85
6264A00k58K87j27n4j28J32J59r7P1L2m94K28%L26j97J5j32L18o9j14J45J25j76
6287I2k54J9j6K83o4o9kN4k4l9j6J5k19L2J26Lj12L15k77L33k65K4J81p1j6J86
6313B19j61M6k65J96nk43K54K40j61l21R1j22K42J18q2j05L05l43K29n2l01M49
6335B28k85K09k04J74j59p2K11j14J25o0j74L65k84P9K15k35P0j21J22k42o9J25
6357i6J9j71J81K55k52M9j25K56m9l4Pj9nk57M89k26p5J1q8K88l25L2J28j12L84
6382B65j02k18L2n8K35j23J06j55K4J7q0J71q6k09L30k29oJ58K5J57m74M8J65
$$ y = [51, -252, -115, 30, 122, -192, -101, -27, -75, 24, -233, -79, 209, -63, 78, 208, -196, 42, -25, 104, -89, 80, 329, 40, 76, 19, 212, 96, -229, -84, 17, 60, 164, 29, -195, 215, 42, 44, 16, -58, 124, 35, 4, -205, -85, 100, -158, 129, 2, -52, -180, -48, 111, 14, 85, 117, -377, -149, -149, 177, -20, -5, -137, 181, 112, -2, 143, 268, 92, -162, -143, -159, 124, 60, -9, -11, 43, 19, -20, -36, -21, -240, -208, -82, -79, -191, 124, -153, 180, -85, -61, 120, 49, 33, 219, 58, 104, -161, 35, 30, -213, 41, 281, 120, -201, -110, -232, 10, 128, 46, -59, 246, -97, 132, 80, -221, 228, -57, 152, -52, 122, -37, -109, 102, -12, 113, 53, -121, 244, -40, 39, 254, 19, 89, -32, 90, -152, -221, -96, -77, -248, -67, 188, -64, -15, -140, 116, 67, 33, 40, 21, 16, -241, 248, 22, -53, -42, -130, 158, -167, -135, -7, -119, 265, 163, -55, -23, -81, 154, 31, 137, -18, 6, 23, -57, 114, 28, -181, 149, -80, -86, 72, 97, 254, -220, -172, -7]
6405go1Qm3N9J5P4pk15L29o5o6n0o2J76N6l40K16j17K3Q3N5k03P1M3R6l3k44M6
6433a63R4J97j95J65l09K66R4n33M46o9O4n5N6q9p9J17J03j04r1k4M71m12Q6n4
6457a8J50M4k43o3J72K8j32M2J99l5j13j24O8Q0j69K64k04K77j53J32p4j74R3
6480D7p1k4K72j30P9j34j65l9lJ30r2J48K7j03p0Q8J41m6k59K27j06O2k21K83
6504D1k12K34o0r1K15j2N3J0j66j43N6L41l27q7P6nl6K02o8j02j8P9j54N2j6J92
6530E4j49L64j51j74K55j49j60K42p2j5o4L5j41J31J21k4r8J53k80L5K41k26J12
6553D0j90R2K45m1j56op2J08l4K4l7J43k87N9J61j0K26j88j13lM9r3K39o5j20
6578b9P3l22M66k67r3K21N4j05qk45L22j04k18J76k4j16L51j55m8R7n7o8J86p1
$$ y = [-7, -68, -60, -103, -44, -29, 45, 38, -177, 152, 87, 21, -29, -91, 85, 141, -199, 17, -100, -77, 6, 61, -142, -71, -28, 68, 35, -209, -163, -69, 128, -67, 98, -211, 55, 149, -384, 62, -7, 57, 2, 58, -31, -110, 7, 110, 6, -85, -109, 362, -50, 36, -18, 132, 176, -67, -130, 42, 70, -62, -20, 179, 144, 31, -93, -25, 55, -114, 150, -54, 223, 70, 202, 128, -46, 47, -24, -48, 224, 94, 173, 39, -126, -165, -168, -38, -130, 18, 45, -58, -128, -40, 101, 55, -204, 23, -83, -21, -242, 41, -171, 63, 3, -88, 127, 115, 168, 178, 12, -131, -75, 266, -61, -148, -72, -77, -113, 89, 21, -81, -99, -20, -174, -122, -138, 54, -95, 269, 118, -56, 199, 50, -110, 132, 60, 45, -19, 16, -125, 6, 127, 103, 5, 158, -122, -87, 154, -72, 40, -150, -58, 187, 146, -10, -16, -88, 20, -14, 10, -27, 116, -171, -112, 49, 39, 265, 77, -36, -39, 10, -83, 156, 91, -29, 44, -278, 188, -79, -172, 49, 103, -2, -10, -255, 67, -37, -255, -79, -103, -219, 132, -23, -71, 26, -31, -99, 87, 16]
6602A6l12L86l7j30K01K8kk70K11k6L0l76K28R8l6n0O8l04L7M49l83j3J65J38
6626A16j54J55l11M1K11k25J77R0r1P8q6j14N14l79p5j04J29J9L2M6l05K07J10
6649H1o7O0k12K76j49l2K19n40O89k79l35J56o1J87k04J35J31K8k66R2K02j53
6671d2J6P9k12P1K72j35J8nj09J08j92L6p6K48J3j63K71k78J7k4M9J27QO1j72
6696a4R2Q5j04rj77K79j64rm0L5q5L74j36o4P7j90P0j11J02Q7o7J00j9m21M32
6721A23k26L98k37q8j26K60k15L25j33P7k37k17L08o0om8J24L2k01L26j24P1k62
6744a36J26K9j30K35m06K87N4m5l17J10K30j2J6o5K55j76J03j64r2J28K16j65
6766H1l6j82J65k21K70r9m54L84J34J5Jm1M1j99J61J0RR7k62K12l7j73m5K95m34
$$ y = [16, -296, 90, 53, -77, 124, 152, 150, -120, 91, 65, 95, -281, -53, 45, 9, -41, 27, -277, -240, 209, -174, -187, -22, 116, -38, 117, -194, -153, 58, -167, 10, 100, 9, 87, 1, -113, 401, 22, -53, -157, -28, -9, 23, 69, -236, -29, 81, 14, 74, -138, 138, -11, -43, 176, -364, 325, 46, -289, -133, -194, -7, -211, -76, 55, 83, -183, -91, 111, -42, -26, 53, -159, -88, 184, 49, 67, 62, -47, 61, -131, -95, -171, 77, 90, -73, 198, -80, -63, -87, -38, 89, 97, 158, -14, 78, 163, 59, 50, -127, 152, -12, -21, -61, -26, -111, 263, 127, 63, 140, -50, 20, -91, 11, 98, 31, 131, 112, -309, 123, -103, 295, 58, -30, -156, 104, -111, 214, 81, 158, -79, -296, 12, -48, -54, -102, 22, 54, -147, 179, 55, 126, -136, -10, 19, -111, 124, -282, 5, 59, 14, -303, -193, 37, 25, 41, -24, 231, 55, 158, -6, -98, 30, 246, 81, 45, -137, 28, -193, 77, -22, -476, -92, 42, 57, 58, 17, 58, -141, 20, 30, 39, 136, -126, 86, 49, -124, -169, 126, -308]
6791c08M87J14k47o4J54k84l8L33k98R9J68l68M26R4j81l04J59O1p1J57r6J16
6813A09l07K19j22j26J70p8P5J75p0j09K13k44J16Q9O9n0p9n9j16N0J11n0J05
6836I1j10n5K24r4P8k55n8J05L00k48j26M79m12J0j34K20J28N2k86Q1j25J49J51
6859A65j56j26J97l28K99N2k90J64q3J92mO9j81mm9j6J73k65K55k4L7J2k26J85
6883D8n9J74m30R2N6K06l9k24p6L94j6O1M3k75k10J06K32k74J3R6j08N75l25k80
6907b20K78q6K8n3K88l46J62k13K0L68l72K90m34M54k14K1j88J5K59j20K91m18
6929a90R0J59rO8o6q4J35K05k02O2o7K5l33K65n43L69K81k7Ql50K81%o7J05k86
6954a71L03L7j03j26r6J31o5P2J11k26Q2j43J78j37mL36l18O4J88r6R2K2L3k80
$$ y = [-308, 179, 293, 46, -18, 136, -148, -186, 147, -151, -52, 116, -252, 174, 268, 87, -217, -58, 3, -68, 89, -7, 109, -198, 21, -101, -227, -57, -135, -60, 115, 45, -64, 149, -95, 21, 110, 179, 129, 50, -9, -125, -75, 36, -14, 91, -19, -74, 150, 56, 134, -121, -179, -74, 226, -22, -148, 331, -81, -71, -205, 15, 143, 195, -91, -10, -135, 14, 165, 9, -117, 80, -248, 51, 103, -187, -23, -106, 86, 82, 151, -30, -34, -83, -99, 74, -191, 64, 40, 77, 89, -137, 48, -11, 163, -267, -175, -119, 87, 48, -176, -252, 142, 126, 187, 230, -45, -255, -149, 83, -191, -178, -82, -190, 385, 60, -220, 58, -28, 0, -53, 235, -111, 51, -162, -142, 226, -146, 144, -290, 164, -50, -29, -217, -202, 57, -63, 228, -190, -100, 59, 50, 118, 52, -32, 103, 308, 106, 168, 101, 126, -207, 58, -485, -116, 165, 138, 146, -204, 77, 77, 10, 115, -171, 132, 169, 66, -60, -156, -25, -90, -18, 93, -133, -51, -194, -16, -153, -157, 179, -139, -75, 113, 17, 109, 131, 164, -116]
6978a16J70k76K6L07m49K41O6j1j89P3M59m99o9L29j78L8R6K68k54o3O2P3k01
7001i7K25o9J0k20p9L69q1o3J20r6L0J92k65J91J28m75J01K4jJ05Ql0q8j22K76
7026I3L4p4J39j98j5N3k02L0J72l9R2j0k2r4p4k09K43P9R4J42j85o9m19M07j03
7051a35j52J88J72p5j37n1K81k16J73j34K77r9k97J83nQ5k4R5k9l01K98o0j54
7074a17M8j23K51K6j73l7L4J49k45K17j53j53L89n6k1q5J33j18j40J35J03j25
7096f1o2K14j24q4J54K15j50j26N9l34J40M10n21K35j20J09K04m3J09j79J03J63
7118C11p2j35j13j04K1q2J28K28j92l5m4K5j10j26K58J05J9k08J31L3j10J95k94
7141a71K58k13J41l6L3P3j31j19K90l5k02k7J13K00j04M9j71n3j50L96q7k26K58
$$ y = [-116, 54, -222, -196, 111, -338, -97, -31, -42, -231, -158, 301, -198, -267, 62, -116, -78, 18, 286, 32, -31, 31, 104, -97, 128, 59, 69, -151, -230, 139, 58, -5, 115, 19, 49, 241, -24, 167, 295, -180, -79, -55, -56, 49, 57, 27, -61, -183, 93, 127, 53, 192, -6, -21, 32, -170, -140, 32, -7, 85, 75, 53, -41, -115, -324, -81, -2, 92, 234, 49, -20, -439, -32, -135, -287, -99, 73, -2, -139, -190, 91, -125, 48, -86, 191, 92, -205, -22, -27, 58, 34, 129, 100, -201, 97, 37, -117, -69, -192, 59, 85, -88, -125, -91, 58, -187, 30, -123, -276, 113, 57, 36, -49, 84, -34, -174, -39, 64, -61, -123, 91, -33, -117, 37, 252, 102, -24, 35, -299, -159, 251, -270, -35, -155, -46, 158, 115, 224, 45, 148, 311, 239, 104, -9, -113, -92, -174, -46, 182, -10, -45, -89, -64, -174, -300, -42, 63, 82, -126, 5, 38, -72, 123, -171, 87, -126, 15, -21, 12, 85, -46, -165, 125, 90, -112, -139, -26, 174, 70, 119, -52, -105, -255, 141, 54, -172, 86]
7164H6l7Q8N3k48R4j52J54k19J72j45k77M37k7m1o8K60j77K45k12n5J11R3j34
7187Ak78Q3K99N5j87K5j74J95O7k2n5J68n4p6q2M8j32J40l6j4K75k88r0J42J97
7212B07j93k0qr9j1p4k34M97j81K53l9o9j7j96L1P5o1j0M27l66K1J30j12O2n4
7237d1J70O1j58Rj70J53J30j16M48n12J04k63k1M48m38O6LL7m2j0Q8J39k17K88
7261A56k37J59j60O4R4j57o9K39p6Q5j21j34L17l05J05K04j85J4l86K42L52l00
7283i9J85Q1l19L06j71N2j44J59Kk34J2J01k0k09J49K06J1J96l32j45J00qK6k30
7307c25M36p8q7L51m99J47n0L2j28K74m3k08L49j33M4M7K1o3j5j14K24n6k91K52
7331H7j42m4L45j21j15J7Oj90L31j91N5J18j69j95K84k04N9K22k08R1M4Rk9k41
$$ y = [86, 49, 137, 190, -58, 36, -116, 38, -181, -9, -154, -431, 6, -21, -62, -130, 130, -47, 198, -14, -69, 42, 135, 1, -277, -194, 105, 160, -27, -2, -176, 19, 86, 64, 9, 177, 123, 47, -35, 13, -119, 21, -15, -29, 246, -42, -132, 10, 207, 14, -6, -14, -113, -124, -198, -432, 65, -116, 137, 98, 29, 12, -184, -153, -78, -139, -149, 278, -88, -67, 63, -49, 13, -41, 129, 190, 32, 41, -129, 24, 154, 38, 486, -26, 78, -185, -206, 242, -196, -130, -127, -90, -132, -142, -54, 85, -132, 156, -81, 78, -82, -18, 76, -81, -150, 89, 13, 98, -23, -157, 160, -145, -40, 164, -21, -7, -393, -151, 201, -99, 86, 167, -152, 154, -17, 35, -109, 50, 52, -182, -170, -69, -89, -298, -149, 57, 68, 264, -68, -213, -113, -121, -95, -325, 111, 33, -54, 297, -202, -55, -105, -73, -201, 73, 30, -178, 171, 38, 82, 129, 150, 87, 72, -42, 182, 126, -165, 87, -55, -99, 246, 125, 10, 27, 33, -157, 174, -17, 38, 156, -13, -208, 76, -128, -69, 153, -55, 36, 80, 89, 60, -181]
7355a81K22J8l3j06J93j73p4J13n7N1Q7R1q6m9J17R6l49j27J11L73j36J65k47
7378A9k2L7j11L1jL33p3l03n4J05J26k36J32m2N3J93m54J91J86j96J66j20J82
7401A42j63K07J45k86O9j0Q7j59P8r8J44j76j93L44k20P1J82k02k8o1L3O2k3J30
7425G5j01L05l00j08J48q7j6j5L2K17l85L82j01j12J19J45j45j07k8N5n7K67l32
7448a49k8L01k33K03o6j8q5K54j93p9J94K08l05K6nJ05qj18J03j74KK03k19Q4
7472Cl7J84l84j0J68o8PK13k62N9L74k93R9j6m6k3J44n7j43P9J30J5j73l4K0J02
7498E1j58l0o8L59j61r9R5J45k93K76n6J9O7k72Q3Q9J64j68K28q5j44k94J9L19
7522H6j86K15j33j9j49J33J62j46P2j13J38O2k85J45M5P9k9r7p9J96j06K59k23
$$ y = [-181, 41, 59, 26, -80, 113, -60, -134, -21, -78, -27, 60, 151, 65, 16, 133, 229, -120, -247, -136, 237, 101, 266, 19, -3, 34, -77, -46, -47, 286, 213, -90, -144, -39, 87, -149, -17, -59, -6, 187, -267, -76, 110, -86, 80, -40, 142, -21, 186, 331, 45, 114, 104, 191, 32, 110, 12, 156, -20, -213, 131, -89, -18, 164, -38, -66, -127, -94, -32, -55, 75, -26, 279, -21, -129, 19, -68, -84, -99, -67, 150, -235, 147, 46, -66, 53, 198, 53, -54, -82, -27, -84, 183, -149, -177, 124, -109, 94, 28, 10, -75, 179, -14, -93, 101, 309, 4, 30, 25, 130, 122, 4, 107, -67, -65, 138, -81, 3, -34, 150, -234, -244, -76, -144, -137, 76, -186, -127, 247, -46, 53, 37, -9, -32, 112, 55, -88, -9, 121, 136, -37, -71, -51, 51, -107, -137, -205, 154, -7, -106, -11, 134, -159, 117, 61, 80, 147, -125, -42, 47, 211, 43, 271, 186, 42, -252, -233, 86, -100, 115, -18, -37, -186, -53, 109, -37, 35, -78, 60, 122, -163, -18, 27, 106, 77, -20, -99, 97, -9, 250, 27]
7545B7k08J02J79l5n8n5L30l52q3L03j11M2l32K68K01j93L7j31J74L7j29MK59
7568B76m11L60N5n54J33Q9J81j72m2n5J14J88n5Q8m32J1M44j17K8J66k80k56K14
7591b7p3j55J70r6K12j7j62m6r6J94J05O8L8k11J88j93P6j81Q5K66k41J48P9l09
7615a78J73j51J77PJ08k59M3K81m0j9k34L4k6r0N34k95j54P5P1m0j38J74j05J04
7639E2q6K12k09J22k68J07J02q8K8O9K04k22k11M4O0K16j53j05L01j78Q8j24K01
7662A62k8k13l5N1J9j72K15p1J74l33M71%Nl18Q7j63J02j16K03Q5l81K43j34j6
7686a63J97N7O6j33j75j59J50J38n7j21J16R1J79j92P9j40K00l67L95o5j8J83
7708B61n33M20k39j28K60MM1j61J68O2r8J22j20j39M4N5n3J65k09J31l1P7k61
$$ y = [27, -181, -79, 100, 65, 7, -48, 282, -70, -153, 150, 39, 81, -251, 17, 218, 25, 62, -69, 105, 142, 13, 17, 276, -135, 225, 280, -274, -141, -52, 129, -43, -85, -140, -26, 162, 107, 195, -237, -226, 218, 101, 129, 295, 15, -241, -27, -100, -255, -85, -181, 31, 14, -148, -194, -290, -96, 9, 77, 115, -96, 92, -101, -25, -206, -121, 145, -96, 52, 131, -178, -5, -156, 21, 28, 136, -123, -80, 201, 161, 142, -92, -58, -84, -174, 360, 65, -89, -14, 57, 17, -121, 53, -52, 52, -34, 178, -31, 91, -177, -70, 32, -56, -28, 41, 245, 23, -188, -144, -84, 132, -21, -126, 175, -3, 85, -39, 162, 134, -79, -114, -63, -44, -216, -1, -72, 102, -231, 240, 240, 245, -73, 14, -149, -47, -163, 40, 125, -256, -13, -147, -163, 34, 91, 157, 24, -151, -310, -160, -22, -79, -200, -84, 7, 186, -6, 73, -67, 133, -234, 161, 96, 78, 261, -272, 148, -91, -219, 41, 45, 86, -75, 93, 155, 57, 179, 59, -80, -36, 19, -34, 131, -78, 53, 22, 99, -162]
7731a62Q0K2p1K57k27K08J01l58L20k62K38k55J67k16K66rr6j09O1L13m76o0L09
7754D1J26l30J45O3j87P3p8J76J54l34L66k19J5j46L60k58m7k5p2O7j01K20k2
7777a3o6jj20N2M3o8K39j19j78J51K12k07J47j36O6k75M67j31L9k69J25JPQ2j24
7802g6q0N2K57k01J87J6r9k61R5j33L92j75NL55m15j60J13J96Kj68k4J93J7j41
7826e3Q4mj08L18j66k04K32n7j54K65k68L8k07L65L7n9M8Q0N3k75J52j97J15j26
7850i1o2J28K97j44j05p3k23R2K42k13J48K49k66N2L2j26J0J13k33K57k06J32
7872A0N7j72K46l3R8J4j9k84k4l4R3O7J1k28K35j08R2p0J10k39j5K84k07L17l83
7897a82J91J44q8j01k51M80k77Q6j86L91j11j37O2l5O6j91L6N11m84R4q5j51K51
$$ y = [-162, -82, -60, -131, 126, -101, 107, 208, -150, 170, -92, 146, -109, 58, -158, 108, 99, 3, -106, -45, 268, -208, -268, 41, 167, -163, -18, 45, -142, -69, -147, 29, 183, -151, 215, -4, 11, -135, 225, -33, -80, -105, -177, -110, -211, 9, -13, -79, -80, -200, -148, -105, -173, 66, -53, -231, -80, 132, -75, 72, -64, 2, -273, 194, 63, 102, -167, -42, -41, -34, 48, -76, -156, -104, 153, -48, 139, 155, 56, -205, -110, -243, 149, -26, -21, 334, -81, -241, -128, 68, 70, -98, -122, 71, 88, -53, 31, 27, -81, 237, 71, -133, 99, 42, -112, 153, -115, -77, -284, 81, 118, 59, 107, 187, 240, -35, 117, -80, 35, -91, -153, -25, 272, 128, 23, -50, -273, -181, 61, -152, -4, 245, -21, 31, 63, -63, -53, 60, -173, 84, -122, 10, 67, -105, 141, 108, 206, 220, 201, -83, -107, -141, -48, 19, 30, -198, 37, -71, 21, -49, 61, -178, -193, 91, -116, 201, -182, 9, 153, 65, -36, -287, 193, -84, 2, -184, 207, 96, -41, 21, -14, 52, -139, -103, 408, -76, 18, -67, -218, 33]
7920C3j67p3L44N7j86K07l8k87K21k19J58q1J08o7k11K2P2MJ63l41K46K35k78
7943g8P7k9J4J22k15K67j57P9j00j62K7L21rk60J44k96J11J27J57J28k39p6K45
7966A98l82M13n62L74O5j59K5J35l91N63j63M3k12n7p1J90n1L38k55k7K8k01K10
7989E1r8j2q5J06N4M8j22K63m7j64P2j38J19J70k81q5L1J12P5J77j83j68K63l45
8013a87J5J59k0n2j95L07o9P1R2j55j2K46j76J3R0l3n1K2k9k22k5N51n3n59L19
8038D7J38k8j1R9j59k36J8O04n60PO4j52J25P4lKo1P4J17K1l24K6L77k50J10j79
8064f0jK55j99Kj04J67o2J14j45j42M00j30j41o7J22q5L19l08P3K25j61o3j74
8087a65K47j34J16k87K42J69j79N3j29K3p3L5J58j62Q8k43K59j3O8J36l22r8K71
$$ y = [33, -134, -207, 137, 194, 8, 215, 177, -110, 111, -108, 50, -31, 77, 10, -201, -179, -107, -103, 60, -281, -35, 200, -78, -1, -30, -16, 106, -109, 158, 1, 80, -20, -182, -155, 166, 157, -103, 41, -255, -144, -17, 140, 268, 29, -47, 198, -184, 229, -333, 41, 106, -53, -28, 107, -284, 279, 116, 159, -53, -110, -181, 9, -42, 296, 41, 14, 42, -159, 51, -47, -59, -144, -38, 16, 64, -58, 205, 158, -6, 66, -72, 47, 217, -64, -149, -118, -6, 69, 246, 63, -105, 158, -187, -172, -13, -33, -85, -280, 27, -42, 29, 121, -34, -46, 200, 24, 37, 127, 94, 43, 65, 36, -186, -211, 340, 287, -272, 47, 185, 157, 146, 245, 86, -150, -132, 472, -88, -81, -17, -169, -44, 30, 27, 29, -32, 42, 159, 180, -144, -118, 259, 9, 119, -60, -61, 194, -5, -3, -107, 60, -2, 112, -33, -175, 225, 95, -46, -113, 9, -76, 243, -65, 8, 233, 72, 9, -165, 82, -52, 64, -223, 19, 188, 9, 62, -67, -44, -117, -82, 76, -86, 2, -241, 18, 5, 73, 209, -113, -211, 60]
8110F0j57J28N1O1Mn4k64NK48J8j2k01J64J35k42J27l6M7r7j20J68j8O4j41j0
8135g2Q1J28R8j71j22mJ81j85N6k89J41L34j56P5N5O5o0k72O6j85L03k58l2L46
8159A23N5l70K02K8J30k8r0Q6l50J18Q9LJ22k06L05k65k81J07J52L03j49q8j86
8182a90K71l6j4n0Lj56m8J16J07
$$ y = [60, -97, 31, 82, 143, 147, 93, -171, -166, 82, 100, 88, -113, 51, 186, -56, 71, 35, 82, -15, -135, 33, 15, 79, -62, -72, 9, 137, 235, 64, -58, -62, 119, -66, -10, -299, -158, 176, 20, 95, 150, 215, 155, -117, -51, -236, 67, -191, -223, 123, 178, -192, 10, 38, 168, 140, 50, 136, -214, -96, -7, -4, 118, -88, 217, -48, -329, -222, -70, 233, 84, -4, -190, 81, 45, 31, -19, -16, -172, -220, -104, 3]
8191C
$$ Imaginary data points
##PAGE= N=2
##DATA TABLE= (X++(I..I)), XYDATA
0@%%%%%%%%%%%%%%%qJ6j6J6j6J7k5L2l3M1m8N6o5P3q7J00j12J26j43J63j83K04
37A08k29K57k88L20l54L92m34M79n28N83o45P11p81Q62r50J047j157J277j415
56g45J574j755J965k215K517k890L362l981M837o094Q119j1900K1217q3363j27900
71a97252J75173k227l9301J63999J1151k10318K1728J01239p7396N1292J75792
82A73880r4708j32602Q4475k3260j17063J25120Q9493j52787j7953J05322r4017
93e4100m1618J62753j0140j34202P2748N0041j04479O4189J25317j08850p5935
104e4276Q0672n5189o6841J48442N2365j32131Q062L6790j27063J0793J74790
115G6414r169p0833O9930m2557j38825P2096J11018n4479J6241O8648j16235r0687
$$ y = [0, 0, 0, 0, 0, 0, 0, 0, 0, 0, 0, 0, 0, 0, 0, 0, -8, 8, -8, 8, -8, 9, -16, 16, -17, 24, -24, 32, -33, 40, -47, 53, -59, 67, -76, 87, -96, 108, -121, 136, -152, 168, -186, 206, -228, 251, -277, 306, -339, 372, -409, 453, -497, 550, -607, 670, -745, 829, -926, 1039, -1176, 1341, -1549, 1813, -2168, 2669, -3425, 4694, -7206, 14011, -69352, -197252, -22079, -24306, -63607, 100392, 111543, -98775, -77047, 24192, -53204, -1912, 173880, 79172, -53430, 31045, 7785, -109278, 15842, 105335, -47452, -65405, 39917, -54100, -95718, 67035, 56895, -77307, -4559, 45482, -58997, 5192, 130509, 21659, -54276, 26396, -28793, -95634, 52808, 105173, -26958, -18896, 17894, -109169, -98376, 76414, 67245, -3588, 66342, 23785, -115040, -42944, 68074, 13595, 29836, 98484, -17751, -108438]
127a08438R5135J2913n2436R3744L2572j26597k26Q2400n5892r763J09680k9283
139D3809r0498O0743K7021p7032L7378N9582q4880k9163P6540k5489l5644P9590
151D1957l893r5328K7304M9708n0460K7329Q5627n4313o9332M2423j1055m7259
163e7292P2434N2543o6970j4805K6439n9593j3393Q6495Q138m0382L6957n005
175B5566p4310K2314O0257l1445m975N0318l7113n2657M2272J3522m2116K7204
187a163L0216m7878m193M4793k2725k2137L9845o598m0707L2110K7372l5850N656
200a259K8132l8439k2819M0903L505k1008K9207O378m5147q8K6147j5254N533
213d209L6906j4805l1571J4793j620k3647K3409K6043k4131p851J6795j9846j6549
$$ y = [-108438, -13303, -390, -52826, 40918, 73490, -53107, -53333, 29067, -26825, -36588, 73092, 43809, -46689, 14054, 41075, -35957, 1421, 61003, -23877, -53040, 23500, -1989, -37633, 41957, 38064, -57264, -29960, 19748, -30712, -3383, 82244, 27931, -41401, 1022, -10033, -57292, 15142, 67685, 715, -14090, 12349, -47244, -60637, 25858, 33996, -6386, 30571, 25566, -48744, -26430, 33827, 2382, -2593, 47725, 10612, -42045, 227, 13749, -28367, -1163, 29053, -18825, -23018, 21775, -950, -23087, 16758, 10160, -30547, 1563, 28935, -6915, -1259, 26873, -11566, -34385, 6518, 10023, -10985, 18222, 24600, -20547, -20635, 5512, -9742, -4209, 32697, 17892, -13679, 1114, -506, -24153, -744, 25299, 1168, -6683, 10112, -9734, -26283]
226b6283K8056P563j8034J2799Q985k2588K49J8608j0824n944J9174m281j5539
239h059J3690M833j9216L616J3313j2566k394J7810m488j3670Q239J080j2466
252a0278O573J2087p254j995O847r438p873J0013K334n145P586L861j1273j762
266e717P246l652j659R761O89p070J863J672n747J189N155k454q46K902k545m076
282c289L124P5l390K461L598l622j364L166j518l040K553J911j493P31J498j771
298c70m68P19r7O08J599k68p01M70r0j641N10J179m72o55O02l2j392n84P53l83
318g13m15N8K36P4n35j50K08O23l20K28O74L64k28q7R23j34m87O56M92l59l44
339G64N43l41l23L15p17r5P52j136r72J516k98j601N61J146k073k25K459p72j492
$$ y = [-26283, 1773, 9336, -8698, 4101, 13086, -9502, -9253, 9355, -1469, -7413, 11761, 7480, -8059, 5631, 10464, -8752, -5136, 8177, -4389, -6783, 11027, 6539, -7131, 1108, 2188, -10278, -3705, 8382, 1128, -867, 5980, -3458, -11331, -1318, 1016, -4129, 3457, 7318, -3955, -5717, 1529, -2123, -3782, 5979, 6668, -402, 1461, 3133, -2614, -1425, 3730, 1276, 430, 3332, 787, -3289, -165, -90, -3480, -1019, 2579, -1043, -2407, 759, -759, -3799, -1246, 665, -828, -97, 1401, -370, -838, -119, -216, 392, 1991, 1723, 1022, 1492, 1402, -239, 271, 1450, 978, 323, 925, 893, -499, -1083, -330, -713, -1128, -1070, -834, -760, -1295, -1445, -1237, -614, -934, -706, -32, 332, 104, 17, 940, 806, 319, 975, 1467, 1108, 764, 1307, 966, 643, 958, 241, 146, 898, -238, -1210, 306, 8, -1593, -1032, 114, -1959, -2184, 275, -497, -1989]
358a989J953L69k320J557J964j993J45K778k165j027L190m16l083L014J024n013
374b012J509M085l437j871M867k676n033M269J707m684K823L835n931j852N852
389A451l020k715P745M77q122L446L906p501J941R109m684n266P509j902q177
404e803P320N524r927J586P609q562l390J1690l521r578Q291J850j1734O710J0381
419H446j0601l823J0591p133q501J5340L713j1764N416N096j5715L03J6752m994
433C126n539J3468o437j7835J0060R777j1493O236J3853j6396j0781J5075l370
446b56j0438J7167N483k0316K801J2378j4971m62K0661r088j4984J5836J958j7120
460a1351J3503J3161k1536l103J8196j0792p586K4412k291k4153Q902P798j9391
$$ y = [-1989, -36, 333, -1987, -430, 1534, -459, -314, 2464, 299, -728, 2462, 2046, -1037, 1977, 3001, -2012, -503, 3582, 145, -1726, 3141, 465, -4568, -299, 1408, -3276, -453, 3382, -2549, -4401, 1451, -1569, -4284, 3461, 3938, -4184, -738, 3168, -4333, -2392, 6717, 2033, -3233, 4276, 2374, -5803, 1517, 7041, -2886, -1300, 6309, -2253, -5643, 6047, 2526, -7052, 1239, 3089, -8645, -1935, 8446, -2155, -5978, 4613, -2520, -11021, 4319, 8032, -3732, 1684, 6780, -8935, -8632, 8120, 3126, -2413, 11055, 4618, -13217, -3157, 6620, -4873, 1363, 15216, -1180, -11961, 3114, -256, -10694, 6473, 11956, -8360, -5559, 6819, -8152, -8614, 12047, 2959, -12025, 3811, 5769, -11351, 2152, 15313, -6223, -9326, 8870, -1922, -9508, 14904, 12613, -11540, -2638, 5160, -14231]
473a4231J0131K5058j5904j3887J4667j1046j7530K5636J4694j9938M103J0128
485A1881k7264n963L0020j885j2089J9894l766l0710J0218J9929j5720L512K3180
498B1237j9403j9415K2793J212j9139J9094J1190k9446R18K4216j5342p854K5667
511A5728j0502k7381J9129J2752j9935J3675J9121k9756j4108K4331n695j0107
523a2748L2192L481l5110L168J2818k2062R236L6247j2960k2941J5055q575k5350
536b7549K6146K4468k1845n78J5327k7668j3292L2649K127j8936J8818L459l2534
549a9408P736K5913j7792n506K4503j4254k2221K6433R653k3922J0956J2971k9833
562a4771k201L1687p146j2736K2332r352l3697J5214K1542j5664R409K2384k8632
$$ y = [-14231, -4100, 20958, 5054, -8833, 5834, -5212, -22742, 2894, 17588, -2350, 1753, 11881, -15383, -21346, 8674, 6789, -5300, 14594, 10828, -19882, -9664, 10265, -5455, -1943, 21237, 1834, -17581, 5212, 6424, -12715, 6379, 17569, -11877, -10959, 13257, -2085, -9939, 15728, 5226, -22155, -3026, 9726, -10209, 3466, 22587, -7169, -21277, 3054, -2641, -12748, 19444, 22925, -12185, -9017, 3801, -18261, -9025, 27222, 14262, -8679, 6376, -2199, -27549, -1403, 23065, 1220, 642, 15969, -11699, -24991, 7658, 9785, -9151, 9667, 13126, -19408, -11672, 14241, -3551, -9057, 15446, 1192, -21029, 5404, 15057, -8865, 2091, 15062, -14771, -16972, 14715, 7569, -5167, 17165, 7813, -25884, -10670, 10872, -4792, 4617, 27001, -1631]
575a631k3387K2076N01j1751K9433J1094l4294m249J4884j8841J876L5341o013
588A5039k3564J3521j903k5324J6753K5030j9176m743J9097j7034j5518K6020
600H198L592k2178J1319R999k3301M645K4963j4661j4096J7183p106j8231K2610
613B936J5047k0566J398J0761k3560o327K9244J666j2430J5153l788k9564O741
626a3289K0865r466M327J9900j7188k2457J4439L113j2168J8638J3365k2593n541
639h055J3168j2777n965K3234q24j7421J0401N619j8628N733J6817j3904o741
652i343J6623m906j1106J6250L043j9102L311J0769j1911K362J9021p488j4846
665g323Q219k197j2465J3677J4329j1913l061O939j3829p989J7440M485q044Q747
$$ y = [-1631, -25018, -2942, -2441, -14192, 15241, 26335, -7959, -12208, 2676, -16165, -14289, 21052, 15039, -8525, 4996, 3093, -22231, -5478, 19552, 376, -4367, 14730, -2304, -17822, 8198, 11790, -10388, 931, 10930, -12371, -7726, 17237, 2576, -11520, 5663, -1443, -19674, 2936, 17983, -2583, -1185, 9576, -13984, -20311, 8933, 10599, -1831, 13322, 9534, -20030, -13289, 7576, -1890, 2437, 22337, 5149, -17308, -2869, 244, -11924, 6714, 20079, -2514, -8055, 5113, -7664, -13629, 9605, 8781, -8640, 1761, 7380, -11248, -5515, 11302, -2602, -9343, 7280, 2374, -8732, 7518, 10561, -8541, -5230, 5539, -6372, -4010, 15011, 7523, -7323, 896, -1301, -13766, -89, 14240, 2327, -734, 6205, -7624, -15613, 1827, 6312, -1732, 7015]
679G015J215j8134k8J2533m933m06J4112n624j3331P223K921r677O607R929r762
694c40k716R460n665p333R482M07r671N959P075q623j10P456p903o112R187J368
710A921n291P235K959j1173j183O138m107M96J0172j506p966K811m43o577M794
725a720Q024l729j729L797n312n916O002K578l547L862K459o782j543M131k817
740b242j711N946L26m279K469J554n179L94L938j972m55M397p58l481J507K80
756G34l090J699M031j941p88K007k552l167K374J218j159J841J288k997j547J173
772h76j079m09K998Q48j768L99J5k210L64K091k6R1J331o98j477J60M79n97P67
791D03J384p66m32L11r85r76P61P19n24M00K57j153n83J45R3NR64o0J34m15q3
$$ y = [7015, 8230, -9904, -9932, 2601, -2332, -2738, 11374, 5750, -7581, -358, 2563, -7114, -507, 9422, -340, -3056, 6404, 739, -6594, 2888, 3295, -6376, -417, 6658, -1965, -2075, 5381, -2522, -8634, 553, 1921, -3370, 3865, 6824, -4349, -5532, 606, -3501, -3005, 7167, 5661, -2305, 506, 63, -6514, -1720, 6304, 2575, 846, 4643, -669, -6585, -583, 1995, -1552, 2310, 4769, -2013, -3556, 575, -2242, -3953, 1993, 2319, -1960, 509, 2063, -3116, -2722, 1216, -756, -1211, 3186, 2428, -1053, 454, 734, -2356, -657, 3374, 1433, 645, 2652, 100, -3067, -693, 525, -634, 1207, 2495, -502, -2049, -876, -1955, -2364, 634, 1482, -286, 113, 128, -2082, -1718, 373, 347, 438, 1769, 1071, -406, -246, 233, -364, 403, 1787, 1021, 589, 900, -85, -1061, -300, 419, -105, 295, 552, -601, -1184, -1039, -946, -941, 23, -37, 97, -318, -401]
812d01j60j65N35P32m9M30l68n32o6L08j06M97J46j39k05j48o13j86K25L97P6
833B08k54q5k50n45N1K43Q0M94j68R0k4p7l14M91L33NJ0K34J5k75L08Q5l72J09
857C92J86k98m33O91m82o27P78k31o31K89M59p52j23O07l38m59Q72nr84R32Q35
878F78j034m0J050n73m77J423j54j285J044L56j194M63J177j314q09J319n63j261
896a194J824J92k181Q53Q66k034O42K030j241j324K038l77j890J772J650k122
912d96m9K515k427q21K897p1k509J951P19l125R81K737k475o81K598j670k943
929b869L233P55k958K058J845m009q50M083j561j562L926q15m576K436K585l098
945a377J188L952l436k928M023o02l317M309K087n412O25L117m036o81N452j407
$$ y = [-401, -561, -726, -191, 541, 492, 922, 554, 22, -44, 264, 158, 655, 801, 662, 457, 309, -304, -490, -265, 132, 208, -46, -131, -381, -926, -875, -632, -552, -58, -226, -136, -160, -237, -551, -60, 273, 278, 288, 522, 537, 262, 570, 655, 283, 392, 578, 280, -153, 538, 56, -571, 207, -24, -655, -366, 93, -659, -782, -175, -513, -972, -100, -105, -1089, -157, 678, -356, -396, 654, 81, -396, 1027, 873, -412, 632, 988, -206, 257, 1434, 120, -689, 630, 67, -1194, 630, 822, -1359, -506, 360, -1674, -1032, 998, -243, -1567, 471, 94, -1796, -24, 1626, -496, -545, 1970, -457, -1278, 1619, 1548, -961, 990, 1709, -1416, -435, 2302, -173, -854, 1744, 74, -2869, 364, 1119, -1839, 219, 2064, -1945, -2795, 1288, -273, -1835, 2091, 1276, -3300, -864, 1721, -1377, -189, 3763, 327, -2601, 1422, 820, -2497, 1812, 3899, -1513, -888, 2229, -1807, -2488, 2964, 1557]
961A557m278L389L97m859K884M363m741j152M717l149k987O076Q35n603K579K229
977B257n638J115P202l400l351M853k679n521N475M085n301J887L603o989l264
992e666P178k44l531N790j17q353J935M962m436P16P090m309o080N647Q89n530
1008d059M961M545p422m75O060m084k771P417j072p270M215K956o345L101O559
1023F316o618m217O002k280m402Q322K349q538R43L819o936M41J0028j866n610
1038b247M595j700q117N623P155n248M48N360p472m798Q083Q09m815N530K151
1053E357r256N43O785m542j805P690l003p394O021K773o843L116M923p610j935
1068e180Q249k517l583P276r20r172L300N221m982K332P687o101o862N416k73
$$ y = [1557, -2721, 668, 1065, -3794, -910, 3453, -1288, -2440, 2277, -872, -3859, 2217, 3052, -2551, 28, 2257, -3381, -2266, 4936, 1536, -1815, 3038, 359, -5162, 313, 4398, -903, 984, 4587, -2402, -5666, 1512, 1268, -2263, 3527, 3410, -4943, -3008, 1954, -2482, -1766, 5324, 1015, -5065, 582, 1471, -4059, 902, 5447, -1975, -2450, 3610, -474, -3245, 4172, 3100, -4170, 45, 3001, -3344, -243, 6316, -302, -4519, 1483, -797, -5199, 3123, 5472, -3066, -2123, 1696, -5240, -4799, 5229, 3363, -2247, 2348, 648, -7469, -1846, 5309, 61, 509, 5869, -1603, -6401, 1682, 2491, -2324, 3206, 5357, -3899, -3356, 3429, -1113, -2918, 4772, 1769, -5625, 396, 3169, -3674, -558, 4365, -3245, -5180, 3069, 552, -3031, 4245, 3325, -5847, -2547, 2674, -2308, 24, 7711, 1610, -5252, 164, -109]
1083a09m780Q190M382q678q88L572o195r18R687m59n915L849j39q277L322P106
1099C750m096j030O043m863n649P025J393n749M031L493o500k63O935l718l617
1114b815N614j270o205N170M457n900M77M048o417k874P355K67l603M903K36q488
1130e045P45N387k996J162P064m168o197L151N17l758M977N132n685j303L340
1145B323m031k651O666R41m729L048J456n806M69N092l556j577M686j532m035
1160c236M134J177n007J357L191l650K60N315j661l795K351j65m240L587M566
1175D184l233l63K270m051l115M553J746k188K686P90n395q46L442j740M6M325
1191C111r89m141J569M06l094J884L590k374o31K695j966k553K913M68k013J681
$$ y = [-109, -4889, 3301, 7683, -995, -1883, 1689, -4506, -5424, 4263, 3804, -2111, 1738, 1599, -6678, -3356, 3750, -346, -1376, 4667, -196, -5845, 1180, 2573, -3176, 855, 4348, -2152, -2415, 4520, 802, -2815, 2799, 1529, -4676, 494, 4951, -949, -472, 3576, -2841, -5715, 1640, 1907, -1696, 3207, 3443, -5045, -4300, 1087, -1909, -747, 6317, 2149, -4048, -897, -380, -4138, 839, 5971, 286, -1017, 2323, -1708, -4359, 2307, 3248, -1481, 1567, 3023, -2783, -2314, 2778, -778, -2355, 2331, 799, -3236, 898, 2075, -2932, -1575, 1616, -2034, -1774, 3541, 1880, -1915, 436, 271, -3969, -382, 4184, 951, 588, 2858, -1193, -4308, 245, 1991, -197, 2489, 3279, -2116, -2962, 480, -1260, -1214, 3111, 2122, -2019, -450, -44, -3138, -1254, 2336, -38, -669, 2026, 60, -2493, 420, 888, -1125, 556]
1207E56J862k515j31J968k328j335K658L83j965K252P42l493j87J603j342k17
1223a489L060J33k483N73k53j892J195K605j145r4J583j694k154J813P96p86J304
1240A072J331j927j261J085p29n10J881O10j695N57L82j701k59J219n41k78J579
1257H15j67j255K97k23q22P54J252k72n54J048o86j218Q88L59j07Q56P02j233
1275D34r46P34q64M08Q82L69p14j29n8r85k0P93J97q6K74k01q33J49j37J69K79
1296b85Q89j67n33J59l37k87M41N31M5L95r5n03l25Q7RJ57K64P9j66l72j10k65
1318c89j54K14J90kK65j32l62k37K91m6L22K73K9j67k9l13K12L31K77q1n0l7N1
1341D56k10m3j57J13K77j46r4m45J40l27m9K01J9l2L52l90j5q9L4K2L44J15P8
$$ y = [556, 2418, -97, -228, 1740, -588, -1923, 735, 1118, -847, 1405, 2147, -1346, -1533, 70, -1272, -1489, 1571, 1704, -779, -206, -459, -2351, -1156, 1449, 304, 210, 1793, 99, -2055, -242, 554, -232, 1072, 2403, 476, -785, 300, -429, -939, 942, 1552, -143, 414, 796, -905, -1164, 55, -486, -764, 815, 648, -607, -310, -533, -1355, -601, 651, 379, -175, 873, 187, -1031, -143, 216, 109, 965, 1667, 434, -512, 222, -642, -234, 648, 1017, 303, 174, 116, -869, -889, -96, 101, 15, 289, 88, -745, -596, -733, -564, -285, 604, 437, -96, 63, -274, -561, -120, 411, 456, 851, 756, 253, -72, 15, 24, 181, 445, 524, 358, -14, -124, -389, -543, -329, -139, -141, 124, -8, -370, -607, -316, -362, -40, 233, 262, 95, 66, -247, -35, 296, 573, 492, 442, 405, 456, 246, 203, 46, 159, 436, 290, 196, -249, -109, -436, -485, -284, -265, -297, 55, -335, -350, -439, -405, -383, -39, 76, 154]
1364A54k62J40J51k14J98K10k42M14n5n21Q1K65O3l62k0K42n11K93O9o49J57L49
1386e0l75n4L52m6j88N5M17m89K00M08k28l0O49m32k87O85R2n82N3Q14j066p5
1408a77P33j60o33L01J77q22M89L75p33L56J33m55l44R41n6q55Q27K78j116N37
1428b04Q42o00l00J281m78j218J046P4m95K60J016j488l36J323q33k33R27Qj509
1447i17O66O39j086K29J499j291o88Q43l5j221J618N33j267L84J000j290n43K067
1465A140o40q28J067l7j667O30J613j216n85J450j215j284J920L29j617Q14O79
1482E53j874Q2J950q03p93J650m58j978J356J285j749P31J655j723j173J947M3
1499G01j147J743J78k445N20J260j271k67K236j061j899J678K47j914J490J530
$$ y = [154, -108, 32, 183, -31, 167, 377, 135, 549, 494, -27, 54, 319, 382, 20, 0, 242, -269, 24, 93, -556, -399, -50, -425, -479, -127, -173, -361, -306, 111, -378, -178, 230, 2, -28, 621, 189, -98, 587, 679, 97, 150, 964, -102, -177, 556, 396, -237, 64, 241, -581, -92, 283, -450, -94, 39, -416, -760, 181, 125, -730, 97, 375, -741, -204, 638, 38, -262, 1019, 541, -677, 369, 443, -52, 208, 1224, -264, -600, 723, -110, -343, 584, 592, -917, -251, 388, -698, -469, 1030, -261, -949, -106, -141, -1362, 256, 789, -478, -94, 906, -384, -927, 1140, 500, -328, 739, 702, -965, -335, 1278, 62, -523, 927, -288, -1572, 348, 677, -940, -126, 553, -1321, -1239, 711, -92, -885, 765, 307, -1671, -315, 970, -779, -48, 1607, -116, -1289, 658, 701, -446, 1297, 1475, -970, -450, 810, -461, -728, 1508, 447, -1452, 226, 473, -1441, 49, 1579]
1515A579k298m33J831j315j089K541r6j903J331N48j943R19K226j771j041J827
1531I13n20j829K392R57k490M64J464k801j90L037n43j811J870o19k627J453K064
1548A184j780K09J987k066j668K214N13j815K183Q76k825j52K407j644n74K789
1564A838p86k419J652P93k110J085J717k137p13J851p07j516K666K05l174J137
1580f18J278j752L24K415j265j901J585l55j463K133J719k181k55J458k055p56
1596a689K941N0j508J313R8k935Q89K086j220n3J807j698j834J957L19j852J586
1613B57J053k283J4J939j325q50K019q7k094J557J250j917L46J660j875r60K294
1630I98l46j271J657M74k637M30J332j418L69K063j051j884R81K27j571J549J548
$$ y = [1579, -719, -1152, 679, -636, -1725, 816, 720, -1183, 148, 696, -1247, -328, 1898, 127, -914, 913, 393, -1436, 956, 1913, -577, -113, 1351, -1450, -1640, 1397, 854, -957, 913, 294, -2333, -880, 1184, -596, -387, 1600, -466, -2134, 80, 593, -1222, 961, 1837, -988, -1140, 1267, -377, -951, 1838, 1052, -1367, 285, 1078, -1032, 53, 1770, -367, -1080, 771, 64, -1452, 1214, 1419, -1755, -618, 660, -1092, -768, 1647, 382, -1519, 66, -289, -1752, 381, 2100, -81, -336, 1122, -933, -1689, 1252, 1302, -206, 1107, 1205, -1730, -841, 1245, 25, -28, 1779, 81, -1753, 204, 523, -1329, 257, 1310, -973, -959, 980, -345, -1195, 824, 737, -1357, 200, 1450, -467, -121, 1539, -336, -1296, 998, 652, -619, 1038, 1512, -1125, -695, 637, -781, -412, 1651, 600, -1284, -303, -76, -1647, -98, 1450]
1647A450j356q01J370j375r88K071M60j629J661K14j737K71J441j292m59J839
1663A140l74j431J080N77j706M86J082j577mJ751p11j056M74M56j417O03J560
1680I33p71k57R60j413r53J450J28l30J092N03j548l50O26o99N99J195Q8j326
1698g3kJ05j095O85J030o46M8N96o10q27O11L31r24N05R21j130N5O83o37l77P55
1719DK96n62O62N33j101j09M59m63J83P69J16r44K9J66q33K02R92P1k55J95o40
1740b30o23N38K12l42M69N21p44l71M55j54r4M84J76j80J96O8n93j04N45J22k18
1761A33O31mo92Lo7m42Q8N47l8j44L1k58m75K21J42j15N00L68m75j61l2K8K42
1784C1K21J76k61M31l44k76m00K24L01RM00k16j43p8j22k97L76J04m5j54N7j26
$$ y = [1450, 94, -707, 663, -712, -1700, 371, 831, -798, 863, 1077, -660, -389, 1052, -240, -699, 1140, 766, -665, 415, 992, -714, -228, 854, -723, -727, 1024, 313, -743, -269, 187, -1230, -627, 933, 162, -95, 865, -548, -1501, -51, 77, -253, 839, 1342, -206, -556, 70, -629, -30, 1165, 1253, -73, -75, 30, -1065, -380, 650, 4, 52, 648, 38, -789, -178, 153, -771, -266, 655, -475, -420, 263, -374, -751, 4, 300, -262, 400, 933, -168, -277, 182, -281, -98, 671, 787, -157, -128, 38, -795, -593, 399, 470, 215, 410, -230, -853, -315, -103, -445, 24, 545, -199, -570, -115, -269, -363, 121, 297, 117, 313, 381, -212, -316, 229, 351, 133, 764, 760, 68, 71, 4, -438, -350, 197, 159, 15, 46, -212, -687, -466, -324, -439, 61, 429, -46, -207, -239, -211, 31, 252, 428, 167, 598, 254, -22, -422, -198, 103, 112, 512, 296, 153, 75, -47, -344, 32, 136, 91, -63, -6, -132]
1806a32k92K53pJ11N7J86l24o2J84p9M9K40M4K15j17n29N1K01J80o7K15P6k48
1829B05k37m8j32rJ01m1O5K10l72Nj61j22N86q4Pn4J27j15K5J57l49M31m5L04
1853D54j87l43j2M66l75j39K51P1k69J47k09J14J67j63k04J69o1J4J2l28K53n2
1875b24R5J08O0k99J18J67n5L48jj50J13k19K43k89K8K30K4j65j41L37m13j62
1897b47K41m9k15K7q6PJ72L8p4J27pR7o4pj00rJ73p4J35K73p6j37K28J15k72k79
1923f3K40r2k53L08J71o11L21K16l81j90L98l11k50N82k40j89K65n6k66L67J43
1944A09l38j44M67J19m26N29K34o79L84rr1L5L29o5n17L39m1k48k1L06m87j79
1966c94N07m39Q8L90j73m12M75J42n15kN87l57k23P67k40n62M91K32n72L98K87
$$ y = [-132, -424, -171, -178, -67, -10, 176, -148, -210, -26, -105, -56, 184, 228, 443, 326, -203, -152, 49, 229, 162, 377, 453, 205, -32, -80, -212, -221, -120, -161, -96, 114, -258, -253, -414, -536, 50, -34, -27, -81, 46, -69, -44, 113, -236, 195, 150, 454, 267, -76, -88, 378, 3, -136, 115, 186, -83, 64, -145, -31, 136, -27, -231, -62, -123, -109, -97, -425, -172, -224, -129, -21, 39, -260, -142, 25, -30, 318, 317, 167, 280, 61, 304, 15, 43, 273, 297, 132, -9, 328, -85, -247, -6, -55, -270, -243, -329, -322, -150, -112, -186, -59, -66, 31, -33, -40, -140, -149, 24, -50, 85, 358, 282, 145, 373, 488, 216, -63, 177, 85, -168, 140, 311, -300, 21, 237, -144, -334, 64, -247, -497, 85, -155, -344, -79, -135, -401, -34, 109, -229, -373, 94, 213, -213, 316, 550, -129, 255, 246, 155, 190, 519, 454, -63, 276, 235, -13, -34, 272, -215, -394, 113, -326, -238, 152, -21, -433, 42, 184, -331, -333, 254, -103, -326, 441, 201, -361, 130, 362, -210, 188, 475]
1987D75o65l0O54m86j77N95k94q40O54O28r68L56M80l74o45O31j2m03N17L61o87
2008b30j12O85n28J28O45l13o25P13k02m52L17M93m57j17M12l54j74M79L8o96
2028c50K47N11r43RN68q9m76O54l32m82P09J21l27l9Q23p02j06O40K4p32R92l31
2050C89q54L79O02l82l09P62o18m22M74P6q65R17L52r05J3P55o24m75Q14L10q80
2071d91M34M09q18L47O89p31l8O12m49l53P82K55o42k2L28m29j40R27l96p97M81
2092d2Q0o94M60P31q49j4P73p92k83P05Pm74P49k58p92N28M13l80K19L28j6q96
2114d97O80K72n66J61M64n20j87O87m69n67J022k44p14K57N99r10J33Q67l51o96
2134e79N53J23m26N02J14l21l7M59n08J65M71k77n58M96j59n07N25P81o61m5K22
$$ y = [475, -190, -220, 434, -52, -229, 366, 72, -768, -114, 514, -454, -98, 382, 8, -637, -6, -18, -421, 96, 457, -230, -342, 343, -185, -57, 588, 275, -350, 363, 161, -291, 26, 519, 62, -55, 357, 3, -171, 308, 346, -350, -103, 408, -535, -526, 42, -47, -523, 131, -201, -683, 26, 147, -180, -219, 604, -98, -204, 436, 460, -272, 720, 389, -465, -86, 516, 134, -175, 587, -31, -453, 21, 97, -768, 149, 501, -404, -391, 364, -260, -735, 79, 389, -491, -57, 352, -466, -119, 570, -161, -199, 413, -36, -389, 393, 648, 6, -16, 312, -117, -257, 670, 274, -523, -42, 38, -656, -196, 535, -314, -328, 445, -347, -630, 75, 82, -392, 357, 99, -693, -165, 248, -132, 87, 415, 399, -497, 183, 455, -111, 50, 514, -6, -193, 494, 25, -542, 480, 236, -478, -221, 378, -532, -399, 468, 117, -579, -26, 97, -329, 173, 287, -34, -71, 388, -120, 45, 516, 239, -319, 177, 18, -489, 36, 817, 156, 111, 333]
2155C33m92k72M90K21l25M39j22o97n3O90l82r2M94J3o06L45M33n16K32R1q3j3
2177A28L63j89l15J75J08l81P8L50k06j51J07j62j22P5J88k62J98J10j41k97J27
2198b19k21K80L23lj01j36ok25J61L83k32J63J28J9m94J38J70j45J30L27k78l41
2220a79L21l39K0J03l02K48m1L77n36J23J7K19j07L35o5l42K98j13l12J15L79
2241B19k29P8J89n1o7n44L80k59M37J15k81j55m6P1k46L29R7j43nJ82l84N0L06
2264D3o4l0L43m45L59o5k53J11l6J34L43n49M87l23k13q1K94P8J55k19j65m8m5
2287a89k5j3Q1J22j44K53l5j63j39M2K70R1Q1j08j78k2Q0r0QJ83K8J51m09M42
2311C17l73K29pk72K40k6k96K53j99O6j08J9K74m1j85K22j85j89J70J95l49J95
$$ y = [333, -159, -431, 59, 280, -45, 394, 272, -425, -478, 212, -170, -262, 232, 245, -361, -16, 417, -99, 133, 224, 141, 128, 491, 302, -13, 162, 270, -111, -33, 317, 111, -40, 67, -95, -217, -142, 46, -216, -18, 92, -49, -346, -219, -440, -160, 163, 160, 59, -77, -83, -308, -147, 236, 4, 167, 295, 314, -180, -42, 128, -17, 113, 440, 162, -179, 142, -197, -177, -74, -376, -128, -169, 208, -328, -205, -188, 31, -76, 259, 194, -148, 150, 37, -275, -160, 219, -10, 68, 257, 206, 139, -405, -25, -284, 153, 268, -13, -168, -214, -143, -389, -60, 37, -106, -111, 71, -313, -263, 43, -21, -51, 292, -153, 206, 141, -112, -1, -37, 97, 440, -109, 378, 55, -158, -239, 55, 133, 288, 69, -96, -144, -189, -214, -227, -146, -24, -168, 85, 50, -113, -252, -210, 60, 151, 232, 124, -54, -76, 4, -86, -78, 105, 133, 284, -125, 317, -56, 173, 166, -106, 134, 108, -188, 65, -134, -68, -176, -157, 117, 76, -109, 113, -72, -261, -91, 104, -245, -50]
2333e0J50j42kNp6L88j53J78k92p6J6o3K03Q8j61n4J32k54J2j39K50j72K21%j16
2358a07J15Nj5k22M7J91K1llj04J37q3L3J97K2p6J3j82j8J31k88K13o3O1j3j36
2384a27j42J39R4K6Q4k4j89K13k0k92L53P1m4J30j76j10J05N7n8k16K99j60j03
2407i0K78k53rJ20n9K19l02J19p3K4J29k65P5P4k03J24N7O9l3%j55K09qj90K77
2432A34l16L21j24J1R9J23q5L03n95n3L00l3L5l91P2J97n7j28J01P5J20j06j8
2455a5J48j84M1l7k26K37QM41n73M02k4k70K13J99j40J66p6l34R3j69J07J0kN5
2479G0q0k72L68j97J25j12J68k83K67j56J02J0J94l58O5M27k85J04Jk2j38J18
2501A16l3K43m07K36m6M7m2j20K64k48K43k88k4J45k88N9n5K97k34J54N8l17L08
$$ y = [-50, 100, -42, -44, -39, -115, 273, 120, 298, 6, -70, -54, -117, 86, 174, 13, -41, 91, -163, -151, -290, -40, -212, 9, 9, -107, 8, 13, -2, -224, -177, 14, 35, 32, 29, -75, 62, -21, 12, 209, 231, 155, 168, -14, -32, 99, -189, 24, -39, 22, 9, -127, -269, -130, -36, -10, 74, 50, -139, 74, 54, -238, 115, 186, 142, 272, 96, -14, 91, 148, 90, -126, 173, 13, -90, 188, -65, -74, 46, -13, 206, -96, 23, -50, -26, 103, -162, -87, -13, -216, -92, -35, 34, 1, 1, -154, 55, 47, -143, 134, -182, 139, 15, 26, 125, 248, 163, 466, -129, -182, 118, 85, 120, -271, -199, -2, -59, -187, -86, -11, 109, 3, -15, 133, -51, -10, -47, -273, -36, -28, 413, -160, 242, 218, -52, 161, 360, 220, 386, 310, -24, 69, -100, 7, 17, 15, 70, -10, -282, 86, -111, 14, -98, 70, -213, 54, -102, 0, 10, 204, -154, -89, 338, 53, 157, 158, 136, -2, 116, 83, 326, -81, 155, 109, 156, 114, -6, 258, 10, 253, -35, -59, 86, -202, -143, -198, 99, -135, 19, 77, -240, 68]
2524F8J32m15J64L82m25J2K44n2k76K22K60n52L43Lk82J75L14j49k58j42J19k25
2546c38M07J17j86k2j59L05k03K56rj68k27L59k67J2L50j06k17J59L3q6O5J85
2568B60j33j89K54r3o9pN0k28K07j27j35R8M37l81q3K68j93j25J93j18R1K32o6
2591A43m06R7K79L2l85J38L48l70O4L20J0l16M50m29k11K30J04l51K94L0j76J64
2613E9N3j09k37L92m29L44k03K31k74K18K47l43k19N81k33j43K28P0j72j30N05
2634D36o09P4n8O5k07L55m56M35L2m9k27j27K50o4N8M0K07j87n2J63l0k24L59
2657A84L6l30L80j96k73K52J61k58mP3k43L49j60O8j08O6K20l74K06j2l42P1J52
2680h2R6o5J03j89J78l4R6k5K8O7l65M21n7j92q3K11k68J48L2K48j83p5L3j28
$$ y = [68, 200, -215, -51, 331, -94, -82, 162, 110, -166, 56, 316, -236, 107, 110, -172, 3, 317, 168, -90, -232, -113, -338, 69, 186, 0, -22, -181, 124, -79, 177, 168, 0, -227, 132, -135, -123, 227, 121, -96, 63, 96, 10, 75, 260, 127, -62, 192, 99, 30, 23, 73, -155, 52, -75, -210, -112, 325, -56, -139, 129, -64, -189, 4, -114, -23, 209, 143, -263, -166, 113, 145, -240, -102, 246, -124, -60, 260, 270, -46, 404, -25, -236, -6, 98, -253, 41, 71, -105, 59, 112, 3, -234, 158, -271, 73, -130, 101, -173, 45, 292, -51, -270, 311, 78, -65, 163, 233, 61, -69, 436, -173, -99, -157, -92, -299, 56, -400, 35, 67, 18, -209, -336, -86, -150, -92, -52, 155, -32, -84, 79, 49, -175, 184, 220, -110, 270, 74, -199, 53, 214, -44, -48, 25, -218, 131, -29, 39, -69, -3, 217, -157, 49, 37, -305, -234, -82, 14, -51, 52, -137, 41, 7, 103, 78, 106, 173, -192, 229, 172, -20, -103, 108, -160, -12, 20, 268, 85, 10, 43, -85]
2704h5p9pJ39j09K1j14J37O6J70l44L05j75m3L9P6M8k05J10K00j61k17K76J4j54
2728i2N7K09l67M99j41j35r4k98K64J22q2J0J66j77J3m6J15j5K7j81J80k9j77
2751a72k5K79O3k64M95k43k01p8K11k17L45j10k04K92p7j88J51j90K29k95K06
2772GJ27j56K42j51k55K63j01J46k00J73k30J67n0k37P5M33j8j3k54M1j7J56r
2795A39p5o6J86l14n2N43n90L03o9j1j52J9K00j27n8J50J12p7Q8k22o1p3k9L89
2819A53j07Q3J90j23k40K79m47M12j82J76l43J49r9J70o8k08K32K5j54J50j18
2840g0k09N56k11j45l0L04Ok6j44j74O7K91k10K5k1Q8j02j19Q8j11K09k7K33l88
2864a20K38l90K13j97M82l93q2L44o6j99K00j24L38j66J44j8j85j63L50k44p6
$$ y = [-85, -164, -171, -32, -141, -120, -234, -97, -31, 139, -205, 100, -75, -118, -79, -3, 45, -160, -50, 150, -11, -228, 48, 62, -92, -35, 174, -193, 306, 165, 30, -64, -362, -98, 24, -58, -48, 118, -59, -46, -92, 23, 8, 35, -146, 34, 5, -172, -197, 82, 145, -119, 376, 133, -68, -146, 65, -152, 193, 83, -121, 171, 94, -94, 57, -133, 96, -199, 7, 134, -22, 220, 69, -186, 77, -24, 122, -78, 95, -135, 32, -18, -255, -180, 253, 235, 222, -32, 9, -8, 148, 139, 64, -2, 184, -130, -182, 361, -229, 74, 5, -6, -158, -139, 61, -66, -124, 26, 138, 61, 149, -73, -134, -207, -236, 153, 46, 129, 319, 196, -44, 235, -212, 200, 18, 194, -149, 0, -99, 71, 3, -205, 27, 52, -102, 48, -70, -279, 277, 66, -79, -109, 195, 201, 175, 31, -143, -76, 215, 5, 30, 9, 97, -5, -124, -36, -147, 62, 35, 268, -120, 118, -272, -59, -256, 226, -167, -249, 95, 29, -170, 30, -94, 244, 78, 222, 204, 19, -144, 206, -38, -114]
2885a14K36k5k73J81J85l10L74l69J14j1K67k89j27j48K38j15j7J0J93O2k70J47
2907f1j4Q3M3J14j47K7P3k21oL81k26j07J28m1K9p1p0J90k08P6P6L2n7o2j79J28
2933i0q2Q4M0j89K92nN2k21R7Pn4J54J20l58R4R4j27K34k8j66L32k66J21J5p0
2958H0m54K50N9J34k9K63m06M7K63l50L8J00J11k17J66j00K04j22K07k30j95L76
2980A95k25J20M8n3q1K63j23j01J46j81J18k95L95j19k34l3L05m23K03K20j55
3001a0l43L42K0j23r6L5L31j68N3p6m7L0L13k24lO2r6o1K74j84p4M2l2J4n2R7
3027B4j36Q7J36k71L08k5k16M7r4J72j37K37j29p5KM5q7kN8j80J89q2J16J2j35
3052a36p0J96L6K10k13j02L67l47n1K80k51J69orj91O9J13j60J49j90J86k30L45
$$ y = [-114, 122, 97, -176, 5, 190, -120, 254, -115, -1, -12, 255, -34, -161, -309, -71, -186, -203, -193, 0, 62, -208, -61, -75, 8, 51, 165, 18, 45, 118, -103, -109, 272, 46, -61, 67, 26, 55, -16, -86, 104, -104, -28, 48, 80, 23, -39, -218, -90, -172, -88, -48, -237, 55, 50, 102, -119, -22, -15, -69, 85, 205, -153, -59, 35, -92, 142, 114, -52, 280, 14, 135, 150, 80, -374, -124, -65, 69, 40, 303, -103, -56, 207, -143, -105, -5, 106, -111, 55, -45, 159, 37, 244, 14, -181, 195, -30, 90, 138, 85, 4, 267, 144, 43, 189, 8, 126, -169, 226, 107, -127, -160, 145, -278, -75, 145, -10, -353, -11, 9, -114, -210, -175, 156, -12, 41, -35, -82, -52, 261, 37, 34, 96, 0, -61, 213, 29, -45, -3, -35, -21, -73, 24, -112, -25, 111, -160, 148, 123, -93, -46, -140, 32, -105, 132, 3, -72, -70, -25, -112, -114, -56, -236, -47, -129, -13, -1, -136, -206, -10, 26, 236, 23, -79, 288, -59, -110, 170, -81, 88, 82, 73, -118, -49, 64, -96, 53, -137, 49, -181, 164]
3075A64ll54K49m1j01J85K2O2j81j59mM0J73K81m94P4o5K15J41l12N5q1qoP9K02
3101A33l11K31J05j60R4k00J91N7k55R1J06q8q8oK22k26K04J3j23Rk24O67o46
3124b04K91J46k55L9j33k31L59K9o8j99j01M35m18L79O3k68N3LM25o84N0K41q8
3147a36N72l29j19J71J00j59j45Q6k29O7M1p0J18r3L9J73J86j99j51R6n2o3J93
3170I7k06M0K52k68L51p9k19K15K5j07J24r2j29r2L00k05k19K51K08k27J52k50
3192g8K65r2q8j67J72m1j7l55R3K33j30K61K37l90J62Q1k69J34L22n56K63j41
3214a01J74L0j56J10o1j75Q0j14J37j49M81n4j52N2j42J04j74J06j89J23J40j06
3236c6l9J16j48L16j21J41m09L10l00M24k03J83l41K3o5J79j51J15K85k24N1k24
$$ y = [164, 161, -193, 56, 15, -86, 99, 121, 183, 2, -157, -161, -121, 52, 333, -161, -87, -152, 63, 204, -108, -53, -134, -142, -148, -69, 133, -178, 53, 158, -2, 92, -108, 83, 140, -115, -24, 82, -6, -94, -100, 122, -104, 100, 113, -10, -1, -225, 442, -204, 87, 233, -22, 17, -116, -347, 12, 41, -27, -226, -327, 108, -310, 69, 132, -136, -83, -80, 345, -339, -289, -48, -136, 436, 107, -12, 159, 259, 100, -45, 41, -188, -121, -80, -150, -32, -125, -86, 87, 273, 74, -77, 19, -33, -96, 97, -109, -69, 183, -85, 266, 187, -32, 183, 208, 101, 225, 133, 4, -88, 212, 7, -212, 39, 247, 20, 172, -78, 187, 95, 7, -160, 12, -29, -46, -401, -308, -75, -205, 56, 293, -97, 65, 146, -123, 11, 333, -223, 40, -101, 73, 103, -53, 57, -4, -179, -99, -213, -76, -225, 256, 202, 50, 102, -40, 64, -110, -4, -193, -70, 70, -36, -75, 41, -107, 209, 88, 229, -180, 130, -170, 254, 51, 234, -107, -84, -149, 30, -121, -6, 279, 55, 106, -118]
3258a18N1j20J8J05j79K23q1n4L47k96j73M25j75q8K30l0r9J66k45J15KP4N5k87
3282a34L41k86J22j4k31K34K3j06O4j0j89kO7P2k15K21J4J68J01j22k17n3L33
3305A81j7l14K98j28o1K51k49J13j20O2m3p6KJ08%q8L0q8K45K3j30j72J45j5N0
3330Gk46L32n3M2qJ88l48K6N0j84J88K5K03k33j47J43m1J83j33k03J84j67K63
3353G1Nq7J7j84J44R9j26q9r0P4M77n54L70J96l05Q9J03k76L20j57j45j9J09P8
3377A20k02l3K92O0l43N2R7o2n7k54K28J24k69K67m5N4j29l7Q4J88r7jj0k53K38
3402A2L25l74K5Q7N5j07n5K30k33K67j56j56P3J21J58k90P5q0J72j32k90L11j05
3425f7J78R7k43k63L6M54j23j44J99j89K71j91QK58l55K22k86J33J73k61J64j67
$$ y = [-118, -67, -187, -169, -64, -243, -20, -101, -155, 192, -104, -277, 148, -27, -115, 115, 85, -14, 152, -93, 22, 24, 98, 153, -134, 207, -79, 43, 29, -202, 32, 55, -51, 13, 3, -186, -188, -121, -49, -264, -43, -29, 139, 240, 118, -99, -152, 181, 164, -150, 148, 20, -41, 210, -39, 74, -46, 16, -27, -103, -101, 7, 7, -81, -51, -139, 106, 129, -1, -173, -28, -43, 7, -239, 93, 40, 82, 74, 262, -86, -60, -10, -194, -6, 19, 222, -11, -158, -15, -56, 127, -6, -209, -25, -192, 71, 76, -11, 6, -178, -34, 65, -61, -150, -240, -166, 311, -243, 127, 323, 18, 107, 210, -66, 254, 97, -48, -67, 42, 120, -82, -115, 177, 237, -106, -54, 43, -19, -76, -330, -102, 22, -247, 20, -25, 29, -100, -137, -53, 135, 38, 37, 27, -226, 12, 337, -37, -12, 75, 130, 23, -32, 198, -35, 232, 76, -80, -7, 114, 272, -18, 57, -23, 149, 17, -273, 38, -67, 111, 208, -35, -298, -262, 192, 69, -75, 124, -65, 206, 15, 23, 281, -74, 148, -138, -5, 168, -93, 71, -96]
3447i6J04Q4l38K5R9L4rJ87pj20r1K00j83%j58K32RJ41J0j17K38k01j26J13MK11
3473B45l04J87J62P1l79Q7R1j50j55K26j16r7P9J80l5j12O5P6J0j43q1L39j30
3496A16N6k07o4L3J11K4k64L66j99J7j20M5L84k54J41Q1l89J54j47RJ69n0j22
3519a10K55k10Pp3K36j97M3j5Q5j2k18K42l01J56K41k23K03n3J5j70K55o7j67
3542g8m7J45n4j01m2K1J61j1k8K72j57Oo9j06R1l4K4J80j27K05k14o%j96K29j37
3568g3R6l35L23K8r6J98m9R9j86RN6r5p1K7P5Rj57J59k27L24N7J3O0l27Q9L3k08
3595a69K55J2j72J64n0L0K06m55J62l4L27j10l8J30j81p8Q8rj57j23J41L00n49
3618c10K33J38j39j45J19K16j12R2n0jK5j24K19q4j59oJ57K55m55K81k52J16L1
$$ y = [-96, 8, 92, -246, -221, -122, -88, -97, 90, 83, -37, -128, 72, -111, -111, -269, -37, -28, 113, 123, 6, 244, 43, -83, 30, 34, 245, -59, 128, 290, 361, -18, 69, 160, 10, -145, 81, -35, -132, -53, 127, 92, -20, 45, 121, 131, -12, -93, 246, 116, 172, -35, -99, -66, 45, 69, -195, 171, -28, -11, -131, -86, 298, 44, 185, 266, -123, 31, -116, -107, 62, 12, -110, 145, -65, -58, -131, 105, -92, -49, -64, 21, 9, -209, 33, -268, -112, 129, -94, 109, 56, 71, -99, 156, 89, -78, -125, 20, -34, -135, -177, -156, 5, -6, -34, 238, 81, 87, 18, -88, 3, -31, -7, 173, 46, 251, 37, 31, 31, -165, 64, -73, 23, -312, 11, 39, -57, 141, 92, 191, 5, 14, 70, -25, -96, -69, 6, 15, -142, 17, -210, 114, 171, 184, 244, -83, 6, 39, -169, 86, 98, -74, 90, 40, 70, 276, -179, -17, -51, 276, 166, 128, 258, 77, -1, 87, 78, -79, -202, -61, 239, -310, -77, 61, -78, -223, -104, 112, 0, 92, 42, 41, 66, -58, 161, 77, -82, -88, 69, 324, -131, 150, -102, 14, 45]
3641D5l20L82k26J52j0r4m4J22L4j98J67m9J07k41J73K59k48M8j40PM5n4ll9K35
3666A10k5o0J86k23Mn4K34j4j49K6N9k11J66J43m07J98J39k10L97k93j1k03M33
3689B35l18J58J33l02J18K5j07Q7L2k91L84r4j23p5J91k2L3j93J97n5k7K15l45
3712a44j0L6j39K18R7p6QJ48q5O8p3k17K29j88K06j53jJ41Q7j30m25N17j35k13
3736b34M92j89k67J18J12k5p8L37l56J46j00o9K29m0j63O8k3J19m42K23O6N00
3758D24m07M27p67K81K3l4K39j59J75k73n2K67K3k87J87j65O9n0J38K24k72j11
3780a00O5N1r5K5OP0mk61L06k15J46J17k15K86k40N8J06j52l5j22J81JqjK23p1
3806A22J26l46J8K64k25j62K69o3M7k03J35N4P2j66L9P0j03n6L08p0j7k4J96l0
$$ y = [45, -275, 107, -119, 33, 23, -71, -115, 7, 41, -157, 10, -39, 68, -173, 0, 259, 11, 59, -81, -74, -29, -83, -86, -125, 110, 85, 25, 211, -12, -8, -62, 172, 158, 9, 35, 94, -117, 49, 192, -215, -17, 122, -88, 309, 16, 5, -198, 235, -83, 75, 208, -94, 24, 49, -58, 29, 61, -230, 154, 60, -63, -138, 53, 31, 64, -129, 68, 13, -14, 201, -144, -154, -118, -257, -39, 58, -18, -10, 138, 53, 121, 48, -169, 60, -128, 78, -75, -76, 65, 152, 22, -403, 114, -21, -234, 258, 69, -198, -80, 32, 7, -71, 266, -90, 56, -44, -113, 116, 76, -87, -19, -42, 77, -365, -142, -76, 424, 17, 444, -323, -42, -19, -53, 186, 27, 202, -71, -123, 144, 167, -120, 67, -98, -29, -79, 59, 283, 11, -100, -35, 16, -79, -54, -48, 22, 18, -243, 63, -152, -6, 111, -104, 182, -58, 0, 106, -46, -81, -203, -22, -21, -29, -30, 193, 122, 248, -98, -80, 184, -41, -203, 66, 3, 50, -153, -18, 36, 108, -58, -19, 51, -52, -108, 200, 130, 113, 89, 285, 255]
3830B55o4j29j64m5Q4Lj48K58M4j41j78O3M40j70q1r9O7j85J86J36m03K84K15
3853B28m14K24l01R2J21k3R5j42P0oJ28N5J6J54m16r7J87K0k31J12%J15j4J1N9
3878D3j30K79j61j54M93m22J16k19J31J94j49K9M9k25k9K17n7k60K24J15k28K90
3900A46k84j6K41j29j00O3J22q9J78j87pj2MJ31J17k55n4K03qk73J95J07j98J85
3924H0j40M28k66l42L47l42J40o4L45j00j99R5J30j45J16r8q3p9O2m8K85k80J22
3947c6J89j79J00p0o4M4LJ40l53M26k29l4P1QL4j34J71l21K19j71Q3M2OK15j05
3972E5q6K29J62l03J93r3k11p3K98m4k13m3J85L1l7N1n5l02O90l15m3J16k31L5
3996dj42J41k08J21J36j77N8J97r8K5j21lJ16K83q7l35L22j79j01J8P6m1MJ19
$$ y = [255, 191, 62, -102, -147, -63, -60, -208, 50, 94, -47, -225, -162, 278, 108, 27, -72, -5, -190, -4, 132, -271, 13, 228, -186, 38, -263, -171, -50, -73, 22, -120, -50, -56, 72, 127, 143, 297, -119, -216, -29, -9, -240, -128, -128, -13, -27, -16, 43, -87, 192, 31, -123, 370, -52, 64, -155, -24, 170, 21, 50, 99, -126, -155, 62, 5, -255, -31, 84, -144, 146, -138, -154, 87, -42, -142, -79, 43, -46, 132, -55, -62, -74, -70, 61, 178, -77, -131, 72, 64, -209, -14, 93, -105, 80, -60, 368, 102, -240, 107, -235, -95, -159, 186, 86, -113, -18, 112, -33, 83, -15, -98, -177, -115, -163, 122, -158, -36, 153, -26, 74, 4, -60, -16, -13, 127, -226, 200, -29, -63, 8, 16, 50, -84, 87, -234, -15, -186, -103, -61, -55, 160, 55, -31, 198, 360, 57, 250, 157, -54, -127, 171, 127, -86, -129, 56, 87, 50, 101, 46, -256, 434, 119, 76, 192, -39, -4, -146, -5, -213, -92, 44, -133, -75, 122, 24, 49, -72, -75, 41, 324, 237, -98, 224, 45, -56, -38, 38, -3, 1, 120]
4020A20M2k63j91K45K2J36J81j91j4R2mj08K03k42j65L7J75k38J13J17l04L41
4042A04K4l33J66J64k72lK55j7m0j16o2R5j76K39J94k49o6J03L7J58l71k16N71
4065A89k00J17k06K11k03K18o5n1J05k44kk00L30O8l24K74J17j95J53R9o8j32
4087ij24K75j35M7M6J04P8o08M99k18P7R6j88j06n2O8J23O4k4j01m5K99l33K89
4111A22j74p2N1RP3N9J10j17j30l2q6L12q4pm0l06K94pj01J16KJ59j40Q4l48L77
4137A24n9n1NQ5R1r2K51k28M4l9m6K02k50q6J84o3r2J11l2O1k10J56qm8N3o7q7
4164i1O5J53k57J24k53L52j26j79J95Q1J6j28j02M29l67K52k52o8L80j90O6%o3
4187C7j51J22p3J21J82l31J82J07q2k36K34j18L0k02M7M5O1J45l40K43k36K75
$$ y = [120, 162, -101, -292, -47, -25, 111, 292, 101, 87, 179, 175, 67, 270, 28, -137, -100, 75, -163, -50, 67, -237, 104, 128, -205, -39, 125, -147, -150, 105, 88, 48, -68, -130, -35, -211, 28, 222, -27, -93, 10, 47, 205, -166, -382, 189, -11, 106, -100, 111, -92, 126, 61, 10, 115, -129, -131, -331, -1, 67, -257, 17, 134, -61, 92, 191, 123, -9, -133, 142, 7, 54, 100, 204, 282, -326, 173, -45, 32, 128, -60, -166, -218, -150, -27, 37, 13, -88, -133, 166, -167, 122, -52, -124, -73, -64, 9, 68, 178, 61, -69, -101, -187, 125, 41, 34, -6, -312, -18, -25, -126, -10, -8, 151, 11, 95, -253, 124, 65, 14, 19, 104, 195, 103, 354, 126, 170, 131, 85, 287, 37, -49, 135, 72, -20, 91, 59, 120, -90, 66, 58, 10, 63, -4, -91, -26, 127, -130, -6, -259, 93, -33, -212, -17, 64, 80, -48, -150, 279, -88, 164, -88, -156, 224, 34, 100, 100, 37, -114, 8, -65, 56, 238, -93, 89, 196, 114, -122, 112, -6, 24, -178, -131, -86, -25, 120, -220, 23, -213, 62]
4209F2J7j73J49j21j16J6J90O7K01l76K08k93L31m74M19p6l6Q6j7j00k55L40k08
4232a59J13O1ROk70K13M9R5j32j42L25j77K33k14l9J23rk6q9J07k72K82l14P8
4256a49M3k3L38l38O8Qj04K59j45J0J8OK03l47K69qk70J13K10l33L77q9J05m68
4280b47K60J03k88m2M24l93J87l8o4R7o3j8R4nj74K16q2J2j72K95K53l61N0R9
4304A43j69m6N7q5J20J05k34J89j5J88j80j10k18N09k39j30J26J07J00j99j73
4325a54K19q0p2K27j89N7P3j79P5L7J8k84K73J03l26O2K15n8l12K64K35k86K75
4348A93j34j1J10k2l9j90K61r5m57K57J81k53j5j7K40l8q0K57l2M2j37K07k63
4371c5j71Q4K33k0j58P9R2p7L6Q8r9m14L68J63j83J09o7j63K5J67Jj82m5J59Q
$$ y = [62, 79, -94, 55, -66, -182, -166, 24, 91, 292, -84, 124, -169, 162, -312, 107, 31, -5, 81, 64, -36, -291, 49, -159, -46, 15, 24, 30, -240, -27, 22, 117, -15, -157, 168, -9, 224, 10, -29, 94, 85, 59, -30, 77, -195, 87, -227, -149, -106, -129, 209, -129, -61, -53, -157, 102, -43, -33, -15, -9, 194, -153, 116, 108, -162, -49, 161, -172, 205, 116, 221, -247, 13, 116, -172, -214, 210, -183, 4, -34, -98, -1, -64, -82, 12, 7, -167, 49, -33, -21, -193, 102, 355, -6, 44, 143, -26, -72, -15, -100, 20, 125, -109, 80, 65, 253, 73, -37, -255, 254, 15, -115, 11, 118, 218, 19, -154, 65, -15, -87, 140, -49, 8, 81, -98, -23, 14, 32, -252, 21, 124, -202, -140, 75, 17, -295, -31, 204, -82, 193, 59, 48, 158, 136, 97, -93, 168, 73, -384, -127, 54, -199, -214, -231, 9, -29, -109, 148, 116, 158, 21, 228, -35, -206, -122, 111, 91, -67, 12, 104, 27, 63, 151, 52, -362, 6, 169, -14, 95, 28, -135, -110, 57, 58, -124, -169, -10, -2]
4396bj15R9K4J48k52K28l12L91l12J81j67K17j65NJ76j66K5k24J11r4K39O4k46
4419a47K91L3j90k46L98Q7j30Q6k60J34r0j23K7K4oj7P5j39m5K66k40N0J00J07
4443D5q3j83P7L68Ol31K88k37P0n6o3J90Q0k03J49K03n16L47p6j55o0K02r1J8
4467a1K2j49J33J74M9j88P4m3J28p3M2k13K14M4j02q7mN3kl6J2l6M8L4l0o6J14
4494A01J15l12J69J0N0k73J71j05N4R5M4j51P8J96j39l00M45j10k76K4J15R4q5
4517A0N7k37N4J29Ol7M9J3o0L7j70R0K54k71J66k5k87K96J29k08Q6R3k46o8M3
4542i7J74j88o2L84l52K34M6m7j97K23k57J58k21M4J95j51K59l50O7L61j00m4
4564G9l8l30J54L2K85j41r7K31mK1p0n5j58J64q5j39J49m1L9J50k69J02n9L30
$$ y = [-2, -117, -18, 6, 154, -98, 130, -182, 209, -103, 78, -89, 128, -37, -32, 144, -22, 3, -221, -110, -204, 35, 99, -147, 144, 177, -13, -259, 139, 226, 96, 182, -78, 56, -34, -157, -130, -106, -112, -129, -54, -193, -238, 28, -212, -162, -62, 45, -38, -221, -144, 224, 230, -101, 187, -50, 20, -36, -99, 91, 171, -32, 117, 320, -196, 151, 75, -80, -140, 62, -29, -11, 11, -138, -5, 169, 218, 30, 104, 61, 189, 116, 158, -55, 159, 203, 101, 14, 10, 63, 61, 25, 37, 1, 49, 83, 53, -13, 101, 216, -96, 73, 83, 133, -140, 31, -74, -20, 75, 119, -32, 46, 242, 103, -197, 248, 138, -138, -114, 1, 95, 10, 67, -170, -116, 13, 19, -18, 31, 44, -16, 21, -149, -59, 195, -76, 90, 65, -222, 74, 203, -5, 81, 174, -72, -140, -97, 77, -111, -173, 211, -141, 93, 139, 92, -105, 118, -139, 19, -202, -158, 37, -114, 145, -205, -138, 223, 123, 79, 41, -289, -135, -103, 182, 41, -56, 175, 171, 192, 122, 67, -91, 73, -12, -151, -2, -43, -4, 146, -123, -21, -80, 250]
4588B50l71K69k28PQ3l1K9P6k37J69j89J54k6L0J44l3q5o8J35m50N07j44K60l21
4612g0J28k0j59L59k37J44j32%j14k3K70l02M5O6p4J48q4O0j01K22m3j62J0L3
4636c6L25l79J29JJ55l69J37O0r2J12j81MM30p6l03k05M85%j49Q6J1j79J29k68
4660a73K13J31l61J85m8J19m0P4Om38J73m2K05J05k57M9R3j51J32N4k21J38j7
4683g1J72p8k05L63l01K46N0k54J31j60N9J09J14K3j09j61M43m78L9J27M8j30
4705b3P3N1k56M5M27j86j20k0J58l8k27J09J12r4j5p8r5J99J77n42K11n6L0L72
4729B14k07M5j56R9J13k1l30M10k66L73j43j0q3L0m61M78j66j08R7J2o5K79rj44
4753a9R1oM0j96N9jp9Kk2k01K00L6J60m9J7Qq6j68K62m2j91K37j69q2K80j70O3
$$ y = [250, -121, 148, -80, -73, 10, -21, 8, 84, -153, 16, -173, -19, -45, -15, 129, 96, 11, -57, 78, -372, 135, -9, 251, -70, 58, 38, -121, 238, 1, 145, 13, 13, -101, -124, 146, -156, -111, -45, -119, 29, -55, 5, -96, 126, 83, -79, -69, -36, 289, -90, 39, 40, 195, -174, -37, 23, -69, 43, -138, -134, 296, 220, -83, -288, 197, 197, 48, 134, 145, -34, 95, -173, 40, 171, -190, -5, -53, 66, 26, 100, 106, -332, -159, -201, 4, 109, -148, -99, -6, -157, -25, 29, -192, -54, -71, 101, 23, -182, 181, -120, 126, 176, -78, 53, -107, -48, 61, 175, 198, 89, -72, 371, -107, -68, 59, 107, -23, 50, 101, -155, -110, 317, 131, 11, -9, 149, 111, -116, -7, 105, 11, -4, -82, -177, 22, 199, -343, -132, -188, -158, 214, 7, 52, -104, -5, 108, 87, -243, 167, -99, 274, 131, 121, 38, 68, -393, 85, -81, -189, -92, -80, -145, 134, 125, -19, 72, 66, 106, -90, -31, -32, -111, -109, -131, -332, -132, -96, 64, 15, 32, 40, -46, -214, 48, 6, -185, 52, -117, -199, 81, -89, -26]
4780b6R1O3k63J80Q7l74L01M5m7jj09k35L71p8J90k41J3P0j5m1N2K6k31J62j90
4805b00L21l15L18Q5k73k0j9J57j20%K3j16L08r0o4k50O4O4J21J45j74q0K21J40
4829B46q0j34j49J54Nk03J19p5K82j97K55r5j57P9l2k9J67j49l31M06j05k51L51
4852G7k98K9L29k12%M9J00j95K42M7p2j86Q0M9J30k10J1O2om3J42K24k79j12J46
4877A04j50j77O55m39j13K0J37j51J97r2j08Q8J58J24N3j53q2k90R9K47j32K94
4899B89m33O7L05k74P0q2K61l92K83j80mj92Q2L40J99m21J37k04N6J80m4M5j8
4922G0l55K39P3j1J63j97K08k72J60l41K49J47O5l00O6j88L23n1ln1j38J26K8
4945A0J02r6%p2R6m1o1J30j56J16j4K22l89J82Q2l5l4j57m1J50l7J96l12j23M98
$$ y = [-26, 65, 128, -135, 45, 132, -242, 59, 104, 57, 56, -53, -288, 83, 5, 195, -46, -33, 37, 22, -19, 33, 59, -172, -10, -200, 121, -194, 124, 209, -64, -84, -103, 54, -66, -66, -43, -159, 149, 59, -5, -255, -191, -127, -6, 139, -35, -115, 106, 246, 166, 32, -117, 37, 42, -161, -42, -117, 165, -32, 223, 128, -29, 50, 18, -11, 156, 7, -324, 82, -23, -274, 77, -221, -192, 137, -75, -75, -26, 74, -121, 121, 168, 96, -90, -10, 39, 169, -41, -30, 32, 26, -17, 125, 349, 70, -42, 104, -46, -223, 432, -7, -120, -100, 37, -114, 83, -9, -117, -29, 129, 253, 306, 153, 71, -219, -120, 127, -5, 289, -144, -77, 228, -46, 24, -58, 203, -189, 94, -86, -90, -282, -200, 140, 339, -82, 55, -149, -93, 87, 43, 88, 70, -285, -46, 27, 16, 179, -18, 190, -82, 78, -263, -14, 133, 198, -102, -36, -224, 99, 48, 45, -6, -144, -18, 10, 112, 16, 16, -56, 40, -1, -62, 68, -88, 28, 14, 236, -153, 29, 111, 76, 42, -115, -156, -6, -43, 153, -159, -282, 216]
4970B16n15K96J1M5O0k40o0K66O7l71K28q0j35K77J80l87J63Q2J14n77M30K7k15
4993a18O6J23o3Lk1O3j98p4J94O0m8J00j7P2n5j63J83n3O9m20L26o1j67J13j95
5018b81L90j05K74m36R8K30j41k58K69k2m6k04K49j24m2K10o8N8k27L34j15kK5
5041F6k97K55r3q5j21K63o3K22m40J01J39j42K32j70K69k47L09j47Klj64J68q5
5064c1q8K2L50n29K33j9L07k48N3RM9r1l63L06j3L66k72L5k20N3K11r3Q4j31j38
5089a58R4L0P2l19K91o8J6J65M8k33K46p3j65n0j2J97R2l00N9o9O9J56l2k2P7
5114A11n6k0j10r3L42m7p7K01j47P6Jk56J10j71J12j27J94J57N5l77J06Q1N1j29
5138a3M5j53L89l42m7Q6k1N6J96j27j73J86n4R5l2r8J97k40J57j69R8J02p1k92
$$ y = [216, -299, -3, 8, 53, 113, -127, -187, 79, 146, -225, 3, -77, -212, 65, 245, -142, 21, 103, 217, -360, 70, 97, -118, -52, 71, 8, 11, -10, 53, -145, -219, -25, 35, -13, 87, 70, 142, 87, -76, 107, 54, 123, -297, 29, -32, -199, -86, -281, 109, 4, 278, -158, -60, 170, 29, -229, 40, 18, -28, -232, 17, -107, -149, 61, -7, 51, -176, 158, 43, 41, 66, -231, 24, -69, -154, -275, -12, -75, 147, -293, -192, -53, -195, 37, -133, 136, -111, 198, 51, 53, 50, -114, 54, -31, -119, -97, 253, -276, -43, -62, 245, -3, 50, 59, 108, 17, -346, -40, -53, 313, 41, 76, -144, -91, 120, 27, 111, -20, -158, -64, -34, 38, -281, 10, -58, -42, 123, 171, -62, 184, 111, -54, -104, -116, 81, 173, -127, -68, -137, -68, 88, 56, 34, 111, 55, 35, -75, -168, 174, 127, 50, 251, 104, 180, 181, -75, 35, -136, -24, -151, 43, 200, 255, -122, -16, 65, 116, -13, 32, -121, 268, -74, -121, -35, -56, 0, 196, 69, -104, 82, 28, 123, 91, -7, 190, -50, 107, -62, 36, 138, 67, -225]
5162b25J91Q5j6O7k20J78j39J90J76l31K44m44J96k2N0J05j72J21O1o4L6j24K71
5185B14J03k56Lq7LJ46p3q8J99l04L51k71J73k70J11K70k91n5J17RR5J79l02L7
5209A3n0J5j96J82L10j91o0P2j93l7K33l8k0j19L5M0k65K93Q3k31M9M2p6K72l11
5234a48M50n63J37K87l58L74O3j89r6L8l2j62J10J13m5J25j37k0r0J16j6N2J43
5257A52Q6l17p3J55R4p8K42k51P7j27J52o4M3J84n26K87K1j58l7J95Q6N8j71J02
5281A32j86Q9o7K5K83j17J18l60K69j50M0J60l52J75r8N6K18l13M1J35n5l29J72
5304a14J71r8j47J38J8j9P6r0R2Kl6j59O7J64O5q5j90L3J46j46K73k97J99ok04
5329a47N5r6J40K01n3o4j88K22j63m5M2l5N0M6L09L9l73J8K46j61o0k21J82o9
$$ y = [-225, -34, 51, 35, 102, -118, 60, -79, 111, 287, -44, 200, -244, -48, -70, -20, 85, -87, 34, 95, 31, 67, -57, 214, 317, 61, 64, -23, -20, 126, 53, -35, 164, -140, 211, -60, 113, -157, -46, 224, -67, -122, -5, 4, 99, 278, -24, 13, -37, -22, -218, -36, 274, 83, 23, 95, -98, -135, 98, 60, 40, -79, -44, -4, -269, 24, 107, -124, -75, -33, -109, 163, -148, 302, -261, -124, 163, -195, 179, 242, 53, -43, -5, -37, -199, -89, 24, -21, 104, -33, -53, -143, -27, -43, 9, 152, 238, -79, -152, 3, 97, 19, 261, 10, 87, -40, 112, 48, 91, 275, -251, 36, 57, -101, -138, 57, 143, 201, 30, 132, -54, 35, -32, -7, 276, 159, 277, -83, 186, 36, 76, 236, -116, 59, -39, 17, 235, -78, -37, 98, 43, -286, -114, 57, -41, -188, -50, -32, -51, 25, -65, 27, 29, -7, -166, -99, 65, 130, 45, -145, -112, 34, -112, 161, -136, 63, 57, -147, -92, -188, -48, 153, 100, 36, -152, 70, -93, -138, -96, -131, -81, -35, 274, 313, -60, -42, 204, 43, -17, -238, -56, -125]
5353a25J98J4O9J34k42J40l99j6J43L2J11j3j04R2P4k63J2J7n7J67L15k34j31
5376f6N2R6j48j9L06j57J95lJk83R1p9J82q7L7JP7M4k21K37j32j32JJ68p8j53
5402g0K04J06j04l2K1j26L0j19j23K78k02K9J64l8q8j55J76L36k82R3o0K2j71
5425a11K16r7J14k71K01j61L3K60k48J71pk04n6K69M5J52m70L14k0j35Q7j83N7
5448d4J69j2l8j61J69J24l10J71k78K17o3L7J05j84O8J83j22j11J54k1P6P8l32
5471a25K84k14R2j70O6P2N2K11n03J06J00j01P4J45L9j45J24j84N0q4j1k7J83
5494C4j81J09k32J92k02L61j88K61k2O0k37j54L87l96K23m3l3L26k45J30l65K60
5516D5P4k11L07k68O4j7K19m09M3J61N5N5j11K9k51R3p8K33k38J13Q5j80J90K45
$$ y = [-125, 73, 87, 156, 290, 48, 188, -211, -227, -84, -52, 59, 46, -58, 34, 108, -155, -143, -126, -183, -16, 299, 65, -66, -14, 82, -66, -85, 221, 64, 259, 256, 257, -26, 65, -14, 168, 81, 118, 119, 196, 240, 19, 256, 124, -8, -7, 161, 83, -70, 134, 240, 136, 104, 125, -1, 29, -90, -213, 65, -137, -108, 56, 18, -70, -225, -49, 287, 5, 98, 38, 60, -111, 105, 8, 122, -149, 52, -109, -76, 184, -64, 107, 100, -104, -160, 109, 154, 306, -164, 150, 130, -5, 82, -101, -44, 125, 113, 75, -86, 83, 207, -103, 68, -210, 7, -56, -19, 86, -98, -30, 153, 31, -80, 74, 53, 129, 207, -125, 159, -55, 37, -133, -67, 5, 57, 268, -235, -129, -29, -130, -56, 89, 128, -17, 107, -77, -27, -111, -122, -149, 34, -147, -38, -270, -78, -280, 81, -107, 154, 132, 192, -45, -199, 188, -208, 15, -28, -61, 265, 20, 150, -215, 45, 119, -92, 215, -53, 11, -6, 213, -196, -153, 8, 63, 118, 7, 36, -215, -122, -200, 33, -205, -92, -7, -187, 3, 248]
5540B48j75l03J34O5J45j33m1J53m8j73J91k28r2K71J3K0K67m71J59P5j37J07
5562D7O7j57j89R1l7J03J37l0k08J26L4J26j27L1o0l8L8j3p6J7J67L2j63k3J4
5587i1K41j72J37k20j6M05k77m9J41k27O0K6J43q1K7j51J15j24J55jj43J53m6
5610Ej99K98j48J4Q1k45K35k86J65M4J42j26L29j89m7j01r4K23r4l02L93k6j35
5633f3n5n1J19lj24J42M1J58l0j79j04J64J35j23p2j41L67k50J75k28K83j72J52
5656A41p2j99J13J34k21J18Lj67L63q8qj75L2J18Oj06nk21K62M9m2oo0J97k32
5681f6j37K90m6k6q1L5J48j76K04O3j5k52K59m10K9K98n9q9j17J64L12l7j74J00
5705B17j12j41K03j04j23j0J28j47%J01j9L5q6K60j69j96L12j18J7j19m3J26K8
$$ y = [248, 73, -230, -96, -31, 114, -19, -60, 93, 45, -128, 63, -165, -257, 14, 27, 47, 314, -157, 2, 77, -60, 47, 114, -43, -232, -141, -178, -75, 62, 32, -176, -50, -16, 110, -17, 14, -46, -84, -46, -59, -135, -118, 49, 81, -82, -105, -91, 150, -22, 115, -105, -121, 284, 7, -42, 99, -128, -68, -42, 101, 20, 47, -104, 11, -113, 42, 41, -102, 51, 5, -194, 104, -44, -30, 51, -194, 41, -245, -80, -36, 106, -20, 309, 120, 73, -28, -122, 101, 7, -295, 98, 72, -63, -118, -169, -50, -53, -177, -35, 6, 164, 134, -45, -149, 15, 150, 27, -45, -186, 181, -69, 106, -122, 161, -11, 141, 69, -130, -17, 117, -104, 14, 17, -150, 213, 125, 117, -58, -26, 92, 98, -8, -13, -234, 28, 77, 35, 29, -31, 166, -66, -203, 87, 41, 15, -66, -31, 117, -59, 145, 208, 193, -59, 200, -210, -181, 117, 58, -31, -148, 16, 328, 291, 117, 217, 105, -36, 167, 63, -60, -70, 58, -89, -89, 12, -7, 28, -58, 202, 33, -163, 149, 31, 48, -71, -114, 12, 40]
5728D0k22J23Mk75N13k65J19n2K0K66j69k37m5L54j62j15J00j08j74L36j70L9
5750h0mO5j54l9K40J21k18O8L8l2J44O5l6k35L8n1L4L4N0j18q5K84j84M7j2j07
5776a27RlR8l0J01k6L5k17J79K12r2o8p5m8m3K60j35J21l24K08l05K8K97j21O9
5801Cl8R9k4k0J17k3n9j94J11j4K36k24k8o5L37m13J41qp9J23M5P7k2j13k44J56
5827a23J7k7R9J32j21m9J57p2J71j00k62N0Q0j22M31k69k92L29J9m9J10j61J67
5850A15L8j44n2J17r7m1l5P8P1mJ4j39j25kJ22R6r9m7J52J23j65K3J35n7m5J7
5876D9J0kj72J63j11pPP1J95k74nO6n7K10k14P8j19k9J40J81m50J58r7P2o3L35
$$ y = [40, -182, -59, -55, -330, 183, -82, 37, -15, 5, 271, 102, -135, -180, 174, 12, -103, -3, -111, -285, 51, -119, -80, -84, -19, -173, -212, 28, 149, -69, -1, 37, 5, 149, 214, 178, -57, -19, -70, -36, -2, 48, -70, -155, 129, -55, -8, -20, -127, -118, -121, -23, -53, 48, 22, 57, -160, 19, 231, 139, 71, -4, -52, -95, 165, 30, 151, -173, 35, -270, -242, 55, -66, 3, -35, 64, 40, 20, 137, 114, 55, -139, -28, -42, 194, -30, -58, -123, 214, -199, -58, -66, -145, -22, 23, 100, 78, -35, -279, -123, -106, -133, -34, 98, -23, -72, 85, 13, 184, 84, -178, -128, -48, -170, 261, -8, -300, 29, 48, -1, 109, -52, 115, 153, 9, -43, 74, -23, -64, -99, -21, 50, 46, 60, -79, -204, -206, -84, 12, -87, -134, 18, 141, -24, -1, 134, 77, 32, 49, 59, 57, -115, 48, -63, -70, -63, 8, 203, -71, -76, -10, -67, 143, -71, 7, -112, -141, -1, 180, -270, -112, -209, -137, -200, 135]
$$ [...]
8191i7
##END NTUPLES=NMR FID
##END=
