##TITLE=1H_SR112_2
 CDCl3
 8 sc, 
 17.03.2022
##JCAMPDX= 6.0         $$ Bruker NMR JCAMP-DX V2.0
##DATA TYPE= NMR FID
##DATA CLASS= NTUPLES
##ORIGIN= UXNMR, Bruker Analytische Messtechnik GmbH
##OWNER= root
$$ XWIN-NMR		Version 3.5
$$ Fri Mar 18 12:36:47 2022 Russian Standard Time (UT+4h)  she@DPX200
##.OBSERVE FREQUENCY= 200.131346
##.OBSERVE NUCLEUS= ^1H
##.DELAY= (6, 6)
##.ACQUISITION MODE= SIMULTANEOUS
##.ACQUISITION SCHEME= undefined
##.AVERAGES= 8
##.DIGITISER RES= 18
##SPECTROMETER/DATA SYSTEM= spect
##.PULSE SEQUENCE= zg30
##.SOLVENT NAME= CDCl3
##.SHIFT REFERENCE= (INTERNAL, CDCl3, 0, 15.7039)
##AUDIT TRAIL= $$ (NUMBER, WHEN, WHO, WHERE, WHAT)
$$ ##TITLE= Audit trail, XWIN-NMR		Version 3.5
$$ ##JCAMPDX= 5.01
$$ ##ORIGIN= Bruker BioSpin GmbH
$$ ##OWNER= she
$$ F:/spectra/data/she/nmr/H-F/1/audita.txt
$$ ##AUDIT TRAIL=  $$ (NUMBER, WHEN, WHO, WHERE, WHAT)
(   1,<2022-03-18 12:16:13.57 +0400>,<she>,<DPX200>,
      <created by zg, POWCHK disabled, PULCHK disabled
       configuration hash MD5:
       00 E9 B6 7A A2 85 ED C7 34 08 36 98 17 FE 4E 26
       data hash MD5: 16K
       B6 DC 2D 2F 80 15 F5 B0 44 62 17 18 CF 06 A5 95>)
$$ ##END=
$$ 
$$ hash MD5
$$ B4 D9 3C 1B 40 A5 BF 3E D3 7E 29 DA 34 53 A3 8C
##$RELAX= 
##$RELAX= 
##$RELAX= 
##$RELAX= 
##$RELAX= 
##$RELAX= 
$$ Bruker specific parameters
$$ --------------------------
##$DU= <F:/spectra>
##$EXPNO= 1
##$NAME= <H-F>
##$PROCNO= 1
##$TYPE= <nmr>
##$USER= <she>
##$AMP= (0..31)
100 100 100 100 100 100 100 100 100 100 100 100 100 100 100 100 100 100 
100 100 100 100 100 100 100 100 100 100 100 100 100 100 
##$AQSEQ= 0
##$AQ_mod= 1
##$AUNM= <au_zg>
##$AUTOPOS= <>
##$BF1= 200.13
##$BF2= 200.13
##$BF3= 200.13
##$BF4= 200.13
##$BF5= 200.13
##$BF6= 200.13
##$BF7= 200.13
##$BF8= 200.13
##$BYTORDA= 1
##$CFDGTYP= 0
##$CFRGTYP= 5
##$CHEMSTR= <none>
##$CNST= (0..31)
1 1 145 1 1 1 1 1 1 1 1 1 1 1 1 1 1 1 1 1 1 1 1 1 1 1 1 1 1 1 1 1 
##$CPDPRG= <>
##$CPDPRG1= <>
##$CPDPRG2= <>
##$CPDPRG3= <>
##$CPDPRG4= <mlev>
##$CPDPRG5= <mlev>
##$CPDPRG6= <mlev>
##$CPDPRG7= <mlev>
##$CPDPRG8= <mlev>
##$CPDPRGB= <>
##$CPDPRGT= <>
##$D= (0..31)
0 1.2 0 0 0 0 0 0 0 0.06 0 0.03 0 0 0 0 0.0002 0 0 0 0 0 0 0 0 0 0 0 0 
0 0 0 
##$DATE= 1647591373
##$DBL= (0..7)
120 120 120 120 120 120 120 120 
##$DBP= (0..7)
150 150 150 150 150 150 150 150 
##$DBP07= 0
##$DBPNAM0= <>
##$DBPNAM1= <>
##$DBPNAM2= <>
##$DBPNAM3= <>
##$DBPNAM4= <>
##$DBPNAM5= <>
##$DBPNAM6= <>
##$DBPNAM7= <>
##$DBPOAL= (0..7)
0.5 0.5 0.5 0.5 0.5 0.5 0.5 0.5 
##$DBPOFFS= (0..7)
0 0 0 0 0 0 0 0 
##$DE= 6
##$DECBNUC= <off>
##$DECIM= 32
##$DECNUC= <off>
##$DECSTAT= 4
##$DIGMOD= 1
##$DIGTYP= 9
##$DL= (0..7)
0 120 120 120 120 120 120 120 
##$DP= (0..7)
150 150 150 150 150 150 150 150 
##$DP07= 0
##$DPNAME0= <>
##$DPNAME1= <>
##$DPNAME2= <>
##$DPNAME3= <>
##$DPNAME4= <>
##$DPNAME5= <>
##$DPNAME6= <>
##$DPNAME7= <>
##$DPOAL= (0..7)
0.5 0.5 0.5 0.5 0.5 0.5 0.5 0.5 
##$DPOFFS= (0..7)
0 0 0 0 0 0 0 0 
##$DQDMODE= 0
##$DR= 18
##$DS= 0
##$DSLIST= <SSSSSSSSSSSSSSS>
$$ [...]
##$SUBNAM2= <"">
##$SUBNAM3= <"">
##$SUBNAM4= <"">
##$SUBNAM5= <"">
##$SUBNAM6= <"">
##$SUBNAM7= <"">
##$SUBNAM8= <"">
##$SUBNAM9= <"">
##$SW= 18.0517287032376
##$SWIBOX= (0..15)
0 0 2 0 0 0 0 0 0 0 0 0 0 0 0 0 
##$SW_h= 3612.71676300578
##$TD= 16384
##$TD0= 1
##$TE= 0
##$TE2= 300
##$TE3= 300
##$TEG= 300
##$TL= (0..7)
0 120 120 120 120 120 120 120 
##$TP= (0..7)
150 150 150 150 150 150 150 150 
##$TP07= 0
##$TPNAME0= <>
##$TPNAME1= <>
##$TPNAME2= <>
##$TPNAME3= <>
##$TPNAME4= <>
##$TPNAME5= <>
##$TPNAME6= <>
##$TPNAME7= <>
##$TPOAL= (0..7)
0.5 0.5 0.5 0.5 0.5 0.5 0.5 0.5 
##$TPOFFS= (0..7)
0 0 0 0 0 0 0 0 
##$TUNHIN= 0
##$TUNHOUT= 0
##$TUNXOUT= 0
##$USERA1= <user>
##$USERA2= <user>
##$USERA3= <user>
##$USERA4= <user>
##$USERA5= <user>
##$V9= 5
##$VALIST= <valist>
##$VCLIST= <CCCCCCCCCCCCCCC>
##$VD= 0
##$VDLIST= <DDDDDDDDDDDDDDD>
##$VPLIST= <PPPPPPPPPPPPPPP>
##$VTLIST= <TTTTTTTTTTTTTTT>
##$WBST= 1024
##$WBSW= 4
##$XGAIN= (0..3)
0 0 0 0 
##$XL= 0
##$YL= 0
##$YMAX_a= 149927
##$YMIN_a= -18212
##$ZGOPTNS= <>
##$ZL1= 120
##$ZL2= 120
##$ZL3= 120
##$ZL4= 120
##$ABSF1= 10
##$ABSF2= 0
##$ABSG= 5
##$ABSL= 3
##$ALPHA= 0
##$AQORDER= 0
##$ASSFAC= 0
##$ASSFACI= 0
##$ASSFACX= 0
##$ASSWID= 0
##$AUNMP= <proc_1d>
##$AZFE= 0.1
##$AZFW= 0.1
##$BCFW= 1
##$BC_mod= 2
##$BYTORDP= 1
##$COROFFS= 0
##$CY= 11.3945322036743
##$DATMOD= 1
##$DC= 2
##$DFILT= <>
##$DTYPP= 0
##$F1P= 2.36226072786647
##$F2P= -0.459571619588291
##$FCOR= 0.5
##$FTSIZE= 0
##$FT_mod= 4
##$GAMMA= 1
##$GB= 0.15
##$INTBC= 1
##$INTSCL= 1
##$ISEN= 128
##$LB= 0.24
##$LEV0= 0
##$LPBIN= 0
##$MAXI= 10000
##$MC2= 0
##$MEAN= 0
##$ME_mod= 0
##$MI= 1.114404
##$NCOEF= 0
##$NC_proc= 0
##$NLEV= 6
##$NOISF1= 3.799351
##$NOISF2= 2.8
##$NSP= 1
##$NTH_PI= 0
##$NZP= 0
##$OFFSET= 15.70392
##$PC= 1
##$PHC0= -17136.59
##$PHC1= 7.80078
##$PH_mod= 1
##$PKNL= yes
##$PPARMOD= 0
##$PSCAL= 0
##$PSIGN= 0
##$REVERSE= no
##$SF= 200.130013532006
##$SI= 16384
##$SIGF1= 3
##$SIGF2= 2
##$SINO= 400
##$SIOLD= 16384
##$SREGLST= <1H.CDCl3>
##$SSB= 0
##$STSI= 0
##$STSR= 0
##$SW_p= 3612.71676300578
##$SYMM= 0
##$S_DEV= 0
##$TDeff= 0
##$TDoff= 0
##$TI= <>
##$TILT= no
##$TM1= 0
##$TM2= 0
##$TOPLEV= 0
##$USERP1= <user>
##$USERP2= <user>
##$USERP3= <user>
##$USERP4= <user>
##$USERP5= <user>
##$WDW= 1
##$XDIM= 8192
##$YMAX_p= 0
##$YMIN_p= 0
$$ End of Bruker specific parameters
$$ ---------------------------------
##NTUPLES= NMR FID
##VAR_NAME=  TIME,          FID/REAL,        FID/IMAG
##SYMBOL=    X,             R,               I
##VAR_TYPE=  INDEPENDENT,   DEPENDENT,       DEPENDENT
##VAR_FORM=  AFFN,          ASDF,            ASDF
##VAR_DIM=   8192,          8192,            8192
##UNITS=     SECONDS,       ARBITRARY UNITS, ARBITRARY UNITS
##FACTOR=    0.0002768,     1,               1
##FIRST=     0,             0,               0
##LAST=      2.2672688,     0,               0
##MIN=       0,             -18212,          0
##MAX=       2.2672688,     149927,          0
$$ Real data points
##PAGE= N=1
##DATA TABLE= (X++(R..R)), XYDATA
0@%%%%%%%%%%%%%%Qj6J6j6J6k4L2l2M0m8N6o4P2q8J02j16J33j51J71j94K19k47
$$ 0 0 0 0 0 0 0 0 0 0 0 0 0 0 0 8 -8 8 -8 8 -16 16 -16 24 -24 32 -32 40 -48 54 -62 71 -80 91 -103 116 -131
36a31K79l13L48l88M33m82N36n95O59p28Q03q87R78j078J190j309J441j590J756
$$ -131 148 -165 183 -205 228 -254 282 -313 346 -382 421 -466 512 -566 624 -685 756 -834 922
55I22j942K152k393K670k995L383l851M434n181O179p589R747j3481K1433J8479
$$ 922 -1020 1132 -1261 1409 -1586 1797 -2054 2380 -2801 3378 -4211 5536 -7945 13488 31967
70C1967n0179K7305j5139J0387p844O405n524M915m022L395l201K918k620K104
$$ 31967 -18212 9093 -6046 4341 -3503 2902 -2622 2293 -1729 1666 -1535 1383 -1237 867
84H67j842J781j605J406j330J336j140Q35p65J002j014Q88n80M08n53N68n90O65
$$ 867 -975 806 -799 607 -723 613 -527 308 -457 545 -469 419 -161 247 -306 262 -328 337
102C37n85L74k14J59k29P0J07J17j24j00L0r3K14j74P7N4p9M8O4q0q6J30j18Q4
$$ 337 -248 126 -88 71 -158 -88 19 136 12 -88 -58 -151 63 -111 -34 20 -59 -11 53 -27 -113 17 -101 -17
126a7M2r5L3KN0J6j02J45K4L9j97Q7J10j56l6J29q9L1k7j28J1k1K18j37o3L10
$$ -17 25 -70 -37 -35 15 31 -71 74 98 137 -60 27 137 -19 -55 74 -15 16 -11 -139 -128 -149 69 -68 -131 179
152A79l35J46Q3j54K16j13j00K9q2j5R1P6m4j33P7J08j51J48j17P8rK7J17k22
$$ 179 -156 -10 73 -81 135 22 -78 -49 -131 -146 -55 21 -23 -156 -79 29 -122 26 -91 -13 -22 5 122 -100
176a00%L8J39j14Q8p7mj2P0jM4n6j01N7M0P0o9O2k5m3j52J32R4j13j06n9K26j65
$$ -100 -100 -62 77 -37 51 -26 -30 -42 28 27 71 15 -86 -29 11 81 12 74 49 6 -146 -14 80 -33 -139 -198 28 -137
204a37K23j36m4K13k31K04j19p9K3J84m5o6J92j72j89J48p7M0J27r7P2l1q8J48
$$ -137 86 -50 -94 119 -112 92 -27 -106 -83 101 56 -10 182 10 -179 -31 -108 -68 59 -38 34 3 -85 63
228F3N6q1Qj30P1r2J81J9j48J41J6p3j11m0J03Q2k48K58J6J2r7j37R1N7K4l4o8
$$ 63 119 38 46 -84 -13 -105 76 95 -53 88 104 31 -80 -120 -17 65 -183 75 91 103 6 -131 -40 17 41 7 -61
255f1J5JJ68o3m0j10L1q5K08J8j38m6K67k30K2K0O9k0m3n7N3Q3j41R2j09K91j80
$$ -61 -46 -45 123 60 20 -90 -59 -144 64 82 -56 -102 165 -65 -43 -23 46 26 -17 -74 -21 62 -79 13 -96 195 15
282A5nR7l9j03J25Q7k52J69k4j00n3N7O9K6q6n7l0J09PJ26j13q0J49q5L1m3q4
$$ 15 10 107 68 -35 90 177 -75 94 70 -30 -83 -26 43 69 -17 -74 -104 5 12 138 25 -55 94 9 40 -3 -87
309h7J40j79J5J34j47J56j08J16J7j49M7k1O3K6j9k23j9J75J2OOnK4j3L4j33J48
$$ -87 53 -126 -111 23 -124 32 -76 40 57 -92 -45 -66 -3 23 4 -219 -238 -63 -51 -45 -39 -44 -20 -33 1 -132 16
336A6j80J66Oj6K8l2K8p0J17k5o4R6o0m4K1K6kj65K00k5O5n5j05Q3%j27J47o3
$$ 16 -164 2 8 -8 20 -12 16 -54 63 38 -26 70 10 -34 -13 13 11 -154 46 21 86 31 -74 9 9 -118 29 -34
364c4j8J82j31j1j35l2K37rL3j2q3N8L6k39K12j40J19j57J55Nn1J83j53lj06P6
$$ -34 -52 130 -1 -12 -147 -179 58 49 82 70 -13 45 81 -158 54 -86 33 -124 31 36 -15 168 15 12 -94 -18
390a8j08Q6P8k7P9j49KJ17r0OJ95k12j03Q9J43l3k8n2K0K4j06J24p6k9p4J59j58
$$ -18 -126 -40 38 11 90 -59 -57 60 -30 -24 171 -41 -144 -55 88 55 27 -25 -5 19 -87 37 -39 -68 -142 17 -141
417a41J54N1p3J18j97q3J62j1j7OK3l5o4J66R1m7p1j64P9J86j00O2r9r4m8L61
$$ -141 13 64 -9 109 -88 -171 -9 -20 -37 -31 -8 -43 -107 59 150 103 32 -132 -53 133 33 95 -4 -98 -146 215
443B15k49K05p7k79J01N4L6o8MJ16j74J07M6j20R3M9k15O3J06J6N1r3M1j19n6
$$ 215 -34 171 94 -185 -84 -30 6 -62 -58 58 -116 -9 37 -83 10 59 -156 -93 13 29 80 -13 28 -91 -147
468a47J10j9l6J1J04q1J85M2j81N3P8j30J06p4L9m3J2p9k4mk7J65o2k7j37J61
$$ -147 -37 -56 -92 -81 23 -58 127 169 -12 41 119 -11 95 21 60 17 29 -50 -74 -78 -105 60 -2 -29 -166 -5
494eJ7L8j15M3J05n5j54k7J71j92J91m2j70J66l5j33J97J3k9O6j08J06N1j02M9
$$ -5 12 50 -65 -22 83 28 -126 -153 18 -174 17 -25 -195 -29 -64 -197 0 13 -16 50 -58 48 99 -3 46
519D6r4l0j3Q7J89j75q6J30M7Mj07K2Lk8p3j12K24p1O4j31QM6N1k2K5p6j04K28
$$ 46 -48 -78 -91 -4 185 10 -76 54 101 105 -2 20 23 -5 -78 -190 34 -37 27 -104 -96 -50 1 -21 4 -72 -176 52
547E2K02k37j28J41L0r0J8n5l9K6J70j07l9J17J1K3M2k71K24k74J18J42j25j3
$$ 52 254 17 -111 30 60 -30 -12 -67 -106 -80 90 -17 -56 61 72 95 137 -134 90 -184 -66 76 -49 -62
571f2j15J26j70L06K6p8J1K7j66L3J00J9j1j47L9J28j78J33r4J20J2J1L0r5LM5
$$ -62 -177 -51 -221 85 111 33 44 71 -95 -62 38 57 46 -101 -62 66 -112 21 -73 47 59 70 100 5 8 53
597E3l0N7q0J05j53J0N0LlP7j63P7K2O7pO3j03j6J2o0P7k92K04Q2j60R2o2J2M0
$$ 53 23 80 0 105 -48 -38 12 15 12 89 -74 3 25 92 85 148 45 29 41 -19 58 -234 -30 52 -108 -16 -78 -66 -26
626b6O7j00J44p7P0j65K9j10J77J14j28NK3J20j07K8j63J84Kq1P0j87J05O8P1
$$ -26 41 -59 85 8 78 -87 -58 -168 9 123 -5 0 23 143 36 64 -99 85 87 6 76 -111 -6 62 133
651A33k47K14r4j00L5M1M6o9r0J0L3q9J20Q2m9j73J81m5N3m3J09o4o4l9Q6J27
$$ 133 -114 100 6 -94 -59 -18 28 -41 -131 -121 -88 -177 -57 25 -24 -197 -16 -61 -8 -51 58 -6 -70 -109 -23 104
677A04j97K10q4nl4N3O5j08L9N7j31J12k39J01j1M3n3j9O2p0J69q4N2j87K24r0
$$ 104 -93 117 33 28 -6 47 112 4 43 100 -31 81 -158 -57 -68 -25 -78 -97 -35 -105 64 -20 32 -155 69 -21
703b1N2r4K1l9K40q6n9M4j72J41k9K5j45j6J66o3M0N0K0j45J85j42n0P2k56J09
$$ -21 31 -63 -42 -81 159 73 14 58 -114 27 -2 23 -122 -138 28 -35 5 55 75 -70 115 -27 -77 -5 -261 -152
729a52J95j63L8n6P3J38j35J47j43O0K3j0M2nq8qJ00L3Q5k25J27q3n0M3L5N5m5
$$ -152 43 -120 -82 -138 -65 73 -62 85 -58 2 25 15 57 52 -36 -44 56 89 174 -51 76 -7 -57 -14 21 76 31
756C1j71M4J71j13M9j32J50j25J36r1O6p1L8J8J4j33K17j53L3R7r8rJ45j16J26
$$ 31 -140 -96 75 -38 11 -121 29 -96 40 -51 15 -56 -18 0 14 -119 98 -55 -22 75 -23 -32 113 -3 123
781A23j48m2K30k09M6N2j12J04j13K53l20P3j2O3O0o3L6j32N4J26l3M1o2n1P3
$$ 123 -25 -67 163 -46 0 52 -60 44 -69 184 -136 -63 -75 -12 48 -15 21 -111 -57 69 36 77 15 -36 37
806C7j13l6K04q2K5k0j2o6J95n1n7j1j66J73J14n5q1ro4o5J22r3J02pJ10j17k0
$$ 37 -76 -112 92 10 35 15 3 -63 132 81 24 13 -153 20 134 79 -2 -11 -75 -140 -18 -111 -9 -16 94 -23 -43
833d3K4J85j52j13J28j30N3pJ11j13J65m0J2j01K8l2j04Q8J35k5j83J36L9r8J17
$$ -43 -19 166 14 -99 29 -101 -48 -55 56 -57 108 68 80 -21 7 -25 -129 -41 94 69 -114 22 61 -37 80
858H0j25N2k0J32j08J27k5m1O2j78N2R4j95K79k06k6N7j66P1k5J36qm4J14J2j20
$$ 80 -45 7 -13 119 11 138 113 72 134 -44 8 102 -93 186 -20 -46 11 -155 -84 -109 27 19 -25 89 101 -19
884a9N9N8j51j5L3O2K4l5o6r7P8J74n7n4l4J35r2n2N4p4Q4j33JJ67k6p5o6J54
$$ -19 40 98 -53 -68 -35 27 51 16 -50 -147 -69 105 48 -6 -40 95 3 -49 5 -69 15 -118 -117 50 24 -51 -117 37
912C7J14j82Q1J7j12N4Q7j22KL8O5Q1j59l8j06J49M9m5j48R4J83k45K12k52N7
$$ 37 151 -31 50 67 -45 9 96 -26 -24 14 79 160 1 -37 -143 6 55 10 -138 -44 139 -106 106 -146 -89
937h9N8J03j73J75O5k31J13R3l2o8j65J2J85j06J51o6o2k1O7n4J16M6k4j42Q1
$$ -89 -31 72 -101 74 139 -92 21 114 82 14 -151 -139 46 -60 91 25 -37 -58 9 -45 71 117 93 -49 32
962C2N8j17M6L7j5j34K68l12J89M3m5p4R4N2r9MJ0J22o0n5j39J28J8m3p6Q9q1
$$ 32 90 -27 19 56 41 -93 175 -137 52 95 50 -24 70 122 23 27 37 159 99 44 -95 33 51 8 -68 21 -60
989f0J97j02K2l6K8j8k6k1K0L6j20r9J21K08k05J1J4J08qk20P9L0J2N7k13J54
$$ -60 137 35 57 21 49 31 5 -16 4 40 -80 -179 -58 150 -55 -44 -30 78 70 -150 -71 -41 -29 28 -185 -31
1015c1R4j13l8P8k7o8kJ84k3j65O7J33j54L4R9m5K0l3p0P6o3K31k07m7K9R5j23
$$ -31 63 -50 -88 -10 -37 -105 -107 77 54 -111 -44 89 -65 -31 68 23 43 10 -60 16 -47 184 -23 -70 -41 54 -69
1042f9J38K2Ok03Q0L7q6Q2l8Ql2J04q6N0J22N5k01Q8K3j01J0j36K21j01k8L3l5
$$ -69 69 91 97 -106 -26 11 -75 7 -31 -23 -55 49 -37 13 135 190 -11 77 100 -1 9 -127 94 -7 -35 -2 -37
1069c7nn6K19q3n4r1J78j1K6r4j4M1M2j0J6K4m3o7L9N4L6k13K50p5q4j99K77j66
$$ -37 -42 -98 121 38 -16 -107 71 60 86 -8 -22 19 61 51 67 91 48 -19 20 74 110 -103 147 72 -12 -211 66 -100
1097a00J82km9L9j42q4P8n8J45OO6j16p2Lj08K50p1oj8K9L5P1j47R9j80j7J80
$$ -100 82 80 31 70 -72 -156 -78 -136 9 15 81 -35 -107 -104 -212 38 -33 -39 -57 -28 7 78 -69 30 -150 -167 13
1124A3p7K02ok48J87L1j66L06l03R9l3N3q0o2J67n6j23J83L4M8p1j27K6N1n1%
$$ 13 -64 138 132 -116 71 102 -64 242 -61 38 5 58 -22 -84 83 27 -96 87 121 169 98 -29 -3 48 -3 -3
1150cO9m5j29K22j14O7jp2P2o1J79k31K0P6j00J90j84OO9q5O9o2L2J2j4J87j30
$$ -3 66 21 -108 114 0 67 66 -6 66 5 184 -47 -27 49 -51 139 -45 -39 30 -55 14 -48 -16 -4 -18 169 39
1177C9j29R1m6j4J1k4J45Rq3jJ05j42J51j34Q0n2m4m0Q7q0j03J25L9R0q4r5J00
$$ 39 -90 1 -45 -59 -48 -72 73 82 -1 -2 103 -39 112 -22 58 6 -38 -78 9 -71 -174 -49 -10 80 -4 -99 1
1204AM4q1J14k64J29r7L59l02K03K6j64J52j46J16j45K5J21p8RO9j69K1J21j34
$$ 1 45 -36 78 -186 -57 -154 205 -97 106 132 -32 120 -26 90 -55 -30 91 13 22 91 -78 -57 64 -70
1228g0k7N8J24J5M4k87J70J9N0j08n3K4J72j21k3J27q2o1J07j52K9K63j82qP1
$$ -70 -97 -39 85 100 144 -143 27 46 96 -12 -65 -41 131 10 -13 114 32 -29 78 -74 -45 218 36 28 99
1253I9q6N0k9j16RJ47j19n0L4O8k9M9r2P8l5Q7j7L9p3r2l1J06k8J03J2l18K35
$$ 99 13 63 34 -82 -73 74 -45 -95 -61 7 -22 27 -65 13 -22 65 48 87 14 -78 -109 -3 -31 72 84 -234 1
1280AKj28J63l5N9l1k7K5qK6r1P2lj07Q5j5J29j52P2j14p3J73L4M8j46m8j3R0
$$ 1 3 -125 38 3 62 31 4 29 21 47 -44 28 25 -82 3 -12 117 -35 37 -77 -150 23 57 105 -41 -89 -102 -12
1308a2m4j31K92j98k2J71J38k89N9N2J49k33o6K7J37j30L1k9k1L16j43j78J33
$$ -12 -56 -187 105 -93 -115 56 194 -95 -36 16 165 -68 -134 -107 30 -100 -69 -98 -119 197 54 -124 9
1331IN9k1P2n2M2o6M2m5nk31J62K8R3k0pL0q7r1K23j49j18J27k2J00r3O9k0n7
$$ 9 68 47 119 67 109 43 85 40 35 -196 -34 -6 87 67 60 90 3 -88 135 -14 -132 -5 -27 73 -20 49 29 -28
1359b8k2Rj34K06L7p8O2j81J67R8p8k37J58JM2L2p3J63j09N1r4J07j17p7R3J53
$$ -28 -50 -41 -175 31 68 -10 52 -129 38 136 58 -179 -21 -20 22 54 -19 144 35 86 -8 99 -18 -95 -2 151
1385A51j79J51r8Q1J9m6j76K65j47O8q7J24p8nk3M0j53J45p7j01K39o8mp9R5j13
$$ 151 -28 123 25 106 125 79 -97 168 21 89 2 126 48 43 20 60 -93 52 -25 -126 113 45 41 -38 57 -56
1411e6J56j44K02j32k0o2J43m1j80jJ10m9K1q1K55Mp5q3qJQ1n2J04m7q9n4O7m1
$$ -56 100 -44 158 26 6 -56 87 46 -134 -135 -25 -74 -53 -134 121 125 50 -33 -41 -40 41 -11 93 46 -43 -97 -30 -71
1439g1J38j08r0K38k43M0N9J07r5n6J33j08L6j37O9O1K9J34k25K5J07p7n9J03
$$ -71 67 -41 -131 107 -136 -96 -37 70 -25 -81 52 -56 -20 -157 -88 -27 2 136 -89 -64 43 -34 -93 10
1463A0M3r6J46j41JO2J59k31o6J81q6J37K5l3p7n8J35k27Q1k0Q9k9j74K86m4M2
$$ 10 53 -43 103 -38 -37 25 184 -47 -113 68 -18 119 144 111 34 -24 111 -116 -35 -55 34 5 -169 117 73 115
1489A15r0PL0j0M3m6k73K38p5L3J01L3k1j24K9jJ02k81J39J65r5j76L54k78N2
$$ 115 25 32 62 52 95 49 -224 14 -61 -28 73 106 85 -39 -10 -11 91 -190 -51 114 19 -157 197 -81 -29
1514b9P3k71K67j16O7J26j02j1l6Q9p2o8J34J50k79J57j12j09K93j42n1KR6p6
$$ -29 44 -227 40 -76 -9 117 15 4 -32 57 -15 -83 51 201 -78 79 -33 -142 151 9 -42 -40 56 -20
1538b0r2J83j19P9j7o7J10Pj59M2L8m8Q9j04M9J1Q1j10jJ69j25m2%q5P4J16k27
$$ -20 -112 71 -48 31 14 -53 57 64 -95 -53 -15 -63 26 -78 -29 -18 63 -47 -48 121 -4 -46 -46 -131 -57 59 -168
1565a68J79j2R7nk19J58l5J9l9J00j87K10Lp0J01j84k3M2oj30L20j28j00J30j14
$$ -168 11 -1 96 91 -128 30 -5 14 -25 75 -112 98 101 31 132 -52 -75 -33 -39 -169 151 23 -77 53 -61
1590f1R3M0k7L3r7l7o5J21KK4j10J25q7J17J01k07K1j1K0O2j16J66k9j28j28K00
$$ -61 32 72 45 78 -19 -56 -121 0 2 26 -84 41 -46 71 172 -35 -14 -25 -5 57 -59 107 78 -50 -178 22
1616B2q1J01ql0J23q6r1J18o5K4N4j05p1J2J13J3j25N5l2L8j25K65j32Oj19Q8
$$ 22 -59 42 34 4 127 41 -50 68 3 27 81 -24 -95 -83 30 43 -82 -27 -59 -21 -146 119 -13 -7 -126 -38
1642c8n3K3%J23o1K4j2J86j87l2j21R5L9P9l0r4J5n9j5P9J85l05J07rKJ19o2k5
$$ -38 -91 -68 -68 55 -6 18 6 192 5 -27 -148 -53 -14 65 35 -59 -44 -103 -118 -39 146 -159 -52 -61 -59 60 -2 -27
1670b7L3p4rL8M1O6m3k9k4q2P0N4K3j00Q2l1K1K05m31J89K4QJ50j22j05J15j29
$$ -27 6 -68 -77 -39 2 68 25 -4 -28 -110 -40 14 37 -63 19 -12 9 214 -217 -28 -4 4 154 32 -73 42 -87
1697h7o4K69l7j07o6J72n8Qj75J89pn9K25l91J97q5K0K28l27J28O3k7R5j51n4
$$ -87 -151 118 81 -26 -92 80 22 30 -145 44 37 -22 203 -188 9 -76 -56 172 -155 -27 36 9 104 -47 -101
1722a01J73j9Jj04L2j27J05J07P2j25o3J30j44R4L0N5l4J5o3J03j64J8Q4M6j60
$$ -101 72 53 54 -50 -18 -145 -40 67 139 14 -49 81 -63 31 61 116 82 97 34 137 -27 -9 75 121 -39
1747c9lN3l3J43j49J54j71j9J5N2M4k01J56J21j45J57j14kL7j39J13N4j56J53
$$ -39 -42 11 -22 121 -28 126 -45 -64 -49 3 47 -154 2 123 -22 135 21 19 56 -83 30 84 -72 81
1771H1j52R7j12J7N2Q9q3p0Q3M5o2l9J07loj92J85j64K19J8k7j5j27Q7j41J16
$$ 81 -71 26 -86 -69 -17 72 -11 -81 2 47 -15 -54 53 50 44 -148 37 -127 92 110 83 68 -59 28 -113 3
1797CK3q9j59L13j0j67J14J61j12o7ll3ml5M4o4Q5R0j42L2N1l8J77j90l6M7o0
$$ 3 26 -63 -222 91 81 -86 28 189 77 10 7 -26 -30 -65 -21 -85 0 90 -52 -20 31 -7 170 -20 -56 -9 -69
1824f9R5P2j37J06k78K25J26r9j8k57J72K9M6j02J65J8j50l1Q2K1K2N8j57oJ4
$$ -69 26 98 -39 67 -211 14 140 41 23 -234 -62 -33 13 -89 76 94 -56 -87 -5 16 38 96 -61 -67 -53
1849e3M6j3Qr0J90j75J02r0j5J09j05J84k7j80Q6m1j9L7JP7M4j38L7j06O5N6l5
$$ -53 -7 -20 -12 -102 88 -87 15 -75 -90 19 -86 98 71 -109 -23 -64 -83 -46 -45 32 76 -62 -25 -131 -66 -10 -45
1876d5j93J97J8j82K91j58K5o1P1J31j44j6R1O4L2k23M0J31l0m1O5j28J5L4M5
$$ -45 -238 -41 -23 -205 86 -72 -47 -108 -37 94 -50 -66 25 89 121 -102 -62 69 39 -2 63 -65 -50 -16 29
1901B9M1j51R6j07J69J27k67L13k01k1P1%p3j1O8N8k13O0p3P3k1P6q3P6O0j41
$$ 29 70 -81 15 -92 77 204 -63 250 49 28 99 99 26 15 83 141 -72 -12 -85 -12 -33 43 -40 36 96 -45
1927d5R2j79J47k5j16J1J85j29N8j87K84r4n4Q9j5p0P3jJ54j69j26Q3J51j92R2
$$ -45 47 -132 15 -10 -126 -115 70 -59 -1 -188 96 2 -52 37 22 -48 25 24 178 9 -117 -34 117 -75 17
1952A7n5R5p5Pj8Q4j22lJ96k7M3j80M9j16K12j24J2J46l4j19J76k38K38j74qj
$$ 17 -38 57 -18 -11 -29 55 -67 -70 126 99 142 -38 11 -105 107 -17 -5 141 107 -12 164 -74 164 -10 -18 -19
1978a9L1m0j12K98m7r9K4J32j73Q8j50POJ10Q0j42L0O7r8O9j28O9j22j7J23O2
$$ -19 12 -28 -140 158 111 12 36 168 -5 83 -67 -60 -54 56 136 -6 24 91 -7 62 -66 3 -119 -136 -13 49
2004D9l2J2R7k5M3k57K46j03o5j2jK2l7K10j27j30K08J0NM7k45j20L34j90q1L28
$$ 49 17 29 126 101 144 -113 133 30 -35 -47 -48 -26 -63 147 20 -110 98 108 113 160 -85 -205 129 -61 -142 186
2030A86k30l5K39j46Q8K4j12n0PRj31J84k1o3J31j24n6O9n3Qq6J33P6j05M6qN1
$$ 186 -44 -79 160 14 102 126 14 -36 -29 -20 -151 33 12 -51 80 -44 -100 -31 -84 -76 -162 -29 47 -58 -12 -20 31
2057C1l6j02J42j2j22n5J35j40K12j24J03Q5k25J21j1O1q4N5r5K9O3k1N9j50L1
$$ 31 -5 -107 35 23 -99 -154 -19 -159 53 -71 32 117 -108 13 2 63 -21 34 -61 -32 31 10 69 -81 -50
2082e0O7p5J56j27R1J7n2o1p7O0N3L2L7j43J18o1M6k26L19j67p6K4N9J27l1q6
$$ -50 17 -58 98 -29 62 79 27 -34 -111 -51 2 34 71 -72 46 -15 31 -195 124 -43 -119 -95 -36 91 60 -26
2108b6J50k7K9k1M6k05j6J1J05Nj37k7K32k11l3J81j69J59j7r0pL1N3j16O3k9
$$ -26 124 97 126 105 151 -54 -70 -59 46 51 -86 -113 119 -92 -125 56 -113 46 29 -61 -68 -37 16 -100 -37 -66
2134f6Q3%L1k9J00j62J03j3Q7r6p1J25mo6l6j97L27j26p6K56j10O3j50J7Q1q9
$$ -66 17 17 48 19 119 -43 60 47 134 38 -33 92 88 22 -14 -211 116 -10 -86 170 60 123 -27 -10 71 -18
2160a8K6n5q3pL7K02j01J13j56J1J32j78l9K59j78j42K52m3Mj40P2q4Q5M1r4Q1
$$ -18 8 -47 -130 -137 -100 102 1 114 -42 -31 101 -77 -116 143 -35 -177 75 32 36 -104 -32 -116 -31 10 -84 -3
2186cn6R8j91L1K51l5N3k07J9N7o5R3j6p7j43K31K9j48J0J04L9j6l9n1KJ6R0l1
$$ -3 -59 39 -152 -121 130 95 148 -59 -40 17 -48 45 29 -48 -191 40 69 -79 -69 35 74 58 19 -32 -30 -14 76 45
2214D5n9M1j9Lj01J37k31L13r1k5k2j26K1J30J2N0l7j4q1J66j43n1J66k45J62
$$ 45 -14 27 8 11 -90 47 -184 129 38 13 -9 -135 -114 16 28 78 41 27 -54 112 -31 -82 84 -161 1
2239Aj80OL38k21P2r0J42q1j69K33J8p9K8Q1m9p5l2o6r5J81Ol3M8R2p2L0J4r9
$$ 1 -179 -173 165 -56 16 -74 68 -13 -182 51 69 -10 18 99 50 -25 -57 -123 -218 -37 -31 -64 -16 76 4 34 48 -51
2267e1J48Np4q4J70K4r0M2N2k3j43J36j53j5K90q7j16m6Q5q1o9K30k01K1j58J96
$$ -51 97 102 28 -56 114 138 48 90 142 119 -24 112 -41 -56 234 147 31 -15 70 -11 -80 150 -51 -30 -188 8
2293HJ8j74J58j42J73r0m4K02L6k72K06k5M1j2o9J71j21N2j52j40K27Jm8J06l5
$$ 8 26 -148 10 -132 41 -49 -93 109 145 -127 79 54 95 83 14 185 64 116 -36 -176 51 52 4 110 75
2318G5m9j72K05k14J56j95K34O4j70M6N1KqN8r0o2N0M1j78J48nj2R3j05L6Lo7
$$ 75 26 -146 59 -155 1 -194 40 104 -66 -20 31 33 25 83 -7 -69 -19 22 -156 -8 -13 -25 68 -37 -1 2 -65
2345f5J3k9K30j23P9j58L7j41K18m6k7J81r4M7k7mkJ5m8j09oJ43Pj74K21j02j13
$$ -65 -52 -81 149 26 105 -53 -16 -157 61 15 -12 169 75 122 95 91 89 104 56 -53 -59 84 91 -83 138 36 -77
2372g7k62L01J10j91O4Q4r8M5K2K9J96k04K8q4jJ45l3k13K16j80K31j55j2P7r6
$$ -77 -339 -38 72 -119 -55 29 -69 -24 -2 27 223 19 47 -37 -38 107 74 -139 77 -103 128 -27 -39 38 -58
2397e8o9N5Q5k2n8J22O3r8K4p6q4N4L3n5J32o0J26p3N1J3j60K66j71j33R4O2M3
$$ -58 -127 -72 13 -9 -67 55 118 20 44 -32 -116 -62 -29 -84 48 -12 114 41 92 105 -55 211 40 -93 1 63 106
2424A06P0j31j65K33p6o6J38r9j92J18J00j76J78n8QN4q7Q5n2j77K47m9n5K8M
$$ 106 176 45 -120 113 37 -29 109 10 -182 -64 36 -140 38 -20 -12 42 -45 40 -12 -189 58 9 -46 -18 -14
2449a4k6M9J85j03j10J56r3N1n6j15J48J0J50k40j5q3r4J05J71j44Q1J42l6k0
$$ -14 -40 9 194 91 -19 137 44 95 39 -76 72 82 232 -8 -23 -106 -200 -95 76 -68 13 155 119 99
2473I9q5M2Jl6n7n0Q7o5N2k1J50L2k28P1N5km5o6N2j20J50l4M3m2q8R4P1o9j00
$$ 99 14 56 57 21 -36 -86 1 -64 -12 -33 117 149 -79 -8 47 45 0 -66 -14 -134 16 -18 25 -17 -105 -11 60 -9 -109
2502a09K22j78J64q8o7N3j5N5k0j51J25l7J36j48K53k82Rj3J95n1k59K44M6j12
$$ -109 113 -65 99 11 -56 -3 -18 37 17 -134 -9 -46 90 -58 195 -87 -78 -91 104 53 -206 38 84 -28
2526b8q0J41j65M9j9j3P9k0q7K79j20J08j31j7J39o9j91P3P6j08J45oJ4J13j26
$$ -28 -108 33 -132 -83 -102 -115 -36 -56 -143 136 16 124 -7 -24 115 46 -145 -72 4 -104 41 35 49 162 36
2551C6j11p0J20K56j01k66J63P2k57J82j52P1L2l2O9j40m8J29J79j50O8j5L0P4
$$ 36 -75 -145 -25 231 130 -136 27 99 -158 24 -128 -57 -25 -57 12 -128 -176 -47 132 -18 50 35 65 139
2575A39j61jO2p8lN4jk0M7j14J26k02L63j23j07j7qL1n5R4j08L9R1K0P1j12l5
$$ 139 -22 -23 39 -39 -42 12 11 -9 38 -76 50 -152 211 88 -19 -36 -44 -13 -68 26 -82 -43 48 68 139 27 -8
2602hm6q0J56o4p9J92j8j12J66j53PK8J27k22K01m7L9r4j0k6j32L6K09l3j33M6
$$ -8 -54 -134 22 -42 -121 71 53 -59 107 -46 -39 -11 116 -106 95 48 87 -7 -17 -43 -175 -139 70 37 -96 -50
2628e0q3J85J10k40j9J57n4M2L0k49J96l9O4L5r2N7p7o3J86j98L8K20j87j02Q9
$$ -50 -133 52 162 -78 -97 60 6 48 78 -171 25 -14 50 85 -7 50 -27 -90 96 -102 -64 156 -31 -133 -44
2653d4O2l4J9M8K1j80J36L2r8K17o9j7r6N2m7O1J0o6Q6J9j33J69r7Kn3L9k63L29
$$ -44 18 -16 3 51 72 -108 28 60 -38 179 110 93 -3 49 2 63 73 7 93 112 -21 148 51 53 0 39 -224 105
2681A05r7J3J5M5r4J2q4R7M9o3R4l8N7L1o4p5K3R5j01J07p6m9k08J38J30r8J1
$$ 105 8 21 36 81 -13 -1 -85 12 61 -2 92 54 111 142 78 3 26 121 20 127 51 2 -206 -68 62 -36 -25
2708b5o5J15j54K17j10J3o2M0j8m1O6%J16n9l8k03L17p8q8J5R9o1Q5QM3j60J8
$$ -25 -90 25 -129 88 -22 -9 -71 -31 -49 -90 -24 -24 92 33 -5 -208 109 31 -57 -42 57 -4 81 89 132 -28 -10
2735a0M7J5O1n5j88Q8L3K9j20J60M7k43J37p8M4m7o6J31j1pq9j8J83K1j9k22P4
$$ -10 37 52 113 58 -130 -42 -9 20 -100 60 107 -136 1 -77 -33 -80 -146 -15 -26 -33 -122 -140 43 64 45 -177 -103
2762a03J11O3j45J00R1p2p6m6N3j81J88N6J4j8j37P0j7O4Jn4P4j05J39j95J36
$$ -103 8 71 -74 26 117 45 -31 -77 -24 -205 -17 39 53 35 -102 -32 -49 15 16 -38 36 -69 70 -125 11
2787A1mn7R9j60J18J56k31j63Q9J40J63p2j94m4J49o7J79q8J06j79J66k25K27
$$ 11 7 -50 49 -111 7 163 -68 -231 -142 -2 161 89 -105 -149 0 -67 112 24 130 -49 117 -108 119
2810A19j56L3j46J77l6R4l3j45l4O9K15k76R6QK5o4J46j58L89l20J5n6R3r8J00
$$ 119 -37 -4 -150 27 -9 85 52 -93 -127 -58 157 -119 -23 -15 10 -54 92 -66 323 3 18 -38 55 -43 57
2835E7m5M7j2J04j40J5R5k43K85j52P8j47l4rJ71j5o1M6P6k31Q8m8Q8n9Kn4r2
$$ 57 12 59 47 151 11 26 121 -122 163 11 89 -58 -92 -101 70 55 -6 40 116 -115 -27 -75 13 -46 -44 -98 -190
2862a90J08O5LJ34m53L33oJ70j40k14L50j46J54k41J13J03j1j29j2l0P4P8r7P4
$$ -190 -82 -17 -14 120 -333 0 -6 164 24 -190 160 14 168 -73 40 143 132 3 -9 -39 35 113 16 90
2886I0j88k3J6J09K2p5M1J63j41M9j15k8o5L8J40n2o5j64P3J18N0Om0o5R7pj79
$$ 90 -98 -121 -105 4 26 -49 -8 155 14 63 -52 -80 -145 -107 33 -19 -84 -248 -175 -57 -7 -1 -41 -106 -9 -16 -195
2913a95K28O6k30N6J34j50J12l2Kj22J45J15j61o6J07P9l03K65L3kk0lo6p8J31
$$ -195 33 99 -131 -75 59 -91 21 -11 -9 -131 14 129 -32 -98 9 88 -215 50 83 81 61 58 -8 -86 45
2938D5p3MJ25J49m50L40J7k44K23l8q0N1j15O1j62J95o7K20k86K30K2k00m2j57
$$ 45 -28 -24 101 250 -200 140 157 -87 136 98 18 69 -46 15 -147 48 -19 201 -85 145 167 -33 -75 -232
2962b32K20R2J6j11L8l7J3R5R7j21j7o7o1Q4n4J01m5m3j20J58L0%rr6J61N2j76
$$ -232 -12 80 96 -15 23 -14 -1 94 191 70 53 -14 -75 9 -45 56 11 -32 -152 6 36 36 27 -69 92 144 -32
2989c2K1O7Oq3K09K0m25J84o1K0j14K91k63J82l0O6P9j2j39o2R3J08j55J98k06
$$ -32 -11 56 62 -21 188 208 -217 -33 -94 -74 -188 103 -160 22 -8 58 137 125 -14 -76 17 125 -30 168 -38
3014c8J21l7j26k2J41L4p9o8Q8l6K57k72L1J16o5j35P3j1O6n6R2j86N9M4J12j28
$$ -38 83 46 -80 -102 39 73 -6 -74 14 -22 235 -37 -6 110 45 -90 -17 -28 38 -18 74 -112 -53 -9 103 -25
3040b5l3Mn2J18N8q8M2K5n3R4q6rj4o3qO4oM8n9Q1M6j27Q8r4J3K08j57Qj2j11
$$ -25 -58 -54 -106 12 70 -18 24 49 -4 90 4 -5 -19 -82 -90 -26 -32 16 -43 38 84 -43 45 -49 -36 172 15 23 11 -100
3070a00J82k42J89j4j5o6N8J40j63M3j45J83j27p3J37J4J7m3Rp9K19j03j8j08
$$ -100 82 -160 29 15 0 -66 -8 132 -31 12 -133 50 -77 -150 -13 1 18 -25 -16 -95 124 21 3 -105
3094a05J36nj09K86k72J9J43j6j55J57j81R6J18k71K83j52J5K3q5K15j31m1m3
$$ -105 31 26 -83 203 -69 -50 93 77 -78 79 -102 -6 112 -159 124 -28 -13 10 -75 140 9 -32 -75
3117g5J77p9J06k22J61p8R0j16l4P4M1O7j66J44j58l6J70K4j08R1j56R3Q8nJ4
$$ -75 102 23 129 -93 68 -10 80 -36 -70 4 45 112 -54 90 -68 -104 66 90 -18 73 -83 10 98 93 107
3142A07j21J9j59lJ79j03R0n3R9m6J13o2k7m4Q7j08p7P6p3O3Q1J9j02r8K31j35
$$ 107 -14 5 -154 -157 22 -81 9 -44 55 9 122 60 33 -11 76 -32 -109 -33 -106 -43 38 57 -45 -143 88 -47
3168d7J5J97k88J05J08j66J06n3m5j8J6L28j47Pj27J8m6O3M0j26K43l11P3K6Q8
$$ -47 -32 165 -123 -18 90 -76 30 -23 -68 -86 -70 258 111 118 -9 9 -37 26 66 -60 183 -128 -55 -29 59
3193E9l4M5o8l5j3K1k3l4j0M1p7P4ONK09r9N9j24Oj02m9J21J48K0n5M6q4K4r1
$$ 59 25 70 2 -33 -46 -25 -48 -82 -92 -51 -128 -54 -48 -43 166 67 126 2 8 -94 -143 -22 126 146 91 137 53 77 -14
3222a4J86j60N0J13j99o0M0J8m4p7J06j4J06j07K4J3J08o4p7k1kO6P8kj56q6J13
$$ -14 172 12 62 175 -24 -84 -44 -26 -70 -147 -41 -55 51 -56 -32 -19 89 25 -52 -73 -75 -9 69 67 -89 -175 -62
3249f2R4j39J8L6J01j77O6O3l4P0n2L6q9K01j40m1N0O0l8K3m5R5r0j2p4J5J57
$$ -62 32 -107 -89 -53 48 -129 -63 0 -34 36 -16 20 -69 132 -8 -49 1 61 23 46 1 96 6 -6 -80 -65 92
3276I2k19J31j93J42N7j8o3L9N4j5o8J20r5r7J14o1o1J66k7P3o1j59J37K5j07
$$ 92 -127 4 -189 -47 10 -8 -71 -32 22 7 -61 59 -36 -133 -19 -80 -141 25 -2 71 10 -149 -12 13 -94
3301i4K49j91k4P2L8j48K7Qq2J19k9J47j49m7K25j37LJ78j56n9J8q7j5K52j68
$$ -94 155 -36 -60 12 50 -98 -71 -63 -145 -26 -55 92 -57 -104 121 -16 -13 165 9 -50 -32 -119 -134 118 -50
3326e0j5Q4n5K2P2O2k31j32L21r6k7J55j68K7K8j30K60j30M0j03J53p1j8l4J81
$$ -50 -65 19 -36 -14 58 120 -111 -243 78 -18 -45 110 -58 -31 -3 -133 127 -3 37 -66 87 16 -2 -36 145
3351A45r9k01J91J39k59L5M5l5Q7L1l5M2R6j66q2R0l8N3j53N8J40r9r3R5K8k2
$$ 145 46 -155 36 175 -84 -49 -4 -39 48 79 44 86 182 16 -66 24 -14 39 -114 -56 84 -15 -108 -13 15 -7
3377gJ14j66J20l9j07K30p8j54q0J52M8Q6j62Q7K6j10J35J16k53Q6p4J91j17j05
$$ -7 107 -59 61 22 -85 145 67 -87 -167 -15 33 119 -43 44 70 -40 95 211 -42 44 -30 161 44 -61
3401f1J17J1koM4m9j79K08P1k61Q7P3l6n4p5O8Q6k51K98j88l5N8J44O2k35J17
$$ -61 56 67 65 59 103 54 -125 83 154 -107 -20 53 17 -37 -112 -44 42 -209 89 -99 -134 -76 68 130 -105 12
3427A2K8lr4J13j33M9J05o5Q0j44j15L04o8ql0j5n2Kj6J19m3J3n7Q0j08n4R2N9
$$ 12 40 37 -57 56 -77 -28 77 12 92 -52 -167 137 69 61 31 16 -36 -34 -50 69 26 39 -18 62 -46 -100 -8 51
3455E1j47J84l8k03R4J22p5J9N8j71J45j36Mp5K44j84J92Jp8j6k1R4j31J54j2
$$ 51 -96 88 50 -153 -59 63 -12 7 65 -106 39 -97 -93 -168 76 -108 84 85 7 -9 -30 64 -67 87 75
3480G5j14K4J38j70J47K1j55oL0J5k4J50p2J6m4rj5Lm3J85k07m2n6N2J38Njn4
$$ 75 -39 -15 123 -47 100 121 -34 -40 -10 5 -19 131 59 75 31 22 7 10 -33 152 -55 -97 -153 -101 37 42 41 -13
3508a3P7L4r3M4p6O4j67K01r4k1J11j3ml7Oj66K07j28K30k43OL7o6J25j26K21
$$ -13 64 98 5 49 -27 37 -130 71 -23 -44 67 54 50 13 19 -147 60 -68 162 -81 -75 -38 -104 21 -105 116
3534A16j26J34j67Qr9Q1L1Q3q6qM4j4J4k03J28R5j8p1o0K1J44k2j04l7J87k47
$$ 116 -10 124 -43 -35 -134 -53 -22 61 -25 -33 11 -3 11 -192 -64 31 13 -58 -118 -97 47 25 -79 -116 71 -176
3560a76J36J22j65K40j39j52J46m1m9J13n1J10nj21M6P2m7rNk9j36J56O7k61J70
$$ -176 -40 82 -83 157 18 -134 12 -29 -78 35 -16 94 89 -32 14 86 39 30 35 6 -130 26 93 -168 2
3585BQjm7l2j3N0M8j70J43O3n9Jm1P7l0K5O7k4n9J3J03p6qp0P6N2N4j18j08J32
$$ 2 10 9 -38 -70 -83 -33 15 -155 -12 51 -8 -7 -48 29 -1 24 91 67 8 21 124 48 40 -30 46 98 152 34 -74 58
3615E8J6j32J11J3k26J33K32j60mK6N6j3r0j22J80j49P0m3r6K55q6K3m2Oq5P1
$$ 58 74 -58 53 66 -160 -27 205 45 41 67 123 110 20 -102 78 -71 -1 -44 -140 115 29 52 10 16 -69 2
3641Bq8K1M0j28K64j82J00J14P3j60p3O0J02j97P1P4j64L3N8j42R4Jj2p2J30N7
$$ 2 -86 -65 -25 -153 111 -71 29 143 216 56 -17 43 145 -52 19 93 -71 -38 20 -122 -28 -27 -39 -111 19 76
3667G6P7j14k37K89M9j57m4P0k3J8J5m4J61j57L0m1k9M2o1O1R0j8k5n6M9L8n6
$$ 76 153 39 -198 91 140 -17 -61 9 -14 4 19 -25 136 -21 9 -32 -61 -19 -80 -19 71 53 28 -28 21 59 3
3694CJ20M1l51K38q3l6L9N7pp2J32l17J49K4r6O1J94n1K8j80M1k7J10Ol8K5n0
$$ 3 123 164 -187 51 -32 -68 -29 28 21 -51 81 -236 -87 -63 -159 -98 96 45 73 -107 -66 -93 17 23 -15 10 -40
3721d0O1m8R6j97K33m4Mr6O9J36k54J56RK1l35L85j39j63K45J4q3r3N5R4Pj0j5
$$ -40 21 -27 69 -128 105 61 65 -31 38 174 -80 76 85 106 -229 156 17 -146 99 113 30 -63 -8 86 93 83 68
3748F8l7j27O8j02J08n8M5L3j74J90j02K05mn1J06k40R9M1j99J82j87L43r2j27
$$ 68 31 -96 -28 -130 -22 -80 -35 -2 -176 14 -88 117 113 62 168 -72 27 68 -131 51 -136 207 115 -12
3772a2N4r2R7P0k55L0J68j67R6J26k76J36N5jp7M2m4J61j09Q9r1J7kJ45j50j87
$$ -12 42 -50 47 117 -138 -108 60 -107 -11 115 -161 -25 30 29 -48 -6 -50 111 2 91 0 17 15 160 10 -177
3798a77L7J90p1rq2j8J53m5P0L1q8m7J25k8M0jj65PO7K4P1O1l7j15p1L9P4P0j22
$$ -177 -140 50 -21 -30 -112 -130 23 -22 48 79 -9 -56 69 41 81 80 -85 -78 -11 13 84 145 108 -7 -78 -39 35 105 -17
3827a7l5K51l09J24jM0O7k58L86j19j52R1p4j68J78pK9J5j48K82j52l7j2Mj98
$$ -17 -52 199 -110 14 13 53 120 -138 248 129 -23 68 -6 -174 4 -3 26 41 -107 175 23 -14 -26 -22 -220
3852b20J60j2O7l4o8J93q4n3J47L2n7o6nj1Rm2J26n0L1j5rM9j25J37q5K8l9R4
$$ -220 -60 -72 -5 -39 -107 86 2 -51 96 128 71 5 0 -11 -2 -44 82 32 63 48 39 88 -37 100 15 43 4 98
3880I8j36R2q8R3p8j0j13K05q0O8k05K47k7o0J41j52j35J40J03l4m2j5P5L5j90
$$ 98 -38 54 -34 59 -19 -29 -142 63 -17 51 -154 93 66 6 147 -5 -140 0 103 69 27 12 87 122 -68
3905f8J23o2j27J01p9J81n9J57k02P4q3p0P6J15o9Q6l3j26J73l6J9L1r5l8J4q9
$$ -68 55 -7 -134 -33 -112 69 10 167 -35 39 -44 -114 -38 77 8 94 61 -65 108 72 91 122 27 -11 3 -86
3931h6J62k0j1j1J32l01J87P5k08J44L3j26KM4j07K01n8K4j08J30N8q6j05j5N5
$$ -86 76 56 45 34 166 -135 52 127 -81 63 96 -30 -28 16 -91 110 52 76 -32 98 156 70 -35 -50 5
3956EKQ7mj58K5J3jR9mJ9Rk00O0O2J3j73L15j70k8n0P7J13j9n6j01R5n4m1P2J19
$$ 5 7 94 90 -68 -43 -30 -31 68 64 83 92 -108 -48 14 27 -146 169 -1 -29 -79 -2 111 92 36 -65 30 -24 -65 7 126
3986A26j60L7j41J56P3m3j56K06k31J10Q3K9n8o6K9J17k28R7J9J53j57oN8q5k0
$$ 126 -34 3 -138 18 91 48 -108 98 -133 -23 60 89 31 -35 -6 111 -117 -20 -1 152 -5 -11 47 -38 -58
4011e8L7p2M1J16o5n2qn3oJ31K3K0j16J7J64j05Q4J9j38j35R2j6j3P9K2J11l5
$$ -58 -21 -93 -52 64 -1 -53 -61 -114 -120 11 34 54 -62 -45 119 14 98 117 -21 -156 -64 -80 -93 -14 8 119 84
4038H4j00j3O9j25L4J17j62j9R0J97k45nj42K20Qk0K4J5k2o9M6P4j7no6J19k15
$$ 84 -16 -29 40 -85 -51 66 -96 -115 -25 172 -73 -78 -220 0 8 -12 12 27 5 -64 -18 56 39 34 -32 87 -128
4065a28J48j02M8J42K3m3j19jL6J78j26j32J92j04q1pK51k15J20j05K12k29qK06
$$ -128 20 -82 -34 108 131 88 -31 -32 4 182 56 -76 116 12 -69 -76 175 -40 80 -25 187 -42 -50 156
4089A56k74J16m2R9k71K79k04K01P9k23M3P0m5J37j87R0J57l29J31O0l9N4n0K1
$$ 156 -118 -2 -44 55 -216 63 -141 60 139 -84 -41 29 -16 121 -66 24 181 -148 -17 43 4 58 8 29
4113B9k12J98o6M9J70k77N1K6o6O2KJ93k36J48j48J94O4j00m3r5R6m8j5Q5k6l4
$$ 29 -183 15 -51 -2 168 -109 -58 -32 -98 -36 -34 159 -77 71 -77 117 181 81 38 -57 39 -9 -24 61 35 1
4139Aj31O9K24k48J24N6k53K59K3j78J1J18p7o2O7J8K7j98J02j13J79j09Q3J39
$$ 1 -130 -61 163 -85 39 95 -158 101 124 -54 -43 75 -2 -64 3 21 48 -150 -48 -161 18 -91 -8 131
4163A31k54J64j43J42j27P6K5%m7J8J4q5K57r2j39J34j12N1O1j92LJ12j19M1o
$$ 131 -123 41 -102 40 -87 -11 14 14 -33 -15 -1 -86 171 79 -60 74 -38 13 74 -118 -115 -3 -122 -81 -87
4188h7J64k17J48l0k8m5L1j05J06LJ17N7j88K13j47KJ95j99R0q8J7J18o9m4n5
$$ -87 77 -140 8 -22 -50 -95 -64 -169 -63 -60 57 114 -74 139 -8 -6 189 -10 80 -8 9 127 58 14 -41
4213d1Q8q5L5N1n8J83l52J40R5J6J05j29p2m7Q8r1p4J73M0j05R1M4q6l3J82k94
$$ -41 47 -38 -3 48 -10 173 -179 -39 56 72 177 48 -24 -71 17 -74 -148 25 65 -40 51 95 9 -24 158 -136
4239a36K0Q3Q8j24qJ30M7p2l3M8r8J03j6k19J21O7M6n9k7J60j74J41Nj83J15J2
$$ -136 -116 -33 55 -69 -77 53 100 28 -5 43 -55 48 32 -187 -66 1 47 -12 -39 121 -53 88 93 -90 25 37
4265C7j81L07j83j35J28n0LP2o0N0J8m3NK26l54J88j7O9J31l16L2M1j0k9J75q0
$$ 37 -144 163 -20 -155 -27 -77 -74 -2 -62 -12 6 -37 -32 194 -160 28 11 80 211 -105 -73 -32 -42 -71 104 24
4291B4o8J43o3j22rQ8N1k7m2J55j48O9l5N6K7J40l44K2O3L5m5j24J60j00P0J7
$$ 24 -44 99 36 -86 -95 -7 44 17 -25 130 -18 51 16 72 99 239 -105 -83 -20 15 -30 -154 6 -94 -24 -7
4317gM1m8J12k80Q1R9l2J94j37K5j10p8J77p5R3o9j3O2KJ7j39J38J16j51k3m2
$$ -7 34 -14 98 -182 -101 -2 -34 160 23 48 -62 -140 37 -38 55 -14 -27 35 37 54 -85 53 169 18 -5 -47
4343d7k2J10m1R7j01mQ1q5j23J33j37R5J47m7j62J12m1n8R9n2p7k5J75K6n8m4
$$ -47 -69 41 0 97 -4 -8 73 -12 -135 -2 -139 -44 103 56 -106 6 -35 -93 6 -46 -123 -148 27 53 -5 -49
4369d9K37k07r5K12j53J1J00M6j34j25K08l3O1J2j47P7J49J2j55J15j47J0m9P2
$$ -49 188 -19 -114 98 -55 -44 56 102 -32 -157 51 18 79 91 -56 21 170 182 27 142 -5 5 -44 28
4393B8J7j22R5K1o1j45P4K14j70J23M0l21K70L0o3j26K06j52J43n9j47pO0O5L9
$$ 28 45 -77 18 39 -22 -167 -93 121 -49 74 114 -207 63 93 30 -96 110 -42 101 42 -105 -112 -52 13 52
4418E2L5o7J3j18J39j17P2Rj87K77k7o7j21J74M1j26J51j68Jj6J27J7n6kJ3K6
$$ 52 87 20 33 -85 54 -63 9 18 -169 108 81 14 -107 67 108 -18 133 -35 -34 -50 77 94 38 36 49 75
4444G5l6k06N3J65j23J39qk8L17l92P4j07J14m4Q4k0k30K91r8o5M0j15J66J20
$$ 75 39 -167 -114 51 -72 67 59 31 348 -44 30 -77 37 -7 77 57 -173 118 20 -45 -5 -120 46 166
4468A66j26K2K6oJ7m3j10J6k0J61j48R3K2j50K9O7j75K28O0q5p1P6Nq0n6J78j13
$$ 166 40 62 88 82 99 56 -54 -38 -58 103 -45 48 70 -80 -51 16 -159 69 129 44 -27 49 54 -26 -82 96 -17
4495a7K6Ln0l7J23Q0j6j14M7P2j24K8M2j54K6J45j97Q2l0p6J75r8J59%j67J46
$$ -17 9 12 -38 -75 48 128 112 -2 45 117 -7 21 63 -91 -65 80 -117 -35 -65 -141 34 -64 95 95 -72 74
4521G4rk04j38L26k8M7Q1j23lJ53l35J77J29j36R1m7l4j02jN8L2J7k3J34j28j62
$$ 74 65 -139 -277 49 21 68 149 26 23 176 -159 18 147 11 102 55 21 -81 -82 -24 8 25 2 136 8 -154
4547a54R8J33j59K6J42j04p1M3j20J30J06M6K4k17k8J32q5J10r4l0k1k7J89o3
$$ -154 -56 77 -82 -56 86 -18 -89 -46 -166 -36 70 116 140 -77 -105 27 -58 52 -42 -72 -93 -120 69 6
4571Fj87L93j33Q2k02M5j56O3J11L7k60K01j46K37p3j34K58k63J23j16J85L4q0
$$ 6 -181 212 79 161 -41 4 -152 -89 22 59 -201 0 -146 91 18 -116 142 -121 2 -114 71 105 25
4594B5l5J05j40J80j13m3o5N1J08J3j42M3k9m8J00L6J8r5J20j83J32q4o5J56K4
$$ 25 -10 95 -45 135 22 -21 -86 -35 73 86 -56 -13 -42 -90 10 46 64 -31 89 -94 38 -46 -111 45 69
4619F9k00K09Qp6K2p1LP8J63k85R4LK2l0J2R0k38R0P2N2j0p5r1Q3p4L2j38J97
$$ 69 -131 78 86 10 32 -39 -36 42 205 -80 14 17 39 9 21 111 -127 -37 35 87 77 2 -89 -6 -80 -48 -186 11
4647A1J89q5j6r2k7M5L0o7ln9J52k24J69j14N1R3L7j95K0R2j62K31p4j01J20M3
$$ 11 200 115 99 7 -20 25 55 -12 -15 -74 78 -146 23 -91 -40 53 90 -105 -85 7 -155 76 2 -99 21 64
4673F4j70R8m2J24O9j49L8L5N8k43J24J07k18R9R1k03j8Q3Q6j74J41M7j30J38
$$ 64 -106 -8 -50 74 143 -6 32 67 125 -118 6 113 -105 -6 85 -118 -136 -53 33 -141 0 47 -83 55
4697E5o1j47K25j00j04O4M4j6Q6j17J25L1j57J06p4%M0n8R9rp8J24m5J3K6j31
$$ 55 -6 -153 72 -28 -132 -68 -24 -40 46 -71 54 85 -72 34 -40 -40 0 -58 41 32 -46 78 33 46 72 -59
4723e9J16L3k5L5l2o9P8o4qJ15j39n7p3Q7J17p5q5J07lj52K04j28J71k35J61j24
$$ -59 57 90 65 100 68 -1 77 13 5 120 -19 -76 -149 -62 55 -20 -105 2 -1 -153 51 -77 94 -141 20 -104
4749a04J21j09R2k1N6k4j29L7R6j40J94j5j07Q4k8M6k02J47j82K22j41N9J57j53
$$ -104 17 -92 0 -21 35 11 -118 -81 15 -125 69 54 -53 31 3 49 -153 -6 -188 34 -107 -48 109 -44
4773d4rl2ll1M7J16K9j16J27p9K9k68J87K10j59Q0j34J1L8M0K0j20JJ21Oo9K3
$$ -44 -53 -85 -88 -119 -72 44 73 -43 84 5 34 -234 -47 163 4 84 -50 -39 -1 39 59 -61 -60 61 67 -2 21
4800B1J09n6n5j25o2K32M8j56J05O0j85m9O0J86K6k38n0J0J39J75k71J76j12M3
$$ 21 130 74 19 -106 -168 64 112 -44 61 121 -64 -113 -53 133 159 -79 -129 -119 20 195 -76 100 -12 31
4824C1m4p8L7l7N7P7j07J88q9j61J82l8K8M4j50M6j5j3L4nRn7R5J36k92J18J06
$$ 31 -13 -91 -54 -91 -34 43 -64 124 35 -126 56 18 46 90 -60 -14 -29 -42 -8 -13 -4 -61 34 170 -122 -4 102
4851A02p4k4j12J35M7j0j10J95l2j60Q9j29M9J9J03j49m3n5K43qj6k3J9j93K64
$$ 102 28 4 -108 27 74 64 -46 149 117 -43 46 -83 -34 -15 88 -61 -104 -159 84 76 60 37 56 -137 127
4876A27k5M1p2j61N7O6j53K63j03Q2j1k70J19m9L3M6J0j07J72j96J31k0K15l66
$$ 127 102 143 71 -90 -33 33 -120 143 40 122 111 -159 -40 -89 -56 -10 0 -107 65 -131 0 -20 195 -171
4900a71K35P7j91R0k8r6Q8p0J57p0%n9j03K06j96O6J18j04j00J97j07L9m5j03
$$ -171 64 141 -50 40 12 -84 4 -66 91 21 21 -38 -141 65 -131 -65 53 -51 -151 46 -61 -22 -67 -170
4924a70J10M4r6J24J5rJ10p4r7J16j28J39k07J52K1K2P3k46K1j05J42L8J05r2
$$ -170 -60 -16 -112 12 27 18 128 54 -43 73 -55 84 -123 29 50 72 145 -101 -80 -185 -43 -5 100 8
4948Hlp6N6j9N5j82J56N9j23J2J29k31R5O3n3R4p2K0N6K8r9R4r9L6l7J33j98J46
$$ 8 5 -71 -15 -34 21 -161 -5 54 -69 -57 72 -159 -64 -1 -54 40 -32 -12 44 72 -27 67 -32 4 -33 100 -98 48
4976D8o1Q2j37J03L9rL3K0J7j82J62l7j21J21n0Lr0q5O0jJ22o8j01K81o5m4n8
$$ 48 -13 69 -68 35 74 65 98 118 135 -47 115 78 -43 78 28 31 -59 -144 -84 -85 37 -31 -132 149 84 40 -18
5003a8L7L9r7p6K32l8N2j07r8P4m2n8J35k7l6J07j97M23l79K06j02k5J4j79k6
$$ -18 19 58 -39 -115 117 79 131 24 -74 0 -42 -100 35 8 -28 79 -118 305 -74 132 30 5 19 -160 -186
5028a86J61R4m0l7J37j23qJ5k3k5J57j40Nq1Q9K5J12k22J36k5l3J49k37J71lK7
$$ -186 -25 69 29 -8 129 6 -2 13 -10 -35 122 -18 -13 -94 -5 20 132 -90 46 21 -12 137 -100 71 68 95
5054I5j56J04l8O3j25J88j15j06J7O9nM1O1M7j75l0J39k10K13j39L4M9n3J93j96
$$ 95 -61 43 5 68 -57 131 16 -90 -73 -4 -9 32 93 140 -35 -65 74 -136 77 -62 -28 21 -32 161 -35
5079c5L3J0j64K73k78J79j9j18K83j06r7K1J8N3o5K3m4M3p7O7M7J8m5q1K11Nk79
$$ -35 -2 8 -156 117 -161 18 -1 -119 164 58 -39 -18 0 53 -12 11 -33 10 -67 0 47 65 20 -61 150 155 -124
5106a24J71L5j91J76jk6R3j04M3j84J67K8J71k14n0mR0j95J54j34Q7m6o1P9R0
$$ -124 47 82 -109 67 66 40 133 29 72 -112 55 83 254 40 -10 -14 76 -119 35 -99 -12 -58 -119 -40 50
5131E0m3P9j54K2m9J12rn5P7O4J27j62l5n8P0%n1J16m7m3q4J72l30K42R7j52J25
$$ 50 7 86 -68 -46 -95 17 8 -47 30 94 221 59 24 -34 36 36 -15 101 54 11 -73 99 -231 11 108 -44 81
5158H1j11n3J37j64J31K5l08K24p4P8O9M1J3o4%m1L0k3k0L0J33j32R7k20P4L8
$$ 81 -30 -83 54 -110 21 46 -262 -38 -112 -34 35 76 89 25 25 -16 14 -9 -29 1 134 2 99 -121 -47 -9
5184ip3N6P8j34J61j51Q1l7P5j15J80n9k1k4J07q8l4L6k5k03J42N5p3r5J51j7
$$ -9 -82 -26 52 -82 79 -72 9 -28 47 -68 112 53 32 8 115 27 -7 29 4 -199 -57 -2 -75 -170 -19 -36
5210c6%l0J45N2k97J81o4J17j29J56J8m4m2n4J83o1n6j04R4J2k0O5r1R9o0k0m6
$$ -36 -36 -66 79 131 -166 15 -49 68 -61 95 113 69 27 -27 156 95 39 -65 29 41 21 86 -5 94 34 14 -32
5237c2J71k71K99j84j02K42j17r6R9R0k85J65M0j08Q4N9Pj14Q1L2j84Q8j44J69
$$ -32 139 -132 167 -17 -119 123 6 -90 9 99 -186 -21 19 -89 -5 54 61 -53 28 60 -124 -36 -180 -11
5261a1K54k00m8K4o8j3J24J21k53M9J61o2j59lJ05J28j03O0p0k6j00K7P8R4n8
$$ -11 243 43 -5 19 -49 -62 62 183 -70 -21 140 78 -81 -84 21 149 46 106 36 10 -90 -63 15 109 51
5286E1L9j31Q7K2K2j63j55J17J63J07j08j91J75mj72Q7J45o4P1Kj81J07R4k9q1
$$ 51 90 -41 46 68 90 -73 -228 -111 52 159 51 -140 35 31 -141 -54 91 27 98 100 -81 26 120 91 10
5311A0l1n1J7J24n6O3j43j1J25ON7j03j26J55J39j67o4P0j36L4pM3J73j19kq3
$$ 10 -21 -72 -55 69 13 76 -67 -78 47 53 110 7 -119 36 175 8 -56 14 -122 -88 -95 -52 121 2 0 -83
5337h3K63k42K1R0K1k4o8j4K2j45J98J0j02J22j07M0M9l8J7j0MK1K7J3k38K43
$$ -83 180 -62 -41 49 70 46 -22 -36 -14 -159 39 49 -53 69 -38 2 51 13 30 20 24 45 72 85 -153 90
5363I0r6n6l6m4j1O7N3k5K09j04j48R7j7KJ08J0j41J43j05K6J6j72J11o1O7P7
$$ 90 -6 -62 -98 -142 -153 -86 -33 -58 151 47 -101 -4 -21 -19 89 99 -42 101 -4 22 38 -134 -23 -84 -17 60
5389F0q9K4j15K6J54o3Q1j33j06R8M7j39K47j37K27k80M8o5K37j86L5o4K9J2Q0
$$ 60 -29 -5 -120 -94 60 -3 78 -55 -161 -63 -16 -155 92 -45 182 -98 -50 -115 122 -64 -29 -93 -64 -52 28
5414B8r2K24k62J24J02k12m4O5J18k10J51J89j30q3J68k09J36j03J2R7k05j12
$$ 28 -64 160 -102 22 124 -88 -132 -67 51 -159 -8 181 51 -32 136 -73 63 -40 -28 69 -136 -248
5436b48M29j73m2KQ3qp7Q8J85l78J01j2J57pnj5j36m1K36j3j16j06Q0O4j08L6
$$ -248 181 8 -34 -32 51 43 -34 54 239 -139 -38 -50 107 100 95 80 -56 -97 139 126 10 -96 -16 48 -60 -24
5462b4L1K5%j5P0j26q0K66j89k4J4j14R9mkj1J15j00P2J05M9j58k4kJ30j20m1
$$ -24 7 32 32 17 87 -39 -119 147 -42 -66 -52 -166 -67 -71 -73 -84 31 -69 3 108 157 -1 -25 -27 103 -17 -58
5489e8Q0j26N7O3P1j31J06P4j96K36o3o3k5l5p3R8j04P5MJ16j79j02J28N3pn0
$$ -58 22 -104 -47 16 87 -44 62 136 -60 176 113 50 25 -10 -83 15 -89 -14 -10 106 -73 -175 -47 6 -1 -51
5515e1J07P8j48j09J25m8J7K3l8P8p1k6J53j21K5O2P0k07J21j0j2l3R2j90R3j8
$$ -51 56 134 -14 -123 2 -46 -29 -6 -44 34 -37 -63 90 -31 -6 56 126 -81 40 30 18 -15 77 -113 -20 -38
5541c8J42P3j79Kkr9K48m3j36q9J17o8K10j91P8j44N9P6m0M8j56K1Q1Q7p6O3l8
$$ -38 104 177 -2 0 -2 -101 147 104 -32 -121 -4 -72 138 -53 25 -119 -60 16 -24 24 -132 -111 -30 57 -19 44 6
5568FJ11j76L0O9p1M6P5r0r6J03J55k04oJ69j39J12q4rN3j21J75n5m6j08J41O2
$$ 6 117 -59 -29 40 -31 15 90 0 -96 7 162 -42 -48 121 -18 94 10 1 54 -67 108 53 7 -101 40 102
5594A02j99Q6K4k51J66ql2J1J39jm2p0J92o2O4j15J64q0q1O7j39R2rl9n5J79r4
$$ 102 -97 -11 13 -238 -72 -80 -112 -101 38 37 -5 -75 117 55 119 4 168 88 7 74 -65 27 18 -21 -76 103 9
5621Ij21K06l2r6l5K02j32O7K6q9o4j4M5j4J03m5Q2k73J03M9P9n1pN2lR7k76J13
$$ 9 -112 94 62 -34 -69 133 1 68 94 5 -59 -73 -28 -42 61 16 98 -175 -72 -23 56 5 -2 50 47 144 -132 -19
5649a9N7l6Mj00J80k33J06J06j37J45lj91J65J7j29J71k37K53K4j04L7M0p0m7
$$ -19 38 2 6 -94 86 -147 -41 65 -72 73 70 -121 44 61 -68 103 -134 119 143 39 76 116 46 -1
5673ak8Q2P2j12L3m3L9J4k19K53ko2r9j09J00J82K0k23J26p6J92l17K71k0r4M
$$ -1 -29 53 125 13 46 3 42 56 -163 90 88 26 -73 -182 -82 100 120 -103 23 -53 139 -178 93 73 -21 -17
5699a7j40R1P9Q1J12j32j14k9O4N8j65j3J59r4J50m4q1K1j33J10P3j63K23q3k23
$$ -17 -157 -66 13 94 206 74 -40 -69 -5 53 -112 -125 34 -60 90 46 -35 -14 -147 -37 36 -127 96 13 -210
5724b10K74L8j01j02R4r1J08J85j98L0k15O6J64m9Rj5nN7O8k44K29p9lP7J4o6
$$ -210 64 102 1 -101 -7 -98 10 195 -3 27 -188 -122 42 -7 2 -13 -18 39 107 -137 92 13 10 87 101 35
5750C5K2m5j18J35J5m1n1L6o9o8J79n4O6m4j8J38j13n3K01j06P0j33K3l0J24j21
$$ 35 57 12 -106 29 44 3 -48 -12 -81 -149 30 -24 42 -2 -20 118 5 -48 153 47 117 -16 7 -23 101 -20
5776b0J09p4n3J25k7Qr1O9n2j0J8J05j42J39j48Pl8j21J31K2O9k4o0j2n4L3J51
$$ -20 89 15 -38 87 60 68 -23 46 -6 -16 2 107 -35 104 -44 -37 -75 -196 -65 -43 26 2 -58 -70 -124 -91 60
5803F0J37j20N6j75N4K6l4n3L3J47j38J9P2l2onq6p7oR7K4Q9j54n1J73M9J8Qj29
$$ 60 197 77 133 -42 12 38 4 -49 -16 131 -7 12 84 52 46 41 -45 -122 -128 -31 -7 82 -72 -123 50 99 117 125 -4
5832dJ53k20P2j73K23O4l6L2j21M5J0j87J63j7J05j01j33K37o6k0O8k62JK01n1
$$ -4 149 -71 1 -172 51 115 79 111 -10 35 45 -142 21 4 109 8 -125 112 46 26 94 -168 -167 34 -17
5857a7j1Q8P9r7M8o9N8j06r8J90L9r2J0q4j12K07J90k29K5Jm8L4J57R2l34J18
$$ -17 -28 60 139 42 90 21 79 -27 -125 65 104 12 22 -62 -174 33 223 -6 19 20 -28 6 163 255 -79 39
5883C9o9J69r6n5M8M3l0J7j9j18Q8m1J2jN9j94k4J28J33j03j6O3J97k45M5q1q
$$ 39 -30 139 43 -12 36 79 49 66 47 -71 17 -24 -12 -13 46 -148 -172 -44 89 -14 -30 33 230 -15 30 -51 -59
5910e9k6J59kj15J37j24P3M4q4R8k05P4n5MR1p7P6JL8j9J6l4QJ90j61J3l4Ln7
$$ -59 -85 74 72 -43 94 -30 43 87 3 101 -104 -30 -85 -81 10 -67 9 10 48 29 45 11 19 209 48 61 27 30 -27
5939b7K6k1MJ13j29J48j55J43n0M1o8n7O5o5P1k4q2M4o0J98r6oJ06r8j22l1J10
$$ -27 -1 -22 -18 95 -34 114 -41 102 52 93 25 -32 33 -32 39 15 -67 -23 -83 115 19 13 119 21 -101 -132 -22
5966b2J2k4R6q6L3o9J56Nk2M4j74l8P0M9k8j28K7J13k8k25J73R9k33K39J00j18
$$ -22 -10 -34 62 -24 9 -60 96 101 79 123 -51 -89 -19 30 2 -126 -99 14 -14 -239 -66 33 -200 39 139 21
5992B1j03J29J3M6o6RK6M9k39K46J5k23M6J0Kq5j8J32L6K1Mj71J30K6J33j21M3
$$ 21 -82 47 60 106 40 49 75 124 -115 131 146 -77 -31 -21 -19 -104 -122 10 46 67 71 -100 30 56 189 68 111
6019A11j01q1P7M5j16NO6P1Q6m2j34J20j35j85K53P8p2J7l0k7J25l0j13J22qK5
$$ 111 10 -71 6 51 -65 -60 6 77 163 121 -13 107 -28 -213 40 118 46 63 33 6 131 101 -12 110 102 127
6045A27j77P7m7P0j41J56l1j71J78j09K3Q9k01K73o9p5q6J91k9k55J67N6P1r2
$$ 127 -50 27 -20 50 -91 65 34 -137 41 -68 -45 44 -157 116 47 -28 -114 77 48 -207 -40 16 87 -5
6069epJ6j60M8P0pn9Q7J22r4q0%J83n8J03q5J0p3j7J6p2J21l5j0O1n2o2P5n7J19
$$ -5 -12 4 -156 -108 -38 -45 -104 -17 105 11 -69 -69 114 56 159 74 84 11 -6 10 -62 59 24 14 75 23 -39 36 -21 98
6099I8o9n9M6j11K06k42K30j05M1m8k9j02P2J90p9m3j32K74j50n0K08o0r8J06
$$ 98 29 -30 16 -95 111 -131 99 -6 35 -13 -42 -144 -72 118 39 -4 -136 138 -12 -62 146 86 -12 94
6123I4p1j44R2K9%l4J15k10J76L6j82K80j76l2o3J47m3J54j46L8r1M4N4j52J72
$$ 94 23 -121 -29 0 0 -34 81 -129 47 83 -99 181 5 -27 -90 57 14 168 22 60 -31 13 67 -85 87
6148H7on1J6PL6j12K4O3j18l3P2J03j78J59j26K00o9q1M1K6N7n5j05n9J59Q0o0
$$ 87 81 30 46 53 89 -23 1 64 -54 -87 -15 88 -90 69 -57 143 74 -7 34 60 117 62 -43 -102 57 137 77
6175G7n2R8q3q0k0K8N7J60j91K5j18oL38n2j70l7J92j23j29n2N4J33j55M3J74
$$ 77 25 123 40 -40 -60 -32 25 185 -6 19 -99 -105 233 181 11 -26 166 43 -86 -138 -84 49 -106 -63 111
6200A11j84J54l9j16lK07j28R4o3N0j07p3J8K24J26l54Q8J43r7j09l7J15r3j2
$$ 111 -73 81 42 -74 -77 130 2 96 33 83 -24 -97 -79 145 271 -83 5 148 51 -58 -95 20 -73 -85
6224h5K26j33m8Q5k3R9j08jl5QR5J4j30k4K10k27Q9j05M3R5j24k5L03k65K19R9
$$ -85 141 8 -40 45 22 121 13 12 -23 -15 80 94 -36 -60 150 -77 12 -93 -50 45 -79 -104 199 -66 153 252
6250B52k87o1N7m5O5P7nl0lk4M7j75K58m8l4r0N0nl0p1J08k61K45N6j75J39J4
$$ 252 -35 -96 -39 -84 -19 58 53 23 20 -4 43 -132 126 78 44 -46 4 -1 -31 -102 6 -255 -10 46 -129 10 24
6277B4j33J45j5k1J5o7N1o3kmK13j82j7P0N5n5k1JJ06j31R8j28j4J21J1m0J8l2
$$ 24 -109 36 21 0 15 -52 -1 -64 -66 -70 143 -39 -56 14 69 14 -7 -6 100 -31 67 -61 -75 46 57 17 35 3
6305Cr2P1J55k96Q0J13O2Pj73l3K13q6O1j39k5R8q0QL7J8J07k16J25J86j98n6
$$ 3 -89 -18 137 -159 -79 34 96 103 -70 -103 110 24 85 -54 -79 19 -61 -53 -16 2 109 -107 18 204 6 -50
6331e0r8J91j21N5J5o8m5K66l6k59K10N7J6k34r0L21k31R2Q9j03j3j6J19J22k75
$$ -50 -148 43 -78 -23 -8 -76 -121 145 109 -150 60 117 133 -101 -191 130 -101 -9 80 -23 -36 -52 67 189 -86
6356h6rK03N4k04N4n8Q0L7m9n8j2N1j16J24lll2J03N5p4o5J9N4j32J31K9j93R3
$$ -86 -95 108 162 -42 12 -46 34 71 22 -36 -48 3 -113 11 8 5 -27 76 131 57 -8 11 65 -67 64 93 -100 -7
6384gM7L6q5q4P2j9m7J77k2N9j71p4J3j7O1K08j21p4j14O7J56j85J62j07J24j34
$$ -7 40 76 -9 -93 -21 -40 -87 90 68 127 -44 -118 -105 -122 -61 147 26 -48 -162 -95 61 -124 38 -69 55 -79
6410g9J81r4P0j44l0M6l9K8j43K21k39K46j13P6L8M9j84Q7L5K9j8j14J58k7L3
$$ -79 102 8 78 -66 -96 -50 -89 -61 -204 17 -222 24 -89 -13 25 74 -110 -23 12 41 23 -91 67 40 73
6435G3j41k6J33l7qN8n7J36k45R9Q6q2K4j65O8p8K11j93J24J11j20J45j11lj4
$$ 73 -68 -94 39 2 -6 52 -5 131 -114 -15 71 -11 13 -152 -84 -162 49 -144 -20 91 -29 116 5 2 -12
6460a2j7K4Q8k32J68m5l6J2Q5j49M8J08k4N6j32L0o1N9mN4K9P7j42l6Q4j89K11
$$ -12 -29 -5 83 -149 19 -26 -62 -50 35 -114 -66 42 18 74 -58 -28 -89 -30 -34 20 49 126 -16 -52 32 -157 54
6487E4j64J13K1J81j49M7j99J47r1J2J20j5j8j41n8R6Q1p9N7O9j17j20P5J49o4
$$ 54 -110 3 24 205 56 103 -96 51 -40 -28 92 77 59 -82 -140 -44 37 -42 15 84 -33 -153 -78 71 7
6512GJ02j31J00K3r0j20K14K4j10lN4j11N5M3O4r3p9K47j46p5J00ok0j13l5R3
$$ 7 109 -22 78 101 11 -109 105 129 19 16 70 -41 14 57 121 28 -51 196 50 -25 75 69 49 -64 -99 -6
6538fl5J8o5N9P8j12J98j6j17mLJ45l10J59nO9k03J04J44o9m3n9R4k4R9j28L5
$$ -6 -41 -23 -88 -29 49 -63 135 119 2 -2 1 146 -164 -5 -10 59 -144 -40 104 35 -8 -67 27 3 102 -26 9
6565Ir0m2J51k7J41j76K6n7K02p9j12R4j68J92k12L11k09K3L8k1L5j3o7QRo6J56
$$ 9 -81 -123 28 1 142 -34 -8 -65 137 58 -54 40 -128 64 -148 163 -46 -23 15 -6 29 16 -51 -43 -34 -100 56
6592E6k3m8J36k32J11k3n0J98j96J29kO5o6o9L8J11Rj29J13n6q2o5J16j92K76
$$ 56 33 -15 121 -111 0 -23 -73 125 -71 58 56 121 55 -14 24 135 144 15 128 72 -10 -75 41 -151 125
6617A25j36lRR7m4q3J36j53J40n4q3J34j03q2J96r7J85k30N4q9Q0O2o6J23l36
$$ 125 -11 -14 -5 92 48 -35 101 -52 88 34 -49 85 -18 -100 96 -1 184 -46 8 -81 -1 61 -5 118 -218
6642b18K16j40Q3J27q7j39J66j06J35p0q5J42rj48M1O1RJ36j03L6Rj77jN5p0P3
$$ -218 -2 -142 -59 68 -19 -158 8 -98 37 -33 -118 24 15 -133 -92 -31 -22 114 11 47 56 -121 -122 -67 -137 -64
6668f4j31K27L3j57M4m8K79j62k2kO3r4Q4M5Q2j79N9K1n6M2p2j01J44j04J23p8
$$ -64 -195 32 65 -92 -48 -96 183 21 -1 -3 60 -34 50 95 177 -2 57 78 22 64 -8 -109 35 -69 54 -24
6694b4R3q4L1l8K0m6o8J93kr4R0nj15m3R8n4L8po2M7J01m6J6j05J56j22M4n1m9
$$ -24 69 -15 16 -22 -2 -48 -116 77 75 -19 71 66 -49 -92 6 -48 -10 -17 -79 -32 69 23 39 -66 90 -32 12 -39 -88
6723h8J33k70J36M9J32j18J06o4j29O6k0J58j58J42r8K7j41L03rn5p9j42J09j8
$$ -88 45 -225 -89 -40 92 -26 80 16 -113 -47 -67 91 -67 75 -23 4 -137 166 157 102 23 -119 -10 -28
6747b8M7l7j8j16J88l8J2j14n5J16k8O0n9n9J93L8P3p0p6j6N1O7k62N9M5M3q0
$$ -28 19 -18 -36 -152 36 -2 10 -104 -159 -43 -71 -11 -70 -129 64 102 175 105 29 13 64 131 -131 -72 -27 16 -64
6774f4L2l6N2O4J45j75K4j51L0L3K2J62j45nj6N8K5j67O7K5RO1K4j82R6J16j51
$$ -64 -32 -68 -16 48 193 18 42 -109 -79 -46 -24 138 -7 -12 -28 30 55 -112 -45 -20 -11 50 74 -108 -12 104 -47
6801d7k8M7O4n3r5J99j43K9j3O0r2N1j05J86q7l2l1o9K62j2p1J12j61j72J75j28
$$ -47 -75 -28 36 -17 -112 87 -56 -27 -40 20 -72 -21 -126 60 -27 -59 -90 -159 103 91 20 132 -29 -201 -26 -154
6827a54K99r3M3k4J6j55J5J27j69N7lR2j42K7R3pk9P1j04Q7j09L7N8M7k2m9r8
$$ -154 145 52 95 71 87 -68 -53 74 -95 -38 -41 51 -91 -64 29 22 -7 64 -40 47 -62 -25 33 80 58 9 -89
6854h9J66j80K22j06JM3m4K3J2Jj08J19k8l4J74j83n8J19J1j57L5J60k11J43j12
$$ -89 77 -103 119 13 14 57 13 36 48 49 -59 60 32 -2 172 -11 -69 50 61 -96 -61 99 -112 31 -81
6879h1J20j9J05j66J02l0l9J75k18l3M7l2J15q2l0nm4J10l8Q9k2p3j05M2N4K7
$$ -81 39 20 125 -41 61 31 -8 167 -51 -84 -37 -69 46 -36 -66 -71 -115 -5 -43 46 24 -49 -154 -112 -58 -31
6905c1n3L0K55o1j63n4J26j61K27r8o3rMj7J74k5p3q8J41j85J13m5R5o8N1Mk9
$$ -31 -84 -54 201 140 -23 -77 49 -112 115 17 -46 -55 -51 -68 106 81 8 -80 61 -124 -11 -56 39 -29 22 26 -3
6932cL5q8L9j4J01n7J4j0kj10J11q0J21J7j13m3J37N7L1r0j29l5J52N3k00Q3k8
$$ -3 32 -56 -17 -31 70 13 27 17 15 -95 16 -64 57 74 -39 -82 55 112 143 53 -76 -111 41 94 -106 -23 -51
6959e1R1k6o2Q0j62J54L5J28q7j41j9J73j80L6p7J36%Q8q8j26J98j06o2K7m8m8
$$ -51 40 14 -48 32 -130 24 59 187 100 -41 -60 113 -67 -31 -108 28 28 116 28 -98 100 -6 -68 -41 -89 -137
6985a37P5N6r1J34r7k2K57j45r0J11l0k6L6j30J61j34m4J57r3NK8k03L09q0JQ2
$$ -137 -62 -6 -97 37 -60 -82 175 30 -60 51 21 -5 31 -99 62 -72 -116 41 -52 -47 -19 -222 87 7 8 90
7011I0j26L1K0j62K38j31k9K16m3rk03J22N3N7r5J84k25l7L0N6No5Q2O3j35K5
$$ 90 -36 -5 15 -147 91 -40 -69 147 104 95 -108 14 67 124 29 213 -12 -49 -19 37 42 -23 59 122 -13 12
7037A2q8K25n9k25J60L7k40J50M7o5j5K43k22q7N1k4N7l2J69j53J36j53m1K3J5
$$ 12 -76 149 90 -135 25 62 -178 -28 19 -46 -61 182 -40 -127 -76 -100 -43 -75 94 -59 77 -76 -117 -94 -79
7062g9J32n1n2J9j41J21nJ50j41K32k2r9r3n3O2J15j57J8M6r7L18k43p3J85k3
$$ -79 53 2 -50 -31 -172 -51 -56 94 -47 185 163 64 -29 -82 -20 95 -62 -44 2 -95 223 -20 -93 92 69
7087F9o5J03j12j07J30j42L34k59P1k5N2j25J93j10k0J08J1k63J28l9R5P6j95
$$ 69 4 107 -5 -112 18 -124 210 -49 22 -3 49 -76 117 7 -13 95 106 -157 -29 -68 27 103 -92
7110i2J98nK6k21J8M8K7R0N7j64q1j2J3J70mj19k6q6J67N7j38J11k2Rr9L4J15
$$ -92 106 101 127 -94 -76 -28 -1 89 146 -18 -99 -111 -98 72 68 -51 -77 -163 4 61 -77 34 12 21 -78 -44 71
7137G1r4J3P4j2j60J07K9K8M3j72P9R4Ro6j07j14K93j86R4j21m3Q6n0K69j69m
$$ 71 -23 -10 64 52 -108 -1 28 56 99 -73 6 100 109 43 -64 -178 115 -71 23 -98 -141 -55 -105 164 -5 -9
7163ik3O0m7m1R6j09J19j33M3Q4M4k42K24n9Kj00QK30j0N0j70n9l4m7J79m9k3
$$ -9 -32 28 -19 -60 36 -73 46 -87 -44 40 84 -158 66 7 9 -91 -83 147 137 187 17 -42 -76 -123 56 7 -16
7190a6O4R3k03K30j55j2R7m6O2k0j73J9k4m2K76p3J8k4o3k68K56j2l9o0P5O0M4
$$ -16 48 141 -62 168 13 1 98 52 114 94 -79 -60 -84 -126 150 77 95 71 8 -260 -4 -16 -55 -115 -40 20 64
7217F4j09R7j67R2j16L8L8k0K2L2R4r3kJ69k79J76q8N9J14j72J38j02K2K9j28
$$ 64 -45 52 -115 -23 -139 -101 -63 -83 -61 -29 65 -28 -30 139 -140 36 -52 7 121 -51 87 -15 7 36 -92
7242i2K65j38j7j2m3jlM3r6J37j44J19M8n8m7O3j22q6J65L3k45J92q2R1nN7R3
$$ -92 173 35 18 6 -37 -38 -41 2 -94 43 -101 18 66 8 -39 24 -98 -184 -19 14 -231 -39 -121 -30 -35 22 115
7269A15J5k13OOJ03k1j87J15L2Jl9k2J8K26k01q8P9J2j4J6p1K4J1L4n6j0J14l3
$$ 115 130 -83 -77 -71 32 11 -176 -61 -29 -28 -67 -89 -71 155 -46 -134 -55 -43 -57 -41 -112 -88 -77 -43 -99 -109 5 -28
7297b8Q8Q8j60p2P4P9j16m0MJ22l7l0K4l0k4M3j03L20j42o3JJ82j85j3O5L4%k04
$$ -28 60 148 -12 -84 -10 69 -47 -87 -83 39 2 -28 -4 -34 -58 -15 -118 202 60 -3 -2 180 -5 -18 47 81 81 -123
7325a23oJ51l7J68j49J86j27k35K42k13L5J00J75k19Q4q5O0l3n2J38P1j51j48
$$ -123 -129 22 -15 153 4 190 63 -172 70 -143 -108 -8 167 -52 32 -53 7 -26 -78 60 131 -20 -168
7348a68K51l5O8p6p7J0K12k60M5M0R4j05O2r3RJ30q6J06j55J51r1n4k0K49k20
$$ -168 83 48 116 40 -37 -27 185 -75 -30 10 104 -1 61 -32 -23 107 21 127 -28 123 32 -22 -42 207 -13
7373a3J0j06J73L8j74j95K12l0J55k08K20L7j79P3n7q0J57L7j17O7o9QK30j63
$$ -13 -3 -109 64 102 -72 -267 -55 -85 70 -138 82 119 -60 13 -44 -124 33 70 -47 20 -49 -41 189 26
7397B6m1jl2J47j22jJ15l9k8O1j35J95k40K19j11J5j98J59Q2q4m6J2J02p0K2q4
$$ 26 -15 -16 -48 99 -23 -24 91 52 24 85 -50 145 -95 124 13 28 -170 -11 71 -13 -59 -47 55 -15 7 -77
7423g7P2o5K37n2j23l1l4J29J43k76J52o2K20k94J81j74J33pm3L2k28K93p9L6
$$ -77 -5 -70 167 115 -8 -39 -73 56 199 -77 75 13 233 -61 120 -54 79 72 29 61 -167 126 47 83
7447H3l8K9m8lQq4M9l7N7L7j90O0KJ29L1J4j8p5Ok0k6J23j55l8J00k3K4P4J09
$$ 83 45 74 26 23 31 -53 -4 -41 16 53 -137 -77 -75 54 85 99 81 6 12 -8 -34 89 -66 -104 -4 -27 -3 71 180
7476A80j69M7N6o2n1J81l10O1O7o2K4j43J60J93k29Mk7Q6R3n7o2K50k11L4N0J2
$$ 180 11 58 114 52 1 182 -128 -67 0 -62 -38 -181 -21 172 -57 -53 -80 6 99 42 -20 230 19 53 103 115
7502A15j07Qn4J55k7o4j7m0P6Q3j51O1j28J95j58R9r9J26O3j21k7o7L18k38qK0
$$ 115 8 16 -38 117 90 26 9 -31 45 128 -23 38 -90 105 -53 46 -53 73 136 15 -12 -79 239 1 -7 13
7528A3q3LO9j0p3J14J4j11j9J06o9j52J58l4K35j79L6P8J2q1j26M0R0j2jo3J8
$$ 13 -70 -67 2 -8 -81 33 47 -64 -83 23 -46 -198 -40 -74 161 -18 18 96 108 27 -99 -59 31 19 18 -45 -27
7555b7L4j14J47j26J26j51p9J54k9M8j26K23j22r3m9K10r6J50j74O1Q6j9J29p9
$$ -27 7 -107 40 -86 40 -111 -190 -36 -65 -17 -143 80 -42 -135 -184 26 -70 80 -94 -33 53 34 163 84
7579H4M4J7k31J47N9j59P3q0J03P6j07j5m7P2Q4j75J07j94J54N8q3%m3Q4N5l9
$$ 84 128 145 -86 61 120 -39 34 -46 57 133 26 11 -36 36 120 -55 52 -142 12 70 -13 -13 -56 28 83 44
7605D4q5J78j60N2O3p0j13NK18N7k88Q0O0O3Jl5m4k9J32k46P8p8m9J45L8j3j22
$$ 44 -41 137 -23 29 92 22 -91 -86 132 189 -99 -19 41 104 105 70 26 -3 129 -117 -39 -117 -166 -21 17 4 -118
7632a18J98P1j07m8Q1LQJ9k7j13J89j03J4p4m0j61J71Q1l3m3P3q1l2K16j73L3
$$ -118 80 151 44 -4 77 80 88 107 80 -33 156 53 67 -7 -47 -208 -37 44 11 -32 41 -40 -72 144 -29 4
7658Dj9m0K3J48J4m3kj17N4J8P0j68R2o4j8M6p4R7j13J00q9O2p6j0lJ6J43r1P9
$$ 4 -15 -55 -32 116 130 87 85 -32 22 40 110 -58 34 -30 -48 -2 -76 21 -92 8 -81 -19 -95 -105 -108 -92 51 -40 39
7687C9q5J45k34R4J10l8o8L7k2K0K6k1j1o4N4O9Kj94J29M6q3L4l9Q9l2J01j02
$$ 39 -46 99 -135 -41 69 31 -37 0 -22 -2 24 3 -8 -72 -18 51 53 -141 -12 34 -49 -15 -54 35 3 104 2
7714BJ13j73l5J28j26p5K68P1k26lN9Q0j12O1j4j52N1J3N7p7r7J44N6n9l7J4R5
$$ 2 115 -58 -93 35 -91 -166 102 173 -53 -56 3 83 -29 32 18 -134 -83 -70 -13 -90 -187 -43 13 -46 -83 -69 26
7741B6M9l9mK4l8j9p0j9k9M8N4J91j59p4J24j54K92k11M2k4%J1J24j72l4N3L7
$$ 26 75 36 32 56 18 -1 -71 -90 -119 -71 -17 174 15 -59 65 -89 203 -8 34 10 10 21 145 -27 -61 -8 29
7768B9r4M5J09j26J65k90J66Lj96K90j66K42j4k63J63Q2k00J23n1L8k5j9j87J59
$$ 29 -65 -20 89 -37 128 -162 4 7 -189 101 -65 177 163 -100 63 145 -55 68 17 55 30 11 -176 -17
7792a7k1R7K6Nj59n5J55j3m8K71p8j65J78p2j81J6K19j09o3M2J1J06j49M4j59
$$ -17 -38 59 85 90 -69 -124 31 18 -30 241 163 -2 176 104 -77 -61 158 49 -14 28 39 145 -4 40 -119
7817a19K6N2PJ06n3k3k0P2R2j20n5L6P7N8r8m0NP8k7k0j23R0J8j63K24J2q1m3
$$ -119 -93 -41 -34 72 19 -4 -24 48 140 20 -35 1 78 136 38 -2 3 81 54 34 -89 1 19 -144 80 92 11 -32
7845c2J40r8n1j9J4J0J44j92J20l9j3l9R7Nj6j25J02J54j85j46J81o9q7Q0P0R8
$$ -32 108 10 -41 -60 -46 -36 108 -84 36 -3 -16 -55 42 47 31 -94 8 162 -23 -169 12 -57 -144 -64 6 104
7871A04n1j7o3r9K19j38M9J00j74J80j22J44q8q9J53j74N9J64j72o6R8K43j73
$$ 104 53 36 -27 -126 93 -45 4 104 -70 110 -12 132 44 -45 108 -66 -7 157 -15 -81 17 260 87
7894H7j44j24L12q3M8k02J91j41P1k6R3j23M0M5M1r6J7j29J27M7j90J89j39NN6
$$ 87 -57 -181 131 48 96 -106 85 -56 15 -11 82 -41 -1 44 85 -11 6 -123 4 51 -139 50 -89 -84 -28
7919b8J45j98J35J29j65M2q8J5K7n1P6M1j63J72p4o3N1M2m3Q5j5mj40J00Q6k14
$$ -28 117 -81 54 183 18 60 -28 -13 14 -37 39 80 -83 89 15 -48 3 45 2 87 72 68 -72 28 114 -100
7945a00P6J03j28J08Pm6m3L8p3P1p5P8m6j36K78o2O1j64j09J54j34J17O0Lk6J09
$$ -100 -24 79 -49 59 66 20 -23 15 -58 13 -62 16 -30 -166 112 50 111 -53 -162 -8 -142 -25 35 38 12 121
7971A21k04j05J02J31j5q0j33Q9R1m7J19j03k3m4J14kk65J40L4L1J41k60J94p0
$$ 121 -83 -188 -86 45 30 -50 -183 -94 -3 -50 69 -34 -57 -101 13 11 -254 -114 -80 -49 92 -168 26 -44
7995d4l2R7p9OO4M2j31J59m9M4n5pNl9j23J97j15n1J39J79j82k3J00j39K1J20
$$ -44 -76 21 -58 -52 12 54 -77 82 33 77 22 15 20 -19 -142 55 -60 -111 28 207 25 2 102 -37 -16 104
8021A04p1J7j01N5o9l2L23m29J99p0P8l0PN2j74J58L8j06O4M4r4OnM3j47J06J01
$$ 104 33 50 -51 4 -65 -97 226 -203 -4 -74 4 -26 -19 33 -141 17 55 -51 13 57 -37 -31 -36 7 -140 -34 67
8048F7k51K91j13j74J05Q7nqMj06J77K7j9o0N8j67P5j3J23j8j07j6j61K08m3O0
$$ 67 -184 107 -6 -180 -75 12 7 -1 3 -103 74 101 82 22 80 -87 -12 -25 98 80 -27 -43 -204 4 -39 21
8074B1r5N1j28J68Kj6j08J81j45L0k3M1m0K03p3j19P6q9J91k41M1K%J40j61R4
$$ 21 -74 -23 -151 17 19 3 -105 76 -69 -39 -62 -21 -61 142 69 -50 26 -63 128 -113 -72 -70 -70 70 -91 3
8100Cj50J92N0k46J47j26N5K05j87K0P6kl1M3r4J18J3J4j14q8J1J26M3j68oQ5
$$ 3 -147 45 95 -151 -4 -130 -75 130 -57 -37 39 37 6 49 -45 73 86 100 -14 -102 -91 35 78 -90 -96 -11
8126a1m1N2J79j94j02J73ml4m4r1J73q0J42r8k2m1j1N1q2K16k27K2K61j97K3n3
$$ -11 -52 0 179 -15 -117 56 52 18 -26 -117 56 -24 118 20 -2 -43 -54 -3 -85 131 -96 -74 187 -10 13 -40
8152d0J08J27k9o6q5j11N7N6j48J74qJ0M9j79J49J86j17j43j12P7m6jp3K83k29
$$ -40 68 195 166 100 15 -96 -39 17 -131 43 35 45 94 -85 64 250 133 -10 -122 -45 -91 -92 -165 118 -111
8177a11R7K2R8j33J88M7j95K28pj13k04J23m4n7
$$ -111 -14 8 106 -27 161 208 13 241 234 121 -83 40 -4 -61
8191f1
$$ Imaginary data points
##PAGE= N=2
##DATA TABLE= (X++(I..I)), XYDATA
0@%%%%%%%%%%%%%%%Qj6J6j6J6k3L1l2L9m7N1n9P1q0Q9j04J20j36J53j73J96k20
$$ 0 0 0 0 0 0 0 0 0 0 0 0 0 0 0 0 8 -8 8 -8 8 -15 16 -16 23 -24 27 -32 39 -41 48 -56 64 -72 81 -92 104 -116
37a16K47k76L07l43L82m23M67n18N72o30O97p68Q45r31J025j131J249j380J529
$$ -116 131 -145 162 -181 201 -222 245 -273 299 -331 366 -402 443 -488 537 -594 655 -725 804
56H04j698J890k115K382k702L095l592M245n140O458q613J2787k4384J66510j39516
$$ 804 -894 996 -1119 1263 -1439 1656 -1936 2309 -2831 3627 -4986 7801 -16583 149927 10411
71A0411j5746R339p047N439m352L342k896K746k155J846j674J622j699J476j231
$$ 10411 -5335 4004 -3043 2396 -1956 1386 -1510 1236 -919 927 -747 875 -824 652 -579
86e79R64q62Q32q88J022r47O95m53L80l65L01k53L26l63M75n27K45j51L11j47
$$ -579 385 -477 355 -533 489 -458 237 -216 164 -201 100 -153 173 -190 285 -242 3 -148 163 16
106A6J29k06J35k19J25J1J31j35m0qJ15on7R5k74J48m1N0J73k32J56j31J39j89
$$ 16 145 -61 74 -145 -20 -9 122 -13 -53 -61 54 48 -9 86 -188 -40 -81 -31 142 -90 66 -65 74 -115
130a15J9Q4o0J07R7j32q1J07j00J4M8L9rJ83j98K3O0r9j08J10pM5N5j13R3n6K00
$$ -115 -96 -12 -72 35 132 0 -81 26 -74 -60 -12 27 18 201 3 26 86 -13 -121 -11 -18 27 82 -31 62 6 206
157B06k79J1P3L4j08L2J3K0j16J28j3J3r7Q6N1m7P0j49N3n7J74j68P2q4R0J47
$$ 206 -73 -62 11 45 -63 -31 -18 2 -114 14 1 14 -83 3 54 7 77 -72 -19 -76 98 -70 2 -82 8 155
183A55n6r6J15L7j44j26J02%J5j15j8O6M0L0j60M7J37l8J2J32J01k87J01J6j90
$$ 155 99 3 118 155 11 -115 -13 -13 2 -113 -131 -65 -25 5 -155 -108 29 -9 3 135 236 -51 50 66 -124
208a24J92%k04J62kk6q7J10j8l1K4j22K99n5j15k9J25j23l1L0J05o2J82j95k0
$$ -124 68 68 -136 26 24 -2 -89 21 3 -28 -4 -126 173 118 3 -26 99 -24 -55 -25 80 18 200 5 -15
233a5Q4l0l3j47K19n1J10n1k36P7J86m5r1Nl8M9J56k55J08K2j92K76j02m8O4m2
$$ -15 69 39 6 -141 78 27 137 86 -150 -73 113 68 -23 -18 -56 -7 149 -106 2 24 -168 108 6 -42 22 -20
259b0j20J88l9J40o2j32o1J22L6j3j71K9J71j94N9Q7mr8K03n6Mp2P1kl8q0j8J27
$$ -20 -140 48 9 149 87 -45 -106 16 52 39 -132 -103 68 -126 -67 20 16 -82 121 65 69 -3 68 66 28 -52 -70 57
287E7pn8J79j29n9l2L5mN0l9o1K72j66L8k66K14j36J19OM2j51Q7k0O5J5j46P7
$$ 57 50 -8 171 42 -17 -49 -14 -18 32 -7 -68 204 38 76 -190 24 -112 7 13 55 -96 -9 -29 36 51 -95 -18
314a8j25K96l44K09j10k5O4Q9j54K9o8K68j32j01J76n4P5o0J45r1p1J46p1r6J35
$$ -18 -143 153 -191 18 -92 -117 -53 36 -118 -89 -157 111 -21 -122 54 0 75 15 160 69 -2 144 73 -23 112
339A12r3lj80K71l7j61J03J21j45J40n5j4q4k8O4m4J1r5j7J57P0j54P3l0N6J3
$$ 112 19 16 -164 107 70 -91 12 133 -12 128 73 59 -25 -53 11 -33 -22 -117 -134 23 93 -61 12 -18 38 51
365E1o7L9o8N3j2J20j99j39L62m8k10J37n1N2j51J64j86J31N4k4J07o2R1j36k8
$$ 51 -16 23 -45 8 -4 116 -83 -222 140 92 -118 19 -32 20 -131 33 -153 -22 32 8 115 53 144 8 -20
390b0N7O2mm3j16q3K9J94q6J33j27J19k91J53K8j00K21j20k8j5Om1kO3O1j57Q0
$$ -20 37 99 95 52 -64 -147 -118 76 -10 123 -4 115 -176 -23 5 -95 126 6 -22 -37 -31 -72 -74 -11 50 -107 -27
417b7p2R4P8J12k87J05j19J13Q2j30J81q8l3k1N3m2j3j02L7Q8j00J58O6Mj76j9
$$ -27 -99 -5 73 185 -102 3 -116 -3 79 -51 130 42 9 -12 41 -1 -14 -116 -79 9 -91 67 133 137 -39 -58
443e8Q2J9m1j44J82O0r0m4N6M8r6J35j71M7m6J32j58R5JJ18k27O7L6R5j45P6O7
$$ -58 24 43 2 -142 40 100 10 -34 22 70 -26 109 -62 -15 -61 71 -87 8 9 127 -100 -33 3 98 -47 29 96
470I6J9r6q7J85k01J59j07K21m5j17J41j14n9O2j95P9Q5m6K4J3m4j71K58oO5j63
$$ 96 115 19 -68 117 -84 75 -32 189 144 27 168 54 -5 57 -138 -59 26 -20 4 17 -27 -198 60 54 119 -44
496d4oJ0j49K43pJ0Km9rK1o2L4j88J99r7k3J47p0L7J12k79J61l4Q9J77j72q0o8
$$ -44 -50 -40 -189 54 47 57 59 10 1 22 -40 -6 -194 5 -92 -115 32 -38 -1 111 -168 -7 -41 48 225 53 -27 -95
524i5J2J61o5m0j78J39K31k58R3P4j24J75j81M2J5%L3j25J67j69N3JJ36o1L6l4
$$ -95 -83 78 13 -27 -205 -66 165 -93 0 74 -50 125 -56 -14 1 1 34 -91 76 -93 -40 -39 97 36 72 38
550C8k24J50J61l02J45j37J22k4P3R0j36K13j22n5J48O8p6q6j20N5m6J30P5j43
$$ 38 -186 -36 125 -177 -32 -169 -47 -71 2 92 -44 169 47 -8 140 208 132 46 -74 -19 -65 65 140 -3
574cJ35p9Nj3L8J7j74j0mJ86j09J39j70P0J22j17K5j80L36k27J26p7J33k65L5
$$ -3 132 53 58 45 83 100 -74 -84 -88 98 -11 128 -42 28 150 33 58 -122 214 -13 113 36 169 -96 -61
599f1J02R6p9n6M8k0l9o1Mo0P1K01k3k31L48j7j62k18J56j08O4J04K5l3p6j8Q9
$$ -61 41 137 58 2 50 30 -9 -70 -66 -126 -55 146 123 -108 240 223 61 -157 -1 -109 -45 59 84 51 -25 -43 46
626D6q7m6Q6J10j11P1J8K3j3r1kJ3O7Ll7j12K22k70Q5Q3j31L8l7K3N6j63L7K32
$$ 46 -41 -87 -1 109 -2 69 87 110 97 6 4 17 84 87 50 -62 160 -110 -25 58 -73 -35 -72 -49 7 -156 -119 113
654A13r0j33j0k6O5J27j50J59j86J47q8N4L2N5m7j3O7J7j66J93j96J76J3k57J51
$$ 113 23 -110 -120 -146 -81 46 -104 55 -131 16 -72 -18 14 69 22 9 76 93 -73 120 -76 100 113 -144 7
679GL9r9PJ14j17Q8k13M2J70j62J83o2j7J08r6NP6r5m0RM4j10K85j02j16O1K3
$$ 7 46 -53 -46 68 -49 39 -174 -132 38 -124 59 -3 -20 88 -8 -3 73 -22 -62 -53 -9 -119 166 64 -52 9 32
706C2m5n7O4j55J19P5j04RP5n2J71k00O8rk71L10p3J88j8r1Q2ok46J15l5j3r2
$$ 32 -13 -70 -6 -161 -42 33 -71 -62 13 -39 132 -68 0 -9 -280 30 -43 145 127 36 118 112 -134 -19 -54 -67 -159
733a59K50r2j0K19j56j07l0o8J89m7R2k07P6J13Oj61K10k4r2M9j39O6O1l2k73
$$ -159 91 -1 -11 208 52 -55 -85 -153 36 -11 81 -126 -50 63 69 -92 118 94 2 51 -88 -22 39 7 -266
758b66K37q4L10j37M8O8k45J13j6j51J22o6K5j05M8J95o6J61l19J84m9j54K00
$$ -266 -29 -113 197 60 108 176 -69 44 28 -123 -1 -67 -42 -147 -99 96 30 191 -128 56 7 -147 53
781E3j59M8J29L0ON0j86l5K5N2n4J57q7o9o8J27J03j41R2j56J12nN6P8q1k77J07
$$ 53 -106 -58 71 101 107 157 -29 -64 -39 13 -41 116 29 -40 -108 19 122 -19 73 -83 29 24 80 158 77 -200 -93
808i3J18N1j49Q4r4K07m8k2o5P0m9q4J22j33J44j0l9m1k5Q0m3r1J12J6J2J32r5
$$ -93 25 76 -73 11 -83 124 76 54 -11 59 10 -74 48 -85 59 49 10 -31 -56 24 -19 -110 2 18 30 162 67
835F7o4j0J02j47J41q5QL3NJ4n3KJM5k7k9J5rj1R1O1j30j67K28j77L3KmN3L8M9
$$ 67 3 -7 95 -52 89 4 12 45 50 64 11 13 14 59 32 3 18 9 -2 89 150 20 -147 81 -96 -63 -61 -65 -12 26 75
866G5j48J18k4J58l40K27j7L2k5j37K15k92J11J30o0o5J19J9j69N6j9Lp1M6J12
$$ 75 -73 45 21 179 -161 66 49 81 56 -81 134 -158 -47 83 23 -42 77 96 -73 -17 -36 -33 -104 -58 54
891E4j98Q9J65J15k77O8M5lmkl9p4P7j00J38o4M4o2o9J22J56k77MK90k04N2N2
$$ 54 -144 -55 110 225 -52 16 61 58 54 52 13 -61 16 -84 54 -10 34 -28 -97 25 181 -96 -92 198 -6 46 98
918I8l1j05mO0o6K12r9J3j8J58j48k5J0Rl5k63K57L3Q0j33LQ0j91K04J05j36r1
$$ 98 67 -38 -42 18 -48 164 65 78 60 218 70 45 55 64 29 -234 23 56 136 3 6 86 -105 99 204 68 -23
945b3Q7K5j47j36J48J29m9J27j00j29L4QJ24p8n9J06j52J80j76rO8M3P1kk0j41
$$ -23 64 89 -58 -194 -46 83 34 161 61 -68 -34 -26 98 20 -39 67 -85 95 -81 -90 -22 21 92 90 70 -71
971g1q6J77q9O9j04J39p1lJ89j02l0j31L03j22L3j16O1Q5j73m0N8J14l0j83J41
$$ -71 -157 20 -69 0 -104 35 -36 -39 150 48 18 -113 190 68 101 -15 46 131 -42 -82 -24 90 60 -123 18
996A8m3J03r7NR4q0k83J78m5J86J31k53J79j75J20k3K7o8J57n8r9Q4n2j66Q8O5
$$ 18 -25 78 -19 -14 80 0 -283 -105 -150 36 167 -86 93 -82 38 15 42 -26 131 73 -26 58 6 -160 -72 -7
1022gn2J42j12q3K39n3J27j86J25p6J4j62R7o7L3n9J22j5q3J88j48L6L9K2k12
$$ -7 -59 83 -29 -112 127 74 201 15 140 64 78 -84 13 -54 -21 -80 42 27 -56 132 -16 20 59 81 -131
1047a31J59j70K46k72L36l28K49j36lR5jo2M2j19P8o0J11j74K11j38J53l7m7m
$$ -131 28 -142 104 -168 168 -160 89 -47 -50 45 44 -18 24 -95 -17 -77 34 -140 71 -67 86 49 2 -2
1071bJ17j52NJ1J4J14k2k9j37J40j35P2N2j73KJ02p9K5R2j5J7j00n1J5K6K95j4
$$ -2 115 -37 -32 -21 -7 107 85 56 -81 59 -76 -4 48 -125 -123 -21 -100 -75 17 2 19 -81 -132 -117 -91 204 190
1098A90m5p1j70J81j5q1Q2R6p4n5k1L0rJ2R5j30O2n5Nk43J65R2J90j84J13j07
$$ 190 145 74 -96 85 70 -11 71 167 93 38 17 47 38 50 145 15 77 22 27 -216 -51 41 231 47 160 53
1124E3l5Q2j92J41j8n1j61J81o5J83j24J2Kq1J63P2k63J59j26J19j18K0J6%l1
$$ 53 18 100 -92 49 31 -20 -181 0 -65 118 -6 6 8 -73 90 162 -101 58 -68 51 -67 -47 -31 -31 -62
1149f2RJ40N6j28J3O2r4m8l3K37j02m5Oqq5MRK08j74J32l4j08N0j59J36J13j80
$$ -62 -53 87 143 15 28 90 -4 -52 -85 152 50 5 11 3 -82 -78 -69 139 -35 97 63 -45 5 -154 -18 95 -85
1176h5l1k8P3L14j13j12o8J87p2l8QO8j39r8K08m0r3J31j31QK59j55N3k3n6o9
$$ -85 -116 -144 -71 243 130 18 -50 137 65 27 35 103 -36 -134 74 34 -59 72 -59 -51 208 53 106 83 27 -42
1202d2L9J10k42J13Ll2L8J38j06J58r6j20J70j41J07r6%R5k02K25j93J46j11o7
$$ -42 -3 107 -135 -22 -19 -51 -13 125 19 177 81 -39 131 -10 97 1 1 96 -106 119 -74 72 -39 -106
1226a06J10qK9r3K03k2j43J15n4n2P9q9jL3QK7J3J72j53j04JO2n6m4J05J0k36
$$ -106 4 -4 25 -68 135 113 -30 85 31 -21 58 -31 -32 1 9 36 49 221 68 -36 -35 27 -29 -73 32 42 -194
1253a94K36ko7R3o4j09oJ65n3k7o7J11Kj7j21J13n8J45j40m8J15q5K03q0Q2j16
$$ -194 42 40 -27 66 2 -107 -113 52 -1 -28 -95 16 18 1 -120 -7 -65 80 -60 -108 7 -78 125 45 127 11
1279A1j36J45o2J07J6k28K72j10j63R5j9M2k0j15J16k3L2rK4J28k62L86j10j55
$$ 11 -125 20 -42 65 81 -147 125 15 -148 -53 -72 -30 -50 -165 -49 -72 -40 -49 -25 103 -159 227 117 -38
1303c8n3j81K03O8J14p9k9m0M0K1k1m3J6q1K09k4p8J36j78Q0k7K3q7J27l01L12
$$ -38 -91 -272 -69 -1 113 34 5 -35 5 26 5 -38 -22 -103 106 82 4 140 -38 42 15 38 -49 78 -223 89
1329H9j29K7lR2j51K00j25l0M9p2M4L0p0q0m5J69L7K8l8k4J00j22M9K7Q2j85J36
$$ 89 -40 -13 -16 76 -75 125 0 -30 19 -53 -9 21 -49 -129 -174 -5 32 60 22 -2 98 -24 25 52 134 -51 85
1356H5j31p4J48m4J27j15J09l0p3J49j6n3j7j56rJ84j29J44j25J02p9mR3j08P9
$$ 85 -46 -120 28 -16 111 -4 105 75 2 151 135 82 65 -91 -100 84 -45 99 -26 76 -3 -7 86 -22 57
1381E7o3p4L6lJ65k8j71jPK86j29j89K45j78R8n2J9j09J76j33j36K65j75P2J28
$$ 57 -6 -80 -44 -47 118 90 -81 -82 -75 211 82 -107 138 -40 58 6 25 -84 92 -41 -177 88 -87 -15 113
1406A13r1l1j28J02K2m1J34j28o6M9K8J8J00P1j69J0m1j53L23j78J14o8n3%R0
$$ 113 22 -9 -137 -35 -13 -54 80 -48 -114 -65 -37 -19 81 152 -17 -7 -48 -201 122 -56 58 -10 -63 -63 27
1431B7k1k4J24j38j28J75p8J69j12J7J3l0J25m9p1q1K07n9r9J36j53m6j30J79
$$ 27 6 -18 106 -32 -160 15 -63 106 -6 11 24 -6 119 70 -1 -82 125 66 -33 103 -50 -96 -226 -47
1455d7m1J13k8l1J30j55J32k00N9O4J68k67K28k31RJ47Lo6M5j05k6J05R1j17j23
$$ -47 -88 25 -3 -34 96 -59 73 -127 -68 -4 164 -103 125 -106 -97 50 53 -13 32 -73 -99 6 97 -20 -143
1480a43K09j05M7O5k19J79j41P2j15K52p8%J4j58Q2O1L3k7P7n5P0j29NL7N0J23
$$ -143 66 -39 8 73 -146 33 -108 -36 -151 101 23 23 37 -121 -39 22 55 28 105 50 120 -9 -4 33 83 206
1506B06j80j24R0r7J56j81J81j54K4N3N5j10J06m0M0L9Or0p3M1j2J80k01J81j53
$$ 206 26 -98 -8 -105 51 -130 51 -103 -79 -26 29 -81 25 -15 25 64 70 -20 -93 -52 -64 116 -85 96 -57
1531e7J16K2j53K34k31R8N2Mj15KJ51k7j51J13j28R1Lo7K37j61P4j10Q4j0J32
$$ -57 59 81 -72 162 -69 29 81 85 -30 -28 123 96 -55 58 -70 21 24 -43 194 33 107 -3 81 71 203
1556B03j67O3j06m3P4o4J9J18k5qj14M1L9R0k05nM4J05j99R1l2J00m5k9O9L0j16
$$ 203 36 99 -7 -50 24 -40 -21 97 72 64 -50 -9 30 120 -85 -90 -46 59 -140 -49 -81 19 -26 -55 14 44 -72
1583g2J2J17N3k08M6N9J93j03k69J72n6Om4n4J30N0r8J50n7j19k4K25j64n0j27
$$ -72 -60 57 110 -98 -52 7 200 97 -172 0 -56 -50 -94 -148 -18 32 -66 84 27 -92 -116 109 -55 -105 -232
1608b32K48O7n5l8o8M5j9R1j64Q5J76k68R2P5J4r3K00j22q7m1L5R3j83J34K5n
$$ -232 16 83 28 -10 -78 -33 -52 39 -125 -40 136 -132 -40 35 49 -44 156 34 -53 -94 -59 34 -149 -15 10 5
1634Em2p1j6J03J28k02Q3j02j9J63L0j8n1N2o2L6O4n8O6j82P2J7o5N2r3j3K25
$$ 5 -37 -108 -124 -21 107 -95 -12 -114 -133 30 60 42 -9 43 -19 17 81 23 89 -93 -21 -4 -69 -17 -110 -123 102
1661A02j76m8J81j16J16l5j15J94r0M6n4M1r3jJ84k03Q1M8k0j0k1p8N6k4j60M9
$$ 102 -74 -122 59 -57 59 24 -91 103 13 59 5 46 -47 -48 136 -67 14 62 42 32 11 -67 -11 -35 -195 -146
1687a46J39N0P4j67k3k8K0L9L0k66K57K06l38J61q4K2p0L7l8J9J55J6r4Jk2K80
$$ -146 -7 43 117 -50 -73 -101 -81 -42 -12 -278 -21 185 -153 8 -76 -54 -124 -87 -125 -106 49 65 -29 -28 -50 230
1713B30q1k59J30j0m9O6J47o5j52j4k8K6j43J43P4j4n8J22j29J16j38L3M3O9m3
$$ 230 149 -110 20 10 -39 27 174 109 -43 -57 -85 -59 -202 -59 15 1 -57 65 -64 52 -86 -53 -10 59 16
1738A6K0p7j9J21M8k24J70j02R8k7m9q8J48j23R6J3o8J12j50J26j9J6K17j50r0
$$ 16 36 -41 -60 61 109 -115 55 -47 51 24 -25 -113 35 -88 8 21 -47 65 -85 41 22 38 255 105 15
1763A5p4J9K9O4R6j78P0k09J39O1p9J16j05PR2m2j11J41m4P5q4nOJ3L8j59O4m4
$$ 15 -59 -40 -11 53 149 -29 41 -168 -29 32 -47 69 -36 -29 63 21 -90 51 7 82 -2 -7 -1 12 50 -109 -45 -89
1791h9J65O4k34P7J34o9j83J10O4j31P5o5p4K3J24J9N1j55RJ33j25J28p8M0P8
$$ -89 76 140 -94 -17 117 48 -135 -25 39 -92 -17 -82 -156 -133 -9 10 61 -94 -85 48 -77 51 -27 13 91
1816I1p8j30M8J19l4j1m2R0n0QP2q4l3J40q4P2r4J5m4R2r8r8O7j0M4J37j47L8
$$ 91 13 -117 -69 50 16 5 -37 53 3 11 83 -1 -34 106 22 94 0 15 -29 63 -35 -133 -66 -76 -32 105 -42 -4
1844dR2l7p7J05o1n0N5j3Q2l8k6O9j18O4q5j09n8K10mJ9k7q6PK99j73J20j06l8
$$ -4 88 51 -26 79 18 -32 23 10 92 54 28 97 -21 43 -42 -151 -209 1 -3 16 -11 -97 -90 209 36 156 50 12
1872A2P8j69N0k5%J15J3j26J84j06r4P4J8k0r1J58n8P6k4j66k9J70N3QM2p8n9
$$ 12 90 -79 -29 -54 -54 61 74 -52 132 26 -68 6 24 4 -87 71 13 89 65 -101 -130 40 93 101 143 65 6
1899FJ1J36j26k3rO8j83J21J1J15j53N8n6J27m0n2O9j19q3K27J5q9j9p9N3J30
$$ 6 17 153 27 4 -5 63 -120 1 12 127 -26 32 -24 103 63 11 80 -39 -122 105 120 31 12 -67 -14 116
1925A16o6p6K6j50J75m7O1j82J22P0Pj1k1l7m6O3Q5k12J74j29J06Pl7J78j50o1
$$ 116 50 -26 0 -150 25 -22 39 -143 -21 49 56 45 24 -13 -59 4 89 -123 51 -78 28 35 -2 176 26 -35
1951c5K9k5O4K6k08K03j02J41N1j03l1O3j79J17J65p2r8M5j80J95J40k53J7j57
$$ -35 -6 -31 33 59 -149 54 -48 93 144 41 10 73 -106 11 176 104 6 51 -129 66 206 -47 -30 -187
1975a87J66n0K9J47k48J89M1j03N7Q6n0k64J66J13p0j01K05k61K37j68nlJ30m2
$$ -187 -21 -71 -42 105 -143 46 87 -16 41 127 77 -187 -21 92 22 -79 126 -135 102 -66 -71 -74 56 14
1999A4j34J00P9oL4j13r4J03Nq5J06J15l9r2k94K79O9k2j19J42j10K79l05R4n6
$$ 14 -120 -20 59 53 87 -26 -120 -17 -12 -97 9 124 85 -7 -301 -22 47 25 -94 48 -62 217 -88 6 -50
2024e0K0M4r3J28J5j35RN9k4J23j69p4J01N6k7J74j73j4n0L7K81k34p4J75k20
$$ -50 -30 14 -79 49 64 -71 -62 -3 -27 96 -73 -147 -46 10 -17 157 -16 -30 -80 -43 238 4 -70 105 -115
2049a15K46j64M3kj45R4P9m6J4J39k09k6J26p2j7J61j94M7K1QL6mj4P6j07M1n3
$$ -115 131 -33 10 8 -137 -43 36 -10 4 143 -66 -92 34 -38 -55 106 -88 -41 -20 -12 24 20 6 82 -25 16 -37
2076c7r7J46k4pQm8J30Nj8k0j17N2J19l1%j17P0J07l2k06J54m3R4p6J28P7l50
$$ -37 -134 12 -12 -19 -11 -59 71 76 58 38 -79 -27 92 61 61 -56 14 121 89 -117 37 -6 88 12 140 217 -133
2103a33J09Nq2M5K55k76O1n5P0j20L4J20J99j96o2J5J24j15R5J2n2No7J88k83
$$ -133 -24 -19 -101 -56 199 -77 -16 -71 -1 -121 -87 33 232 36 -26 -11 113 -2 93 105 53 58 -9 179 -104
2128a04J54j86K8J74J1j28J85k96K35Rk37L9J62J11j65r5J43j26O2n3Q0L7Q0q9
$$ -104 50 -136 -108 66 77 -51 134 -162 73 82 -155 -116 46 157 -8 -103 40 -86 -24 -77 3 40 120 31
2152C1k6J52lj22j99J59p4J1LrJ23j40J95M8j53m0n6n1N9J21n7J05k03K16j73
$$ 31 5 157 154 32 -167 -8 -82 -71 -68 -77 46 -94 101 149 -4 -44 -100 -151 -92 29 -28 77 -126 90 -83
2177h3J03R4m4k4q8k7q9J40k4L8o1R6J7N6j84M4R5l5Q5r1J5r8O1nR3q4q6kO2l7
$$ -83 20 114 70 46 -42 -69 -158 -18 -42 -4 -65 31 48 104 -80 -36 59 24 109 18 33 -65 -4 -9 84 0 -86 -88 -26 -63
2207f3J03J8j65Q7mJ71r8k2r2J63j0K5j7p4j39J10J76j82j02K26j92J8R7p8R5
$$ -63 40 58 -107 -20 -24 147 49 27 -65 98 88 113 96 22 -117 -7 169 -13 -115 111 -81 -63 34 -44 51
2232E1q8O4R5j49Kj27J55KM6j81K17j60K6J56j93J53J04q6j98R2L3L8lj7p7K10
$$ 51 -37 27 122 -27 -25 -152 3 5 51 -130 87 -73 -47 109 -84 69 173 87 -111 -19 14 52 49 32 -45 165
2258A65k49K26j73J23l9J8No2j5N8q2P9j4j05J94j21M6pj09J02O1oj44R9k5p1
$$ 165 -84 142 -31 92 53 71 76 14 -1 57 -25 54 40 -65 129 8 54 47 -62 40 101 95 -49 50 25 -46
2284d6J74n0r0n1L7j9jJ42j10J2J48j68j75L15j47M1l9Q2j33O0K6Q4q4j22K53
$$ -46 128 78 -12 -63 -26 -45 -46 96 -14 -2 146 -22 -197 118 -29 12 -27 55 -78 -18 8 92 8 -114 139
2309A39j90M9j07J95j43J13j21Q5K7n5j6r0Q0mP7j13O5OP8j60Q8L7m7n0K16j66
$$ 139 -51 -2 -109 86 -57 56 -65 20 47 -8 -24 -114 -34 -38 39 -74 -9 -3 75 -85 3 40 -7 -57 159 -7
2335gj9j40K71o8p6l1jJ97k33O3P9pj13J15J01j41P5p1P4p3n9J9j51K43n5K15
$$ -7 -26 -166 105 37 -39 -70 -71 126 -107 -44 35 28 -85 30 131 -10 65 -6 68 -5 -64 -45 -196 47 -8 207
2361B07j68q2J09j78J60j13MO3j26J3K63k02O8j16P1JL7N5j95P2Q3j47J5R6K0
$$ 207 39 -43 66 -112 48 -65 -61 2 -124 -111 152 -50 18 -98 -27 -26 11 66 -129 -57 26 -121 -106 -10 10
2386A0P3L6j79L9K28r9k39M7j1O5L3n0O5Q8n4r0l9J06J03j45Kp2NJ15r4o5M9m
$$ 10 83 119 -60 -21 207 108 -131 -84 -95 -30 3 -47 18 106 52 -38 -77 29 132 -13 -11 -83 -78 37 -57 -122 -73 -77
2414g7J86j14o0J31pn9qJ19J6j39n0K07Ok17J00m3J08j30n9J88j46N5r3Q5MN9
$$ -77 109 -5 -65 66 59 0 -8 111 127 -12 -62 145 151 -66 34 -9 99 -31 -90 98 -48 7 -86 -1 3 62
2440F2r3R5j16pJ86q2j80J19j44J25J12n3Q9o7N8j50j4J41k6j60PM5j35J4K44
$$ 62 -31 64 -52 -59 127 45 -135 -16 -160 -35 77 24 113 46 104 -46 -60 81 55 -105 -98 -53 -188 -174 70
2465G0q1j24J42l3r4M7n4PJ95l5m4R2k2j13jO3l4k3J12l4L9q6o8Q7P1j04J8K3
$$ 70 -11 -135 7 -26 -120 -73 -127 -120 75 40 -4 88 66 -47 -48 15 -19 -42 70 36 75 -11 -79 8 79 -25 -7 16
2493A6l8l5j5j62J69K4k0j5R4oL2j7jl0L5j86Q6J3J67k53K49j46J4q9Nm3J02O8
$$ 16 -22 -57 -72 -234 -65 -41 -61 -76 18 12 44 27 26 -4 31 -155 -69 -56 111 -142 107 -39 -25 -114 -109 -152 -50 18
2521A8Q6N0k02p3P5r8K53q7m8Q3j27N9M4M9l6k05J46J8j64K5J97j37o4J95j81
$$ 18 104 154 -48 -121 -46 -144 109 22 -26 57 -70 -11 33 82 46 -159 -13 5 -159 -134 63 -74 -138 57 -124
2546a24k6J14k6M2L0j6j75L20kj84n1Q0j03J22k1n8J10L1j3j40J23N2j30J59j83
$$ -124 -150 -36 -62 -20 10 -6 -181 139 137 -47 -98 -18 -121 1 -20 -78 32 63 50 -90 33 85 -45 114 -69
2571f9K6j3OO1mO4j27J94k34O4J72J1k02j5P5M2m7J48q1m4j76R8O4M4n3j39L11
$$ -69 -43 -56 -50 11 7 71 -56 138 -96 -32 140 151 -51 -66 9 51 4 152 71 27 -149 -51 13 57 4 -135 176
2598A76r2j25Q8q5J99k88J45o0Q2k6j29lJ22O8j56J98j10K0l4J6j03J52j46o2
$$ 176 84 -41 47 -38 161 -127 18 -42 40 14 -115 -118 4 72 -84 114 4 24 -10 6 -97 55 -91 -153
2622a53J55J0K8l7j40L7N1K35j49Qk5J7j28J54P6n9k07J24%qk7J88k05k9j4R1
$$ -153 2 12 40 3 -137 -100 -49 186 37 45 20 37 -91 63 139 80 -127 -3 -3 -11 -38 150 -55 -84 -98 -7
2648glj22K30p7M2n0M6j04M4j27j22L31l0P9l8j60K9P9j85Q0m0K06j40P6p4l4
$$ -7 -10 -132 98 21 63 13 59 -45 -1 -128 -250 81 51 130 92 -68 -39 40 -145 -65 -105 101 -39 37 -37 -71
2674g1J11l1P0j01L5j3O0nN8j28j27N1J19O9j28J29j67o4J47j47K06m4r6J35J30
$$ -71 40 9 79 -22 13 0 60 55 113 -15 -142 -91 28 97 -31 98 -69 -133 14 -133 73 29 -67 68 198
2699A98k03j4k9L8R2j38j6K59k16M7QJ4L2r0M6j23Q8L3J02j42K2l2j0l9L3J64
$$ 198 -5 -19 -48 -10 82 -56 -72 187 -29 18 26 40 72 -18 28 -95 -7 26 128 -14 8 -24 -34 -73 -40 124
2725A24r8Jj36J63j07K19j57J17j55J56J2j94J45j35R9j15mJ41P3k53K34nn0o
$$ 124 26 27 -109 54 -53 166 9 126 -29 127 139 -55 90 -45 54 -61 -65 76 149 -104 130 125 75 69
2749F9q5L6m8p8J49K7k1j6j34K5K0R9r6J73j10l2J5o6P2N5p9J54o3rr9J5P0l8
$$ 69 -16 20 -28 -106 43 70 49 33 -101 -76 -56 43 -53 120 10 -22 -7 -73 -1 54 -25 129 66 57 -42 -27 43 5
2777Em8Q5k8K3k2Q1k0j2k40K09j03J24k06J61Q0j02J25q8j8j16O9M7K6o3Mo3J61
$$ 5 -43 42 14 37 15 96 76 64 -176 33 -70 54 -152 9 89 -13 112 24 6 -110 -41 6 32 -31 -27 -90 71
2804G1j06N6J35k33J52m5r3l0J22O0j29J99j49Q2o2rp9k8J8p9L39j70j85K35j57
$$ 71 -35 21 156 -77 75 30 -63 -93 29 89 -40 159 10 92 30 21 -58 -86 -68 -147 192 22 -163 72 -85
2829h5J12L8j71P4J39o3J35k00N7n7J8j02J65o5Q4N5j65K5j03L2q4M1K64j20K
$$ -85 27 65 -106 -32 107 44 179 -21 36 -21 -3 -105 60 -5 79 134 -31 -6 -109 -77 -161 -120 144 24 26
2854B6j87K59j84J7o3RK72j76N3k18R1J52p6J9r0M8j8o9J15j0OML9J48k51Q8j75
$$ 26 -161 98 -86 -69 -132 -123 149 -27 26 -192 -101 51 -25 -6 -96 -48 -66 -135 -20 -30 -24 -20 19 167 -84 4 -171
2881a71J32qQ9o2kRJ77k44J17o1j4J01j6R5K7p5k2j84P0J65j85J02j3o0jJ49r0
$$ -171 -39 -47 42 -20 -22 -13 164 -80 37 -24 -38 63 47 142 169 94 72 -112 -42 123 -62 40 27 -33 -34 115 25
2908B5o0oJ5J1o6j8J24o4j9J40k28k4J17N5M8p6J41j28N8Jo5L2J8J21j21J1l0
$$ 25 -35 -41 -26 -15 -81 -99 25 -39 -58 82 -146 -170 -53 2 50 -26 115 -13 45 46 -19 13 31 152 31 42 12
2935A2l3J19j58J4J8J7N1n6K9J23j13J25m6j20Kj2l9J98k73J31m0n6R9p6J68k33
$$ 12 -21 98 -60 -46 -28 -11 40 -16 13 136 23 148 102 -18 -16 -28 -67 131 -142 -11 -51 -107 -8 -84 84 -149
2961a49J16R5J8n4r9R5NJ0p5KJ0J0jn2J00o3k8oR6k6j27J41J1Qp5J3R6q5l6J88
$$ -149 -33 62 80 26 -73 22 27 37 -38 -36 -26 -16 -17 -69 31 -32 -60 -66 30 4 -123 18 29 37 -38 -25 71 -14 -50 138
2991A38LK9l62O9J44j5j84J87J67j97J2p6m4J75j51NJ82o4J28j99N7l2M8k4P9
$$ 138 141 170 -192 -123 21 6 -178 9 176 -21 -9 -85 -129 46 -105 -100 82 18 146 -53 4 -28 20 -4 75
3016G5r2J18o8J9o8M9j18OJ45j97K54J16l63K6K66j05j24P2q3L5K18j72J3j25
$$ 75 -17 101 33 52 -16 33 -85 -79 66 -131 123 239 -124 -98 168 63 -61 11 -72 -37 181 9 22 -103
3040a03R7n8kJ24J02k37O9r5Q8r5P6P2n7J10on1j37Q3K30k33J7n0N0j36J01J15
$$ -103 -6 -64 -66 58 160 -77 -8 -103 -15 -110 -34 38 -19 91 85 34 -103 -20 210 -23 -6 -56 -6 -142 -41 74
3066G4j81L6N2M1p4j27J14J29r0J67k20J39j16K37q6k03J41K9o2j21J08pj09J18
$$ 74 -107 -71 -19 22 -52 -179 -65 64 -26 141 -79 60 -56 181 95 -108 33 62 0 -121 -13 -20 -129 -11
3090a1n5J38j06J62l5m3m0m6j8J36o7J05N9j06k12J14J61p9r3j00N0J52O6k69
$$ -11 -66 72 -34 128 93 50 10 -36 -54 82 15 120 179 73 -139 -25 136 57 -36 -136 -86 66 132 -137
3114a37P0N7jO1j29N7K0R4r9j0k53L53l3K7ml9J2k6J72p0k49J49o7j27K75j57
$$ -137 -67 -10 -11 50 -79 -22 -2 92 -7 -17 -270 83 50 77 73 34 46 20 192 122 -127 22 -45 -172 103 -54
3140e4L3L7K6j06N4J3j91K06N0N3q7J02j74J38j49N2J6j9j20K28m7j6J33j09m4
$$ -54 -21 16 42 -64 -10 3 -188 18 68 121 34 136 -38 100 -49 3 19 0 -120 108 61 45 178 69 25
3165B5m1m9J07j7j32O9o6kk0J98j21K7J02p0p7L1J81op8j41J04J2p4O2O9j29J22
$$ 25 -16 -65 42 25 -107 -38 -104 -106 -126 72 -49 -22 80 10 -67 -36 145 139 61 -80 24 36 -38 24 93 -36 86
3192H6j87J26n8N6Rq6j29L25j72J81j85M0K8j4j40J09l8J03j5q1R4J5J03j63L3
$$ 86 -101 25 -33 23 32 -54 -183 142 -30 151 -34 6 34 20 -120 -11 -49 54 39 -42 52 67 170 7 40
3217D0n9K3j50K27j63J14j78K25q1J3j2j20K02j71o2J24J19Pq5l3K8Q2k7j41l8
$$ 40 -19 4 -146 81 -82 32 -146 79 -2 11 -1 -121 81 -90 -152 -28 91 98 13 -20 8 90 63 -78 -116
3242a16J84q0L7j29J17j55O6J4K2J15k14K32k8m6l4J24j54k5O8J8j80J79J25j21
$$ -116 68 -12 25 -104 13 -142 -76 -62 -40 75 -139 93 65 19 -15 109 -45 -70 -2 16 -164 15 140 19
3266A9o6o9J7O7L8m5N8m3J9l4n4n4N4J33O5j39J55j43PN5o1O4K9n6j21p5L08j37
$$ 19 -47 -116 -99 -32 6 -39 19 -24 -5 -39 -93 -147 -93 40 105 -34 121 -22 -15 40 -21 43 72 16 -105 -180 128 -9
3294im1j8k7J31o1J8q6J46q8K15j82r6K78n5j20m7n1j2J42j22J02q2j8M5J13n
$$ -9 -50 -68 -95 36 -25 -7 -93 53 -35 180 -2 -98 180 125 5 -42 -93 -105 37 -85 17 -65 -83 -38 75 70
3320G0Q9l52J62J25o5n6J28k0J05j81k3N8m2J65j66k2j4L2j05P0j8J01j40J8J70
$$ 70 159 -193 -31 94 29 -27 101 81 186 5 -18 40 -2 163 -3 -25 -39 -7 -112 -42 -60 41 -99 -81 89
3345H9k03R7j48P2L01k51L7p8J33j41J56j40J50j80J7o7%R4J11j6N8j21K4N2o3
$$ 89 -114 -17 -165 -93 208 -43 -6 -84 49 -92 64 -76 74 -106 -89 -156 -156 -62 49 33 91 -30 -6 46 -17
3370a7j19K06k5n2Mj23L25l73K99k9j73K39j57M9l0J1j10J73NQ1j17j99J49q7
$$ -17 -136 70 45 -7 -3 -126 199 -174 125 96 -77 162 5 54 24 35 -75 98 103 184 67 -132 17 -70
3394g0J16l4P2j11J9p4L1J45j35Kj81r2K46K08k39P6Q4r5o6K21Qj87Q9l6n3P9
$$ -70 46 12 84 -27 -8 -82 -51 94 -41 -39 -220 -312 -66 142 -97 -21 63 -32 -98 123 131 -56 33 -3 -56 23
3420B3Lj04J17J10k58j3K03j90J69n8p1J01j07J16j00J1j13K46r0L3Rj18J14n1
$$ 23 26 -78 39 149 -109 -122 81 -109 60 2 -69 32 -75 41 -59 -48 -161 85 -5 28 37 -81 33 -18
3444a8Ol4J44m9p7l7q3Q6J24n4J26n9j43P0p8J67j59O5j0k8K2N6j26L7J33J09
$$ -18 -12 -46 98 49 -28 -65 -148 -62 62 8 134 75 -68 2 -76 91 -68 -3 -13 -41 -19 37 -89 -52 81 190
3470A90k89N8J23jj32O3j06mJ01n4LK2J3o6M1l0P1M7N9q0j18R5J08j53M7M9r7
$$ 190 -99 -41 82 81 -51 12 -94 -98 3 -51 -48 -26 -13 -79 -38 -68 3 50 109 29 -89 6 114 -39 8 57 -40
3497d0K4J21p4k26J57n6m0K35j22j9O0J05q6j9K6n6rO3j37oJ39j23J45Rm1r4Q7
$$ -40 -16 105 31 -195 -38 -94 -134 101 -21 -40 20 125 39 20 46 -10 -19 44 -93 -99 40 -83 62 71 30 -64 23
3524B3o1kJ36k25J93O5j71RJ20J74k14r1J77k12Q5o9O9o2L2K5L3M7Rj78K36j82
$$ 23 -38 -40 96 -129 64 129 -42 -33 87 261 47 -44 133 -79 6 -63 6 -56 -24 1 34 81 90 -88 148 -34
3550c4P1O8J6j29k3m2R8L7k9k1O0j54n0R3L6j3j48R6N7j9Q6j81R8n8J71K3n8j72
$$ -34 37 105 121 -8 -31 -73 25 62 33 12 72 -82 -132 -39 -3 -16 -164 -68 -11 -30 56 -125 -27 -85 86 109 51 -121
3578a21R7J36j63q1J95l7J4r1n5K38j63r5N1J46k03J27j4R0R5j84k0J80k77K88
$$ -121 -24 112 -51 -132 63 26 40 -51 -106 132 -31 -126 -75 71 -132 -5 -19 71 166 -18 -38 142 -135 153
3602A53j68J25j38J08j03Q5k2j10O7M7o5q4K47n3q6Q4k72J78k1Q5K11k71J0mJ6
$$ 153 -15 110 -28 80 -23 62 40 -70 -3 44 -21 -105 142 89 3 87 -185 -7 -28 57 268 -3 7 3 19
3627A9J0Q7j20o3j19J52K5K4l9K9q4J15L1r0P5K6o3j0%N0j0j61P8o8N4pJ13N1
$$ 19 29 116 -4 -67 -186 -34 -9 15 -24 5 -79 36 67 -23 52 78 15 5 5 55 45 -116 -38 -106 -52 -59 54 105
3655A05l0q7J73l5n8Rl7P1o7k3K1oq9J78k48K20j67K23j25l6J22j32J09j16J07
$$ 105 75 -12 161 126 68 77 40 111 44 21 42 36 -53 125 -123 97 -70 153 28 -8 114 -18 91 -25 82
3680H2m7O3j89Q0p3J76q7l4J53o9q9j76J89R6j9j95K97L4j62J20k02o0l0K35p2
$$ 82 35 98 -91 -11 -84 92 5 -29 124 55 -34 -210 -21 75 56 -139 158 192 30 150 -52 -112 -142 93 21
3705B1j81O2J45j6j97J68jj19J11j8l7M8L1L0n5Kj4J1Q3j44j3L7j42J95K3n8j5
$$ 21 -160 -98 47 31 -166 2 1 -118 -7 -25 -62 -14 17 47 -8 -6 -20 -9 74 -70 -83 -46 -188 7 30 -28 -43
3732d3j13J69l4m2j9J27L0q6KO6O2L2j73O9k4j21P8%Q1n9J70k73N3J08l9rl5j
$$ -43 -156 13 -21 -63 -82 45 75 -11 -9 57 119 151 -22 47 23 -98 -20 -20 61 2 172 -101 -48 60 21 12 -23 -24
3760b4j2m3N3J25j0n3o6o4N7K1L2RL6j9l8r9N9J27p3j51J51o9P5k33R2K68l10
$$ -24 -36 -79 -26 99 89 36 -30 -94 -37 -16 16 25 61 42 4 -95 -36 91 18 -133 18 -51 24 -209 -117 151 -159
3787a59m6K20L0j30J82j33M9j29J54m9Q5N2j29q8M3m4M9K0Q0N9J6j67rq6P2P6
$$ -159 -205 15 45 -85 97 -36 13 -116 38 -11 74 126 -3 -91 -48 -92 -43 -23 57 116 132 -35 -44 -130 -58 18
3813A8p3N3K3j4m7k8J24j10J32o1o5m5nM9P4K8k40J14J27j54J34O4m8n1q7J69
$$ 18 -55 -2 21 7 -40 -68 56 -54 78 17 -48 -93 -98 -49 25 53 -187 -73 54 -100 34 98 50 -1 -88 81
3839H1k44J69n1O5R7j61k0J24O7j97P0j40J93J2J0m1p3N8k10J04K5p4J75n8oL2
$$ 81 -163 6 -45 20 117 -44 -64 60 127 -70 0 -140 53 65 75 34 -39 19 -191 -87 -62 -136 39 -19 -25 7
3865Gq9J51Lj95P2L2O6j6K5o9Oo5J07O7j24j0J0o9PP8P1j57M9L0mJ20n7P3j44
$$ 7 -82 69 72 -123 -51 -19 47 31 56 -13 -7 -72 35 102 -22 -32 -22 -91 -84 -6 65 -92 -43 -13 -17 103 46 119 -25
3894b5p3J93j98J10J37j81J85m9R3j10M1k95J84o0L7l9k4Q8o7J27j06J8M6L8m
$$ -25 -98 95 -103 7 144 -37 148 99 192 82 123 -172 12 -48 -11 -50 -74 14 -53 74 -32 -14 32 70 66
3919F6j04R3m6j2l4J75j22j7p7m0M5N6R1j08L8N1r3L0Q0j84N3N3Jm0j89K39N5
$$ 66 -38 55 9 -3 -37 138 16 -1 -78 -118 -73 -17 74 -34 4 55 -38 -8 72 -112 -59 -6 -5 -45 -234 5 60
3946F0N9l4l2j32J80j45N0J2o7Q9Nk2M6Qo0k7N8R1k50J80j20P3m4m2N2L1JL2Q7
$$ 60 119 85 53 -79 101 -44 6 18 -49 40 45 23 69 77 17 -10 48 139 -111 69 -51 22 -22 -64 -12 19 20 52 139
3975A39j89NM3J01j12j85J68qMkj3J17m7j14K42k13J10l9n2m3J07Q4j1j44k4l1
$$ 139 -50 -45 -2 99 -13 -198 -30 -38 -34 -36 -49 68 21 -93 149 -64 46 7 -45 -88 19 103 92 -52 -76 -107
4001a07N8K23k23k3j0k7J65pj02r9J56Q6K3j68j6o1K21O5j29k5K6o1q2J59j85
$$ -107 -49 174 -49 -72 -82 -109 56 49 -53 -152 4 90 113 -55 -71 -132 89 154 25 0 26 -35 -117 42 -143
4026a43J58JK2j19J19q0J40J16j22j55J62m3j77J06n4J08o4k2J18o5m2j22J92
$$ -143 15 16 38 -81 38 -42 98 214 92 -63 99 56 -121 -15 -69 39 -25 -47 71 6 -36 -158 34
4049C4p1J28q6L0qk6J06j76p9J71O1J34k78P5K9m1J52j70L8J3l4o7J18N2r7R7
$$ 34 -37 91 5 35 27 1 107 -69 -148 23 84 218 -60 15 44 3 155 -15 23 36 2 -65 53 105 8 105
4075A05j7J9j17K18p4o0j25J68r4p5J07L3j05K0pj52J02J41N6k33J11l8J39k49
$$ 105 88 107 -10 208 134 74 -51 117 23 -52 55 88 -17 3 -4 -156 -54 87 143 -90 21 -17 122 -127
4099a27J06q2O8j25J43J80k41L8J6K3J1N5o2O3j14J6N3J3N7O7j49O0r4QK8j20
$$ -127 -21 -103 -35 -160 -17 163 -78 -40 -24 -1 10 65 3 66 -48 -32 21 34 91 158 9 69 -25 -17 11 -109
4125a09l8R7m9J81j25L7O0j79O0J0N5k3Q1N0j30j35P7M3J37J6j18J40k70J59o8
$$ -109 -147 -50 -99 82 -43 -6 54 -125 -65 -55 0 -23 58 108 -22 -157 -80 -37 100 116 -2 138 -132 27 -41
4150d1P1k3jj01P0k2J28K8k06P4l0O3J49p6o5M6k0m4j7l7J90M6k27J23j78J19
$$ -41 30 7 6 -95 -25 -47 81 109 -97 -23 -53 10 159 83 18 64 44 0 -17 -54 136 182 -45 78 -100 19
4176A9R0j81R4L2j16K1Ok6J30k69J44J38r2j7P8l0J0J6mj38J37j13K41k29J16
$$ 19 109 -72 22 54 -62 -41 -35 -61 69 -200 -56 82 -10 -27 51 21 31 47 43 -95 42 -71 170 -59 57
4201E7j16O8OO8j46J28n3l0P6n0J1j29J8J07j5l8q2J49j44K0J26o1R7k50R8J41
$$ 57 -59 9 15 83 -63 65 12 -18 58 8 19 -110 -92 15 0 -38 -120 29 -115 -95 31 -30 67 -183 -85 56
4227E6Nj34km0J2J33J21j36r9J04L6k38K50j93J52m0m3J46Q7j52l5k0J2o5J24
$$ 56 61 -73 -75 -115 -103 30 151 15 -84 20 56 -182 68 -125 27 -13 -56 90 177 25 -10 -30 -18 -83 41
4252D1p0j06K33j75Q4j31J7Q6J04j06N0k0L8j21k2J51n5N4r1j45J00M4Q2l6K7
$$ 41 -29 -135 98 -77 7 -124 -107 -21 83 -23 27 7 45 -76 -98 53 -2 52 -39 -184 -84 -40 42 6 33
4277C3J07j93K4p9J66Pj35jN8j02K7J74J3j56J9K08k03J32j79K01j27pK1k6M0
$$ 33 140 -53 -29 -108 58 65 -70 -71 -13 -115 -88 86 99 -57 -38 170 -33 99 -80 121 -6 -13 8 -18 22
4302B2J14k29K81k49lO2K6J74j41o9P9Jq5k1J90j48J81k44j22J85l0j76K89PM9
$$ 22 136 -93 188 -61 -64 -2 24 198 57 -12 67 68 -17 -38 152 4 185 -59 -181 4 -26 -202 87 94 143
4327A43k79J25Q4j07J11o4m0m0J03r2L5K5oOJ52r3J2R7j62j48K17j04l6J08r3
$$ 143 -136 -11 73 -34 77 13 -27 -67 36 -56 -21 4 -2 4 156 63 75 172 10 -138 79 -25 -61 47 -46
4352d6J9J11k4m6ll6J80j84No9R2J05j06m0mJ58o9j62J89l6o1JQQK6O3j55k8Q9
$$ -46 -27 84 60 14 11 -25 155 -29 -24 -93 -1 104 -2 -42 -46 112 43 -119 70 34 -27 -26 -18 -10 16 79 -76 -104 -15
4381a5J19j47r8K93j73K7n0M9j06M5M1J28j31M0j85k9K45K6p3j69L34j82P4q5
$$ -15 104 -43 -141 152 -21 6 -44 5 -101 -56 -15 113 -18 22 -163 -192 53 79 6 -163 171 -11 63 -22
4405b2O7n9J12o9o6P3k1p6Q6m7J06o4J06j32J72N1l96J71j40M0J28J06j00j2j27
$$ -22 45 -14 98 29 -37 36 15 -61 25 -22 84 20 126 -6 166 217 -179 -8 -148 -108 20 126 26 14 -113
4430a13J31j72J22J16q3j0K3j1L5N2or0J12j23l6R8j8M7j44m0J67p9Q3q3l4L7
$$ -113 18 -154 -32 84 1 -9 14 3 38 90 84 -6 106 -17 -53 45 27 74 -70 -110 57 -22 61 -22 -56 -19
4456a9l4O8j29J18n6N1oJR4q2P5Jp7Q9j24N4m2k6J73k34J98l3q7N8lk1O0l0r2
$$ -19 -53 15 -114 4 -52 -1 -7 -6 88 6 81 82 5 94 -30 24 -18 -44 129 -105 93 60 -27 31 28 7 67 37 -55
4485e5J44J5q5m7j44J03K16k53R6M8q2P6K5k7p0l3J32j00lM2Q7j09J20q0p0O9
$$ -55 89 104 19 -28 -172 -69 147 -106 -10 38 -44 32 57 30 -40 -73 59 -41 -44 -2 85 -24 96 16 -54 15
4511A5N1Mr5N4n3R9J11j73j32P4K16k98K20p3l2r0J47q5Mp9L5J76j75J02r3J98
$$ 15 66 70 -25 29 -24 75 186 13 -119 -45 171 -127 93 20 -12 -102 45 -40 -36 -115 -80 96 -79 23 -70 128
4537A28j39N1j37J19O3r6M9j09k3J29j19J45j02l5J43j45J93n1O1q4n2K9Q7j68
$$ 128 -11 40 -97 22 85 -11 38 -71 -94 35 -84 61 -41 -76 67 -78 115 64 125 41 -11 18 105 -63
4561f3Q9k8m6J31j74J95k34K49j02j24J65j34P5j19J40P3j22j18J31oj23j7j6
$$ -63 26 -2 -48 83 -91 104 -130 119 17 -107 58 -76 -1 -120 20 93 -29 -147 -16 -22 -145 -162 -178
4584a78K74o4N8j71J14j38O0K9J01p8n4M4q9JK46l10J96j02mo0L49m11J85L9q7
$$ -178 96 32 90 -81 33 -105 -45 -16 85 7 -47 -3 -92 -91 155 -155 41 -61 -65 -125 224 -187 -2 37 -50
4609e0N5J2K13l29k8K66r3K3l2J62k68j37L1J32K08k78J46m8J0j16J02P9j45m0
$$ -50 5 17 230 -99 -127 139 46 69 37 199 -69 -206 -175 -43 165 -113 33 -15 -5 -121 -19 60 -85 -125
4633a25K00j60j6k1J70p4R1R6j31o3O7q0J23rK4q0k2l8P3N0o6j03J04m1J64j59
$$ -125 75 -85 -101 -122 48 -26 65 161 30 -33 34 -46 77 68 92 12 -10 -48 25 75 9 -94 10 -31 133 -26
4659b6J12k06O1n3n1K72r2j4O4k74J65k0O0K6M4Q7k14J27nj18n8J89p9J70j51
$$ -26 86 -120 -59 -112 -163 109 17 3 67 -207 -42 -62 -2 24 68 155 -59 68 63 -55 -113 76 -3 167 16
4684A6NPj31K85j51r6J26o5j12J21p4O2K03l22J12R5l9lj64L46l50J70j08J67
$$ 16 21 28 -103 182 31 -65 61 -4 -116 5 -69 -7 196 -126 -14 81 42 39 -125 221 -129 41 -67 100
4708A00j79OJ09K5r9n7J93n5j51J81j25O2J03j02j35R0J6m7M8j00J62o5k7m3K52
$$ 100 -79 -73 36 61 -38 -95 98 43 -108 73 -52 10 113 11 -124 -34 -18 -65 -17 -117 45 -20 -47 -90 162
4733A62J1k95J16Rl7N2Kj1n2j7R8O6j42K09k63q0P6K39j74j15K76n8J5n4O5qk9
$$ 162 173 -122 -6 3 -34 18 20 9 -43 -60 38 104 -38 171 -92 -172 -96 143 -31 -146 130 72 87 33 98 90 61
4760F1m4k9N5o9k2JL9M3n5nj08K31r9j7P9k18J27p7K48k97J84Qj71m0K02oN7q0
$$ 61 17 -12 43 -26 -48 -47 -8 35 -20 -25 -133 98 -1 -18 61 -157 -30 -107 141 -156 28 36 -135 -175 27 21 78 -2
4788bk0n0l7K3j7L8N0N2J76j65m6j28J71j25K10k1j30J86j50j49J05m9J61J11
$$ -2 -22 -72 -109 -86 -103 -65 -15 37 213 48 2 -126 45 -80 130 109 -21 165 15 -134 -29 -78 83 194
4812A94j28p3K5j47L7J84j32j04L2K13k41M9J11k3O3j6mL4j29P0J25r3n5O7P8
$$ 194 66 -7 18 -129 -92 92 -40 -144 -112 101 -140 -91 20 -3 60 44 40 74 -55 15 140 47 -8 59 137
4837A37j1k09J05Oj03j33J97j75k2J24k7K99k68M2M4J2J9p5k6K0J46j76K7O9k72
$$ 137 126 -83 22 28 -75 -208 -11 -186 -208 -84 -111 188 -80 -38 6 18 37 -38 -64 -44 102 -74 -47 22 -250
4862b50K27j48J44n8PK04j50mO4Q4j66P6j7LL3J50j56j82K31J5j55J26k18J7J90
$$ -250 -23 -171 -27 -85 -78 126 -24 -28 36 120 -46 30 13 16 49 199 43 -139 92 107 -48 78 -140 -123 67
4887F7q4k2R3r4j2P4k6j50J56o6K13q1j09p8L8n8J79J11j72j26j1K09j68K08j06
$$ 67 -17 -39 54 -40 -52 22 -4 -154 2 -64 149 68 -41 -119 -81 -139 40 151 -21 -147 -158 51 -117 91 -15
4912a5n3l2K51j86mp8O8J21k00Q0O5p6J25j80N6J2M6R2j95K9j05J68J7M1j44J37
$$ -15 -68 -100 151 -35 -39 -117 -49 72 -128 -48 17 -59 66 -114 -58 -46 0 92 -103 -74 -179 -11 6 47 -97 40
4938D0Q5k16P8p7J31oj45J40Q1m0o2N3j48n1J83K3j59J7L5N2j08%P1R5p5j38J08
$$ 40 125 -91 -13 -90 41 35 -110 30 111 71 9 62 -86 -137 46 69 -90 -73 -38 14 -94 -94 -23 72 -3 -141 -33
4965c3K0N3j50L4M7L1m8K9M3Q5r8o6K39j54r2M7l4M9J8k06K30J32j82o2l4J80
$$ -33 -13 40 -110 -76 -29 2 -46 -17 26 111 13 -53 186 32 -60 -13 -47 2 20 -186 44 176 -6 -68 -102 78
4991G8l3j1o4l2O9r5M7N8n2K3rn7j13K43j07P4J95m06J10R8m1J78k3l4n7m1J8
$$ 78 45 34 -30 -62 7 -88 -41 17 -35 -12 -21 -78 -191 52 -55 19 214 -192 -82 16 -25 153 130 96 39 -2 16
5018A6j17P5P6M6Q3k40O3J30n7j03J56k16P3R2K0k2m4r7J76m2j65L0J91j82o8
$$ 16 -101 -26 50 96 179 -61 2 132 75 -28 128 -88 -15 77 97 75 31 -66 110 68 -97 -67 124 -58 -126
5043a26J96pj87J57Q1k07K9K3l4P7J84n5j70R0L0n5j63Q1jk3J03N0k73J69j1o1
$$ -126 70 63 -124 33 114 -93 -64 -41 -75 2 186 131 -39 51 81 26 -137 -56 -57 -80 23 73 -200 -31 -42 -103
5069a03J14jN8q8m7J45k17K03j4k3j44J80q3l7L5J2m3P7M0q8J08k03n2K37j71
$$ -103 11 10 68 -20 -67 78 -139 64 50 27 -117 63 -20 -57 -22 -10 -53 24 64 -24 84 -119 -171 66 -105
5094a05N2Q1n6k4M9p7M6O1M0j43J10j64J15QK9j6M7j84K27l6j39O1j18l2K83k54
$$ -105 -53 28 -28 -52 -3 -80 -34 27 67 -76 34 -130 -15 -7 22 6 53 -131 96 60 -79 -18 -136 -168 115 -139
5120a39J88L2j38J25o1m6P9jM4j7J2j11J06m0P9j37j4O5r4q4K82l70K96j06j6
$$ -139 49 81 -57 68 7 -39 40 39 83 66 78 -33 73 33 112 -25 -39 26 -68 -152 130 -240 56 -50 -66
5145f6o4J58J2p1r9P8K64l79PJ8J67j16J03J6j24J72j50J26K8k13N1K10j43%j
$$ -66 -130 28 40 -31 -130 -52 212 -167 -160 -142 25 -91 12 28 -96 76 -74 52 80 -133 -82 128 -15 -15 -16
5170a6J84k49r8K02j40K61j56M5l5j00P2O6j09J32l74L61P5j92L5M5R1j14n1J05
$$ -16 168 -81 -179 23 -117 144 -12 33 -2 -102 -30 36 -73 59 -315 46 121 -71 -36 9 100 -14 -65 40
5194D0n3p5KJ73q0L7j20L2N3M3j49J0RJ00l9MNm1J76m8l4Q5Mp8M4l9P9j06Lq4
$$ 40 -13 -88 -86 87 7 44 -76 -44 9 52 -97 -87 -78 22 -17 -13 -8 -49 127 79 45 130 134 56 100 61 140 34 37 -47
5224d7M1J09j2j49n7J72k9o5J39j92J44o2o5J58j39L3n1J58o6J0j0j25KQ2k2J22
$$ -47 -6 103 91 -58 -115 57 28 -37 102 -90 54 -8 -73 85 -54 -21 -72 86 20 30 20 -105 -103 -21 -43 79
5250G9p8l1p5K4L2j2L2J03p8rj2N0J21j52m8n7K4J35J03j96L3N9L8j47O0J8j1
$$ 79 1 -30 -105 -81 -49 -61 -29 74 -4 -13 -25 25 146 -6 -54 -111 -87 48 151 -45 -12 47 85 -62 -2 16 5
5277Erj36n5K10l9j3J11J03k09J8M0O6l4k01L62l18N7%R4m4J14j60Q%M2m4n3J14
$$ 5 -4 -140 -195 15 -24 -37 74 177 -32 -14 26 92 58 -143 219 -99 -42 -42 52 8 122 -38 -30 -30 12 -32 -85 29
5305B9k11K24K2M0l35K37L6p9L1r0N9o4j0Q6P6N4j44O7N2l00R1J55q8J88l9m3
$$ 29 -182 42 64 104 -231 6 42 -37 -6 -96 -37 -101 -111 -25 51 105 -39 28 80 -220 -129 26 -62 126 87 44
5331D4j9J09k77K3J26kK2m9R8j1j5%M3j39j06L5J22L4O8j41J48p1j34J16k0K3
$$ 44 25 134 -143 -120 6 4 26 -23 75 64 49 49 92 -47 -153 -118 4 38 106 -35 113 42 -92 24 4 27
5357B7o8k1K6P3r2KL9P7O2j91Nn0K07n4n2p6J40r7K2M7j16jN7J0J09j51P6O4Q0
$$ 27 -41 -62 -36 37 -55 -53 -14 63 125 -66 -61 -111 96 42 -10 -86 54 -43 -21 26 -90 -91 -34 -24 85 -66 10 74 154
5386A54j76j11J51j38Q7J68j75P2j2J55k19n9J12j19J67J01o4N8k58R6J47k1j08
$$ 154 -22 -133 18 -120 -33 135 -40 32 20 175 -44 -103 9 -110 57 158 94 152 -106 -10 137 116 8
5409Hn8K03j88K58k82o1R1j05J31m4M2j87K98p6J02j53R3r5J35k8Q0l43K68j63
$$ 8 -50 153 -35 223 -59 -120 -29 -134 -3 -47 -5 -192 106 30 132 -21 72 -23 112 84 164 -179 89 -74
5433g4M0mQP5n6J09j9j02O6k3j34K26k9O7k00j6J22j17J9J2K8j29J33r4L0j12
$$ -74 -34 -38 -30 45 -11 98 79 -23 43 20 -114 112 83 150 -50 -66 56 -61 -42 -30 -2 -131 2 -92 -62 -174
5459a74K09j79J77p7K3QQ1Rj8j56J7n5N2J18qoj4j8M3Rj02J30Q5J9l48jP5J33
$$ -174 35 -144 33 -44 -21 -13 68 77 59 -97 -80 -135 -83 35 27 21 7 -11 32 41 -61 69 154 173 -175 -176 -101 32
5487C2r0J5m6P7J25j32J27j2m6L2p6K03j37%j56m4Q3l3n3K41m4j39J29J9j2j09
$$ 32 -58 -43 -89 -12 113 -19 108 96 50 82 6 209 72 72 -84 -128 -45 -78 -131 110 66 -73 56 75 63 -46
5513d6Nj01M4J70j00m4K28n6j83J24r8N3r4P5M5q4QJ22j32k5N6N3O5Q8r7j12N2
$$ -46 -41 -142 -98 72 -28 -72 156 100 -83 41 -57 -4 -98 -23 22 -62 -54 68 -64 -89 -33 20 85 173 76 -36 16
5540A6n6o1J11r2K12q8n8m9O9j26J95J22k00j07Q0l1K1j5J8R6k1k1m5NL0Pj94
$$ 16 -40 -101 10 -82 130 42 -16 -65 4 -122 73 195 -5 -112 -32 -63 -42 -57 -39 57 36 15 -30 -25 5 12 -182
5567a82P6K1j4J28L6k35J44j56J19Q2q8J21j76M0qL4K8J75J3o4j03K4j08QL3M3
$$ -182 -106 -85 -99 29 65 -170 -26 -182 -63 19 -69 52 -124 -84 -92 -58 -30 145 158 94 -9 15 -93 -85 -52 -9
5593iN9M7j65NJ68o0N3j19MQ7j22N8Q1k55J41N2j03L3Nj11J37o3m7P4m9k9J43
$$ -9 50 97 -68 -63 105 45 98 -21 -17 70 -52 6 87 -168 -27 25 -78 -45 -40 -151 -14 -77 -124 -50 -99 -128 15
5620A5O5j57K24j64m4M4J65k82P4Q8M5m6P3m0j54R2n0Q4m7j5qo1L0N2Rrl5jJ6
$$ 15 80 -77 147 -17 -61 -17 148 -134 -60 28 73 27 100 60 -94 -2 -52 32 -15 -30 -38 -99 -69 -17 -8 -17 -52 -53 -37
5649c7L5JL1n1nnj9r4M0K8J19m4o9J65M6n7j43R1J05k70L0kK2k2K62l0l6j81o2
$$ -37 -2 -1 30 -21 -26 -31 -50 -144 -104 -76 43 -1 -70 95 141 84 -59 32 137 -133 -103 -105 -83 -105 157 127 91 -90 -152
5678a52N0M7oJ78j19J00q6m6L76n38J13J65m3j6j33J73l2l6r6J46k4k1L6R6r0
$$ -152 -102 -55 -61 117 -2 98 12 -34 342 -196 -83 82 39 23 -110 63 31 -5 -101 45 21 0 36 132 42
5703D2k16K24j33J0N2J61j28J34j20j41N9j7q3O5L17k65J12j4j9j53K8N1j8P0
$$ 42 -174 50 -83 -73 -21 140 12 146 26 -115 -56 -73 -156 -91 226 -39 73 59 40 -113 -85 -34 -52 18
5727A8n1J65j95J99r9j56j5rN0J27k7k3o2Q5m4Q5m0J28j16n5JlNQ1k4J28k34N3
$$ 18 -33 132 -63 136 37 -119 -134 -143 -93 34 7 -16 -78 7 -37 48 8 136 20 -35 -34 -37 -32 49 25 153 -81 -28
5755b8J31j17K1pp2M3K25j06o5o0K00k14rL3k5J26J7J6j98J9J7J37r2L4j52J29
$$ -28 103 -14 7 0 -72 -29 196 90 25 -35 165 -49 -58 -25 -50 76 93 109 -89 -70 -53 84 -8 26 -126 3
5781COj4j29K36j08j11J29M8M1J1m2j15o6O0J1M0M2j89L37j62L0o5o2J76k6j66
$$ 3 9 -5 -134 102 -6 -117 12 60 101 112 70 -45 -111 -51 -40 0 42 -147 190 28 58 -7 -69 107 81 -85
5807h5jJ50q8m0J34Lj04M7M7j00J77k98J18N0n6o5q0Q3r4K89j9j14J68k00O7o1
$$ -85 -86 64 -24 -64 70 73 -31 16 63 -37 140 -158 -40 10 -46 -111 -191 -108 -202 87 68 -46 122 -78 -11 -72
5833g2L8n4M6J3J35o1l4q8R1j8m0o7J30k7j9N4pk7N9K5j15J00j15Q1n2L0J00m8
$$ -72 -34 -88 -42 -29 106 45 11 -77 14 -4 -44 -111 19 -8 -27 27 20 -7 52 77 -38 62 -53 28 -24 6 106 58
5861E8m4Kj61K37J34j79j59Q3P3Pl8q1qj02LJ45l3J11l6M8j59N0n2n8J12J2J9
$$ 58 14 16 -145 92 226 47 -112 -29 44 51 13 -68 -76 -178 -175 -30 -63 48 12 60 -99 -49 -101 -159 -47 -35 -16
5888a6o3j3Q7J50j18Pj26J95k22P8m4J94j80K75p7k38J19k9J00j68J97j27n4J59
$$ -16 -79 -92 -5 145 27 34 -92 103 -119 -41 -85 109 -71 204 127 -111 8 -21 79 -89 108 -19 -73 86
5912H6j10L9P1p5J46j74J22l0j57o0K57K1k04O8M9q5O8j53R0P3q6J13q8l3L4Q5
$$ 86 -24 15 86 11 157 -17 105 75 -82 -142 115 136 -68 0 49 -36 32 -121 -31 42 -44 69 -19 -52 -18 67
5938F7j48n0m1J42l8J87l5o1R2j68M0r6m8K67k29K9J57r4N8lJ12k75JK17q6m3
$$ 67 -81 -131 -172 -30 -68 119 84 23 115 -53 -13 -109 -157 110 -119 -90 67 -27 31 28 140 -135 -134 83 -3 -46
5964d6n6J45J14j37O6k17K53m9L6q9L6r2R4q2N3pJ7j08K1M1n0J2N7M8N2o0m6k4
$$ -46 -102 43 157 20 86 -131 122 73 109 20 56 -36 58 -24 29 22 39 -69 -48 -7 -57 -45 12 60 112 52 6 -18
5992a8L6j75K22j45M1p4j3n8Q3J09k44K06Jk3n1J3J61j31R1o2p2J27O8j43j42
$$ -18 18 -157 65 -80 -39 -113 -126 -184 -101 8 -236 -30 -29 -52 -103 -90 71 -60 31 -31 -103 24 92 -51 -193
6017a93K66J5j9j22m9J27j09J77lqj06M6l2MO6k7q7J43p2n2l4m0J81k21J59j4
$$ -193 73 88 69 -53 -102 25 -84 93 90 82 -24 22 -10 -6 60 33 -54 89 17 -35 -69 -109 72 -149 10 -4
$$ [...]
8191i5
##END NTUPLES=NMR FID
##END=
