##TITLE=1H_SR112
 CDCl3
 8 sc, 
 17.03.2022
##JCAMPDX= 6.0         $$ Bruker NMR JCAMP-DX V2.0
##DATA TYPE= NMR FID
##DATA CLASS= NTUPLES
##ORIGIN= UXNMR, Bruker Analytische Messtechnik GmbH
##OWNER= root
$$ XWIN-NMR		Version 3.5
$$ Fri Mar 18 12:03:12 2022 Russian Standard Time (UT+4h)  she@DPX200
##.OBSERVE FREQUENCY= 200.131346
##.OBSERVE NUCLEUS= ^1H
##.DELAY= (6, 6)
##.ACQUISITION MODE= SIMULTANEOUS
##.ACQUISITION SCHEME= undefined
##.AVERAGES= 8
##.DIGITISER RES= 18
##SPECTROMETER/DATA SYSTEM= spect
##.PULSE SEQUENCE= zg30
##.SOLVENT NAME= CDCl3
##.SHIFT REFERENCE= (INTERNAL, CDCl3, 0, 15.7039)
##AUDIT TRAIL= $$ (NUMBER, WHEN, WHO, WHERE, WHAT)
$$ ##TITLE= Audit trail, XWIN-NMR		Version 3.5
$$ ##JCAMPDX= 5.01
$$ ##ORIGIN= Bruker BioSpin GmbH
$$ ##OWNER= she
$$ F:/spectra/data/she/nmr/H-F/1/audita.txt
$$ ##AUDIT TRAIL=  $$ (NUMBER, WHEN, WHO, WHERE, WHAT)
(   1,<2022-03-18 11:58:27.15 +0400>,<she>,<DPX200>,
      <created by zg, POWCHK disabled, PULCHK disabled
       configuration hash MD5:
       00 E9 B6 7A A2 85 ED C7 34 08 36 98 17 FE 4E 26
       data hash MD5: 16K
       9A 7A 4D 60 26 1C 2A 82 17 75 3B 8C B6 36 DB 48>)
$$ ##END=
$$ 
$$ hash MD5
$$ B4 51 2E 8E 2B 22 BD 62 03 0A AD 58 54 93 4B C3
##$RELAX= 
##$RELAX= 
##$RELAX= 
##$RELAX= 
##$RELAX= 
##$RELAX= 
$$ Bruker specific parameters
$$ --------------------------
##$DU= <F:/spectra>
##$EXPNO= 1
##$NAME= <H-F>
##$PROCNO= 1
##$TYPE= <nmr>
##$USER= <she>
##$AMP= (0..31)
100 100 100 100 100 100 100 100 100 100 100 100 100 100 100 100 100 100 
100 100 100 100 100 100 100 100 100 100 100 100 100 100 
##$AQSEQ= 0
##$AQ_mod= 1
##$AUNM= <au_zg>
##$AUTOPOS= <>
##$BF1= 200.13
##$BF2= 200.13
##$BF3= 200.13
##$BF4= 200.13
##$BF5= 200.13
##$BF6= 200.13
##$BF7= 200.13
##$BF8= 200.13
##$BYTORDA= 1
##$CFDGTYP= 0
##$CFRGTYP= 5
##$CHEMSTR= <none>
##$CNST= (0..31)
1 1 145 1 1 1 1 1 1 1 1 1 1 1 1 1 1 1 1 1 1 1 1 1 1 1 1 1 1 1 1 1 
##$CPDPRG= <>
##$CPDPRG1= <>
##$CPDPRG2= <>
##$CPDPRG3= <>
##$CPDPRG4= <mlev>
##$CPDPRG5= <mlev>
##$CPDPRG6= <mlev>
##$CPDPRG7= <mlev>
##$CPDPRG8= <mlev>
##$CPDPRGB= <>
##$CPDPRGT= <>
##$D= (0..31)
0 1.2 0 0 0 0 0 0 0 0.06 0 0.03 0 0 0 0 0.0002 0 0 0 0 0 0 0 0 0 0 0 0 
0 0 0 
##$DATE= 1647590306
##$DBL= (0..7)
120 120 120 120 120 120 120 120 
##$DBP= (0..7)
150 150 150 150 150 150 150 150 
##$DBP07= 0
##$DBPNAM0= <>
##$DBPNAM1= <>
##$DBPNAM2= <>
##$DBPNAM3= <>
##$DBPNAM4= <>
##$DBPNAM5= <>
##$DBPNAM6= <>
##$DBPNAM7= <>
##$DBPOAL= (0..7)
0.5 0.5 0.5 0.5 0.5 0.5 0.5 0.5 
##$DBPOFFS= (0..7)
0 0 0 0 0 0 0 0 
##$DE= 6
##$DECBNUC= <off>
##$DECIM= 32
##$DECNUC= <off>
##$DECSTAT= 4
##$DIGMOD= 1
##$DIGTYP= 9
##$DL= (0..7)
0 120 120 120 120 120 120 120 
##$DP= (0..7)
150 150 150 150 150 150 150 150 
##$DP07= 0
##$DPNAME0= <>
##$DPNAME1= <>
##$DPNAME2= <>
##$DPNAME3= <>
##$DPNAME4= <>
##$DPNAME5= <>
##$DPNAME6= <>
##$DPNAME7= <>
##$DPOAL= (0..7)
0.5 0.5 0.5 0.5 0.5 0.5 0.5 0.5 
##$DPOFFS= (0..7)
0 0 0 0 0 0 0 0 
##$DQDMODE= 0
##$DR= 18
##$DS= 0
##$DSLIST= <SSSSSSSSSSSSSSS>
$$ [...]
##$SUBNAM2= <"">
##$SUBNAM3= <"">
##$SUBNAM4= <"">
##$SUBNAM5= <"">
##$SUBNAM6= <"">
##$SUBNAM7= <"">
##$SUBNAM8= <"">
##$SUBNAM9= <"">
##$SW= 18.0517287032376
##$SWIBOX= (0..15)
0 0 2 0 0 0 0 0 0 0 0 0 0 0 0 0 
##$SW_h= 3612.71676300578
##$TD= 16384
##$TD0= 1
##$TE= 0
##$TE2= 300
##$TE3= 300
##$TEG= 300
##$TL= (0..7)
0 120 120 120 120 120 120 120 
##$TP= (0..7)
150 150 150 150 150 150 150 150 
##$TP07= 0
##$TPNAME0= <>
##$TPNAME1= <>
##$TPNAME2= <>
##$TPNAME3= <>
##$TPNAME4= <>
##$TPNAME5= <>
##$TPNAME6= <>
##$TPNAME7= <>
##$TPOAL= (0..7)
0.5 0.5 0.5 0.5 0.5 0.5 0.5 0.5 
##$TPOFFS= (0..7)
0 0 0 0 0 0 0 0 
##$TUNHIN= 0
##$TUNHOUT= 0
##$TUNXOUT= 0
##$USERA1= <user>
##$USERA2= <user>
##$USERA3= <user>
##$USERA4= <user>
##$USERA5= <user>
##$V9= 5
##$VALIST= <valist>
##$VCLIST= <CCCCCCCCCCCCCCC>
##$VD= 0
##$VDLIST= <DDDDDDDDDDDDDDD>
##$VPLIST= <PPPPPPPPPPPPPPP>
##$VTLIST= <TTTTTTTTTTTTTTT>
##$WBST= 1024
##$WBSW= 4
##$XGAIN= (0..3)
0 0 0 0 
##$XL= 0
##$YL= 0
##$YMAX_a= 921471
##$YMIN_a= -1003701
##$ZGOPTNS= <>
##$ZL1= 120
##$ZL2= 120
##$ZL3= 120
##$ZL4= 120
##$ABSF1= 10
##$ABSF2= 0
##$ABSG= 5
##$ABSL= 3
##$ALPHA= 0
##$AQORDER= 0
##$ASSFAC= 0
##$ASSFACI= 0
##$ASSFACX= 0
##$ASSWID= 0
##$AUNMP= <proc_1d>
##$AZFE= 0.1
##$AZFW= 0.1
##$BCFW= 1
##$BC_mod= 2
##$BYTORDP= 1
##$COROFFS= 0
##$CY= 11.3945322036743
##$DATMOD= 1
##$DC= 2
##$DFILT= <>
##$DTYPP= 0
##$F1P= 2.36226072786647
##$F2P= -0.459571619588291
##$FCOR= 0.5
##$FTSIZE= 0
##$FT_mod= 4
##$GAMMA= 1
##$GB= 0.15
##$INTBC= 1
##$INTSCL= 1
##$ISEN= 128
##$LB= 0.24
##$LEV0= 0
##$LPBIN= 0
##$MAXI= 10000
##$MC2= 0
##$MEAN= 0
##$ME_mod= 0
##$MI= 1.114404
##$NCOEF= 0
##$NC_proc= 0
##$NLEV= 6
##$NOISF1= 3.799351
##$NOISF2= 2.8
##$NSP= 1
##$NTH_PI= 0
##$NZP= 0
##$OFFSET= 15.70392
##$PC= 1
##$PHC0= -17306.46
##$PHC1= 7.80078
##$PH_mod= 1
##$PKNL= yes
##$PPARMOD= 0
##$PSCAL= 0
##$PSIGN= 0
##$REVERSE= no
##$SF= 200.130013532006
##$SI= 16384
##$SIGF1= 3
##$SIGF2= 2
##$SINO= 400
##$SIOLD= 16384
##$SREGLST= <1H.CDCl3>
##$SSB= 0
##$STSI= 0
##$STSR= 0
##$SW_p= 3612.71676300578
##$SYMM= 0
##$S_DEV= 0
##$TDeff= 0
##$TDoff= 0
##$TI= <>
##$TILT= no
##$TM1= 0
##$TM2= 0
##$TOPLEV= 0
##$USERP1= <user>
##$USERP2= <user>
##$USERP3= <user>
##$USERP4= <user>
##$USERP5= <user>
##$WDW= 1
##$XDIM= 8192
##$YMAX_p= 0
##$YMIN_p= 0
$$ End of Bruker specific parameters
$$ ---------------------------------
##NTUPLES= NMR FID
##VAR_NAME=  TIME,          FID/REAL,        FID/IMAG
##SYMBOL=    X,             R,               I
##VAR_TYPE=  INDEPENDENT,   DEPENDENT,       DEPENDENT
##VAR_FORM=  AFFN,          ASDF,            ASDF
##VAR_DIM=   8192,          8192,            8192
##UNITS=     SECONDS,       ARBITRARY UNITS, ARBITRARY UNITS
##FACTOR=    0.0002768,     1,               1
##FIRST=     0,             0,               0
##LAST=      2.2672688,     0,               0
##MIN=       0,             -1003701,        0
##MAX=       2.2672688,     921471,          0
$$ Real data points
##PAGE= N=1
##DATA TABLE= (X++(R..R)), XYDATA
$$ [...]
3969i642M530K0642k9651J5967J0183k8687K5170k277k2344K9799j4523j2112
3981a2945K9647k4286L67K3841k9917J2961J3839l0040K3204J608k5138K9216
3993A2357j0767j5711L0007k1360l889K6015k7829Q357J7455k9636J9042N967
4005A0008k6420K6526o179j8841K9681j7828q004K7598k5941M233K0861k9895
4017a4201J6118J0074k8729K5206k382k2176K9865j4475j2042K9062k3812L80
4029g112K3209k8808J2151J3700k8944K1947J884k4022K7630j0106j5180K8645
4041A4994j9952l990K4888k6809Q203J6928k8936J8718O070k6404K6425o242j8869
4054a4976K9479j7551p825K7198k5547M216K0299k9135J5680R725k7550K4027
$$ plain form
3969 -9642 -5112 15530 -14121 1846 12029 -16658 8512 6235 -16109 13690 -833 -12945
3981 -12945 16702 -7584 -7217 16624 -13293 -332 13507 -16533 6671 8279 -16859 12357
3993 12357 1590 -14121 15886 -5474 -9363 16652 -11177 -2820 14635 -15001 4041 10008
4005 10008 -16412 10114 3935 -14906 14775 -3053 -11057 16541 -9400 -5167 15694 -14201
4017 -14201 1917 11991 -16738 8468 6086 -16090 13775 -700 -12742 16320 -7492 -7112
4029 -7112 16097 -12711 -560 13140 -15804 6143 8027 -15995 11635 1529 -13651 14994
4041 14994 -4958 -8948 15940 -10869 -2666 14262 -14674 4044 10114 -16290 10135 3893 -14976
4054 -14976 14503 -3048 -10873 16325 -9222 -5006 15293 -13842 1838 11563 -15987 8040
4066H040k047k1504K8371j3353j1813K7747k2331q0K2242k7279J1341J3580k8237
4079a5323K1350K037k3745K7321r885j5264K8507k0070l965K5254k6934Q060J6741
4092A4084k8893J8665N934k6002K6071n996j8280K8393j6695p884K6227k4257
4104h633L649J9839k7934J4637R755k6549K2806j695k0836K7500j2918j1419K7046
4117A5248k1932j81K2354k7613J1530J3362k7952K1101J881k3462K6960r727j5021
4130a3452K8305j9740l928K4251k5678P506J6372k7552J7641N609k4697K4541
4142I178n345j7717K7288j5731p900K5481k3917L878J9172k7296J4473R480k6279
4155a5235K3087k234k0470K7262j3012j1130K6925k1982L9K1706k6570J1128J2718
$$ plain form
4066 8040 5993 -15511 12860 -493 -12306 15441 -6890 -6970 15272 -12007 -666 12914 -15323
4079 -15323 6027 8064 -15681 11640 1755 -13509 14998 -5072 -9037 16217 -10717 -2657 14084
4092 14084 -14809 3856 9790 -16212 9859 3863 -14417 13976 -2719 -10603 15624 -8633
4104 -8633 -4984 14855 -13079 1558 11313 -15236 7570 5875 -14961 12539 -379 -11798 15248
4117 15248 -6684 -6865 15489 -12124 -594 12768 -15184 5917 7798 -15664 11296 1569 -13452
4130 -13452 14853 -4887 -8815 15436 -10242 -2736 13636 -13916 3725 9334 -15363 9178
4142 9178 3833 -13884 13404 -2327 -10227 15254 -8663 -4785 14387 -12909 1564 11044 -15235
4155 -15235 7852 5618 -14852 12410 -602 -11732 15193 -6789 -6750 14956 -11614 -486 12232
4168A2232k6609J9814K352k2814K5798q988j4535K6603j8282m046K3302k4608
4180i781O818J6197k6746J6903N884k4275K3906n088j7768K7375j6047p614K5568
4193A5332k3728L685J8966k7008J4391R194k5883K2610k035j9871K6172j2128
4205c03j1225K6082k0887j72K0830k5241J0224J2465k5547J8938K461k2167K4930
4218A0388q552j4274K6233j8195m046K3238k4688P293J5612k6533J7004N768k3996
4231a4748K3843n574j6887K6307j5426p466K4600k2756L434J8286k5955J3707
4243A365R232k4596K0903j347j9168K4921j1563j0855K4978j9981l52K0481k5033
4256a1015J0407J2435k5760J9172K133k1905K4805q545j4106K5956j7768m040
$$ plain form
4168 12232 -14377 5437 7789 -15025 10773 1785 -12750 13853 -4429 -8475 14827 -9781
4180 -9781 -2963 13234 -13512 3391 9275 -15000 8906 3818 -13950 13425 -2622 -10236 15332
4193 15332 -8396 -4711 14255 -12753 1638 10832 -15051 7559 5524 -14347 11825 -303
4205 -303 -11528 14554 -6333 -6505 14325 -10916 -692 11773 -13774 5164 7625 -14542 10388
4218 10388 1836 -12438 13795 -4400 -8446 14792 -9896 -2603 13009 -13524 3480 9248 -14748
4231 -14748 9095 3521 -13366 12941 -2485 -9951 14649 -8107 -4673 13613 -12342 1365
4243 1365 10597 -13999 6904 5557 -13611 11310 -253 -11108 13870 -6111 -6463 14018 -11015
4256 -11015 -608 11827 -13933 5239 7372 -14533 10272 1727 -12379 13577 -4191 -8231
4268h231K2628k3943O955J5281k5603J5957N892k3049K2297m558j6745K5298j4150
4281a971p634K3438k1374K841J7999k5069J2987R158k4288K0743j278j9070K4845
4294A1327j1797j0455K4729j9822l24K0242k4578J0073J2301k5302J8723J973
4306G090k0935K3673q056j3630K4855j6840m061K1605k2645O299J4834k4647J5291
4319B833N946k2566K2111m843j6313K4945j4211p400K3424k1548L177J7510k4860
4332a1795J3129Q765k3925K0712j377j8723K4347j1358j0500K4091j9250l58J9491
4345A3249k3510R397J2120k4211J7547K514k0622K2813p413j3552K4219j6381
4357c830m088K1475k2387O324J4634k4524J5487N457k2186K1896m691j6239K4475
$$ plain form
4268 -8231 14397 -9546 -2591 12690 -12913 3044 8936 -14113 8184 3626 -13119 12179 -1971
4281 -1971 -9605 13833 -7541 -4700 13299 -11770 1217 10375 -13913 6830 5552 -13518 11327
4294 11327 -470 -10925 13804 -6018 -6342 13900 -10678 -605 11696 -13606 5117 7090
4306 7090 -13845 9828 1772 -11858 12997 -3843 -7904 13701 -8944 -2645 12189 -12458 2833
4319 2833 8779 -13787 8324 3481 -12832 12113 -2098 -9498 13926 -7622 -4445 13065 -11795
4332 -11795 1334 10099 -13826 6886 5509 -13214 11133 -225 -10725 13366 -5884 -6242 13249
4345 13249 -10261 -864 11256 -12955 4592 7106 -13516 9297 1884 -11668 12551 -3830
4357 -3830 -7918 13557 -8830 -2506 12128 -12396 3091 8548 -13638 8258 3567 -12672 11803
4370A1803j4152p010K2877k0914K896J7229k4012J2318Q797k3058J9704j107j8059
4383a2688K3161j0432j0485K3286j8080r07J9239k3015Q985J1943k3680J7263
4395D590K297k0077K2532p731j3121K4112j6435m023K1205k2102O175J4453k3865
4408a1990J4708N772k1587K0652l834j5899K3429j3035p346K1984j9685K261J6892
4421A2322k2978J1528Q779k2254J8750q62j7847K2845j0378j0105K3187j8325
4433e338o85J8863k2644R225J1427k3315J7049K160j9630K1998p363j2880K3022
4446A1889j5418l969K0169k0738N382J4113k2822J3899N600k0609J9930l999j5240
4459a1813K2773j2808o964K1412j9496K594J6428k2755J1563Q524k1950J8735
$$ plain form
4370 11803 -2349 -9359 13518 -7396 -4500 12729 -11283 1035 9832 -13226 6478 5371 -12688
4383 -12688 10473 41 -10444 12842 -5238 -6145 13094 -9921 -936 11007 -12673 4590
4395 4590 6887 -13190 9342 1611 -11510 12602 -3833 -7856 13349 -8753 -2578 11875 -11990
4408 -11990 2718 8490 -13097 7555 3721 -12178 11251 -1784 -9130 12854 -6831 -4570 12322
4421 12322 -10656 872 9651 -12603 6147 5285 -12562 10283 -95 -10200 12987 -5338
4433 -5338 -6023 12840 -9804 -579 10848 -12467 4582 6742 -12888 9110 1747 -11133 11889
4446 11889 -3529 -7498 12671 -8067 -2685 11428 -11394 2505 8105 -12504 7426 3427 -11813
4459 -11813 10960 -1848 -8812 12600 -6896 -4302 12126 -10629 934 9458 -12492 6243
4471F243j204j7340K2559j0569r707K2446j7630o02J8145k1563Q218J1394k2285
4484a1895J6007K664j9116K0934o803j2580K2190j4576m206J9820k0301N169J3959
4497A1266k2470J3779N390k0504J9878l821j5166K2465j2602o950K1125j9014
4509f624K402J5984k2025J1124Q385k1266J7581l60j7233K1494r149r984K1341
4522A1670j6289j331J7916k0721P648J1247k1716J5538K688j8719K0499o747j2378
4535a0695K2203j4722m182J9660k0033N169J3524k1979J3461N572k0114J9136
4547G000l511j4945K1830j1812p151K0357j7885J696J5742k0843R972Q567k0584
4560a1567J6961j06j6826K0666q845r886K1172j6304j100J7711k0717Q031J0794
$$ plain form
4471 6243 5039 -12301 10258 -311 -10018 12428 -5202 -5804 12341 -9222 -1004 10390 -11895
4484 -11895 4112 6776 -12340 8594 1791 -10789 11401 -3175 -7381 12439 -7862 -2693 11266
4497 11266 -11204 2575 7965 -12539 7339 3518 -11648 10817 -1785 -8735 12390 -6624
4509 -6624 -4222 11762 -10263 861 9246 -12020 5561 5201 -12032 9462 313 -9671 11670
4522 11670 -4619 -5950 11966 -8755 -1107 10140 -11576 3962 6650 -12069 8430 1683 -10695
4535 -10695 11508 -3214 -7396 12264 -7769 -2600 10924 -11055 2406 7978 -12136 7000
4547 7000 3489 -11456 10374 -1438 -8589 11768 -6117 -4421 11321 -9522 450 9017 -11567
4560 -11567 5394 5288 -11538 9128 283 -9603 11569 -4735 -5835 11876 -8841 -810 9984
4573I984k1305J5429K246j8360K0255o440j2311K1541j4184m091J9114j9225M589
4586b758J3550k1168J2580N661j9514J8163k806j4684K0930j1186o996J9960j7651
4599e919J709J5514k1060J0318Q317k0417J6965m60j6466K0797r142r495K0928
4612A1589j6197j141J7454k0098P327J0841k0536J4395K817j7868J9097n698j2078
4625a0096K0524j3203m391J8817j8598M123J3304k0663J2259N492j8949J7908
4637F527l129j4134K0626j1403o613J9612j7511J985J5172k0585J0125P995k0050
4650a1383J6669l90j5983J9965q564r453K0082j5161j444J6804j9195O778J0841
4663I566k0197J4020K878j7711J9010n587j2044K0363j3086m109J8263j8422M523
$$ plain form
4573 9984 -11321 4108 6354 -12006 8249 1809 -10502 11039 -3145 -7236 11878 -7347 -2758
4586 -2758 10792 -10376 2204 7865 -11649 6514 3708 -10976 9954 -1232 -8228 11732 -5919
4599 -5919 -4210 11304 -9756 562 8879 -11538 5427 4967 -11499 9298 156 -9339 11589
4612 11589 -4608 -5749 11705 -8393 -1066 9775 -10761 3634 6451 -11417 7680 1982 -10096
4625 -10096 10428 -2775 -7166 11651 -6947 -2824 10480 -10183 2076 7568 -11381 6527
4637 6527 3398 -10736 9890 -1513 -8126 11486 -6025 -4040 11132 -9453 672 8667 -11383
4650 -11383 5286 4896 -11087 8878 314 -9139 10943 -4218 -5662 11142 -8053 -1275 9566
4663 9566 -10631 3389 6267 -11444 7566 1979 -10065 10298 -2788 -6897 11366 -7056 -2533
4676b533J2909k0407J2170N225j8580J7863l468j3548J9977j0878o765J9082j6524
4689e477J151J4963j9658R246Q233j9266J5591K39j5895J9331p904r449J9497
4702A0602j4655j525J6344j8733O797J0579j9915J4138K540j7408J8723n502j1762
4715i777J9991j2952l954J7896j7823L911J2609j9643J1553N642j8277J6630k265
4728C541j3827J9255r847p153J8801j5905R08J4759j9275Q940Q205j9028J5273
4741D647K05j5616J9208q108r047J9116j4572j169J6167j8603O606J0253j9389
4754a0302J3510K928j6953J7955n075j1458J8922j1918m386J7361j6980L543J2675
4767I822j9097J0818N726j7901J6376k379j3395J9205j0109o767J8265j5999J258
$$ plain form
4676 -2533 10376 -10031 2139 7364 -11216 6647 3179 -10369 9608 -1270 -8035 11047 -5477
4689 -5477 -4326 10637 -9021 225 8458 -10808 4783 5022 -10873 8458 554 -8895 10602
4702 10602 -4053 -5578 10766 -7967 -1170 9409 -10506 3632 6172 -11236 7487 1985 -9777
4715 -9777 10214 -2738 -6692 11204 -6619 -2708 9901 -9742 1811 7453 -10824 5806 3541
4728 3541 -10286 8969 -878 -8031 10770 -5135 -4227 10532 -8743 197 8402 -10626 4647
4741 4647 4852 -10764 8444 336 -8711 10405 -4167 -5336 10831 -7772 -1166 9087 -10302
4754 -10302 3208 6136 -10817 7138 2063 -9395 9527 -2391 -6777 10584 -6396 -2853 9822
4767 9822 -9275 1543 7269 -10632 5744 3365 -10030 9175 -934 -7701 10564 -5435 -4177
4780d177J4490j9000R105P958j8868J5086M6j5016J8389p427r365J8915j3893
4793c757j612J5727j7766O128J0386j8763J2387L332j6519J7255m822j1257J8868
4806I587j1862m309J7285j7007L567J2356j8758J1006N509j7936J6255k352j3203
4819i862J8992j0069o578J7607j5103Q59J4208j8186Q284P818j7971J4258N65
4832D822j4814J7677o952r236J8264j3196k048J5755j7438N872J0157j8501J2802
4845C164K704j6024J7068n039j0919J8370j1844l909J6608j6300L554J2018j8233
4858h782J0269N522j7070J5512k034j3125J7966q924o896J7468j4398L73J3730
4871I611j7611P965P747j7395J3714O63j4482J7320o979q801J7693j2953j786
$$ plain form
4780 -4177 10313 -8687 418 8376 -10492 4594 4640 -10376 8013 586 -8779 10136 -3757
4793 -3757 -5369 10358 -7408 -1280 9106 -9657 2730 6062 -10457 6798 1976 -9281 9587
4806 9587 -2275 -6584 10701 -6306 -2739 9617 -9141 1865 7374 -10562 5693 3341 -9862
4819 -9862 9130 -939 -7517 10090 -5013 -4154 10054 -8132 152 7970 -10001 4257 4822
4832 4822 -9992 7685 733 -8503 9761 -3435 -5483 10272 -7166 -1294 8863 -9638 3164
4845 3164 5868 -10156 6912 1873 -9046 9324 -2520 -6429 10179 -6121 -2567 9451 -8782
4858 -8782 1487 7009 -10061 5451 3417 -9708 8258 -666 -7562 9906 -4492 -4119 9611
4871 9611 -8000 -35 7712 -9683 4031 4694 -9788 7532 553 -8248 9445 -3508 -5294
4884e294J5268j7126N780R988j8151J2439K859j5652J6304m362j0840J7616j0938
4897b109m255J6056j5446K894J2029j7507R552N526j6330J4536j614j2620J7478
4910H190q873o537J6917j4300O65J3410j7308P878P715j7430J3595Q02j4365J6866
4924G225o632q652J7379j2462k045J4798j6298N320R799j7152J1113L310j5412
4937i709J5851l846j0991J7150j0327m260J5769j5158K780J1764j7304R668N271
4950F658j6273J4729j844j2404J7057q717o319J6507j3885O07J3279j6803P269
4963a39P782j6796J2949Q91j4012J6205n996q852J6906j1847k464J4778j5672
4976f267M807R736j6908J1214L157j4991J5164l877j0563J6855j0188m158J5353
$$ plain form
4884 -5294 9974 -7152 -1372 8616 -9535 2904 5763 -9889 6415 2053 -8787 8829 -2109
4897 -2109 -6364 9692 -5754 -2860 9169 -8338 1214 6740 -9590 4946 3332 -9288 8190
4910 8190 -683 -7220 9697 -4603 -3938 9472 -7836 42 7757 -9673 3922 4724 -9641 7225
4924 7225 593 -8059 9320 -3142 -5187 9611 -6687 -1367 8432 -8720 2393 5703 -9709
4937 -9709 6142 2296 -8695 8455 -1872 -6132 9637 -5521 -2741 9023 -8281 1387 6658
4950 6658 -9615 5114 3270 -9134 7923 -794 -7113 9394 -4491 -3884 9395 -7408 -139
4963 -139 7643 -9153 3796 4687 -9325 6880 884 -7968 8938 -2909 -5373 9405 -6267
4976 -6267 -1460 8276 -8632 2582 5739 -9252 5912 2035 -8528 8327 -1861 -6019 9334
4989I334j4822K749J1432j6779R306N446j5908J3925j337j2262J6414p891o821
5002g214J6115j3034J22J3097j6049O739P549j6128J2111J366j3625J5668n745
5015I72q822J6570j1692k057J4144j5418M873R550j6631J0888L035j4641J4959
5028E730l624j0283J6307r765m604J5327j4205K394J1315j6215Q498N847j5469
5041h747J3414j300j1952J5897p700o509J5637j2876K67J2652j5914O829P664
5054G362j6096J2340P84j3176J5483n870q294J5901j1201k260J4053j5166M511
5067a629R411j5981J0297L478j4535J4126k825j0615J6050r290m484J4756j3631
5080d872K058J1062j5698Q165N732j5149J3186j034j1906J5523p534o339J5361
$$ plain form
4989 9334 -5488 -2739 8693 -8086 1220 6666 -9242 4683 3346 -8916 7498 -393 -7214
5002 -7214 8901 -4133 -4011 9086 -6963 -224 7325 -8803 3308 4674 -8951 6717 972
5015 972 -7850 8720 -2972 -5029 9115 -6303 -1430 8120 -8511 2377 5412 -9229 5730
5028 5730 2106 -8177 8130 -1635 -6239 9088 -5117 -2723 8592 -7623 875 6722 -8747
5041 -8747 4667 3367 -8585 7312 -388 -6897 8740 -4136 -3869 8783 -7131 -302 7362
5054 7362 -8734 3606 4390 -8786 6697 827 -7467 8434 -2767 -5027 9026 -6140 -1629
5067 -1629 7782 -8199 2098 5576 -8959 5167 2342 -8273 7777 -1513 -5997 8759 -4872
5080 -4872 -2814 8248 -7450 715 6447 -8702 4484 3450 -8456 7067 -467 -6806 8555
5093H555j2574J01J2370j5144O335P409j5478J1672J296j3074J4759n033q726
5106g532J5641j0558k624J3681j4249L916R466j5590R884L419j3970J3800l130
5119B154j0146J5554r151m087J4300j3570K309J0611j5303Q366N163j4770J2825
5132D255j054j1444J5117p085o434J4789j1841l08J2404j4685N840P396j5050
5145h100J1012J523j2934J4461m831q380J5127j0244k389J3060j3944L917R219
5158G497j5306R898L093j3680J3623k893r901J5204q928m404J4055j2727J721
5171b748J0641j4875P630N533j4442J2214o13j1456J4799o769o388J4577j1385
5184c282n72J2054j4600N916P206j4720J0994J174j2459J4255n071p989J4704
$$ plain form
5093 8555 -4019 -3918 8452 -6692 -357 7052 -8426 3246 4542 -8532 6227 1194 -7532
5106 -7532 8109 -2449 -5073 8608 -5641 -1725 7741 -7849 2035 5454 -8516 5284 2154
5119 2154 -7992 7562 -1589 -5676 8624 -4946 -2637 7974 -7329 1037 6200 -8570 4255
5132 4255 3201 -8243 6874 -211 -6645 8144 -3697 -4005 8399 -6286 -446 6950 -8100
5145 -8100 2912 4435 -8499 5962 1131 -7249 7878 -2366 -4755 8305 -5639 -1722 7497
5158 7497 -7809 2089 5182 -8498 5125 2232 -7669 7535 -1393 -5797 8258 -4469 -2748
5171 -2748 7893 -6982 648 6181 -8261 3953 3340 -8116 6683 -86 -6474 8103 -3282
5184 -3282 -3854 8200 -6400 -484 6722 -7998 2996 4170 -8289 5966 895 -7094 7610
5197G610j0092k022J2698j3665L893Q845j4798R295L598j3533J3112k629r814
5210g502J4543q215m671J4088j2312J143J0576j4476P448N351j3932J1663n83
5223C121j1003J4297o652o144J4328j1503l03J1723j4062N831P058j4564J0835
5236B962J341j2246J3545m517p927J4253r498k765J2829j2939L169R031j4386
5249g148Q692L451j2891J2525k429r431J4110q006m384J3441j2035J515J0094
5262G504j4073P032N453j3589J1540p06j0882J4090o415o305J3985j0899n28J1607
5276G814j3701N256P136j3985R931J810j2003J3194m249q136J4140r264k593J2388
5290G738j2949L568Q551j4052Q909L249j2815J2597k859r052J3830p966l976J2886
$$ plain form
5197 7610 -2482 -4504 8194 -5471 -1578 7267 -7531 1764 5362 -8171 4941 2312 -7502
5210 -7502 7041 -1174 -5845 8243 -4069 -2926 7650 -6826 622 5973 -7959 3704 3121
5223 3121 -7882 6415 -237 -6381 7947 -3556 -3859 7864 -6198 -367 6691 -7873 2962
5236 2962 4303 -7943 5602 1085 -6842 7411 -2087 -4852 7977 -4962 -1793 7238 -7148
5249 -7148 1544 4995 -7896 4629 2200 -7231 6879 -1127 -5511 7930 -4105 -2590 7504
5262 7504 -6569 463 5916 -7673 3867 3161 -7721 6369 -46 -6351 7634 -3265 -3793 7814
5276 7814 -5887 -631 6505 -7480 2451 4261 -7742 5452 1203 -6933 7207 -2057 -4650 7738
5290 7738 -5211 -1643 6908 -7144 1765 5014 -7801 4796 1937 -7115 6715 -1251 -5227 7659
5304G659j1925J592R984j3733O932N203j3349J1234l65j0761J3485n885o213J3497
5318G355j0272p02J1146j3141N049O877j3679J0005J395j1633J2967m374p400
5331f407J3448r301k228J1861j2359L428Q173j3463Q583L149j2404J1899k213
5344B166r217J3423p309m579J2929j1197J015J0026j3323O348N322j2959J0755
5357C400j71j0518J3072n805n881J3145j0248l55J0601j2798N037O618j3037R387
5371B447J602j1288J2454m259p175J2966q587k593J1769j1908K947Q335j3182
5384f472P805L297j1958J1565k136r213J3457p122m303J2439j1025J159R427j2947
5398f027O564M982j2819J0752m81j0085J2960n730n860J2832r997m86J0418j2261
$$ plain form
5304 7659 -4266 -2674 7310 -6423 509 5712 -7637 3597 3232 -7529 5956 71 -6142 7355
5318 7355 -2917 -3619 7527 -5614 -565 6312 -7367 2638 4033 -7600 5367 993 -6407
5331 -6407 7041 -2260 -4488 7373 -4986 -1558 6615 -6848 1735 4884 -7520 4379 2166
5344 2166 -7051 6372 -937 -5516 7413 -3784 -2769 7257 -6066 282 5604 -7355 3400
5357 3400 3229 -7289 5783 -22 -5903 7242 -3006 -3361 7240 -5558 -521 6097 -6940 2447
5371 2447 4049 -7239 5215 956 -6219 6747 -1840 -4433 7336 -4572 -1625 6710 -6472
5384 -6472 1333 4630 -7328 4237 2101 -7112 6345 -777 -5080 7359 -3666 -2507 6920 -6027
5398 -6027 537 5519 -7300 3452 2971 -7114 5846 116 -5744 7088 -2909 -3395 7023 -5238
5412e238M630O800j2898Q899J827j1207J1998l527p799J3073q303k711J1654j1499
5426d301K502Q374j2922P820L203j1918J1181k033q509J2583o880m073J2077j0691
5440c587J064R309j2528O142N077j2564J0246j07j0022J2376n130o042J2571r416
5454b611r72J0580j2040M173O919j2605Q620J854j0844J1660l451p445J2625q243
5468a780k503J1305j1568K855Q015j2522P485L293j1489J0870j887q542J2336
5481E868o591m192J1770j0208O68R455j2340N820N214j2028R461M9r797J1956
5495E105m741n969J2150r036q44J0056j1563M296O214j1992Q480J458j0350J1428
5509D692l518p250J2381p904k539J0891j0899K445P859j2184P075L513j1357J0384
$$ plain form
5412 -5238 -608 6192 -6706 2193 4020 -7187 4811 1284 -6515 6558 -1745 -4456 7198 -4301
5426 -4301 -1799 6575 -6347 1473 4676 -7242 3939 1906 -6603 5980 -900 -4973 7104 -3587
5440 -3587 -2523 6786 -5742 400 5477 -7087 3159 3052 -6970 5406 276 -5766 6805 -2611
5454 -2611 -3583 6997 -5043 -870 6049 -6556 2064 3918 -6926 4734 1283 -6162 6463 -1780
5468 -1780 -4283 7022 -4546 -1691 6324 -6198 1287 4580 -6909 3961 2074 -6468 5868
5481 5868 -723 -4915 6855 -3353 -2685 6770 -5570 250 5464 -6564 2897 2946 -6851 5105
5495 5105 364 -5605 6545 -2491 -3335 6721 -4842 -546 5668 -6324 2156 3614 -6736 4692
5509 4692 1174 -6076 6305 -1599 -4138 6753 -4146 -1701 6158 -6026 1049 4562 -6795 3589
5523C589j379q669J2118o232m253J1374r819P40Q986j1749N399M988j1627R480
5537B946j58r161J1518n141n429J1828q882q82R857j1277M190O087j1781Q190
5551A905K021j0663J1084l101p157J1862p397k821J0984j0694K150Q101j2234
5564e960O901L567j1078J0161j446q267J1644n885m401J1174r605Q87Q596j1471
5578e183N387M839j1243Q890J51r137J1260m770n613J1525q307j265R988j0968
5592d446L604O294j1312P697J976j0263J0638k967o915J1354p174k514J0331j0342
5606d039K414P483j1332O515L215j0628R847j469q101J1509o014m104J0993r222
5620b933L37Q861j1268N001N025j1237Q697O30r253J0869m202n753J1157q075
$$ plain form
5523 3589 2210 -6459 5659 -573 -4826 6548 -3271 -2531 6455 -5294 105 5093 -6534 2946
5537 2946 2788 -6373 5145 4 -5425 6403 -2479 -3361 6496 -4781 -591 5496 -6285 1905
5551 1905 3926 -6737 4347 1246 -5911 5951 -1446 -4267 6717 -3977 -1827 6274 -5960
5564 -5960 941 4508 -6570 3591 2145 -6122 5522 -363 -4764 6410 -3195 -2308 6288 -5183
5578 -5183 204 5043 -6200 2690 2841 -6296 4964 194 -5419 6106 -2201 -3466 6522 -4446
5592 -4446 -842 5452 -5860 1837 3813 -6450 4188 1221 -5694 5660 -1514 -4028 6303 -4039
5606 -4039 -1625 5858 -5474 1041 4256 -6372 3475 2006 -6095 5414 -600 -4704 6289 -2933
5620 -2933 -2596 6265 -5003 -2 5023 -6214 2483 3113 -6140 4729 527 -5226 5931 -2144
5634b144j289R743j0637L632N984j1140P616J889r937J0495l025o681J1227p125
5648a392k573J0195r888K018P408j1151O270L556j0483R264j000q139J1013n438
5662c40m364J0824q966K90Q572j0803M749N005j0937Q499K52q744J0688m348n285
5677d908J0697p849j043R156j0409L557O090j0954P433J682r584J0004k597o832
5691e557J0989o655k828J0126r616J700P575j0954O029L586j0400R188j040p966
5705e823J0787n370m117J0492q710L17Q288j0701M901M514j0297Q201L36q694
5719e876J0223l934n413J0668p657j254R301j0062L013O293j0865P138K102r751
5733f074R865k390o746J0750o592k706R780r351J889P143j0684N856L232r868
$$ plain form
5634 -2144 -3433 6310 -4327 -695 5289 -5851 1765 3654 -6283 4212 1187 -5494 5733 -1392
5648 -1392 -3965 6230 -3658 -1640 5768 -5383 887 4443 -6040 3224 2224 -5915 5098 -340
5662 -340 -4704 6120 -2846 -2556 6016 -4787 -38 4967 -5970 2529 2781 -5963 4725 377 -4908
5677 -4908 5789 -2060 -3103 6053 -4356 -799 5291 -5663 1770 3452 -6132 3872 1275 -5557
5691 -5557 5432 -1223 -4051 6075 -3541 -1841 5734 -5220 809 4395 -6005 3183 2143 -5823
5705 -5823 4964 -406 -4523 5969 -2741 -2424 5864 -4837 64 4578 -5719 2482 2818 -5876
5719 -5876 4347 413 -5000 5668 -1989 -3243 6058 -4004 -991 5302 -5563 1575 3677 -6074
5733 -6074 3791 1401 -5345 5405 -1187 -3893 5887 -3464 -1575 5568 -5116 740 3972 -5896
5747e896Q928j043p631J0569n347l928J0077q419K21Q176j0216M406M894j0184
5761e393P742O55q892J0235l865n561J0703p502j173Q792r672L071N912j0356
5775e304O805J932r234R390k541o215J0317o480k418R481r142J728O930j0376
5789e127O039L274j0056Q815q18p709J0322m962m076R914q221J92Q106r977M010
5804b74M855j0128P663O21q563R964l533n224J0016p240j259Q732r446L021N850
5819E055j0233O697J896r000Q969k089o268R968n970k823R477q963J539P042j0055
5834d758N301L688j0049Q572o32p537J0020m652m128R578p962L02P636r617M267
5849B9M353r679P386N01q187R754l615n315J0066o988j378Q554r296K796N926
$$ plain form
5747 -5896 3032 1989 -5642 4927 -420 -4348 5729 -2690 -2469 5707 -4509 -103 4791 -5393
5761 -5393 2349 3004 -5888 4347 482 -5079 5624 -1878 -3051 5741 -3931 -860 5052 -5304
5775 -5304 1501 3433 -5801 3589 1048 -5167 5150 -1330 -3748 5733 -3409 -1681 5249 -5127
5789 -5127 912 4186 -5870 2945 2127 -5582 4740 -222 -4298 5616 -2605 -2413 5693 -4284 -274
5804 -274 4581 -5547 2116 2737 -5826 4138 605 -4619 5397 -1843 -3102 5630 -3816 -795 5055
5819 5055 -5178 1519 3415 -5585 3384 1295 -4973 4995 -975 -3798 5679 -3284 -1745 5297 -4758
5834 -4758 543 4231 -5818 2754 2122 -5415 4605 -47 -4175 5403 -2559 -2257 5379 -4238 29
5849 29 4382 -5297 2089 2590 -5597 4157 542 -4773 5293 -1695 -3073 5481 -3815 -1019 4907
5864D907r926O352K207r046Q771j845o580R892n509k966R193q716J471O949r799
5879d645N150L446r364Q347r35p393R667m567l806R383p653N5P604r417L933M529
5895D334r482P119R41q341R321k978n547R743o608j532Q475q955K220O149r710
5910d851O085K117q874Q728j654o357R542n676k668Q946q338J411O598r456M867
5925D20L329q944P767o92o983R324m091m473R599p385l23P620r205L595M779r327
5941d990O887Q89q009Q959l086n157R351o171j687Q022q635K611N724r476N977
5956A209J978q410Q426j796o291R541n419k727Q678p874R96O668r372M761L407
5971C775q864P588m08p131R147m066m165R107p172k50P440q810L531M478r114
$$ plain form
5864 4907 -5019 1333 3540 -5506 3265 1420 -5160 4732 -777 -3743 5450 -3266 -1795 5154 -4645
5879 -4645 505 3951 -5413 2934 1999 -5394 4273 -294 -4100 5283 -2370 -2315 5289 -4128 -195 4334
5895 4334 -5148 1971 2912 -5429 3892 914 -4633 5110 -1498 -3030 5445 -3510 -1290 4859 -4851
5910 -4851 1234 3351 -5523 3205 1551 -4806 4736 -940 -3608 5338 -3000 -1589 5009 -4447 420
5925 420 3749 -5195 2572 1880 -5103 4221 130 -4343 5256 -2129 -2452 5168 -4037 -442 4337 -4990
5941 -4990 1897 2786 -5223 3736 650 -4507 4844 -1327 -3014 5008 -3627 -1016 4708 -4768 1209
5956 1209 3187 -5223 3203 1407 -4884 4657 -762 -3489 5189 -2685 -1689 4979 -4393 368 3775
5971 3775 -5089 2499 2091 -5040 4107 41 -4124 4983 -2189 -2439 5001 -3809 -278 4200 -4914
5986d914O645P64p709Q805k989m949Q975o090j508Q026q260K190N667r196N601
6001A058K302q313Q020j583o171R212n184k895Q638p752R17O632r092M634L461
6016C884q815P233l80o693Q625l815l923Q808o915m06P320q634L452M272q777
6031d764O600P85p586Q428k697n041Q848n941j717P990q019J943N504q679N023
6046F77K477q053P781j465n991Q796n024k672Q293p390R57O171q606M232L341
6061C524q183O829l8o951Q601l890l740Q479o422o10P272q455L332M442q828O278
6077A640J012p457Q046k503n013Q806n706j617P685p867J864N310q417N228K069
6092C080p761P420j373n647Q344m616k706P995p269R02O186q327L881L624q456
$$ plain form
5986 -4914 1731 2495 -5214 3591 602 -4347 4628 -1462 -2970 5056 -3204 -1014 4653 -4543 1058
6001 1058 3360 -4953 3067 1484 -4687 4525 -659 -3554 5084 -2668 -1751 4881 -4211 423 3884
6016 3884 -4931 2302 1922 -4771 3854 39 -3884 4924 -1991 -2397 4923 -3711 -259 4013 -4764
6031 -4764 1836 2621 -4965 3463 766 -4275 4573 -1368 -3085 4905 -3114 -1171 4333 -4346 677
6046 677 3154 -4899 2882 1417 -4574 4222 -802 -3474 4819 -2571 -1614 4557 -4049 183 3524
6061 3524 -4659 2170 2132 -4819 3782 -108 -3848 4631 -1791 -2401 4871 -3584 -252 4190 -4638 1640
6077 1640 2652 -4805 3241 738 -4275 4531 -1175 -2792 4893 -2974 -1110 4200 -4217 1011 3080
6092 3080 -4681 2739 1366 -4281 4063 -553 -3259 4736 -2533 -1631 4555 -3772 109 3733 -4723
6107d723O632K77o829Q446l524m236Q588o411o71P348q206K674M623q425N916
6122A479R42p234P939k332m880Q302n463j371P434p717J993N283q523M975K233
6137C060p700P284j185n901Q510m519k950Q130p087O59O010q238M026L626q263
6152d538O741k79o616Q082l211l900Q047o262m21O842p866K939M412q377N817
6167A410J182p233P537k188m799Q351n276j860P668p528J391N751q479M706K551
6182C184p699P099j015n999Q254m135l129P800o693O95N936p990L921L364p950
6197d357O176J53o227P683l023m066P853n827o60O771p581K452M517p942N499
6212A421J333p226P560k109n177Q419n121k121P536p132J504N373q111M585K371
$$ plain form
6107 -4723 1909 2186 -4643 3803 279 -3957 4631 -1780 -2451 4897 -3309 -635 3988 -4437 1479
6122 1479 2421 -4813 3126 794 -4086 4216 -1247 -2618 4816 -2901 -908 4375 -4148 827 3060
6137 3060 -4640 2644 1459 -4442 4068 -451 -3401 4729 -2358 -1699 4311 -3927 99 3725 -4538
6152 -4538 2203 1924 -4692 3390 179 -3721 4326 -1936 -2357 4485 -3381 -442 3970 -4407 1410
6167 1410 2592 -4641 2896 708 -4091 4260 -1016 -2876 4792 -2736 -1345 4406 -4073 633 3184
6182 3184 -4515 2584 1569 -4430 3824 -311 -3440 4360 -2333 -1638 4298 -3692 229 3593 -4357
6197 -4357 1819 1972 -4255 3428 405 -3661 4192 -1635 -2295 4476 -3105 -653 3864 -4078 1421
6212 1421 2754 -4472 3088 979 -4198 4221 -900 -3021 4515 -2617 -1113 4260 -3851 734 3105
6227C105p455O772j019n585P903m165k706P404o330L44O064q039L903L338p816
6242d282O055K93o501P791l178l662P635n638q55O755p495K523M414q092N535
6257A298J256o965P062j713m870P980n057j590O905o898J276N328p871M587K325
6272C053p506O826r63n484P773m010k972P558o499N29O028p721L367L608p774
6287d187N841M44o405P533k837l980P748n601p34O520p397K380M250p540N285
6302A320J060o544O872j862m641P665m666j967P027o777J410N119p709M092K612
6317C011p257O454o51n640P634l810l042P524o233K26N956p370L032L437p331
6332d060N705K96n929P015k651l895P431n394q68O536o989K045M299p426M763
$$ plain form
6227 3105 -4350 2422 1403 -4182 3721 -444 -3150 4254 -2076 -1732 4332 -3707 196 3534 -4282
6242 -4282 1773 2066 -4435 3356 178 -3484 4151 -1487 -2342 4413 -3082 -559 3855 -4237 1298
6257 1298 2554 -4411 2651 938 -3932 4048 -1009 -2599 4306 -2592 -1316 4012 -3859 728 3053
6272 3053 -4453 2373 1410 -4074 3699 -311 -3283 4275 -2224 -1695 4333 -3388 -21 3587 -4187
6287 -4187 1654 2098 -4307 3226 389 -3591 4157 -1444 -2178 4342 -3055 -675 3575 -3965 1320
6302 1320 2380 -4164 2708 846 -3795 3870 -796 -2763 4264 -2513 -1103 4016 -3693 399 3011
6317 3011 -4246 2208 1557 -4083 3551 -259 -3301 4223 -2010 -1784 4172 -3198 -166 3271 -4060
6332 -4060 1645 1941 -3988 3027 376 -3519 3912 -1482 -2350 4186 -2803 -758 3541 -3885 878
6347H78J736o693O658j698m656P324m320k145P083o689J169N243p492M070K380
6362B848o914O114o39n377P239l500k724O877n789J91N711p255L004L438p103
6377c879N378O21o188O948k581l845P597n374j111O526o859K035M366p468M850
6392A016J547o724O755j609m668P176l953k090O523o288J172M872p160L859K403
6407B831o834O153n86n399P073l461k994P174n603k46N892p049K865L506p247
6422c925N409O05o087P031k515m001P258n132q48O150o548J991M056p042M608
6437A010J545o455O389j452m523P112m232j940O501o336J368M686o949L730K485
6452B939o851N915l89n499P299l428l147P016n605j78N836o912K733L515p093
$$ plain form
6347 878 2614 -4079 2579 881 -3775 3549 -771 -2916 4167 -2522 -1353 3890 -3602 468 2848
6362 2848 -4066 2048 1409 -3968 3271 -229 -2953 3924 -1865 -1674 4037 -3218 -214 3224 -3879
6377 -3879 1499 2120 -4068 2880 299 -3546 4051 -1323 -2434 4092 -2767 -732 3634 -3834 1016
6392 1016 2563 -4161 2594 985 -3683 3493 -460 -2550 3973 -2315 -1143 3729 -3431 428 2831
6407 2831 -4003 2150 1564 -3835 3238 -223 -3217 3957 -1646 -1892 4000 -3049 -184 3322 -3925
6422 -3925 1484 2089 -3998 3033 518 -3483 3775 -1357 -2205 3945 -2603 -612 3444 -3598 1010
6437 1010 2555 -3900 2489 1037 -3486 3626 -606 -2546 3955 -2381 -1013 3673 -3276 454 2939
6452 2939 -3912 2003 1614 -3885 3414 -14 -3161 3855 -1750 -1928 3908 -3004 -271 3244 -3849
6467c849N216M83n557O463k446l616O858m820r00N988o364J786M301p128M378
6482G93J850o457O089j267m593P060l983k229O643o001Q56M824o843L560K547
6497B849o582N526k96n121O652l160k963O865n493r8N421o587K695L549o909N059
6513A407O34n967O678k087m035O849m507j267O152o142J592M203p025M309J727
6528B521o221N874j083m596O750l715k149O526n991Q16M848o746L503K381o336
6543c618N326j74n184O454k808k937O616n150k48N413o495K593L363o728M716
6558A139R27n808O338k019l901O926m529j320O092o293J585M076o444M088J527
6573B384o034N826j078m524O474l532k266O398n625O78N030o596L011K745o518
$$ plain form
6467 -3849 1367 1850 -3707 2756 310 -3306 3552 -1268 -2168 3820 -2544 -758 3543 -3585 793
6482 793 2643 -3814 2275 1008 -3585 3475 -508 -2737 3906 -2095 -1239 3585 -3258 302 2849
6497 2849 -3733 1793 1497 -3624 3028 -132 -3095 3770 -1723 -1821 3600 -2987 -292 3257 -3652 1407
6513 1407 2041 -3926 2752 665 -3370 3479 -1028 -2295 3857 -2285 -693 3510 -3515 794 2521
6528 2521 -3700 2174 1091 -3505 3245 -470 -2619 3907 -2084 -1268 3580 -3166 337 2718 -3618
6543 -3618 1708 1534 -3650 2804 -4 -2941 3675 -1475 -1723 3690 -2805 -212 3151 -3577 1139
6558 1139 2066 -3742 2596 577 -3324 3602 -927 -2247 3845 -2448 -863 3213 -3231 857 2384
6573 2384 -3650 2176 1098 -3426 3048 -484 -2750 3648 -1977 -1299 3731 -2865 146 2891 -3627
6588c627N209o8n098O551k921l149O740n018m97N654o512K444L260o426M723Q01
6604B066n588O037j807l860O447m345j102N590n527J347M002o715M136J698n994
6619c615N778q81m606O344l278k336O345n597M73M957o537L156K830o731N310
6634A612J0n263O465k679k984O264m854l02N216o147K155L536o434M632Q23n633
6650c583N952j849l643O412m060j367N808n902J365M036o396L841J852o142N690
6665B014q03m563O490l454k213O081n354L31M837o131K799K648n945M838P2n155
6681c508O259k695k823O190m763m45N398o074K047L346o215M237J173n695O053
6696B485j869l878O443m011j439N762n722J244M208o211L483J926o063N473o48
$$ plain form
6588 -3627 1582 1514 -3584 2967 46 -3103 3637 -1381 -1878 3776 -2736 -292 2968 -3458 1265 2066
6604 2066 -3522 2515 708 -3152 3295 -1050 -2152 3438 -2089 -742 3260 -3455 681 2379 -3615
6619 -3615 2163 1282 -3324 3020 -258 -2594 3751 -1846 -1373 3584 -2953 203 3033 -3698 1612
6634 1612 1622 -3641 2824 145 -2839 3425 -1429 -1731 3485 -2662 -507 3029 -3405 1227 2050 -3583
6650 -3583 2369 520 -3123 3289 -771 -2138 3670 -2232 -867 3169 -3227 614 2466 -3676 2014
6665 2014 1211 -3352 3138 -316 -2529 3552 -1802 -1471 3366 -2765 34 2682 -3263 1575 1647 -3508
6681 -3508 2751 56 -2767 3423 -1340 -1785 3613 -2461 -414 2932 -3283 954 2127 -3568 2485
6696 2485 616 -3262 3181 -830 -2269 3493 -2229 -985 3223 -2988 495 2421 -3642 1831 1183
6711A183m278O062l215k344O137n215K26M862o160K780K702o244M996R1n019O116
6727B680k584l003O348m596p62N483o004J994L465o258M180J057n498N857j670
6742F89l779O164l801j373N472n445J164M131o024L171J949n667N191p96m223
6757c177O095l140k350O052n094k8M976o163K835K838o292M849K96n060N848k309
6773A76l095O217m485n49N005n586J735L555o200M344R66n380N495j451l757O005
6789B995l764j531N776n419Q85M209o229L515K022n851N101m47m492O017k883
6804i6k389N696m833J16M757n925K563K783n820M384L52m759N559k155l052N836
6820C017m135p61N193n596J629L558o034L968J140n348N478j321l722O082l744
$$ plain form
6711 1183 -3095 2967 -248 -2592 3545 -1670 -1444 3418 -2742 38 2740 -3504 1492 1583 -3436 2680
6727 2680 96 -2907 3441 -1155 -1917 3566 -2438 -444 3021 -3237 943 2000 -3498 2359 689
6742 689 -3090 3074 -727 -2100 3372 -2073 -909 3222 -2802 369 2318 -3349 1842 1046 -3177
6757 -3177 2918 -222 -2572 3480 -1614 -1642 3334 -2829 6 2844 -3448 1401 1697 -3363 2485 176
6773 176 -2919 3298 -1187 -1736 3269 -2317 -582 2973 -3227 1117 2083 -3297 2198 747 -3010 2995
6789 2995 -769 -2300 3476 -1943 -1058 3151 -3078 437 2459 -3392 1709 1262 -3230 2787 -96
6804 -96 -2485 3211 -1622 -1506 3251 -2674 -111 2672 -3148 1236 1588 -3171 2388 233 -2819 3017
6820 3017 -1118 -1879 3314 -2282 -653 2905 -3129 839 1979 -3369 2109 788 -2934 3148 -596
6835e96j573N631n431R28M370o177L148K007n680N015l02m573O028l022k344N675
6851C104m607L8M642n504K264K672n830M423M26m858N499j919l200N974m113j112
6867b101N365n448J527L876o232L859J404n478N262j200l865N852l214j814N409
6882C202m962O24M075n540K813K306n618M688k69m412N659k724k206N498m542
6897a408j72M687n678K411K817n929M466N17n041N707k046k989N713l942r96N109
6913C226n314J373L624n815L563J256n133N068r67l825N749l366j554N247m800
6928a668N97M022n514K909K056n600M674j53m514N827k551k704N739m367k01M578
6944C130n358K112K668n538M022O27m905N465j833l152N726l790j005M901n053
$$ plain form
6835 -596 -2169 3462 -1969 -1041 3329 -2848 300 2307 -3373 1642 1340 -3233 2795 -227 -2571 3104
6851 3104 -1503 -1465 3177 -2327 -63 2609 -3221 1202 1628 -3230 2269 350 -2850 3124 -989 -2101
6867 -2101 3264 -2184 -657 3219 -3013 846 2250 -3228 2034 834 -3031 2821 -393 -2207 3202
6882 3202 -1760 -1136 2939 -2601 212 2518 -3100 1588 1319 -3093 2566 -158 -2364 3134 -1408
6897 -1408 -1580 3107 -2571 -160 2657 -3272 1194 1711 -3330 2377 331 -2658 3055 -887 -1883 3226
6913 3226 -2088 -715 2909 -2906 657 1913 -3220 1848 881 -2944 2805 -561 -2115 3132 -1668
6928 -1668 -1071 2951 -2563 346 2402 -3198 1476 1323 -3191 2636 85 -2619 3120 -1247 -1448 3130
6944 3130 -2228 -116 2552 -2986 1036 1663 -3242 2223 390 -2762 2964 -826 -1831 3070 -1983
6959a983J309L279n369L182J543n158M997r11l971N834l145j746N289m919P54
6974a015M060n704K756K317n543M481l1m359N472k279k684N660m386l01M438n305
6990b423K138K938n580L922O51m674N250j692l278N568l598j061N001n037J058
7005h17L691n706L303J586n216M939q11l937N493k999j651N228m654L71M042n642
7021b780K987K137n308M178K10m326N009k012k475N393m116l23M561n491J990
7036c66K905n531M017O82m741N101j472l485N634l434j137M959m892J031L511
7051B782n357K989J679n123M621o31l699N133k623j950N276m576L23L989n327
7066b494K496K266n179L990L65m427N259k045k682N355m006m58M718n282J828
$$ plain form
6959 -1983 -674 2605 -2764 418 1961 -3197 1800 889 -3082 2752 -393 -2139 3150 -1769 -1015
6974 -1015 3045 -2659 97 2414 -3129 1352 1321 -3038 2434 155 -2529 3131 -1255 -1556 2882 -2423
6990 -2423 -285 2653 -2927 995 1646 -3028 2222 530 -2748 2820 -778 -1839 3162 -1875 -817
7005 -817 2874 -2832 471 2057 -3159 1780 969 -2968 2525 -474 -2125 3103 -1551 -1180 2862 -2780
7021 -2780 207 2344 -2964 1214 1424 -2902 2107 95 -2380 3013 -1103 -1426 3135 -2356 -366
7036 -366 2539 -2992 1025 1707 -3034 2067 595 -2890 2744 -690 -1827 3132 -1760 -729 2782
7051 2782 -2575 414 2093 -3030 1591 960 -2739 2394 -229 -2179 3097 -1479 -1156 2833 -2494
7066 -2494 2 2268 -2911 1079 1444 -2983 2276 231 -2451 2904 -1102 -1560 3158 -2124 -296
7081b96L051n503L572Q30m607M901j312l294N376l364j218M805m823J225L673
7096C016n529L015J589n204M631o05l629N065k485k135N244m420J96M192n474
7111b533K639K223n388M347O8m334N164k012k573N107l715o44M545m938J671K984
7127B611n337L524Q83m368M409j124l314N352l289j216M871m849R80L624n338
7142b581L073J649n041M596p07l879N297k409k239N205m394K86M102n223K368
7157A03K144n073L931K67m298M944j745k650M970l432o22M356m989J606K883n086
7173b691L613P73m656M771j083l452N171k933j409M632m475Q13L589n078K799
7188C84J819m995M384n96l976N331k604j770M592l890L9L975m808K038K499n115
$$ plain form
7081 -296 2755 -2748 824 1654 -2953 1948 636 -2658 2718 -646 -1864 2941 -1882 -657 3016
7096 3016 -2513 502 2091 -3113 1518 913 -2716 2349 -136 -2271 2973 -1447 -1251 2941 -2533
7111 -2533 106 2329 -3059 1288 1356 -2978 2186 174 -2399 2708 -1007 -1651 2894 -2044 -373 2611
7127 2611 -2726 798 1681 -2687 1722 598 -2716 2636 -653 -1869 3002 -1847 -867 2757 -2581
7142 -2581 492 2141 -2900 1696 989 -2890 2407 -2 -2241 2964 -1430 -1144 2958 -2265 103
7157 103 2247 -2826 1105 1372 -2926 2018 273 -2377 2593 -839 -1461 2895 -2094 -488 2395 -2691
7173 -2691 922 1695 -2961 1810 727 -2725 2446 -487 -1896 2736 -1739 -926 2663 -2415 384
7188 384 2203 -2792 1592 996 -2980 2351 -253 -2023 2569 -1321 -1282 2693 -2115 -77 2422 -2693
7204b693L707M85m309M804j685k758N183l549p66M509m850J392L078n113L245
7219F80J272m656M317q43l323N198k993j571M556m054L83L622m942K468J860m795
7235b821M129j68l813M753k260k013M874l914j10M222n033J918K573n006L648
7250I79N87m398M913j737k723N086l496r04M646m814J224L037m836K978J192m436
7266b702M278p13l398N068k791j617M485m071M39L739n126K704J786m660L895
7281A316k37l896N109k329k250M921l763k9M064m993J724K765m865L411M91m371
7297b932M857j521k794M934l356q97M530m578J169L086n013L148J130m544M192
7312A411n33l541M969k780j415M623m101L29L647m964K422J984m834M105j37l738
$$ plain form
7204 -2693 1014 1499 -2810 1994 309 -2449 2734 -815 -1581 2928 -1922 -530 2548 -2565 680
7219 680 1952 -2704 1613 770 -2553 2645 -348 -1919 2637 -1417 -1034 2588 -2354 114 1974 -2821
7235 -2821 1308 1140 -2673 2080 -180 -2193 2681 -1233 -1343 2879 -2154 -236 2337 -2669 979
7250 979 1566 -2832 2081 344 -2379 2707 -789 -1693 2953 -1861 -637 2400 -2436 542 1734 -2702
7266 -2702 1576 863 -2535 2533 -258 -1875 2610 -1461 -1022 2717 -2409 295 2081 -2579 1316
7281 1316 1079 -2817 2292 -37 -2287 2634 -1129 -1158 2906 -2087 -363 2402 -2463 948 1439 -2932
7297 -2932 1925 404 -2390 2544 -812 -1709 2821 -1757 -588 2498 -2515 633 1763 -2781 1411
7312 1411 878 -2663 2306 -474 -1889 2734 -1367 -1038 2609 -2355 67 2051 -2783 1322 1185 -2553
7328b553M526j973k332M921l610k36L818m360J464K627m795L400P51m437M622
7343A833j390k684M659l077j183M579m217Q03L212m854K856J220m378M225q84
7358G20l348M818k387j601M472m065N33L471m826K241J880m339L537R3l911M830
7374B118j982k199M591l435m95M144m801J682K765m886L319O99m207M259j156
7389D16k912M988k968j168M378m325Q50L054m546K488J586m298L896m29l523M562
7405B049k101k006M598l719R2L643m595K045K132m657L683k6l706M581j872k349
7421b208M743l399n29M052m445J632K486m854L110R24m226M296j064k748M484
7436B254k623j345M257m129P56L268m593K585J391m354L726l16l289M526k244
$$ plain form
7328 -2553 1973 0 -2332 2589 -1021 -1257 2561 -1799 -335 2292 -2503 897 1648 -2789 1833
7343 1833 443 -2241 2418 -659 -1842 2737 -1480 -677 2535 -2319 537 1757 -2621 1604 720
7358 720 -2628 2190 -197 -1798 2674 -1391 -858 2613 -2213 28 1908 -2431 1106 1199 -2712 2118
7374 2118 136 -2063 2528 -907 -1402 2742 -2059 -377 2388 -2498 821 1520 -2687 1572 416
7389 416 -2496 2492 -476 -1644 2734 -1591 -741 2313 -2233 255 1841 -2457 1439 1010 -2513 2049
7405 2049 -52 -2058 2540 -1179 -1087 2556 -2039 6 2138 -2519 1164 1138 -2568 2013 141 -2208
7421 -2208 2535 -864 -1393 2659 -1786 -154 2332 -2522 588 1512 -2714 1582 518 -2230 2254
7436 2254 -369 -1714 2543 -1586 -830 2438 -2155 430 1821 -2533 1193 877 -2412 2114 -130
7451a30j836M526l759K20L446m395J789K190m591L569K80l864M509j780k270M552
7467B456l160q61L899l933J098K835m479K649J193m339M213r87l022M652k673
7482d59j357M383m082O11L304m375K142J680m463L986l63l555M513k056j893M402
7498B418l481j93L750m433J620K411m672L402N03l854M165j337k349M221k970
7513g99p32M152m295J119L004m801K966Q07m111M242r80k877M568k644j488M379
7529B510l766L64L364m663K440J730m534L751j43l608M506j855k178M497l475
7544a060j35L484m094J777K073m356L267M42l825M387j626k640M741l092p96L913
7560B460m220J453K489m396K730J199m028L738q08k883M391k302j607M275l612
$$ plain form
7451 -130 -1966 2560 -1199 -979 2467 -1928 -139 2051 -2540 1029 1309 -2555 1954 174 -2096 2456
7467 2456 -704 -1565 2334 -1599 -501 2334 -2145 504 1697 -2642 1571 584 -2438 2214 -459
7482 -459 -1816 2567 -1515 -904 2400 -1975 167 1847 -2616 1370 1007 -2548 1965 -91 -1984 2418
7498 2418 -1063 -1256 2494 -1939 -319 2092 -2580 822 1325 -2529 1636 299 -2050 2171 -799
7513 -799 -1531 2621 -1674 -555 2449 -2352 614 1421 -2690 1552 572 -2305 2263 -381 -1869 2510
7529 2510 -1256 -892 2472 -2191 249 1979 -2555 1196 1053 -2555 1951 96 -2082 2415 -1060
7544 -1060 -1195 2289 -1805 -28 2045 -2311 956 1398 -2427 1960 334 -2306 2435 -657 -1453 2460
7560 2460 -1760 -307 2182 -2214 516 1715 -2313 1425 617 -2266 2125 -177 -1784 2491 -1121
7575a121K28L210m292K011J746m203L526n9l479M391j851k083M353l213m46L815
7591B533m358J720K211m494L244O20l920M116j289k506M275k736j003M007l888
7606a468Q81K786m274K452J262m176L905o31l128M412k266j368L977l417J98L228
7622B373m361J966J887m221L350J23l564M340j709k076M297l269n11L797m048
7637a626J332K379m356K947Q35l956L824q24k706M326k545j254M000l803O00K987
7653B160m211K330J421m143L737m59l091M214k123j604L964l436J54L463m364
7668a988K055J958m300L314P1l527L985j333k138M046k845o22L543l713J144K378
7684B028m052K600P86l828L992j106k589M265k619j005L907l816O69K923m146
$$ plain form
7575 -1121 -893 2317 -1975 36 1782 -2421 1105 1046 -2433 1958 107 -1976 2377 -836 -1282 2533
7591 2533 -1825 -105 2106 -2388 856 1476 -2444 1672 383 -2123 2152 -584 -1587 2420 -1468
7606 -1468 -587 2199 -2075 377 1639 -2537 1368 737 -2391 2021 -245 -1613 2364 -1053 -855 2373
7622 2373 -1988 -22 1865 -2356 994 1117 -2447 1893 184 -1892 2405 -864 -1375 2422 -1626
7637 -1626 -294 2085 -2271 676 1511 -2445 1379 555 -2151 2175 -370 -1624 2376 -1427 -827 2160
7653 2160 -2051 279 1700 -2443 1294 835 -2256 1958 -165 -1769 2195 -1241 -1087 2376 -1988
7668 -1988 67 2025 -2275 1039 1110 -2417 1568 235 -1903 2143 -702 -1324 2219 -1494 -350 2028
7684 2028 -2024 576 1362 -2466 1526 420 -2169 2096 -523 -1528 2379 -1437 -768 2155 -1991
7699a991K265J478m108L516l05l017M015j980j544L909l240j13L319l971J608
7714a59K062m086L135M2l207L873j461k226M044k723o45L654l915J343K270m074
7730b073K695Q95l988L889q76k797M352k607j053L933l672N31L050m277K140J404
7746A546l710L131j11k944L840j823j707M032l185j45L445m268J778K125m181
7761b177L010K54l435L933j277k215L961k606q74L821l836R51K408l994K536R80
7777A440l595L645r87k532L989k283j246L795l322L62K759l803J908J513l854
7792b211L226L1l284L895j722j848M250l290q3L010l702J592J963m074L243L50
7808A346l368L542j151k268M053k805p39L588l586P42K621l903K280J155l683
$$ plain form
7699 -1991 274 1752 -2356 1160 855 -2162 1853 -127 -1671 2238 -1002 -1115 2204 -1767 -159
7714 -159 1903 -2183 952 994 -2213 1660 199 -2027 2017 -706 -1351 2303 -1612 -269 2001 -2073
7730 -2073 622 1517 -2471 1418 542 -2255 2097 -510 -1563 2370 -1302 -771 2279 -1998 142 1546
7746 1546 -2164 967 856 -2088 1752 -71 -1778 2254 -931 -1076 2369 -1899 -121 2004 -2177
7761 -2177 833 1087 -2348 1585 308 -1907 2054 -552 -1426 2395 -1441 -490 1918 -2076 460 1440
7777 1440 -2155 1490 503 -2029 1960 -323 -1569 2226 -1096 -734 2025 -1778 130 1643 -2211
7792 -2211 1015 1046 -2238 1657 -65 -1913 2337 -953 -1036 1974 -1728 -136 1827 -2247 996 1346
7808 1346 -2022 1520 369 -1899 2154 -651 -1390 2198 -1388 -646 1975 -1928 352 1507 -2176
7823b176L417m70k771L919k228j346L886l381L84K875l984K003J483l757L121
7838I75l7l109M063j676k102M015k876m12L264l654J278K116l883K753N17l302
7854b070L493j022k159L461k247q37L504l462P34K468l920K355J093l556L534
7869A369o38k757L965k050j406L539l125J57L202l939J808J570l722K969l4l080
7885b172L864j522j955L781k672m04L195l714J335K156l698K456N07l336L713
7900A534r96k472L812k418q80L551l390O14K655l986K160J389l674L256l13k776
7916a934L754j873j583L709l139J28L009l903J680J894l681L050l4l178L756j462
7932A93k125M060k895l16L041l321J210K065l761K543O76l445L367r38k142L737
$$ plain form
7823 -2176 1241 771 -2000 1919 -309 -1655 2231 -1150 -766 2109 -1875 128 1611 -2146 975
7838 975 938 -2171 1892 216 -1886 2129 -747 -1159 2105 -1549 -271 1845 -2038 715 1232 -2070
7854 -2070 1423 401 -1758 1703 -544 -1381 2123 -1339 -605 1863 -2057 298 1391 -2165 1369
7869 1369 731 -2026 1939 -111 -1517 2022 -1103 -946 2256 -1683 125 1695 -2027 942 908 -2172
7885 -2172 1692 170 -1785 1996 -676 -1080 2115 -1599 -264 1892 -1806 650 1157 -2179 1534
7900 1534 538 -1934 1878 -540 -1420 2131 -1259 -645 2010 -1976 184 1573 -2101 1155 842 -1934
7916 -1934 1820 -53 -1636 2073 -1066 -938 2071 -1832 -152 1742 -1939 1111 1077 -2101 1655 193
7932 193 -1932 2128 -767 -1083 1958 -1363 -153 1912 -1849 694 1370 -2075 1292 354 -1788 1949
7948A949k446q91L509l214M59K742l952K177J137l470L072l49k717L702j845j359
7964a496L558l008L4L096l897J638J841l738K773K65l227L660j293j963L681k548
7980f24m56L122l261R35K196l791K240J136l615L469p21k531L609j925j137L462
7996B108l196M80K649l847J961J324l474L067m06k681L699j959j269L570k885
8011h59j38L062l689J420J815l565K655L33l190L704j197k161L776k373q90L310
8027B013l227Q27K255l642K236P63l241L225p19k417L625k045j178L615l126L43
8043f93K653l829K065J403l695L239m34k570L537j550j716L481k787j92L111l459
8059a436J345J807l676K549M90l047L591j335k132L725k356p07L183l402R41K201
$$ plain form
7948 1949 -497 -1388 2121 -1093 -634 2108 -1844 333 1470 -2000 1072 723 -1994 1708 -137 -1496
7964 -1496 2062 -946 -912 2184 -1713 -75 1766 -1972 801 1066 -2161 1499 206 -1757 1924 -624
7980 -624 -1080 2042 -1219 -284 1912 -1879 361 1497 -2118 1351 630 -1901 1708 -217 -1354 2108
7996 2108 -1088 -608 2041 -1806 155 1479 -1995 1072 666 -2015 1684 -275 -1544 2026 -859
8011 -859 -997 2065 -1624 -204 1611 -1954 701 1034 -2156 1548 351 -1810 1966 -407 -1297 2013
8027 2013 -1214 -387 1868 -1774 462 1225 -2016 1209 490 -1927 1698 -347 -1525 2090 -1036 -693
8043 -693 1960 -1869 196 1599 -2096 1143 709 -1861 1676 126 -1590 1891 -896 -1088 2023 -1436
8059 -1436 -91 1716 -1960 589 1079 -1968 1623 288 -1844 1881 -475 -1182 2001 -1401 -460 1741
8075A741l629K297Q98l320L321o59k488L578k023j117L303l008M58K575l556J749
8091A20J495l747L002P3k727L362j525j512L374k641k46K964l469J262J794l426
8107a847K547M93l341L626j190j857L397k356p76L389l454R00K232l541K033Q14
8123A069l070L157l41k590L321j835j045L261k912J92K815l566J602J441l521
8138b022K927M8k977L470j448j743L730k666l39L109l554J334J748l533K661L53
8154A098l094L146p54k061L530k226j034L251k945L86K596l545J913J054l229
8169a914K830k83k433L482j910j188L602l144J91K748l466J722J123l370K876
8184H66M7k944L551j395j678L451k555
$$ plain form
8075 1741 -1888 409 1307 -2013 1308 649 -1839 1739 -284 -1401 1902 -1106 -648 1927 -1629 120
8091 120 1615 -2132 870 943 -1784 1578 53 -1459 1915 -726 -972 1992 -1477 -215 1579 -1847
8107 -1847 700 1193 -2148 1478 288 -1569 1828 -528 -1304 2085 -1369 -469 1763 -1778 255 1069
8123 1069 -2001 1156 815 -1775 1546 -289 -1334 1927 -985 -793 2022 -1544 58 1499 -2022
8138 -2022 905 953 -2024 1446 -2 -1745 1985 -681 -1020 2089 -1465 -131 1617 -1916 745 1098
8154 1098 -1996 1150 396 -1665 1865 -361 -1395 1856 -1089 -703 1893 -1652 261 1315 -1914
8169 -1914 916 633 -1800 1682 -228 -1416 2186 -958 -767 1981 -1485 237 1360 -2010 866
8184 866 913 -2031 1520 125 -1553 1898 -657
8191f57
$$ Imaginary data points
##PAGE= N=2
##DATA TABLE= (X++(I..I)), XYDATA
0@%%%%%%Qj6J6j6J6j6K4m0M8n6O4p2Q8j10J37j63J89k17K49k87L34l89M45n03
30b67N68o41P24q18R21j033J153j280J420j578J753j942K146k367K607k869L158
47A655l478L829m213M635n102N626o218O889p656Q539r567J0782j2247J4050j6323
62h799J9272k3233K8815l7204N0967p6800J38994n05872j82361J517692j540531
73f19060L96277J102875j670571R83022M51885j578130J399284k02826j134771
82h72015J610564p84387n74837J524429j305980L7065J174439j516668O86580
91b0810O83729j462840J177495M5224j232433J409254n59456p53397J463856j022419
101b71797j48426J260335j366965M10683Q06194j443861R32468K66319j221966
$$ plain form
0 0 0 0 0 0 0 0 8 -8 8 -8 8 -8 16 -24 24 -32 32 -40 48 -62 75 -88 101 -116 133 -154 180 -209 236 -267
30 -267 301 -340 384 -434 487 -546 607 -673 747 -831 922 -1020 1126 -1241 1366 -1503 1655
47 1655 -1823 2006 -2207 2428 -2674 2952 -3266 3623 -4033 4506 -5061 5721 -6526 7524 -8799
62 -8799 10473 -12760 16055 -21149 29818 -46982 92012 -413860 -596221 921471 -619060
73 -619060 -222783 880092 -790479 192543 644428 -933702 465582 262756 -872015
82 -872015 738549 -45838 -620675 903754 -402226 -365161 809278 -707390 -20810
91 -20810 662919 -799921 377574 422798 -809635 599619 40163 -713234 750622 -271797
101 -271797 -420223 840112 -526853 -116170 690024 -753837 178631 444950 -777016
110g77016J284467l08409q64597J343676q23602l65382J216212j139359K13907
119b20103R21148j292678O90402M25016j237060J050303j04443r25395J265917
128E73107n84451n00424J211564r92319j6771R59196j198712N07731N99055j199423
138f41447R12454R1367j018947J128246m22712o32069J188383q04382j54149J015442
148F62186j065667K97205O55164j138605P15319K53325j000730J007224k07564
157A77857p22490J087755o53453l17632J016999r35734J53344P73249j064940
166d85045N59109L62620j033872Q73477o1705q00587J058693m70684m38782J022917
176E86141q32700k1045Q22197j008260M13979N04758r92164P48330P6148q44768
$$ plain form
110 -777016 507451 199042 -665555 678121 -145481 -510863 705349 -434010 -220103
119 -220103 701045 -591633 98769 523785 -713275 337028 232585 -692810 573107
128 573107 -11344 -511768 699796 -292523 -309294 649902 -548810 -41079 557976 -641447
138 -641447 271007 362374 -656573 471673 48961 -583108 605275 -199107 -353256 662186
148 662186 -403481 -106276 548888 -589717 125602 378927 -621803 385421 177857
157 177857 -544633 543122 -110331 -427963 589036 -346698 -193354 579895 -485045
166 -485045 74064 436684 -597188 276289 214584 -586003 472690 2006 -436776 586141
176 586141 -246559 -267604 554593 -453667 -39688 465070 -527094 221236 297384 -547384
186e47384R34107l32228n44206R89865o55894j45124Q59069r03338K46422N77738
196D79027r84602O09731K26880q66777Q71503j84483o33390R56640n62372k93403
206c81246Q97488q11769J24376O81104r39419M86516L32892r12047P57166m4144
216A90917o94119R12214m08015l83497Q86705p09520l4487P18573q63559L48925
226c5863M45124q74295O52765Q3020p59945Q26974k84055m88556Q86095n91087
236a39823j37207P82608q12910K07650N33246q84199N44180K09935p88716P81426
246B96190j51342n81270Q51118m86005k66384P95022p12862R6210O12575q23919
256c70667M05377L12331q02885O58343k4404o29324Q11677l46656l65651P98656
$$ plain form
186 -547384 386723 54495 -489711 500154 -155740 -300864 558205 -345133 -98711 479027
196 479027 -505575 104156 331036 -535741 335762 151279 -482111 474529 -87843 -381246
206 -381246 516242 -295527 -171151 509953 -429466 57050 389942 -522105 235061 190917
216 190917 -503202 409012 997 -382500 504205 -205315 -239802 478771 -384788 -35863
226 -35863 409261 -465034 187731 270751 -489194 337780 53725 -434831 451264 -139823
236 -139823 -277030 505578 -307332 -99682 433564 -450635 93545 303480 -485236 296190
246 296190 144848 -436422 414696 -71309 -337693 457329 -255533 -159323 453252 -370667
256 -370667 34710 347041 -455844 202499 178095 -451229 360448 13792 -351859 446797
266D46797o24917m2211O57205p82141L03940M22844q01272N76184R5973o98134
276d45732P49383k45876m58858Q09180n21191j46287P08518p17501J73716M82895
286C88247p84506M69757K05834p04056O72779j12445n23902P51846m20169k51637
296c08252P18879o29211O7688N57757p39428L61638K86879p32109N97353j0110
306A71084n82105P34172l07174l40054P32489n71006m3944O08665p09972K66796
316d1049L84971p20760N17085Q4584o25054O67211k08132m14329P12199m51622
326i4896j37886O33338o40436J48171M44851p06397M16830J90152o39253O14301
336B28775j07711m79861O91447l80782k34629O58430n74330O0049N15657o86854
$$ plain form
266 446797 -178120 -220331 436874 -345267 -41327 381517 -419755 156429 252402 -445732
276 -445732 303651 57775 -401083 408097 -113094 -259381 449137 -268364 -94648 388247
286 388247 -396259 73498 279332 -424724 248055 135610 -388292 363554 -56615 -308252
296 -308252 410627 -218584 -150896 406861 -332567 29071 315950 -416159 181194 171084
306 171084 -411021 323151 15977 -324077 408412 -162594 -206538 402127 -307845 -41049
316 -41049 343922 -376838 140247 224831 -400223 266988 58856 -355473 356726 -94896
326 -94896 -232782 400556 -239880 -91709 353142 -353255 63575 253727 -385526 228775
336 228775 121064 -358797 332650 -48132 -282761 375669 -198661 -138612 377045 -309809
346c09809L31419K73222o75928N44914o755n29895O69565k84239l07844O60926
356C65576n07193m5012N43324o27498K32949L49578o52215M61174Q7957n72620
366c63980O04629j86368l79380O58781m25569j24205N87127n94123J39309M08407
376C24628o51906L89915J75222n99281N72123r4988m50343O40578l50930k15048
386b60030O10452n35050N6696M72168o23919K97101K46561o06390M90438j831
396A46196m86789O07002k48128k91862O06234m61898m5052N10701n91069K18393
406c6272L30378o12666M30608Q0605n34085N69253j74066l62214O20743l91544
416g9260j27842N52327n51565J23865L90126o12392L58329J71153n55368N18608
$$ plain form
346 -309809 21610 294832 -381096 163818 157063 -372832 296733 12494 -295350 365576
356 365576 -141617 -186629 356695 -270803 -37854 311724 -340491 120683 208640 -363980
366 -363980 240649 54281 -325099 333682 -91887 -216092 371035 -223088 -83779 324628
376 324628 -327278 62637 237859 -361422 210701 115713 -334630 305948 -44982 -260030
386 -260030 350422 -184628 -127932 344236 -279683 17418 263979 -342411 148027 146196
396 146196 -340593 266409 18281 -273581 332653 -129245 -174297 336404 -254665 -36272
406 -36272 294106 -318560 112048 192653 -341432 227821 53755 -308459 312284 -79260
416 -79260 -207102 345225 -206340 -82475 307651 -304741 53588 224741 -330627 187981
426A87981q0507m14039N83719l11621k09461N63724m78844L3513M43799n75134
436b56870K67043K43391n77800M60435P229m64811N71480k33612k76545N75933
446C15873m36446m9061M88977n52750J93664L18136n77018L98616Q7447n11198
456c23760N32057j50931l43935N72385l55968j23117N10702n03240J02541L67926
466B84660n57666L15090J69204n17182M76214o2566m01732N52905k85703k05490
476b32266N35375m54033L1394M23696n48617K49615K36666n44721M27267J4055
486A38431m40975N34511k09158k73357N42863l97038n7158M57424n07468J71115
496d0810L00921n33229L56689R3420m71775M79918j26613l25291N30699l22070
$$ plain form
426 187981 107474 -306565 277154 -34467 -243928 319796 -159048 -125535 318264 -256870
436 -256870 10173 253564 -324236 136199 143428 -321383 250097 16485 -260060 315873
446 315873 -120573 -169634 319343 -233407 -39743 278393 -298625 99991 187438 -323760
456 -323760 208297 57366 -286569 285816 -70152 -193269 317433 -185807 -83266 284660
466 284660 -273006 42084 211288 -305894 170320 107754 -293978 258927 -26776 -232266
476 -232266 303109 -150924 -119530 304166 -244451 5164 241830 -302891 124376 138431
486 138431 -302544 231967 22809 -250548 292315 -104723 -161881 295543 -211925 -40810
496 -40810 260111 -273118 83571 176991 -294784 185134 58521 -266770 263929 -58141
506e8141j30498M86614m68587Q8613L51897n28635K99009J63591m95865M50903
516A58901n5069l81004N19052k65264j96421N05262m21905J7703M03501n08282
526b23526K23678K24943n04254L91529K0064m11999M88144j82731k56379M95691
536B65160l58765n8608M27680m69093J50118K89283n00666L32242Q8851m46560
546b80358M58116j21528l10291N04345l05455j21470M56313m41488Q4341L32780
556B55305m96324K74543J59646m63677M15400m7973l54511M80349k40710j87080
566b05032M66290l82877J1719L70180m65023K02610K12680m68658L59062K5761
576A26712l87863M57418j73593k41377M71959l43226n4682M06204m45330J45754
$$ plain form
506 -58141 -188639 297975 -170612 -81999 269898 -258737 40272 203863 -292002 158901
516 158901 103832 -277172 241880 -23384 -219805 285457 -136448 -118745 284756 -223526
526 -223526 152 225095 -279159 112370 132434 -279565 208579 25848 -230531 265160
536 265160 -93605 -152213 275467 -193626 -43508 245775 -254891 77351 166202 -280358
546 -280358 177758 56230 -254061 250284 -55171 -176641 279672 -161816 -77475 255305
556 255305 -241019 33524 193170 -270507 144893 96920 -257591 222758 -17952 -205032
566 -205032 261258 -121619 -109900 260280 -204743 -2133 210547 -258111 100951 126712
576 126712 -261151 196267 22674 -218703 253256 -89970 -144652 261552 -183778 -38024
586c8024K68220m72567L16262Q3225m20886M27984j09030k91791M68703k82656
596e0560j14897M24495m06496P2199L10547m53863K48024J48397m26689L80478
606A31635l8859l33192M44579k17544j78643M37880l61246J1194L52165m42989
616a95020J91723K02949m44046L41754K1571l66353M32746j62216k31171M43279
626B35216l15340n7067L81684m13440J29721K55800m39047K84531Q6191l89613
636b41364L89187r3831k72914M30988k53053j16823L96711l71612N9119K96011
646B22419m28408K32474J44746m08081L60558l5263l16598M23016k09358j67159
656a81654M15167l40817P012L32564m13048J75588J92920m15646L16503K5621
$$ plain form
586 -38024 230196 -242371 73891 157116 -263770 164214 55184 -236607 232096 -50560
596 -50560 -165457 259038 -147458 -75259 235288 -218575 29449 177846 -248843 131635
606 131635 92776 -240416 204163 -13381 -192024 245856 -115390 -104196 247969 -195020
616 -195020 -3297 199652 -244394 97360 118931 -247422 185324 23108 -208063 235216
626 235216 -80124 -137191 244493 -168947 -39226 216574 -222473 62058 148249 -241364
636 -241364 147823 53992 -218922 212066 -40987 -157810 238901 -132711 -73592 222419
646 222419 -205989 26485 171231 -236850 123708 88445 -228153 194863 -14495 -181654
656 -181654 233513 -107304 -100292 232272 -180776 -5188 187732 -227914 88589 114210
666A14210l44273L98448j43923k17201M08862k89290n4725L54078l79931J15035
676c8710K39668m06551K62440Q2377l67899L69456q8889k60355M10950k43425
686d0938j07503L76743l58769O3011K78841m06662K20692J35373l82509L37281
696A15560l2216k98362L96742j91857j60852L86633l12429K277L09676l82036
706a66864J59836J82735l85399K88385K9743l22161L69725j31559k08108L88635
716B04968k72766n5140L38511l62393J10862K27909l90912K54802P6316l49178
726b17021L49786q3222k45362L85739k27262j04413L55786l32748N2011K64277
736A97571l76830K00336J30305l57864L11608k5496k79239L65509j73071j52108
$$ plain form
666 114210 -230063 168385 24462 -192739 216123 -73167 -127892 226186 -153745 -38710
676 -38710 200958 -205593 56847 139224 -228675 140781 51892 -208463 202487 -40938
686 -40938 -148441 228302 -130467 -67456 211385 -195277 25415 160788 -221721 115560
696 115560 83344 -215018 181724 -10133 -170985 215648 -96781 -94504 215172 -166864
706 -166864 -7028 175707 -209692 78693 108436 -213725 156000 24441 -183667 204968
716 204968 -67798 -122938 215573 -146820 -35958 191951 -198961 55841 132157 -217021
726 -217021 132765 49543 -195819 189920 -37342 -141755 214031 -118717 -66706 197571
736 197571 -179259 21077 151382 -206482 105126 79630 -199609 165900 -7171 -159279
746a59279L60238k90689r36K94842l61709J49615J74839l67311K77991K4888l08075
757b05586L57171j30110j95609L68343k59630m9354L18223l41532J02919K16461
767A81296l65881K33151P6276l26355L23046p2662k32590L59228k06810j02355
777a33656L30947l05139M4145K48828l51967J84526J26917l39233K92543k1754
787G6157k66392L49422j66547j45676L46714k79738o0K79422l42906J42273J65503
798A58172l46825K59419K8455k91708L30653j14614j87276L43283k36735n3156
808a10332L00172l14752Q9047K04509l38227K12204P5558l06740L00765o3517
818D8687k22651L39025j94324r7993L16017k93055M3489K38748l38159J78600
$$ plain form
746 -159279 200959 -89730 -90666 204176 -157533 -7918 166921 -200390 77601 102489 -205586
757 -205586 151585 21475 -174134 194209 -65421 -114775 203448 -138084 -35165 181296
767 181296 -184585 48566 124842 -201513 121533 48871 -183719 175509 -31301 -133656
777 -133656 197291 -107848 -63703 185125 -166842 17684 144601 -194632 97911 76157
787 76157 -190235 159187 -7360 -153036 193678 -86060 -86120 193302 -149604 -7331 158172
798 158172 -188653 70766 99221 -192487 138166 23552 -163724 179559 -57176 -110332
808 -110332 189840 -124912 -35865 168644 -169583 42621 118179 -188561 112204 48687
818 48687 -173964 165061 -29263 -127256 188761 -104294 -60805 177943 -160216 18384
828A8384J17820l21072K78348k1822k51422L28486j53127j40111L23855k56730
838g7391n409K63325l17408J25960J60620l23541K36561L1005k71861L04796j02540
849B4117j78545L21092k17460n4430K83754k95435Q1999J95906l23138K02600
859D0460P3267k94074K87804o2016k09744L21095j84586r3210K98191k72714L6352
870e9175K25400l13038J60267J15851l00592K53938j1849k38563L03168j36430
880a023j34025L00872k35212j0306K48377k94845J14009J52988l04060K22196
890E8971L0781k59867K90782r7789j70217L06846k09739m8009K67906k81026P8554
901c2807J84330l02825J87543P0576k73930K64962n2517j99673K97867j65162
$$ plain form
828 18384 136204 -184868 93480 71658 -179764 148722 -4405 -144516 179339 -77391
838 -77391 -82800 180525 -136883 -10923 149697 -173844 62717 93722 -178139 126657 24117
849 24117 -154428 166664 -50796 -105226 178528 -116907 -34908 160998 -162140 40460
859 40460 113727 -180347 107457 45441 -164303 156792 -27794 -121004 177187 -95527 -59175
870 -59175 166225 -146813 13454 129305 -171287 82651 70802 -167761 135407 -1023
880 -1023 -135048 165824 -69388 -79694 168683 -126162 -12153 140835 -163225 58971
890 58971 89752 -170115 120667 22878 -147339 159507 -50232 -98241 169665 -111361 -32807
901 -32807 151523 -151302 36241 106817 -167113 97849 45332 -154341 143526 -21636
911b1636r3349K78820k50663L0454K11135k90198J46354J10592k80716K35344
921G6137r614k24071K85225j28443j27924K87115k24880r190K36612k83114J12753
932i394J42585k88958K12554K7467k43997K72287r0983j58991K85083j92083m9405
943i3835K51498k58203O7120J75448k82193J72160O8720k56729K46523m7110j87613
954a44214K78385j54976q6215K61605k37332K9717K00363k76859J41400J03005
964A14879k68065K28511j4171k11192K72933j24979j18421K69504k12325o548
974f9874K19794k63092J02708J35569k68637J93982K9511k28740K52891q2794
984B1318j50293K66496j78117m7013K35059k42901O5169J63504k66360J64462
$$ plain form
911 -21636 -114985 163835 -86828 -56374 154761 -135437 10917 121509 -159207 76137
921 76137 66523 -157548 127677 -766 -128690 158425 -66455 -75645 160967 -122147 -9394
932 -9394 133191 -155767 56787 84254 -159743 112544 21561 -137430 147653 -44430 -93835
943 -93835 157663 -100540 -33420 142028 -140165 31995 100715 -156014 90509 43399 -144214
954 -144214 134171 -20805 -107020 154585 -82747 -53030 147333 -129526 11874 114879
964 114879 -153186 75325 61154 -150038 122895 -2084 -120505 148999 -63326 -69874
974 -69874 149920 -113172 -10464 125105 -143532 50450 79961 -148779 104112 21318
984 21318 -128975 137521 -40596 -87609 147450 -95451 -30282 133222 -133138 31324
994C1324O3512k43114K35935m8177j76726K67321j52640p8477K48433k27271L1079
1005d8801J87258k60929J34401R5368k49889K11204r868j98190K51840j12424
1015c0j13138K51797j96261r117K07073k45407R5133J26749k51943J84236K4726
1026G3818k14196K39688q0785j39845K52803j72820m0209K22783k34549O7008
1036b6304J52220k53692J59932N5815k28204K24398m8489j63587K48927j41442
1046b0426p3763K30654k09939K7280J75581k42949J23702R0522k33850J97528
1056F4340r938j85438K38144j08844j04246K37650j88015n167J94510k35132R5087
1067g049J17779k40978J79167K0250k02786K29335p9524j30934K39783j64394
$$ plain form
994 31324 94836 -148278 87657 39480 -137246 130075 -22565 -101042 147391 -79880 -48801
1005 -48801 138457 -122472 11929 107297 -142592 68612 58744 -139446 112394 -30
1015 -30 -113168 138629 -57632 -66749 140324 -105083 -9950 116799 -135144 49092 73818
1026 73818 -140378 99310 18525 -121320 131483 -41337 -81546 141237 -93312 -26304
1036 -26304 125916 -127776 32156 87971 -140233 84165 35676 -127911 121016 -20426
1046 -20426 -94189 136465 -73474 -46194 129387 -113562 10140 100662 -133188 64340
1056 64340 54402 -131036 107108 -1736 -105982 131668 -56347 -61514 132996 -102136 -7049
1067 -7049 110730 -130248 48919 69169 -133617 95718 16194 -114740 125043 -39351
1077c9351l7716K09680k18547N9367J44716k36321J46142N5919k15109K08136
1087G6916m1380j55869K33161j31387p0805K18615j99495K7137J65740k31178
1097a08545J19449Q4076k23178J91728j2956j76310K30085j07970r6459K26380
1107A26300j81837j629J83454k24088R1691J10198k26001J67181J9976j90552
1117a25307K14352p2718j24624K25024j52526l6738J97070k05738N6923J35909
1127A11627k24605J40943N0400k02999J99824m3753j45768K24216j30748o3213
1137h4076K08581j93912L0575J55359k21557J17568P7054k11556J82710j3676
1147D7070j65133K15365r9772r2007K12795j69084m452J74008k09292Q3657J04750
$$ plain form
1077 -39351 -77067 132613 -85934 -26567 118149 -118172 27970 83889 -131220 76916
1087 76916 35536 -120333 112828 -18559 -89364 129251 -70244 -43107 122633 -108545
1097 -108545 10904 94980 -128198 63530 50574 -125736 104349 -3621 -100080 126300
1107 126300 -55537 -57166 126288 -97800 -6109 104089 -121912 45269 65245 -125307
1117 -125307 89045 16327 -108297 116727 -35799 -72537 124533 -81205 -24282 111627
1127 111627 -112978 27965 78365 -124634 75190 31437 -114331 109885 -20863 -84076
1137 -84076 124505 -69407 -38832 116527 -105030 12538 89592 -121964 60746 47070
1147 47070 -118063 97302 -2470 -94477 118318 -50766 -55218 118790 -90502 -6845 97905
1158I7905k12572J57487J8982j80528K03686p0830j16165K13702j47834l1805
1168f7972J87678j99373N8653J27360k15884J38941M3530j92356J93053m5272
1178B8358j36610K13014j25197n8144J95084j81372K7642J46907k07586J08243
1188A0339P4555j99075J70860j2116j55882K03864r5821q5574K01205j62334j38
1199e0117J62083j99978Q4372R5991k03327J54560J3078j70289J97332p3227j06833
1210i6355K04410j44987k5741J76310j90513N8596J17284k01931J30358M1513
1220F8944j80936J80101m0500j29447J99732j16710n5581J84940j72343K7209
1230c4591J38411j97710J06032O6715j88205J65596j5922j46328J96189r5792
$$ plain form
1158 97905 -114667 42820 61802 -118726 84960 14130 -102035 111667 -36167 -67972
1168 -67972 119706 -79667 -21014 106346 -109538 29403 72933 -119423 73630 28358
1178 28358 -108252 104762 -20435 -78579 116505 -64867 -37225 109682 -97904 10339
1188 10339 84894 -114181 56679 44563 -111319 92545 -3276 -88850 112355 -49979 -50117
1199 -50117 111966 -88012 -3640 92351 -110976 43584 56662 -113627 83705 10478 -96355
1210 -96355 108055 -36932 -62673 113637 -76876 -18280 99004 -102927 27431 68944
1220 68944 -111992 68109 27609 -101838 97894 -18816 -74397 110543 -61800 -34591
1230 -34591 103820 -93890 12142 78857 -109348 56248 40326 -106002 90187 -5605
1240e605p7869J92124j58951L969J54026j93478Q3883Q9567j93556J48447J0171
1251E2728j59884J86134o8502j01586J92333j34600k6643J67039j78769N3446
1261a8304J12839j92323J24123L8821j72042J73472m2406j20438J91202j15329
1271b0385m9192J75749j67650L0769J29686j91017J05928O0911j80372J61262
1281E5689j8606j38171J87985r3549p1870J81235j49971L099J45398j81332P7333
1292b760Q5517j82247J38907J1629j53055J76829o4845r6643J84124j31404k1612
1303e5560J57724j73089N5965J04119j84103J22949L2014j62517J68260m4662
1313B1100j13132J83956j13041m4615J67573j61598L1606J21907j80821J00025
$$ plain form
1240 -5605 -83474 108650 -50301 -46332 107694 -85784 -1901 87666 -105890 42557 52728
1251 52728 -107156 78978 10476 -91110 101223 -33377 -60020 107019 -71750 -18304
1261 -18304 94535 -97788 26335 65156 -106886 66586 24180 -96258 94944 -20385
1271 -20385 -69577 106172 -61478 -30709 98977 -92040 13888 74799 -105573 55689
1281 55689 37083 -101088 86897 -6652 -78522 102713 -47258 -44159 101239 -80093 -2760
1292 -2760 82757 -99490 39417 51046 -102009 74820 9975 -86668 97456 -33948 -55560
1303 -55560 102164 -70925 -14960 89159 -94944 28005 60019 -102498 65762 21100
1313 21100 -92032 91924 -21117 -65732 101841 -59757 -28151 93756 -87065 12960
1323A2960N7608j69766J50934j6618j30276J76687q7085o9251J72237j42437L597
1334d1410J37890j74362P7447P8399j74097J36487N962j43686J71436o8093q7398
1345h1425J75937j29521j6547J49549j67007N6373R7433j76149J19030K9232j54172
1356i7267J59401m1496j07764J73706j05871m3396J58728j51638K7807J17068
1366H9278j71592R4828N4659j62433J46089j8265j23642J70550q6883o3100J65103
1377I4592j40658Q510J30021j68458P7272P2909j67035J32933L334j36882J64992
1388G1530o5819q3468J67418j22290j6688J42405j58093N2358R3299j66698J11396
1399B5350K9155j47203J52325m0607j02230J66991j04011l8479J51564j48563
$$ plain form
1323 12960 70568 -99198 51736 35118 -95158 81529 -5556 -74807 97430 -45007 -41410
1334 -41410 96480 -77882 -435 77964 -96133 40354 46316 -97370 74066 5973 -81425
1345 -81425 94512 -35009 -51556 97993 -69014 -12641 84792 -91357 27673 56905 -97267
1356 -97267 62134 20638 -87126 86580 -19291 -62687 96041 -55597 -27790 89278
1366 89278 -82314 12514 67173 -95260 50829 32564 -91078 79472 -7411 -70511 94592
1377 94592 -46066 -37556 92465 -75993 1279 74188 -92847 40086 43420 -93462 71530
1388 71530 5711 -77757 89661 -32629 -49317 93088 -65005 -12647 80652 -86046 25350
1399 25350 54505 -92698 59627 19020 -83210 83781 -20230 -58709 92855 -55708
1409e5708L1833J09075j66852R7154M6800j54695J43720k2172j15963J64611q6891
1420i088n7651J57741j35961R607J23395j60688P3907O9575j59299J26205M225
1431D1968j30828J56483o1969q0027J60122j17469j5074J36229j52900N2678Q7723
1442G6936j60822J10694K4042j40823J49805m3920r5231J61400j03611l3812J45081
1453H9739j44855L3237J03632j60374R3555M5109j48040J36385j9927j11767J56985
1464G3679q1097n7020J50490j27801P232J19076j54350P1239O6492j53174J22923
1475C7689R04j23836J52015o4025p3199J54343j17093r631J28664j48770N4825
1486h114Q1283j55180J09716J9980j34021J44386m3761q9690J53832r9219l2021
$$ plain form
1409 -55708 -23875 85200 -81652 15502 62302 -92393 51327 29155 -86808 77803 -9088
1420 -9088 -66739 91002 -44959 -35352 88043 -72645 1262 70837 -88462 37743 41968
1431 41968 -88860 67623 5654 -74373 85749 -31720 -46794 89435 -63465 -10787 76936
1442 76936 -83886 26808 50850 -89973 59832 15912 -79319 82081 -21530 -55342 89739
1453 89739 -55116 -21879 81753 -78621 14934 60043 -87997 48388 28461 -83306 73679
1464 73679 -7418 -64438 86052 -41749 -34517 84559 -69791 1448 67940 -85234 37689
1475 37689 38593 -85243 66772 2747 -70452 83891 -33202 -42833 85831 -62939 -8114
1486 -8114 73169 -82011 27705 47685 -86336 58050 14289 -75401 78431 -20788 -52809
1497e2809J38218j37529L1059R8732j52163Q8693M2925j41647J31731k0707j05940
1508g9437J51132q1183n0659J43994j26912J2441J11599j50204P3767N8722j45953
1519h2693J21295l409j17022J47533o4423o8253J47637j13325p872J22643j42344
1530f0233N2176P8065j47652J03293K0240j27999J36955m0559q6800J47841r5457
1541b0130l0169J32514j33612L2696R3038j47413Q9167L7324j35123J29175k4446
1552B3021r8655J45968q1123m6364J38397j23964J4182J06363j44667P1711N5972
1563F0841j40346J16240k605j12625J40600o0047o6189J40724j06881r194J18548
1574G9066j37025N0356P4893j42684J01279J7389j22800J34467m3136q1057J42997
$$ plain form
1497 -52809 85409 -52120 -21061 77671 -74492 14201 57126 -84521 47210 26503 -79437
1508 -79437 71695 -9488 -60147 83847 -43065 -30624 80975 -69229 4538 63260 -82693
1519 -82693 38602 35193 -81829 65704 1281 -66972 80665 -32660 -40532 82111 -60233
1530 -60233 -8057 70008 -77644 25649 45889 -82110 54845 14286 -72514 75327 -20130
1541 -20130 -50299 82215 -51397 -18701 74337 -73076 16091 53415 -81708 47467 23021
1552 23021 -75634 70334 -10789 -57153 81244 -42720 -28538 77825 -66842 4869 60841
1563 60841 -79505 36735 34130 -78495 62105 2058 -64131 76593 -30288 -39482 79066
1574 79066 -57959 -7603 67290 -75394 25885 43274 -79526 54941 11805 -69252 73745
1585G3745r5595k4859J25824j30222L4654Q7622j42246Q7340L4758j29961J24984
1596D6044k3679r5664J40849p7122m5615J32874j17821J2328J02253j37840O7077
1607C684N4934j34731J11208k459j08069J35955n9895o1935J36479j06785m645
1618c6259J12343j33895N3330O7920j37051J00687J3240j16976J30451m3646p6291
1629f6147J37611r2926k3393J21304j25041L2350Q4779j36613Q3316L4038j24747
1640g5469J19001k1745r2128J35336p5009m2685J27874j15175J4349R7286j34500
1651f2865O8924M9167j29646J11123p584j01423J32266o1136n7206J31113j04285
1662c1552k485J07452j29513N1428O6171j32341R6469J3584j12827J25083m1102
$$ plain form
1585 73745 -21850 -46709 79115 -51107 -16453 71169 -71077 16263 51021 -78940 46044
1596 46044 22365 -73299 67550 -9572 -55187 77687 -40134 -27806 74447 -63393 3684
1607 3684 58618 -76113 35095 32636 -75433 60522 627 -61308 75171 -31614 -36259
1618 -36259 76084 -57811 -4481 63439 -73612 27075 40315 -76661 53790 10144 -66147
1629 -66147 71464 -21462 -44855 76449 -48592 -16242 68537 -68076 15240 49278 -75469
1640 -75469 43532 21787 -70341 64995 -10014 -52699 75175 -40000 -25651 71635 -62865
1651 -62865 6059 55226 -74420 36703 29119 -72304 59962 -1174 -58380 72733 -31552
1662 -31552 -34037 73415 -56098 -4670 61501 -70840 25629 39213 -73614 51469 10367
1673A0367p4219J32046q8188k3464J16899j20640L2155Q0894j31883Q1842L0930
1684D6739j20034J17328k5181q6474J32179p6759l7178J22227j13203J7258R1712
1695F8614j30114O8217M6255j24808J07094o905r8372J27593n8439n5551J26550
1706G0134r9965l496J03869j24130M9104O3667j27570R3565J1982j08241J21576
1717E0495m1994o9498J27972q8661j8497J11477j19050L5545P5092j27754Q2139
1728A7266K6485j14796J14781k6377q2240J27050p3714l6204J18073j08854J5743
1739b2787Q9235j25387O4875M5445j20428J02552n833r5351J23433n6913n3074
1750e4233J22212r7858j229R9513j21734N0775N8855j23385R3494P945j03010
$$ plain form
1673 10367 -63852 68194 -19994 -43458 73441 -47199 -15044 65850 -66033 15809 46739
1684 46739 -73295 44033 18852 -67622 64557 -12202 -49380 72847 -40356 -23098 68614
1695 68614 -61500 6717 52972 -71836 35258 28353 -70019 57574 -865 -56416 70134
1706 70134 -29831 -33327 70542 -53588 -4484 59183 -68387 25178 37160 -71081 50495
1717 50495 8501 -60997 66975 -21686 -40183 71294 -47756 -12211 62881 -64873 17266
1728 17266 43751 -71045 43736 17359 -64881 62169 -11545 -47749 70324 -38530 -22787
1739 -22787 66448 -58939 5936 51381 -69047 33505 27672 -67679 55754 -1159 -54233
1750 -54233 67979 -29879 -31108 68405 -53329 -2554 56301 -67084 26410 34355 -68655
1761f8655J18819m3395o5280J23649q6858j6773J07268j14526L3381P3372j23661
1772f2659P8427K7227j11614J09951k3803q0370J22668p0561l5780J14570j05530
1783c7474J5776Q5675j21313O4199M2100j16486J01682r133r0102J20465n8379
1794b990m8495J17705r6593J325R5179j18197N0252N6255j19077Q9944Q307j00206
1806f6591J14628m0575o4682J19764q2280j8331J04582j10242L1172P1890j19756
1817f0421P5921K5869j07756J07059k4621p6846J19575p0916l1788J10064j03968
1828c7828J8403Q1007j18153O4395L8933j12101R9030r594q7214J16496n5814
1839b440m7724J14460r3142n0R2980j13999M7327N5525j15474Q6640Q719r7358
$$ plain form
1761 -68655 50164 6769 -58511 65138 -21720 -38493 68775 -45751 -12370 61002 -62659
1772 -62659 15768 42995 -68619 41332 17529 -62841 59827 -10734 -46514 68056 -37474
1783 -37474 -21698 63977 -57336 6863 48963 -67523 34159 25026 -65076 55389 -2990
1794 -2990 -51485 66220 -30373 -29048 66131 -52066 -1814 54441 -64636 25308 33615 -66591
1806 -66591 48037 7462 -57220 62544 -19736 -38067 66515 -43727 -12555 59335 -60421
1817 -60421 15500 41369 -66387 40672 16051 -60795 58780 -12136 -43924 66140 -37828
1828 -37828 -19425 61582 -56571 7824 46757 -65344 33686 24092 -63122 53374 -2440
1839 -2440 -50164 64296 -28846 -28896 64084 -49915 -2588 52937 -62537 24103 32822 -64536
1851f4536J11348l9990o1680J15929q1626j5274J00737j09071L3952O6806j16301
1862e9706P7067K1018j03003J05630k7095p2088J15622p0198k9301J06089j00719
1873c6684J7606P9258j14904O1825L8674j09134R5459q278q5216J13051n3893
1884b236m6373J10792r0482R64Q9298j11250M7823N2114j12030Q6388N282r2582
1896f2292J08911m1954n7091J12433q1262j2507R6298j05951L4114O4110j12738
1907e7929P4007K1861j00658J01965k4827p1337J12240o6689l0034J03807r7318
1918c4912J5980P7215j11327O0314L6873j05697R3515r910q1226J10442n5308
1929d041m2013J06792q9805M094Q4827j08398M8626M8350j08017Q4359M198q9435
$$ plain form
1851 -64536 46812 6822 -54858 61071 -20555 -35829 64908 -44163 -10211 56595 -59706
1862 -59706 17361 38379 -64624 41006 13911 -58177 57445 -12753 -42054 64035 -36684
1873 -36684 -19078 60180 -54724 7101 45775 -63359 32100 23822 -61394 51657 -2236
1884 -2236 -48609 62183 -28299 -27335 61963 -49287 -1464 50650 -61380 25008 30290 -62292
1896 -62292 46619 4665 -52426 60007 -21255 -33762 62536 -43415 -9301 54809 -57929
1907 -57929 16078 37939 -62719 39246 14419 -56918 55322 -11367 -41401 62406 -34912
1918 -34912 -18932 58283 -53044 7270 44143 -61554 31961 22051 -59175 51267 -4041
1929 -4041 -46054 60738 -29067 -24973 59854 -48544 82 48432 -59585 24774 28972 -60463
1941f0463J05358l9863n6405J09446p8024j3438R4481j02668L1648O3418j09531
1952e6041P1575K1113r7381R8962k4759o8320J08862o5994k7330R9794r5819J8606
1964a6732P2513j07938O0668L3074j01384R1815j1708p7287J06760n4161m0210
1975d4590J03417q6332K635Q3051j04758M5789M8257j05070Q0689O003q7779J02011
1987D3323l8067n5113J05998p5800j2297R0666r9451L2235N9706j05922P1213
1998A6491J7769r2971R6885k6717o3912J05345o5713k4290R5606r3243J8891O9944
2010E4085j04674N8476L2873r8772Q8478j0013p6121J03596n1242m0337J00793
2021E7142q3768K411Q0608j01860M5197M5850j01516P9437L449q3856J00286m0046
$$ plain form
1941 -60463 44895 5032 -51373 58073 -19951 -33389 61092 -41576 -9928 53490 -56041
1952 -56041 15534 36647 -60734 38228 13469 -54851 54011 -11983 -39313 60481 -35338 -16732
1964 -16732 55781 -52157 8511 41585 -59799 32016 20308 -56979 49781 -4380 -44590
1975 -44590 58827 -27505 -24870 58181 -46577 -788 47469 -57601 23088 29091 -58688 43323
1987 43323 5256 -49857 56141 -19659 -31956 58710 -40741 -8506 51200 -54722 16491
1998 16491 34260 -58711 38174 11457 -52455 52890 -12823 -37113 58493 -34750 -15859 54085
2010 54085 -50589 7887 40760 -58012 30466 20453 -55668 47928 -3314 -43651 57142
2021 57142 -26626 -24215 56393 -45467 -270 45580 -55936 23501 26950 -56906 43380 3334
2033C334n0643J02307p5710q937Q6614r7533L3729N5973j02648P0073J6434r0104
2045e7111R4041k5369o3038J02837o3191k4946R3795r0166J6897O9346j02407
2056d9312N7116L1922r6324Q6949j1280p2653J00487n1630l6695R7158q3231N685
2068b1808P6030r9325M6567M1925r8271P8957J146q0261R7506l9598m8730R9413
2080E3551p3358r398Q5064r5148L1811N5881j00188O7213J7474q8727R1689k4221
2092A1643o1681J00222o2059k3554R0830q8411J8461O5617r9535N7589K8292r2248
2104e4834Q5264j3022o9361R8485n1992l4520R4525q1255N479P4289r6747M4198
2116E09M2725r6738P5960L204p9889R4918l6746m9600R7751p0978r974Q3039r2313
$$ plain form
2033 3334 -47309 54998 -20712 -29649 56965 -40568 -6839 49134 -53514 16559 32993 -57111
2045 -57111 36930 11561 -51477 51360 -11831 -36777 57018 -33148 -16251 53095 -49312
2056 -49312 7804 39726 -56598 30351 19071 -53582 46905 -4725 -41420 55738 -27493 -21808
2068 -21808 54222 -45103 1464 43389 -54882 24075 25221 -55040 42466 2868 -45862 53551
2080 53551 -19807 -29205 55859 -39289 -7478 48403 -51785 15428 32902 -55825 35864 11643
2092 11643 -50038 50184 -11875 -35429 55401 -33010 -14549 51068 -48467 9122 37414 -54834
2104 -54834 30430 17408 -51953 46532 -5460 -39980 54545 -26710 -21231 53058 -43689 509
2116 509 43234 -53504 22456 25660 -54229 40689 3943 -45657 52094 -18884 -28858 54181 -38132
2129c8132L1056N3774r7287O6209J5566q5435Q9962k5908n7559R6822o1853k0625
2141c3410Q7493q7250J9772O2689r6621N6362K7431r0090Q3091j1761o8657R5925
2153D4974m9369l5081R2525p8574L770P3862r4540M2792M1648r4001P4280K083
2165B4369p6633R2499l7947m5796R4336p0431o884P8810r0228L2287N0524r4482
2177d9576O5659J3495q2248Q7665k5431n6376R4485n9532k1476Q6098q4171J7492
2189a3916O2617r4525N3439K8919q8929Q0531j0657o7018R3161m7955l4035Q9737
2201E1369p6581M940P0504r2130M3432L8281r0606P3448K19p3556R0279l7977
2213A622m3397R1216o8662o959P7294q7737L0567N0442r2600O3162J4900q1444
$$ plain form
2129 -38132 -7076 46698 -50589 15620 31186 -54249 35713 9805 -47754 49068 -12785 -33410
2141 -33410 54083 -33167 -13395 49294 -47327 9035 36466 -53624 29467 17706 -50951 44974
2153 44974 -4395 -39476 53049 -25525 -21755 52107 -42433 359 42007 -51994 22286 24369
2165 24369 -52264 40235 2288 -43508 50828 -19603 -26487 52323 -37905 -5618 44906 -49576
2177 -49576 16083 29578 -52670 34995 9564 -46812 47673 -11859 -33335 52763 -31408 -13916
2189 -13916 48701 -45824 7615 36534 -52395 28136 17479 -49539 43622 -4333 -38368 51369
2201 51369 -25212 -20272 50232 -41898 1534 39815 -50791 22657 22876 -50680 39599 1622
2213 1622 -41775 49441 -19221 -26180 51114 -36623 -6056 44386 -48214 14948 29848 -51596
2225e1596Q5055k3060n6573R2785n7881k1333Q3961q2179J7622O0315r1888N2975
2237H203K6286q5340P9102j2419o3633R0618m8040l1281Q6605p5125N884O7677
2249D8537q9180M2003L7720q8388P0746J619p2939Q7949l5136m4645Q9964o5810
2261a7560r084P6835q5578K8743M9991r0090O1037J4766p9196Q3135k3635n3653
2273d4289Q9754n7373j8939Q0560q0117J8248N7570q9284N2443K4700q2645P6771
2285B7399j1619o2546Q8498m6209l1805Q5435p3093M269O7701q7427L9946L8401
2297C8950q7082O8981J707p1143Q5797l4642m2887Q7337o4835p046P3397q3622
2309c5088K9761M6765q7352O0846J2291p5928Q1227k4203n1286Q7221n5759j8598
$$ plain form
2225 -51596 33459 10399 -46174 46611 -11270 -32603 51358 -30821 -13199 47116 -44772 8203
2237 8203 34489 -50851 28251 15832 -47801 42817 -5223 -36504 50101 -25024 -19140 48537
2249 48537 -40643 1360 39080 -49308 21438 23057 -49882 38067 2931 -41714 48250 -17560
2261 -17560 -26644 50191 -35387 -6644 43347 -46743 14294 29060 -50136 32999 9364 -44289
2273 -44289 45465 -11908 -30847 49713 -30404 -12156 45414 -43870 8573 33273 -49372 27399
2285 27399 15780 -46766 41732 -4477 -36282 49153 -23940 -19671 48030 -39397 549 38950
2297 38950 -48132 20849 22556 -48587 37210 2568 -40319 47018 -17817 -24863 48534 -35088
2309 -35088 -5327 41438 -45914 14932 27223 -48705 32522 8319 -42967 44254 -11505 -30103
2321c0103P8761p8212J7172N7077q7099M9969K5934q1904P4446r732o2485Q6790
2333D0614m4453l1805Q3482p1105M375O5422q5225L9911L5610q3819O7773K40
2345B1020o7591Q3023l4802m0180Q4288o3526o140P0952q0806K8465M5866q5194
2357d4625N8534J3490p4932P8733k1779n2061Q5742n3354j9947P7808p5937J5819
2369a2509N6119q4910M8500K5125p9253P2745j0743n9285Q3951m4587k8806Q0024
2381D6371o9611N750O2267q2506L9193L4302q1131O5521O65o6598Q0978l2947
2393B254m0707Q3269o1475p587P0670p9317K6760M6466q4008N7271J3267p3443
2405d6580P7326k2076m9694Q3086n2858j7757P4494p4217J7206N2929q2335M8515
$$ plain form
2321 -30103 48658 -29554 -12382 44695 -42404 7565 33499 -48405 26041 16309 -46176 40614
2333 40614 -3839 -35644 47838 -23267 -18892 46530 -38695 1216 36826 -46993 20780 21020
2345 21020 -46571 36452 1650 -38530 45758 -17768 -23908 47044 -33762 -5297 40569 -44625
2357 -44625 13909 27399 -47533 31200 9421 -42640 43102 -10252 -30199 47609 -28328 -12509
2369 -12509 43610 -41300 7200 32325 -46928 25817 15074 -44211 39740 -4847 -33653 46371
2381 46371 -23240 -17490 44777 -37729 1464 35766 -45365 20156 20821 -45777 35201 2254
2393 2254 -38453 44816 -16659 -24246 46424 -32893 -6133 40333 -43675 13596 26863 -46580
2405 -46580 30746 8670 -41024 42062 -10796 -28553 45941 -28276 -11070 41859 -40476 8039
2417H039K2450p6255P1422j1700n6953Q1831m3518k8505P8576o8198N163O1807
2429D4159q0857L7571L4692q0278O3801J802o5754P9236l2032l9688Q0777n9780
2441a6351o879O8290p7341K7347M3211q0505N6135J1195o9795P4671k2179m7337
2453c9538Q0299n1547j6891P2216p1808J5917N2493q0311M6323K3647p5343O8863
2465B4320r415n7471P9872m0635l0020P7522o5308L313O0757p8207L5996L3781
2477C4505p7672O1763J312o3142P6510l1250l7675P7591n7983o103O5470p4553
2489c1227K6334M2129p8056N3627J2263o8901P2548k0276m7482P8694m9154j8425
2501b7926P1810o9837J4142N2566p8900M4590K3584p3438O7010r434n5176P7456
$$ plain form
2417 8039 30489 -45766 25656 13956 -42997 38834 -4684 -33189 45387 -22811 -17648 44159
2429 44159 -36698 873 35565 -44713 19088 20890 -44864 34372 2340 -37348 43429 -16351
2441 -16351 -23230 45060 -32281 -4934 38277 -42228 13907 25102 -44693 29978 7799 -39538
2453 -39538 40761 -10786 -27677 44539 -27269 -11352 41141 -39170 7153 30800 -44543 24320
2465 24320 14905 -42566 37306 -3329 -33349 44173 -21135 -17822 42935 -35272 724 34505
2477 34505 -43167 18596 19908 -43234 33276 2026 -35649 41942 -16041 -22144 43326 -31227
2489 -31227 -4893 37236 -40820 12807 25070 -43831 28717 8441 -39041 39653 -9501 -27926
2501 -27926 43884 -25953 -11811 40755 -38145 6445 30029 -43409 23601 14167 -41009 36447
2513C6447m0783k6916P3893o3961N187N7358p5946L6303L1150p4685O0678j15
2525A8610o0451P4619l0997l6761P6067n6607o399O4780p3417K5407M1991p7263
2537d0421N2970J2268o7842P1129j9863m6433P7026m8471j6897O9015o8248J5315
2549a0452M9020p5749M4317K1061p0188O5562j0590n2391P4822l9740k6016P1603
2561D1259o1977M591N6816p4382L4611L1763p3671N8611J890o1073P3210k9096
2573B552l7454P5078n4968o868O3141p0908K4346M0789p4593N1175J1113o4596
2585d1193O8465j9833m3679P3397m6846j5828O6348o5810J4687M7889p3523M2481
2597F555K1514o9094O3533r109n2226P3289l7738k7177P1217o0253L034N6330
$$ plain form
2513 36447 -4336 -31252 42641 -21320 -16133 41225 -34721 1582 32732 -41953 18725 18610
2525 18610 -41841 32778 1781 -34980 41087 -15520 -21919 42861 -30556 -5149 36842 -40421
2537 -40421 12549 24817 -43025 28104 8241 -38192 38834 -9637 -26534 42481 -25767 -10452
2549 -10452 38568 -37181 7136 28197 -41991 23571 12981 -39410 35412 -4328 -30344 41259
2561 41259 -20718 -16127 40689 -33693 918 32681 -40990 17621 19511 -41562 31648 2552
2573 2552 -34902 40176 -14792 -21660 41481 -29427 -5081 35708 -38885 12290 23403 -41193
2585 -41193 27272 7439 -36240 37157 -9689 -25517 40831 -24979 -10292 37597 -35926 6555
2597 6555 28069 -41025 22508 13399 -38827 34462 -3276 -30453 40764 -19489 -16455 39875
2609C9875p2549L3264L1400p1765N6897J284n8254P0579k8963l4675P1658n3698
2621a4947n254N9943o8475K4305L8457p1558M9604J0525o2551O6291j8850m3184
2633c5694P2214m5595j6398O5778o4264J3187M8040p2336M0960K1967o7900O1590
2645B1549q340n1029P1099l6527k5802O7943n8112M055N3225o9398L2220K9360
2657C0243o8408N5014N85n5617O7814k7804l3678O9231n1456o117N9052o6511
2669b7652K2785L8741p0363M7581J1790o2176O4924j7627m3263P0650m3711j6533
2681b4854O3741o2102J2996M5751o9390M0176J9677o4215N9161q910m8031O8150
2693C2150l5883k3813O5235n6694M338N1508o7391L1263K9153o7330N3685J329
$$ plain form
2609 39875 -32674 590 31990 -39775 17122 18406 -39848 30731 1768 -32907 38751 -14947
2621 -14947 -20201 39742 -28733 -4428 34029 -37529 12075 22600 -39951 26340 7490 -35694
2633 -35694 36520 -9075 -25473 40305 -23959 -10772 37268 -35068 5892 27859 -40041 21549
2645 21549 13209 -37820 33279 -3248 -29050 38893 -19219 -15164 38061 -31337 883 30243
2657 30243 -38165 16849 17434 -38183 29631 1827 -31851 37380 -14076 -20193 38859 -27652
2669 -27652 -4867 33874 -36489 11092 22882 -39294 25630 8003 -35260 35390 -8321 -24854
2681 -24854 38887 -23215 -10219 35532 -33858 6318 25995 -38220 20941 12031 -36000 32150
2693 32150 -3733 -27546 37689 -19005 -14667 36841 -30550 713 29866 -37464 16221 17550
2705A7550n5255O6687k6592l4067O8672n0469o728N8335o4970K2116L7546o8374
2717c5549M6697J0626n9602O2781j8009m0394O7448m2815j4520O0894o0574J3810
2729i207M3518o7201L8957J9291o2707N8166q535m7857O7145l4521k4535O4745
2741C7259n5236K723N2007o6631L0145K9487o6326N2227J717n4191O4836k5774
2753B243l2764O5909m8704n669N5559o2628K1813L5380o5449M5196R915n7324
2765c6523O0658j7337l9601O6056m1602j4956O0047n8832J2176M3950o6290L7486
2777E232K0341o2377N6703p582m7376O5629l3466k4220O3176n3455K869M9680
2789C5154o4068K9535K7283o2938N0425Q52n1301O2203k5597l0544O3251m7221
$$ plain form
2705 17550 -37705 28982 2390 -31677 36995 -13474 -20202 38133 -26837 -4721 32825 -35549
2717 -35549 11148 21774 -37828 24953 6944 -33450 33998 -8817 -23337 37557 -23017 -9207
2729 -9207 34311 -32890 6067 25358 -37349 20817 12282 -35575 31570 -2951 -27486 37259
2741 37259 -17977 -15254 36753 -29878 267 29754 -36572 15655 17372 -36819 28017 2243
2753 2243 -30521 35388 -13316 -18985 36574 -26054 -4241 31139 -34310 10886 20801 -36523
2765 -36523 24135 6798 -32803 33253 -8349 -23305 36742 -22090 -9914 34036 -32254 5232
2777 5232 25573 -36804 19899 12317 -35059 30570 -2896 -27116 36060 -17395 -14526 35154
2789 35154 -28914 621 27904 -35034 15391 16243 -35058 27145 1548 -28996 34255 -12966
2801a2966n202N3719o0824K0811L5293o4484M4019J0635n6976N9530j6470l9609
2813c2524O5177m0485j4995N8856n7522J2002M2476o4088L6519J8858n9609N4649
2825A9314p926m4516O2787l2928k2185O0083n1910L872M7123o1671K8672K6404
2837B7119o1195M8848J374n0776O0956k4252l0981O2643m5849o596N3622n9418
2849b4505J9696L5378o3333M2474J0757n5477N7813j5908l8026O2441l8899j4127
2861b1716N6052n5040J1990M0200o1357L5286J7811n7156N2283p086m3607O0944
2873B8604l1225k2676N9279n0427K604M7372o0649K7106K7402o0913M7682J842
2885A6001m9931N9685k3506l0447O0724m4430n708N1245n7551J9812L2788o0062
$$ plain form
2801 -12966 -18168 35551 -25273 -4462 30831 -33653 10366 21001 -35975 23555 7085 -32524
2813 -32524 32653 -7832 -22827 36029 -21493 -9491 32985 -31103 5416 24274 -35335 19314
2825 19314 11388 -33128 29659 -3269 -25454 34629 -17281 -13409 33714 -27957 715 27119
2837 27119 -34076 14772 16146 -34630 26326 2074 -28907 33736 -12113 -18709 34913 -24505
2849 -24505 -4809 30569 -32764 9710 20467 -35010 22803 6895 -31131 31310 -7589 -21716
2861 -21716 34336 -20704 -8714 31486 -29871 5415 23226 -33930 18353 11267 -32340 28604
2873 28604 -2621 -25297 33982 -16445 -13841 33531 -27118 -12 27390 -33523 14159 16001
2885 16001 -33930 25755 2249 -28198 32526 -11904 -17612 33633 -23918 -4106 28682 -31380
2897c1380M1384R064n2474N5652j6176l5775O0052l8116j3124N4420n3881J1597
2909h757L9700o0400L4710J7993n6932N1913o783m3595O0234l0587k2307N8258
2921C3447m9637K771M5990n9325K7153K5544n8265M6484Q42m7311N7184k3168
2933A709k8434N8105m3282m745M9132n5735J9320L2048n8854M0350R398n2126
2945c3114N4619j4901l6228N9583l6823j4408N4397n2740J0464L9830n9271L3162
2957D570J8161n5420N0123o494m1740N7872k9817k0768N5368m7407K992M3465
2969C0905n6521K6265K4081n5815M4594J064m6186N5842k2388k8407N7436m2188
2981a1318n747M9253n4822J8180L2619n8391L9229R853n0977N2700j4076l5246
$$ plain form
2897 -31380 10004 19068 -33406 22246 6070 -29705 30347 -7769 -20893 33527 -20354 -8757
2909 -8757 30943 -29457 5253 23246 -33686 18227 11444 -32151 28083 -2504 -24811 33447
2921 33447 -16190 -13419 32571 -26754 399 25943 -32322 14162 15004 -32307 24877 1709
2933 1709 -26725 31380 -11902 -16647 32485 -23250 -3930 28118 -30736 9614 19012 -33114
2945 -33114 21505 6604 -29624 29959 -6864 -21272 33125 -19615 -9151 30679 -28592 4570
2957 4570 22731 -32689 17434 10940 -30800 27072 -2745 -23513 31855 -15552 -12560 30905
2969 30905 -25616 649 24730 -31085 13509 14573 -31613 24229 1841 -26566 30870 -11318
2981 -11318 -17065 32188 -22634 -4454 28165 -30226 9003 18856 -32121 20579 6503 -28743
2993b8743N7513l5604j3503N1956n0593J0728L7024n6031L2110J6404n2318M8029
3005A6972o562l9859N5622k8821k0351N3971m5916K480M2923n5465K5144K4688
3017B4826n5409M3405K042m5891N4494k1057k8485N6066m0701n723M7444n2831
3029b1820J7757L0652n5282L7651Q693m8290N0499j3964l2990N4508l4239j2275
3041a9100M9557m8597J0106L6254n4827L1179J6678n1728M6983o183l9682N5113
3053B5753k8080k0611N3383m5119K443M1903n4035K4418K3869n3338M2044J209
3065A3839m3358N2232k1133k6259N3225l9314m642M4957n0716J7433K9178n3065
3077b7623L6225Q566m7064M9517j3756l2471N3742l3771j2593M9285m7858R659
$$ plain form
2993 -28743 28770 -6834 -20337 31619 -18974 -8246 28778 -27253 4857 21261 -31057 16972
3005 16972 10410 -29449 26173 -2648 -22999 30972 -14944 -12464 30459 -25006 138 24826
3017 24826 -30583 12822 14864 -31027 23467 2410 -26075 29991 -10710 -16433 31011 -21820
3029 -21820 -4063 26589 -28693 8958 17651 -30639 19860 5896 -27094 27414 -6825 -19100
3041 -19100 30457 -18140 -8034 28220 -26607 4572 21250 -30478 16505 10322 -29360 25753
3053 25753 -2327 -22938 30445 -14674 -12231 29672 -24363 55 23924 -29414 12630 13839
3065 13839 -29519 22713 1580 -24679 28546 -10768 -15410 29547 -21169 -3736 25442 -27623
3077 -27623 8602 17168 -29896 19621 5865 -26606 27136 -6635 -19228 30057 -17801 -8142
3089h142L6056n4197L0513J6679n0726M6042o134l8224N2979k7304j9064N0553
3101B9031m3344L101L9466n1451K3763K1824n0745M0715P15m1611N0459k0406
3113A517k5391N1799l8340m620M4267m9881J6817K9056n2687L5785Q815m6539
3125b9402M8657j3472l2057N2591l2600j2381M7627m6380R906L3951n1361K9335
3137D414J4967m7668M3875o358l6016N0463k6345j8058M8671m1723K739L8543
3149B7504n0040K2859K1865m9951L9745J298m1521M9681j9812k5486N1173l7378
3161a0063m954M3433m8364J6076K8208n0601L4290Q213m4227M6105j2708l0342
3173b4934N0071l1215j1450M5180m4150R369L2554m9554K8330J4729m6610M2614
$$ plain form
3089 -8142 27914 -26283 4230 20909 -29817 16225 10091 -28133 24846 -2458 -21522 29031
3101 29031 -14313 -11212 28254 -23197 566 22390 -28355 12360 13075 -28536 21923 1517
3113 1517 -23874 27925 -10415 -15035 29232 -20649 -3832 25224 -27463 8322 17137 -29402
3125 -29402 19255 5783 -26274 26317 -6283 -18664 28963 -17417 -7511 26440 -24921 4414
3137 4414 19381 -28287 15588 9230 -26786 23677 -2668 -20726 27945 -13778 -11039 27504
3149 27504 -22536 323 22188 -27763 11982 13280 -28241 21440 1628 -23858 27315 -10063
3161 -10063 -15017 28416 -19948 -3872 24336 -26265 8025 16238 -27989 18116 5408 -24934
3173 -24934 25137 -6078 -17528 27652 -16498 -7129 25425 -24129 4201 18930 -27680 14934
3185A4934n966l5325M9616k5438j8392M8193m0837J959L8524m9343K2269K1677
3197B1871m8947L8379J756m0518M8166j9080k4130M8704l5778m619M1062m5984
3209a9118J5716K6594m8193L2775P737m2487M4537j2081k9611M8667l0468j1572
3221a7504M4714m3386Q742L2899m9281K7675J5047m6309M2012n397l5008M8504
3233B2708k4726j7991M6701l9471K096L6419m6891K1496K0309m6524L6944P92
3245A1862l7780M5712j8536k2854M6702l4624m212L9919m4876J5320K6234m7684
3257b4817L2449P981m2582M4551j2326k9281M8348l0246j1098M3846m2768Q867
3269g076L1421m7625K7560J3487m3759M0290n842l2907M6359k4481j6179M4267
$$ plain form
3185 14934 8968 -26357 23259 -2179 -20571 27622 -13215 -11256 27268 -22075 194 21871
3197 21871 -27076 11303 13059 -27459 20707 1627 -22503 26201 -9577 -14196 26866 -19118
3209 -19118 -3402 23192 -25001 7774 15511 -26976 17561 5480 -24131 24536 -5932 -17504
3221 -17504 27210 -16176 -7434 25465 -23816 3859 18906 -27403 14609 9212 -25796 22708
3233 22708 -2018 -20009 26692 -12779 -10683 25736 -21155 341 20650 -25874 11070 11862
3245 11862 -25918 19794 1258 -21596 25106 -9518 -13730 26189 -18687 -3367 22867 -24817
3257 -24817 7632 15613 -26969 17582 5256 -24025 24323 -5923 -17021 26825 -15943 -7076
3269 -7076 24345 -23280 4280 17767 -25992 14298 8456 -24451 21908 -2573 -18752 25515
3281B5515l8102K534L5029m5772K1404J9530m5378L6436N12l7525M5704j8319
3293A568k3186M6899l4641m240L9866m4830J5269K5794m6836L1956P387m0961
3305b5955M2895j1863k7919M6124k9017j0251M1488m0847Q829K9668m5227K6104
3317D029J3252m2311L8746n351l2376M5087k3257j6603M3792l7367K182L5207
3329B5030m5357K0512J9848m4895L5509J163l6939M4289j7686k2305M4888l2835
3341h778m103L7690m2112J4103K4671m4499L0009P278l8932M0590j1096k6806
3353b1985M4205k7614j0343M0522l9476Q100K9643m4877K5476J3728m2333L8429
3365A3475m926l2489M4703k2584j6850M3239l6327J576L4243m3627J9764J8890
$$ plain form
3281 25515 -12587 -10053 24976 -20796 608 20138 -25240 11196 11708 -25817 19887 1568
3293 1568 -21618 25281 -9360 -13600 26266 -18564 -3295 22499 -24337 7619 15006 -25955
3305 -25955 16940 5077 -22842 23282 -5735 -15986 25502 -15345 -6516 23152 -22075 4029
3317 4029 17281 -25030 13716 8365 -24011 21076 -2181 -18784 25008 -12359 -10177 25030
3329 25030 -20327 185 20033 -24862 10647 11810 -25129 19160 1474 -20831 24057 -8778
3341 -8778 -12881 24809 -17303 -3200 21471 -23028 6981 14259 -24673 15917 4821 -21985
3353 -21985 22220 -5394 -15737 24785 -14691 -6591 23052 -21825 3651 17379 -24954 13475
3365 13475 8549 -23940 20763 -1821 -18671 24568 -11759 -10183 24060 -19567 197 19087
3377A9087m2863L3839J155l5165M2031j6479k1469M2857l1402m033L6162m0521
3389a6801J3719K3914m3274K9377P237l8523M0111j0661k6846M3924k7626j0006
3401a5455L9980l9237Q094K9178m3880K5060J2849m0630L7183n333l0327M2364
3413A9846k1939j5349M0824l4828K195L2008m1674J9259J8077m1375L2905R52
3425A0901l4245M1257j6638k0833M2432l1332m109L6373m0677J3891K3647m2998
3437b2331K9350O870l7834L9530j1036k5713M2648k6636r656L8076l7275P900
3449f107K7463m1872K4215J2217l8965L5567m891k9574M1480k1557j4926L9931
$$ plain form
3377 19087 -23776 10063 11218 -23947 18084 1605 -19864 22993 -8409 -12442 23720 -16801
3389 -16801 -3082 20832 -22442 6935 14172 -24351 15760 5099 -21747 22177 -5449 -15455
3401 -15455 24525 -14712 -6618 22560 -21320 3740 16589 -24041 13142 7809 -22518 19846
3413 19846 -2093 -17442 23382 -11446 -9251 22757 -18917 342 18419 -22956 9949 10901
3425 10901 -23344 17913 1275 -19558 22874 -8458 -12567 23806 -16871 -2980 20667 -22331
3437 -22331 7019 13889 -23945 15585 4549 -21164 21484 -5152 -14808 23268 -14007 -6107
3449 -6107 21356 -20516 3699 15916 -23049 12518 7627 -21947 19533 -2024 -16950 22981
$$ [...]
##END NTUPLES=NMR FID
##END=
