##TITLE=1H_SR111_k2
 CDCl3
 8 sc, 
 16.03.2022
##JCAMPDX= 6.0         $$ Bruker NMR JCAMP-DX V2.0
##DATA TYPE= NMR FID
##DATA CLASS= NTUPLES
##ORIGIN= UXNMR, Bruker Analytische Messtechnik GmbH
##OWNER= root
$$ XWIN-NMR		Version 3.5
$$ Wed Mar 16 13:25:05 2022 Russian Standard Time (UT+4h)  she@DPX200
##.OBSERVE FREQUENCY= 200.131346
##.OBSERVE NUCLEUS= ^1H
##.DELAY= (6, 6)
##.ACQUISITION MODE= SIMULTANEOUS
##.ACQUISITION SCHEME= undefined
##.AVERAGES= 8
##.DIGITISER RES= 18
##SPECTROMETER/DATA SYSTEM= spect
##.PULSE SEQUENCE= zg30
##.SOLVENT NAME= D2O
##.SHIFT REFERENCE= (INTERNAL, D2O, 0, 15.7039)
##AUDIT TRAIL= $$ (NUMBER, WHEN, WHO, WHERE, WHAT)
$$ ##TITLE= Audit trail, XWIN-NMR		Version 3.5
$$ ##JCAMPDX= 5.01
$$ ##ORIGIN= Bruker BioSpin GmbH
$$ ##OWNER= she
$$ F:/spectra/data/she/nmr/H-F/1/audita.txt
$$ ##AUDIT TRAIL=  $$ (NUMBER, WHEN, WHO, WHERE, WHAT)
(   1,<2022-03-16 13:24:06.90 +0400>,<she>,<DPX200>,
      <created by zg, POWCHK disabled, PULCHK disabled
       configuration hash MD5:
       00 E9 B6 7A A2 85 ED C7 34 08 36 98 17 FE 4E 26
       data hash MD5: 16K
       5E 10 85 BF F2 37 57 30 3D 85 C7 12 E9 75 23 1C>)
$$ ##END=
$$ 
$$ hash MD5
$$ 0F 13 AF 49 29 68 96 90 B8 E2 8D 93 18 4F F5 3C
##$RELAX= 
##$RELAX= 
##$RELAX= 
##$RELAX= 
##$RELAX= 
##$RELAX= 
$$ Bruker specific parameters
$$ --------------------------
##$DU= <F:/spectra>
##$EXPNO= 1
##$NAME= <H-F>
##$PROCNO= 1
##$TYPE= <nmr>
##$USER= <she>
##$AMP= (0..31)
100 100 100 100 100 100 100 100 100 100 100 100 100 100 100 100 100 100 
100 100 100 100 100 100 100 100 100 100 100 100 100 100 
##$AQSEQ= 0
##$AQ_mod= 1
##$AUNM= <au_zg>
##$AUTOPOS= <>
##$BF1= 200.13
##$BF2= 200.13
##$BF3= 200.13
##$BF4= 200.13
##$BF5= 200.13
##$BF6= 200.13
##$BF7= 200.13
##$BF8= 200.13
##$BYTORDA= 1
##$CFDGTYP= 0
##$CFRGTYP= 5
##$CHEMSTR= <none>
##$CNST= (0..31)
1 1 145 1 1 1 1 1 1 1 1 1 1 1 1 1 1 1 1 1 1 1 1 1 1 1 1 1 1 1 1 1 
##$CPDPRG= <>
##$CPDPRG1= <>
##$CPDPRG2= <>
##$CPDPRG3= <>
##$CPDPRG4= <mlev>
##$CPDPRG5= <mlev>
##$CPDPRG6= <mlev>
##$CPDPRG7= <mlev>
##$CPDPRG8= <mlev>
##$CPDPRGB= <>
##$CPDPRGT= <>
##$D= (0..31)
0 1.2 0 0 0 0 0 0 0 0.06 0 0.03 0 0 0 0 0.0002 0 0 0 0 0 0 0 0 0 0 0 0 
0 0 0 
##$DATE= 1647422646
##$DBL= (0..7)
120 120 120 120 120 120 120 120 
##$DBP= (0..7)
150 150 150 150 150 150 150 150 
##$DBP07= 0
##$DBPNAM0= <>
##$DBPNAM1= <>
##$DBPNAM2= <>
##$DBPNAM3= <>
##$DBPNAM4= <>
##$DBPNAM5= <>
##$DBPNAM6= <>
##$DBPNAM7= <>
##$DBPOAL= (0..7)
0.5 0.5 0.5 0.5 0.5 0.5 0.5 0.5 
##$DBPOFFS= (0..7)
0 0 0 0 0 0 0 0 
##$DE= 6
##$DECBNUC= <off>
##$DECIM= 32
##$DECNUC= <off>
##$DECSTAT= 4
##$DIGMOD= 1
##$DIGTYP= 9
##$DL= (0..7)
0 120 120 120 120 120 120 120 
##$DP= (0..7)
150 150 150 150 150 150 150 150 
##$DP07= 0
##$DPNAME0= <>
##$DPNAME1= <>
##$DPNAME2= <>
##$DPNAME3= <>
##$DPNAME4= <>
##$DPNAME5= <>
##$DPNAME6= <>
##$DPNAME7= <>
##$DPOAL= (0..7)
0.5 0.5 0.5 0.5 0.5 0.5 0.5 0.5 
##$DPOFFS= (0..7)
0 0 0 0 0 0 0 0 
##$DQDMODE= 0
##$DR= 18
##$DS= 0
##$DSLIST= <SSSSSSSSSSSSSSS>
$$ [...]
##$SUBNAM2= <"">
##$SUBNAM3= <"">
##$SUBNAM4= <"">
##$SUBNAM5= <"">
##$SUBNAM6= <"">
##$SUBNAM7= <"">
##$SUBNAM8= <"">
##$SUBNAM9= <"">
##$SW= 18.0517287032376
##$SWIBOX= (0..15)
0 0 2 0 0 0 0 0 0 0 0 0 0 0 0 0 
##$SW_h= 3612.71676300578
##$TD= 16384
##$TD0= 1
##$TE= 0
##$TE2= 300
##$TE3= 300
##$TEG= 300
##$TL= (0..7)
0 120 120 120 120 120 120 120 
##$TP= (0..7)
150 150 150 150 150 150 150 150 
##$TP07= 0
##$TPNAME0= <>
##$TPNAME1= <>
##$TPNAME2= <>
##$TPNAME3= <>
##$TPNAME4= <>
##$TPNAME5= <>
##$TPNAME6= <>
##$TPNAME7= <>
##$TPOAL= (0..7)
0.5 0.5 0.5 0.5 0.5 0.5 0.5 0.5 
##$TPOFFS= (0..7)
0 0 0 0 0 0 0 0 
##$TUNHIN= 0
##$TUNHOUT= 0
##$TUNXOUT= 0
##$USERA1= <user>
##$USERA2= <user>
##$USERA3= <user>
##$USERA4= <user>
##$USERA5= <user>
##$V9= 5
##$VALIST= <valist>
##$VCLIST= <CCCCCCCCCCCCCCC>
##$VD= 0
##$VDLIST= <DDDDDDDDDDDDDDD>
##$VPLIST= <PPPPPPPPPPPPPPP>
##$VTLIST= <TTTTTTTTTTTTTTT>
##$WBST= 1024
##$WBSW= 4
##$XGAIN= (0..3)
0 0 0 0 
##$XL= 0
##$YL= 0
##$YMAX_a= 125221
##$YMIN_a= -120800
##$ZGOPTNS= <>
##$ZL1= 120
##$ZL2= 120
##$ZL3= 120
##$ZL4= 120
##$ABSF1= 10
##$ABSF2= 0
##$ABSG= 5
##$ABSL= 3
##$ALPHA= 0
##$AQORDER= 0
##$ASSFAC= 0
##$ASSFACI= 0
##$ASSFACX= 0
##$ASSWID= 0
##$AUNMP= <proc_1d>
##$AZFE= 0.1
##$AZFW= 0.1
##$BCFW= 1
##$BC_mod= 2
##$BYTORDP= 1
##$COROFFS= 0
##$CY= 11.3945322036743
##$DATMOD= 1
##$DC= 2
##$DFILT= <>
##$DTYPP= 0
##$F1P= 2.36226072786647
##$F2P= -0.459571619588291
##$FCOR= 0.5
##$FTSIZE= 0
##$FT_mod= 4
##$GAMMA= 1
##$GB= 0.15
##$INTBC= 1
##$INTSCL= 1
##$ISEN= 128
##$LB= 0.24
##$LEV0= 0
##$LPBIN= 0
##$MAXI= 10000
##$MC2= 0
##$MEAN= 0
##$ME_mod= 0
##$MI= 1.114404
##$NCOEF= 0
##$NC_proc= 0
##$NLEV= 6
##$NOISF1= 3.799351
##$NOISF2= 2.8
##$NSP= 1
##$NTH_PI= 0
##$NZP= 0
##$OFFSET= 15.70392
##$PC= 1
##$PHC0= -16949.68
##$PHC1= 11.80078
##$PH_mod= 1
##$PKNL= yes
##$PPARMOD= 0
##$PSCAL= 0
##$PSIGN= 0
##$REVERSE= no
##$SF= 200.130013532006
##$SI= 16384
##$SIGF1= 3
##$SIGF2= 2
##$SINO= 400
##$SIOLD= 16384
##$SREGLST= <1H.CDCl3>
##$SSB= 0
##$STSI= 0
##$STSR= 0
##$SW_p= 3612.71676300578
##$SYMM= 0
##$S_DEV= 0
##$TDeff= 0
##$TDoff= 0
##$TI= <>
##$TILT= no
##$TM1= 0
##$TM2= 0
##$TOPLEV= 0
##$USERP1= <user>
##$USERP2= <user>
##$USERP3= <user>
##$USERP4= <user>
##$USERP5= <user>
##$WDW= 1
##$XDIM= 8192
##$YMAX_p= 0
##$YMIN_p= 0
$$ End of Bruker specific parameters
$$ ---------------------------------
##NTUPLES= NMR FID
##VAR_NAME=  TIME,          FID/REAL,        FID/IMAG
##SYMBOL=    X,             R,               I
##VAR_TYPE=  INDEPENDENT,   DEPENDENT,       DEPENDENT
##VAR_FORM=  AFFN,          ASDF,            ASDF
##VAR_DIM=   8192,          8192,            8192
##UNITS=     SECONDS,       ARBITRARY UNITS, ARBITRARY UNITS
##FACTOR=    0.0002768,     1,               1
##FIRST=     0,             0,               0
##LAST=      2.2672688,     0,               0
##MIN=       0,             -120800,         0
##MAX=       2.2672688,     125221,          0
$$ Real data points
##PAGE= N=1
##DATA TABLE= (X++(R..R)), XYDATA
$$ plain form
0 0 0 0 0 0 0 0 0 0 0 0 0 0 0 0 -8 8 -8 8 -8 16 -16 20 -24 28 -32 40 -44 51 -59 68 -79 88 -100 113 -128 144
36 144 -163 181 -204 228 -252 281 -312 344 -381 422 -466 512 -564 622 -684 755 -832 919 -1015
55 -1015 1123 -1249 1390 -1556 1751 -1989 2279 -2641 3120 -3778 4741 -6293 9219 -16718 81825
70 81825 125221 -24833 -69898 -46479 41139 85230 62651 -29031 -88014 -65451 31821 88429
82 88429 41088 -72579 -120800 -63153 31233 61234 17226 -57546 -83815 -26143 70350 103698
94 103698 41902 -46861 -63738 4894 84027 85289 9491 -60986 -53874 13212 71143 63640 -6555
107 -6555 -75011 -73351 -9949 44438 33760 -32343 -86829 -63562 21430 77205 45948 -28714
119 -28714 -63869 -26352 44342 76794 38104 -28423 -53054 -11423 55167 77657 27084 -46826
$$ packed form
0@%%%%%%%%%%%%%%qJ6j6J6j6K4l2L6m4N2o0P2q4R5j10J27j47J67j88K13k41K72
36A44l07L44l85M32m80N33n93O56p25Q03q88R78j076J186j306J439j587J751j934
55a015K138k372K639k946L307l740M268m920N761o898Q519j1034J5512k5937R8543
70H1825M3396j50054m5065K3419Q7618M4091k2579r1682n8983K2563R7272N6608
82H8429m7341j13667m8221N7647R4386L0001m4008p4772k6269N7672R6493L3348
94A03698o1796q8763j6877O8632P9133J262p5798p0477P112O7086N7931p503p0195
107f555o8456J660O3402N4387j0678o6103n4486K3267Q4992N5775l1257p4662
119b8714l5155L7517P0694L2452l8690o6527k4631M1631O6590K2490n0573p3910
$$ plain form
131 -46826 -63209 -10021 44766 41386 -11930 -62847 -63463 -12973 42460 47409 -4348 -57831 -51919
144 -51919 12139 65287 47883 -17494 -53406 -24195 34120 64540 41766 -13877 -48914 -27216
156 -27216 28556 56855 22294 -41750 -67274 -27554 30740 43762 3978 -42550 -52346 -15690
168 -15690 35221 51717 13185 -40312 -48222 1089 54919 55290 3579 -41427 -32501 15348 49879
181 49879 37644 -9341 -47940 -41280 5156 41597 26052 -25360 -57310 -35357 16841 44622
193 44622 21233 -24959 -44036 -17604 27411 48377 24288 -21299 -39265 -8250 39390 52502
205 52502 16798 -30689 -40204 -3952 33677 31494 -6910 -42605 -41724 -6410 29342 29244 -7121
218 -7121 -41135 -35390 5650 39620 29732 -12194 -37608 -19447 21382 44459 29611 -6655 -29288
$$ packed form
131d6826j6383N3188N4787l380n3316n0917o16N0490N5433M949n1757n3483N912
144e1919O4058N3148j7404o5377l5912K9211N8315L0420k2774n5643l5037K1698
156b7216N5772K8299l4561o4044k5524L9720N8294J3022l9784m6528r796L6656
168a5690N0911J6496l8532n3497p910M9311N3830L71n1711m5006Q926M7849L4531
181D9879j2235m6985l8599O660M6436L6441j5545n1412l1950K1953N2198K7781
193D4622k3389m6192j9077K6432M5015K0966k4089m5587j7966L1015M7640J3112
205E2502l5704m7487r515L6252L7629k183l8404l5695Q81L5314L5752r8l6365
218g121l4014N745M1040L3970r888m1926k5414J8161M0829K3077j4848l6266k2633
$$ plain form
231 -29288 -15018 22668 41870 18002 -27214 -45114 -17605 23145 31843 1928 -31674 -35829
243 -35829 -9581 21310 27725 1471 -32581 -36822 -2618 35482 37074 2856 -27562 -19390 15160
256 15160 38621 27807 -5137 -30958 -25462 6636 32911 22870 -14702 -38086 -21093 15924
268 15924 31793 9347 -25671 -37060 -16990 13986 28550 13619 -16482 -28321 -5802 29508
280 29508 37469 9253 -24945 -29092 -829 27289 26681 -165 -24791 -24255 1442 26834 24453
293 24453 -6265 -33480 -28339 2875 26625 17575 -12327 -28874 -14550 15556 31223 18565
305 18565 -9861 -26565 -14984 13803 29260 13152 -17583 -29238 -7944 22106 28632 4807
317 4807 -23214 -27030 -6376 16463 20522 1062 -22689 -24724 218 27344 27179 -279 -23896
$$ packed form
231b9288J4270L7686J9202k3868m5216j7900K7509M0750Q698k9915l3602m155
243c5829K6248L0891O415k6254l4052m241L4204L8100J592l4218l0418Q172L4550
256A5160K3461j0814l2944k5821N496L2098K6275j0041l7572k3384J6993L7017
268A5924J5869k2446l5018j1389K0070L0976J4564j4931l0101j1839K2519L5310
280B9508P961k8216l4198m147K8263K8118o08k6846k4626N36K5697K5392k381
293B4453l0718k7215N141L1214K3750r050k9902j6547J4324L0106J5667j2658
305A8565k8426j6704J1581K8787J5457j6108l0735j1655K1294L0050O526k3825
317D807k8021l816K0654K2839M059j9460k3751k035K4942K7126j65k7458k3617
$$ plain form
330 -23896 -18374 7805 25357 16734 -7265 -22993 -16812 6837 25818 17923 -10341 -28719 -16989
343 -16989 10910 23150 6479 -19000 -26039 -8654 14819 23834 10571 -11977 -21315 -4765 20499
356 20499 26258 5170 -19677 -20681 1248 22139 20119 -661 -18960 -18487 -118 17385 15596
369 15596 -6377 -26504 -22117 3374 21319 13294 -9526 -21649 -10135 11941 22312 12565 -7688
382 -7688 -18838 -9221 13197 24996 11924 -11937 -20053 -3912 17383 20081 1359 -18347 -21037
395 -21037 -5639 11665 14544 -586 -18791 -20597 -746 19641 18264 -2753 -19805 -14290 6525
408 6525 19788 14167 -3906 -15289 -9561 8831 21770 14901 -6865 -20629 -11426 9618 17936
421 17936 4777 -14861 -20294 -6830 11340 16683 5007 -12452 -18507 -6346 12885 18207 2512
$$ packed form
330b3896N522K6179J7552q623k3999j5728O181K3649J8981p895k8264j8378J1730
343a6989K7899J2240j6671k5479p039J7385K3473R015j3263k2548r338J6550K5264
356B0499N759k1088k4847j004K1929K0891k020k0780j8299M73J8369J7503j789
369A5596k1973k0127M387K5491J7945q025k2820j2123J1514K2076J0371r747k0253
382g688j1150R617K2418J1799j3072k3861q116J6141K1295K698j8722j9706k690
395b1037J5398J7304K879j5130j8205j806J9851K0387j377k1017j7052N515K0815
408F525J3263n621j8073j1383N728J8392J2939o869k1766j3764R203K1044Q318
421A7936j3159j9638n433J3464J8170N343j1676j7459o055J2161J9231N322j5695
$$ plain form
434 2512 -16249 -16723 2221 19049 17318 234 -13654 -11780 2035 14259 12369 -3455 -18311
447 -18311 -15013 4489 18789 11951 -7182 -17123 -8634 7666 14797 6353 -8734 -16475 -8428 8836
461 8836 18698 9275 -9569 -16751 -3095 13305 14474 -282 -14428 -14966 -2846 10992 13873 2717
475 2717 -11770 -13452 719 15409 13405 -4049 -16386 -10968 4766 15134 10911 -1997 -11497
488 -11497 -7836 5826 15168 8518 -8446 -18579 -9969 7201 13940 4013 -10095 -13513 -3586 9497
502 9497 12719 3144 -10625 -14403 -3789 11576 15138 3307 -10142 -10270 4005 15861 12836 -1391
516 -1391 -12525 -11189 821 10773 8725 -3667 -14171 -11208 3476 13998 7821 -8043 -16246
529 -16246 -8270 5935 11386 4835 -5898 -10481 -3535 9474 16142 8361 -6913 -13012 -3086 11266
$$ packed form
434B512j8761m74J8944J6828j731j7084j3888J874J3815J2224j890j5824j4856
447a8311L298J9502J4300o838j9133r941Q489J6300P131q444j5087p741Q047J7264
461H836R862r423j8844p182J3656J6400J169j4756j4146n38J2120J3838K881j1156
475B717j4487j682J4171J4690k004j7454j2337N418J5734J0368m223j2908r500
488a1497L661J3662R342o650j6964j0133Q610J7170O739r927j4108l418R927J3083
502I497L222r575j3769l778J0614J5365L562j1831j3449j28J4275J1856l025j4227
516a391j1134J336J2010R952k048j2392j0504K963J4684J0522o177j5864q203
529a6246P976J4205N451o551j0733m583O946J3009O668p781j5274o099R926J4352
$$ plain form
543 11266 12655 362 -10594 -10147 -126 9215 9595 483 -11023 -13451 -2524 9625 8850 -4557
557 -4557 -14009 -8750 4799 12098 7990 -2307 -8665 -5942 4030 11796 8161 -4723 -12235 -5215
571 -5215 8613 13191 4500 -7513 -10132 -2667 6250 8287 1233 -8881 -12261 -4163 8347 11059
585 11059 894 -9532 -9183 1419 9951 8242 -1757 -9670 -7646 1664 10198 8533 -1190 -9497
599 -9497 -6832 4438 11412 5965 -6008 -11644 -5772 5306 9605 4061 -4978 -8570 -2838 6370
613 6370 10183 3745 -7113 -11254 -2954 7539 9233 273 -8369 -7775 821 8169 7746 87 -8145
628 -8145 -9427 -1349 8400 8590 -1832 -9874 -5724 5606 11029 6016 -2638 -7478 -4655 2270 7923
643 7923 5775 -3697 -10078 -5070 6402 10616 2246 -7739 -9454 -3127 3835 5444 648 -6106 -8689
$$ packed form
543A1266J389j2293j0956M47J0021R341L80r112j1506k428J0927J2149p75j3407
557d557r452N259J3549P299m108j0297o358K723R972P766l635j2884p512P020
571e215J3828M578q691j2013k619P465Q917K037p054j0114l380Q098J2510K712
585A1059j0165j0426L49J0602Q532j709r999p913K024R310Q534j665r723q307
599i497K665J1270O974n447j1973n636N872J1078M299n544r039l592N732R208
613F370L813o438j0858m141Q300J0493J694q960q642N94Q596P348m23p659q232
628h145j282Q078R749J90j0422q042M150J1330N423n013q654m840K823O925N653
643G923k148r472o381N008J1472M214q370r985j715O327O962J609m796o754k583
$$ plain form
658 -8689 -2083 7843 10607 2170 -7388 -6607 2327 8546 6238 -1116 -5950 -4820 2007 8344 7686 -695
674 -695 -8297 -6949 1922 7107 2497 -6469 -10024 -4807 3434 7292 3603 -3636 -7307 -2919 4919
689 4919 7897 2272 -5212 -7170 -554 8052 9342 2558 -4375 -4685 1007 6464 5482 -1198 -7442 -7371
705 -7371 -866 6093 5955 -1755 -8408 -5968 2501 6881 2767 -4516 -7389 -4051 2338 6676 5289
720 5289 -1153 -5777 -2498 5922 9250 2895 -5823 -7294 -858 4802 4962 1584 -3626 -5929 -2243
735 -2243 4922 6756 89 -8001 -8250 395 6364 3823 -2013 -4809 -2844 1616 5770 5800 -678 -6740
751 -6740 -5816 2136 6974 3427 -3848 -5946 -1445 4253 5870 2638 -2893 -6209 -3466 2892 5925
766 5925 1436 -4844 -5987 -410 5941 6065 422 -4674 -4943 -328 3984 3987 -745 -5688 -5160 630 5678
$$ packed form
658h689O606R926K764q437r558P81Q934O219k308p354m834J130O827O337o58q381
674f95p602J348Q871N185m610q966l555N217Q241L858l689p239l671M388P838
689D919K978n625p484j958O616Q606J290o784o933l10N692N457r82o680o244P1
705g371O505O959j38p710o653K440Q469M380m114p283k873L338O389M338j387
720E289o442m624L279Q420L328o355q718j471O436N660J60l378n210k303L686
735b243P165J834o667q090k49Q645N969k541n836k796J965M460M154L0o478o062
751f740R24P952M838l547p275k098M501N698J617l232n531l316K743O358L033
766E925m489o280j143N577O351J24n643n096k69M615M312Lm732m943N28N790N048
$$ plain form
783 5678 4868 -728 -5648 -4064 2164 5729 2909 -2721 -5178 -2188 3373 6333 3855 -1318 -4539
798 -4539 -2132 3286 5735 1169 -5222 -6259 -1025 3836 3955 109 -3515 -4740 -1921 2954 4548
813 4548 89 -5926 -5796 751 6329 4775 -545 -3115 -1075 2535 4732 4164 -19 -4692 -4185 1784
829 1784 5966 3246 -3564 -5312 -1604 2489 2958 -30 -3596 -5582 -3752 1141 4417 1826 -3493
844 -3493 -4519 387 5824 5243 442 -3153 -2656 694 4002 4372 987 -2881 -3349 1066 5178 3645
860 3645 -1940 -5646 -4282 186 2728 846 -3008 -4592 -2564 1515 4309 2384 -1867 -4317 -2275
875 -2275 2935 4881 1730 -2482 -3123 773 4600 4907 1158 -2164 -3273 -1072 2228 2927 -441 -4549
891 -4549 -4678 123 4379 3146 -1612 -4272 -2465 542 2171 1501 -1003 -3695 -2636 1630 5532 3530
$$ packed form
783E678q10n596m920J584O228L565k820n630k457K990N561K960k478n173l221
798d539K407N418K449m566o391j037N234M861J19l846l624j225K819M875J594
813D548m459o015J30O547N578j554n320k570K040L610K197n68m183m673N07N969
829A784M182k720o810j748L708M093M69k988l566j986J830M893L276k591n319
844c493j026M906N437n81m801l595M97L350L308L70l385l868m68M415M112j533
860C645n585l706J364M468K542j882l854j584K028M079K794j925m251k450K042
875b275N210J946l151m212o41L896L827L07l749l322j109K201L300O99l368m108
891d549j29M801M256j233m758k660J807L007J629o70k504k692J059M266L902k002
$$ plain form
907 3530 -1665 -3754 -859 2802 3253 86 -2594 -3083 -1428 1950 4161 2194 -2456 -4187 -625 3523
923 3523 2892 -908 -4089 -2869 443 2741 2738 758 -2194 -2849 353 3376 2412 -1960 -4589 -2678 1381
940 1381 3313 1826 -1251 -2273 -1167 1644 3251 2147 -1690 -3912 -1689 2512 3819 1062 -1892
955 -1892 -2491 223 2956 2549 -246 -3276 -3818 -1366 1508 2605 -514 -3184 -3015 411 3082 2286
971 2286 -1137 -3302 -1946 956 2523 2436 86 -1826 -872 2297 4924 2503 -1535 -3550 -1431 1806
987 1806 1940 -82 -2502 -2782 -1243 1050 2043 615 -2701 -4263 -1544 2216 2190 -406 -2823 -1480
1003 -1480 1603 3255 3081 1133 -989 -1704 387 2869 2742 -949 -3234 -1573 1741 2930 1030 -1469
1019 -1469 -2894 -1775 -60 883 390 -2296 -4052 -1949 1957 3581 1159 -1811 -1703 612 2521 2363
$$ packed form
907C530n195k089K895L661M51l167k680m89J655L378K211j967m650j731L562M148
923C523o31l800l181J220L312K298lj980k952o55L202L023r64m372k629J911M059
940A381J932j487l077j022J106K811J607j104l837k222K223M201J307k757k954
955a892n99K714K733m07k795l030n42K452K874J097l119k670J69L426K671p96
971B286l423k165J356K902J567q7k350j912R54L169K627k421m038k015K119L237
987A806J34k022k420k80J539K293R93j428l316j562K719L760k6k596k417J343
1003a480L083J652j74j948k122p15K091K482j27l691k285J661L314J189j900k499
1019a469j425J119J715R43m93k686j756K103L906J624k422k970J08K315J909j58
$$ plain form
1035 2363 364 -1496 -1785 9 2491 3211 1007 -2144 -2226 955 2557 1162 -1936 -3171 -2279 -262
1051 -262 1482 1248 -308 -2159 -1902 1300 3023 1158 -2036 -2948 -1130 1775 2051 976 -839 -966
1067 -966 -100 1844 2553 960 -1703 -2938 -960 2101 1945 -508 -1796 -1144 643 2020 1627 -346
1083 -346 -2036 -2466 -502 1529 1606 -866 -2555 -1288 1508 2361 758 -1296 -2189 -1490 484 1433 1192
1100 1192 -569 -1883 -353 2181 3169 1269 -1550 -2187 66 1512 1133 -104 -1412 -1507 -204 1216
1116 1216 1978 216 -2464 -2628 -456 1579 571 -1788 -2351 -637 950 1860 1751 340 -1156 -1122 843
1133 843 2643 1426 -1143 -1922 77 2039 1976 533 -296 -1278 -956 369 909 -136 -2323 -3068 -763
1150 -763 1305 1419 -686 -1672 -1126 409 1068 1018 39 -1212 -1155 897 2798 2617 265 -1176 -159 1247
$$ packed form
1035B363j999j860k89J794K482P20k204l151q2L181J602j395l098j235Q92K017
1051b62J744k34j556j851K57L202J723j865l194r12J818K905K76j075j815j27
1067i66Q66J944P09j593k663j235J978L061j56k453j288O52J787J377l93j973
1083c46j690m30J964K031P7k472j689J267K796Q53j603k054q93O99J974R49k41
1100A192j761j314J530K534R88j900k819o37K253J446l79j237j308r5J303J420
1116A216P62j762k680j64K172K035j008k359n63J714J587R10j09j411j496L4J965
1133H43J800j217k569p79J999J962o3j443q29r82L22J325N40j045k187p45K305
1150g63K068J14k105r86N46J535O59n0r79j251N7K052J901j81k352j441J017J406
$$ plain form
1168 1247 2106 791 -1102 -1840 -1360 219 1119 381 -922 -2151 -1281 718 1490 -129 -1944 -2285 -286
1185 -286 1323 1336 307 -437 -269 701 1663 2024 436 -1436 -1670 351 2063 1302 -472 -1335 -537 989
1203 989 1179 586 -422 -1635 -1805 -299 1362 862 -1354 -1918 -53 1653 1964 178 -939 -843 -519
1220 -519 264 1213 799 -807 -1566 -30 2250 1949 263 -1441 -907 346 686 255 -120 -1129 -1245 11
1238 11 1706 1802 -418 -1816 -755 499 720 -352 -1102 -1119 -749 371 1423 1152 -531 -1422 -317 1035
1256 1035 1383 8 -1385 -972 241 1459 1734 818 -347 -653 -226 904 736 -733 -1462 -1705 -406
1273 -406 999 803 -653 -1181 -763 365 862 113 -955 -1377 -685 507 1465 1415 46 -688 368 1778
1291 1778 1671 202 -1057 -806 -22 585 950 605 -431 -1358 -742 913 1102 -1118 -2403 -1154 -221
$$ packed form
1168A247Q59j315j893p38M80J579R00p38j303j229Q70J999P72j619j815l41J999
1185b86J609J3j029p44J68R70R62L61j588j872k34K021J712p61j774q63P98J526
1203I89J90n93j008j213j70J506J661n00k216n64J865J706L11j786j117R6L24
1220e19P83R49m14j606p59J536K280l01j686j704N34J253L40m31l75j009j16J256
1238A1J695R6k220j398J061J254K21j072p50j7L70J120J052k71j683q91J105J352
1256A035L48j375j393M13J213J218K75r16j165l06M27J130j68j469p29k43J299
1273d06J405j96j456n28M18J128M97p49j068m22O92J192R58n0j369p34J056J410
1291A778j07j469j259K51P84O07L65l45j036r27O16J655J89k220j285J249R33
$$ plain form
1308 -221 315 -19 -228 -414 -869 217 1417 1970 98 -1395 -687 1086 1889 406 -103 -109 76 689 1266
1327 1266 968 -490 -1962 -1111 202 474 -594 -1626 -725 239 480 520 94 -469 -1186 -171 940 883
1345 883 -156 -691 -256 861 1698 1194 361 -501 -449 133 533 539 -662 -1233 -611 272 779 535 -473 -1112
1365 -1112 -802 279 899 -271 -1308 -1109 -149 896 911 631 -5 -628 -204 707 1216 -255 -1373 -651
1383 -651 606 1220 880 203 -223 -172 -97 353 565 -337 -1649 -995 703 1291 234 -790 -370 340 27
1402 27 100 360 -517 -1441 -964 506 1360 127 -706 -126 819 987 509 -124 28 -283 -352 761 1397 558
1422 558 -636 -632 621 977 184 -971 -976 -801 -540 -204 205 -152 -1047 -360 491 937 302 -587 -711 -213
1442 -213 577 879 448 -72 -91 618 1257 1164 473 9 -757 -384 346 164 -409 -1310 -977 57 544 93
$$ packed form
1308b21N36l34k09j86m55J086J200N53j872j493P08J773Q03j483n09oJ85O13N77
1327A266k98j458j472Q51J313K72j068j032R01R64K41M0m26n63p17J015J111n7
1345H83j039n35M35J117Q37n04q33q62N2N82M00Oj201n71O22Q83N07k44j008o39
1365a112L10J081O20j170j037J99R60J045J5k80o36o23M24R11N09j471j118P22
1383f51J257O14l40o77m26N1P5M50K12r02j312O54J698N88j057j024M20P10l13
1402B7P3K60q77r24M77J470Q54j233q33N80R45J68m78o33J52l11o9J113O36q39
1422E58j194MJ253L56p93j155nJ75K61L36M09l57q95O87Q51M46o35q89j24M98
1442b13P90L02m31n20j9P09O39r3o91m64p66L73P30j82n73r01L33J034M87m51
$$ plain form
1462 93 -355 -939 -560 -354 -6 417 -212 -731 -334 1141 1570 912 45 -428 468 328 260 73 -90 -621
1482 -621 -415 455 806 310 -1042 -768 30 349 -350 -791 -618 -751 -550 394 842 439 -538 -417 617
1501 617 1063 171 -495 -181 61 441 551 747 640 -376 -415 199 995 -73 -987 -1068 -380 220 460 -167
1521 -167 -279 -418 -109 194 382 -43 -797 -942 -407 636 418 33 -371 -133 569 614 576 -67 -412 -567
1541 -567 -61 574 587 -38 -166 -190 510 978 404 -375 -808 -266 -47 -217 47 -237 -774 -394 165 832 245
1562 245 -824 -1038 141 499 -17 -190 53 -92 311 836 1087 846 -8 -494 -10 691 387 -607 -903
1581 -903 -107 217 84 -153 -75 -791 -1033 -666 400 -3 -794 -863 -94 1001 811 428 219 332 399 413 712
1602 712 468 23 -476 555 897 809 233 -357 -40 60 -222 -361 -618 -968 -809 -313 336 547 -99 -558
$$ packed form
1462I3m48n84L79K06L48M23o29n19L97J475M29o58q67m73Q96j40o8j87j63n31
1482f21K06Q70L51m96j352K74P98L19o99m41J73j33K01R44M48m03r77J21J034
1501F17M46q92o66L14K42L80J10J96j07j016l9O14P96j068r14q1O88O00K40o27
1521a67j12j39L09L03J88m25p54j45N35J043k18l85m04K38P02M5l8o43l45j55
1541e67N06O35J3o25j28k4P00M68n74p79m33N42K19j70K64k84n37L80N59O67n87
1562B45j069k14J179L58n16j73K43j45M03N25K51k41q54m86M84P01l04r94k96
1581i03P96L24j33k37P8p16k42L67J066m03p91o9P69J095j90l83k09J13O7J4K99
1602G12k44m45m99J031L42q8n76n90L17J00k82j39k57l50J59M96O49K11o46m59
$$ plain form
1622 -558 -309 232 699 82 -82 -98 217 571 925 773 353 66 -65 322 674 -8 -581 -751 -259 115
1642 115 198 64 -468 -93 -163 85 222 -121 -640 -793 -48 549 388 -128 -16 462 590 533 251 137 -244
1663 -244 -302 -248 581 447 -487 -629 187 702 384 -56 -441 -328 -435 -71 -63 127 55 -476 -54 612 647 -155
1685 -155 -595 -269 13 295 -106 -231 13 11 173 764 800 249 -333 -116 349 177 -50 -398 79 20 109 479
1707 479 474 -240 -557 -536 -183 194 -443 -639 -628 -39 229 129 -25 12 -275 27 314 324 122 -409 -10 532
1729 532 1236 925 404 119 116 162 -84 -214 -358 -651 -595 -417 -1 4 -378 -630 36 378 -112 -245 -357 -354 -231
1752 -231 318 627 535 381 175 419 640 614 333 -132 -64 -127 176 -1 -278 -444 -21 -4 -296 -113 -283 -796
1774 -796 -654 -120 87 -196 -359 58 223 538 580 637 218 -226 -142 126 714 91 -157 -130 438 646 178
$$ packed form
1622e58K49N41M67o17j64j6L15L54L54j52m20k87j31L87L52o82n73j70M92L74
1642A15Q3j34n32L75p0K48J37l43n19j53P45N97j61n16J12M78J28n7k82j14l81
1663b44n8N4Q29j34r34j42Q16N15l18m40l85J13j07L64QJ90p2n31M22O66L5q02
1685a55m40L26K82K82m01j25K44kJ62N91L6n51n82K17M65j72k27l48M77n9Q9L70
1707D79np14l17K1L53L77o37j96J1N89K68j00j54L7k87L02K87J0k02n31L99N42
1729E32P04l11n21k85lM6k46j30j44k93N6J78M16Nl82k52O66L42m90j33j12LJ23
1752b31N49L09r2j54k06K44K21k6k81m65O8o3L03j77k77j66M23J7k92J83j70n13
1774g96J42N34K07k83j63M17J65L15M2N7m19m44Q4K68N88o23k48K7N68K08m68
$$ plain form
1795 178 -327 -294 -95 -456 -475 77 -425 -591 -355 -11 475 -39 -46 12 -129 -152 -54 -106 197 -292 -197 336 547
1818 547 480 -89 -296 79 342 32 -239 121 -226 137 304 181 596 -85 -318 -19 140 -106 -549 -549 -114
1839 -114 -233 -5 165 135 -55 -354 75 430 28 -236 -285 86 408 706 517 201 295 355 388 286 61 -343
1861 -343 -556 -269 -41 177 262 -223 -544 -11 -122 -312 -719 -509 -306 -322 -110 384 468 -36 -127 315 694
1882 694 796 90 111 284 56 117 274 18 51 -242 -40 389 161 -494 -882 -610 -265 -71 -344 -511 -199
1903 -199 -59 161 442 379 -119 -300 -38 447 504 18 156 656 434 525 383 436 23 -462 -550 -240 70 -522
1925 -522 -566 -226 -230 24 80 -43 -408 -208 -286 21 10 -171 -257 134 451 421 345 364 -166 146 212 -7 -108 -280
1949 -280 2 -25 56 349 -164 -118 -350 -117 69 -93 -493 -478 -263 3 -10 -75 89 -5 -197 -51 418 338 62
$$ packed form
1795A78n05L3J99l61j9N52n02j66K36L44M86n14pN8j41k3R8n2L03m89R5N33K11
1818E47o7n69k07L75K63l10k71L60l47L63J67j23M15o81k33K99J59k46m43%M35
1839a14j19K28J70l0j90k99M29L55m02k64m9L71L22K98j89l16R4O0L3j02k25m04
1861c43k13K87K28K18Q5m85l21N33j11j90m07K10K03j6K12M94Q4n04r1M42L79
1882F94J02p06K1J73k28O1J57k56L3k93K02M29k28o55l88K72L45J94k73j67L12
1903a99J40K20K81o3m98j81K62M85N7m86J38N00k22R1j42N3m13m85q8L10L10n92
1925e22m4L40mK54N6j23l65K00p8L07j1j81q6L91L17l0p6J9n30L12O6k19j01j72
1949b80K82k7Q1K93n13M6k32K33J86j62m00J5K15K66j3o5J64r4j92J46M69q0k76
$$ plain form
1972 62 -469 5 255 -5 -63 235 362 375 -23 141 52 -222 -363 -217 187 257 -361 -41 3 479 -27 -464
1994 -464 -484 -67 -178 -419 -144 123 -209 -397 236 502 237 -2 -24 224 110 130 380 481 166 -226 183
2015 183 264 503 -51 -309 -411 -252 -222 -316 -129 -341 -244 -228 101 -114 47 -275 -202 153 186 179 40 72 -60
2038 -60 576 543 304 258 177 319 -168 -19 88 -346 -427 -143 -92 -2 -228 -542 -281 -273 -326 -469 -154 -50 -347
2061 -347 -239 283 537 253 -17 181 610 176 55 252 112 21 79 397 444 308 -475 -259 -52 -68 -110 -812
2083 -812 -234 -332 -232 64 61 30 -17 -109 176 128 96 -208 -25 242 130 251 145 244 21 -73 254 58 19 -356
2107 -356 -347 -327 72 -129 -334 -286 -89 -230 177 165 -127 -248 -445 16 -264 -105 -162 10 153 75 392 101
2129 101 -89 13 -7 90 -64 39 199 334 33 160 304 158 -55 -549 -45 -10 -201 -236 141 -108 -54 -30
$$ packed form
1972F2n31M74K50k60n8K98J27J3l98J64q9k74j41J46M04P0o18L20M4M76n06m37
1994d64k0M17j11k41K75K67l32j88O33K66k65k39k2K48j14K0K50J01l15l92M09
2015A83Q1K39n54k58j02J59L0r4J87k12R7J6L29k15J61l22P3L55L3pj39L2j32
2038f0O36l3k39m6q1J42m87J49J07m34q1K84N1R0k26l14K61Qn3j43L15J04k97
2061c47J08N22K54k84k70J98M29m34j21J97j40r1N8L18M7j36p83K16K07j6m2p02
2083h12N78r8J00K96ll1m7r2K85m8l2l04J83K67j12J21j06R9k23r4L27j96l9l75
2107c56RK0L99k01k05M8J97j41M07j2k92j21j97M61k80J59n7J72J43p8L17k91
2129A01j90J02k0R7j54J03J60J35l01J27J44j46k13m94N04L5j91l5L77k49N4K4
$$ plain form
2151 -30 429 -50 -238 -394 -222 130 -261 -214 -191 136 342 72 371 77 64 113 326 495 17 -173 -64 -88
2173 -88 -140 -52 -110 187 -183 -179 -116 -273 -314 -676 -358 135 217 151 -133 178 233 111 196 306 115 -165 -81 230
2197 230 637 386 244 75 198 154 77 -100 -257 -594 -284 -116 8 -282 -335 -207 -294 -12 46 -16 -375 53
2219 53 20 386 209 179 503 174 363 246 68 129 -317 -316 42 171 111 -100 230 133 -275 -37 -211 -346 -272
2242 -272 -526 -322 76 123 19 96 257 169 178 378 -79 26 -23 -42 392 205 14 2 148 453 248 -80 -56
2265 -56 -12 -189 -139 -82 317 -144 20 109 90 -54 -258 -253 -40 28 16 55 -174 -147 169 197 327 263 183 44 -113
2290 -113 273 60 -143 -76 45 303 202 24 26 41 -226 74 -217 -226 -188 -344 -265 -87 210 87 -92 -47 -20
2313 -20 8 -301 182 -47 -33 3 234 521 274 256 256 345 348 353 -161 -198 21 -148 -203 -124 61 -286 -81 -290 226
$$ packed form
2151c0M59m79j88j56J72L52l91M7K3L27K06k70K99k94j3M9K13J69m78j90J09k4
2173h8n2Q8n8K97l70MO3j57m1l62L18M93Q2o6k84L11N5j22Q5J10j91k80Q4L11
2197B30M07k51j42j69J23m4p7j77j57l37L10J68J24k90n3J28q7K82N8o2l59M28
2219E3l3L66j77l0L24l29J89j17j78O1m46JL58J29o0k11L30r7m08K38j74j35P4
2242b72k54K04L98M7j04P7J61q8RK00m57J05m9j9M34j87j91j2J46L05k05l28K4
2265e6M4j77N0N7L99m61J64Q9j9j44k04NK13O8j2L9k29K7L16K8J30o4q0j39j57
2290a13L86k13k03O7J21K58j01j78KJ5k67L00k91rL8j56P9J78K97j23j79M5K7
2313b0K8l09M83k29J4L6K31K87k47j8%Q9LNn14l7K19j69n5P9J85l47K05k09N16
$$ plain form
2338 226 -231 -214 -229 -169 -44 -130 24 145 291 243 292 288 215 34 60 62 83 45 17 65 -126 57 -20 -68 -162 -198 -170
2365 -170 -209 -90 -28 -149 -527 19 140 65 -259 343 252 208 159 -41 252 70 274 160 484 123 -7 -15 67
2388 67 138 -46 -236 -9 39 -152 -265 -90 66 83 131 -169 36 -2 22 -208 62 -49 -125 257 403 42 167
2411 167 -47 187 199 174 -101 -334 -206 193 147 -192 31 -3 -48 -219 -130 -287 15 -298 -197 -98 27 -21 -23
2434 -23 -70 -24 -28 80 -24 117 -2 -145 -54 96 135 105 49 217 259 -218 -205 38 6 68 -92 -104 -24 -12 98
2459 98 54 -19 -206 -235 -305 -107 -25 -249 -44 -128 -82 -21 -110 373 398 64 6 24 156 254 116 85 350 66 261
2484 261 27 127 -99 -190 -214 -244 -493 -233 -255 -247 -17 -205 -136 60 19 12 -53 -126 203 53 317 23 220 602
2508 602 349 114 196 -9 37 -12 -59 -73 -244 -151 -73 33 -211 -41 -205 -42 -51 -218 -397 -171 -223 -107 65
$$ packed form
2338B26m57J7j5O0J25q6J54J21J46m8M9mp3j81K6KK1l8k8M8j91J83p7m8r4l6K8
2365a70l9J19O2j21l78N46J21p5l24O02r1m4m9k00K93j82K04j14L24l61j30qQ2
2388F7P1j84j90K27M8j91j13J75J56J7M8l00K05l8K4k30K70j11p6L82J46l61J25
2411A67k14K34J2k5k75k33J28L99m6l39K23l4m5j71Q9j57L02l13J01R9J25m8k
2434b3m7M6mJ08j04J41j19j43R1J50L9l0n6J68M2m77J3K43l2O2j60j2Q0J2J10
2459I8m4p3j87k9p0J98Q2k24K05q4M6O1q9M83K5l34n8J8J32R8j38l1K65k84J95
2484B61k34J00k26r1k4l0k49K60k2QK30j88O9J96m1po5p3L29j50K64k94J97L82
2508F02k53k35Q2k05M6m9m7j4j71R3P8J06k44J70j64J63rj67j79K26n2J16J72
$$ plain form
2531 65 135 176 302 136 125 234 72 -56 -129 -49 450 122 -69 96 70 49 -252 89 -144 -323 -260 -206 -142 -42
2555 -42 -222 -145 300 388 -124 -84 113 107 -253 240 129 223 43 173 422 132 203 196 -109 13 -249 -387 39
2578 39 -159 55 -228 94 287 -6 -58 -311 -31 -110 -180 -4 1 -29 -58 119 213 -56 -317 -69 38 -53 -114 110
2602 110 94 13 -58 -67 367 275 -38 117 -31 -99 -191 101 -77 -116 -91 -53 -87 -68 -240 115 13 -74 -123 -150 -150 -252
2628 -252 99 106 367 -256 237 47 302 -2 -57 106 104 60 87 137 197 -18 -115 179 6 -144 -333 -227 -305 -252
2652 -252 -170 -20 98 -121 -247 264 154 82 305 -10 298 229 508 447 296 105 -249 160 132 51 -238 -284
2674 -284 -143 -316 -204 -141 -160 -228 -184 -205 -117 -180 -247 -64 -92 -17 140 193 231 130 294 280 247 42 68 9 -37 52
2700 52 -76 168 -62 -248 -210 -195 -395 -145 -199 -164 -91 -213 -197 -72 -80 -26 66 113 229 -54 -131 125 157 42 120
$$ packed form
2531F5P0M1J26j66j1J09j62j28p3Q0M99l28j91J65k6k1l01L41k33j79O3N4O4J00
2555d2j80P7M45Q8n12M0J97ol60M93j11R4j80J30K49k90P1pl05J22k62j38M26
2578C9j98K14k83L22J93k93n2k53K80p9p0J76Nl0k9J77R4k69k61K48J07r1o1K24
2602A10j6q1p1rM34r2l13J55j48o8r2K92j78l9K5L8l4J9j72L55j02q7m9k7%j02
2628b52L51PK61o23M93j90K55l04n5J63km4K7N0O0k15r7K94j73j50j89J06p8N3
2652b52Q2J50J18k19j26N11j10p2K23l15L08o9K79o1j51j91l54M09k8q1k89m6
2674b84J41j73J12O3j9o8M4k1Q8o3o7J83k8P5J57N3L8j01J64j4l3k05K6n9m6Q9
2700E2j28K44k30j86L8J5k00K50n4L5P3j22J6J25qN4R2M7J16k83p7K56L2j15P8
$$ plain form
2725 120 94 22 241 -73 98 182 -112 -223 -78 295 -139 -56 -153 -12 38 -22 -39 28 -76 32 -202 12 -187
2748 -187 23 -207 -208 -43 171 -120 157 57 -190 4 165 140 148 -84 -119 267 224 131 -113 36 154 -225 218
2771 218 -19 -74 22 -320 -100 -29 -179 -45 -92 -92 -236 -321 193 -159 101 161 -69 55 143 136 33 77 338 315
2795 315 -173 103 -33 -9 172 -208 6 -169 -190 -52 -182 -138 -78 -92 -145 192 106 -6 -58 190 424 522 69
2818 69 134 335 177 118 223 161 82 23 101 197 130 -93 -16 133 -483 -475 -175 -213 36 -81 -57 -25 144 -238 -163
2843 -163 -53 58 95 111 9 142 -68 -17 300 250 275 6 -92 -21 2 208 -281 -156 -133 -171 -66 25 -408 -107
2867 -107 -207 23 -84 -73 -46 -38 -137 -48 185 6 131 23 57 77 38 -186 -40 -19 75 122 -77 -6 13 154 36
2892 36 106 -219 -211 -312 54 -109 -1 -127 54 1 -121 16 -163 28 -267 -206 -221 47 -5 342 141 -53 -146
$$ packed form
2725A20k6p2K19l14J71Q4k94j11J45L73m34Q3r7J41N0o0j7O7j04J08k34K14j99
2748a87K10k30jJ65K14k91K77j00k47J94J61k5Qk32l5L86m3r3k44J49J18l79M43
2771B18k37n5R6l42K20P1j50J34m7%j44q5N14l52K60O0k30J24Q8pj03M4K61k3
2795C15m88K76j36K4J81l80K14j75k1J38j30M4O0j4n3L37q6j12n2K48K34R8m53
2818F9O5K01j58n9J05o2p9n9P8R6o7k23P7J49o16QL00l8K49j17K4L2J69l82P5
2843a63J10J11L7J6j02J33k10N1L17n0K5k69r8P1K3K06m89J25K3l8J05R1m33L01
2867a07j00K30j07J1K7Qr9Q9K33j79J25j08L4K0l9k24J46K1R4M7j99P1J9J41j18
2892C6P0l25Qj01L66j63J08j26J81n3j22J37j79J91k95O1j5K68n2L47k01j94r3
$$ plain form
2915 -146 344 309 223 -136 -83 341 -84 -39 136 147 -36 -50 135 51 -130 -292 -149 -190 26 -150 -121 -15 -108
2938 -108 212 -219 298 -87 -142 88 192 -14 121 -25 15 386 82 55 52 -50 19 -81 -133 -177 -294 -237 -60
2961 -60 -242 98 -41 -227 -179 -25 63 80 -28 241 -218 172 191 62 298 61 84 -16 332 -174 -191 -30
2983 -30 -279 69 -344 176 -171 -74 -48 -88 -17 -360 -90 -57 -125 -67 131 13 26 71 -47 -64 281 73 101 107 -17
3008 -17 -135 204 -164 -26 75 4 77 -99 -126 -148 -253 -357 -212 179 31 53 -54 -221 87 -123 33 -18
3030 -18 -211 -125 110 -91 153 262 141 154 80 294 2 -25 153 47 -116 -96 176 219 -67 -102 113 -94 44
3053 44 -11 -191 -144 -217 -234 89 182 -80 -166 33 133 -36 -108 -30 337 47 -50 160 93 140 255 -203 207 208 -34
3078 -34 60 69 14 -126 -48 -165 -209 -208 -95 -250 -25 -70 -216 -215 22 -18 -64 37 213 121 98 183 92 330 76 169
$$ packed form
2915a46M90l5q6l59N3M24m25M5J75J1j83j4J85q4j81j62J43m1K16j76K9J06r3
2938a08L20m31N17l85n5K30J04k06J35j46M0L71l04k7lj02O9j00n2m4j17N7J77
2961f0j82L40j39j86M8J54Q8J7j08K69m59L90J9j29K36k37K3j00L48n06j7J61
2983c0k49L48m13N20l47R7K6m0P1l43K70L3o8N8J98j18J3M5j18j7L45k08K8Oj24
3008a7j18L39l68J38J01p1P3j76k7k2j05j04J45L91j48K2j07j67L08k10J56n1
3030a8j93Q6K35k01K44J09j21J3p4K14k92k7J78j06j63K0K72M3k86l5K15k07J38
3053D4n5j80M7p3j7L23R3k62q6J99J00j69p2P8L67k90r7K10o7M7J15m58M10Jk42
3078c4R4Rn5j40P8j17m4JJ13j55K25m5j46JK37m0m6J01J76r2k3Q5r1K38k54R3
$$ plain form
3104 169 111 -70 156 -94 41 -82 62 154 -22 79 -199 24 -144 -183 -134 -194 -38 -27 -147 -200 -90 167
3126 167 109 -74 73 -181 36 253 88 20 20 98 221 66 -43 132 -80 -2 -12 26 -44 -422 -133 -124 -305 -26
3150 -26 103 -94 59 154 -200 -34 95 87 -23 223 28 131 -31 58 147 -32 -24 -62 265 40 69 65 -13 167
3174 167 -292 -151 74 -269 -60 72 -12 -206 -33 67 214 -23 90 84 82 -7 78 -251 -91 -28 156 61 184
3197 184 -88 -104 74 13 76 -262 29 -153 -152 -12 -47 28 209 16 -139 84 306 -368 -63 -171 -104 -120 -217
3220 -217 9 -168 68 142 90 263 5 -54 76 223 17 46 157 -2 74 102 26 -235 -64 -211 -68 122
3242 122 -123 -69 1 248 -172 -122 326 -47 -141 145 162 227 157 127 187 268 206 159 224 231 -152 -98 212 2 -109
3267 -109 -20 -8 60 -181 -116 -248 -218 -80 -110 -66 -44 -42 -181 83 51 -42 -177 244 279 157 178 -31 163 126 -111
$$ packed form
3104A69n8j81K26k50J35j23J44R2j76J01k78K23j68l9M9o0J56J1j20n3J10K57
3126A67n8j83J47k54K17K17j65o8%P8J23j55j09J75k12P8j0L8p0l78K89Rj81K79
3150b6J29j97J53R5l54J66J29qj10K46j95J03j62Q9Q9j79Ql8L27k25K9mp8J80
3174A67m59J41K25l43K09J32q4j94J73J00J47k37J13okq9Q5l29J60O3J84r5J23
3197A84k72j6J78o1O3l38K91j82JJ40l5P5J81j93j55K23K22o74L05j08O7j6r7
3220b17K26j77K36P4n2J73k58n9J30J47k06K9J11j59P6K8p6k61J71j47J43J90
3242A22k45N4P0K47m20N0M48l73r4K86J7O5p0l0O0Q1o2m7O5Pl83N4L10k10j11
3267a09Q9J2O8k41O5j32L0J38l0M4K2Kj39K64l2r3j35M21L5j22K1k09J94l7k37
$$ plain form
3292 -111 88 112 -62 30 95 204 45 -32 196 -96 -216 -197 -152 17 -109 -106 -115 45 33 107 257 -38 2 -17 180
3317 180 152 256 186 142 44 -9 249 -14 293 1 7 -31 218 34 14 -183 -65 -186 -258 -215 -194 -20 -28 -179 68
3342 68 258 213 71 337 157 55 -124 -236 302 136 -113 87 -58 36 -218 -54 -14 -129 96 -75 -164 -119
3364 -119 -281 -106 97 -31 -94 151 196 128 250 131 124 -65 -241 90 154 13 -19 6 230 -130 -46 315 -203
3387 -203 -123 110 22 93 -57 174 90 71 -141 95 -7 -404 -229 -291 -146 -65 82 -171 45 162 -3 -15 -55
3410 -55 39 139 10 344 82 339 41 134 83 249 -55 -99 124 17 -136 -315 -7 -48 113 -102 -63 -106 -166
3433 -166 -134 80 -222 -85 20 30 35 36 53 190 365 43 211 196 -190 -43 -52 136 164 75 -371 -54 -51 17 -160
3458 -160 -85 106 198 -33 46 151 -89 -44 25 97 -127 237 155 -133 -86 25 -63 321 53 50 15 140 16 -106
$$ packed form
3292a11J99K4j74R2O5J09j59p7K28k92j20J9M5J69j26LrJ60j2P4J50k95M0j9J97
3317A80k8J04p0m4r8n3K58k63L07k92Ol8K49j84k0j97J18j21p2M3K1J74qj51K47
3342F8J90m5j42K66j80j02j79j12N38j66k49K00j45R4k54J64M0j15K25j71q9M5
3364a19j62J75K03j28o3K45M5o8J22j19pj89j76L31O4j41l2K5K24l60Q4L61n18
3387b03Q0K33q8P1j50K31q4j9k12K36j02l97J75o2J45Q1J47k53K16J17j65j2m0
3410e5R4J00j29L34k62K57k98R3n1J66l04m4K23j07j53j79L08m1J61k15L9m3o0
3433a66L2K14l02J37J05J0NJJ7J37J75l22J68j5l86J47rJ88K8q9m46L17LO8j77
3458a60P5J91R2k31P9J05k40M5O9P2k24L64q2k88M7J11q8L84k68ll5J25j24j22
$$ plain form
3482 -106 -29 182 -158 -127 -58 -106 -64 -12 12 -59 -154 197 -65 -89 -66 -9 -104 -53 249 21 -31 233 166 -169 63
3507 63 214 121 -90 112 77 -194 79 78 -136 113 -86 -67 54 50 -189 -222 -248 16 -58 -112 -137 -122 139 71 -159
3532 -159 -37 91 66 -164 -169 316 100 107 -2 67 -15 168 -108 -22 72 -184 25 -162 -297 -209 -180 -82 57 -15
3556 -15 0 -370 -71 -119 -86 -72 235 -11 -19 167 23 153 -24 176 357 187 103 -150 -180 442 72 56 103 -46
3580 -46 79 -112 -66 -62 -123 -149 -150 7 -9 245 32 -43 -50 -250 -115 246 209 127 -130 -35 -189 -47 -114 132 38 -26
3606 -26 31 79 -23 188 14 -441 -92 -347 259 -166 9 18 -120 -36 -272 61 229 -51 -54 84 228 -31 223
3629 223 171 -158 144 54 143 123 73 137 -201 10 -92 -77 -122 -57 -7 -99 -69 -199 -106 -151 -104 183 -11 90 18
3654 18 110 10 -22 -38 349 184 124 129 5 188 213 -24 134 -157 144 62 52 -81 -187 132 -158 -163 219 -49
$$ packed form
3482a06P7K11l40L1O9m8M2N2K4p1r5L51k62k4K3N7r5N1L02k28n2K64o7l35K32
3507F3J51r3k11K02l5k71K73jk14K49j99J9J21mk39l3k6K64p4n4k5J5K61o8k30
3532a59J22J28k5k30nM85k16Pj09O9q2J83k76Q6R4k56K09j87j35Q8K9R8J39p2
3556a5J5l70K99m8L3J4L07k46qJ86j44J30j77K00J81j70q4k53l0O22l70j6M7j49
3580d6J25j91M6Mo1k6jJ57j6K54k13p5pk00J35L61l7q2k57R5j54J42o7K46r4o4
3606b6N7M8j02K11j74m55L49k55O06m25J75Rj38Q4k36L33J68k80lJ38J44k59K54
3629B23n2l29L02r0Q9k0n0O4l38K11j02J5m5O5N0r2L0j30R3m5M7K87j94J01p2
3654A8R2j00l2j6L87j65o0Nj24J83K5k37J58k91L01q2j0j33j06L19k90nL82k68
$$ plain form
3678 -49 -64 9 -130 -175 -261 166 -280 -124 -47 -38 -130 153 62 183 108 -43 182 100 162 -76 56 204 34 -61 90
3703 90 117 -31 -13 -201 -124 -19 51 -4 63 -62 -36 121 -151 131 -253 224 208 92 -51 2 -12 259 99 37
3727 37 414 146 -42 305 102 -18 106 -85 -215 -32 21 -148 32 -203 -49 -191 69 49 -1 88 -247 101
3749 101 266 -15 56 -73 -188 78 48 -6 55 0 183 132 56 9 43 66 -263 -67 -306 50 -90 -157 -221 -349
3773 -349 -76 9 -92 113 171 67 -14 -268 69 91 -25 -60 -21 23 2 106 79 -38 176 257 -157 196 310
3796 310 99 -205 -100 82 -212 35 136 -150 -287 -144 97 13 267 109 165 14 -19 -85 143 43 -47 85
3818 85 -112 -239 22 147 -189 156 178 124 -36 -310 -66 -107 -126 -17 -83 -195 -125 -94 -160 -42 -148 45 -14
3841 -14 39 94 323 52 -47 146 -74 -74 -136 153 44 -34 115 -43 46 -15 -191 -111 19 -198 -147 -156 -55 -269 -16
$$ packed form
3678d9j5P3j39m5q6M27m46J56P7Rr2K83r1J21p5j51K25q2O2k38J32J48j70r5J51
3703I0K7j48J8j88P7J05P0n5O7j25K6J57k72K82l84M77j6j16j43N3j4K71j60o2
3727C7L77k68j88L47k03j20J24j91j30J83N3j69J80k35J54j42K60k0n0Q9l35L48
3749A01J65k81P1j29j15K66l0n4O1n5J83n1p6m7L4K3l29J96k39L56j40o7o4j28
3773c49K73Q5j01K05N8j04q1k54L37K2j16l5L9M4k1J04k7j17K14Q1m14L53J14
3796C10k11l04J05J82k94K47J01k86j37J43K41q4K54j58N6j51l3o6K28j00r0J32
3818H5j97j27K61J25l36L45K2n4j60k74K44m1j9J09o6j12P0L1o6J18j06J93n9
3841a4N3N5K29k71r9J93k20%o2K89j09p8J49j58Q9o1j76Q0J30k17N1rJ01k14K53
$$ plain form
3866 -16 -32 -173 53 -251 -144 3 166 96 157 14 -5 -275 165 275 -8 -40 -28 263 123 -27 169 214 199
3889 199 57 111 2 -285 -31 -301 -254 -136 9 97 -72 -32 -110 -135 -87 174 -190 33 270 193 91 197 -251
3912 -251 -108 67 -28 -28 239 8 1 75 44 63 -25 -215 8 9 -190 -234 -109 -62 -132 -84 70 97 201 159 187 220
3938 220 77 -227 192 -39 -18 192 21 191 179 117 284 3 -82 66 -130 14 -52 146 -35 -17 -247 -218
3960 -218 12 -85 -181 -74 51 -192 -140 -129 35 -125 36 -38 162 107 22 -30 -45 24 20 -82 80 -14 23 -199 -65
3985 -65 -77 92 -82 -250 -71 -32 -64 -33 -137 54 -139 -29 -4 -60 -101 174 206 137 -54 315 320 -167 405 -52
4009 -52 16 -215 -12 -238 214 119 77 -22 -95 268 -90 -36 -174 -53 -42 1 -63 48 -296 -46 199 -143 90
4032 90 -33 73 12 62 72 62 109 93 203 -3 -70 92 212 95 226 -78 -104 -271 -195 181 223 -69 -132 -207
$$ packed form
3866a6j6j41K26l04J07J47J63p0O1j43j9k70M40J10k83l2J2K91j40j50J96M5j5
3889A99j42N4j09k87K54k70M7J18J45Q8j69M0p8k5M8K61l64K23K37p7j02J06m48
3912b51J43J75r5%K67k31pP4l1J9q8j90K23Jj99m4J25M7p0M8J54K7J04m2K8L3
3938B20j43l04M19k31K1K10j71J70j2o2J67k81q5J48j96J44o6J98j81J8k30K9
3960b18K30r7r6J07J25k43N2J1J64j60J61p4K00n5q5n2j5O9mj02J62r4L7k22J34
3985f5j2J69j74j68J79L9l2L1j04J91j93J10K5n6m1K75L2o9j91L69Nm87N72m57
4009e2O8k31K03k26M52r5m2r9p3L63l58N4j38J21J1M3o4J11l44K50K45l42K33
4032I0j23J06o1N0J0j0M7j6J10k06o7J62J20j17J31l04k6j67P6L76M2k92o3p5
$$ plain form
4056 -207 84 147 -14 -91 -79 55 -15 38 -163 -70 156 60 -177 -41 76 234 70 172 29 -378 101 67 119
4079 119 -158 177 123 -164 179 47 -176 -179 -110 -239 -221 -165 -84 47 108 287 48 87 201 -165 133 6 251
4102 251 -102 -76 235 -17 137 185 10 -81 78 -49 -274 -165 58 -136 -20 34 -51 64 25 56 -62 10 -169
4125 -169 50 -115 -59 2 14 138 188 54 220 -86 -53 200 -167 -145 -11 31 -81 -267 -84 -111 39 21 -44
4148 -44 -63 117 -1 -164 -115 332 96 82 104 -42 -67 18 -197 99 203 289 71 206 77 -178 167 -201 72
4171 72 -78 155 -302 -252 -247 5 23 154 135 -190 -35 -57 23 -205 74 -79 -196 37 136 -25 154 189 100 23
4195 23 33 150 -13 189 -71 92 63 6 -393 -105 -5 -130 48 -27 -64 19 -17 46 -245 179 -79 -162 -187 143
4219 143 -68 -50 231 41 -187 21 -11 145 68 -47 64 48 -135 140 39 -114 69 -121 -206 -54 -344 171
$$ packed form
4056b07K91O3j61p7J2J34p0N3k01R3K26r6k37J36J17J58j64J02j43m07M79l4N2
4079A19k77L35n4k87L43j32k23lO9j29J8N6Q1J31O1J79k39L9J14l66K98j27K45
4102B51l53K6L11k52J54M8j75r1J59j27k25J09K23j94J16N4q5J15l9L1j18P2j79
4125a69K19j65N6O1J2J24N0j34J66l06L3K53l67K2J34M2j12j86J83k7J50j8o5
4148d4j9J80j18j63M9M47k36j4K2j46k5Q5k15K96J04Q6k18J35j29k55L45l68K73
4171G2j50K33m57N0NK52J8J31j9l25J55k2Q0k28K79j53j17K33R9j61J79L5q9p7
4195B3J0J17j63K02k60J63k9n7l99K88J00j25J78p5l7Q3l6O3k91M24k58q3k5L30
4219A43k11J8K81j90k28K08l2J56p7j15J11j6j83K75j01j53J83j90q5J52k90N15
$$ plain form
4241 171 150 -151 71 -5 -30 49 -27 93 -48 81 91 132 127 125 21 -136 297 -56 -223 -129 220 -102 -118 68
4265 68 -104 53 -120 104 28 275 -32 -69 -122 -5 14 64 56 -252 -133 -90 49 -117 -47 154 -106 -199 113 79
4289 79 165 -119 147 -86 178 67 105 -34 -57 -220 -89 218 -131 -111 7 -298 -174 -88 146 195 0 -282
4311 -282 53 2 -26 147 275 -153 76 48 -141 -74 26 13 -52 -31 -71 77 -167 -43 -14 -167 -104 78 -71
4334 -71 -28 171 192 -79 -115 -190 11 -8 -271 -136 -21 180 206 -140 129 182 59 79 168 63 -61 38 -158 46
4358 46 52 43 -86 -80 -120 -36 112 -40 -25 -175 -82 -69 83 -137 112 360 -71 -43 1 174 76 120 5 26 48 -182
4384 -182 -81 -37 272 -137 100 -144 178 -168 250 96 -119 -27 89 -140 7 -297 -33 -71 -47 9 -283 -106
4406 -106 41 130 8 -94 -84 -84 109 171 8 172 207 -27 -262 -109 -190 113 -43 -43 -73 -179 -136 -120 90 64
$$ packed form
4241A71k1l01K22p6k5P9p6J20j41J29J0M1nkj04j57M33l53j67R4L49l22j6J86
4265F8j72J57j73K24p6K47l07l7n3J17J9N0ql08J19M3J39j66P0K01k60r3L12l4
4289G9Q6k84K66k33K64j11L8j39k3j63J31L07l49K0J18l05J24Q6K34M9j95k82
4311b82L35n1k8J73J28m28K29k8j89O7J00j3o5K1m0J48k44J24K9j53O3J82j49
4334g1M3J99K1k71l6p5K01j9k63J35J15K01K6l46K69N3j23K0Q9j05j24R9j96K04
4358D6Orj29Om0Q4J48j52J5j50R3J3J52k20K49K48m31K8M4J73r8M4j15K1K2k30
4384a82J01M4L09m09K37k44L22l46M18j54k15R2J16k29J47l04K64l8K4N6k92J77
4406a06J47Q9j22j02J0%J93O2j63J64L5k34k35J53q1L03j56%l0j06M3J6K10k6
$$ plain form
4430 64 -261 13 -301 83 -34 -11 69 130 -174 83 140 57 -29 27 23 49 214 -135 105 237 34 -100 54 146
4454 146 67 33 -102 -169 -222 -4 -145 2 1 -93 31 40 -97 -4 118 80 53 -41 137 198 67 -128 214 3 200
4479 200 49 -198 -67 -13 184 -114 -184 -118 138 -233 58 -133 39 -71 1 237 105 -270 -94 102 -4
4500 -4 120 -265 46 234 53 288 81 197 121 -16 -149 -231 -25 -16 -129 139 45 6 6 -73 -138 56 -116 130
4524 130 7 -87 -37 -87 -79 0 104 164 43 -408 60 255 -77 50 -150 -36 -16 58 121 88 43 -165 164 -4
4548 -4 -33 -6 -303 -241 -155 -54 258 -166 -264 25 -38 191 191 -21 -37 -7 -201 79 -111 269 -142 143 -37 -10
4572 -10 29 137 -101 24 -121 28 151 -121 -30 55 -86 -179 88 -78 -294 77 17 174 -18 70 -53 -44 -93
4595 -93 -95 66 15 -49 20 -23 13 42 -49 161 127 0 -67 -46 144 -70 -34 219 -88 -60 86 -95 -125 -99 -54 -51 -205
$$ packed form
4430F4l25K74l14L84j17K3Q0O1l04K57N7q3q6N6mK6J65l49K40J32k03j34J54R2
4454A46p9l4j35o7n3K18j41J47jr4J24Rj37R3J22l8k7r4J78O1j31j95L42k11J97
4479B00j51k47J31N4J97k98p0O6K56l71K91j91J72j10P2K36j32l75J76J96j06
4500dJ24l85L11J88j81K35k07J16p6j37j33q2K06Rj13K68r4l9%p9o5J94j72K46
4524A30j23r4N0n0QP9J04O0j21m51M68J95l32J27k00J14K0P4O3l3m5k08L29j68
4548dk9K7k97O2Q6J01L12m24r8K89o3K29%k12j6L0j94K80j90L80m11K85j80K7
4572a0L9J08k38J25j45J49J23k72R1Q5j41r3K67j66k16L71o0J57j92Q8j23Rm9
4595i3kJ61n1o4O9m3L6K9r1K10l4j27o7K1J90k14L6K53l07K8J46j81l0K6M5Lj54
$$ plain form
4622 -205 -152 -106 19 -161 -122 313 -155 32 116 73 -209 -257 85 -83 -48 -274 61 -186 -55 -43 -189 -112 17
4645 17 -191 -66 -72 -37 59 -46 125 14 -218 -22 -126 73 206 182 252 -203 41 122 -9 61 -165 46 147
4668 147 58 252 192 183 -203 119 165 201 -242 -157 18 195 26 -117 -424 -211 312 -15 76 3 177 95 100 -204
4692 -204 -65 126 147 -20 -138 48 -72 6 -41 -21 -119 -4 80 -37 -84 -82 -129 -84 -119 -50 -28 118 -32 174 -127
4717 -127 88 -266 -11 227 -103 92 -97 81 -115 -59 -59 114 289 109 -143 113 -80 -269 -44 381 76
4738 76 -70 178 121 80 95 168 -204 48 153 175 119 -27 53 -19 19 14 -7 -202 -58 -96 3 86 90 215 49 -183
4764 -183 13 -170 -73 131 -103 -222 -174 58 -116 118 -140 -148 -133 -87 70 -49 -41 -61 257 64 41 165 -147
4787 -147 -88 145 218 7 56 115 -70 -91 -20 -223 -61 -97 155 -218 -70 51 57 -130 -94 -145 -281 99 24 61
$$ packed form
4622b05N3M6J25j80L9M35m68J87Q4m3k82m8L42j68L5k26L35k47J31J2j46P7J29
4645A7k08J25oL5R6j05J71j11k32J96j04J99J33k4P0m55K44Q1j31P0k26K11J01
4668A47q9J94o0rl86L22M6L6m43Q5J75J77j69j43l07K13N23l27R1p3J74q2Nl04
4692b04J39J91K1j67j18J86j20P8m7K0r8J15Q4j17m7Km7M5l5O9K2J46j50K06l01
4717a27K15l54K55K38l30J95j89J78j96N6%J73J75j80k52K56j93j89K25M25l05
4738G6j46K48n7m1J5P3l72K52J05K2n6j46Q0p2L8nk1j95J44l8R9Q3MJ25j66k32
4764a83J96j83R7K04k34j19M8K32j74K34k58qJ5M6J57j19Qk0L18j93k3J24l12
4787a47N9K33P3k11M9N9j85k1P1k03J62l6K52l73J48J21Oj87L6n1j36L80p5L7
$$ plain form
4811 61 66 -120 -30 24 -42 -99 146 -138 37 -229 225 -39 68 -131 87 -77 -164 -217 277 -53 -1 -296 -48
4834 -48 91 -21 -141 -76 46 -40 -133 13 -36 13 -52 77 148 79 242 -120 -170 -138 161 28 34 -54 -42 -37 -334 -32
4860 -32 -50 -110 -10 153 -5 138 6 -97 177 -124 106 71 -107 113 167 166 141 22 -16 -175 -11 86 -152
4883 -152 -197 -211 148 -20 -60 111 -143 37 -43 72 -270 -195 -275 42 -127 -68 56 -82 47 4 21 -155 -24
4906 -24 102 -197 -111 -37 -41 -168 206 8 14 542 160 106 -72 52 -55 -19 -85 75 3 17 -65 -71 -31 -71 -28 -126
4932 -126 107 -1 88 98 201 -187 -179 258 -32 -3 -176 128 -87 62 4 196 -223 156 -98 -62 -186 -137 -307
4955 -307 -262 -213 -137 114 -141 -232 26 172 -95 148 -90 -49 -12 177 -56 114 239 69 -170 190 114 225
4977 225 -79 14 -137 -172 6 86 -34 -72 122 -152 91 71 -59 89 191 -173 -139 -119 128 15 -133 21
$$ packed form
4811F1Nj86R0N4o6n7K45k84J75k66M54k64J07j99K18j64q7n3M94l30N2k95K48
4834d8J39j12j20O5J22q6r3J46m9M9o5J29P1o9J63l62n0L2K99j33Oq8J2Nk97L02
4860c2j8o0J00J63j58J43j32j03K74l01K30l5j78K20N4jk5j19l8j59J64R7k38
4883a52m5j4L59j68m0J71k54J80q0J15l42P5q0L17j69N9J24j38J29m3J7j76J31
4906b4J26k99Q6P4mj27L74j98ON28l82n4j78J24j07L6o6J60p2J4q2oM0m0M3r8
4932a26K33j08Q9J0J03l88QM37k90K9j73L04k15J49n8J92m19L79k54L6j24M9j70
4955c07M5M9P6K51k55r1K58J46k67K43k38M1L7J89k33J70J25j70k39L60p6J11
4977B25l04R3j51l5J78Q0j20l8J94k74K43k0j30J48J02l64L4K0K47j13j48J54
$$ plain form
4999 21 -162 98 18 152 60 -210 150 75 47 -37 168 67 140 144 -136 -5 -167 -79 -84 7 -114 -105 -39 19 -126 -100
5025 -100 -80 -39 39 192 -107 -172 137 112 75 141 -93 50 -150 1 60 -270 73 57 -88 -50 79 -103 298
5048 298 124 -4 -112 -33 -82 -1 -153 -169 170 -62 138 -48 -150 110 290 -87 195 159 102 -204 -17 82
5070 82 68 12 146 76 253 86 98 -19 -101 -146 163 -115 -161 7 85 144 44 59 201 -205 -108 -61 29 -79 124
5095 124 -161 129 157 103 90 12 201 -244 178 36 116 291 -61 -132 -160 160 -18 102 -160 -62 -193 -11 -2
5118 -2 -136 39 -79 -351 -97 -85 -46 72 -48 30 -111 128 88 106 -143 -43 37 -70 36 -45 376 -2 129
5141 129 -221 -128 126 86 62 125 -59 199 -35 1 -9 38 -70 -17 221 -67 -147 89 -13 -23 258 78 133 65
5165 65 116 -101 79 71 149 64 12 -32 97 -109 -105 -141 78 37 -84 91 -420 134 -3 32 -142 -7 44 151 -192
$$ packed form
4999B1j83K60q0J34r2k70L60p5k8q4K05j01P3Mk80J31j62Q8nR1j21RO6N8j45K6
5025a00K0M1P8J53k99o5L09k5l7O6k34J43k00J51N9l30L43j6j45L8J29j82M01
5048B98j74j28j08P9m9Q1j52j6L39k32K00j86j02K60J80l77K82l6n7l06J87R9
5070H2j4n6J34p0J77j67J2j17q2m5L09k78m6J68P8N9j00J5J42m06R7M7R0j08K03
5095A24k85K90K8n4j3p8J89m45M22j42Q0J75l52p1k8L20j78J20k62R8j31J82R
5118bj34J75j18k72K54J2L9J18j20P8j41K39m0J8k49J00Q0j07J06q1M21l78J31
5141A29l50R3K54m0k4O3j84K58k34L6j0M7j08N3K38k88q0K36j02j0K81j80N5o8
5165F5N1k17J80qP8q5n2m4J29k06Ml6K19m1j21J75n11N54j37L5j74J35N1J07l43
$$ plain form
5190 -192 37 178 -28 -184 12 -108 -136 -141 -272 280 -83 -14 -257 111 103 -117 120 91 -15 28 -39 -262 -31
5213 -31 161 166 -216 182 27 -88 160 88 36 -42 90 -320 107 98 -6 63 137 48 -216 -31 221 52 3 -18
5237 -18 82 115 10 -28 15 -62 -150 -23 -4 84 59 -172 -5 -9 -4 108 -18 53 23 42 210 203 -103 269 37 140
5263 140 -20 6 145 23 135 70 -37 73 50 113 113 173 -42 227 64 -118 148 119 -251 -241 -77 185 -139
5286 -139 9 -27 119 -34 77 -164 79 -276 57 139 14 -158 83 -21 -1 127 -127 117 47 -215 6
5307 6 -228 67 -49 -49 135 7 61 196 -20 -96 169 195 303 146 9 -35 163 127 -51 -26 -57 -96 125 -2
5331 -2 -75 125 -126 101 179 -332 56 -187 -11 -43 -32 -283 -65 203 37 96 -165 -148 -314 -1 56 73 0 -141
5355 -141 47 183 -71 78 165 25 -121 63 -196 35 -287 147 -37 128 106 128 -84 -64 47 -79 157
$$ packed form
5190a92K29J41k06j56J96j20k8nj31N52l63O9k43L68qk20K37k9j06M3o7k23K31
5213c1J92Nl82L98j55j15K48p2n2p8J32m10M27rj04O9P4q9k64J85K52j69m9k1
5237a8J00L3j05l8M3p7q8J27J9Q8k5k31J67mNJ12j26P1l0J9J68pl06L72k32J03
5263A40j60K6J39j22J12o5j07J10k3O3%O0k15K69j63j82K66k9l70J0J64K62l24
5286a39J48l6J46j53J11k41K43l55L33Q2j25j72K41j04K0J28k54K44p0k62K21
5307Fk34K95j16%J84j28N4J35k16p6K65K6J08j57j37m4J98l6j78K5l1l9K21j27
5331bp3K00k51K27P8n11L88k43J76l2J1k51K18K68j66N9k61J7j66L13N7J7p3j41
5355a41J88J36k54J49Q7j40j46J84k59K31l22M34j84J65k2K2k12K0J11j26K36
$$ plain form
5376 157 -26 -117 99 117 7 -113 41 76 -128 -145 -1 146 256 -108 15 267 177 53 39 5 -90 133 -80
5399 -80 28 -116 -282 139 -3 232 66 29 -66 181 -51 -69 127 -331 -21 100 201 -65 100 7 -219 96
5421 96 -102 84 78 -90 -79 -25 -286 86 185 -12 -103 -42 -65 -109 -30 -119 94 91 51 285 99 93 -246 163 52 205
5447 205 233 -252 63 -249 -101 129 -119 48 -221 -147 29 138 38 -72 126 88 -118 61 21 84 -27 -19
5469 -19 41 187 3 242 156 104 -183 -105 57 80 40 -93 15 93 -185 -22 131 137 121 -156 52 -93 83 -217
5493 -217 35 -123 -86 -126 -79 99 -37 161 -106 7 -3 248 82 110 88 -157 -47 163 -17 -74 -25 67 111
5516 111 -33 108 127 45 -36 150 79 -229 -63 -95 -210 4 49 47 94 -8 70 -24 -77 -61 31 5 98 3 231 -92
5542 -92 177 -221 -97 -98 -110 169 103 144 95 -49 -89 -170 -75 -321 41 38 -40 170 81 75 98 99 -83 -89 54 -210 107
$$ packed form
5376A57j83r1K16J8j10j20J54L5k04j7J44J47J10l64J23K52r0j24j4l4r5K23k13
5399h0J08j44j66M21j42K35j66l7r5K47k32j8J96m58L10J21J01k66J65r3k26L15
5421I6j98J86oj68J1N4k61L72R9j97r1O1k3m4P9q9K13lm0K34j86ol39M09j11J53
5447B05K8m85L15l12J48K30k48J67k69P4J76J09j00j10J98l8k06J79m0O3j11Q
5469a9O0J46j84K39q6n2k87P8J62K3m0j33J08P8k78J63J53Oj6k77K08j45J76l00
5493b17K52j58L7m0M7J78j36J98k67J13j0K51j66K8k2k45J10K10j80n7M9R2M4
5516A11j44J41J9q2q1J86p1l08J66l2j15K14M5kM7j02P8r4n3J6R2k6R3r5K28l23
5542i2K69l98J24jj2K79o6M1m9j44m0q1R5k46L62lp8K10q9oK3Jj82oJ43k64L17
$$ plain form
5569 107 -141 179 9 24 138 175 -232 3 -104 -37 245 -208 83 38 14 19 -51 -84 59 27 35 -239 103 33
5593 33 226 -111 11 -244 98 -245 -80 26 12 22 172 -93 68 211 84 292 20 78 11 -52 -153 -78
5615 -78 10 -16 -130 132 -285 125 35 250 99 198 207 -38 76 191 98 -108 264 -190 -54 172 63 -53 159
5638 159 134 -52 -98 211 99 -86 76 -157 42 -100 -298 -38 -131 -35 -101 -65 147 276 -52 -64 9 -94 -34
5661 -34 -35 -69 -256 -44 139 -166 -103 0 -4 145 -75 -128 -47 -135 23 -33 57 -190 168 -250 219 88 -180 123
5685 123 288 39 -134 -38 -64 2 46 -38 -247 1 -81 166 -12 -160 35 119 -147 -10 245 -72 -104 -129 -199
5708 -199 -58 -225 81 281 86 -70 -156 -13 163 -29 -90 129 -141 160 48 85 -122 149 60 98 7 -36
5730 -36 263 20 -330 329 81 -184 12 117 91 -105 -106 -125 46 122 275 -62 181 231 -20 -3 -143 226 -24
$$ packed form
5569A07k48L20j70J5J14L7m07K35j07O7K82m53K91m5k4Np0l3J43l2Qk74L42p0
5593C3J93l37J22k55L42l43J65J06j4J0J50k65J61J43j27K08k72N8o7o3j01P5
5615g8Q8k6j14K62m17M10r0K15j51R9Rk45J14J15r3k06L72m54J36K26j09j16K12
5638A59k5j86m6L09j12j85J62k33J99j42j98K60r3R6o6L6K12J29l28j2P3j03O0
5661c4jl4j87K12J83l05O3J03mJ49k20n3Q1q8J58n6R0k47L58m18M69j31k68L03
5685A23J65k49j73R6k6O6M4q4k09K48q2K47j78j48J95Q4k66J37K55l17l2k5p0
5708a99J41j67L06K00j95j56q6J43J76j92o1K19k70L01j12L7k07K71q9L8r1m3
5730c6K99k43l50O59k48k65J96J05k6j96jj9J71P6J53l37K43N0k51J7j40L69k50
$$ plain form
5753 -24 -167 21 -113 50 4 63 -137 -216 32 106 36 64 -122 -15 108 239 -33 -29 184 -72 -166 25 -21 -42
5777 -42 -24 42 -222 -5 252 59 41 -100 -22 86 6 5 152 -59 -197 -49 -68 24 -18 -136 -68 -161 265 8
5801 8 -162 42 -87 -190 167 130 14 61 -72 -47 6 8 446 -44 -24 -53 -40 -61 156 -67 -48 43 -23 232 114
5826 114 39 119 129 -42 -62 34 19 324 -10 58 19 -141 -87 -137 -16 -8 46 -175 187 87 84 16 -318 50 -39 156
5852 156 8 237 103 74 -25 162 -122 -44 67 165 346 -18 -83 -43 2 -127 -2 -302 -133 154 63 -92 -49
5875 -49 115 111 28 -74 144 177 270 28 -124 -210 101 -108 46 69 -65 161 -36 233 112 64 102 -95 -82 196
5899 196 -142 -35 55 -111 -98 -192 -55 -24 81 60 28 294 -184 243 -20 56 -213 -225 -139 -246 274 -83 70
5922 70 -113 281 26 57 -39 88 -21 -69 -220 245 -203 -105 -121 -215 -182 8 -265 -16 -126 -62 -151 -38 37 -52
$$ packed form
5753b4j43J88j34J63m6N9k00p9K48P4p0K8j86J07J23J31k72MK13k56r4J91m6k1
5777d2J8O6k64K17K57j93j8j41P8J08q0jJ47k11j38J48j9R2m2j18O8r3M26k57
5801Hj70K04j29j03L57l7j16M7j33K5N3KM38m90K0k9J3k1K17k23J9R1o6K55j18
5826A14p5Q0J0j71k0R6j5L05l34O8l9j60N4n0J21QN4k21L62j00lo8l34L68q9J95
5852A56j48K29j34k9r9J87k84P8J11R8J81l64o5M0M5j29J25l00J69K87r1j55M3
5875d9J64mq3j02K18L3R3k42j52q6L11k09J54K3j34K26j97K69j21m8L8j97J3K78
5899A96l38J07R0j66J3r4J37L1J05k1l2K66m78M27k63P6k69j2Q6j07N20l57J53
5922G0j83L94k55L1r6J27j09m8j51M65m48R8j6r4L3J90k73K49j10O4q9J13P5q9
$$ plain form
5946 -52 117 182 254 -119 225 103 -15 140 -188 -14 -224 -364 -153 -46 -171 -259 48 -55 -98 -297 -33 -181
5968 -181 -269 -98 58 -16 -50 106 177 232 -22 -99 40 -138 -24 95 -91 372 -149 2 -142 45 8 47 -20
5991 -20 54 -29 -187 -70 139 76 276 187 -121 -270 -67 158 55 -23 -19 -33 -15 184 -51 73 313 -156 -129 -109
6015 -109 85 -248 113 -28 158 -99 27 -60 -122 -110 -158 289 32 109 -149 -38 131 176 -6 72 66 -134 6
6038 6 -59 97 -52 81 165 -34 -16 -157 -164 -199 152 70 111 -302 -69 12 5 120 -106 -213 48 -20 124 -93 -204
6063 -204 51 -87 -49 11 -136 92 -29 97 77 -344 52 -100 18 -207 31 284 -166 -218 -18 -165 -23
6084 -23 294 105 117 -34 -219 65 186 99 93 -19 -98 -259 -136 102 118 106 -78 -107 75 45 43 -82 215 79
6108 79 -43 3 -110 -44 -105 -36 92 -69 50 66 -101 159 -138 22 59 24 54 -37 220 -4 -99 49 156 35
$$ packed form
5946e2J69O5P2l73L44j22j18J55l28J74k10j40K11J07j25q8L07j03m3j99K64j48
5968a81q8J71J56p4l4J56P1N5k54p7J39j78J14J19j86M63n21J51j44J87l7L9o7
5991b0P4q3j58J17K09o3K00q9l08j49K03K25j03p8Mj4J8J99k35J24K40m69K7K0
6015a09J94l33L61j41J86k57J26q7o2J2m8M47k57P7k58J11J69M5j82P8ok00J40
6038Fo5J56j49J33Q4j99J8j41pl5L51q2M1m13K33Q1pJ15k26j07K61o8J44k17j11
6063b04K55j38L8O0j47K28j21J26k0m21L96j52J18k25K38K53m50n2K00j47J42
6084b3L17j89J2j51j85K84J21q7oj12p9j61J23K38J6j2j84k9J82l0kj25K97j36
6108G9j22M6j13O6o1O9J28j61J19J6j67K60k97J60L7l5L0r1K57k24r5J48J07j21
$$ plain form
6132 35 -134 66 76 -186 52 71 -30 102 -84 -110 204 -91 -93 -24 42 5 -52 27 -111 175 -248 -195 -188 187 -93
6157 -93 257 -5 -19 141 -79 157 2 -121 220 16 -7 68 64 48 87 -206 59 195 -215 -80 -14 151 145 -145
6181 -145 126 -167 135 -104 68 243 -110 -217 31 169 -230 -54 -170 59 352 179 36 141 -77 106
6201 106 -169 -258 -304 -67 -110 196 -32 58 213 200 -48 60 -103 -95 -142 -367 46 -14 215 -70 127 -163 -276
6224 -276 82 106 91 325 -60 -90 -100 91 78 153 76 -314 75 -177 -63 65 -5 20 -133 -92 -178 -48 -77 -190
6248 -190 122 -144 -157 -68 -135 53 128 -182 161 66 -37 -42 -21 28 -98 -148 -70 -56 -117 -150 173 -100 -3 131 -105
6273 -105 -50 -109 69 20 156 -21 -63 -119 213 105 -33 79 230 -117 189 -242 95 -4 -67 9 -332 -55 17
6296 17 74 -32 -463 32 -273 -166 -335 -270 -15 -188 -156 -139 -103 22 111 -223 56 209 -106 127 50 26 127
$$ packed form
6132C5j69K00J0k62K38J9j01J32j86k6L14k95kO9O6l7n7P9j38K86m23N3PL75k80
6157i3L50k62j4J60k20K36j55j23L41k04k3P5mj6L9k93K65J36m10J35O6J65ok90
6181a45K71k93L02k39J72J75l53j07K48J38l99J76j16K29K93j73j43J05k18J83
6201A06k75q9m6K37m3L06k28R0J55j3k48J08j63Qm7k25M13o0K29k85J97k90j13
6224b76L58K4j5K34l85l0j0J91j3P5p7l90L89k52J14J28p0K5j53M1q6J30k9j13
6248a90L12k66j3Q9o7J88P5l10L43r5j03nK1M9j26n0P8J4o1l3L23k73R7J34k36
6273a05N5n9J78m9J36j77m2n6L32j08j38J12J51l47L06m31L37r9o3P6l41K77P2
6296A7N7j06m31M95l05J07j69O5K55j73L2J7L6J25Q9l34K79J53l15K33p7k4J01
$$ plain form
6319 127 47 102 76 -100 20 26 -109 -141 41 -80 152 -101 168 -8 35 -188 -144 -47 198 -126 -362 135 30
6342 30 -198 178 -198 -134 -118 -38 -70 61 126 -247 198 -104 -322 -246 -142 62 8 156 -87 -62 -75 2 -129 31
6366 31 -241 213 -204 -94 8 171 -44 -1 -17 94 -104 89 45 -244 -34 45 238 60 98 30 -158 -390
6388 -390 -3 -101 -51 221 -101 -24 -364 -155 131 -88 -102 58 6 -242 -63 101 126 -137 57 2 70 61 -69
6411 -69 11 143 54 -33 -56 -9 100 -18 24 174 113 -129 -63 -67 22 -132 15 53 -45 -68 28 -71 -220 -230 -147 121
6437 121 -88 -5 137 113 -53 248 159 99 10 114 -145 -76 -158 85 35 207 102 -229 115 4 -44 -19 159
6460 159 -250 95 -114 -89 156 -185 -164 29 74 7 -50 48 61 154 80 -28 141 138 -31 136 -45 -24 -207 120
6484 120 -47 -150 -8 193 -118 48 239 -131 39 22 -43 -11 -15 153 132 83 -44 100 13 216 -39 23 -110
$$ packed form
6319A27q0N5k6j76J20Oj35l2J82j21K32k53K69j76M3k23M4R7K45l24k36M97j05
6342C0k28L76l76O4J6Q0l2J31O5l73M45l02k18P6J04K04n4J48k43K5j3P7j31J60
6366C1k72M54m17J10J02J63k15M3j6J11j98J93m4k89K10P9J93j78L8o8j88k32
6388c90L87r8N0K72l22P7l40K09K86k19j4J60n2k48J79J64K5k63J94n5O8rj30
6411f9Q0J32q9q7k3M7J09j18M2J50o1k42O6mQ9j54J47L8r8k3R6r9j49j0Q3K68
6437A21k09Q3J42k4j66L01q9o0q9J04k59O9q2K43n0J72j05l31L44j11m8K5J78
6460A59m09L45k09K5K45l41K1J93M5o7n7R8J3R3p4j08J69lj69J67j81K1j83L27
6484A20j67j03J42K01l11J66J91l70J70j7o5L2mJ68k1m9j27J44q7K03k55O2j33
$$ plain form
6507 -110 -27 -3 -21 -54 3 -58 90 86 -33 181 -87 186 6 43 80 33 119 -2 -81 33 -123 107 105 -140 170
6532 170 27 88 121 -2 163 33 87 38 184 75 -10 -319 -134 51 -91 139 50 25 -19 44 -208 53 59 155
6556 155 -61 -133 30 -27 -40 -158 135 -117 -123 63 79 -92 6 100 -93 116 93 220 -127 -119 177 239 165 47
6580 47 81 7 -50 389 80 -59 -187 -115 -25 6 -25 28 -21 -116 -149 67 -186 213 -118 -135 -23 -63 92 137 61
6605 61 -47 265 -81 -107 119 171 105 -8 -70 -37 16 95 49 -79 -67 -193 213 76 -248 113 90 6 122 -1
6629 -1 54 215 108 -60 123 -72 -255 48 171 238 -15 102 -105 74 69 -206 -99 -173 183 -6 -20 56 108
6652 108 -15 80 58 17 -232 119 -139 -42 -21 65 125 27 150 138 -116 117 -379 118 -11 201 119 8 29 -105
6676 -105 91 -153 -93 -81 183 -285 120 104 -3 5 5 261 58 -23 90 -12 -276 36 161 -30 182 91 -8
$$ packed form
6507a10Q3K4j8l3N7o1J48mj19K14k68K73j80L7L7m7Q6j21p9J14j56K30kk45L10
6532A70j43O1L3j23J65j30N4m9J46j09q5l09J85J85j42K30q9k5m4O3k52K61OR6
6556A55k16p2J63n7j3j18K93k52oJ86J6j71R8R4j93K09k3J27l47QK96O2p4j18
6580D7L4p4n7M39l09j39j28P2R0L1l1N3m9r5l3K16k53L99l31j7J12m0J55M5p6
6605F1j08L12l46k6K26N2o6j13o2L3N3P9m6j28J2j26M06j37l24L61k3q4J16j23
6629aN5J61j07j68J83j95j83L03J23O7k53J17k07J79nk75J07p4L56j89j4P6N2
6652A08j23R5k2m1k49L51k58R7K1Q6O0r8J23j2k54K33m96M97j29K12q2j11K1j34
6676a05J96k44O0J2K64m68M05j6j07Q%K56k03q1J13j02k64L12J25j91K12r1r9
$$ plain form
6699 -8 28 22 -95 -55 -79 -31 8 -97 86 -175 -34 172 -53 25 -259 78 98 145 -33 -159 -17 162 -326 -79
6723 -79 55 -95 1 129 27 139 -43 -7 95 16 28 -89 14 -132 -2 -91 38 -84 -15 -11 -127 -51 222
6746 222 378 124 51 40 52 224 -218 -158 104 -50 -22 -13 -42 23 -61 52 22 -133 91 -173 112 133 -102 27
6770 27 -12 -147 -32 -85 45 -59 -85 -17 -221 77 -135 151 99 96 -44 136 172 47 152 -92 42 170 -25
6793 -25 -105 5 84 -10 90 217 55 -124 120 -66 -257 193 -21 170 -39 -153 -118 134 97 -165 -100 -107 -15
6816 -15 3 -194 -203 -50 90 -55 -113 -113 44 -51 -162 -125 -191 -260 87 -121 -21 159 56 -37 83 -44 82 227
6840 227 -121 -132 -72 -62 87 132 -84 -171 142 -61 -62 174 -69 58 -3 9 -17 64 -111 -72 -38 -119 -158 -32 176
6865 176 94 -207 206 -13 -76 -82 228 -165 184 -194 -155 -114 82 -106 269 89 -75 -68 -131 -70 185 -98 10
$$ packed form
6699hL6oj17M0k4M8L9j05J83k61J41K06k25P8k84L37K0M7j78j26J42J79m88K47
6723g9J34j50R6J28j02J12j82L6J02p9J2j17J03j46J30q9J29j22O9Mj16P6K73
6746B22J56k54p3j1J2J72m42O0K62j54K8Rk9O5q4J13l0j55K24k64K85K1k35J29
6770B7l9j35J15n3J30j04k6O8k04K98k12K86n2lj40J80L6j25J05k44J34J28j95
6793b5q0J10P9r4J00J27j62j79K44j86j91M50k14J91k09j14L5K52l7k62O5pR2
6816a5J8j97rJ53J40j45n8%J57r5j11L7o6o9L47k08J00J80j03r3J20j27J26J45
6840B27l48j1O0J0J49M5k16q7L13k03jK36k43J27o1J2k6Q1j75L9L4q1l9J26K08
6865A76q2l01M13k19o3oL10l93L49l78L9M1J96j88L75j80j64Po3O1K55k83J08
$$ plain form
6888 10 -58 190 -39 -139 -82 -218 241 -27 -119 204 169 198 -320 209 50 109 -70 -66 142 6 118 -195 -32
6911 -32 -68 171 -69 -19 107 69 163 14 -107 -77 149 -48 31 204 -110 -130 199 71 306 149 132 -197 39
6934 39 51 175 -52 5 -184 -62 -67 -115 -134 -57 -131 -129 -130 -205 122 -151 75 42 73 154 -115 63 95 -18 -64 -10 90
6961 90 2 -47 -32 163 372 -153 -109 -139 -17 -52 70 81 118 2 -169 145 60 -24 268 53 -116 71 -261 -62
6985 -62 -15 41 -14 -72 22 149 -196 96 -360 -8 -80 -123 127 102 205 19 24 -69 -67 104 6 79 -23 93 -203
7010 -203 -72 -25 -159 153 -35 -122 2 -17 61 34 -125 35 -106 -47 -124 129 -127 -41 46 -90 38 -209 -349
7033 -349 -102 -183 132 -28 -176 -61 150 -163 199 81 27 -78 2 19 51 17 -50 117 -147 -24 -65 -149 -114
7056 -114 194 54 -103 -58 -241 -228 67 -113 -18 -113 70 41 -71 -38 117 93 12 148 -366 -40 7 -119 6
$$ packed form
6888A0o8K48k29j00N7j36M59k68r2L23l5K9n18N29j59N9j79MK08j36J12l13J63
6911c2l6K39k40N0J26l8R4j49j21L0K26j97P9J73l14k0L29j28K35j57j7l29K36
6934C9J2J24k27N7j89J22nm8j9P7p4Kjp5L27k73K26l3L1Q1k69J78L2j13m6N4J00
6961I0q8m9J5J95K09n25M4l0J22l5J22J1L7j16j71L14q5q4K92k15j69J87l32J99
6985f2M7N6n5n8R4J27l45K92m56L52p2m3K50k5J03j86Nr3KJ71r8P3j02J16k96
7010b03J31M7j34L12j88q7J24j9P8k7j59J60j41N9p7K53k56Q6Q7j36J28k47j40
7033c49K47q1L15j60j48J15K11l13L62j18n4j05Q0J7L2l4o7J67k64J23m1q4L5
7056a14L08j40j57M5j83J3K95j80R5r5J83k9j12L3J55k4q1J36n14L26M7j26J25
$$ plain form
7079 6 -158 -89 130 295 -50 -27 162 173 -153 14 -82 -142 181 -57 95 95 -25 171 144 220 -113 -34 -36 -81 35
7104 35 99 -101 -224 141 -155 -234 -378 96 45 -85 54 -64 84 -87 14 72 96 33 -120 -146 302 224 54
7127 54 -73 -135 130 -138 46 -174 88 -9 138 55 -313 49 -14 -68 28 -104 132 37 120 95 -63 -165 -161 43
7151 43 -226 29 124 23 -326 -218 -10 -27 90 98 127 -301 -139 222 -50 -88 -36 105 -138 -87 -169 102 95 13
7175 13 151 -155 64 17 -21 74 -52 -63 -161 -173 151 142 114 -12 86 38 -60 14 39 54 15 45 103 187 89 152 -56
7202 -56 268 -32 -196 168 -40 -90 14 -251 -49 -57 120 -33 -126 194 -78 -28 -128 166 16 202 -19 146
7224 146 -42 -63 -191 60 -172 -166 -142 -284 3 -46 27 -183 -108 -138 40 83 110 100 -375 -66 -36 -20 -56 -35 165
7249 165 -12 180 25 -195 112 10 36 7 -11 21 -290 -178 43 211 56 178 241 184 -95 128 11 -96
$$ packed form
7079Fj64O9K19J65l45K3J89J1l26J67r6o0L23k38J52%j20J96k7P6l33P9km5J16
7104C5O4k00j23L65k96p9j44M74n1j30J39j18J48j71J01N8K4o3j53k6M48p8j70
7127E4j27o2K65k68J84k20K62r7J47q3l68L62o3n4R6j32K36r5Q3k5j58j02MK04
7151D3k69K55R5j01l49J08K08j7J17QK9m28J62L61k72l8N2J41k43N1q2K71pq2
7175A3J38l06K19m7l8R5j26j1r8j2L24rk8j26R8m8r8P4K5J5l9L0N8Q4r8O3k08
7202e6L24l00j64L64k08n0J04k65K02qJ77j53r3L20k72N0j00K94j50J86k21J65
7224A46j88k1j28K51k32OK4j42K87m9P3k10P5l0J78M3K7j0m75L09L0J6l6K1K00
7249A65j77J92j55k20L07j02K6k9j8L2l11J12K21J68j55J22O3n7k79K23j17j07
$$ plain form
7271 -96 -220 144 212 -207 -29 88 -214 54 -155 -104 -112 -134 -59 53 168 257 232 121 -50 -177 80 233 -1
7294 -1 61 -195 -134 106 328 32 201 25 194 163 36 335 -46 -99 96 28 40 285 60 126 174 -159 253
7317 253 40 -262 37 28 123 -104 -21 -119 -76 -174 -138 -257 102 31 159 165 -109 136 79 -86 -276 -55 -45 -153
7341 -153 48 13 -167 -118 51 -339 113 155 -184 1 234 170 -44 58 -10 30 8 112 -65 -25 -180 -149 189
7364 189 -90 25 150 -128 -88 -86 76 7 102 114 -30 157 144 -107 222 -98 172 41 140 262 84 257 42
7387 42 133 -71 -40 -261 -25 -35 -16 23 75 165 234 81 74 87 110 -126 29 -2 -32 86 -344 -3 -74 17 2 -86
7413 -86 160 61 44 -6 39 45 111 42 -192 59 -187 -82 25 80 -28 -150 78 -211 -48 109 69 -53 -22 112
7437 112 -92 194 28 97 -6 -114 115 44 54 -25 9 128 54 -95 39 185 54 -168 -7 11 -93 -260
$$ packed form
7271i6j24L64O8m19J78J17l02K68k09N1qk2P5J12J15Q9k5j11j71j27K57J53k34
7294aO2k56O1K40K22k96J69j76J69l1j27K99l81n3J95o8J2K45k25O6M8l33M12
7317B53k13l02K99rR5k27Q3r8M3r8L6j19L59p1J28Ok74K45n7j65j90K21J0j08
7341a53K01l5j80M9J69l90M52M2l39J85K33o4k14J02o8M0k2J04j77M0j55L1L38
7364A89k79J15J25k78M0KJ62o9R5J2j44J87j3k51L29l20K70j31R9J22j78J73k15
7387D2R1k04L1k21K36j0J9L9N2R0O9j53pJ3K3k36J55l1l0J18m30L41p1R1j5q8
7413h6K46r9j7n0M5OO6o9k34K51k46J05J07N5j08j22K28k89J63J57m0j22L1J34
7437A12k04K86j66O9j03j08K29p1J0p9L4J19p4j49J34J46j31k22J61J8j04j67
$$ plain form
7459 -260 97 55 -127 129 67 -147 -74 42 -52 181 268 188 154 -239 -124 -151 -39 131 -2 224 -273 -150 -15
7482 -15 98 -185 33 209 12 -54 -26 15 -23 189 141 -193 -18 20 -278 231 -20 -89 17 -79 54 121 -16
7505 -16 43 -101 -3 -32 17 -75 65 177 -170 59 -33 -85 105 -84 75 -31 -18 -47 -199 33 -29 -74 -33 -13 -243
7530 -243 -79 142 271 -66 -58 56 -110 169 -93 -78 -18 -26 111 19 112 -92 -106 -142 -256 -30 -5 -199 94 -9
7554 -9 -22 235 -180 -138 43 -42 -159 -73 -207 -164 257 229 -18 55 0 -59 26 -127 -88 15 37 -87 -72 -115 -18 224
7580 224 31 -11 -205 148 -92 84 -31 22 18 -69 10 4 84 14 26 81 30 75 54 36 -87 98 115 344 112 161
7606 161 -57 -91 -29 180 -136 167 -236 38 -3 -90 116 28 93 55 -12 264 39 139 125 161 145 -137 -215 -169
7630 -169 105 -105 -51 84 -106 -82 38 55 80 90 135 17 -127 156 208 37 -26 35 82 -72 98 126 -221 -33
$$ packed form
7459b60L57m2j82K56o2k14P3J16r4K33Q7q0l4l93J15k7J12J70j33K26m97J23J35
7482a5J13k83K18J76j97o6K8M1l8K12m8l34J75L8k98N09k51o9J06r6J33O7j37
7505a6N9j44R8k9M9r2J40J12l47K29r2n2J90j89J59j06J3k9j52K32o2m5M1K0k30
7530b43J64K21J29l37QJ14j66K79k62J5O0qJ37r2R3k04j4l6j14K26K5j94K93j03
7554ij3K57m15M2J81q5j17Q6j34M3M21k8k47P3n5n9Q5j53L9J03K2j24J5m3R7K42
7580B24j93m2j94L53k40J76j15N3mq7P9oQ0p0J2N5n1M5k1j8j23J85J7K29k32M9
7606A61k18l4O2K09l16L03m03K74m1q7K06q8O5l8o7K76k25J00j4L6j6k82p8M6
7630a69K74k10N4J35j90K4J20J7K5J0M5j18j44K83N2j71o3O1M7j54J70K8l47J88
$$ plain form
7654 -33 24 93 151 69 160 -304 -36 172 -66 -1 0 18 209 78 -253 62 199 104 139 -42 14 -323 -135 95
7678 95 42 51 -68 -26 -168 -65 128 202 124 -20 111 2 118 -66 -10 -10 -282 -47 -121 36 -25 -32 53 -92 31
7703 31 -130 135 -262 3 -17 10 -18 11 249 8 141 127 -56 -109 55 128 -150 -210 191 -55 6 -97 96
7726 96 22 -102 -403 262 251 -4 77 -177 -135 148 97 -177 136 0 -184 -18 -46 -17 -40 76 -276 -123 -49
7749 -49 -82 -95 67 -120 -29 119 -52 160 49 -43 147 91 -219 104 285 29 25 246 180 -22 166 16 -89
7772 -89 -37 14 -45 102 79 180 -31 2 77 -69 -83 45 -6 -93 120 -44 107 -47 84 180 18 135 60 -46
7796 -46 70 87 106 -77 -59 -272 39 22 254 -63 308 -45 -181 49 47 -126 -321 -84 16 78 227 190 88
7819 88 -31 -37 -139 34 100 -80 -65 -81 -83 18 -103 127 162 -299 -35 -5 84 -36 189 -175 65 -137 -107 374
$$ packed form
7654c3N7O9N8q2R1m64K68K08k38O5JJ8J91j31l31L15J37r5L5j81N6l37J88K30
7678I5n3Rj19M2j42J03J93P4p8j44J31j09J16j84N6%k72K35p4J57o1pQ5j45J23
7703C1j61K65l97K65k0K7k8K9K38k41J33j4j83n3J64P3k78o0M01k46O1j03J93
7726I6p4j24l01O65j1k55Q1k54M2K83n1k74L13j36j84J66k8K9k3J16l52J53P4
7749d9l3j3J62j87R1J48j71K12j11r2J90n6l10L23J81k56mK21o6k02J88j50j05
7772h9N2N1n9J47k3J01k11L3P5j46j4J28n1q7K13j64J51j54J31R6j62J17p5j06
7796d6J16J7J9j83J8k13L11j7K32l17L71l53j36K30kj73j95K37J00O2J49l7j02
7819H8j19oj02J73O6j80J5j6kJ01j21K30L5m61K64L0Q9j20K25l64K40k02L0M81
$$ plain form
7843 374 117 -64 -98 -238 -60 -82 184 -28 30 43 259 -50 -191 49 -152 -139 -149 181 40 -50 164 25
7865 25 -31 -11 253 -28 -94 -55 -133 -21 70 54 144 63 -173 82 -94 26 -137 -184 -10 -73 173 97 5 -87 83
7890 83 92 15 81 -129 231 -284 -65 180 38 -171 -137 -85 -20 -168 57 3 28 -76 29 139 -15 -84 207 197
7914 197 111 208 -244 148 -38 -117 -62 222 -161 -57 125 60 -92 21 -120 267 -66 -86 -250 -58 26 82 33
7937 33 38 -113 -112 86 -94 14 -222 -126 -92 32 -130 14 -98 -95 -180 -164 -156 33 -16 -167 -27 34 -264 -81 45
7962 45 47 -204 -82 -38 2 26 -110 -268 81 181 -104 -159 20 -4 -205 -148 -18 -163 -144 -20 -34 40 411 -35
7986 -35 -133 -192 -35 -377 -79 122 -31 -40 16 -179 -65 3 -144 91 -171 309 108 64 -119 94 -163 -113 -156
8009 -156 55 -141 -3 136 -198 22 -121 147 -359 -99 -143 38 56 23 51 -46 -136 131 13 14 -429 68 49
$$ packed form
7843C74k57j81l4j40J78k2K66k12N8J3K16l09j41K40k01J3j0L30j41r0K14j39
7865B5n6K0K64k81o6L9p8J12R1j6R0q1k36K55j76J20j63m7J74o3K46p6r2r2J70
7890H3Rp7O6k10L60n15K19K45j42k09L4N2O5j48K25n4K5j04J05J10j54o9K91j0
7914A97q6R7m52L92j86p9N5K84l83J04J82o5j52J13j41L87l33k0j64J92Q4N6m9
7937C3Nj51JJ98j80J08k36R6L4J24j62J44j12Lq5J6QJ89m9j51J40O1k98J83J26
7962D5Kk51J22M4M0K4j36j58L49J00k85n5J79k4k01N7J30j45J9J24j4P4L71m46
7986c5r8n9J57l42K98K01j53rN6j95J14O8j47K35k62M80k01m4j83K13k57N0m3
8009a56K11j96J38J39l34K20j43K68n06K60m4J81J8l3K8r7r0K67j18Jm43M97j9
$$ plain form
8032 49 133 -284 75 211 -130 91 -78 123 -163 148 -50 -152 22 -162 343 187 -44 -80 -31 7 -253 -28
8054 -28 54 -161 69 -168 223 -55 128 426 205 36 148 -137 -278 -136 295 -17 -134 111 161 138 -170
8075 -170 -46 -68 -123 204 -59 -65 -5 94 37 108 196 -8 -10 86 37 235 21 -5 47 128 -204 -151 19 -8 -174 33
8101 33 58 -65 -65 -4 176 210 156 -31 -161 67 -213 118 -32 157 -111 66 219 -28 -189 -11 -77 16 182
8124 182 40 5 -259 140 38 71 -154 90 168 -109 -142 101 -64 220 -333 62 91 -16 -78 -170 84 38 -139
8147 -139 90 -70 24 -209 138 148 255 -308 -80 169 -96 18 -49 -63 175 -63 -120 -186 116 185 -11 222
8169 222 116 99 134 -78 -55 124 38 -60 -76 67 -152 24 231 -13 85 243 22 -19 49 -61 -53 89
$$ packed form
8032D9Q4m17L59J36l41K21j69K01k86L11j98j02J74j84N05j56k31l6M9L8k60K25
8054b8Q2k15K30k37L91k78J83K98k21j69J12k85j41J42M31l12j17K45N0k3l08
8075a70J24k2n5L27k63oO0R9n7P1Q8k04kR6m9J98k14k6N2Q1l32N3J70k7j66K07
8101C3K5j23%O1J80L4n4j87j30K28k80L31j50J89k68J77J53k47j61J78o6R3J66
8124A82j42l5k64L99j02L3k25K44P8k77l3K43j65K84n53L95K9j07o2r2K54m6j77
8147a39K29j60R4k33L47J0J07n63K28K49k65J14o7j4K38k38n7o6L02O9j96K33
8169B22j06j7L5k12K3J79q6r8j6J43k19J76K07k44R8J58k21m1O8j10QJ42
8191H9
$$ Imaginary data points
##PAGE= N=2
##DATA TABLE= (X++(I..I)), XYDATA
$$ plain form
0 0 0 0 0 0 0 0 0 0 0 0 0 0 0 0 0 0 0 0 8 -8 8 -8 8 -8 15 -16 16 -19 24 -24 32 -34 40 -44 50 -56 64 -72 80 -90
40 -90 99 -108 121 -134 149 -165 182 -200 220 -244 268 -295 327 -359 395 -439 487 -542 606 -680
60 -680 771 -882 1023 -1200 1444 -1798 2352 -3361 5768 -22762 11002 90996 47631 -50964
74 -50964 -88880 -3616 101115 120671 35546 -51224 -56619 14555 75705 69185 -5504 -84677
86 -84677 -89423 -3442 76189 56656 -37515 -99343 -72135 7892 57395 30094 -43591 -84224
98 -84224 -44363 42270 94826 64545 -19446 -64031 -16553 68420 93688 32200 -51548 -73595
110 -73595 -13318 61728 67716 422 -66258 -71374 -17837 41633 45430 -16276 -80507 -75030 -3714
123 -3714 63000 60000 -3935 -55621 -36276 30827 74011 53763 -9112 -56151 -38990 30747
$$ packed form
0@%%%%%%%%%%%%%%%%%%Qj6J6j6J6j6K3l1L2l5M3m8N6o6P4q4R4j06J20j36J52j70
40i0J89k07K29k55K83l14L47l82M20m64N12n63O22o86P54q34R26j029J148j286
60f80J451j653J905k223K644l242M150n713R129k8530L3764P9994m3365r8595
74e0964l7916Q5264J04731J9556q5125q6770n395P1174O1150o520p4689p9173
86h4677m746Q5981P9631j9533r4171o1828K7208Q0027M9503k7301p3685m0633
98h4224L9861Q6633N2556l0281q3991m4585M7478Q4973K5268o1488q3748k2047
110g3595O0277P5046N988o7294o6680n116N3537N9470L797o1706o4231N477P1316
123c714O6714l000o3935n1686J9345O7103M3184k0248o2875m7039J7161O9737
$$ plain form
135 30747 77206 44628 -31561 -69480 -32709 32074 52698 9503 -50470 -68324 -30895 25337
147 25337 50038 17245 -41816 -59545 -8669 55595 63482 11135 -41970 -41637 7472 53921 50851
160 50851 3462 -42108 -42320 5812 51751 39393 -22386 -64496 -43146 12869 42287 19232
172 19232 -28275 -51161 -26801 21347 49117 28625 -19924 -44861 -14902 39641 57374 19172
184 19172 -31148 -40760 -4281 38746 43650 5551 -38383 -45224 -9381 31051 32887 -10204 -51882
197 -51882 -45054 3163 40505 30627 -11105 -39569 -24654 18808 46821 32550 -8752 -36132
209 -36132 -21175 22913 50271 28306 -19807 -42189 -16382 25980 38100 6568 -36321 -48286
221 -48286 -19233 19834 31668 5174 -32938 -40408 -4879 37230 39624 1458 -33230 -28779 8310
$$ packed form
135C0747M6459l2578p6189l7919L6771O4783K0624m3195n9973j7854L7429N6232
147B5337K4701l2793n9061j7729N0876O4264P887n2347n3105L33M9109M6449l070
160E0851m7389m5570k12M8132M5939j2358o1779m2110K1350N6015K9418k3055
172A9232m7507k2886K4360M8148K7770k0492m8549k4937K9959N4543J7733l8202
184A9172n0320r612L6479M3027M904l8099m3934o841L5843M0432J836m3091m1678
197e1882O828M8217L7342r878m1732k8464J4915M3462K8013j4271m1302k7380
209c6132J4957M4088K7358k1965m8113k2382K5807M2362J2120l1532m2889j1965
221d8286K9053L9067J1834k6494l8112p470L5529M2109K394l8166l4688M451L7089
$$ plain form
234 8310 39005 35274 2620 -25962 -22859 10065 39650 31295 -11670 -44569 -31422 9655 31137
247 31137 11888 -23685 -38957 -19097 15664 32344 15338 -20134 -37634 -15956 23745 38785
259 38785 12471 -22273 -25383 3285 33802 34660 7241 -23668 -29799 -6037 24114 26729 -3828
272 -3828 -35264 -31180 4791 31649 21362 -12371 -33312 -23067 6559 26584 18049 -10227 -28551
285 -28551 -15356 18629 38600 21815 -13992 -29266 -10463 19197 27585 6571 -21407 -29156
297 -29156 -8527 20501 28401 6367 -24151 -30658 -6345 23162 23910 -3746 -27806 -22613 6110
310 6110 28738 24865 -862 -21941 -18366 6058 26093 19528 -10031 -30748 -19463 12133 28589
323 28589 13381 -14636 -26703 -12392 12268 22849 8717 -16216 -27604 -10263 19633 30349
$$ packed form
234H310L0695l731l2654k8582L103L2924K9585q355m2965l2899J3147M1077K1482
247C1137j9249l5573j5272J9860L4761J6680j7006l5472j7500K1678L9701J5040
259C8785k6314l4744l110K8668L0517Q58k7419l0909o131K3762L0151K615l0557
272c828l1436M084L5971K6858j0287l3733k0941J0245K9626K0025q535k8276j8324
285b8551J3195L3985J9971j6785l5807j5274J8803K9660Q388k1014k7978p749
297b9156K0629K9028P900k2034l0518o507K4313K9507P48k7656k4060N193K8723
310F110K2628l873k5727k1079L575K4424K0035o565k9559k0717J1285L1596J6456
323B8589j5208k8017j2067J4311K4660J0581j4132k4933j1388J7341K9896J0716
$$ plain form
335 30349 9660 -17800 -21312 1523 23065 21848 439 -20609 -21951 -2368 19266 21047 -1478
348 -1478 -25006 -22611 3737 23272 14363 -11489 -25854 -15992 7455 21974 15377 -6095 -19882
361 -19882 -9996 14567 28412 14671 -12694 -23552 -7122 16602 21579 4978 -15705 -20910 -6362
374 -6362 14095 19052 1681 -21036 -25422 -5354 17302 18053 -3277 -20777 -15764 5941 21978
387 21978 18243 -237 -16134 -13509 6325 22426 17035 -5666 -21317 -12006 11481 22043 8854
400 8854 -12383 -21295 -11159 6965 15072 5037 -14411 -22057 -8289 13808 21321 5715 -14961
413 -14961 -17268 553 17651 17409 1101 -14166 -14304 1420 17951 18239 807 -16672 -15459 3444
427 3444 17767 10711 -9980 -21095 -12381 5404 15738 9270 -6391 -16347 -9299 8741 18614
$$ packed form
335C0349k0689k7460l512K2835K1542j217k1409k1048j342J9583K1634J781k2525
348a478k3528K395K6348J9535q909k5852j4365R862K3447J4519o597k1472j3787
361a9882R886K4563J3845j3741k7365j0858J6430K3724M977j6601k0683n205J4548
374f362K0457M957j7371k2717m386K0068K2656P51k1330j7500N013K1705J6037
387B1978l735j8480j5897K625J9834J6101n391k2701j5651R311K3487J0562j3189
400H854k1237q912J0136J8124Q107j0035j9448p646J3768K2097P513j5606k0676
413a4961k307J7821J7098k42j6308j5267j38J5724J6531K88j7432j7479J213J8903
427C444J4323p056k0691j1115Q714J7785J0334o468j5661r956P048J8040R873
$$ plain form
440 18614 8633 -11485 -19648 -5695 14132 18638 4996 -10692 -13109 -1697 12335 15187 2104
453 2104 -15360 -18582 -2743 14688 15074 -1543 -16045 -11460 5374 15658 10589 -3609 -15126
466 -15126 -12904 2965 16260 12704 -5125 -16448 -8373 9678 17124 6295 -11028 -16797 -7745
479 -7745 6333 13347 5740 -8768 -14945 -3813 13760 17242 3501 -12643 -14317 -685 12591
492 12591 12698 954 -10636 -10662 1077 13793 13287 -1853 -16076 -14387 875 12344 7409 -7322
506 -7322 -15398 -8084 6449 14136 8301 -5315 -12786 -7448 6737 14668 7143 -7348 -12326 -1719
520 -1719 12971 15915 4437 -9000 -11441 -2807 7836 9157 -501 -12356 -14380 -2474 11628
533 11628 11532 -2211 -13924 -10448 2907 11024 6422 -3964 -10732 -6748 4978 14414 11761 -1680
$$ packed form
440A8614r981k0118q163J3953J9827M506j3642j5688k417J1412J4032K852j3083
453B104j7464l222J5839J7431L86j6617j4502M585J6834J0284n069j4198j1517
466a5126K222J5869J3295l556j7829j1323Q075J8051P446j0829j7323n769R052
479g745J4078P014p607j4508o177J1132J7573L482j3741j6144j674J3632J3276
492A2591J07j1744j1590k6J1739J2716n06j5140j4223J689J5262J1469m935j4731
506g322q076P314J4533P687n835j3616p471N338J4185P931p525j4491m978J0607
520a719J4690K944j1478j3437k441Q634J0643J321r658j1855k024J1906J4102
533A1628r6j3743j1713L476J3355Q117m602j0386o768L984J1726R436k653j3441
$$ plain form
547 -1680 -11472 -5730 8149 13616 4422 -8993 -12600 -4413 6431 10240 3867 -7551 -12853 -5373
561 -5373 8048 11293 64 -12949 -12572 327 10666 9863 697 -7341 -6921 1843 10924 10690 -577
576 -577 -11340 -9219 3383 12189 7353 -4502 -10496 -5244 4517 9629 5271 -5639 -12290 -7412
590 -7412 4489 10842 4417 -7125 -10445 -2311 8982 10572 2038 -7590 -9449 -2068 7088 8940
604 8940 1528 -8022 -8823 333 10082 9695 -888 -10381 -8160 1961 8868 5875 -3071 -8346 -5644
619 -5644 3527 10141 7350 -2688 -10390 -6633 4595 9487 2824 -7571 -9685 -2391 5687 7937
633 7937 3153 -5233 -9068 -3578 5856 9277 1099 -8782 -8657 1670 10339 8474 266 -5548 -4705
648 -4705 590 6745 6958 -1005 -9964 -8358 2464 9748 5500 -4421 -8978 -4330 2665 5779 2493
$$ packed form
547a680r792N742J3879N467r194j3415l607Q187J0844L809o373j1418n302P480
561e373J3421L245j1229j3013L77J2899J0339q03r166q038M20Q764R081k34j1267
576e77j0763K121J2602Q806m836j1855n994N252R761N112m358j0910o651M878
590g412J1901O353o425j1542l320Q134J1293J590q534r628j859P381R156J852
604H940p412r550q01R156R749l87j0583r493K221J0121O907k993q946n275K702
619e644R171O614k791j0038p702L757J1228M892o663j0395k114P294Q078K250
633G937m784q386l835N490R434L421q178r881J25J0327Q669j865q208n814Q43
648d705N295O155K13p963q959J606J0822P284m248r921m557M648O995L114l286
$$ plain form
663 2493 -4692 -9464 -5734 4930 10770 5107 -4574 -6981 263 7899 8235 1390 -5921 -6633 -1062
678 -1062 6504 8024 1855 -6346 -7486 -12 6715 5115 -3342 -9830 -8211 -215 6151 4656 -2050
693 -2050 -6558 -3926 3629 8360 5232 -2712 -7595 -3876 4580 8891 4675 -3397 -5702 -613 5891
708 5891 6611 1679 -5208 -7977 -4035 3213 6135 666 -6907 -7530 425 6990 5598 -1786 -6254 -5089
724 -5089 32 4951 5451 572 -5549 -4948 3420 9607 5694 -3079 -6996 -2852 3098 4605 1842 -2629
740 -2629 -5886 -3608 3145 7610 3619 -5341 -7938 -2017 4849 4702 -549 -5208 -4656 -281 4996 6716
756 6716 1940 -4953 -6103 -50 5800 4747 -2137 -6425 -4020 2182 5938 4631 -912 -5132 -3867
771 -3867 1762 5752 3560 -3093 -6639 -2811 3875 6669 2631 -3209 -5368 -1423 3698 4279 123
$$ packed form
663B493p185m772L730J0664N840n663r681k407P244P636L36o845p311p12N571
678a062P566J520o169q201j140P474O727j600q457o488J619P996O366j495o706
693b050m508K632P555M731l128p944m883L719Q456M311m216q072k305N089O504
708E891P20m932o887k769L942P248K922n469p573o23P955O565j392p384m468J165
724e089N121M919N00m879o121O01Q368O187l913q773l917M144N950J507k763m471
740b629l257K278O753M465l991q960k597N921O866j47n251m659N52M375N277J720
756F716m776o893j150O053N850j053o884m288K405O202L756j307n543m220J265
771c867N629L990k192o653l546L828O686K794m038n840k159L945N121N81m156
$$ plain form
786 123 -5006 -6321 -2017 3577 5333 1306 -4447 -5215 632 5885 4380 -881 -4834 -3382 1294 4894
802 4894 4794 825 -3823 -3339 2039 6394 3897 -3672 -7073 -3399 2052 3294 521 -3057 -4631 -2932
818 -2932 1996 4957 2335 -4302 -6862 -1259 4770 4973 458 -2662 -1887 1720 5096 5395 1987 -3241
834 -3241 -5270 -579 5028 3890 -1937 -5882 -3381 1661 3495 1665 -2043 -4990 -4459 -394 3351
849 3351 2499 -2500 -5426 -1532 4319 6355 2816 -1758 -2886 -206 3209 4415 1469 -2590 -3776
864 -3776 -802 4273 4778 597 -4491 -4752 -1023 2471 1659 -2105 -5342 -3824 436 3688 3567 -52
880 -52 -3420 -3137 1522 4882 3146 -1838 -4066 -1347 3451 4800 2403 -1353 -2599 -1371 1485 3208
896 3208 1155 -3643 -5719 -1953 3498 3735 -191 -3248 -2523 11 2652 2374 -15 -3158 -4107 -269
$$ packed form
786A23n129j315M304N594J756m027n753p68N847N253j505n261l953J452M676L600
802D894j00l969m648M84N378M355k497p569l401L674N451J242k773l578j574J699
818b932M928K961k622o637k560N603O029K03m515l120P75L607L376K99l408n228
834c241k029M691N607j138n827l945K501N042J834j830l708k947N31M065L745
849C351q52m999k926L894N851K036l539m574j128K680L415J206k946m059j186
864c776K974N075N05m181n088k61L729L494q12l764l237J518M260L252j21l619
880e2l368K83M659L360j736m984k228K719M798J349k397l756j246J228K856J723
896C208k053m798k076L766N451K37l926l057P25K534K641k78k389l143r49L838
$$ plain form
912 -269 4247 4411 -277 -3769 -1968 2463 3840 1533 -1786 -3397 -2658 493 3587 2911 -954 -3935
928 -3935 -1694 2978 4566 689 -3046 -3489 -1042 1710 2681 1027 -1627 -2978 -719 3162 3692 -31
944 -31 -4126 -3957 56 2570 1825 -771 -2489 -1551 1272 3830 3334 16 -3081 -2554 1009 3888 2254
961 2254 -1647 -3070 -820 2527 3277 1139 -1990 -3661 -2172 426 1966 168 -2953 -3952 -883 3277
977 3277 3260 80 -2503 -2109 473 2393 2487 718 -1680 -1725 909 4006 3840 421 -2930 -1796 1266
994 1266 2104 369 -2420 -3284 -2463 38 1921 1430 -1358 -3616 -2159 1666 2906 498 -2829 -2751 75
1011 75 2494 3019 1969 -294 -1531 90 2895 3343 278 -3109 -2971 -187 2666 1677 -1020 -2376
1027 -2376 -1783 -128 1347 1046 -1259 -3623 -3017 104 2727 1776 -882 -1893 -22 2504 2949 1038
$$ packed form
912b69M516J64m688l492J801M431J377k307l319j611P39L151L094o76l865k981
928c935K241M672J588l877l735m43K447K752R71j654k654j351K259L881N30l723
944c1m095J69M013K514p45k596j718R38K823K558m96l318l097N27L563K879j634
961B254l901j423K250L347P50k138l129j671J489K598J540j798l121r99L069M160
977C277j7l180k583L94K582J920R4j769k398m5K634L097j66l419l351J134L062
994A266Q38j735k789q64Q21K501J883m91k788k258J457L825J240k408l327P8K826
1011G5K419N25j050k263j237J621K805M48l065l387J38K784K853r89k697j356
1027b376N93J655J475l01k305k364O06L121K623r51k658j011J871K526M45j911
$$ plain form
1043 1038 -549 -1902 -1352 1501 2897 1285 -1676 -2467 -68 2595 2472 -689 -2814 -2628 -696 568
1059 568 1220 148 -2166 -2136 389 2619 2509 -512 -2764 -1830 899 2292 1169 -750 -1269 -958 1008
1076 1008 2654 1934 -605 -2662 -1505 979 2000 531 -1937 -1914 81 2205 2227 672 -746 -1991
1092 -1991 -1154 1040 1977 -264 -2711 -2321 445 2313 1670 -527 -1577 -1024 250 1050 1087 -283 -1851
1109 -1851 -1459 912 2999 2112 -264 -1625 -185 1577 1420 120 -1366 -1778 -1077 541 1758 1113
1125 1113 -1636 -2591 -761 1378 1019 -1300 -2387 -1909 -8 1277 1573 1041 -300 -926 534 2631
1141 2631 2425 -431 -2109 -950 1374 1995 946 -536 -1227 -818 75 1048 447 -1742 -3324 -1879 211
1158 211 1322 -14 -1559 -1436 98 1415 1650 719 -957 -1589 -255 1603 1984 498 -829 -767 1201
$$ packed form
1043A038j587j353N50K853J396j612k961p91K399K663j23l161k125J86J932J264
1059E68O52j072k314L0K525K230j10l021k252R34K729J393j123j919n19L11J966
1076A008J646p20k539k057J157K484J021j469k468K3J995K124K2j555j418j245
1092a991Q37K194R37k241k447L90K766J868o43k197j050N53J274Q00L7j370j568
1109a851L92K371K087q87k376j361J440J762j57j300j486m12P01J618J217o45
1125A113k749r55J830K139l59k319j087M78J901J285K96n32j341o26J460K097
1141B631k06k856j678J159K324O21j049j482o91M09Q93R73o01k189j582J445K090
1158B11J111j336j545J23J534J317K35r31j676o32J334J858L81j486j327O2J968
$$ plain form
1175 1201 2236 1440 -415 -1593 -1202 -335 813 311 -918 -2048 -1494 101 1502 889 -1340 -2086 -958
1192 -958 822 1041 80 -925 -658 317 1491 2218 1573 -542 -2025 -365 1434 1458 -269 -1694 -826
1209 -826 562 1065 683 394 -1075 -1498 -1011 1154 959 -915 -2392 -1234 1213 1820 602 -582 -620
1226 -620 -561 251 995 1004 -658 -1807 -1023 1571 2330 738 -973 -421 293 975 740 -56 -919 -1751 -771
1245 -771 917 1629 99 -1430 -1001 459 875 478 -872 -1591 -1323 -266 972 1068 66 -939 -591
1262 -591 1017 1849 896 -661 -1377 -434 912 1424 1011 -89 -384 155 1004 1347 274 -1458 -2051 -1019
1280 -1019 327 786 -444 -1578 -964 406 972 461 -82 -1061 -1157 -444 1070 1338 230 -722 -310 1755
1298 1755 2290 1092 -390 -408 -474 88 663 775 -346 -1610 -1311 810 1266 -246 -1568 -1580 -363 235
$$ packed form
1175A201J035p96j855j178L91Q67J148n02j229j130N54J595J401o13k229p46J128
1192i58J780K19r61j005K67R75J174P27o45k115j483J660J799K4j727j425Q68
1209h26J388N03l82k89j469m23M87K165j95j874j477J158K447O07j218j184l8
1226f20N9Q12P44Rj662j149P84K594P59j592j711N52P14O82k35p96q63q32R80
1245g71J688P12j530j529M29J460M16l97j350p19K68J057J238R6j002j005L48
1262e91J608Q32r53j557p16R43J346N12m13j100k95N39Q49L43j073j732n93J032
1280a019J346M59j230j134O14J370N66n11n43r79r6P13J514K68j108r52M12K065
1298A755N35j198j482j8o6N62N75J12j121j264K99K121M56j512j322j2J217N98
$$ plain form
1316 235 -228 -388 -569 -907 -379 1033 1945 850 -1355 -843 859 1576 695 -135 -455 75 552 1086 1179
1335 1179 111 -1165 -1342 -223 730 -333 -1536 -1579 -471 554 1021 677 -279 -884 -529 763 1156
1352 1156 415 -834 -895 355 1109 1340 678 -192 -584 358 930 408 -526 -1274 -864 -443 779 976 9
1371 9 -890 -731 337 1002 141 -883 -1110 -354 190 511 363 6 -536 -644 804 1250 383 -1212 -979
1390 -979 154 830 688 22 93 111 -118 549 1371 292 -1293 -1527 11 849 -66 -528 -901 -387 31
1409 31 98 310 -84 -990 -1263 -93 709 403 -699 -384 575 1420 941 719 203 -332 -565 388 903 313
1429 313 -754 -816 279 1049 551 -396 -1028 -994 -867 -400 -18 -469 -1084 -976 65 1209 839 -42 -438
1448 -438 -173 344 825 805 -164 -477 294 1025 1025 856 336 -390 -415 229 357 -203 -1372 -1533 -357 479 272
$$ packed form
1316B35m63j60j81l38N28J412R12j095k205N12J702P17q81q30l20N30M77N34R3
1335A179j068j276j77J119R53j063j203m3J108J025M67l44r56o05L55J292L93
1352A156p41j249o1J250P54K31o62q70l92R42N72n22r34p48M10M21J222J97r67
1371Iq99J59J068O65q61j024k27P56N44L21j48l57n42j08J448M46q67j595K33
1390i79J133O76j42o66P1J8k29O67Q22j079j585k34J538Q38r15m62l73N14M18
1409C1O7K12l94r06k73J170Q02l06j102L15R59Q45m79k22n16n35k33R53N15n90
1429C13j067o2J095P70m98r47o32L4J27M67L82m51o15J08J041J144l70q81l96
1448d38K65N17M81k0r69l13P71P31%j69n20p26k5O44J28n60j169j61J176Q36k07
$$ plain form
1469 272 -392 -497 -115 -99 76 291 96 -826 -986 351 1429 1065 285 47 214 812 612 449 155 -667
1489 -667 -1020 -50 857 527 -861 -836 175 605 283 -363 -602 -901 -625 -33 744 361 -331 -715 443
1508 443 1310 684 -234 -496 -272 164 307 728 437 -206 -542 279 1113 1018 -195 -1017 -426 52 166 -22
1528 -22 -353 -528 -253 297 622 311 -368 -673 -688 36 332 -58 -522 -193 173 899 1012 442 -56 -453 -144
1549 -144 195 492 159 -287 -393 353 899 709 -303 -739 -255 17 -243 -452 -589 -450 -961 -96 986
1568 986 489 -371 -814 -159 466 196 -355 -212 -29 144 565 1223 904 340 -190 80 674 574 -489 -885
1588 -885 -665 -50 -95 53 48 -591 -819 -420 367 182 -583 -1345 -649 173 538 391 318 361 242 583 645 628
1610 628 45 -528 -111 577 850 -3 -425 -323 199 328 -195 -481 -797 -1150 -757 -202 147 42 -410 -328
$$ packed form
1469B72o64j05L82J6J75K15j95r22j60J337J078l64p80k38J67N98k00j63k94q22
1489f67l53R70R07l30j388K5J011M30l22o46k39k99K76N92P77l83o92l84J158
1508D43Q67o26r18k62K24M36J43M21k91o43l36Q21Q34r5j213q22N91M78J14j88
1528b2l31j75K75N50L25l11o79l05j5P24K96l90m64L29L66P26J13n70m98l97L09
1549a44L39K97l33m46j06P46N46j90j012m36M84K72k60k09j37J39n11Q65J082
1568I86m97q60m43O55O25k70n51J43J83J73M21O58l19n64n30K70N94j00j063l96
1588h85K20O15m5J48no39k28L99P87j85p65p62O96Q22L65j47p3M3j19L41O2j7
1610F28n83n73M17O88K73q53m22J02N22J29n23k86l16l53L93N55L49j05m52Q2
$$ plain form
1630 -328 224 865 415 -184 -441 -215 337 508 655 301 119 309 645 775 645 -75 -834 -491 136 -44
1650 -44 -372 -463 -266 -87 185 118 111 -426 -794 -393 382 373 -223 -256 -86 473 475 368 350 288 -202 -414 403 242
1674 242 -154 -568 -429 618 696 298 -261 -160 29 -36 99 23 -188 -505 -367 295 563 17 -239 -370 -59
1695 -59 21 -269 -367 -224 -212 164 447 1040 353 -13 -71 186 620 361 -360 -458 30 266 346 173 140 -165 -524
1718 -524 -75 205 -138 -747 -908 -566 -74 285 -213 1 109 101 339 358 500 -97 -138 254 657 595 335 -326
1740 -326 102 247 115 224 -106 -519 -701 -601 -197 -73 -192 -752 -449 495 592 -11 -577 -395 -201 173
1760 173 388 367 344 91 180 709 802 407 -214 -229 -13 39 -33 -332 -187 -399 74 12 59 23 -579 -760 -293
1783 -293 -14 -63 -393 -172 449 654 316 599 155 384 77 193 505 229 -96 -375 91 549 491 251 -195
$$ packed form
1630c28N52O41m50n99k57K26N52J71J47l54j82J90L36J30j30p20p59L43O27j80
1650d4l28r1J97J79K72o7pn37l68M01P75rn96l3J70N59Kj07j8o2m90k12Q17j61
1674B42l96m14J39J047P8l98n59J01J89o5J35p6k11l17J38O62K68n46k56j31L11
1695e9Q0k90r8J43J2L76K83N93o87l66n8K57M34k59p21r8M88K36Q0j73l3l05l59
1718e24M49K80l43o09j61L42M92L59m98K14J08qK38J9J42n97m1L92M03o2k60o61
1740c26M28J45j32J09l30m13j82J00M04J24j19n60L03R44R7o03n66J82J94L74
1760A73K15k1k3k53Q9N29R3l95o21j5K16N2p2k99J45k12M73o2M7l6o02j81M67
1783b93K79m9l30K21O21K05l38K83m44K29l07J16L12k76l25k79M66M58n8k40m46
$$ plain form
1804 -195 -40 20 -281 26 1 -549 -587 -52 290 383 -76 -135 8 -11 53 -118 -274 156 -362 -41 285 493
1826 493 251 -104 209 375 354 97 -175 -371 -20 68 97 331 -2 -297 -56 277 200 -198 -527 -549 -141 -175
1848 -175 15 -23 -211 -117 -30 -127 355 30 -190 -287 77 327 289 19 256 291 689 433 182 33 -66 -388 -304
1871 -304 116 -172 -400 -639 -218 239 -11 -284 -492 -317 -306 -84 170 66 173 -126 368 941 642 137
1891 137 44 101 200 343 -29 164 20 -343 -349 177 315 -270 -826 -382 -290 -422 -262 -451 -1 -120 91 -28
1913 -28 441 148 -291 265 474 584 94 -32 12 394 263 419 422 37 -389 43 146 63 -139 -599 -473 -161
1935 -161 -383 62 139 -183 -338 -2 234 -111 -371 -214 -33 -8 458 432 221 188 144 463 245 -192 -269 -192
1957 -192 -168 -106 194 118 -19 -181 -380 297 309 -109 -515 -181 185 -239 -123 -50 168 -63 -31 88 223 -57
$$ packed form
1804a95J55O0l01L07k5n50l8N35L42R3m59n9J43j9O4j71j56M30n18L21L26K08
1826D93k42l55L13J66k1k57k72j96L51Q8K9K34l33k95K41L33p7l98l29k2M08l4
1848a75J90l8j88R4Q7r7M82l25k20r7L64K50l8k70K37L5L98k56k51j49r9l22Q4
1871c04M20k88k28k39M21M57k50k73k08J75J1K22K54j04J07k99M94N73k99n05
1891A37r3N7R9J43l72J93j44l63oN26J38n85n56M44R2j32J60j89M50j19K11j19
1913b8M69k93m39N56K09J10m90j26M4L82j31J56Ll85m26M32J03q3k02m60J26L12
1935a61k22M45P7l22j55L36K36l45k60J57J81K5M66k6k11l3m4L19k18m37p7P7
1957a92K4O2L00p6j37j62j99O77J2m18m06L34L66m24J16P3K18k31L2J19J35k80
$$ plain form
1979 -57 -670 -220 267 194 -14 123 354 407 162 239 401 88 -381 -445 241 325 -7 -294 -197 187 -114 -264
2001 -264 100 -284 -396 -610 -87 57 -217 -299 -81 446 287 307 219 224 127 26 240 349 -124 -234 202 192
2023 192 414 338 109 -189 -596 40 -154 -181 -652 -408 -70 143 169 22 -233 -247 -179 383 166 -62 -159 -18
2045 -18 250 508 449 383 538 406 142 -52 296 66 -523 -575 -245 270 -200 -481 -205 -140 -202 -359 16 -134
2067 -134 -538 -171 257 314 251 19 46 401 567 229 91 133 288 -111 -56 109 373 -149 -56 166 168 -216 -463
2090 -463 -422 -323 -384 -22 -110 23 -287 -228 316 536 150 -236 61 72 107 109 210 76 98 51 234 366 356 52
2114 52 -89 -132 -168 -60 -42 -105 -394 -364 259 166 45 -275 -1 -61 -184 168 122 -339 -395 347 344 62 -41 -178
2138 -178 94 -288 105 -7 164 245 101 93 425 356 81 -43 298 60 -301 -126 -199 -321 -312 -362 65 135 -76
$$ packed form
1979e7o13M50M87p3k08J37K31N3k45P7J62l13m69o4O86Q4l32k87R7L84l01j50
2001b64L64l84j12k14N23J44k74q2K18N27j59K0q8Nr7j01K14J09m73j10M36j0
2023A92K22p6k29k98m07O36j94k7m71K44L38K13K6j47k55j4O8N62k17k28r7J41
2045a8K68K58n9o6J55j32k64j94L48k30n89n2L30N15m70k81K76O5o2j57L75j50
2067a34m04L67M28N7o3k32K7L55J66l38j38M2J55l99N5J65K64n22R3K22Kl84k47
2090d63M1R9o1L62q8J33l10N9N44K20l86l86K97J1L5KJ01j34K2m7J83J32j0l04
2114E2j41m3l6J08J8o3k89L0O23r3j21l20K74o0j23L52m6m61n6P42lk82j03j37
2138a78K72l82L93j12J71Q1j44qL32o9k75j24L41k38l61J75p3j22Rn0M27P0k11
$$ plain form
2161 -76 -420 -71 -4 0 -461 -389 318 -157 135 385 473 170 67 489 253 131 -21 -145 -98 131 50 -118 -69
2184 -69 -175 -440 -311 -163 -113 -243 -519 -78 -94 -27 -79 -55 45 182 93 222 273 123 169 181 429 382 376 227
2208 227 -20 7 -5 195 -229 -384 -415 -202 -269 -365 -303 -139 -260 -221 165 225 -226 -141 59 -51 289 -33 195
2231 195 252 162 365 271 171 191 -249 -142 99 31 -123 -265 -107 -226 217 -79 91 -148 -366 -401 82 -52
2253 -52 -156 -61 67 272 88 -205 117 4 -88 -76 -131 82 93 -289 109 258 221 154 -74 174 -94 -179 -137
2276 -137 33 147 34 -31 -38 243 -324 -227 97 63 -106 -307 -100 93 -118 106 107 176 183 -11 311 203 204 80
2300 80 -287 -342 -173 118 -1 5 -2 49 -81 0 -57 -252 -234 -544 -424 -106 -37 -311 147 -2 212 -33 -67 159
2324 159 -65 118 201 -28 414 258 106 410 460 183 -76 -93 -314 -161 -330 -136 -260 152 -321 -376 -88
$$ packed form
2161g6l44L49O7Mm61P2P07m75K92K50Q8l03j03M22k36j22j52j24M7K29q1j68M9
2184f9j06k65J29J48N0j30k76M41j6O7n2K4J00J37q9J29N1j50M6J2K48m7oj49
2208B27k47K7j2K00m24j55l1K13o7r6O2J64j21L9L86O0m51Q5K00j10L40l22K28
2231A95N7r0K03r4j00K0m40J07K41o8j54j42J58j19M43k96J70k39k18l5M83j34
2253e2j04R5J28K05j84k93L22j13r2J2n5K13J1l82L98J49l7o7k28K48k68q5M2
2276a37J70J14j13o5pK81n67R7L24l4j69k01K07J93k11K24JO9Pj94L22j08Jj24
2300H0l67n5J69K91j19OpN1j30Q1n7j95J8l10J20L18O9k74M58j49K14k45l4K26
2324A59k24J83Q3k29M42j56j52L04N0k77k59j7k21J53j69J94j24M12m73n5K88
$$ plain form
2345 -88 -8 -137 -269 -278 -37 11 -132 -54 201 185 7 407 467 179 227 63 119 378 -22 -108 -94 146 97 -24
2369 -24 -161 -86 -255 -408 -143 2 -104 -146 -222 68 -65 95 5 111 9 16 2 261 84 6 145 210 311
2392 311 84 91 22 105 -8 -143 -172 122 -51 -189 -92 -61 104 -268 -229 -92 -177 21 -130 -76 -95 -180 -170 -107 282
2417 282 233 106 259 211 -87 -92 -318 -2 -81 -94 -83 26 -20 103 -252 -156 -232 -170 -250 -314 -74 84 -29 -71 -25
2442 -25 118 102 199 133 -84 -92 -40 122 60 118 113 186 175 385 145 210 -1 185 -75 -242 -35 62 10 -112 185
2467 185 -173 -288 -135 -256 -385 -136 -11 -331 -88 234 -205 -69 143 230 95 66 353 187 80 11 159
2488 159 -83 109 64 261 316 72 -319 -197 -54 -277 -512 -385 -217 -496 -274 15 93 303 28 -116 -77
2509 -77 3 85 -213 -21 150 337 686 377 10 -77 68 -90 11 -117 -366 -309 -37 -317 31 -146 2 3
$$ packed form
2345h8Q0j29j32rK41M8j43P8K55j6j78M00O0k88M8j64N6K59m00q6J4K40m9j21
2369b4j37P5j69j53K65J45j06m2p6K90j33J60r0J06j02Pj4K59j77p8J39O5J01
2392C11k27Po9Q3j13j35k9K94j73j38R7L1J65l72L9J37q5J98j51N4j9q5J0O3L89
2417B82m9j27J53m8k98nk26L16p9j3J1J09m6J23l55R6p6O2q0o4K40J58j13m2M6
2442b5J43j6R7o6k17qN2J62o2N8nP3j1K10k40O5k11J86k60j67K07R7n2j22K97
2467A85l58j15J53j21j29K49J25l20K43L22m39J36K12Q7j35k9K87j66j07o9J48
2488A59k42J92m5J97N5k44l91J22J43k23k35J27J68k79K22K89P8K10k75j44L9
2509g7Q0Q2k98J92J71J87L49l09l67q7J45j58J01j28k49N7K72k80L48j77J48J
$$ plain form
2531 3 7 128 -146 -478 -110 247 -110 15 85 315 102 87 172 434 -76 -116 76 219 164 -206 233 115 -43
2554 -43 5 83 200 -194 -508 -208 43 -224 -57 -262 76 -56 -171 4 108 365 -228 -111 194 -27 -155
2575 -155 -8 129 185 50 -49 173 -89 -231 -365 -184 92 1 252 -55 202 20 -316 -173 -218 72 -230
2596 -230 -160 12 -305 -86 87 -38 157 178 26 -117 -117 -160 -23 -148 -71 116 234 99 216 58 53 177 -25
2619 -25 57 47 -344 -252 -372 121 -122 -159 -92 147 -197 -32 -85 69 -90 -232 -224 153 311 -1 -187 444 532
2642 532 338 21 341 132 -22 14 -92 200 18 -143 -148 158 -262 -370 -171 -421 -441 -532 34 146 -202 -169
2664 -169 124 198 184 -82 -35 234 128 -58 165 262 66 -60 149 254 -19 105 -289 -292 -331 -166 -305 4
2686 4 58 -136 -16 -281 109 -200 91 -19 -201 68 169 101 196 13 -95 614 138 96 171 160 167 -160 -99 43
$$ packed form
2531CMJ21k74l32L68L57l57J25P0K30k13j5Q5K62n10m0J92J43n5l70M39j18j58
2554d3M8P8J17l94l14L00K51k67J67k05L38j32j15J75J04K57n93J17L05k21j28
2575a55J47J37N6j35r9K22k62j42j34J81K76r1K51l07K57j82l36J43m5K90l02
2596b30P0J72l17K19J73j25J95K1j52j43%m3J37j25P7J87J18j35J17j58nJ24k02
2619b5Q2j0l91R2j20M93k43l7O7K39l44J65n3J54j59j42QL77J58l12j86O31Q8
2642E32j94l17L20k09j54L6j06K92j82j61nL06m20j08J99k50k0r1N66J12l48L3
2664a69K93P4j4k66M7K69j06j86K23R7j96j26K09J05k73J24l94ll9J65j39L09
2686DN4j94J20k65L90l09K91j10j82K69J01o8R5j83j08P09m76m2P5j1Pl27O1J42
$$ plain form
2710 43 -94 -238 -148 51 -29 -105 -354 -84 108 -203 -111 -136 -187 -55 -128 124 -183 -26 22 79 -105 -63 33 466
2734 466 174 67 52 98 -23 -129 141 -7 57 -82 -235 71 53 -35 -79 167 7 -115 -50 -89 150 -55 -209
2757 -209 67 77 -173 124 413 272 -83 18 -114 157 -132 28 189 154 301 11 131 32 155 -237 -73
2778 -73 -107 -187 -131 13 -10 -258 -129 -159 -199 -30 -212 330 198 222 -222 53 271 152 36 359 290 126 56
2801 56 149 93 50 -62 150 80 -269 -74 -51 -247 -110 -29 -90 -36 -172 -266 247 -59 -226 -103 -8 552 137 -69
2825 -69 353 92 -78 236 -3 -105 -18 157 -143 155 185 -266 -53 -271 260 -272 -402 -30 34 3 -187 14
2847 14 -4 -110 257 223 62 224 -102 60 160 236 99 226 190 360 147 -159 92 173 30 8 -236 -247 -346
2870 -346 -204 -80 -75 -142 -59 109 127 0 175 -38 -101 -127 5 192 270 84 138 215 109 310 174 -78 -103 -42
$$ packed form
2710D3j37j44R0J99q0p6k49K70J92l11R2k5n1J32p3K52l07J57M8N7j84M2R6M33
2734D66k92j07j5M6j21j06K70j48O4j39j53L06j8q8m4K46j60j22O5l9K39k05j54
2757b09K76J0k50K97K89j41l55J01j32K71k89J60J61l5J47k90J20r9J23l92J64
2778g3l4q0N6J44k3k48J29l0m0J69j82N42j32K4m44K75K18j19j16L23o9j64p0
2801E6R3n6m3j12K12p0l49J95K3j96J37Q1o1N4j36r4N13l06j67J23R5N60m15k06
2825f9M22k61j70L14k39j02Q7J75l00K98L0m51K13k18N31n32j30L72O4l1j90K01
2847A4j8j06L67l4j61J62l26J62J00P6j37J27l6J70k13l06K51Q1j43k2k44j1r9
2870c46J42J24No7Q3J68J8j27J75k13o3k6J32J87P8j86N4P7j06K01j36k52k5O1
$$ plain form
2894 -42 20 -37 -105 -16 10 196 -204 -60 -78 3 23 -52 -11 -82 -69 -126 110 99 110 -67 -79 90 12 -358 -252 148
2920 148 -155 6 169 294 28 -232 27 158 200 91 -76 75 -294 -125 24 56 -177 -222 -97 -241 -222
2941 -222 -73 -130 -229 -186 64 292 -77 14 404 -42 66 146 205 159 20 3 94 -54 146 -6 85 13 -46 -400
2965 -400 -68 -44 -310 12 -146 -29 -280 -32 293 -40 -105 7 68 72 2 459 43 -62 209 12 220 210
2987 210 -48 377 9 31 193 -142 -4 31 -126 -361 -156 -145 -9 -49 -191 -149 171 9 51 112 130 93 88 63
3011 63 -71 225 223 4 -6 -29 190 180 -93 73 -162 -17 0 -160 -98 -99 -228 -84 -124 144 -7 -73 -22 -195
3035 -195 -180 159 162 139 -67 64 94 -14 -99 109 222 293 -11 118 42 -34 185 9 -105 -4 163 -27 47
3058 47 -65 21 -138 -59 -34 -27 -159 -157 -141 87 -121 206 -107 213 120 -128 -17 120 290 -64 54 139 102 323
$$ packed form
2894d2O2n7o8Q9K6J86m00J44j8Q1K0p5M1p1J3n7K36j1J1j77j2J69p8l70J06M00
2920A48l03J61J63J25k66k60K59J31M2j09j67J51l69J69J49L2k33m5J25j44J9
2941b22J49n7r9M3K50K28l69R1L90m46J08Q0N9m6j39j7R1j48K00j52R1p2n9l54
2965d00L32K4k66L22j58J17k51K48L25l33o5J12O1Mp0M57m16j05K71j97K08j0
2987B10k58M25l68K2J62l35J38L5j57k35K05J1J36m0j42M2L20j62M2O1J8l7nk5
3011F3j34K96kk19j0k3K19j0k73J66k35J45J7j60O2jj29J44m0K68j51o6N1j73
3035a95J5L39Lk3k06J31L0j08q5K08J13P1l04J29p6p6K19j76j14J01J67j90P4
3058D7j12Q6j59P9K5Pj32KJ6K28k08L27l13L20r3k48J11J37J70l54J18Q5l7K21
$$ plain form
3082 323 191 73 250 36 63 64 47 -3 -135 -79 -44 -215 -24 -106 -29 -26 -47 -89 -122 7 -161 -84 33 -81 117
3107 117 111 -55 -28 265 117 105 246 43 182 -144 -36 2 25 -40 -177 -173 -329 -263 -114 -13 -158 -358 -52
3130 -52 -53 -18 71 85 -1 -46 -187 -4 -14 272 75 135 353 174 -80 -11 108 17 -110 20 -119 -37 -22 35 -167
3155 -167 -215 47 -111 -55 -32 108 -27 70 180 74 261 62 248 79 58 88 415 -110 7 46 67 85 94 118
3179 118 -97 147 102 -113 -221 99 -313 -91 -356 -106 233 4 109 -158 -7 -190 -50 -94 98 26 -5
3200 -5 198 227 111 134 -63 -135 -51 239 -63 73 162 11 -20 -314 -59 -151 -153 -67 -156 -260 -9 291 -138 -124 -59
3225 -59 152 182 95 260 106 156 148 119 20 198 430 309 281 48 89 -20 275 -171 -17 -45 -114 -34 -76 -461 -170
3250 -170 -135 -220 -180 -157 -92 48 92 30 -137 -152 361 154 24 -57 78 223 163 35 -22 141 216 -205 72 4
$$ packed form
3082C23j32j18J77k14K7Jj7n0j32N6L5j71J91q2P7Lk1m2l3J29j68P7J17j14J98
3107A17oj66K7K93j48j2J41k03J39l26J08L8K3o5j37Mj56O6J49J01j45k00L06
3130e2jL5Q9J4q6m5j41J83j0K86j97O0K18j79k54O9J19r1j27J30j39Q2J5N7k02
3155a67m8K62j58N6K3J40j35R7J10j06J87j99J86j69k1L0L27n25J17L9K1J8RK4
3179A18k15K44m5k15j08L20m12K22k65K50L39k29J05k67J51j83J40m4J92p2l1
3200eK03K9j16K3j97p2Q4K90l02J36Q9j51l1k94K55r2kQ6q9j04K51L00m29J4O5
3225e9K11L0q7J65j54N0qk9r9J78K32j21k8k33M1j09K95m46J54k8o9Q0m2l85K91
3250a70L5q5M0K3O5J40M4o2j67j5N13k07j30q1J35J45o0j28n7J63P5m21K77o8
$$ plain form
3274 4 167 -195 -227 -3 -189 35 67 -61 -171 -36 -240 -12 140 75 -66 132 -15 199 311 -141 110 197
3296 197 141 31 -80 -5 153 -55 -36 187 328 -32 22 165 10 -26 -178 -291 -191 215 60 -1 50 -192
3318 -192 128 90 -5 47 -56 177 113 66 14 105 255 117 39 99 143 95 130 -94 81 38 -53 -209 -133 88 -27
3343 -27 -70 182 -53 -18 -44 28 -42 -102 -128 0 216 75 40 165 140 -285 -244 36 4 256 27 149 78 -179
$$ packed form
3274DJ63l62l2K24j86K24L2j28j10J35k04K28J52o5j41J98j47K14J12m52K51Q7
3296A97n6j10j11P5J58k08J9K23J41l60N4J43j55l6j52j13J00M06j55o1N1k42
3318a92L20l8r5N2j03K33o4m7n2R1J50j38p8O0M4m8L5k24J75m3r1j56P6K21j15
3343b7m3K52k35L5k6P2p0o0k6J28K16j41l5J25k5m25M1K80l2K52k29J22p1k57
$$ [...]
8191E7
##END NTUPLES=NMR FID
##END=
