##TITLE=1H_SR111_k1
 D2O
 8 sc, 
 15.03.2022
##JCAMPDX= 6.0         $$ Bruker NMR JCAMP-DX V2.0
##DATA TYPE= NMR FID
##DATA CLASS= NTUPLES
##ORIGIN= UXNMR, Bruker Analytische Messtechnik GmbH
##OWNER= root
$$ XWIN-NMR		Version 3.5
$$ Tue Mar 15 13:02:40 2022 Russian Standard Time (UT+4h)  she@DPX200
##.OBSERVE FREQUENCY= 200.131346
##.OBSERVE NUCLEUS= ^1H
##.DELAY= (6, 6)
##.ACQUISITION MODE= SIMULTANEOUS
##.ACQUISITION SCHEME= undefined
##.AVERAGES= 8
##.DIGITISER RES= 18
##SPECTROMETER/DATA SYSTEM= spect
##.PULSE SEQUENCE= zg30
##.SOLVENT NAME= D2O
##.SHIFT REFERENCE= (INTERNAL, D2O, 0, 15.7039)
##AUDIT TRAIL= $$ (NUMBER, WHEN, WHO, WHERE, WHAT)
$$ ##TITLE= Audit trail, XWIN-NMR		Version 3.5
$$ ##JCAMPDX= 5.01
$$ ##ORIGIN= Bruker BioSpin GmbH
$$ ##OWNER= she
$$ F:/spectra/data/she/nmr/H-F/1/audita.txt
$$ ##AUDIT TRAIL=  $$ (NUMBER, WHEN, WHO, WHERE, WHAT)
(   1,<2022-03-15 13:00:53.96 +0400>,<she>,<DPX200>,
      <created by zg, POWCHK disabled, PULCHK disabled
       configuration hash MD5:
       00 E9 B6 7A A2 85 ED C7 34 08 36 98 17 FE 4E 26
       data hash MD5: 16K
       6E FE 88 FB 0C 23 CD 8F 19 FC EF 1B FE E9 8F 91>)
$$ ##END=
$$ 
$$ hash MD5
$$ 14 54 A9 DB 8E 32 2A 79 B3 4C 76 B3 A2 52 34 DD
##$RELAX= 
##$RELAX= 
##$RELAX= 
##$RELAX= 
##$RELAX= 
##$RELAX= 
$$ Bruker specific parameters
$$ --------------------------
##$DU= <F:/spectra>
##$EXPNO= 1
##$NAME= <H-F>
##$PROCNO= 1
##$TYPE= <nmr>
##$USER= <she>
##$AMP= (0..31)
100 100 100 100 100 100 100 100 100 100 100 100 100 100 100 100 100 100 
100 100 100 100 100 100 100 100 100 100 100 100 100 100 
##$AQSEQ= 0
##$AQ_mod= 1
##$AUNM= <au_zg>
##$AUTOPOS= <>
##$BF1= 200.13
##$BF2= 200.13
##$BF3= 200.13
##$BF4= 200.13
##$BF5= 200.13
##$BF6= 200.13
##$BF7= 200.13
##$BF8= 200.13
##$BYTORDA= 1
##$CFDGTYP= 0
##$CFRGTYP= 5
##$CHEMSTR= <none>
##$CNST= (0..31)
1 1 145 1 1 1 1 1 1 1 1 1 1 1 1 1 1 1 1 1 1 1 1 1 1 1 1 1 1 1 1 1 
##$CPDPRG= <>
##$CPDPRG1= <>
##$CPDPRG2= <>
##$CPDPRG3= <>
##$CPDPRG4= <mlev>
##$CPDPRG5= <mlev>
##$CPDPRG6= <mlev>
##$CPDPRG7= <mlev>
##$CPDPRG8= <mlev>
##$CPDPRGB= <>
##$CPDPRGT= <>
##$D= (0..31)
0 1.2 0 0 0 0 0 0 0 0.06 0 0.03 0 0 0 0 0.0002 0 0 0 0 0 0 0 0 0 0 0 0 
0 0 0 
##$DATE= 1647334853
##$DBL= (0..7)
120 120 120 120 120 120 120 120 
##$DBP= (0..7)
150 150 150 150 150 150 150 150 
##$DBP07= 0
##$DBPNAM0= <>
##$DBPNAM1= <>
##$DBPNAM2= <>
##$DBPNAM3= <>
##$DBPNAM4= <>
##$DBPNAM5= <>
##$DBPNAM6= <>
##$DBPNAM7= <>
##$DBPOAL= (0..7)
0.5 0.5 0.5 0.5 0.5 0.5 0.5 0.5 
##$DBPOFFS= (0..7)
0 0 0 0 0 0 0 0 
##$DE= 6
##$DECBNUC= <off>
##$DECIM= 32
##$DECNUC= <off>
##$DECSTAT= 4
##$DIGMOD= 1
##$DIGTYP= 9
##$DL= (0..7)
0 120 120 120 120 120 120 120 
##$DP= (0..7)
150 150 150 150 150 150 150 150 
##$DP07= 0
##$DPNAME0= <>
##$DPNAME1= <>
##$DPNAME2= <>
##$DPNAME3= <>
##$DPNAME4= <>
##$DPNAME5= <>
##$DPNAME6= <>
##$DPNAME7= <>
##$DPOAL= (0..7)
0.5 0.5 0.5 0.5 0.5 0.5 0.5 0.5 
##$DPOFFS= (0..7)
0 0 0 0 0 0 0 0 
##$DQDMODE= 0
##$DR= 18
##$DS= 0
##$DSLIST= <SSSSSSSSSSSSSSS>
$$ [...]
##$SUBNAM2= <"">
##$SUBNAM3= <"">
##$SUBNAM4= <"">
##$SUBNAM5= <"">
##$SUBNAM6= <"">
##$SUBNAM7= <"">
##$SUBNAM8= <"">
##$SUBNAM9= <"">
##$SW= 18.0517287032376
##$SWIBOX= (0..15)
0 0 2 0 0 0 0 0 0 0 0 0 0 0 0 0 
##$SW_h= 3612.71676300578
##$TD= 16384
##$TD0= 1
##$TE= 0
##$TE2= 300
##$TE3= 300
##$TEG= 300
##$TL= (0..7)
0 120 120 120 120 120 120 120 
##$TP= (0..7)
150 150 150 150 150 150 150 150 
##$TP07= 0
##$TPNAME0= <>
##$TPNAME1= <>
##$TPNAME2= <>
##$TPNAME3= <>
##$TPNAME4= <>
##$TPNAME5= <>
##$TPNAME6= <>
##$TPNAME7= <>
##$TPOAL= (0..7)
0.5 0.5 0.5 0.5 0.5 0.5 0.5 0.5 
##$TPOFFS= (0..7)
0 0 0 0 0 0 0 0 
##$TUNHIN= 0
##$TUNHOUT= 0
##$TUNXOUT= 0
##$USERA1= <user>
##$USERA2= <user>
##$USERA3= <user>
##$USERA4= <user>
##$USERA5= <user>
##$V9= 5
##$VALIST= <valist>
##$VCLIST= <CCCCCCCCCCCCCCC>
##$VD= 0
##$VDLIST= <DDDDDDDDDDDDDDD>
##$VPLIST= <PPPPPPPPPPPPPPP>
##$VTLIST= <TTTTTTTTTTTTTTT>
##$WBST= 1024
##$WBSW= 4
##$XGAIN= (0..3)
0 0 0 0 
##$XL= 0
##$YL= 0
##$YMAX_a= 88896
##$YMIN_a= -132226
##$ZGOPTNS= <>
##$ZL1= 120
##$ZL2= 120
##$ZL3= 120
##$ZL4= 120
##$ABSF1= 10
##$ABSF2= 0
##$ABSG= 5
##$ABSL= 3
##$ALPHA= 0
##$AQORDER= 0
##$ASSFAC= 0
##$ASSFACI= 0
##$ASSFACX= 0
##$ASSWID= 0
##$AUNMP= <proc_1d>
##$AZFE= 0.1
##$AZFW= 0.1
##$BCFW= 1
##$BC_mod= 2
##$BYTORDP= 1
##$COROFFS= 0
##$CY= 11.3945322036743
##$DATMOD= 1
##$DC= 2
##$DFILT= <>
##$DTYPP= 0
##$F1P= 2.36226072786647
##$F2P= -0.459571619588291
##$FCOR= 0.5
##$FTSIZE= 0
##$FT_mod= 4
##$GAMMA= 1
##$GB= 0.15
##$INTBC= 1
##$INTSCL= 1
##$ISEN= 128
##$LB= 0.24
##$LEV0= 0
##$LPBIN= 0
##$MAXI= 10000
##$MC2= 0
##$MEAN= 0
##$ME_mod= 0
##$MI= 1.114404
##$NCOEF= 0
##$NC_proc= 0
##$NLEV= 6
##$NOISF1= 3.799351
##$NOISF2= 2.8
##$NSP= 1
##$NTH_PI= 0
##$NZP= 0
##$OFFSET= 15.70392
##$PC= 1
##$PHC0= -16954.13
##$PHC1= 14.20078
##$PH_mod= 1
##$PKNL= yes
##$PPARMOD= 0
##$PSCAL= 0
##$PSIGN= 0
##$REVERSE= no
##$SF= 200.130013532006
##$SI= 16384
##$SIGF1= 3
##$SIGF2= 2
##$SINO= 400
##$SIOLD= 16384
##$SREGLST= <1H.CDCl3>
##$SSB= 0
##$STSI= 0
##$STSR= 0
##$SW_p= 3612.71676300578
##$SYMM= 0
##$S_DEV= 0
##$TDeff= 0
##$TDoff= 0
##$TI= <>
##$TILT= no
##$TM1= 0
##$TM2= 0
##$TOPLEV= 0
##$USERP1= <user>
##$USERP2= <user>
##$USERP3= <user>
##$USERP4= <user>
##$USERP5= <user>
##$WDW= 1
##$XDIM= 8192
##$YMAX_p= 0
##$YMIN_p= 0
$$ End of Bruker specific parameters
$$ ---------------------------------
##NTUPLES= NMR FID
##VAR_NAME=  TIME,          FID/REAL,        FID/IMAG
##SYMBOL=    X,             R,               I
##VAR_TYPE=  INDEPENDENT,   DEPENDENT,       DEPENDENT
##VAR_FORM=  AFFN,          ASDF,            ASDF
##VAR_DIM=   8192,          8192,            8192
##UNITS=     SECONDS,       ARBITRARY UNITS, ARBITRARY UNITS
##FACTOR=    0.0002768,     1,               1
##FIRST=     0,             0,               0
##LAST=      2.2672688,     0,               0
##MIN=       0,             -132226,         0
##MAX=       2.2672688,     88896,           0
$$ Real data points
##PAGE= N=1
##DATA TABLE= (X++(R..R)), XYDATA
0 0 0 0 0 0 0 0 0 0 0 0 0 0 0 0 -8 8 -8 8 -8 14 -16 16 -24 24 -30 32 -40 46 -49 57 -66 78 -89 98 -113 127
36 127 -142 159 -178 198 -221 246 -272 302 -332 369 -406 447 -494 544 -600 660 -727 803 -887
55 -887 981 -1090 1215 -1359 1528 -1730 1981 -2295 2702 -3260 4069 -5356 7733 -13638 65026
70 65026 46033 -66002 -38793 -39036 -55155 -33951 45918 80656 73767 37409 -12727 -68329 -76239
83 -76239 -51778 -19453 13292 57922 70470 29803 -29154 -53356 -58592 -55340 -22751 38557 72344
96 72344 58063 25342 -2279 -36025 -61672 -47755 2507 46867 60447 51742 33654 -2855
108 -2855 -50054 -68891 -43652 -3631 28732 50378 50156 22240 -15541 -48202 -69934 -59662 -8053
121 -8053 41762 50931 39178 29063 2762 -42911 -66546 -40790 2803 33224 53543 59599 34614
134 34614 -7953 -37092 -47037 -42345 -12821 30986 52218 42808 22839 -6538 -44432 -62012 -42033
147 -42033 -7904 17767 37400 47274 27804 -14298 -45005 -46844 -31296 -8691 23236 51778
159 51778 52161 24804 -6756 -31360 -44611 -34734 -2542 29493 44293 43926 26494 -9764 -43134
172 -43134 -50156 -33376 -10341 16897 42219 45600 18216 -17235 -37589 -45304 -39308 -11186 26771
185 26771 46992 40650 22059 -2556 -32027 -46985 -32707 -1510 26004 43115 46136 26596
197 26596 -7655 -33814 -41615 -34250 -11915 20960 42747 37603 15710 -8173 -31879 -48515 -39489
210 -39489 -7586 21505 35225 36796 23672 -6233 -34488 -40254 -26549 -5641 20165 43036
222 43036 44258 21344 -7495 -27673 -37294 -31010 -6021 23183 38028 35810 19238 -8563 -36087
235 -36087 -44185 -29730 -7415 15073 34969 39675 18949 -12783 -32577 -36979 -30359 -9290 22070
248 22070 42338 37950 19045 -3063 -25579 -39374 -30570 -3881 21378 36086 37584 21954 -7431
261 -7431 -30725 -36071 -28652 -11794 14615 36647 35207 13729 -8992 -25973 -37317 -32755 -7950
274 -7950 20400 32763 30938 19828 -2733 -28410 -36422 -22884 -2677 17670 34933 37576 18041
287 18041 -8079 -25128 -32572 -29076 -7312 21573 34517 28096 14385 -4514 -28684 -41169 -29253
300 -29253 -4187 16754 29227 32426 19563 -6753 -28157 -34010 -25212 -6127 17915 35373 33778
313 33778 17646 -2900 -22316 -34264 -27826 -4178 18934 29416 29225 18631 -4238 -27861 -35397
326 -35397 -24392 -6737 12951 29222 31423 15171 -8247 -24159 -30720 -26535 -7259 18263 32080
339 32080 28655 15333 -3115 -23739 -32560 -21960 -2908 14917 29746 33768 17557 -9287 -25554
352 -25554 -27970 -23738 -8984 15078 31371 28148 13177 -5517 -25218 -34629 -24754 -3355 14127
365 14127 25573 29888 18651 -5534 -25636 -29791 -20925 -5169 15004 31086 30647 14817 -4323
378 -4323 -20445 -29896 -25571 -4786 17622 26911 25069 15297 -3663 -25057 -32410 -22083 -4789
391 -4789 12080 26458 28914 14243 -7006 -21396 -26868 -23349 -6486 17187 29978 25199 12715
404 12715 -1849 -19395 -30624 -22585 -2113 15892 25384 26938 15165 -6376 -23227 -26887 -21008
417 -21008 -7450 13273 28998 26634 10854 -6299 -20666 -28944 -23375 -4364 14939 25058 26082
430 26082 16335 -4849 -23907 -27527 -17838 -3945 11471 26465 29545 15227 -5773 -20843 -25971
443 -25971 -21034 -5432 13962 24509 23850 14605 -3301 -22772 -29477 -19156 -3485 10195 22501
456 22501 26715 14320 -6484 -20586 -23753 -19409 -5998 13844 27100 24187 11429 -3153 -17602
469 -17602 -26641 -20795 -2717 13997 23121 24170 14198 -5468 -21696 -24894 -18857 -6633 11663
482 11663 26902 24865 8852 -5054 -16076 -25128 -23885 -5740 16210 24488 21084 12562 -1606
495 -1606 -18140 -25919 -19295 -4433 11533 23971 25228 12404 -5246 -17442 -22117 -19747 -6581
508 -6581 12282 23680 21365 10614 -2712 -18087 -26552 -19385 -2340 11390 19016 21596 14991
521 14991 -3621 -20891 -24309 -15698 -3561 10736 22886 23341 11656 -3617 -16194 -24112 -19402
534 -19402 -2651 13656 20209 20019 13704 -2717 -20243 -24730 -15767 -3775 8725 20688 23737
547 23737 11880 -5956 -17081 -21553 -18640 -4845 12821 21519 19665 12053 -1741 -17528 -23726
560 -23726 -15927 -2743 9564 19907 22855 12178 -5515 -16925 -19666 -16780 -7026 10183 22979
573 22979 20701 8432 -3586 -15179 -22308 -18717 -4071 10758 19172 20139 11924 -3607 -17314
586 -17314 -20643 -14519 -4152 8591 20691 22745 10191 -4664 -14160 -19227 -18221 -4780 12619
599 12619 20056 16945 10370 -763 -16608 -23690 -15907 -2166 8576 17292 20603 11749 -4619 -16103
613 -16103 -18941 -15956 -5310 10617 20754 18508 9715 -773 -13894 -21923 -16545 -2015 9833
626 9833 16784 19078 12523 -2884 -16732 -19380 -14141 -5002 7708 18564 19324 9463 -3268 -13197
640 -13197 -19662 -16367 -3769 9851 16871 17077 10597 -2212 -15140 -19053 -13440 -3099 8158 17999
654 17999 19363 9911 -3852 -13546 -17427 -15367 -4756 9824 18619 16095 8640 -1487 -13972 -20616
668 -20616 -15360 -3126 8100 15914 18021 10274 -3393 -13979 -17113 -14273 -5091 8762 19018
681 19018 17150 8653 -1100 -11056 -18702 -15805 -2668 9558 15243 15841 10615 -1430 -14208 -17825
695 -17825 -12869 -4211 6492 16837 17308 7755 -3527 -11722 -16669 -14970 -3712 9690 15817 15130
709 15130 9908 -948 -13442 -18293 -11950 -1714 7108 14474 17621 10243 -3145 -13605 -16313 -12600
723 -12600 -4238 7428 16051 15659 8211 -2031 -12302 -18204 -13925 -2759 7280 13523 15940 10338
737 10338 -2129 -13472 -15725 -11321 -3798 6494 16100 16923 8116 -2610 -10089 -15372 -13967 -3263
751 -3263 8645 14519 13619 8265 -1356 -12414 -17067 -12394 -3467 5851 14472 15797 7728 -3338 -10511
766 -10511 -14094 -13177 -4670 8662 15431 13718 7391 -629 -10583 -15959 -11753 -1981 6751 13517 15260
781 15260 8686 -2974 -11786 -13768 -11269 -4775 5915 14846 14325 6454 -2612 -10285 -15146 -12369 -2831
796 -2831 7333 12463 13642 9599 -1756 -12330 -14664 -9756 -2659 5639 13447 15350 7964 -2125
810 -2125 -9923 -13677 -12284 -3288 7604 13098 11896 7005 -629 -10515 -15797 -11569 -2300 5503 11449
825 11449 13546 8153 -2639 -10564 -12574 -10296 -3689 7011 13917 12875 6547 -967 -8795 -13982
839 -13982 -11613 -1841 7116 11936 12098 7548 -1980 -10757 -13626 -10666 -3984 5668 13144 13141 5915 -2568
855 -2568 -8809 -12620 -11638 -3676 6600 12403 12432 7339 -1031 -9810 -13001 -9409 -2371 5051 11673 13561
871 13561 7706 -2225 -9230 -12081 -10089 -3495 5752 11943 11266 5818 -1153 -9082 -13906 -10101 -1707
886 -1707 5524 10129 11889 7631 -2233 -9719 -11828 -8581 -2930 5760 12421 12061 6014 -1649 -7816
901 -7816 -12368 -10411 -1841 6643 10227 10445 7100 -1189 -9954 -12944 -8938 -2766 4417 10906 11665 5864
917 5864 -2436 -8141 -10868 -10295 -3340 6327 11700 10655 6092 -830 -8313 -12145 -8885 -1581 5017
932 5017 10115 11606 6426 -2261 -8797 -10765 -9011 -3303 4849 10887 10533 5245 -1732 -7738 -11616
947 -11616 -9415 -2028 5597 9940 10565 6773 -1515 -8880 -10654 -7831 -2426 4615 10909 11477 5726
962 5726 -1813 -7570 -10422 -9014 -2479 5499 9903 9565 5682 -1200 -8771 -11624 -8302 -1927 4193
977 4193 9514 10949 5696 -2272 -7573 -9731 -8767 -2836 5958 10837 9782 5056 -549 -7139 -11121
992 -11121 -8312 -1623 4522 8840 9618 6221 -1878 -8318 -10130 -7907 -2728 4404 9766 9647 4338
1007 4338 -1345 -6378 -10107 -8994 -1832 5743 8725 8724 6045 -332 -7820 -10354 -6728 -1729 3738 9023
1023 9023 10087 5267 -2217 -7381 -9466 -8214 -2724 4894 9071 8556 4529 -753 -7562 -10984 -7745
1038 -7745 -1213 4082 7889 9443 5835 -1507 -7328 -9039 -7085 -2349 4454 9806 9597 4681 -1283
1053 -1283 -6126 -9335 -8137 -2102 4558 7837 8337 5242 -1466 -7626 -9267 -6566 -2159 3660 8709
1068 8709 9186 4651 -1557 -6283 -8593 -6951 -1943 4869 8693 8146 4812 -863 -6836 -9463 -6603
1083 -6603 -1466 3669 8216 8939 4521 -1994 -6664 -8402 -7467 -2292 4143 8311 7874 3864 -771 -6257
1099 -6257 -9387 -7268 -1101 4405 7384 8101 5303 -981 -6741 -8117 -6018 -1768 4015 8559 8138
1114 8138 3857 -1051 -5551 -8137 -7694 -1714 4658 7370 7074 4442 -824 -6860 -8596 -5950 -1292
1129 -1292 3526 7641 8472 4366 -1650 -5808 -7709 -6394 -1954 4432 8208 7567 3755 -888 -5863
1144 -5863 -8350 -6447 -1341 3622 6555 7685 4536 -1549 -6666 -7473 -5838 -2188 3176 7598 7537 3568
1160 3568 -1105 -5324 -7938 -6316 -1219 4068 6980 7173 4519 -742 -6121 -7700 -5311 -1260 3275
1175 3275 7081 7502 3708 -1156 -5438 -7690 -6520 -1608 3923 6650 6336 3662 -599 -5537 -7914
1190 -7914 -5364 -1174 3381 6657 7214 3817 -1343 -5059 -6627 -5393 -1865 3832 7330 6667 3062
1205 3062 -843 -4937 -7659 -6086 -1029 3368 6191 6584 4098 -1182 -5990 -6845 -5026 -1632 2966
1220 2966 6891 7084 3177 -1633 -4533 -6747 -5893 -1291 3819 6284 6278 3908 -851 -5572 -7097 -4828
1236 -4828 -1152 2452 5999 7059 3732 -1651 -4993 -6284 -5276 -1590 3534 6229 6066 3269 -839
1251 -839 -4762 -7309 -5350 -833 3176 5622 6413 3852 -1061 -4982 -6157 -4654 -1371 3018 6721
1266 6721 6613 2747 -1099 -4642 -6801 -5515 -1295 3438 5588 5788 3353 -986 -5091 -6546 -4892
1281 -4892 -1348 2769 6206 6323 3093 -1084 -4136 -5944 -5174 -1289 3640 6037 5406 3330 -767 -4735
1297 -4735 -6320 -4771 -1074 2631 5638 5916 3137 -1364 -4809 -5664 -4640 -1466 3043 5849 5281 3042
1313 3042 -901 -4337 -6197 -4737 -787 3007 5189 5555 3429 -931 -4869 -5754 -4132 -1379 2708
1328 2708 5654 5838 2686 -1063 -3968 -5754 -4705 -1207 3062 5385 5192 3046 -630 -4468 -5886
1343 -5886 -4210 -917 2385 5042 5630 3101 -1210 -4181 -5367 -4284 -1197 2837 5715 4971 2474
1358 2474 -685 -4165 -5933 -4369 -861 2823 4932 5217 2981 -1189 -4494 -5279 -3829 -1245 2425
1373 2425 5104 5067 2616 -744 -3949 -5335 -4573 -799 2876 4747 4783 2807 -642 -4092 -5445 -3921
1389 -3921 -905 2323 5098 5052 2451 -1007 -3725 -4971 -4141 -886 2863 5016 4443 2499 -694 -3945
1405 -3945 -5526 -3917 -1256 2442 4516 5078 2897 -882 -3938 -4850 -3783 -1259 2646 4861 4960 2344
1421 2344 -578 -3430 -5264 -4199 -864 2527 4374 4631 2857 -968 -4093 -4902 -3595 -963 2103
1436 2103 4476 4897 2426 -1041 -3525 -4550 -3863 -937 2772 4529 4218 2547 -650 -3747 -5245 -3514
1452 -3514 -634 2244 4214 4626 2849 -1039 -3712 -4386 -3651 -1237 2206 4552 4517 2054 -526 -3445
1468 -3445 -4764 -3773 -677 2129 3801 4316 2499 -765 -3459 -4173 -3228 -931 2006 4452 4417 2003
1484 2003 -837 -3137 -4325 -3742 -767 2323 4001 4252 2236 -657 -3502 -4431 -3113 -1059 1913 4304
1500 4304 4382 2343 -1006 -3025 -3842 -3291 -962 2312 4203 4208 2353 -479 -3258 -4638 -3411 -693 1962
1517 1962 3776 4213 2479 -873 -3430 -3710 -3534 -1038 2050 4268 3913 2045 -850 -2768 -4149 -3627
1533 -3627 -772 2111 3645 3969 2443 -305 -3170 -4101 -2793 -788 1730 3952 4052 2009 -846 -2919
1549 -2919 -3865 -3372 -1098 2079 3529 3446 2226 -540 -2847 -4470 -3097 -742 1841 3463 4114 2445
1565 2445 -834 -3079 -3675 -3167 -1369 1867 3939 3624 1875 -630 -2765 -3944 -3152 -956 1707 3441
1581 3441 3748 2326 -347 -2961 -3893 -3056 -1103 1518 3655 3877 2021 -369 -2819 -3883 -3048 -924
1597 -924 1759 3454 3668 1963 -531 -2699 -3807 -2751 -914 1464 3259 3447 2296 -592 -2613 -3607
1613 -3607 -3237 -1008 1883 3262 3486 1922 -170 -2636 -3874 -2918 -548 1668 3225 3388 2495 -599
1629 -599 -2994 -3489 -2966 -919 1852 3565 3391 1554 -480 -2284 -3515 -3036 -850 1642 3013 3391
1645 3391 2082 -73 -2698 -3438 -2718 -951 978 3038 3584 1867 -357 -2192 -3017 -2737 -878 1720
1661 1720 3174 2993 2139 -223 -2313 -3318 -2701 -789 1153 2904 3139 2170 -512 -2276 -3041 -2647 -984
1678 -984 1109 3181 3274 2049 -227 -1980 -3431 -2681 -636 1212 2645 3215 1946 -187 -2337 -3312
1694 -3312 -2669 -859 1209 2773 3023 1624 -120 -1828 -3230 -2867 -751 1415 2969 3019 2035 -17
1710 -17 -2252 -3237 -2725 -818 1292 2546 3161 1857 -304 -1973 -2915 -2624 -759 1366 2791 3060 1647
1727 1647 -236 -2021 -2923 -2523 -659 1224 2415 2873 1960 -159 -2221 -3014 -2598 -782 1325 2821
1743 2821 3014 1457 -180 -1899 -2848 -2505 -728 1310 2563 2798 1819 24 -1979 -3124 -2244 -777
1759 -777 910 2870 3050 1846 -442 -1882 -2792 -2478 -957 1319 2371 2527 1778 126 -1942 -2923 -2562
1776 -2562 -661 1077 2614 2819 1806 -238 -1785 -2643 -2072 -980 1008 2506 2767 1594 -139 -1851
1792 -1851 -2539 -2462 -1082 1153 2581 2532 1750 5 -1865 -2842 -2142 -958 725 2466 2816 1795 -302
1809 -302 -1759 -2570 -2333 -843 1016 2297 2739 1831 183 -1858 -2753 -2143 -941 663 2162 2547 1756
1826 1756 -54 -1719 -2758 -2166 -1073 967 2544 2659 1554 153 -1541 -2558 -2348 -842 847 2346
1842 2346 2533 1557 -11 -1497 -2357 -2185 -976 801 2153 2505 1416 -180 -1600 -2746 -2636 -766
1858 -766 855 2132 2477 1725 96 -1642 -2340 -2171 -693 540 2056 2315 1834 -2 -1442 -2292 -2363
1875 -2363 -850 872 2443 2437 1470 26 -1417 -2349 -2199 -984 697 2112 2304 1583 221 -1578 -2157
1892 -2157 -2227 -1055 680 2108 2189 1462 80 -1380 -2222 -2180 -792 674 1789 2180 1584 209 -1472
1909 -1472 -2402 -2259 -991 700 2225 2307 1587 -111 -1206 -2254 -2231 -997 589 2019 2227 1676 224
1926 224 -1471 -2253 -2102 -1081 591 2052 2193 1577 137 -1383 -2073 -2003 -863 655 1824 2027 1417
1943 1417 90 -1261 -2169 -2011 -974 459 1666 2384 1410 317 -1210 -2241 -2024 -895 509 1849
1959 1849 2361 1547 207 -1155 -2205 -2000 -984 610 1519 2202 1711 248 -1461 -2376 -2083 -1125 559
1976 559 1708 2212 1699 313 -1184 -1910 -1988 -984 531 1724 2283 1326 37 -1227 -2298 -1820 -937
1993 -937 652 1736 2038 1509 318 -966 -1973 -1845 -1132 578 1933 2032 1724 491 -942 -2019 -1897
2010 -1897 -970 446 1597 2222 1366 271 -1238 -1833 -1645 -844 591 1579 2052 1378 332 -1109 -1860
2027 -1860 -1817 -940 356 1341 1870 1511 229 -1013 -1824 -2025 -945 173 1344 2134 1423 82 -1154
2044 -1154 -1575 -1993 -978 423 1498 2270 1585 452 -947 -1774 -1776 -1008 386 1294 1932 1362 471 -877
2062 -877 -1975 -1772 -1305 136 1300 2189 1420 414 -945 -1970 -1888 -1082 267 1239 1976 1338 382 -844
2080 -844 -1816 -1655 -1110 360 1562 2189 1669 109 -738 -1895 -1685 -1124 367 1310 2098 1661 135 -826
2098 -826 -1555 -1793 -969 49 1236 1934 1536 423 -687 -1720 -1751 -920 -38 1379 1907 1504 678 -631
2116 -631 -1699 -1778 -1008 98 1259 1681 1524 399 -739 -1511 -1714 -920 138 1375 1551 1444 355 -595
2134 -595 -1553 -1697 -1054 53 1325 1850 1367 718 -771 -1723 -1960 -871 100 1168 1887 1312 408 -648
2152 -648 -1526 -1811 -1072 117 1279 1839 1337 778 -523 -1593 -1663 -949 -36 1284 1944 1606 229 -603
2170 -603 -1472 -1676 -947 -147 1054 1567 1492 595 -557 -1486 -1671 -1310 184 1211 1859 1563 709 -636 -1394
2189 -1394 -1795 -1011 -78 1150 1920 1482 652 -528 -1348 -1609 -1255 -178 1105 1699 1401 661 -391 -1452
2207 -1452 -1524 -1027 -119 1027 1707 1535 727 -429 -1519 -1707 -1038 -206 1101 1486 1513 873 -588 -1065 -1709
2226 -1709 -1364 -385 908 1820 1364 800 -577 -1335 -1645 -1101 4 759 1576 1252 568 -384 -1367 -1715 -1154
2245 -1154 -90 833 1619 1412 729 -273 -1354 -1756 -1130 -112 895 1670 1271 891 -383 -1296 -1801 -1319
2263 -1319 -343 898 1365 1575 653 -407 -1326 -1824 -1020 -284 914 1758 1567 830 -348 -1121 -1651 -1250
2281 -1250 42 797 1600 1518 659 -276 -1265 -1523 -1422 -77 784 1413 1626 840 -460 -1392 -1815 -1273 -294
2300 -294 878 1685 1479 811 -625 -1246 -1512 -1187 -331 910 1792 1446 1010 -496 -1365 -1226 -1183 -106 837
2319 837 1645 1509 742 -42 -1271 -1537 -1273 -178 713 1392 1457 930 -43 -1286 -1558 -1076 -317 516 1480
2338 1480 1534 805 -185 -1282 -1377 -1152 -413 655 1460 1492 985 -217 -1071 -1595 -1255 -490 662 1282 1629
2357 1629 728 -174 -1255 -1460 -1409 -256 774 1532 1361 687 -408 -943 -1709 -1348 -565 634 1619 1559 1047
2376 1047 51 -946 -1597 -1037 -217 608 1561 1639 1086 76 -805 -1491 -1115 -211 871 1400 1457 979 -101
2395 -101 -744 -1725 -1323 -288 722 1142 1336 877 -315 -1169 -1512 -1573 -388 753 1265 1686 970 -112
2413 -112 -1102 -1622 -1462 -427 625 1330 1563 820 -181 -1215 -1685 -1158 -584 581 1258 1460 1018 -162
2431 -162 -784 -1484 -1185 -268 699 1240 1256 982 72 -1091 -1599 -1326 -477 551 1396 1521 804 -311 -1071
2450 -1071 -1674 -1410 -401 626 1117 1330 1041 115 -855 -1558 -1269 -309 593 1360 1572 1087 117 -838 -1369
2469 -1369 -1443 -349 456 1437 1509 938 -71 -842 -1502 -1323 -432 356 1268 1474 1174 14 -1013 -1465 -1462 -545
2489 -545 298 1261 1735 1190 -142 -1147 -1261 -1463 -695 506 1248 1644 1230 -31 -952 -1923 -1338 -538 291
2508 291 1455 1680 782 -31 -966 -1593 -1294 -444 255 1401 1343 1047 242 -928 -1624 -1329 -816 503 1432
2527 1432 1635 1009 -34 -932 -1678 -1439 -863 290 1373 1493 1111 349 -635 -1549 -1543 -313 368 1248 1624
2546 1624 1115 250 -1054 -1601 -1459 -499 324 1126 1485 889 -149 -776 -1427 -1401 -767 495 1206 1362 1003
2565 1003 145 -976 -1541 -1169 -597 472 1180 1505 1167 -110 -819 -1386 -1617 -826 318 1000 1438 1010
2583 1010 220 -756 -1479 -1418 -544 437 986 1626 984 266 -923 -1420 -1408 -664 465 1067 1343 1223 354 -884
2603 -884 -1414 -1377 -763 412 1213 1320 1325 303 -881 -1502 -1438 -653 156 1332 1721 1091 200 -857 -1587 -1554
2623 -1554 -727 385 1151 1376 1178 559 -680 -1482 -1662 -893 155 1261 1691 1366 347 -877 -1357 -1284
2641 -1284 -857 249 1173 1680 1234 199 -659 -1609 -1348 -679 382 1078 1262 1135 62 -690 -1518 -1405
2659 -1405 -563 190 1152 1765 1316 153 -714 -1272 -1313 -856 180 1202 1595 926 316 -744 -1482 -1510 -395
2678 -395 413 1023 1814 1337 339 -672 -1325 -1488 -1103 112 1162 1502 1162 318 -660 -1450 -1509 -755 614
2697 614 1343 1603 1417 515 -727 -1328 -1431 -698 -17 1083 1435 1179 236 -641 -1360 -1534 -581 384 1030
2716 1030 1366 1291 404 -827 -1317 -1277 -639 300 892 1400 1391 -105 -795 -1270 -1373 -975 112 1102 1594 1042
2736 1042 306 -426 -1584 -1494 -839 274 1159 1854 880 586 -681 -1292 -1305 -1013 283 1083 1461 970 528
2755 528 -443 -1345 -1434 -927 355 1027 1477 1255 410 -766 -1415 -1327 -913 52 893 1717 1065 275 -661 -1113
2775 -1113 -1519 -1123 269 1094 1440 1152 471 -480 -1378 -1407 -1016 226 986 1566 1359 360 -669 -1553 -1376
2794 -1376 -925 0 1185 1239 1136 296 -645 -1130 -1411 -877 89 1139 1606 1405 492 -682 -1264 -1384 -812
2813 -812 65 1095 1562 838 615 -446 -1176 -1483 -879 172 880 1398 1222 409 -401 -1621 -1464 -619 -92
2832 -92 934 1452 1136 546 -559 -1434 -1306 -920 41 1288 1449 1386 532 -410 -1434 -1457 -791 -63 832 1423
2852 1423 1240 335 -636 -1182 -1043 -1015 67 1152 1473 1235 617 -581 -1453 -1232 -949 270 1051 1263 1587
2871 1587 524 -632 -1371 -1287 -1012 -392 1027 1569 1405 294 -456 -1239 -1624 -1130 -2 1133 1361 1348
2889 1348 465 -434 -1645 -1140 -585 219 1087 1564 1410 415 -626 -1309 -1389 -1036 -54 1136 1644 1214 650
2908 650 -259 -1289 -1457 -908 109 805 1303 1432 584 -526 -1330 -1258 -978 -52 892 1731 1327 473 -554
2927 -554 -1058 -1612 -929 123 1096 1253 1158 684 -438 -1139 -1489 -767 96 828 1586 1371 337 -686 -1370
2946 -1370 -1410 -1225 -102 980 1214 1069 356 -530 -1558 -1483 -706 74 849 1529 1510 545 -596 -1480 -1166
2965 -1166 -1125 -571 692 1395 1160 527 -374 -993 -1418 -805 105 1007 1354 998 618 -406 -1311 -1741 -798
2984 -798 -207 938 1538 1623 453 -384 -1406 -1303 -1081 82 1010 1343 1190 604 -204 -1480 -1370 -1138 -187
3003 -187 946 1040 1703 301 -582 -1067 -1137 -771 -88 911 1602 1044 549 -230 -958 -1263 -1073 421 815 1418
3023 1418 1473 477 -656 -1335 -1391 -968 -88 917 1544 1337 451 -240 -1182 -1543 -1011 221 701 1546 1016
3042 1016 501 -345 -1265 -1229 -760 -19 796 1471 1223 582 -327 -1049 -1423 -928 -273 1065 1257 823 332 -313
3062 -313 -1474 -1335 -1062 107 909 1282 1402 492 -445 -1126 -1259 -1235 -63 794 1419 1149 315 -97 -1012
3081 -1012 -1554 -1144 -60 779 1224 1196 650 -443 -1371 -1364 -969 -150 722 1473 1352 277 -517 -1029 -1481 -1063
3101 -1063 -37 863 1352 1123 605 -156 -1090 -1489 -853 93 708 1483 1398 713 -576 -1159 -1303 -834 -208
3120 -208 977 1066 864 535 -311 -1287 -1517 -1125 -13 745 1475 1466 688 -363 -1314 -1178 -1032 -316 610 1310
3140 1310 1220 402 -158 -1039 -1354 -1033 -218 909 1002 1423 599 -249 -1237 -1364 -853 -74 768 1240 1432 640
3160 640 -537 -1011 -1222 -1284 -72 1089 1334 1131 488 51 -1095 -1558 -951 -2 794 1184 1291 513 -371
3179 -371 -1131 -1260 -812 -276 850 1581 1267 646 -322 -1013 -1609 -1105 227 959 1184 1327 652 -496 -1462
3198 -1462 -1345 -865 -317 681 1471 1374 364 -484 -1078 -1383 -996 -154 788 949 1254 732 -64 -1106 -1405
3217 -1405 -931 -65 750 1352 1349 793 -305 -962 -1077 -1340 -171 1044 1363 1076 541 -450 -743 -1360 -761
3236 -761 -144 555 1303 1398 720 -448 -1164 -1150 -945 -181 680 1579 1259 749 -250 -1021 -1139 -1251 7 832
3256 832 1479 1278 773 -270 -1098 -1052 -656 -239 894 1201 1343 355 -342 -1030 -1338 -1220 -316 1096 1213
3275 1213 1220 415 -76 -1081 -1321 -930 -215 716 1106 1339 796 -411 -1123 -1287 -986 -219 645 1558 955 486
3295 486 -383 -914 -1375 -1167 66 542 1132 1345 652 -249 -1244 -1249 -897 -223 828 1596 1127 482 -155 -889
3315 -889 -819 -1013 -216 963 1223 1028 555 -320 -1218 -1386 -967 -93 490 1270 1184 747 -519 -1093 -1311 -1038
3335 -1038 -315 557 1238 1003 585 -266 -971 -1492 -1134 -13 673 1163 965 654 -269 -1199 -1065 -809 -286
3354 -286 459 1271 1066 611 -180 -626 -1527 -1134 -373 641 1137 958 998 -13 -1343 -1245 -807 -252 495 1307
3374 1307 1222 588 -452 -953 -1478 -919 -357 584 1134 1019 525 -120 -1003 -1303 -809 -212 515 809 1230 869
3394 869 -297 -1175 -1372 -727 -111 691 1280 1370 623 -242 -785 -1129 -1214 -42 742 1113 1225 776 -127 -1370
3414 -1370 -1445 -747 -327 692 1100 1369 532 -424 -848 -1070 -974 -269 913 1100 744 797 -20 -1050 -1244 -948
3434 -948 -212 499 1118 1392 756 -561 -1116 -1073 -1143 -401 505 1486 956 277 -146 -971 -1178 -887 -37 594
3454 594 1126 1129 870 -247 -950 -1005 -998 -187 491 1084 896 374 -63 -661 -1260 -1159 -273 436 1189 836 735
3475 735 -14 -1311 -1382 -664 -23 383 1135 1407 601 -166 -846 -1167 -913 -526 705 1048 872 467 244 -699
3495 -699 -1271 -1036 -51 745 884 958 722 -105 -881 -1047 -777 -435 704 1070 1154 444 -138 -841 -1510 -1085
3515 -1085 -130 464 1198 1046 970 81 -789 -1197 -765 -364 668 949 997 725 -427 -798 -1201 -1272 -324 520
3535 520 1077 950 564 147 -974 -1249 -986 -29 341 913 1307 711 -299 -758 -958 -666 -590 683 1221
3554 1221 878 639 -35 -827 -1316 -1205 -83 610 1179 1114 597 -143 -1109 -868 -640 -247 534 1080 1424 585
3574 585 -363 -659 -1138 -1139 -356 619 912 921 715 -44 -1046 -1156 -1007 -5 408 787 1243 701 -440 -1089
3594 -1089 -952 -911 -237 437 1302 858 455 166 -868 -1127 -1002 -74 435 872 1076 644 -94 -993 -828 -915
3614 -915 -338 401 1117 1424 436 -326 -922 -1279 -1036 -235 577 1129 949 821 55 -959 -1093 -938 -33 483
3634 483 1008 1239 511 -76 -895 -895 -1177 -438 699 1104 976 493 128 -737 -1111 -856 -134 537 890 1309
3654 1309 652 -188 -791 -984 -727 -564 409 928 1012 409 49 -766 -1245 -1132 -82 200 1022 992 605 -196
3674 -196 -793 -1019 -714 -373 359 1042 1144 524 -201 -763 -935 -952 -330 721 975 1004 821 -8 -664 -992
3694 -992 -792 -208 360 782 1320 467 -155 -754 -881 -788 -243 709 1099 936 392 12 -845 -1348 -1121 58
3714 58 436 963 744 714 -192 -902 -925 -663 -508 461 1220 1143 470 -38 -731 -1177 -977 -119 560 870 957 589
3736 589 147 -1079 -1028 -806 -162 322 779 1167 638 -209 -979 -672 -914 -494 619 774 1118 519 159 -766
3756 -766 -1181 -1006 -410 221 820 1142 477 -242 -947 -984 -677 -257 541 961 915 324 -214 -567 -1261 -1166 -25
3777 -25 514 704 974 545 41 -580 -1046 -616 -342 343 1068 955 476 -190 -552 -1085 -1150 -262 707 908 748
3798 748 806 43 -822 -965 -696 -163 379 981 979 754 -160 -882 -878 -853 -366 315 932 832 488 138 -475 -1106
3820 -1106 -863 -92 734 896 959 631 -199 -613 -944 -944 -168 234 854 987 448 -150 -655 -872 -988 -466 418
3841 418 985 818 570 69 -798 -1195 -749 -316 246 711 1196 449 -216 -701 -821 -804 -485 491 770 835 775
3862 775 -35 -875 -978 -851 -46 245 516 1140 699 -265 -892 -795 -684 -289 205 1032 893 417 -60 -504
3882 -504 -983 -934 -359 456 970 529 978 144 -688 -892 -440 -252 196 798 1010 539 -240 -382 -830 -895 -374
3903 -374 663 1083 824 456 -65 -744 -1119 -465 -225 564 992 1070 681 -262 -534 -801 -605 -493 559 908
3923 908 1036 478 -127 -811 -1120 -636 -348 622 824 825 870 42 -698 -797 -946 -353 386 969 1158 284 -50
3944 -50 -686 -1196 -805 -263 648 702 875 648 -89 -517 -945 -672 -9 311 806 1042 591 -383 -749 -824 -694
3965 -694 -380 711 1093 472 518 -98 -597 -855 -724 -330 665 817 1051 718 -234 -623 -582 -706 -445 493
3985 493 952 879 510 -61 -419 -888 -839 -242 688 560 866 609 -53 -612 -814 -855 -64 166 769 787 406
4006 406 -52 -628 -754 -698 -265 759 784 811 621 101 -622 -1043 -692 -104 82 684 813 652 -4 -675 -685
4027 -685 -591 -312 93 939 965 204 99 -317 -904 -626 5 458 641 705 621 16 -702 -900 -495 -360 214
4048 214 930 920 182 11 -652 -712 -698 -286 519 679 1099 646 163 -613 -1124 -570 -220 299 756 593 546
4069 546 -261 -613 -673 -660 -471 612 685 751 740 -180 -635 -1054 -702 -147 336 638 714 519 139 -544 -727 -541
4091 -541 -272 6 754 1088 536 -114 -503 -761 -564 -398 536 727 871 698 114 -528 -927 -579 -107 196
4111 196 646 815 22 -278 -595 -663 -1055 -342 400 749 630 491 171 -667 -1021 -509 -139 170 657 692 496
4132 496 -163 -593 -663 -654 -492 47 681 635 330 -48 -509 -979 -824 -130 443 551 434 755 230 -598 -602 -580
4154 -580 -22 312 919 797 476 -276 -390 -668 -824 -232 445 711 649 687 132 -632 -914 -540 -206 40 601
4175 601 713 614 -182 -802 -583 -696 -278 185 885 614 363 -73 -378 -911 -879 -81 227 389 710 773 -150
4196 -150 -850 -594 -535 -102 236 520 856 437 38 -508 -925 -716 -297 406 567 629 663 -7 -653 -892 -650
4217 -650 -178 17 772 861 604 -67 -319 -546 -675 -352 397 814 481 278 86 -367 -845 -817 -161 226 535
4238 535 923 573 -46 -449 -515 -637 -512 221 732 328 325 19 -243 -880 -857 -260 321 613 646 562 1 -649
4260 -649 -663 -551 -215 -296 875 520 451 -29 -225 -542 -884 -171 291 719 609 282 271 -301 -937 -431 -111
4281 -111 168 776 492 587 -5 -532 -519 -632 -539 219 732 692 366 168 -258 -685 -765 -400 324 435 658 569
4303 569 134 -477 -870 -672 -289 46 735 772 313 -16 -338 -723 -703 -401 353 376 488 354 193 -461 -850
4324 -850 -772 -276 223 604 606 502 -376 -519 -242 -784 -368 389 546 575 387 5 -200 -937 -488 -146 301
4345 301 236 677 643 -171 -594 -499 -313 -441 178 565 561 419 87 -218 -663 -552 -328 333 559 501 456 -4
4367 -4 -616 -540 -488 -95 315 721 720 595 -2 -276 -781 -865 -158 239 431 496 475 100 -324 -610 -683 -139 169
4390 169 160 609 319 29 -481 -688 -584 -247 206 672 700 451 76 -314 -681 -668 -376 448 526 460 755 -49
4412 -49 -414 -730 -456 -114 -19 760 640 268 -77 -397 -445 -925 -417 287 518 487 251 114 -259 -947 -471
4433 -471 164 265 472 730 566 -101 -259 -422 -646 -285 199 513 561 454 41 -295 -886 -787 -55 396 429
4454 429 508 750 -61 -150 -721 -462 -452 192 651 780 287 240 -78 -782 -736 -324 398 333 624 312 78 -321
4476 -321 -853 -440 -106 156 575 625 268 -85 -382 -569 -471 -272 419 622 270 554 219 -154 -530 -477 -50
4497 -50 99 288 717 501 -59 -572 -387 -673 -311 8 675 729 546 -73 -298 -613 -318 -60 98 476 596
4518 596 633 3 -463 -636 -287 -206 12 640 597 346 23 -324 -641 -641 -284 267 366 631 440 177 -460 -334
4540 -334 -311 -310 70 379 565 348 146 -434 -230 -603 -335 263 569 414 428 101 -93 -487 -469 -186 231 370
4562 370 666 596 205 -461 -508 -587 -302 424 380 564 174 -196 -364 -437 -687 -281 178 519 392 327 260 -328
4584 -328 -487 -785 -151 239 509 724 434 -251 -220 -495 -476 -294 88 627 428 248 10 -295 -726 -604 79
4605 79 139 409 733 327 106 -535 -559 -549 -85 60 601 568 229 218 -210 -795 -586 -225 291 462 431 790
4627 790 -203 -201 -586 -481 -344 203 713 769 389 7 -151 -532 -569 -97 107 398 558 439 273 -450 -627
4648 -627 -410 -5 248 464 501 355 49 -377 -333 -702 -303 280 494 382 328 211 -147 -535 -469 -356 -14
4669 -14 345 347 693 320 -590 -454 -266 21 196 646 672 308 87 -204 -489 -423 -407 117 418 400 561 -99
4691 -99 -265 -630 -424 -191 -49 254 340 399 53 -577 -201 -353 -391 379 564 359 60 -120 -253 -653 -388
4712 -388 -32 104 333 855 338 -76 -237 -384 -256 -101 94 499 521 175 -107 -247 -303 -410 -46 49 502
4733 502 499 258 235 -290 -382 -478 -55 29 182 664 137 -227 -252 -343 -433 -53 306 548 635 305 -18 -220 -652
4756 -652 -342 -279 175 227 543 471 -24 -239 -685 -236 -561 83 352 345 274 -101 -140 -560 -601 -277 47 453 296
4779 296 294 216 -115 -629 -484 -234 -37 434 472 161 151 -62 -397 -523 0 -5 211 431 319 196 -341 -475
4801 -475 -569 -97 187 266 476 301 55 -532 -372 -616 -519 303 515 352 21 69 -218 -616 -646 78 111 391
4823 391 446 328 75 -435 -364 -392 -464 140 383 524 328 245 77 -211 -562 -178 138 156 280 516 72 -289
4845 -289 -320 -518 -150 18 127 527 337 -151 -312 -454 -574 -407 93 243 219 87 54 -61 -160 -352 -276 78
4867 78 105 138 432 -82 -500 -509 -377 -358 39 332 185 537 227 -358 -561 -319 -151 216 350 396 297 73 -586
4890 -586 -439 -195 -211 120 305 730 288 113 -171 -601 -621 -21 85 281 476 345 52 -324 -293 -357 -35
4911 -35 64 294 484 404 -1 -181 -189 -307 -269 258 205 488 289 -16 -197 -307 -439 -156 143 123 276 500 48
4934 48 -362 -441 -308 -273 -125 319 339 449 200 22 -466 -606 -148 55 229 368 299 116 -276 -432 -450 -144
4956 -144 47 329 384 46 117 -43 -70 -404 -507 -134 589 422 56 5 8 -549 -146 -249 -112 281 175 406
4978 406 67 -451 -547 -244 -230 5 313 425 109 170 -50 -375 -693 -113 -54 249 461 593 174 -174 -206 -323
5000 -323 -5 -35 207 636 88 -50 -129 -367 -337 -324 114 188 302 527 305 -212 -581 -442 -268 102 404 499
5022 499 492 126 -170 -632 -496 -225 -61 561 314 51 5 -338 -308 -410 -59 142 169 459 440 165 -480 -257
5044 -257 -436 -29 -42 218 501 107 -63 -254 -323 -290 -241 124 301 346 235 169 -197 -375 -271 -354 39 328
5066 328 397 563 116 -132 -498 -366 -360 -17 174 197 142 19 15 -378 -261 -136 213 197 530 480 159 -174 -560
5089 -560 -327 -401 -67 358 541 9 27 -231 -342 -318 -505 -49 489 360 160 30 -194 -540 -674 123 -278
5110 -278 251 148 386 -50 -83 -506 -345 29 -39 346 423 307 165 -95 -473 -257 -119 271 143 423 403
5131 403 160 -35 -275 -243 -268 111 230 474 290 -114 -395 -386 -315 -32 -219 380 354 380 366 -326 -320 -277 -301 87
5155 87 187 348 229 80 -262 -499 -344 -122 83 330 365 460 82 -303 -416 -376 81 -72 138 516 412
5176 412 -21 213 -383 -374 -227 -173 475 463 247 91 42 -228 -485 -370 152 261 269 271 369 -272 -482 -218 -313 270
5200 270 147 529 563 -53 8 -333 -566 -223 -40 273 162 410 419 -320 -381 -271 -50 67 329 355 138 128
5222 128 -225 -492 -260 -230 190 321 364 217 224 -78 -424 -261 -281 73 117 353 322 3 -212 -377 -203 -642
5244 -642 -9 174 473 173 306 -131 -508 -338 -205 -24 308 295 41 79 -156 -391 -286 -246 -24 321 183
5265 183 341 -70 -78 -395 -499 -60 -22 273 301 324 114 -207 -315 -8 -142 -106 200 481 185 -115 -115 -214 -266
5288 -266 -406 -139 463 552 94 82 -157 -250 -421 -159 115 19 111 412 301 -233 -19 -198 -29 82 184 156
5310 156 340 164 -128 -301 -238 -271 70 375 300 188 -76 -10 -345 -539 -141 77 196 425 279 30 -94
5331 -94 -308 -56 -243 -154 247 333 320 45 -150 -137 -294 -161 100 253 436 130 239 -12 -190 -402 -310 1
5353 1 103 192 351 283 -233 -269 -213 -42 106 71 366 369 233 -243 -427 -382 -341 -84 40 567 -41 51 51 -270 -381
5378 -381 -198 -132 48 265 240 301 -156 -413 -267 -132 38 85 459 258 65 -111 -125 -531 -142 163 87 -58
5400 -58 224 419 -79 -342 -452 -134 -105 87 39 329 75 -122 -117 -184 -355 -253 85 428 350 353 -83 -131 -295
5423 -295 -311 65 183 -3 341 -121 -48 -235 -336 -6 110 0 163 223 3 -201 -277 -342 -185 117 342 339
5445 339 228 -35 137 -308 -208 -268 113 260 271 396 65 -249 -90 -206 -228 57 53 243 324 -188 -96 -230
5467 -230 -466 -63 44 82 596 433 180 -30 -226 -217 59 -159 131 170 253 118 -91 -226 -209 -183 -8 99
5489 99 319 246 284 -396 -65 -476 -354 -29 194 522 348 243 -40 -323 -213 -270 -144 357 -9 417 256
5510 256 -73 -324 -121 -80 52 260 185 399 11 -88 -391 -538 -73 154 78 339 224 263 -225 -468 -218 -583
5532 -583 5 76 49 218 54 -127 -221 -266 -246 -65 216 203 460 112 -90 -197 -292 -214 -174 79 263 202 153 72
5556 72 -19 -210 -208 73 187 375 193 66 -47 -80 -284 -120 130 453 259 255 219 -309 -262 -135 -142 144 241 174
5580 174 287 194 -72 -121 -413 -3 -156 -60 370 41 150 -2 -272 -480 -158 -342 139 -30 226 142 -392
5601 -392 -277 -339 16 22 143 356 219 245 -200 -132 -520 -135 -74 139 234 226 395 -131 -189 -381 -470 -27 -146 268
5625 268 19 213 -157 -343 -267 -207 -59 122 161 243 140 -41 -310 -420 -129 31 230 234 353 215 -58 -107
5647 -107 -113 67 -229 174 206 269 303 -43 -403 -282 -90 144 195 225 152 173 -106 -162 -335 -325 43 145 424 111
5671 111 330 -202 -141 -192 -228 -51 194 288 246 370 214 -40 -280 -217 -200 192 453 389 103 295 -221 -245 -165
5694 -165 11 59 222 198 234 -123 -183 14 16 -21 356 208 253 101 -97 -402 -244 -331 20 210 312 284 197 216
5718 216 -145 -194 -156 -141 273 472 155 185 -228 -206 -367 -381 116 264 407 295 206 52 -21 -89 -290 -117 -206
5741 -206 437 541 58 -327 -202 -169 -49 9 -5 200 211 398 55 -344 -398 -128 4 187 112 224 141 48 -105
5764 -105 -241 -429 168 341 264 296 95 -332 -90 -199 -65 178 -51 75 150 205 174 69 -168 -398 -143 154
5786 154 90 273 201 -73 -75 -128 -214 -10 16 296 425 145 -96 107 -429 -69 -183 -102 6 106 -139 -33 -302
5809 -302 -239 -26 -198 75 80 168 184 -96 -100 -92 -186 -292 201 397 277 181 -211 -48 -178 -277 -24 -48 162 244 -24
5834 -24 36 -107 -132 -46 -54 50 -185 259 61 51 -235 -413 -312 27 187 113 202 241 183 -134 -342 -344 -153 77
5858 77 350 -16 244 44 -108 -309 -478 -43 75 328 164 120 93 -236 -302 -296 -181 60 277 130 171 -100
5880 -100 -262 -410 -91 -114 102 110 235 329 -130 -88 -81 -358 -229 145 296 278 171 98 -299 -227 -529 7 97 171
5904 171 307 87 -89 -140 -394 -121 -47 71 192 236 -35 108 -252 -111 -102 -79 -40 196 274 108 64 -205 8
5927 8 -166 -52 33 138 -21 121 107 -224 -180 -177 -138 -187 43 57 -184 -91 -19 -364 -368 -184 -108 -8 275 228 -30
5952 -30 -326 -227 -91 -187 -16 73 173 -116 244 -116 -217 -239 104 199 340 224 45 0 -41 -264 -237 63 13
5975 13 111 280 226 92 -100 -64 -215 -197 163 192 302 254 -22 -152 -211 -235 -209 -344 231 -97 406 -64 -326
5998 -326 -230 67 -79 -107 84 70 261 186 -267 -389 -46 -143 130 180 163 19 -123 -129 -260 -183 -42 222 181 450
6022 450 275 -22 34 -240 -468 -55 -2 16 268 209 -78 20 -316 -9 -97 132 138 428 270 228 -28 -206 -300
6045 -300 39 104 157 143 -146 155 -135 -251 -301 112 -70 141 173 369 3 -264 162 -283 -275 72 266 220 150
6068 150 139 -137 -108 -402 -142 87 181 272 -42 -31 -73 -376 -336 -12 74 -30 151 134 -65 -175 -130 -369 -76
6091 -76 -38 69 170 263 118 -5 -639 -281 -129 138 31 193 209 -90 -7 -152 -157 -16 -45 195 36 114 78
6114 78 -140 -238 -367 -137 -86 177 179 72 -54 -58 -192 -248 76 -60 193 194 39 -10 -345 -257 -218 -194 -75 119 438
6139 438 147 57 -85 97 -59 -151 85 -76 282 -144 25 1 -108 171 179 114 162 -5 168 -9 -52 -199 -241
6162 -241 -323 5 -117 393 -126 17 58 -299 71 -164 136 157 464 125 91 -101 63 -168 11 169 185 -139
6184 -139 319 -140 -141 -185 -353 -203 90 170 87 149 63 -318 -290 -212 -75 129 508 137 295 -64 -183 -237 -260 -84
6208 -84 -7 148 196 160 65 -95 -123 -88 -309 118 53 172 213 -201 240 -374 -231 -157 -95 68 206 200 -14 -279
6232 -279 -437 -127 56 28 224 101 296 269 -110 -259 -427 -260 -180 -30 216 -35 -217 117 -208 -129 -55 -124
6254 -124 202 -12 327 101 -273 -177 -160 -92 -176 192 271 159 16 -102 -256 13 -65 163 144 108 225 -53 -61
6277 -61 -179 -252 -350 40 257 220 -51 84 28 -305 -62 49 -208 113 230 54 -86 -89 -262 -162 11 -138
6299 -138 125 53 84 268 -327 -391 82 -85 -34 332 -26 54 -3 -139 -162 -58 -244 62 473 254 130 -27
6321 -27 65 -93 -268 -310 44 43 120 161 -179 57 41 -172 -102 138 145 110 -49 167 29 57 -185 -60 -77 107 159
6346 159 312 139 -54 -227 -94 -143 70 -124 35 296 -121 39 -291 -228 66 54 103 168 359 155 -35 39
6368 39 98 -121 189 161 133 59 -218 -23 -479 -424 53 78 -7 138 293 88 -96 -318 -89 -101 139 57 238
6391 238 237 110 30 -201 -84 8 -98 243 253 183 1 -22 61 -173 -60 -310 176 67 194 388 56 -52 -3
6414 -3 -115 8 -67 25 181 121 -331 -105 -68 -134 53 -61 324 25 -81 -163 -167 -104 -216 67 377 124 -90 7
6438 7 129 -56 81 -337 -41 152 182 138 192 -215 75 -120 -117 103 -110 178 273 -101 -212 -158 116 -23 254
6461 254 85 87 91 71 -258 -84 -90 -20 34 69 136 477 71 -338 -121 -175 -73 -48 232 368 305 -162 -105 -364 54
6486 54 -167 43 325 262 207 -57 43 -353 -303 -323 143 176 239 218 119 -121 -176 -317 -65 42 100 96 245 123
6510 123 17 -337 -161 -83 37 239 64 110 20 -130 -5 -242 -9 -66 73 127 214 171 -175 27 -232 -180 25
6533 25 231 54 -5 -222 -169 -373 -93 21 3 84 317 -96 83 -35 -131 -384 49 20 64 329 155 54 8
6556 8 -158 -449 -190 104 39 310 68 98 -140 -54 -243 22 36 89 196 25 32 -2 -210 -82 172 71 319
6579 319 270 132 132 108 -415 -189 -84 254 -103 267 177 124 -223 -230 -90 -157 14 164 31 231 60 -64 114
6602 114 -198 -137 79 191 174 212 -19 -19 -328 -95 -84 16 92 184 331 -41 -129 61 -74 -2 228 219 205 109 -47
6627 -47 -279 52 -223 -201 -78 190 72 -65 188 -129 -132 -160 -207 -239 152 265 262 194 -155 -80 -308 -107 38 133
6651 133 -90 20 100 -52 -136 -98 107 -84 16 297 47 104 42 6 -249 79 17 278 224 -126 7 19 -349
6674 -349 -182 -105 -194 -7 -121 95 28 -90 -407 -38 162 -431 68 341 128 146 -52 -203 -36 -20 -102 -189
6696 -189 71 101 -60 -174 132 40 -4 -236 91 214 225 -44 120 -184 -117 -38 92 85 122 215 314 -2 -30 -293
6720 -293 30 26 195 222 -126 -169 -2 127 -202 -1 -310 76 308 21 158 -148 -167 -84 -180 283 85 20 146
6743 146 121 109 -246 -66 -12 76 115 230 152 -31 -143 -171 -342 -55 -62 133 125 78 191 -66 54 -36 -8 -229 -16
6768 -16 119 18 74 64 -147 -23 -106 2 230 254 46 179 41 -171 -270 -143 127 109 221 8 -27 226 -226
6791 -226 -81 -127 39 138 149 31 119 -159 57 -196 85 87 0 75 165 89 -264 -225 -126 -37 5 29 -55 61 -48
6816 -48 124 -117 -176 -86 12 -42 111 345 283 -19 -9 -150 69 36 -75 12 330 -29 -79 -48 51 -155 -38 205
6840 205 -87 99 -75 -50 -78 -149 116 57 -80 -143 164 -81 -90 76 -17 -84 -86 115 44 195 237 44 174 -5
6864 -5 44 69 250 183 178 140 -41 -166 -31 33 -24 59 107 29 110 344 -255 -367 -264 -43 204 211 -147 172 -104
6889 -104 -181 -221 -140 141 85 -88 10 184 -56 -86 9 96 120 -96 -107 234 10 60 -207 -153 -17 -95 201 -301
6913 -301 145 -37 -11 9 -34 -14 -50 136 39 102 78 -65 54 -61 -86 80 136 67 104 124 246 -483 205 12
6937 12 -104 -209 121 105 191 -48 -24 -123 -57 -158 113 210 60 179 31 -173 -154 -119 -208 97 240 -23 -110 111
6961 111 36 -56 -87 -363 53 -45 170 178 -141 39 -181 -148 156 273 401 -19 11 14 -194 -187 -277 4 49 53 269
6986 269 13 -307 368 39 -95 -207 -48 185 36 44 142 -150 -61 -288 -232 -96 151 -68 -54 2 96 55 -16
7009 -16 -190 15 18 160 -144 6 -82 94 7 -186 -53 -223 294 152 -82 116 -86 -123 -17 55 -106 154
7031 154 76 0 -9 -35 -94 42 88 322 204 176 -212 92 -166 -263 67 -27 158 103 123 20 -17 -8 -297 -6 141
7056 141 127 122 46 -23 -213 -224 -328 89 -5 -128 331 111 -40 74 -168 -146 -171 52 130 81 288 -160 -171 -328
7080 -328 -80 -205 185 96 242 255 174 76 -394 91 -168 -19 -110 247 69 -157 -135 -63 -133 -144 14 327 49
7103 49 -69 -28 -116 -127 154 95 274 73 -63 38 130 -200 -93 104 -98 -137 173 288 -259 252 82 -10 9
7126 9 54 84 168 -5 221 63 105 -129 -182 21 89 261 248 136 262 -31 6 -92 -78 -62 35 37 75 -127 -187 201
7152 201 -214 -68 -83 115 162 334 197 -100 -190 -219 32 -109 5 -210 -184 358 -88 28 -144 -68 82 8
7174 8 153 -33 -137 -288 -146 -50 -162 32 39 -73 175 123 -36 20 -180 89 -27 -12 245 265 16 -42 -241
7197 -241 134 261 -20 -63 46 76 -51 37 -74 -46 -193 -82 65 72 418 1 -93 10 -143 3 -131 -54 130
7220 130 341 243 95 -128 -98 -111 6 57 174 98 -91 47 17 20 -174 141 -19 148 210 -272 -86 -182 2
7243 2 -175 90 389 -108 195 61 -29 -89 -62 82 -34 136 205 74 -49 -44 102 -79 129 -203 56 261 92
7266 92 1 -100 -163 -240 21 156 138 118 253 5 77 93 -245 -198 61 41 249 -10 60 16 -93 -144 -150 32 88
7291 88 110 -24 199 190 9 129 -138 71 187 162 114 138 -58 88 14 227 25 -105 89 6 -109 -41 -145
7314 -145 -242 -27 107 -65 98 272 -46 -2 -101 -169 -55 172 289 286 37 15 24 -193 -48 -73 85 64 112 164
7338 164 -95 -162 -230 -216 -170 121 -218 -6 218 -112 20 -155 -214 30 314 284 -33 -9 357 -170 -12 -7 95
7361 95 117 139 165 116 -70 -42 -201 -115 -67 42 -11 279 194 -92 35 -216 -224 3 -23 -61 47 -99 91 31 91
7386 91 44 25 72 146 56 270 -155 -35 -189 -91 89 -172 136 73 36 -235 -1 -205 -183 52 -104 58 310
7409 310 33 9 81 -153 -182 145 13 -94 12 207 -121 6 26 -163 132 111 282 50 35 244 -122 15
7431 15 -37 144 410 64 -109 62 87 -172 -1 30 6 248 134 131 -13 183 169 -199 -68 61 142 56 212
7454 212 250 132 56 -123 -72 157 -22 -32 226 252 -87 186 -191 7 80 195 126 153 98 -86 -168 -296 -8
7477 -8 -329 -169 104 61 179 -79 -198 -206 165 -176 -28 106 -89 -49 281 47 -197 -113 64 -103 258 257 -21
7500 -21 -85 108 -203 14 -246 -113 222 210 121 18 121 72 -171 -81 -162 201 170 159 -195 6 -142 152 -181
7523 -181 59 260 133 251 1 -285 -279 -155 -112 41 136 101 231 195 84 -150 -244 -75 49 -77 246 88
7545 88 170 192 107 24 -310 -48 210 136 77 -60 -77 -271 -385 60 -8 260 33 97 89 -137 -215 16 -172 -27
7569 -27 -88 167 216 57 -328 -178 -251 -188 -11 395 -13 -146 8 -118 -231 -179 97 -19 -15 150 158 -264 -53
7592 -53 -64 -38 16 -57 -18 0 76 9 -16 134 -129 -94 60 3 -61 42 32 109 -147 -201 15 4 159 248 97 217
7618 217 -22 60 42 -202 -15 -68 -10 -79 -115 -97 14 -477 -108 -86 -78 -75 60 136 -95 -134 133 -175 -13 -180 392
7643 392 -41 272 -20 4 -17 -123 -162 8 37 237 143 -308 -433 -268 -28 99 -2 200 -20 317 -101 -278
7665 -278 -136 -405 32 161 13 108 -216 -116 -55 -11 -118 52 -217 -67 49 93 132 -299 -302 -23 67 304 -44
7688 -44 17 249 -30 -22 84 239 73 -177 173 135 -2 23 -165 -364 26 130 142 -150 217 -129 -67 51 -84
7711 -84 -68 -76 -69 73 1 19 39 -47 8 -125 -47 274 275 -10 80 -88 -39 63 -181 -184 -127 -35 90 -119 -75 -80 93 -66
7739 -66 -109 92 68 114 89 9 -22 -268 -182 22 157 -7 143 37 -37 81 -22 -155 -51 -22 -7 197 -211 23
7763 23 -166 -148 75 10 2 84 372 177 57 136 -199 -81 111 72 -56 -20 200 -9 -168 -58 35 124 384 168
7787 168 -42 -166 -18 -143 36 -166 -78 204 -35 154 -104 37 -122 -72 -144 40 4 184 61 60 -6 130
7809 130 -155 -164 -171 -29 -47 4 184 127 -122 -136 143 -237 133 89 9 102 -12 53 -320 -12 -327 207 -163 22
7833 22 2 38 12 -133 -113 -56 167 183 -110 378 -146 -135 -229 93 -20 -269 49 196 89 -111 -49 -106 -114 125
7857 125 170 295 163 128 -169 -269 -113 -258 103 39 160 27 218 112 -208 -33 -349 179 24 -128 47
7878 47 -7 31 -13 -29 -79 121 129 -3 -10 190 161 -100 -119 -102 143 -6 69 174 12 -29 76 -194 -331 10 149
7903 149 -21 -59 186 12 -38 83 -62 228 84 114 169 88 12 37 -140 29 -22 130 -40 65 -63 154 -14
7926 -14 -156 -40 106 76 243 189 -135 63 -169 -201 -19 387 2 226 21 9 50 -145 -106 -34 40 -7 112
7949 112 229 286 88 -266 -301 -74 170 151 106 84 -123 223 -272 -133 -238 -153 33 73 120 0 35 -108 -322
7972 -322 43 21 59 233 -10 48 -98 -82 -134 112 111 -3 -115 34 70 -177 5 114 -53 56 -3 90 -80
7995 -80 202 -28 -16 -43 -65 -171 -186 66 -21 98 -91 73 -210 -154 195 160 272 113 146 -28 36 -253 -110
8018 -110 -119 -60 -111 227 228 155 -283 -133 254 9 27 55 151 156 -72 98 -142 -260 5 77 32 87 50 -131 -3
8043 -3 -81 -167 80 16 -47 298 280 -114 -3 148 125 -66 29 146 -39 -3 95 -217 -216 -121 -25 -186 258 86 6
8068 6 17 11 8 -113 113 76 -49 217 21 88 12 -228 106 40 -42 46 328 301 -314 0 -119 18 -219 -172 122
8093 122 -37 75 13 91 -404 -161 -9 54 26 -204 147 -12 -241 -59 -268 -29 50 -1 260 174 -133 37
8115 37 50 -155 33 -141 6 157 290 55 -457 -303 -58 141 -128 -29 82 296 -49 -149 47 0 6 -72
8137 -72 390 -27 -32 324 -12 -50 60 14 -118 132 -42 202 -47 -234 143 -12 17 14 71 40 193 -129 -290
8160 -290 -85 -172 19 -53 214 -158 178 18 -175 -21 -25 -168 115 219 81 -30 -142 -141 152 -183 30 297
8182 297 68 -78 129 31 -142 218 71 -6 238
8191B38
$$ Imaginary data points
##PAGE= N=2
##DATA TABLE= (X++(I..I)), XYDATA
0 0 0 0 0 0 0 0 0 0 0 0 0 0 0 0 0 0 0 0 8 -8 8 -8 8 -8 16 -16 16 -19 24 -25 32 -33 40 -43 49 -57 63 -68 77 -86
40 -86 97 -108 118 -131 144 -159 175 -194 213 -235 259 -286 316 -347 386 -428 476 -532 596 -672
60 -672 767 -882 1032 -1231 1508 -1929 2628 -4022 7842 -41299 -132226 -63528 -6532 -1295
74 -1295 24772 86819 88896 34602 -21233 -56201 -72058 -41287 13393 49343 59798 62963 37753
87 37753 -23037 -74199 -70077 -36793 -8448 24610 61968 59496 10353 -38178 -54910 -57175 -46558
100 -46558 -6970 46622 70046 50169 12662 -16671 -40754 -57074 -39773 11463 54204 63895
112 63895 50365 21865 -18655 -49976 -56116 -41156 -7107 42306 68174 42622 -250 -24523
124 -24523 -42608 -63107 -54116 -4350 43593 53730 40960 19500 -16046 -49398 -52730 -28672
136 -28672 1572 34490 61477 55421 18635 -15003 -35373 -48137 -36940 3179 39480 47148
148 47148 36824 18531 -14508 -50486 -58717 -32875 1576 25201 39484 40838 16835 -22370
160 -22370 -46187 -45485 -29031 71 34680 52436 41906 16909 -10673 -37065 -47373 -26812
172 -26812 8975 34481 44165 42081 20126 -18578 -47353 -46506 -27324 -3477 24437 46054 39339
185 39339 8434 -22068 -39607 -46366 -35185 -2150 32451 45083 36906 16871 -11863 -38227
197 -38227 -43200 -23768 3334 28420 46522 44259 16907 -16260 -34434 -37774 -29679 -4183 28842
210 28842 43504 32217 9776 -14056 -38081 -47435 -29969 422 23944 35716 35402 15887 -16380
223 -16380 -37952 -37480 -21816 917 27993 44444 37819 14175 -11418 -32036 -39340 -24574 4927
236 4927 28458 36718 33020 15803 -15176 -41210 -42457 -24099 -1449 20696 37950 35937 10568
249 10568 -18038 -33759 -36916 -27288 -2287 27367 41149 34030 15088 -9253 -32008 -37766 -21351
262 -21351 2555 22252 36626 37334 16240 -15264 -33598 -33095 -23723 -5299 21155 37520 29529
275 29529 7528 -13064 -29794 -38785 -26808 1326 24270 32286 29308 14481 -12290 -32735 -32487
288 -32487 -18439 109 23277 40106 33977 9530 -12813 -26203 -32888 -25751 -198 26349 34839
301 34839 26587 10472 -11145 -32375 -38426 -23984 -531 19743 32510 30488 11530 -13394 -28792
314 -28792 -31378 -22904 -1605 24025 36674 28896 11226 -7706 -25412 -33502 -22114 2378 22138
327 22138 30237 28353 13103 -11580 -30780 -31843 -20002 -2591 17639 32233 28501 7554 -13300
340 -13300 -26619 -31281 -22492 771 22158 29653 26523 13844 -9280 -30200 -31437 -15319 2235
353 2235 18095 31908 31029 11137 -12034 -25686 -30277 -21978 -162 21949 29472 22944 10172
366 10172 -8759 -28666 -34502 -20712 1118 18397 28114 27180 11516 -11438 -26527 -27365 -19066
379 -19066 -1692 20526 33418 26632 8572 -8140 -22634 -29946 -20968 1715 20554 26995 24102
392 24102 11296 -10686 -28074 -29134 -17825 -1874 16010 29744 26524 6938 -12591 -22523 -26175
405 -26175 -20897 -1622 21035 29845 23246 9504 -8077 -24818 -28492 -16041 1703 16716 27528
418 27528 27237 10255 -12478 -25291 -25416 -18108 -1715 18440 28809 22809 8309 -8602 -24920
431 -24920 -30875 -18272 2507 17743 24458 23683 12590 -8550 -25886 -27203 -15609 537 17293
444 17293 28071 24276 9403 -7385 -21219 -27959 -19011 1616 18753 23619 20401 10754 -7816
457 -7816 -25450 -27464 -15175 -212 14063 25236 24392 8068 -11138 -21628 -23343 -17347 -1163
470 -1163 18487 27106 21463 8587 -7287 -22270 -26479 -15341 1616 15480 24600 24719 9731
483 9731 -12079 -23386 -21871 -16125 -4544 15003 28661 22861 5221 -9414 -19646 -24780 -18212
496 -18212 -952 16166 24216 21796 9987 -8359 -22282 -23306 -13720 -1050 13901 25106 23175
509 23175 8041 -8665 -18962 -22718 -17269 -752 17356 23162 17453 7727 -5707 -20602 -26855
522 -26855 -16279 2019 15127 20939 20235 9052 -8732 -20726 -21960 -15361 -1164 16645 25451
535 25451 19211 6506 -5689 -18065 -24717 -16494 2345 15865 20355 19523 10592 -7480 -22322
548 -22322 -23070 -13368 -1286 13180 23328 20212 6039 -7613 -17644 -23061 -16663 103 15517
561 15517 20471 18488 9790 -6378 -20761 -22221 -12040 555 11633 21059 22430 8430 -9448
574 -9448 -18574 -19037 -14441 -2146 13687 22064 18027 6844 -6842 -18839 -22785 -14235 603 12392
588 12392 18414 19110 9586 -7736 -20013 -19354 -11791 -1890 12468 23328 19442 5301 -6596 -14804
602 -14804 -20622 -15767 491 15352 19328 15994 8378 -5528 -19136 -21849 -12591 -447 10970
615 10970 20141 19162 6313 -8119 -15879 -19009 -15438 -1513 14393 20441 15968 7601 -3956 -16697
629 -16697 -21283 -12791 1370 11759 18005 18147 8601 -6603 -16823 -18145 -12779 -2045 11706 19501
643 19501 16003 5835 -5469 -15627 -20051 -13425 450 11864 17260 16344 7854 -6225 -16986
656 -16986 -18348 -10852 -561 11024 19717 18291 6255 -6734 -14262 -17483 -13632 -885 12794
669 12794 18142 15411 7238 -5183 -17125 -19337 -11940 -1114 9565 17482 17610 6379 -6870 -14590
683 -14590 -16141 -12845 -2253 12175 19310 14951 5985 -3642 -13554 -18189 -12022 432 10611 15719
697 15719 15923 7688 -6315 -15930 -16126 -10721 -2174 10029 17803 14999 4678 -4878 -13238 -17905 -12616
712 -12616 494 11936 15443 13797 7665 -4018 -15313 -17734 -9989 514 9989 16601 15846 6771
726 6771 -5192 -13543 -16158 -12097 -1105 11065 16213 12977 5652 -3704 -14176 -18262 -11193 387
740 387 9076 14232 14858 7206 -5706 -14165 -14834 -10052 -1996 9631 17442 14590 5101 -4312 -11697
755 -11697 -15670 -11436 -337 10005 14340 13494 6526 -5379 -14511 -14952 -9450 -1846 7876 15907 14652
770 14652 4413 -5829 -11740 -14491 -11557 -854 10635 14866 12430 6352 -3513 -13339 -15020 -8627
784 -8627 229 8070 14054 14870 6519 -5819 -13158 -13885 -9955 -1631 9011 14780 11935 4858 -3631
799 -3631 -12412 -16391 -10304 863 9076 12475 12248 6718 -4187 -12741 -13799 -8749 -932 8494 15464
814 15464 13428 4735 -3905 -9734 -13794 -10776 -684 9598 13033 10914 5752 -3761 -12641 -14617
828 -14617 -8980 -344 6968 13032 12908 4863 -5054 -10976 -12047 -9582 -1186 9481 14369 11584 4547
843 4547 -3139 -11114 -13872 -8803 73 7995 12900 12993 5674 -5226 -12092 -12284 -8616 -1947 7077 13529
859 13529 12096 4527 -4088 -11084 -13636 -9423 -293 7858 11783 11235 6381 -3088 -11300 -12776 -7560
874 -7560 -15 6927 12882 11917 4699 -4004 -9608 -12012 -9493 -703 8531 12149 9513 4375 -2926
889 -2926 -10766 -13594 -7937 495 6935 11345 11350 5037 -4411 -10207 -11259 -8126 -1000 8402 13324 10236
905 10236 3947 -2607 -9369 -12836 -8792 291 7825 11040 10350 5141 -4357 -11162 -11490 -7702 -1657
920 -1657 6324 12481 11157 3722 -4047 -8940 -11129 -8643 -412 7491 11230 9945 5119 -2548 -10267
935 -10267 -11647 -6852 -201 6376 10958 10784 4517 -3952 -9709 -10475 -7804 -1281 6913 11129 9313
950 9313 3602 -3108 -9516 -11979 -7577 142 6275 10020 10311 5202 -3243 -9638 -10078 -6689 -728 6688
966 6688 11293 9740 3740 -2949 -8450 -11093 -7634 -176 6875 9732 8756 4109 -3411 -10139 -10593 -6897
982 -6897 -943 5615 10748 10017 3323 -3904 -7826 -9581 -7550 -601 7420 10601 8713 4192 -2149
997 -2149 -9073 -10585 -6724 139 5905 9587 9442 3922 -3884 -8731 -9083 -7168 -1955 6391 10783 8160
1013 8160 2710 -2596 -7459 -10579 -7389 565 6695 8989 8516 4706 -2902 -8806 -9357 -5712 -401
1028 -401 5591 10330 9266 3216 -3104 -7535 -9789 -7493 -442 6533 9300 7422 3634 -2196 -8643
1043 -8643 -10415 -6364 -363 5391 8874 8898 4081 -3208 -7808 -8511 -5984 -920 5949 9719 8167 3450
1059 3450 -2242 -7648 -9592 -5917 290 5063 8161 8106 3736 -3207 -8445 -8688 -5900 -697 5122 8968
1075 8968 8179 3029 -2882 -6977 -8896 -6145 220 6246 8331 7593 4003 -2707 -8141 -8870 -5358 -435
1091 -435 5224 8630 8011 2953 -3106 -7126 -8354 -6338 -1084 5846 8776 6806 2899 -2075 -7414
1106 -7414 -9007 -5735 -6 4791 8367 8003 3576 -3019 -6872 -7190 -5475 -681 5576 9030 7210
1121 7210 2562 -2546 -6430 -8297 -6052 32 5228 7430 6817 3208 -2863 -7867 -8224 -4930 -423
1136 -423 4605 8274 7637 2759 -2868 -6603 -7417 -5405 -264 5466 8070 6826 3140 -1939 -7201 -8720
1152 -8720 -4673 190 4270 7252 7396 3156 -3047 -6924 -7371 -5506 -658 4847 8018 6474 2418
1167 2418 -1905 -6200 -8055 -5106 614 4921 7024 6710 3291 -2616 -6586 -7229 -4661 -619 4857
1182 4857 7898 6647 2505 -2415 -5813 -7340 -5594 -120 4895 7002 5933 2979 -2135 -6604 -7145
1197 -7145 -4619 -374 3971 7226 7162 2521 -2731 -5510 -6555 -5073 -382 4799 7240 6088 2650
1212 2650 -2151 -6298 -7546 -4434 211 3960 6321 6470 2883 -2715 -6404 -6354 -4453 -764 4436 7447
1228 7447 6386 2375 -1777 -5307 -7045 -4901 238 4614 6034 5769 3053 -2019 -6163 -6850 -4038
1243 -4038 -54 3706 6498 5988 2006 -2485 -5431 -6025 -5063 -365 4729 6578 5015 2098 -1534 -5511
1259 -5511 -6948 -3997 286 4029 6145 6137 2537 -2429 -5239 -5831 -4137 -409 4273 6763 5424 1945
1275 1945 -1631 -5342 -6606 -4233 18 3804 5701 5161 2345 -2206 -5690 -5858 -4126 -648 3799
1290 3799 6304 5400 1946 -2020 -4770 -5982 -4217 24 3983 5658 5222 2541 -1892 -5707 -5978 -3560
1306 -3560 140 3555 5757 5424 1940 -2177 -5040 -5799 -4155 -89 3900 5973 4722 1928 -1713
1321 -1713 -5050 -6261 -4010 260 3594 5548 5125 2487 -2046 -5242 -5371 -3488 -174 3730 5846
1336 5846 5418 1742 -1725 -4465 -5818 -3970 -54 3792 5383 4739 2159 -1843 -5391 -5776 -3451 -269
1352 -269 3281 5746 5155 1759 -1973 -4629 -5251 -3840 -116 3705 5384 4565 1739 -1827 -4733 -5617
1368 -5617 -3372 -15 3230 4996 5190 2082 -2191 -4689 -5030 -3327 -400 3509 5447 4535 1975 -1613
1384 -1613 -4213 -5424 -3500 118 3352 5100 4509 1887 -2025 -4756 -5066 -3369 -289 3324 5258
1399 5258 4627 1421 -1584 -4436 -5156 -3310 -73 3434 4949 4248 1845 -1476 -4580 -5212 -3263 -85
1415 -85 2871 4915 4602 1851 -1801 -4270 -4649 -3388 -514 3506 5174 4263 1703 -1796 -4081 -4963
1431 -4963 -3141 161 3208 4422 4100 1869 -1846 -4627 -4612 -2937 -360 3085 5149 4225 1569 -1705
1447 -1705 -3817 -4963 -3338 306 3362 4415 3974 1978 -1447 -4465 -4650 -2914 -38 3004 4596
1462 4596 4460 1452 -1338 -3748 -4777 -3290 -363 3089 4383 3814 1584 -1319 -3918 -4538 -2755 229
1478 229 2588 4501 3996 1299 -1736 -3660 -3892 -2906 -245 3071 4792 3686 1579 -1346 -3751 -4629
1494 -4629 -2920 -85 2787 4208 3855 1360 -1760 -4190 -4499 -2685 -10 2672 4429 4188 1506 -1606
1510 -1606 -3518 -4334 -3056 -105 3058 4117 3415 1476 -910 -3509 -4340 -2821 -103 2398 4147 3914
1526 3914 1565 -1659 -3642 -4145 -3061 -137 2754 4067 3430 1253 -1138 -3131 -4300 -2856 286
1541 286 2674 3909 3656 1721 -1292 -3654 -3851 -2716 -287 2427 4104 3475 1649 -1245 -3380 -3935
1557 -3935 -2917 -132 2608 3828 3372 1610 -1212 -3488 -4078 -2513 -319 2297 3641 3824 1585 -1419
1573 -1419 -3085 -3681 -2479 -182 2677 3959 3438 1672 -1000 -3282 -4063 -2219 -41 2076 3461 3366
1589 3366 1608 -1420 -3610 -3569 -2611 -513 2359 3753 3169 1341 -877 -2881 -3718 -2561 -32 2430
1605 2430 3711 3162 1508 -775 -3247 -3794 -2625 -272 2175 3875 3307 1357 -1045 -2883 -3691 -2547
1621 -2547 -48 2264 3520 3149 1579 -720 -3146 -3756 -2562 -1 2041 3599 3262 1446 -1318 -2881
1637 -2881 -3387 -2440 -466 2222 3599 2962 1323 -818 -2983 -3657 -2477 -199 1876 3339 3196 1640
1653 1640 -760 -3022 -3593 -2312 -438 1701 3508 2945 1422 -907 -2541 -3436 -2424 -69 2303 3122
1669 3122 3037 1501 -686 -2757 -3538 -2099 -131 1614 3133 3387 1398 -1013 -2631 -3139 -2380 -489
1685 -489 1784 3196 2977 1143 -887 -2647 -3565 -2333 35 1776 2940 3096 1591 -664 -2501 -2972
1701 -2972 -2087 -378 2029 3223 3160 1403 -772 -2489 -3288 -2246 -356 1924 3072 2735 1407 -698
1717 -698 -2609 -2838 -2093 -379 1485 3062 2922 1549 -649 -2640 -2785 -2310 -14 1797 2845 2804 1457
1734 1457 -514 -2493 -3244 -2106 -268 1708 2919 2881 1424 -788 -2346 -2857 -2218 -382 1641 2941
1750 2941 2929 1296 -539 -2183 -3021 -2457 -311 1744 2629 2619 1481 -640 -2611 -2922 -1829 -334 1515
1767 1515 2911 2971 1288 -805 -2274 -3015 -2304 -404 1523 2397 2592 1126 -527 -2132 -2795 -1970 -482
1784 -482 1645 2562 2780 1616 -710 -2155 -2775 -2119 -554 1482 2774 2680 1067 -384 -2096 -2904 -2247
1801 -2247 -143 1416 2460 2468 1267 -706 -2031 -2540 -1992 -482 1383 2491 2584 1257 -619 -2013 -2519
1818 -2519 -1860 -230 1478 2535 2615 1225 -674 -2250 -2718 -2222 -526 1238 2343 2466 1141 -516
1834 -516 -1866 -2565 -2281 -499 1394 2559 2580 1322 -239 -1923 -2618 -1900 -447 1123 2322 2253 1428
1851 1428 -397 -1823 -2244 -1920 -290 1270 2692 2292 1120 -364 -2086 -2540 -1801 -512 1430 2191
1867 2191 2467 1405 -209 -1933 -2394 -1811 -406 1291 2489 2300 1321 -221 -1727 -2314 -1796 -617 1483
1884 1483 2146 2214 1261 -210 -1824 -2497 -1727 -654 1175 2123 2372 1428 -433 -1772 -2342 -2039 -689 1040
1902 1040 2059 2096 1403 -100 -1807 -2306 -1791 -744 956 2274 2170 1036 -253 -1489 -2109 -1800 -492
1919 -492 1076 2153 2154 1160 -133 -1694 -2373 -1946 -713 1126 2125 1964 1275 -238 -1884 -2215 -1647 -446
1937 -446 927 1814 2183 1381 -402 -1633 -2132 -1754 -720 841 2238 2094 1362 -119 -1544 -2287 -1897
1954 -1897 -432 1124 1928 2235 1432 -248 -1596 -2035 -1786 -535 1010 2181 2069 1109 -167 -1509 -2081
1971 -2081 -1993 -669 827 1874 2103 1429 -481 -1250 -2214 -1540 -676 873 1685 2058 1127 -271 -1414 -2296
1989 -2296 -1812 -513 789 1971 1965 1469 -19 -1628 -2198 -1875 -776 681 1827 2284 1309 -103 -1284
2006 -1284 -1851 -1743 -416 607 1636 2066 1238 203 -1280 -2148 -1659 -720 638 1809 2165 1243 -243
2023 -243 -1499 -2001 -1844 -693 668 1612 1877 1173 -69 -1292 -1859 -1714 -536 605 1666 1978 1485
2040 1485 -181 -1209 -2042 -1603 -562 664 1903 2051 1307 219 -1146 -1783 -1856 -658 643 1790 1961
2057 1961 1401 182 -1265 -1914 -1702 -387 731 1835 1863 1531 134 -1488 -1770 -1668 -731 808 1733
2074 1733 2004 1117 129 -1153 -1798 -1588 -825 650 1684 1967 1491 98 -1180 -1622 -1608 -720 682 1490
2092 1490 1806 1248 63 -1295 -1708 -1884 -900 407 1520 1975 1235 8 -1022 -1786 -1765 -878 670 1416
2110 1416 1836 1378 178 -1004 -1642 -1864 -993 655 1542 1818 1309 299 -878 -1707 -1794 -676 470 1530
2128 1530 1813 1378 78 -1093 -1651 -1691 -833 468 1543 1648 1161 198 -870 -1722 -1603 -826 438 1415
2146 1415 1776 1598 335 -1119 -1607 -1946 -860 372 1460 1853 1425 557 -649 -1741 -1533 -821 284
2163 284 1435 1662 1268 317 -1055 -1716 -1668 -645 508 1459 1568 1393 264 -895 -1691 -1603 -610 444
2181 444 1099 1694 1346 303 -842 -1744 -1608 -1000 313 903 1809 1500 207 -686 -1577 -1621 -882 369 1142
2200 1142 1611 1410 276 -756 -1590 -1763 -1220 61 1278 1491 1422 502 -664 -1673 -1664 -1118 281 1044
2218 1044 1579 1417 424 -858 -1400 -1835 -817 432 1236 1809 1256 459 -847 -1530 -1746 -1149 28 1281
2236 1281 1737 1553 433 -568 -1555 -1572 -1238 173 1069 1642 1365 531 -477 -1686 -1673 -1080 -52 1008
2254 1008 1734 1548 543 -622 -1204 -1347 -1063 36 1158 1792 1392 536 -563 -1710 -1512 -1061 -60
2271 -60 998 1625 1381 463 -646 -1501 -1611 -909 193 1104 1684 1252 433 -650 -1455 -1739 -1074 -45 827
2290 827 1308 1136 479 -516 -1355 -1250 -679 -159 872 1441 1457 567 -487 -1194 -1510 -842 186 894 1627
2309 1627 1448 581 -538 -1640 -1774 -997 39 1099 1582 1249 668 -571 -1345 -1424 -945 122 940 1675
2327 1675 1308 573 -301 -1399 -1738 -948 301 1095 1460 1729 384 -420 -1166 -1419 -743 -39 1060 1679
2345 1679 1522 553 -585 -1355 -1621 -1359 142 1082 1580 1456 745 -612 -1293 -1589 -991 26 732 1482
2363 1482 1550 643 -396 -1033 -1542 -1191 -50 968 1488 1289 595 -234 -1186 -1556 -1367 -109 878 1605 1482
2382 1482 712 -469 -1132 -1734 -1067 -444 787 1359 1330 790 -138 -1338 -1469 -1369 -114 845 1329 1531 683
2401 683 -262 -1396 -1656 -1245 -279 783 1564 1442 519 -400 -1279 -1175 -1049 -252 867 1441 1389 674 -184
2420 -184 -1142 -1508 -928 111 637 1327 1496 537 -338 -1279 -1490 -1253 -321 793 1267 1566 733 -351 -1030
2439 -1030 -1531 -1085 -119 615 1270 1800 1050 -287 -1413 -1502 -1273 -247 698 1510 1522 652 -415 -1375 -1488
2458 -1488 -1413 -300 706 1541 1668 870 -41 -1068 -1596 -1413 -286 838 1190 1778 680 -240 -1394 -1523
2476 -1523 -1352 -239 883 1672 1315 860 -167 -1161 -1446 -1047 -139 752 1628 1505 844 -86 -1193 -1214 -1248
2495 -1248 -276 823 1598 1463 758 -416 -1241 -1609 -1390 -113 713 1521 1551 1151 -179 -1024 -1382 -976 -451
2514 -451 740 1319 1671 655 -275 -907 -1540 -1059 -269 723 1268 1431 1042 12 -1061 -1518 -1370 -298
2532 -298 528 1060 1224 865 -214 -1269 -1397 -1171 -370 494 1348 1287 684 -161 -851 -1394 -1134 -579 794
2551 794 1305 1640 1057 -202 -1065 -1599 -1492 -573 451 1415 1557 810 -391 -1093 -1583 -1268 -245 870
2569 870 1345 1562 864 -52 -1182 -1577 -1376 -415 772 1445 1558 795 33 -1110 -1469 -1192 -538 713 1367
2588 1367 1560 939 46 -802 -1516 -1236 -584 482 1300 1717 929 -3 -1078 -1422 -1163 -472 658 1500 1461
2607 1461 797 -46 -757 -1673 -1412 -226 769 1128 1302 974 -176 -826 -1555 -1402 -195 395 1308 1584 1005
2626 1005 -308 -797 -1430 -1324 -162 594 1006 1446 1094 -25 -736 -1412 -1346 -502 391 1264 1623 925 -254
2645 -254 -1139 -1687 -1357 -577 268 1419 1317 1039 66 -774 -1443 -1289 -572 540 1243 1861 915 -262 -1064
2664 -1064 -1584 -1249 -750 671 1313 1508 997 62 -1045 -1541 -1184 -373 530 1551 1283 1301 198 -997
2682 -997 -1330 -1216 -358 307 1287 1422 997 -51 -826 -1463 -1694 -427 670 1270 1287 941 121 -897 -1529
2701 -1529 -1324 -516 380 1444 1483 1154 -123 -923 -1518 -1240 -636 590 1185 1636 877 89 -787 -1594 -1352
2720 -1352 -517 559 1000 1660 1236 171 -1002 -1441 -1332 -433 438 1357 1476 572 18 -866 -1342 -1262 -586
2739 -586 470 1183 1553 924 171 -941 -1474 -1415 -529 269 1134 1746 1087 -104 -741 -1323 -1602 -653 166
2758 166 1071 1322 993 210 -722 -1775 -1446 -431 338 1272 1432 974 26 -975 -1621 -1378 -682 201 1170
2777 1170 1386 1348 86 -743 -1238 -1385 -512 406 1384 1459 891 273 -900 -1559 -933 -462 249 1071 1366 1272
2797 1272 261 -973 -1173 -1448 -861 515 1144 1348 1133 194 -603 -1682 -1113 -579 609 1148 1579 1072
2815 1072 128 -796 -1617 -1342 -717 399 1287 1366 886 260 -873 -1602 -1576 -835 516 929 1271 1050 93
2834 93 -660 -1484 -1338 -635 253 1140 1385 1130 -37 -784 -1293 -1621 -826 579 1406 1400 984 91 -1059 -1481
2854 -1481 -1486 -659 245 1223 1460 1101 14 -839 -1198 -1459 -835 422 1262 1385 1074 356 -585 -1291 -1389 -482
2874 -482 355 1128 1561 1107 329 -932 -1435 -1269 -800 59 1236 1423 1050 159 -700 -1284 -1329 -809 171 991
2894 991 1342 995 351 -871 -1483 -1381 -639 250 1088 1333 1237 110 -726 -1384 -1549 -699 359 1226 1342
2913 1342 1018 350 -615 -1747 -1327 -697 401 951 1675 1405 354 -843 -1354 -1347 -833 179 1022 1542 1165
2932 1165 261 -693 -1384 -1443 -810 420 1284 1391 1202 242 -1100 -1356 -1164 -573 60 1047 1587 1037 535
2951 535 -718 -984 -1361 -781 260 1345 1130 1069 370 -522 -1497 -1371 -536 274 900 1395 1337 278 -962
2970 -962 -1245 -1279 -1314 249 1007 1363 789 -47 -610 -1297 -1485 -627 414 1029 1504 1234 454 -943 -1129 -1197
2990 -1197 -912 22 1073 1597 1219 4 -494 -1064 -1435 -940 292 992 1469 1118 571 -457 -1147 -1351
3008 -1351 -853 388 1150 1378 1229 301 -788 -1390 -1426 -743 195 1412 1252 877 431 -771 -1139 -1407 -635
3027 -635 209 952 1420 1523 407 -498 -1311 -1382 -579 294 1008 1152 1148 157 -539 -1323 -1277 -957 347 1032 1186
3048 1186 986 393 -856 -1288 -1244 -654 146 1003 1438 954 202 -715 -1197 -1372 -601 95 772 1465 906 288
3068 288 -642 -1173 -1204 -767 314 939 1469 1214 461 -837 -1254 -1418 -813 29 1049 1332 980 258 -661
3087 -661 -1332 -1462 -737 18 773 1237 1182 297 -833 -1349 -1273 -601 36 1105 1433 987 361 -660 -1205 -1134
3107 -1134 -1048 283 1045 1268 1273 440 -782 -1594 -1375 -810 -55 944 1327 1176 429 -523 -1521 -1487 -632 316
3127 316 1030 1417 1025 171 -482 -1132 -1508 -732 400 566 1275 1241 263 -789 -1450 -1025 -951 -85 963 1468
3147 1468 1146 362 -463 -980 -1470 -708 364 978 1347 1012 252 -597 -1185 -1248 -782 57 975 1613 1014 231
3167 231 -598 -1101 -1151 -874 71 1146 1501 1183 406 -558 -1183 -1675 -876 266 834 1427 1075 537 -641
3186 -641 -1129 -1219 -1050 200 1279 1283 1118 483 -359 -1053 -1556 -656 198 951 1415 1205 622 -521 -1458 -1191
3206 -1191 -607 -11 755 1731 1229 135 -531 -876 -1447 -848 226 1334 1292 1309 442 -335 -1172 -997 -600
3225 -600 -51 1005 1332 1359 458 -309 -1069 -1101 -1066 37 953 1175 892 447 -434 -1405 -1096 -779 178 724
3245 724 1275 1215 483 -531 -1116 -1379 -1049 31 1070 1398 916 122 -513 -942 -990 -907 239 862 1035 1182
3265 1182 514 -445 -1209 -1362 -687 -315 968 1210 1307 454 -639 -1311 -1536 -998 -14 980 1468 890 625
3284 625 -468 -1277 -1477 -688 326 721 1710 1272 492 -818 -1206 -1117 -1008 -74 923 1274 1108 514 -460
3303 -460 -1245 -1338 -990 72 999 1182 1176 612 -616 -1247 -1158 -830 -80 1019 1404 922 358 -379 -1126 -1332
3323 -1332 -804 127 1207 1147 1103 484 -431 -1261 -1246 -686 148 804 1177 1172 300 -521 -896 -1224 -1115 -91 874
3344 874 1408 963 436 -252 -1195 -1449 -899 251 939 1254 1241 478 -556 -974 -1207 -1021 -419 904 1448
3363 1448 1034 433 -305 -1173 -1457 -867 285 957 958 979 620 -556 -1107 -1161 -660 -118 576 1080 1017 391 -365
3384 -365 -724 -1137 -1100 74 1011 1275 937 343 -350 -1176 -1239 -797 -4 694 1245 1252 361 -681 -1043 -994 -896
3405 -896 -201 713 1186 793 415 -208 -1105 -1302 -938 53 887 1242 1082 370 -610 -1214 -1311 -609 44 723
3425 723 1242 955 309 -304 -931 -1606 -927 9 978 1263 1077 494 -376 -1219 -1080 -684 -75 825 1108 1158
3445 1158 197 -404 -995 -1344 -775 -21 701 1054 1081 542 -333 -1106 -1513 -670 -106 603 1347 1307 654 -369
3465 -369 -1044 -1126 -531 -129 901 1118 1105 76 -272 -1169 -1427 -726 -66 843 1138 1046 616 -232 -984 -982 -449
3486 -449 86 503 1238 991 289 -409 -727 -1028 -1105 -209 924 1105 914 453 -310 -1213 -1680 -566 128 503
3506 503 966 992 618 -526 -1108 -1141 -985 -135 645 1256 967 502 -250 -956 -1166 -874 296 847 775 1121
3526 1121 699 -311 -1090 -1299 -342 0 767 1214 1005 447 -437 -882 -1352 -778 82 1015 905 984 466 -304
3546 -304 -1049 -1204 -676 -185 520 1353 990 473 -411 -883 -1118 -941 -37 662 1150 771 365 -373 -961 -1115
3566 -1115 -933 20 552 1182 1105 632 -538 -1185 -1141 -548 -219 736 1323 1090 366 -397 -705 -1246 -1071 169
3586 169 891 991 1087 621 -486 -1088 -990 -560 -176 646 1274 1050 239 -452 -899 -1136 -1284 -156 865 1149
3606 1149 959 376 -168 -1130 -1196 -722 5 566 865 1050 727 -343 -957 -1117 -699 -226 771 1275 875 337
3626 337 -199 -961 -1095 -924 -135 774 908 1005 534 -194 -1218 -1073 -771 -224 569 1210 820 402 -391 -770
3646 -770 -1217 -875 -410 692 1209 699 448 -200 -1095 -1038 -596 86 586 761 741 357 -682 -756 -823 -841 -312
3667 -312 695 1253 1003 311 -311 -997 -1400 -800 238 737 1041 1037 539 -550 -975 -914 -741 -266 309 1003
3687 1003 884 437 -284 -827 -1000 -831 140 671 626 661 529 -182 -893 -926 -520 19 398 1359 1077 209 -313
3708 -313 -712 -893 -1023 -350 744 1043 846 219 -46 -746 -1099 -548 51 469 860 1166 588 -246 -747 -1078
3728 -1078 -1044 -380 552 1341 941 101 -221 -593 -1234 -721 55 694 952 762 502 -303 -998 -974 -542 -205
3748 -205 931 1119 904 87 -485 -767 -1012 -953 -169 947 1126 839 616 -150 -1032 -1041 -518 19 508 858
3768 858 838 418 -516 -814 -903 -713 -271 608 1320 635 386 -124 -726 -1136 -794 60 559 863 1194 499 -206
3789 -206 -875 -896 -444 -44 515 1132 840 303 -387 -752 -1059 -808 56 647 792 645 481 -620 -968 -932
3809 -932 -672 64 495 770 891 467 -239 -809 -922 -774 -186 795 1050 721 235 -122 -1061 -959 -664 324
3829 324 669 1007 911 459 -199 -956 -1008 -664 -146 767 1083 790 406 -367 -661 -1059 -783 92 698 698 892
3850 892 658 -233 -828 -941 -710 -65 633 1119 966 289 -268 -200 -995 -690 -317 502 943 770 451 -119
3870 -119 -774 -1122 -577 47 376 731 1068 357 -324 -620 -833 -845 -138 855 671 665 213 -101 -644 -1021 -764
3891 -764 135 536 755 829 598 -375 -744 -690 -708 -133 429 959 986 350 -216 -604 -1282 -753 -40 561 759
3912 759 668 475 -111 -772 -1024 -717 -171 197 1159 1044 441 -445 -968 -884 -918 -121 511 868 462 357 -170
3933 -170 -986 -1038 -638 -87 469 779 912 512 -291 -875 -807 -518 -53 427 1169 880 609 -277 -792 -1166 -832
3954 -832 101 188 757 673 509 53 -521 -824 -201 -64 254 1112 1189 514 -187 -730 -771 -875 -282 701 888
3975 888 779 316 93 -606 -1074 -479 -42 717 797 973 540 -364 -837 -654 -554 -230 554 889 751 257
3995 257 -124 -492 -1040 -747 105 611 810 924 751 -80 -781 -647 -535 -311 669 1070 876 300 -262 -533
4015 -533 -975 -766 -86 596 773 795 570 -64 -874 -1164 -716 -28 420 1298 1126 731 -398 -714 -868 -673
4035 -673 -72 512 963 634 277 -48 -771 -955 -725 183 485 701 824 515 -371 -863 -753 -594 -328 337
4055 337 1033 766 362 -161 -522 -1127 -816 -43 586 679 782 651 151 -672 -976 -612 -118 404 821 1056
4075 1056 74 -358 -829 -808 -887 -231 491 813 625 423 -97 -395 -1077 -799 50 338 669 778 461 -321
4095 -321 -891 -456 -566 -413 481 888 870 324 -169 -449 -733 -744 -154 550 627 557 503 33 -555 -867 -614 -247
4117 -247 360 672 718 175 -10 -535 -497 -838 -104 465 713 501 139 -25 -731 -777 -541 -50 250 782 1063
4138 1063 436 -435 -626 -792 -699 -319 271 747 887 290 -38 -399 -1195 -580 -87 515 554 770 554 -102
4158 -102 -515 -969 -431 -252 452 792 708 527 -191 -431 -822 -579 -43 540 556 556 381 -161 -631 -745 -472
4179 -472 -336 534 613 733 156 -344 -520 -768 -865 -138 555 819 720 364 -35 -596 -1068 -408 -17 413 573
4200 573 1054 476 -30 -677 -616 -511 -370 375 577 675 277 -103 -482 -686 -510 -3 367 358 746 609 -88
4221 -88 -624 -864 -324 -441 150 889 669 292 -386 -500 -832 -682 167 292 353 259 412 21 -856 -1024 -579
4242 -579 116 287 755 860 317 -101 -620 -569 -694 -287 569 674 681 92 -67 -433 -1068 -571 -13 387 461
4263 461 753 393 -100 -465 -620 -556 -51 188 902 782 508 -163 -398 -564 -839 -255 395 627 499 341
4283 341 165 -688 -804 -704 153 309 693 865 235 -160 -763 -792 -473 -121 309 742 532 268 -158 -557
4303 -557 -998 -566 181 448 533 427 479 -169 -521 -382 -489 -272 117 847 674 457 -341 -615 -529 -439 -144
4324 -144 733 547 425 485 -148 -697 -571 -376 -330 274 670 753 405 -107 -435 -687 -836 -472 152 695 470
4345 470 263 -70 -454 -760 -574 83 24 377 906 344 -220 -421 -544 -511 -405 549 601 737 269 38 -582
4366 -582 -999 -684 21 152 557 504 607 98 -880 -587 -491 -197 204 842 752 196 -118 -302 -733 -931 25
4387 25 245 696 701 178 -91 -845 -565 -618 47 257 524 761 565 -106 -467 -253 -759 -203 362 511 391
4408 391 284 -147 -391 -792 -492 -148 194 516 560 319 115 -729 -871 -588 -162 211 645 543 398 -31
4428 -31 -342 -500 -544 -50 302 692 527 351 -62 -307 -525 -374 -181 106 618 983 89 -191 -476 -598 -691
4449 -691 -70 313 394 614 347 -146 -403 -918 -417 -52 265 402 776 286 -15 -495 -718 -615 -127 324
4469 324 646 411 -45 16 -148 -888 -553 40 215 471 515 265 -59 -413 -648 -226 -68 294 646 667 79
4490 79 -47 -216 -673 -501 -71 543 532 274 431 242 -215 -664 -654 51 160 700 305 506 -51 -445 -414
4511 -414 -433 -255 124 853 627 168 310 -173 -588 -675 -24 375 568 495 659 -37 -771 -571 -337 -161 378
4532 378 572 568 254 -174 -535 -563 -242 60 64 578 465 341 -164 -355 -694 -483 0 -37 293 615 219 -435
4554 -435 -186 -440 -853 -182 369 402 440 479 -43 -636 -580 -365 124 341 350 575 310 53 -407 -615 -286 -70
4576 -70 172 536 753 240 147 -47 -822 -617 34 646 483 570 402 68 -623 -557 -163 -176 212 426 575 271
4598 271 1 -214 -647 -707 -298 130 533 690 613 -161 -610 -403 -345 43 132 513 542 307 -50 -375 -455 -504
4620 -504 -294 -64 529 543 236 -102 -334 -587 -440 -85 425 485 427 466 197 -612 -386 -740 -200 251 675
4641 675 593 91 112 -340 -587 -412 -101 2 333 733 533 60 -392 -499 -277 67 268 533 888 340 -45
4662 -45 -374 -593 -272 -182 316 560 259 42 -92 -376 -667 -495 43 -61 302 554 245 93 -446 -338 -637
4683 -637 -125 299 386 474 138 5 -359 -436 -656 -102 23 367 673 356 -4 -517 -495 -413 -191 31 448 511
4705 511 183 -104 -258 -650 -588 -144 -91 370 417 371 22 -375 -689 -310 -156 276 326 527 286 -16 -574 -223
4727 -223 -454 -307 171 380 477 390 -11 -525 -840 -570 -198 184 482 432 291 -41 -220 -515 -245 -50 162
4748 162 487 655 187 -25 -101 -314 -304 -192 206 510 530 220 204 -243 -575 -443 81 187 444 693 399
4769 399 49 -447 -482 -419 -202 432 401 288 228 -72 -291 -523 -270 44 206 372 534 422 72 -177 -340
4790 -340 -230 -122 -238 546 610 120 174 -277 -615 -544 -37 140 348 467 254 -166 -161 -457 -341 152 -201 196
4812 196 559 149 -54 -284 -312 -466 -188 459 590 311 84 344 -312 -413 -481 -115 244 462 204 399 -294
4833 -294 -200 -422 -336 -282 -77 663 519 281 25 -251 -465 -559 -166 173 338 426 355 -138 -403 -356 -392 -385 47
4856 47 551 454 324 -154 -317 -557 -296 202 28 441 402 252 264 -341 -609 -212 -167 236 512 646 502 84
4878 84 -293 -455 -664 -58 268 575 8 210 286 5 -405 -602 31 142 265 530 433 -137 -507 -207 -253
4899 -253 -210 192 447 472 162 -36 -541 -558 -411 -155 230 198 466 559 48 -315 -573 -133 -137 269 291 564 90
4922 90 -114 -144 -423 -247 -145 309 518 459 457 49 -237 -474 19 102 146 113 667 510 -196 -256 -487 -290 -131
4945 -131 178 336 389 328 25 -68 -183 -367 174 164 390 417 225 108 -248 -190 -475 -188 129 361 497 404
4967 404 36 -205 -443 -478 -375 -17 209 431 354 172 -329 -553 -373 -40 63 87 548 51 -234 -83 -303
4988 -303 -450 -324 -1 221 430 200 152 -148 -566 -404 3 237 -24 448 370 -107 -276 -490 -297 -521 90
5009 90 376 433 132 80 -338 -388 -349 33 216 83 421 257 141 -349 -583 -467 -190 196 329 382 251 -147
5031 -147 -132 19 -328 -442 -37 374 403 341 215 -344 -435 -205 9 95 159 532 158 -135 -409 -472 -205 -290 74
5054 74 523 454 -2 62 -201 -378 -481 -124 413 215 574 364 247 -266 -522 -226 -68 61 316 304 -36
5075 -36 100 -92 -231 -289 -334 265 374 444 320 108 -219 -385 -259 -309 253 171 558 369 -134 -329 -253 -282 -175
5098 -175 8 372 394 199 11 -102 -493 -336 -247 162 315 320 177 103 -23 -441 2 -146 -48 627 504 163
5120 163 143 -230 -388 -586 -420 137 372 165 195 15 -215 -456 -87 -153 -11 312 391 151 -198 -417 -362 -64
5142 -64 -192 185 153 493 167 241 -275 -480 -242 -76 191 410 357 457 -82 -135 -8 -319 -475 180 294 410
5164 410 186 173 -71 -119 -178 -159 5 241 573 375 -78 -356 -393 -261 -330 146 250 274 385 55 -75 -437
5186 -437 -608 -212 210 359 379 327 -18 -315 -387 -115 -70 82 166 353 451 155 -217 -286 -258 -285 -57 480 144
5209 144 12 65 -100 -363 -445 9 112 184 574 435 138 -299 -165 -353 -362 -203 180 400 194 122 -405 28
5231 28 -429 -142 314 272 343 647 99 -165 -274 -149 49 111 61 429 481 -138 -464 -187 -270 -234 233 128 611
5254 611 261 109 -263 -447 -183 -230 311 183 421 553 66 -123 -267 -245 -109 -117 232 392 61 84 -402 -350
5276 -350 -392 -172 -91 436 114 459 313 -188 -371 -154 -118 -34 191 259 440 100 -286 -357 -597 -97 222 220 185
5299 185 137 206 -102 -156 -295 18 -11 116 359 269 -5 -268 -302 -303 -373 44 395 372 62 114 -53 -492 -293 -72
5323 -72 -204 169 257 486 -77 -191 -156 -335 -182 165 242 392 199 -115 -69 -3 -406 -278 163 -91 338 149
5345 149 113 -350 -437 -360 -342 7 329 456 241 -133 -212 15 -371 -237 29 188 59 432 133 143 -373 -346
5367 -346 -106 -6 32 261 275 88 -181 -350 -391 -385 124 200 220 138 134 123 -341 -287 -274 -90 358 386 179 227 -241
5392 -241 -178 -371 -180 87 272 422 267 -77 150 -171 -450 5 236 277 487 325 94 -216 -168 -448 -20
5413 -20 151 107 317 301 -92 -13 -2 -148 -168 -45 338 68 513 3 148 -314 -476 -348 124 261 335 95
5435 95 -172 -32 -310 -522 -268 115 148 452 16 49 -61 -391 -328 -140 38 447 202 348 160 -189 -181 -100
5457 -100 -90 40 261 439 320 185 -126 -354 -347 -243 -107 163 371 354 106 -226 -109 -125 -94 -39 109 168 272
5480 272 -264 -272 -433 -200 -322 -109 226 432 257 355 52 -154 -274 -364 214 185 96 454 167 -293 -448 -211
5502 -211 -336 -104 348 425 266 83 -112 -208 -205 -45 201 156 587 96 141 -8 -162 -288 -114 163 298 428
5524 428 310 294 -146 -338 -254 -381 -322 205 208 111 89 -89 -25 -240 18 5 280 207 101 -2 -154 -227 -299 -165
5548 -165 15 436 56 146 106 79 -119 -455 67 -130 241 -46 112 -58 38 -253 95 -88 20 20 55 293
5570 293 83 -101 -441 -245 -234 -129 -73 254 426 74 -114 -151 -307 -55 137 364 117 229 289 -300 -327 -188
5592 -188 11 -67 223 389 180 73 147 -20 -377 -199 -40 205 182 517 23 42 -243 -171 -290 -198 428 246
5614 246 259 124 62 -53 -467 -63 95 69 372 152 37 -144 -104 -156 -24 -128 -6 762 231 176 -71 -237
5636 -237 -166 -320 20 202 281 166 93 -15 -333 -234 -259 -139 165 63 145 -84 91 42 -245 -112 -166 -13 319
5659 319 77 -52 173 -213 -370 -207 59 134 185 97 211 -14 -107 -445 -32 102 23 119 167 169 -71 -293 -44
5682 -44 -217 -198 133 76 415 388 154 -330 -402 -133 -83 165 151 202 167 -73 -97 -218 -172 -210 318 351 50 -131
5706 -131 -80 -358 -134 -367 -117 129 363 189 412 -242 -177 -310 -85 235 -17 331 161 85 -55 -49 -387 -445
5728 -445 175 238 81 295 132 -225 -215 -156 -380 -14 -12 250 56 201 -197 -285 -412 -21 -64 232 248 278 46
5751 46 40 -15 -442 -211 100 -41 340 246 -105 -34 -133 -149 -239 -336 45 567 381 -106 -27 -318 -565 -160 -78 122
5775 122 265 105 120 -84 -268 -413 -297 -163 164 359 127 106 100 -142 -307 -240 -94 260 239 233 204 -50 -233
5798 -233 -196 -398 -133 299 170 58 -21 66 -157 -222 -255 -15 195 278 -22 90 5 -218 80 -310 236 427
5820 427 47 211 140 -102 -311 -432 -107 -123 -235 347 122 221 -151 -283 -400 -350 13 161 43 248 189 9
5842 9 -356 -398 -252 392 148 162 237 211 -309 -181 -153 -175 -122 -197 21 109 -62 -145 -11 -526 -107 -166 11 247
5866 247 363 57 -86 -389 -237 -146 -61 184 178 113 -59 -224 -277 -216 -62 27 62 119 208 184 -140 -132 -378 -75 -38
5891 -38 40 298 459 -84 -84 -22 -350 -147 26 19 399 182 183 -12 -255 -553 -206 9 63 87 358 -53 176 -337
5915 -337 -265 -119 -73 135 278 339 15 86 -382 -78 -177 85 188 309 122 306 -82 -157 -202 -174 57 255 429
5938 429 341 154 -142 -122 -246 -242 164 174 194 -46 101 -128 -213 -343 -205 89 258 203 255 38 -14 -217 -262 -256
5962 -256 -213 97 120 53 221 -6 -570 -291 -309 -112 158 248 334 144 8 -33 -166 -12 -79 -72 329 324 324 -126 -432
5987 -432 -135 -345 -240 94 125 212 109 45 -299 -496 22 -83 19 317 304 101 -241 -205 -219 -275 66 244
6009 244 316 138 249 -127 70 -634 -227 -35 405 148 73 306 222 -10 -255 23 144 -53 138 355 -131
6030 -131 -83 -297 -275 -377 14 87 141 290 132 -234 2 -478 -384 -49 -74 122 375 188 -116 -315 -267 -121
6052 -121 -120 9 209 -40 211 -231 -101 -433 -240 82 -40 103 22 135 86 -96 -193 -247 14 190 427 220
6074 220 54 82 -261 -246 -183 90 61 257 336 -33 -226 -147 -68 -345 -27 252 82 238 393 149 -41 -205
6096 -205 -421 -71 331 404 236 -297 -192 -298 -169 -307 170 297 44 233 102 51 -84 -154 -223 -253 170 275
6118 275 163 -64 -14 -292 -131 -237 -52 82 196 49 -106 11 -104 -388 -229 -139 266 271 322 -179 60 -259
6140 -259 -254 173 -74 85 -92 146 -312 -126 -58 -133 -303 -115 28 -19 32 94 -26 -72 -236 -306 36 120 48 228
6164 228 17 0 -336 -364 -37 183 75 144 162 172 43 -122 -251 -201 -124 -17 87 405 447 186 8 -178 -204
6187 -204 -105 -58 194 295 192 60 -28 -188 -53 49 11 81 352 -153 111 -195 -35 19 -42 -192 -92 119
6209 119 32 42 -263 -93 -185 -142 33 335 202 53 105 -138 -229 -32 17 176 189 97 103 -78 -284 -55 -215 16
6233 16 199 161 267 150 -61 -241 -12 24 63 9 141 57 49 -149 -65 -461 -228 -177 2 218 370 2 62 -130
6257 -130 -224 -400 62 245 82 123 -69 -31 -206 -267 -238 105 239 238 231 207 49 -4 10 -169 -124 245 -202 345
6281 345 -80 -24 -198 -23 -77 -76 196 145 260 396 171 -108 -292 -90 81 178 71 -20 348 -200 -288 -268 -85
6304 -85 39 45 186 92 104 -235 -241 -89 -124 -148 -155 373 300 20 158 -22 -425 -194 68 -96 -97 265 232 32 -133
6329 -133 -201 -276 -14 122 193 219 -62 -211 -364 -186 -273 -103 -133 262 330 122 -58 -346 -221 66 -209 31
6351 31 251 16 261 -162 39 -52 -91 -134 85 31 315 168 253 -48 -152 -190 169 -160 206 352 146 155 29
6374 29 -246 -152 -239 44 -13 -119 28 -23 -43 -407 54 -113 179 233 204 113 76 -303 -107 -264 -136 73 386
6397 386 421 68 31 -136 -111 -418 -201 54 -28 269 126 -135 -25 29 23 -54 233 329 17 -13 -196 -460 -207
6420 -207 -75 -170 -12 -59 236 328 -10 -104 -267 104 -171 -5 153 303 -89 -41 -143 -116 -69 66 77 272 326
6443 326 154 -90 -89 -403 -34 126 -3 227 199 205 296 104 -22 -161 -54 -3 243 205 -58 -217 -124 -160 -121 -117
6467 -117 -78 189 -21 57 171 133 -65 -285 -10 104 -128 291 -22 17 13 -221 -325 -81 323 147 89 121 17
6490 17 -66 -51 -223 -118 -83 171 170 -65 -182 -243 147 -237 -54 25 45 -58 334 -198 -119 -80 -40 26 -201 428
6514 428 87 304 183 29 73 -372 6 -175 29 214 135 -6 -172 -221 -164 -358 -127 -71 355 -21 75 -122
6536 -122 -204 1 67 205 340 -14 203 87 156 -361 -140 -75 304 30 224 18 10 11 -112 -177 -267 152 -51
6559 -51 506 24 382 -64 -72 -237 -49 1 13 -15 182 40 52 -200 -288 41 -118 163 102 161 -37 -399 61
6582 61 -104 140 -11 239 174 -41 71 -50 -107 -42 79 -38 105 113 174 -206 16 -149 130 13 -157 144
6604 144 296 113 -20 -116 72 371 -119 -72 218 425 127 123 -134 -169 -317 -3 -162 -131 240 -112 54 -183
6626 -183 -150 -227 -122 114 282 284 158 14 -27 -174 -49 -37 33 195 35 212 185 201 -166 -57 -135 -21 350
6649 350 166 -15 115 109 -121 -132 -175 2 119 130 253 44 -223 -181 -157 -39 121 47 302 -63 6 168 -68
6672 -68 -159 -191 3 -137 -35 -25 68 117 -248 18 -141 -119 242 90 274 104 52 -59 -189 221 10 282 58
6695 58 20 30 -153 24 132 -218 74 180 55 176 41 33 -95 -124 -136 204 71 193 33 -35 -333 62 45
6718 45 53 194 -81 53 -21 147 47 -294 25 -273 111 71 215 294 21 -51 -77 -47 -118 308 214 385 162 205
6742 205 -314 56 -158 36 88 93 310 289 120 -114 -129 -4 -45 -186 48 229 75 -13 60 -164 -90 -276 62
6765 62 265 46 91 246 7 -114 -160 -96 -14 -199 391 -97 78 61 -128 -113 -342 -154 103 321 70 -72
6787 -72 80 -162 -343 -100 196 -83 162 -62 -157 -61 -76 -53 -137 -157 -17 102 302 313 39 -182 104 -215 -4
6810 -4 275 99 262 205 -26 -135 -146 -105 257 -27 159 187 107 -66 -278 -71 -214 -159 141 -18 23 107 120 -205
6834 -205 -25 -99 173 25 -2 17 7 36 -268 -58 -193 -37 312 175 194 -21 -46 -133 -300 37 -172 100 200
6857 200 80 62 278 -133 -334 -197 -47 162 153 3 115 -39 -298 -268 25 55 117 189 81 168 -207 -163 -70
6880 -70 -159 -154 107 216 210 -301 -15 -269 31 116 48 -23 115 158 -30 -8 -177 -214 10 -164 367 291 -80 -4 10
6905 10 -17 -145 -95 -31 37 235 178 -131 96 -177 -356 -240 213 62 23 331 -32 -129 -183 -14 -68 -183 21
6928 21 113 243 -22 4 -127 -179 263 -70 3 64 -41 -115 -33 -268 -375 -126 0 208 80 33 -142 -243 -255
6951 -255 -212 -33 -29 205 170 363 142 -259 -38 -96 115 -234 122 245 303 149 -321 -190 -218 -73 207 224 274
6974 274 -84 104 42 -8 -79 21 -98 166 117 57 5 5 -190 -150 -105 31 -116 89 164 -180 -19 -6 -189 -77
6998 -77 -27 -87 -3 -70 48 1 -141 -240 -137 150 226 165 71 -98 -81 -88 97 21 -26 -21 28 287 -46 -172 -148 -70 -92
7025 -92 23 -191 -46 -49 125 -115 -102 67 -7 -120 304 261 115 13 -113 -25 30 -317 -98 93 340 198 201
7048 201 1 148 -193 40 47 -3 -31 382 158 98 -67 32 52 -120 105 -170 61 -147 -39 -52 -179 -99 123
7071 123 -4 -78 15 49 -107 -101 -196 -67 -267 124 36 -62 -140 -197 -222 -11 -146 -95 62 204 -51 71 51 -147
7095 -147 -106 56 94 -139 57 212 -27 -41 23 -367 -103 -110 45 251 203 91 -148 -283 75 -31 64 -195 139
7118 139 375 200 -123 -276 -137 34 -218 15 -63 18 -16 -65 -247 -343 -108 -112 407 246 3 12 99 -64 -223
7141 -223 -289 109 59 168 171 -116 -159 -82 -43 45 -14 116 305 -148 115 46 -171 -355 -245 -170 275 -4 -123 82
7165 82 135 63 -180 -91 70 10 262 299 -45 -5 41 -21 19 -169 -48 -48 54 38 2 -372 -172 70 -147 146 34
7190 34 185 184 -236 57 -131 -198 -231 -54 8 -86 5 -139 -32 -92 53 -386 236 147 226 214 39 -88 -76 -258
7214 -258 -85 76 0 75 -23 249 -183 97 36 47 144 -96 373 181 -52 43 -82 -10 -11 107 105 -10 -143 245
7238 245 24 -30 -172 30 161 238 285 337 59 -34 94 -189 148 19 232 253 105 -61 -92 53 -84 -69 94
7261 94 -26 74 281 -35 -24 -270 80 59 49 122 392 63 -182 -16 -292 -159 -89 51 -112 145 -134 -42
7283 -42 82 -39 -134 40 -129 122 258 131 -141 3 -59 29 -109 -113 -142 300 -100 389 -236 -255 -209 -14 71
7306 71 -150 136 147 -11 -220 -12 -166 -108 0 199 291 -8 -242 -9 -61 -200 -147 92 209 49 71 3 -343
7329 -343 -141 -90 25 161 7 206 289 -197 54 -152 -132 93 18 28 279 58 211 -161 -71 -122 184 225 132
7352 132 55 -77 -225 -178 -94 -47 15 78 -76 101 -15 170 -11 6 43 30 138 133 64 10 -95 -50 11 -109 116
7377 116 -112 36 19 -87 -47 -215 89 -287 -13 -10 -117 96 -29 118 -146 -180 -72 -289 -172 -12 91 -196
7399 -196 -95 -224 -140 187 20 358 -24 -56 135 78 -149 -28 -5 95 33 328 -307 -19 171 11 -40 41
7421 41 -110 -173 111 144 69 -176 -89 -90 -224 -6 221 -101 111 -76 -171 -119 67 91 28 62 296 -146 79 -194
7445 -194 13 -200 -211 -71 -132 -130 153 260 101 -117 -283 -195 -27 31 99 -78 -213 -199 -108 6 -252 97 185
7468 185 139 96 16 46 -145 58 -105 -66 12 318 -222 -10 -63 -162 -21 -205 -55 14 78 250 98 256 88
7491 88 46 -229 -31 -226 259 194 101 173 55 -225 -77 50 98 83 238 140 -55 3 -84 -139 41 87 -45 129
7515 129 -71 43 -293 261 -50 28 297 -14 165 -46 46 91 -56 -60 -141 -16 64 332 -18 63 -135 -141 -99 -36
7539 -36 188 72 106 179 52 -102 -205 -51 -109 -119 -36 71 93 29 51 -66 -133 -160 -115 -47 27 150 112 91 -141
7564 -141 -418 -34 227 110 -47 184 108 -212 8 -1 -258 261 -61 -22 80 -14 56 -36 -201 138 90 35 210
7587 210 20 -196 -428 -151 -262 -123 117 40 -55 82 -11 -51 -58 -12 -186 -110 184 -61 280 190 -75 118 -62
7610 -62 25 -91 -143 118 -25 -54 223 -304 -100 217 -24 60 211 86 82 40 -188 22 -217 229 89 -11 167
7633 167 -190 -84 -21 60 0 62 77 269 148 -54 -112 -9 -176 -20 294 3 97 77 180 282 -155 -74 88
7656 88 -7 372 46 93 64 -220 100 -198 -123 10 -39 211 5 208 -71 159 80 -62 -66 -167 71 -250 -146
7679 -146 -343 13 -145 -221 -30 77 64 92 -39 -71 -182 -233 -43 89 230 -32 -138 -220 130 -115 -217 -51
7701 -51 65 221 101 52 -107 -222 -114 -86 18 -35 49 128 -105 -216 -141 36 -190 -22 -6 77 -4 158 182 -140
7725 -140 -517 46 -59 -68 189 138 168 -80 33 -52 30 -116 29 27 131 105 61 -312 -188 -34 35 55 223 157
7749 157 45 -75 -230 83 -123 -64 -202 -22 53 -66 104 -151 -153 -62 -81 106 327 250 162 -207 -262 -86 -101
7772 -101 -219 73 0 171 287 132 -29 -188 -125 -55 -12 -111 144 239 6 -94 -346 -271 -46 -213 42 238
7794 238 307 67 -56 -169 -140 -208 368 45 56 346 125 -109 35 0 87 16 37 276 -104 -116 350 -262 106
7817 106 214 170 -78 15 -122 -76 -106 -152 -45 189 233 -187 -90 102 7 -5 -112 39 34 -167 -38 352 51 1
7841 1 37 -227 -281 -75 225 -1 106 82 233 47 -98 4 137 65 -30 1 208 43 188 -89 -272 -90 96
7864 96 235 -46 78 201 -81 -273 -11 28 131 14 285 26 -124 74 -51 -133 -149 -280 16 211 24
7885 24 -73 -42 57 -220 -245 173 -17 74 17 127 171 -166 -296 65 100 94 172 124 44 44 -160 -476 -126 -98 93 -47
7911 -47 -24 -183 177 -134 -97 -162 57 -36 -28 250 97 -15 -91 -321 -85 23 137 183 103 138 -53 -50 -233 -35
7935 -35 151 33 71 -13 46 23 -266 -60 -244 -50 -11 223 -77 67 -84 35 -378 66 48 -124 157 414
7957 414 240 -124 -26 -68 -190 20 21 101 266 -5 -59 -166 -151 -40 -96 59 117 -54 -75 128 -109 -265 29
7980 29 -15 210 -96 133 -16 -69 0 -163 -102 16 -24 -29 84 -22 40 -194 -2 14 167 186 27 -107 293 -106
8004 -106 16 -249 -207 33 138 65 102 152 62 -67 -133 -298 -51 26 75 254 -92 90 -25 -23 -34 -223 -135 132
8028 132 54 -142 -22 -98 192 -78 -138 18 192 74 10 60 -237 59 -206 103 -53 -110 76 97 -31 -230
8050 -230 -151 -21 36 -24 151 273 52 58 -114 -110 -73 267 124 121 165 -77 -41 21 24 60 -55 -267 263 41 -122
8075 -122 -125 149 -90 -239 -163 -186 85 -65 -54 99 -69 -439 25 126 12 -55 -58 47 123 -30 -280 4 35
8098 35 32 12 -9 -127 -68 -65 -41 60 159 41 228 21 196 194 48 -124 -155 -108 35 2 146 79 -34 -10 -140 0
8124 0 70 -72 370 -90 190 -7 -341 17 -123 26 -44 140 228 -113 -26 -59 -245 39 -24 -2 171 145 103 -155
8148 -155 -261 -100 -62 -62 15 122 -28 256 -112 -210 -60 -29 -83 233 -85 -110 4 20 -223 -315 -207 9 138
8171 138 -49 -5 -101 67 -40 -60 -118 -161 367 225 -17 143 25 -93 -128 -37 -41 158 327 -92
8191i2
##END NTUPLES=NMR FID
##END=
