##TITLE=1H_SR110
 CDCl3
 8 sc, 
 18.03.2022
##JCAMPDX= 6.0         $$ Bruker NMR JCAMP-DX V2.0
##DATA TYPE= NMR FID
##DATA CLASS= NTUPLES
##ORIGIN= UXNMR, Bruker Analytische Messtechnik GmbH
##OWNER= root
$$ XWIN-NMR		Version 3.5
$$ Fri Mar 18 13:46:07 2022 Russian Standard Time (UT+4h)  she@DPX200
##.OBSERVE FREQUENCY= 200.131346
##.OBSERVE NUCLEUS= ^1H
##.DELAY= (6, 6)
##.ACQUISITION MODE= SIMULTANEOUS
##.ACQUISITION SCHEME= undefined
##.AVERAGES= 8
##.DIGITISER RES= 18
##SPECTROMETER/DATA SYSTEM= spect
##.PULSE SEQUENCE= zg30
##.SOLVENT NAME= CDCl3
##.SHIFT REFERENCE= (INTERNAL, CDCl3, 0, 15.7039)
##AUDIT TRAIL= $$ (NUMBER, WHEN, WHO, WHERE, WHAT)
$$ ##TITLE= Audit trail, XWIN-NMR		Version 3.5
$$ ##JCAMPDX= 5.01
$$ ##ORIGIN= Bruker BioSpin GmbH
$$ ##OWNER= she
$$ F:/spectra/data/she/nmr/H-F/1/audita.txt
$$ ##AUDIT TRAIL=  $$ (NUMBER, WHEN, WHO, WHERE, WHAT)
(   1,<2022-03-18 13:45:05.75 +0400>,<she>,<DPX200>,
      <created by zg, POWCHK disabled, PULCHK disabled
       configuration hash MD5:
       00 E9 B6 7A A2 85 ED C7 34 08 36 98 17 FE 4E 26
       data hash MD5: 16K
       61 77 9D 38 1B B7 46 5B 1D 3C 3B C6 B0 1B 94 C5>)
$$ ##END=
$$ 
$$ hash MD5
$$ 26 C4 ED 61 31 DF E9 BF B7 2C 44 31 8E 3F 8F 58
##$RELAX= 
##$RELAX= 
##$RELAX= 
##$RELAX= 
##$RELAX= 
##$RELAX= 
$$ Bruker specific parameters
$$ --------------------------
##$DU= <F:/spectra>
##$EXPNO= 1
##$NAME= <H-F>
##$PROCNO= 1
##$TYPE= <nmr>
##$USER= <she>
##$AMP= (0..31)
100 100 100 100 100 100 100 100 100 100 100 100 100 100 100 100 100 100 
100 100 100 100 100 100 100 100 100 100 100 100 100 100 
##$AQSEQ= 0
##$AQ_mod= 1
##$AUNM= <au_zg>
##$AUTOPOS= <>
##$BF1= 200.13
##$BF2= 200.13
##$BF3= 200.13
##$BF4= 200.13
##$BF5= 200.13
##$BF6= 200.13
##$BF7= 200.13
##$BF8= 200.13
##$BYTORDA= 1
##$CFDGTYP= 0
##$CFRGTYP= 5
##$CHEMSTR= <none>
##$CNST= (0..31)
1 1 145 1 1 1 1 1 1 1 1 1 1 1 1 1 1 1 1 1 1 1 1 1 1 1 1 1 1 1 1 1 
##$CPDPRG= <>
##$CPDPRG1= <>
##$CPDPRG2= <>
##$CPDPRG3= <>
##$CPDPRG4= <mlev>
##$CPDPRG5= <mlev>
##$CPDPRG6= <mlev>
##$CPDPRG7= <mlev>
##$CPDPRG8= <mlev>
##$CPDPRGB= <>
##$CPDPRGT= <>
##$D= (0..31)
0 1.2 0 0 0 0 0 0 0 0.06 0 0.03 0 0 0 0 0.0002 0 0 0 0 0 0 0 0 0 0 0 0 
0 0 0 
##$DATE= 1647596705
##$DBL= (0..7)
120 120 120 120 120 120 120 120 
##$DBP= (0..7)
150 150 150 150 150 150 150 150 
##$DBP07= 0
##$DBPNAM0= <>
##$DBPNAM1= <>
##$DBPNAM2= <>
##$DBPNAM3= <>
##$DBPNAM4= <>
##$DBPNAM5= <>
##$DBPNAM6= <>
##$DBPNAM7= <>
##$DBPOAL= (0..7)
0.5 0.5 0.5 0.5 0.5 0.5 0.5 0.5 
##$DBPOFFS= (0..7)
0 0 0 0 0 0 0 0 
##$DE= 6
##$DECBNUC= <off>
##$DECIM= 32
##$DECNUC= <off>
##$DECSTAT= 4
##$DIGMOD= 1
##$DIGTYP= 9
##$DL= (0..7)
0 120 120 120 120 120 120 120 
##$DP= (0..7)
150 150 150 150 150 150 150 150 
##$DP07= 0
##$DPNAME0= <>
##$DPNAME1= <>
##$DPNAME2= <>
##$DPNAME3= <>
##$DPNAME4= <>
##$DPNAME5= <>
##$DPNAME6= <>
##$DPNAME7= <>
##$DPOAL= (0..7)
0.5 0.5 0.5 0.5 0.5 0.5 0.5 0.5 
##$DPOFFS= (0..7)
0 0 0 0 0 0 0 0 
##$DQDMODE= 0
##$DR= 18
##$DS= 0
##$DSLIST= <SSSSSSSSSSSSSSS>
$$ [...]
##$SUBNAM2= <"">
##$SUBNAM3= <"">
##$SUBNAM4= <"">
##$SUBNAM5= <"">
##$SUBNAM6= <"">
##$SUBNAM7= <"">
##$SUBNAM8= <"">
##$SUBNAM9= <"">
##$SW= 18.0517287032376
##$SWIBOX= (0..15)
0 0 2 0 0 0 0 0 0 0 0 0 0 0 0 0 
##$SW_h= 3612.71676300578
##$TD= 16384
##$TD0= 1
##$TE= 0
##$TE2= 300
##$TE3= 300
##$TEG= 300
##$TL= (0..7)
0 120 120 120 120 120 120 120 
##$TP= (0..7)
150 150 150 150 150 150 150 150 
##$TP07= 0
##$TPNAME0= <>
##$TPNAME1= <>
##$TPNAME2= <>
##$TPNAME3= <>
##$TPNAME4= <>
##$TPNAME5= <>
##$TPNAME6= <>
##$TPNAME7= <>
##$TPOAL= (0..7)
0.5 0.5 0.5 0.5 0.5 0.5 0.5 0.5 
##$TPOFFS= (0..7)
0 0 0 0 0 0 0 0 
##$TUNHIN= 0
##$TUNHOUT= 0
##$TUNXOUT= 0
##$USERA1= <user>
##$USERA2= <user>
##$USERA3= <user>
##$USERA4= <user>
##$USERA5= <user>
##$V9= 5
##$VALIST= <valist>
##$VCLIST= <CCCCCCCCCCCCCCC>
##$VD= 0
##$VDLIST= <DDDDDDDDDDDDDDD>
##$VPLIST= <PPPPPPPPPPPPPPP>
##$VTLIST= <TTTTTTTTTTTTTTT>
##$WBST= 1024
##$WBSW= 4
##$XGAIN= (0..3)
0 0 0 0 
##$XL= 0
##$YL= 0
##$YMAX_a= 315578
##$YMIN_a= -491882
##$ZGOPTNS= <>
##$ZL1= 120
##$ZL2= 120
##$ZL3= 120
##$ZL4= 120
##$ABSF1= 10
##$ABSF2= 0
##$ABSG= 5
##$ABSL= 3
##$ALPHA= 0
##$AQORDER= 0
##$ASSFAC= 0
##$ASSFACI= 0
##$ASSFACX= 0
##$ASSWID= 0
##$AUNMP= <proc_1d>
##$AZFE= 0.1
##$AZFW= 0.1
##$BCFW= 1
##$BC_mod= 2
##$BYTORDP= 1
##$COROFFS= 0
##$CY= 11.3945322036743
##$DATMOD= 1
##$DC= 2
##$DFILT= <>
##$DTYPP= 0
##$F1P= 2.36226072786647
##$F2P= -0.459571619588291
##$FCOR= 0.5
##$FTSIZE= 0
##$FT_mod= 4
##$GAMMA= 1
##$GB= 0.15
##$INTBC= 1
##$INTSCL= 1
##$ISEN= 128
##$LB= 0.24
##$LEV0= 0
##$LPBIN= 0
##$MAXI= 10000
##$MC2= 0
##$MEAN= 0
##$ME_mod= 0
##$MI= 1.114404
##$NCOEF= 0
##$NC_proc= 0
##$NLEV= 6
##$NOISF1= 3.799351
##$NOISF2= 2.8
##$NSP= 1
##$NTH_PI= 0
##$NZP= 0
##$OFFSET= 15.70392
##$PC= 1
##$PHC0= -17312.3
##$PHC1= 8.00078
##$PH_mod= 1
##$PKNL= yes
##$PPARMOD= 0
##$PSCAL= 0
##$PSIGN= 0
##$REVERSE= no
##$SF= 200.130013532006
##$SI= 16384
##$SIGF1= 3
##$SIGF2= 2
##$SINO= 400
##$SIOLD= 16384
##$SREGLST= <1H.CDCl3>
##$SSB= 0
##$STSI= 0
##$STSR= 0
##$SW_p= 3612.71676300578
##$SYMM= 0
##$S_DEV= 0
##$TDeff= 0
##$TDoff= 0
##$TI= <>
##$TILT= no
##$TM1= 0
##$TM2= 0
##$TOPLEV= 0
##$USERP1= <user>
##$USERP2= <user>
##$USERP3= <user>
##$USERP4= <user>
##$USERP5= <user>
##$WDW= 1
##$XDIM= 8192
##$YMAX_p= 0
##$YMIN_p= 0
$$ End of Bruker specific parameters
$$ ---------------------------------
##NTUPLES= NMR FID
##VAR_NAME=  TIME,          FID/REAL,        FID/IMAG
##SYMBOL=    X,             R,               I
##VAR_TYPE=  INDEPENDENT,   DEPENDENT,       DEPENDENT
##VAR_FORM=  AFFN,          ASDF,            ASDF
##VAR_DIM=   8192,          8192,            8192
##UNITS=     SECONDS,       ARBITRARY UNITS, ARBITRARY UNITS
##FACTOR=    0.0002768,     1,               1
##FIRST=     0,             0,               0
##LAST=      2.2672688,     0,               0
##MIN=       0,             -491882,         0
##MAX=       2.2672688,     315578,          0
$$ Real data points
##PAGE= N=1
##DATA TABLE= (X++(R..R)), XYDATA
$$ [...]
$$ plain form
2826 -1966 -5453 -6237 -4363 -801 3450 6464 5658 2856 -1177 -4989 -6391 -5002 -987 3279 5622
2841 5622 5875 3557 -873 -4738 -6057 -4927 -1594 2555 5571 6308 3886 -409 -4320 -6254 -5292 -2008
2857 -2008 2456 5290 6288 3943 232 -4056 -6016 -5394 -2271 1602 4830 6184 4643 707 -3665
2872 -3665 -5645 -5508 -2972 782 4807 6043 4772 1057 -2869 -5590 -5600 -3463 705 4379 6117 5014
2888 5014 1617 -2457 -5315 -5806 -4034 52 4028 5975 5297 2165 -1873 -4910 -5926 -4103 -266
2903 -266 3478 5772 5514 2704 -1457 -4625 -5838 -4483 -765 3128 5472 5478 2923 -871 -4336 -5924
2919 -5924 -4813 -1252 2488 5160 5413 3509 -406 -3919 -5979 -4956 -1858 1980 5085 5733 3928
2934 3928 101 -3743 -5579 -5063 -2328 1490 4826 5611 4166 729 -3333 -5402 -5492 -2647 978 4417
$$ packed form
2826a966l487p84J874L562M251L014q06k802m033l812j402J389M015M266K343
2841E622K53k318m430l865j319J130L333M149L016P37k422m295l911j934R62L284
2857b008M464K834R98k345l711m288j960O22L123L873L228J354j541l936m372
2872c665j980J37K536L754M025J236j271l715l926k721j0K137M168L674J738j103
2888E014l397m074k858m91J772M086L976J947o78l132m038l037j016J823L837
2903b66L744K294k58k810m161l168j213J355L718L893K344Ok555l794l465j588
2919e924J111L561L740K672K53j904l915l513k060J023L098L838L105O48j805
2934C928l827l844j836N16K735L818L336P85j445l437m062k069r0K845L625L439
$$ plain form
2950 4417 5831 4722 1044 -2668 -5282 -5545 -3285 556 4097 5492 4804 1491 -2115 -5036 -5380 -3450
2966 -3450 178 3797 5492 4879 2221 -1707 -4841 -5497 -3646 -267 3339 5408 4873 2239 -1528 -4330
2982 -4330 -5399 -4066 -597 2851 5300 5249 3187 -1079 -4266 -5468 -4143 -1136 2358 5020 5276 3083
2998 3083 -293 -3907 -5444 -4747 -1553 2093 4846 5320 3514 -163 -3730 -5246 -4663 -2073 1462 4605
3014 4605 5474 3758 303 -3219 -4977 -4846 -2452 1148 4377 5555 4015 771 -2576 -5018 -5004 -2946
3030 -2946 733 3899 5265 4187 1298 -2270 -4800 -5187 -3181 466 3452 4988 4601 1714 -1856
3045 -1856 -4430 -5411 -3410 -201 3147 5056 4583 2270 -1344 -4090 -5255 -3786 -407 2829 5080
3060 5080 4864 2489 -1024 -4000 -5013 -3895 -1168 2436 4904 5167 2845 -471 -3650 -5065 -4237 -1525
$$ packed form
2950D417J414j109l678l712k614k63K260L841L541J395o88l313l606k921l44J930
2966c450L628L619J695o13k658l928l134o56J851L379L606K069n35k634l767k802
2982d330j069J333L469L448K449n1k062m266l187j202J325L007L494K662K56k193
2998C083l376l614j537O97L194L646K753M74j806l677l567j516N83K590L535L143
3014D605Q69j716l455l522j758J31K394L600L229J178j540l244l347k442J4K058
3030b946L679L166J366j078k889l568k530l87K006L647K986J536l87k887l570
3045a856k574r81K001L209L348J909m73k313l614k746j165J469L379L236K251
3060E080k16k375l513k976j013J118K727L604K468K63k322l316l179j415Q28K712
$$ plain form
3076 -1525 1861 4227 4746 3347 -44 -3294 -4956 -4539 -2006 1564 4296 5081 3304 126 -2956 -4909
3092 -4909 -4962 -2386 1258 3836 5121 3744 765 -2464 -4553 -4480 -2410 411 3554 5005 4115 996
3108 996 -1956 -4344 -4760 -3175 541 3327 4816 4135 1750 -1765 -4247 -4828 -3296 -215 2896 4519
3124 4519 4433 1757 -1402 -4041 -4512 -3515 -720 2523 4544 4508 2334 -744 -3611 -5124 -3791 -862
3140 -862 2146 4496 4556 2582 -631 -3421 -4689 -3656 -1306 1962 4285 4555 2867 -44 -2928 -4845
3156 -4845 -4193 -1698 1669 3896 4583 3098 371 -2787 -4619 -4243 -2113 1017 3607 4620 3461 597
3172 597 -2226 -4443 -4366 -2269 754 3297 4520 3554 1260 -1978 -4126 -4272 -2502 303 3329 4631
3188 4631 3667 1429 -1562 -3944 -4315 -2958 16 2837 4428 3784 1830 -1070 -3846 -4489 -3203 -330
$$ packed form
3076a525L386K366N19j399l391l250j662M17K533L570K732P85j777l178l082j953
3092d909n3K576L644K578J285j377k979l229k089P3K070K821L143J451q90l119
3108I96k952k388m16J585L716K786J489o81k385l515k482n81J532L081L111J623
3124D519q6k676l159k639m71R97K795L243K021l6k174l078k867j513J333K929
3140h62L008K350O0j974l213k790j268J033K350L268K323K70j688k911k884j917
3156d845O52K495L367K227O87j485k727l158j832L76K130L130K590J013j159k864
3172E97k823k217P7K097L023K543J223r66k294l238k148j46J770K805L026J302
3188D631r64k238k991k382l71J357K974K821J591o44j954k900k776o43J286K873
$$ plain form
3204 -330 2492 4252 4099 2051 -832 -3346 -4518 -3496 -832 2414 4191 4050 2428 -292 -3125 -4296
3220 -4296 -3736 -1069 1917 3846 4314 2829 -209 -2817 -4110 -3689 -1658 1159 3839 4191 2855 216
3236 216 -2384 -4335 -3717 -1730 985 3268 4137 3264 401 -2258 -3979 -3860 -2168 429 3109 4447
3252 4447 3315 960 -1891 -3888 -4123 -2690 174 2873 3868 3504 1210 -1529 -3596 -4076 -2850 -266
3268 -266 2409 3984 3854 1541 -951 -3321 -4178 -2938 -599 2165 4126 3938 1995 -693 -3162 -4147
3284 -4147 -2986 -794 1935 3623 3665 2213 -430 -2983 -4159 -3445 -932 2008 3619 3919 2427 -156
3300 -156 -2702 -3948 -3344 -1303 1299 3410 4232 2670 30 -2487 -3777 -3796 -1830 1026 3469 3930
3316 3930 2988 323 -2060 -3958 -3843 -1819 928 3009 4041 3120 980 -1691 -3281 -3624 -2331 377
$$ packed form
3204c30K822J760j53k048k883k514j172J022K664L246J777j41j622k720k833j171
3220d296N60K667K986J929M68j485l038k608j293M21K031K817K680L52j336k639
3236B16k600j951O18J987K715K283Q69q73k863k659j721J19J692K597K680J338
3252D447j132k355k851j997k35J433K864K699R95l64k294k739k067m80J226K584
3268b66K675J575j30k313k492k370q57J240K339K764J961j88j943k688k469r85
3284d147J161K192K729J688M2j452k643k553j176P14K513K940J611L00j492k583
3300a56k546j246O04K041K602K111Q22j562k640k517j290j9J966K856K443M61
3316C930r42k665k383j898J15K024K747K081J032r21k140k671j590l43J293K708
$$ plain form
3332 377 2701 3887 3471 1223 -1429 -3313 -3713 -2496 -111 2302 3377 3410 1460 -1155 -3173 -3982
3348 -3982 -2718 -157 2165 3643 3554 1781 -840 -3331 -3696 -2884 -890 1989 3477 3623 1774 -448
3364 -448 -2677 -3810 -3087 -1051 1621 3424 3612 2153 -317 -2376 -3621 -3084 -1347 1209 3416 3559
3380 3559 2525 137 -2115 -3548 -3373 -1674 869 2918 3808 2733 631 -1961 -3542 -3513 -1904 640
3396 640 2453 3516 2763 682 -1633 -3200 -3690 -2139 316 2492 3596 2906 1091 -1264 -3058 -3498
3412 -3498 -2407 -131 2406 3513 3458 1041 -1365 -2948 -3235 -2443 -577 2108 3597 3293 1694 -848
3428 -848 -2785 -3615 -2612 -487 1596 3224 3158 1624 -296 -2809 -3698 -2723 -865 1499 3394 3386 2175
3445 2175 -81 -2200 -3227 -2993 -1156 1097 2836 3231 1929 288 -1806 -3680 -3023 -1326 670 2780
$$ packed form
3332C77K324J186m16k248k652j884m00J217K385K413J075L3j950k615k018q09
3348c982J264K561K322J478q9j773k621k491l65Q12J994K879J488J46j849k222
3364d48k229j133P23K036K672J803J88j459k470k059j245N37J737K556K207J43
3380C559j034k388k252j433J75J699K543K049Q90j075k102k592j581K9J609K544
3396F40J813J063p53k081k315j567m90J551K455K176J104o90j815k355j794m40
3412c498J091K276K537J107n5k417k406j583k87P92J866K685J489l04j599k542
3428h48j937q30J003K125K083J628o6j534j920k513q89R75J858K364J895qj211
3445B175k256k119j027K34J837K253J739L95j302j641k094j874O57J697J996K110
$$ plain form
3461 2780 3180 2540 490 -1955 -3315 -3506 -1462 338 2648 3396 2491 592 -1412 -3133 -3429 -1874
3477 -1874 370 2113 3440 3153 962 -1368 -3041 -3413 -1974 162 2097 3423 2806 1166 -1011 -2651
3493 -2651 -3361 -2185 -80 1912 3353 2800 1662 -602 -2790 -3053 -2597 -711 1567 3001 3265 1657
3509 1657 -293 -2379 -3136 -2519 -1043 1517 2905 3080 2008 -193 -2113 -3344 -2683 -1240 1052 2718
3525 2718 3127 2102 211 -1792 -3251 -2987 -1144 555 2734 2905 2287 95 -1993 -2812 -2821 -1630 680
3542 680 2357 3103 2525 334 -1632 -2860 -3316 -1737 357 2130 3265 2718 982 -1281 -2693 -3191
3558 -3191 -1854 -152 1973 3097 2994 1047 -1018 -2724 -3102 -2108 -289 1868 2909 2916 1609 -608
3574 -608 -2202 -3030 -2606 -439 1535 2826 2956 1794 -286 -2313 -3227 -2559 -864 992 2596 2973 2077
$$ packed form
3461B780M00o40k050k445j360j91K044J800K310P48r05j899k004j721k96J555
3477a874K244J743J327k87k191k330j673l72J439K136J935J326o17j640k177j640
3493b651p10J176K105J992J441n53j138k264k188k63M56J886K278J434K64j608
3509A657j950k086p57O17J476K560J388J75j072k201j920j231O61J443K292J666
3525B718M09j025j891k003j459K64J843J699K179J71o18k192k088q19rJ191K310
3542F80J677P46n78k191j966j228m56J579K094J773J135n47j736k263j412m98
3558c191J337J702K125J124j03j947k065j706l78R94J819K157J041Pj307k217
3574f08j594q28M24K167J974J291J30j162k080k027r14O68J695J856J604L77q96
$$ plain form
3591 2077 -138 -1927 -2867 -2641 -1069 1003 2600 2863 2020 102 -1780 -2812 -2836 -1332 778 2735
3607 2735 3027 2215 369 -1641 -2580 -2741 -1337 478 2209 3003 2453 796 -1395 -2866 -3177 -1636 173
3624 173 2018 2987 2634 941 -1148 -2532 -3010 -2017 -131 1734 2824 2565 1308 -980 -2331 -2871 -2002
3641 -2002 -399 1668 2672 2416 1428 -457 -2344 -2593 -2097 -592 1342 2938 2602 1448 -327 -1845
3657 -1845 -2859 -2352 -856 1013 2410 2814 1741 100 -2069 -2828 -2413 -1127 918 2460 2523 1908 119
3674 119 -1469 -2686 -2540 -1380 536 2250 2735 2035 340 -1605 -2689 -2543 -1436 408 1874 2732
3690 2732 2116 522 -1225 -2661 -2737 -1551 144 1768 2493 2328 617 -1090 -2536 -2625 -1954 -214 1374
3707 1374 2439 2484 872 -613 -2429 -2638 -1991 64 1778 2432 2354 1093 -609 -2263 -2539 -2079 -468
$$ packed form
3591B077k215j789r40K26J572K072J597K63q43j918j882j032k4J504K110J957
3607B735K92q12j846k010r39j61J404J815J731P94n50j657k191j471l11J541J809
3624A73J845R69l53j693k089j384m78R93J886J865J090k59j257k288j351n40Q69
3641b002J603K067J004k56r88j885j887k49M96J505J934J596l36j154j775j518
3657a845j014N07J496J869J397M04j073j641k169p59M15J286K045J542O3o15j789
3674A19j588j217J46J160J916J714M85p00j695j945j084J46J107J844J466Q58
3690B732o16j594j747j436p6J186J695J624P25j65j711j707j446q9O71J740J588
3707A374J065M5j612j485j816k09O47K055J714O54p8j261j702j654k76M60J611
$$ plain form
3724 -468 1259 2473 2339 1346 -98 -2077 -2643 -2243 -562 881 2260 2593 1576 -290 -1720 -2368 -2164
3741 -2164 -803 857 2045 2771 1786 125 -1543 -2483 -2256 -1229 661 2026 2762 2005 378 -1343
3757 -1343 -2488 -2405 -1550 31 1620 2539 1825 790 -1226 -2258 -2499 -1363 158 1810 2644 2083 528
3774 528 -919 -2293 -2487 -1731 -247 1966 2349 2245 983 -419 -2092 -2682 -1908 -341 1601 2519 2402
3791 2402 1210 -582 -1834 -2331 -2226 -557 1196 2172 2261 1520 -163 -1962 -2318 -2100 -737 1413 2195
3808 2195 2301 1747 -177 -1644 -2386 -2183 -587 596 2017 2467 1748 76 -1544 -2502 -2179 -1095 771
3825 771 1805 2619 1768 312 -1167 -2523 -2317 -1253 359 1782 2308 1662 602 -1058 -2215 -2500 -1451
3842 -1451 233 1467 2300 1770 449 -1067 -2025 -2369 -1640 -62 1568 2244 2222 865 -661 -2032 -2237
$$ packed form
3724d68J727J214j34r93j444j979n66M00J681J443J379L33j017j866j430o48K04
3741b164J361J660J188P26r85j661j668r40K27J027J890J365P36p57j627j721
3757a343j145Q3Q55J581J589R19p14j035k016j032k41J136J521J652Q34n61j555
3774E28j447j374j94P56J484K213L83j04j262j402j673n90P74J567J942R18j17
3791B402j192j792j252m97J05J669J753R76Q9p41j683j799l56K18J363K150P82
3808B195J06n54j924j467p42K03J596J183J421M50p19j672j620r58L23J084J866
3825G71J034Q14q51j456j479j356K06J064J612J423N26o46j060j660j157k85J049
3842a451J684J234Q33n30j321j516r58l44P29J578J630O76k2j357j526j371k05
$$ plain form
3859 -2237 -1787 -252 1319 2354 2177 1041 -563 -1884 -2451 -1714 -268 1073 2005 2349 1196 -378
3875 -378 -1574 -2056 -1673 -686 892 1957 2273 1324 9 -1547 -2069 -2065 -1121 743 1915 2253 1648 159
3893 159 -1105 -2469 -2004 -852 428 2102 2092 1749 192 -1227 -2027 -2166 -1117 373 1708 2311 1615
3910 1615 624 -877 -2038 -2288 -1224 132 1626 2348 1968 963 -853 -1927 -2333 -1393 -94 1313
3926 1313 1986 2064 931 -716 -1861 -2276 -1392 -322 1134 2143 2185 906 -444 -1698 -2057 -1619 -38
3943 -38 850 2061 2197 1365 -115 -1749 -1865 -2038 -481 774 1868 2215 1359 10 -1513 -2149 -1774 -571
3961 -571 697 1722 2083 1601 20 -1252 -2126 -2025 -1169 457 1726 2388 1529 419 -1350 -1807 -1964
3978 -1964 -1072 224 1717 2226 1562 656 -889 -1697 -2088 -1097 -123 1289 2248 1906 863 -717 -1900
$$ packed form
3859b237M50J535J571J035j77j136j604j321n67P37J446J341R32L44j153j574
3875c78j196m82L83R87J578J065L16r49j315j556n22MR44J864J172L38o05j489
3893A59j264j364M65J152J280J674j0l43j557j419q00j39J049J490J335O03o96
3910A615r91j501j161k50J064J356J494P22l80j005j816j074m06R40J299J407
3926A313O73P8j133j647j145m15Q84J070J456J009M2j279j350j254l59M38J581
3943c8Q88J211J36q32j480j634j16j73J557J255J094L47q56j349j523o36L75J203
3961e71J268J025L61m82j581j272q74J01Q56J626J269O62q59j110j769m57j57
3978a964Q92J296J493N09o64r06j545q08l91R91R74J412R59l42j043j580j183
$$ plain form
3995 -1900 -2001 -1574 -111 1319 2118 1891 939 -756 -1532 -2212 -1588 -282 1220 1954 1864 1070 -525 -1511
4013 -1511 -2009 -1531 -537 1008 1636 2064 1214 -300 -1270 -2184 -1673 -554 974 1713 2038 1366 192 -1209
4031 -1209 -2212 -1679 -792 675 1655 1931 1587 -90 -1429 -2040 -1850 -1011 619 1494 2012 1484 355 -915
4049 -915 -2026 -1766 -1168 303 1556 2048 1811 500 -1036 -1625 -1986 -1196 183 1508 2027 1740 720
4066 720 -907 -1753 -1919 -1353 -70 1155 1923 1787 885 -314 -1647 -2078 -1540 -117 1230 1812 1946 963
4084 963 -148 -1640 -2131 -1526 -352 1096 1782 1909 1233 -263 -1503 -1822 -1684 -502 763 1569 1851
4101 1851 1270 54 -1376 -1999 -1666 -615 591 1791 1758 1316 265 -1234 -1863 -1795 -1012 414 1639
4118 1639 2043 1283 381 -974 -2002 -1557 -810 341 1194 2173 1760 375 -835 -1700 -2016 -1471 188 1072
$$ packed form
3995a900j01M27J463J430P99k27r52j695p76o80O24J306J502P34r0p94j595r86
4013a511m98M78R94J545O28M28q50j514r70r14N11J119J528P39L25o72j174j401
4031a209j003N33Q87J467R80K76l44j677j339o11J90Q39J630Q75N18n28j129j270
4049i15j111K60N98J471J253M92k37j311j536n89l61P90J379J325N19k87j020
4066G20j627q46j66N66J283J225P68j36r02j199j333m31N38J423J347N82J34r83
4084I63j111j492m91O05J174J448O86J27o76j496j240l19J38J182J265Q06K82
4101A851n81j216j430o23L33J051J206J200l3m42j051j499o29O8P83J426J225
4118A639M04p60r02j355j028M45P47J151Q53R79m13j385j210q65l16N45J659Q84
$$ plain form
4136 1072 1838 1594 807 -703 -1729 -1778 -1327 -164 943 1888 1767 817 -358 -1496 -1785 -1342 -186 973
4154 973 1588 1666 850 -302 -1156 -1895 -1464 -261 831 1692 1848 1086 -145 -1067 -1822 -1509 -381 818
4172 818 1786 1895 898 -100 -1093 -2016 -1286 -745 551 1585 2033 1266 112 -937 -1634 -1755 -903 104
4190 104 1391 1899 1191 366 -776 -1714 -1736 -722 225 1196 1756 1370 452 -716 -1566 -1796 -959 -201 1316
4209 1316 1875 1449 571 -676 -1401 -1765 -1355 -141 876 1627 1528 904 -504 -1622 -1972 -1233 -171 1029
4227 1029 1592 1757 894 -270 -1422 -1821 -1462 -457 802 1658 1544 958 -16 -1233 -1731 -1305 -445 421
4245 421 1397 1793 1406 -43 -1141 -1660 -1762 -811 637 1439 1793 1174 152 -995 -1658 -1490 -886 379
4263 379 1238 1585 1325 256 -796 -1672 -1856 -1036 246 1258 1734 1350 662 -692 -1311 -1747 -1064 -123
$$ packed form
4136A072P66k44p87j510j026m9M51J163J107R45j21r50j175j138k89M43J156J159
4154I73O15P8q16j152q54p39M31J203J092Q61J56p62j231r22p55L13J128J199
4172H18R68J09r97r98r93r23P30N41J296J034M48p67j154j049o97j21Q52J007
4190A04J287N08p08q25j142r38k2J014R47R71N60l86r18j168q50k30Q37P58J517
4209A316N59m26q78j247p25l64M10J214J017P51r9o24j408j118l50P39J062J200
4227A029N63J65q63j164j152l99L59J005J259Q56j14n86r74j217m98M26Q60Q66
4245D21R76L96l87j449j098n19j02R51J448Q02L54o19j022j147o63J68O04J265
4263C79Q59L47k60j069j052q76j84Q20J282J012M76l84o88j354o19m36O83R41
$$ plain form
4281 -123 1094 1740 1345 720 -568 -1244 -1540 -1037 -283 978 1563 1671 702 -296 -1317 -1721 -1316 -332 1000
4300 1000 1577 1459 710 -199 -1001 -1565 -1523 -135 784 1275 1438 874 -38 -1218 -1822 -1521 -602 512 1360
4319 1360 1580 861 -132 -1002 -1595 -1467 -852 429 1199 1661 1004 149 -831 -1649 -1419 -907 480 1073 1715
4338 1715 817 279 -971 -1565 -1650 -890 163 1114 1662 1346 374 -901 -1524 -1631 -1384 208 1104 1637 1486
4357 1486 744 -706 -1291 -1435 -1051 -76 968 1496 1597 823 -459 -1158 -1598 -1126 -139 686 1293 1631 734
4376 734 -142 -1499 -1530 -1214 -260 759 1557 1387 908 -188 -1252 -1572 -1486 -448 282 1071 1848 1211 235
4395 235 -1021 -1475 -1398 -399 109 1213 1517 1086 258 -749 -1367 -1351 -803 233 1044 1776 1205 266 -556
4414 -556 -1167 -1556 -761 185 1052 1478 1506 603 -449 -1515 -1436 -683 -75 907 1420 1536 673 -368 -1226 -1619
$$ packed form
4281a23J217O46l95o25j288o76k96N03P54J261N85J08r69r98j021m04M05R84J332
4300A000N77j18p49r09q02n64M2J388R19M91J63n64r12j180o04L01R19J114Q48
4319A360K20p19r93q70n93J28O15J281P70M62o57q55r80q18K30N12J387N93O42
4338A715q98n38j250n94q5P60J053R51N48l16r72j275o23j07K47J592Q96N33j51
4357A486p42j450n85j44L84R75J044N28J01p74j282o99m40M72R87Q25O07L38q97
4376G34q76j357l1L16R54J019P98j70m79j096j064l20Q6J038P30P89P77o37r76
4395B35j256m54P7R99N08J104L04m31q28j007o18J6N48J036Q11P32n71r39q22
4414e56o11l89P95R46Q67M26K8r03j052j066P9P53O08R82N13J16q63j041q58l93
$$ plain form
4434 -1619 -1069 -181 905 1571 1417 741 -179 -1170 -1505 -915 -234 744 1222 1554 680 -221 -885 -1549 -1161
4453 -1161 -223 604 1272 1562 1174 22 -1045 -1495 -1212 -570 503 1325 1151 1085 -94 -1164 -1560 -1401
4471 -1401 -795 286 1230 1699 1189 -76 -767 -1346 -1402 -615 280 1282 1691 1282 454 -593 -1332 -1291 -803
4490 -803 197 1112 1379 1462 409 -445 -1319 -1613 -1042 -78 788 1348 1118 646 -415 -1318 -1691 -1034 -11
4509 -11 779 1484 1328 644 -383 -1005 -1275 -1181 -362 850 1226 1254 865 -91 -947 -1455 -1190 -439 788 1258
4529 1258 1517 660 -269 -934 -1663 -1091 -663 537 1222 1439 942 56 -818 -1718 -1285 -403 379 1181 1550
4548 1550 1147 147 -513 -1420 -1364 -888 70 1024 1681 1326 617 -703 -1157 -1339 -848 54 997 1373 1316 535
4568 535 -684 -1127 -1365 -822 -81 912 1333 1131 456 -315 -1185 -1527 -984 -208 498 1140 1144 612 -248 -976
$$ packed form
4434a619N50Q88J086O66j54o76r20r91l35N90O81R78M78L32q74r01o64o64L88
4453a161R38Q27O68K90l88j152j067m50K83O42J073Q22j74o6j179j070l96J59
4471a401O06J081R44M69n10j265o91n79n6P87Q95J002M09m09q28j047p39M1M88
4490h03J000R15K67Q3j053q54q74k94N71R64Q66N60k30m72j061r03l73O57J023
4509a1P90P05j56o84j027o22k70R4Q19J212L76K8l89r56q56n08K65P51J227M70
4529A258K59q57r29o65p29N72M28J200O85K17m97q86q74r00M33Q82P82Q02L69
4548A550m03j000o60r07N6M76R58R54O57l55p09j320m54j82M91R02R43L76n7p81
4568E35j219m43k38N43P41R93M21k02o75p71q70l42N43P76P06O42Mn32q60p28
$$ plain form
4588 -976 -1554 -1297 -48 676 1604 1361 520 -351 -1079 -1432 -1137 -181 642 918 1306 1076 -154 -1033 -1308
4607 -1308 -1181 -346 443 1296 1408 947 81 -878 -1234 -1356 -356 208 1259 1555 973 87 -736 -1288 -1378
4626 -1378 -656 390 1082 1427 1063 182 -613 -1375 -1408 -859 287 1110 1371 1172 297 -711 -1314 -1278 -974
4645 -974 -137 688 1293 1446 626 -349 -1077 -1382 -1100 -9 872 1320 1360 508 -120 -1131 -1256 -1104 -428 619
4665 619 1123 1273 704 74 -1107 -1266 -1367 -177 657 1323 1273 666 -121 -1001 -1169 -1302 -274 343 1331
4684 1331 1371 822 168 -730 -1027 -1189 -546 315 1198 1175 906 148 -413 -992 -1051 -405 159 1064 1349 1104 -27
4705 -27 -400 -1154 -1235 -839 -118 758 1453 1114 345 -665 -1261 -1306 -815 -166 1082 1350 963 724 -464 -942
4725 -942 -1302 -926 10 519 1310 1203 637 -203 -1049 -1310 -1048 -277 509 1138 1281 717 -88 -1047 -1655 -968
$$ packed form
4588i76n78K57J249P24R28k43q41q71p28l53K95R56Q23K76L88k30j230q79k75
4607a308J27Q35P89Q53J12m61q66r59l56j22J000N64J051K96n82q86q23n52r0
4626a378P22J046O92L45l64q81p95p62l3N49J146Q23K61j99q75j008o03L6L04
4645i74Q37Q25O05J53q20r75p28l05K82J091Q81M48M0q52o28j011j25J52O76J047
4665F19N04J50n69o30j181j59j01J190Q34O66n0o07p87q80j68j33J028O17R88
4684A331M0n49o54q98k97j62O43Q61Q83k3k69p58n61n79n9O46N64R05K85k45j131
4705b7l73p54q1L96P21Q76O95l39p69j010n96m5M91O49J248K68l87k39j188m78
4725i42l60L76R36N09P91j07n66q40q46k61K62P71P86O29J43n64q05r59o08O87
$$ plain form
4745 -968 -279 753 1250 1066 700 -84 -685 -1059 -1073 -605 449 1253 1352 625 -72 -606 -975 -1174 -265 244
4765 244 998 1314 1158 151 -550 -1073 -1007 -447 197 1036 1226 959 249 -583 -1306 -1387 -1082 252 737 1300
4785 1300 1122 484 -354 -1306 -1168 -558 11 659 1180 1176 273 -275 -1062 -1198 -960 -229 744 1191 1155 746 -199
4806 -199 -1180 -1216 -936 -384 570 1373 1283 488 -243 -947 -1163 -1095 -518 445 1045 1215 1051 -165 -646 -1133 -993
4827 -993 -544 542 1073 1063 889 8 -549 -1286 -1025 -278 280 940 1223 984 330 -631 -964 -1073 -614 178
4847 178 869 1514 953 150 -525 -952 -1272 -717 146 984 1257 1016 329 -513 -810 -1337 -781 103 568 1116
4867 1116 1114 400 -432 -1095 -1339 -1112 107 479 1265 1164 316 -318 -878 -1192 -999 -268 802 1090 1312 647
4887 647 -170 -1008 -1479 -1030 -343 563 1298 1420 607 -133 -835 -943 -1014 -217 522 1179 1165 739 95 -613 -1019
$$ packed form
4745i68O89J032M97j84l66p84o01l74j4M68J054Q04R9p27o97n34l69j99R09N09
4765B44P54L16j56j007p01n23O6N60O44Q39J90k67p10q32p23q1L05J334M85N63
4785A300j78o38q38r52J38O10N69O48N21mr03n48p87j36K38P31R73M47l6m09r45
4806a99r81l6K80N52R54Q03r0p95p31p04k16O8N77R63O00J70j64j216m81m87J40
4827i93M49J086N31j0j74q81n57p37K61P47N58O60K83k39o54r61l33j09M59P92
4847A78O91O45n61q03o75m27l20N55Q63Q38K73k41o87q42k97n27N56Q84M65N48
4867A116kp14q32o63k44K27J219L72P86j01q48o34n60l14J93P31J070K88K22o65
4887F47q17q38m71M49O87R06P35J22q13p40p02j08p1P97P39O57j4m26o44p08m06
$$ plain form
4908 -1019 -1172 -549 403 691 1032 989 7 -857 -1112 -979 -635 158 869 984 717 240 -351 -929 -1004 -742
4928 -742 154 658 955 1021 148 -503 -1233 -1142 -778 13 1147 1178 1077 513 -348 -1039 -1100 -824 -220 692 1112
4949 1112 847 584 -366 -955 -1228 -969 -166 583 1309 1071 732 -49 -858 -1245 -963 -237 661 1088 983 654
4969 654 70 -693 -1242 -769 -249 444 1085 832 926 47 -746 -1086 -1101 -381 440 780 1277 747 124 -597 -1077
4990 -1077 -984 -569 15 830 1174 1005 240 -456 -1343 -1066 -419 221 889 1113 1072 250 -448 -1010 -1160 -739
5010 -739 -118 742 1068 886 381 -316 -916 -1180 -866 -98 664 898 838 688 -211 -860 -1183 -906 -251 614
5030 614 1048 1169 518 -162 -658 -1130 -1059 -421 519 972 1360 693 27 -752 -1213 -960 -319 467 1031 1030 598
5051 598 23 -622 -881 -1074 -320 414 1042 1252 730 129 -800 -1152 -1090 -510 100 920 1004 1024 243 -684 -951
$$ packed form
4908a019j53O23R52K88L41m3r82q64k55J33L44P93P11J15k67m77n91n78p5K62
4928g42Q96N04K97O6q73o51p30R1L64P91J134L1j01n64q61o91o1K76O04R12M20
4949A112k65k63r50n89k73K59Q03P49P26k38l39p81q09l87K82P26Q98M27j05l29
4969F54n84p63n49M73N20O93O41k53R4q79p93l40j5P20Q21L40M97n30o23p21m80
4990a077R3M15N84Q15L44j69p65o96q87K77O47O40O68K24m1q22o98n62j50M21
5010g39O21Q60L26j82n05o97o00k64L14P68P62K34o0j50q99o49l23K77O55Q65
5030F14M34J21o51o80m96m72P1O38R40M53L88o67o66p79m61K53O41P86N64jm32
5051E98n75o45k59j93P54P34O28K10n22o01r29l52O2N80O10Q20Q4K0p81r27k67
$$ plain form
5072 -951 -1035 -730 152 692 1311 834 70 -598 -823 -1314 -685 113 806 984 857 381 -360 -930 -1187 -987
5092 -987 -39 716 967 994 467 -477 -953 -1038 -701 -141 741 987 769 443 -149 -777 -1010 -938 -250 676 1142
5113 1142 1172 370 -62 -854 -1224 -966 -477 367 944 1106 907 113 -717 -1037 -1172 -231 239 800 995 583
5133 583 244 -626 -1114 -849 -799 87 918 1034 551 234 -585 -856 -803 -775 144 876 1004 651 280 -438 -743
5154 -743 -1073 -649 -21 854 971 863 189 -473 -960 -879 -706 225 471 1083 881 417 -355 -917 -746 -855
5174 -855 121 357 899 1124 608 -125 -946 -1012 -853 -333 659 1213 864 596 71 -798 -1186 -840 -420 388
5194 388 949 1149 608 90 -701 -1074 -1098 -436 359 1096 1126 688 92 -356 -820 -917 -600 277 770 1030 822
5215 822 250 -245 -1058 -1044 -568 87 635 1246 869 273 -485 -733 -946 -657 85 604 869 926 571 -299 -838
$$ packed form
5072i51q4L05Q82N40O19m77p64o68k25m91O29P98O93J78j27m76p41n70k57K00
5092i87R48P55K51K7n27r44m76q5L37N60Q82K46k18l26n92o28k33P2O88R26M66
5113A142L0q02m32p92l70K58M89Q44N77J62j99p94q30l20j35R41M70N61J95m12
5133E83l39q70m88K65N0Q86Q31J16m83l17q19k71N3K8R19P32J28l53l71p18l05
5154g43l30M24O28Q75J17j08o74o62m87Q1J73R31K46O12k02m64p72n62J71j09
5174h55R76K36N42K25n16p33q21o6J59N20R92N54l49k68n25q69l88L46M20Q08
5194C88N61K00n41n18p91l73k4O62P95P37L0m38n96m48m64r7L17Q77M93K60k08
5215H22n72m95q13J4M76O55N48O11l77n96p58k48k13K89P42N19K65N7l55q70n39
$$ plain form
5236 -838 -693 -713 -177 526 1049 1150 250 -307 -889 -975 -818 -107 582 1007 1064 596 -280 -711 -864 -664 -101
5257 -101 336 831 770 508 39 -900 -1105 -914 -184 535 860 956 596 64 -813 -1146 -940 -294 551 941 849
5278 849 785 29 -691 -989 -849 -429 -39 829 1003 768 112 -674 -972 -1126 -454 140 783 960 1053 129 -279
5299 -279 -835 -911 -673 -102 596 930 816 357 -305 -937 -960 -839 -136 626 947 603 680 -470 -921 -1134 -815
5320 -815 -413 563 912 838 548 -445 -625 -939 -807 -611 516 969 911 403 -99 -697 -829 -897 -95 477 947
5341 947 1099 748 98 -679 -1020 -665 -193 181 786 981 732 -101 -589 -791 -1004 -479 296 966 965 680 -196
5362 -196 -546 -865 -1114 -528 183 835 861 627 135 -474 -799 -889 -769 12 792 975 1026 183 -324 -754 -1095
5383 -1095 -709 86 481 896 712 225 -153 -741 -1020 -741 -226 691 924 1005 401 -227 -743 -1027 -910 -119
$$ packed form
5236h38J45k0N36P03N23J01r00n57n82q6J57P11O89M25N7m68q76m31j53K00N63
5257a01M37M95o1k62m69r39k05J91P30P19L25R6l60n32q77l33K06O46Q45L90r2
5278H49o4p56p20k98J40M20L90Q68J74k35o56p86k98j54O72N94O43J77R3r24m08
5299b79n56p6K38N71O98L34j14m59o62o32k3J21P03P62L21l44P7j150m51k13L19
5320h15M02R76L49p4k90r93j80l14J32J96J127M53n8n08n02n98j32o8Q02N72M70
5341I47J52l51o50p77l41L55M72L74O05J95k49q33m88k02k13N25P75O70jk85q76
5362a96l50l19k49N86P11O52K6k34m92o09l25r0J20P81P80J83N1q43n07m30l41
5383a095L86P95L95M15j84m87l78n88k79K79N15R17K33Q1o04o28n16k84J17P91
$$ plain form
5403 -119 478 880 826 344 -54 -772 -928 -921 -287 354 1023 984 445 6 -661 -886 -751 -297 354 822 1124
5424 1124 568 86 -535 -1190 -558 -219 123 754 859 559 122 -557 -785 -757 -306 52 597 1075 934 96
5444 96 -633 -831 -1103 -587 161 610 1034 841 525 -371 -1230 -857 -624 50 470 856 888 29 -551 -839 -770
5465 -770 -576 -256 356 1055 1050 649 -352 -920 -793 -623 -362 281 762 916 301 -399 -641 -916 -846 -43 530
5486 530 860 1102 612 160 -542 -934 -672 -209 372 882 1026 541 100 -486 -928 -829 -383 335 941 899 648
5507 648 32 -314 -1000 -851 -549 263 587 904 646 190 -697 -1072 -864 -441 254 487 870 743 518 -625
5527 -625 -842 -1155 -489 23 538 843 769 536 -285 -685 -883 -566 -78 728 855 708 343 -562 -877 -946 -665
5548 -665 -198 638 870 672 455 62 -628 -920 -612 -404 648 866 879 347 -79 -578 -916 -819 -178 76
$$ packed form
5403a19N97M02n4m82l98p18j56PO34O41O69l9n39m39o67k25J35M54O51M68L02
5424A124n56m82o21o55O32L39L42O31J05l00m37o79k28K8M51L58N45M78j41q38
5444I6p29j98k72N16P48M49M24j93l16q96q59L73K33O74M20L86L2q59n80k88O9
5465g70J94L20O12O99nm01j001n68J27J70K61O43M81J54o15p00k42k75P0Q03N73
5486E30L30K42m90m52p02l92K62M63N81N10J44m85m41n86m42R9M46P18O06m2k51
5507F48o16l46o86J49L02Q12L24L17k58m56q87l75K08M23O95K33L83j27k25j143
5527f25k17l13O66N12N15L05p4k33q21m00j98L17M88Q06J27j47l65r05l15o9K81
5548f65M67Q36K32j98k17l93o90k92L08K08J052K18J3n32m26m99l38R7O41K54
$$ plain form
5568 76 746 857 801 -25 -583 -954 -683 -486 267 745 816 660 121 -546 -744 -976 -531 168 529 706 779
5589 779 188 -274 -929 -665 -409 279 649 793 853 217 -239 -865 -901 -463 176 652 948 760 415 -204 -690
5610 -690 -689 -589 88 369 798 795 369 -311 -512 -738 -487 -21 626 771 889 585 -268 -671 -963 -744 28
5631 28 462 373 914 489 -7 -600 -733 -752 -235 252 715 773 638 -28 -754 -901 -675 -448 350 624 816
5652 816 835 78 -420 -814 -883 -471 183 847 1094 688 36 -617 -949 -734 -525 36 364 1203 678 160 -272
5673 -272 -727 -859 -635 107 576 889 478 127 -232 -595 -923 -481 -75 608 749 723 242 -198 -501 -873
5693 -873 -1002 -137 445 1037 997 369 -73 -589 -861 -731 -54 599 876 860 653 -1 -786 -830 -868 -420 124
5714 124 681 1080 413 -134 -568 -1086 -523 -312 360 825 863 714 -16 -477 -770 -785 -390 145 926 847 401
$$ packed form
5568G6O70J11n6q26n58l71K71J97P53M78P1j56n39o67j98k32M45O99L61J77P3
5589G79n91m62o55K64K56O88L70J44O0o36m56o26l6M38O39M76K96j88l45o19m86
5610f90JJ00O77K81M29lm26o80k01k26K51M66O47J45J18l04q53m03k92K19P72
5631B8M34q9N41m25m96n93j33j9N17M87M63N8j35o66p26j47K26K27P98K74J92
5652H16J9p57m98l94o9M12O54O64K47m06o52o53l32K15K09N61L28Q39n25n18m32
5673b72m55j32K24P42M69L13m11l51l59l63l28M42M06O83J41k6m81m40l03l72
5693h73j29Q65N82N92m0o28m42n16k72J30O77O53K77j6k07o54p85m4l8M48N44
5714A24N57L99o67n47m34n18N63K11O72M65L8j49p30m61k93j5L95N35P81p9m46
$$ plain form
5735 401 141 -324 -842 -703 -386 52 774 787 933 186 -293 -628 -998 -657 142 533 618 716 371 -208 -460
5756 -460 -895 -435 153 612 1122 953 376 -203 -666 -763 -756 -156 411 627 986 271 -81 -935 -798 -715 -93
5777 -93 337 706 736 547 84 -652 -784 -683 -137 561 822 669 405 193 -614 -949 -959 -456 367 803 1002
5798 1002 590 -38 -550 -558 -903 -206 316 872 937 624 47 -693 -990 -717 -306 301 608 981 639 65 -368
5819 -368 -829 -920 -418 76 588 1003 660 -81 -228 -807 -952 -354 -189 487 750 816 240 -379 -523 -821 -562
5840 -562 -151 463 923 787 341 -194 -700 -706 -464 -131 371 761 742 287 -203 -588 -884 -835 -284 420 455 676
5862 676 560 -16 -490 -722 -749 -390 -49 625 791 711 74 -283 -840 -680 -461 304 829 773 436 75 -411
5883 -411 -898 -456 -337 275 376 854 673 154 -340 -905 -758 -331 -31 545 926 617 167 -408 -777 -792
$$ packed form
5735D01k60m65n18J39L17M38P22J3J46p47m79l35l70L41P99L91Q5R8l45n79k52
5756d60m35M60N88M59N10j69n77n79m63r7PO00N67K16L59p15l52q54J37Q3O22
5777i3M30L69L0j89m63p36j32J01N46O98K61j53k64k12q07l35j0N03Q23M36J99
5798A002m12o28n12ql45O97N22N56O5l13n77p40k97K73M11O07L07L73l42n74m33
5819c68m61r1N02M94N12M15l43p41j47n79j45N98J65O76K63O6n76o19j44k98K59
5840e62M11O14M60j36m46n35n06oK42L33N02L90j9m55m90l85k96M9N51P04L5K21
5862F76j16n76m74k32k7L59L41O74J66q0o37l57n57J60K19P65N25n6l37l61m86
5883d11m87M42J19O12J01M78j81n19m94n65J47M27L00N76L81l09m50n75l69j5
$$ plain form
5903 -792 -322 139 553 837 860 363 -466 -878 -746 -566 -84 292 488 742 331 -222 -978 -835 -576 -231
5923 -231 345 656 654 362 -129 -656 -902 -638 -136 238 714 938 487 -81 -257 -821 -685 -210 336 426 678
5944 678 404 -101 -332 -743 -767 -300 80 400 650 335 113 -442 -776 -746 -473 183 600 899 796 132 -579
5965 -579 -678 -770 -627 41 621 716 816 156 -103 -799 -720 -525 56 764 577 641 159 -317 -727 -903 -575 -297
5987 -297 722 751 876 360 -403 -610 -904 -475 -90 420 883 770 324 -375 -590 -860 -823 -322 296 772
6007 772 657 394 -153 -532 -717 -676 -446 284 552 791 377 -268 -514 -856 -469 -349 460 737 724 621 276
6028 276 -362 -787 -665 -274 251 561 686 659 3 -492 -864 -734 -371 259 422 450 865 335 -58 -625 -688
6049 -688 -619 109 614 671 552 139 -349 -674 -781 -420 243 527 685 585 313 61 -461 -559 -547 -202 399
$$ packed form
5903g92M70M61M14K84K3m97q29m12J32J80M82L76J96K54m11n53p56J43K59L45
5923b31N76L11kk92m91n27k46K64N02L74M76K24m51n68j76n64J36M75N46R0K52
5944F78k74n05k31m11k4M67L80L20K50l15k22n55l34L0K73O56M17K99j03o64p11
5965e79r9r2J43O68N80R5J00o60k59o96P9J95N81P08j87O4m82m76m10j76L28K78
5987b97J019K9J25n16p63k07k94M29L85N10M63j13m46o99k15k70L7N01O18M76
6007G72j15k63n47l79j85M1K30P30K68K39m14o45k46l42L87J20Q09K77j3j03l45
6028B76o38m25J22L91N25L10J25k7o56m95l72J30L63O30J63K8M15n30l93n67o3
6049f88O9P28N05N7j19m13m88l25j07L61O63K84J58j00k72k52n22r8J2L45O01
$$ plain form
6070 399 917 758 235 16 -696 -634 -668 -117 276 552 705 376 -26 -515 -646 -682 -135 272 477 795 717
6091 717 -104 -602 -759 -624 -201 233 773 873 481 19 -585 -1007 -513 -461 364 739 746 855 56 -406 -1001
6112 -1001 -785 -373 -27 494 1080 788 144 -343 -540 -639 -473 280 597 683 790 215 -20 -708 -694 -133 -78
6133 -78 636 681 880 105 -400 -716 -996 -395 -73 181 619 736 339 -377 -563 -719 -699 -121 652 557 578 221
6155 221 -266 -613 -695 -554 -200 318 736 665 271 32 -246 -925 -570 -166 245 764 784 263 -79 -614 -726
6176 -726 -804 -253 293 653 618 449 -181 -325 -658 -367 -485 74 763 916 720 186 -488 -680 -1009 -560 214
6197 214 357 976 629 239 -443 -787 -817 -364 115 444 902 607 84 -177 -773 -619 -708 -178 491 596 702
6218 702 22 -382 -578 -653 -339 -97 328 793 639 392 -153 -536 -545 -552 -193 359 640 642 474 23 -428 -867
$$ packed form
6070C99N18j59n23k19p12O2l4N51L93K76J53l29m02m89j31l6N47M07K05L18p8
6091G17q21m98j57J35M23M34N40J00l92m62o04m22M94N2Q25L75PJ09p99m62n95
6112a001K16M12L46N21N86k92o44m87j97r9J66P53L17Q6J07n75k35o88J4N61N5
6133g8P14M5J99p75n05l16k80O01L22K54M38J17l97p16j86j56K0N78P73r5K1l57
6155B21m87l47q2J41L54N18M18p1l94k39k78o79L55M04M11N19K0n21l42n35j12
6176g26p8N51N46L60l5j69o30j44l33K91j18N59O89J53j96n34o74j92l29M49P74
6197B14J43O19l47l90o82l44l0M53M79L29M58k95n23k61n96J54q9N30O69J05J06
6218G02o80m04j96p5L14K42M25M65j54k47n45l83rpL59N52K81Kj68m51m51m39
$$ plain form
6240 -867 -663 -114 410 706 652 575 -35 -383 -745 -577 -218 449 719 690 558 68 -480 -651 -668 -139 170
6261 170 507 648 532 90 -503 -549 -746 -430 255 653 595 574 249 -250 -1025 -624 -396 102 623 863 642
6282 642 418 -36 -677 -614 -444 13 700 584 768 310 -335 -530 -791 -484 128 619 554 553 333 -102 -728
6303 -728 -631 -388 -148 329 542 844 513 -188 -455 -959 -702 -219 173 737 579 647 -26 -676 -834 -729 -132
6324 -132 199 934 547 293 -35 -446 -616 -626 -314 63 680 760 359 146 -385 -618 -762 -371 -87 461 488
6345 488 272 144 -235 -769 -722 -416 31 554 774 378 132 -273 -766 -681 -694 -13 603 837 596 168 -272
6366 -272 -750 -865 -531 71 548 611 708 260 -116 -605 -971 -578 -126 534 689 808 431 -98 -389 -718 -633
6387 -633 -265 475 653 496 392 177 -430 -763 -597 -139 157 755 719 389 -183 -546 -764 -631 -323 349
$$ packed form
6240h67K04N49N24K96n4p7o10l48l62J68L59O67K70k9j32m90n48j71j7N29L09
6261A70L37J41j16m42n93m6j97L16O85L98n8k1l25m99p75M01K28M98N21K40k21
6282F42k24m54o41O3J70M57O87j16J84m58o45j95k61L07O12M91o5jk20m35o26
6303g28R7K43K40M77K13L02l31p01k67n04K57M83L92N64j58O8o73o50j58J05N97
6324a32L31P35l87k54l28m11j70j0L12L77O17Q0m01k13n31k33j44L91K84N48K7
6345D88k16j28l79n34M7L06M47N23K20l96k46m05m93Q5j3O81O16K34k41m28m40
6366b72m78j15L34O02M77O3R7m48l76m89l66L93M52O60J55J19l77n29k91l29Q5
6387f33L68P40J78j57j04k15o07l33J66M58K96N98l6l30n72l63k18J33L08O72
$$ plain form
6407 349 527 620 535 209 -253 -550 -521 -218 -46 604 877 757 39 -264 -900 -789 -339 163 516 993 583
6428 583 271 -407 -545 -434 -590 -108 394 907 422 169 -333 -687 -737 -463 -56 486 833 845 157 -27 -636
6449 -636 -573 -472 -299 270 702 592 295 89 -665 -489 -624 -37 298 863 622 408 -18 -234 -656 -636 -123
6470 -123 278 519 602 170 -70 -534 -702 -749 -234 291 401 626 544 102 -461 -738 -775 -369 -105 787 753 408
6492 408 310 -334 -605 -566 -736 82 424 425 638 32 -140 -693 -574 -248 12 522 799 566 347 -122 -925
6513 -925 -644 -96 103 469 716 567 391 -111 -707 -639 -517 -94 429 635 630 185 -239 -601 -764 -512 -198
6534 -198 360 663 842 502 198 -529 -445 -602 -126 204 651 452 551 -150 -418 -891 -467 -163 89 811 535
6555 535 385 201 -300 -672 -460 -391 392 532 778 855 -106 -472 -657 -389 -304 119 546 768 770 148 -90 -594
$$ packed form
6407C49J78R3q5l26m62k97K9L03J72O50K73j20p18l03o36J11M50N02L53M77m10
6428E83l12o78j38J11j56M82N02N13m85k53n02l54n0K74M07N42L47J2o88j84o09
6449f36O3J01J73N69M32j10k97k06p54J76j35N87L35N65k41k14m26k16m22K0N13
6470a23M01K41Q3m32k40m64j68m7N15N25J10K25q2m42n63k77l7M06K64Q92l4l45
6492D08r8o44k71L9j70Q18L42JK13o06j72n53J19L26K60N10K77k33k19m69q03
6513i25K81N48J99L66K47j49j76n02n96O8J22M23N23K06nm45m24l62j63K52L14
6534a98N58L03J79l40l04p27Q4j57M76L30M47j99R9p01k68m73M24L04K52P22k76
6555E35j50j84n01l72K12O9P83J40K46P7r61l66j85K68Q5M23M27K22Ko22k38n04
$$ plain form
6577 -594 -623 -494 -43 547 714 345 144 -171 -638 -781 -377 -215 556 505 601 299 -350 -431 -819 -493 46
6598 46 268 756 849 643 -500 -126 -632 -473 63 415 633 417 456 -191 -388 -660 -360 -188 499 542 484
6619 484 181 -29 -430 -773 -498 -115 317 869 663 377 -169 -245 -765 -518 -192 -133 541 613 415 37 -532
6640 -532 -619 -471 -114 84 635 837 644 299 -577 -638 -623 -385 -116 407 788 431 229 -327 -452 -738 -539
6661 -539 13 406 581 587 227 -54 -720 -722 -496 236 540 719 651 194 -156 -723 -756 -227 -131 265 707 661 397
6684 397 -77 -572 -817 -654 -372 647 577 659 269 -258 -163 -600 -789 -139 -14 664 598 308 -121 -626 -490
6705 -490 -680 -352 168 509 405 287 171 -346 -714 -564 -448 -199 644 680 443 150 -409 -755 -866 -378
6725 -378 309 454 556 610 136 -136 -707 -692 -368 -27 122 431 628 148 -206 -402 -463 -597 -31 295 688
$$ packed form
6577e94k9J29M51N90J67l69k01l15m67j43M04J62P71n1R6l02o49q1l88L26N39
6598D6K22M88R3k06j143L74n06J59N36L52K18k16L9o47j97k72L00J72O87M3n8
6619D84l03k10m01l43K75L83M32N52k06k86n46p6n20K47L26N9O74P2j98l78n69
6640e32q7J48L57J98N51K02j93l45q76o1J5K38K69N23L81l57k02n56j25k86J99
6661e39N52L93J75Ol60k81o66kK26P32L04J79o8m57l50n67l3N29R6L96M42m6k64
6684C97m74m95k45J63K82J019p0Q2l90n27R5m37j89O50J25O78o6k90m29n05J36
6705d90j90L28N20L41j04j18j16n17l68J50J16K49Q43L6k37k93n59l46j11M88
6725c78O87J45J02N4m74k72n71J5L24L41J49L09J97m80l54j96o1j34N66L26L93
$$ plain form
6746 688 662 208 -291 -622 -636 -381 -157 395 651 702 410 -185 -347 -659 -613 -227 414 444 645 296 -102 -453
6768 -453 -847 -561 -321 285 523 513 546 -119 -370 -573 -574 24 46 644 783 459 -147 -423 -819 -640 -353 139
6790 139 552 699 653 94 -420 -726 -554 -189 147 550 357 603 41 -230 -392 -682 -539 -66 386 459 380
6811 380 144 -467 -656 -537 -344 160 604 579 461 285 -151 -295 -517 -414 -165 262 861 688 406 -89
6831 -89 -386 -402 -523 -348 523 760 248 326 -94 -623 -836 -477 -106 523 709 659 336 -207 -441 -851 -693
6852 -693 -88 240 384 833 434 16 -281 -504 -734 -146 275 599 569 811 146 -430 -745 -398 -151 127
6872 127 216 711 463 98 -311 -556 -588 -20 -63 361 678 361 287 -257 -544 -713 -256 142 415 572 626 -27
6894 -27 -368 -587 -592 -344 78 570 466 480 162 -213 -515 -581 -276 -88 214 611 363 161 -148 -504 -776 -468
$$ packed form
6746F88k6m54m99l31j4K55K24N52K56N1k92n95j62l12M6L86O41L0K01l49l98l51
6768d53l94K86K40O06K38j0L3o65k51k03jN98K2N98J39l24o06k76l96J79K87M92
6790A39M13J47m6n59n14l06J72L65L36M03j93K46n62k71j62k90J43M73M52P3p9
6811C80k36o11j89J19J93N04M44k5j18j76m36j44k22J03K49M27N99j73k82m95
6831h9k97j6j21J75Q71K37n12P8m20n29k13L59L71O29J86n0l23n43k34m10J58
6852f93O05L28J44M49l99m18k97k23k30N88M21L24l0K42o65n76l15L47K47K78
6872A27Q9M95k48l65m09k45l2N68m3M24L17l17p4n44k87j69M57L98K73J57N4o53
6894b7l41k19nK48M22M92j04J4l18l75l02o6L05J88L02L97k48k02l09l56k72L08
$$ plain form
6916 -468 12 242 648 899 255 -132 -447 -823 -524 -119 100 731 571 382 -106 -329 -735 -180 -348 -13
6936 -13 734 482 379 151 -326 -417 -611 -228 -49 454 588 689 -107 -353 -625 -514 -178 99 466 562 289
6957 289 116 -460 -691 -672 -268 141 590 284 502 295 -363 -584 -233 -491 87 418 383 777 288 -154 -584
6978 -584 -514 -455 131 269 676 709 193 78 -713 -738 -569 165 198 634 632 166 5 -509 -693 -340 -61 293
7000 293 711 491 381 -61 -562 -629 -695 -311 169 681 492 388 121 -431 -744 -499 -267 266 654 726 378
7021 378 52 -123 -491 -433 -118 19 622 787 373 131 -299 -662 -504 -441 84 387 804 609 146 -154 -615
7042 -615 -541 -678 -43 326 574 270 225 -99 -689 -713 -526 -44 397 637 385 232 -198 -624 -521 -411 -283
7063 -283 353 405 541 413 -9 -584 -746 -413 -231 436 556 399 405 -245 -587 -638 -666 -436 343 407 625 610
$$ packed form
6916d68M80K30M06K51o44l87l15l76K99M05K19O31j60j89m88k23m06N55j68L35
6936a3P47k52j03k28m77r1j94L83J79N03J34J01p96k46k72J11L36K77L67R6k73
6957B89j73n76k31J9M04M09M49l06K18k07o58k21L51k58N78L31l5L94m89m42m30
6978e84P0N9N86J38M07L3n16j15p91k5J69P34L3M36km66j61n14j84L53K79L54
7000B93M18k20j10m42n01o7o6L84M80N12j89j04k67n52l13K45K32N33L88P2l48
7021C78l26j75l68N8L15J37O03J65m14k42m30l63J58O3N25L03M17j95m63l00m61
7042f15P4j37O35L69K48l04m5l24n90k4J87M82M41K40k52j53m30m26J03J10J28
7063b83O36N2J36j28m22n75j62L33J82O67J20j57Oo50l42n1k8K30P79O4K18j5
$$ plain form
7085 610 155 -156 -361 -297 -418 436 529 364 382 -10 -409 -592 -598 -344 -35 492 780 412 121 -401 -406 -568
7107 -568 -146 307 173 675 504 31 -306 -789 -498 -296 171 425 401 407 329 -106 -497 -627 -300 -41 109
7128 109 667 380 155 -115 -797 -580 -373 41 260 598 477 49 47 -368 -642 -356 -386 277 285 489 426 107
7150 107 -365 -608 -594 -83 340 192 456 305 33 -448 -697 -565 -329 237 608 763 330 63 -358 -563
7170 -563 -437 -464 172 367 487 399 102 -188 -593 -438 -21 106 520 661 503 38 -308 -838 -653 -365 15
7191 15 426 605 673 133 -183 -501 -658 -82 -104 73 329 523 314 -428 -510 -582 -593 -237 174 512 415 126
7213 126 -204 -344 -724 -271 -49 170 550 462 443 39 -433 -562 -531 -90 264 483 535 289 -23 -472 -817
7234 -817 -435 -135 -11 402 547 156 12 -88 -726 -603 -241 74 540 446 151 283 -173 -491 -525 -95 194
$$ packed form
7085F10m55l11k05O4j21Q54R3j65J8l92l99j83oK54L09N27K88l68k91n22nj62
7107e68M22M53j34N02j71m73l37m83K91K02M67K54k4Op8m35l91j30L27K59J50
7128A09N58k87k25k70o82K17K07M14K19L38j21m28km15k74K86l0O63QK04o3l19
7150A07m72k43J4N11M23j48K64j51k72m81k49J32K36N66L71J55m33k67m21k05
7170e63J26k7O36J95J20q8k97k90m05J55M17J27M14J41j58m65l46n30J85K88L80
7191A5M11J79O8n40l16l18j57N76k2J77K56J94k09p42q2p2j1L56M11L38r7k89
7213A26l30j40l80M53K22K19L80q8j9m04m72j29L1M41L54K19N2k46l12m49l45
7234h17L82L00J24M13J45l91j44j00o38J23L62L15M66r4k95J32m56l18l4M30K89
$$ plain form
7255 194 388 653 540 387 -326 -536 -469 -216 91 417 299 549 185 -494 -518 -739 -281 -11 496 470 512
7276 512 84 -194 -453 -609 -541 80 348 471 637 116 -308 -321 -812 -406 -201 -60 521 286 331 -55 -442
7297 -442 -586 -618 -168 301 483 621 236 194 -517 -354 -324 -176 365 518 581 449 -188 -243 -665 -560 -188 59
7319 59 266 585 453 144 -302 -697 -329 -422 334 364 929 432 -49 -205 -467 -626 -193 211 296 509 489 97
7341 97 -157 -448 -521 -244 180 468 630 543 339 -34 -460 -507 -384 -169 407 757 381 90 -17 -556 -584 -412
7363 -412 -59 267 518 518 486 3 -313 -545 -427 -107 255 742 532 105 -212 -485 -428 -325 -53 199 710
7384 710 516 255 172 -537 -351 -498 -87 222 498 393 428 70 -209 -561 -616 -423 106 290 517 364 -90
7405 -90 -276 -391 -366 -456 113 432 745 497 84 -403 -389 -401 -253 -143 272 794 481 110 -275 -637 -610 -511
$$ packed form
7255A94J94K65j13j53p13k10O7K53L07L26j18K50l64o79k4k21M58K70N07k6M2
7276E12m28k78k59j56O8O21K68J23J66n21m24j3m91M06K05J41N81k35M5l86l87
7297d42j44l2M50M69J82J38l85m2p11J63L0J48N41J53O3j32o37n5m22J05L72K47
7319E9K07L19j32l09m46l95L68r3P56L0N65m97m81j56k62j59M33M04Q5K13k0l92
7341I7k54k91p3K77M24K88J62q7k04l73m26m7J23K15N76L50l76k91j07n39k8J72
7363d12L53L26K51%l2m83l16k32J18L20L62M87k10m27l17k73N7J03K72K52N11
7384G10j94k61q3p09J86j47M11L09K76j05L5l58k79l52n5J93N29J84K27j53m54
7405i0j86j15K5r0N69L19L13k48m13m87J4j2J48J10M15N22l13l71l85l62K7R9
$$ plain form
7427 -511 285 243 603 401 -18 -263 -652 -587 -159 -24 299 467 296 208 60 -629 -434 -498 -92 342 501
7448 501 388 -40 84 -473 -564 -577 -173 262 777 600 434 -23 -455 -508 -560 -231 370 425 503 372 118 -322
7470 -322 -501 -474 -356 93 513 737 244 57 -112 -543 -293 -397 157 551 336 583 125 -70 -201 -268 -278
7491 -278 20 382 328 515 -18 -376 -515 -672 -109 -156 318 490 410 447 -346 -391 -398 -377 -146 499 680 503 322
7514 322 -248 -579 -527 -272 -178 127 475 300 227 -331 -429 -608 -391 -114 527 619 368 246 -132 -476 -485 -421 -347
7537 -347 223 628 443 310 133 -123 -446 -506 -132 119 859 362 269 153 -164 -372 -349 -257 243 530 609 358
7559 358 -36 -652 -299 -557 -50 -36 468 496 289 -55 -378 -462 -500 -147 -43 467 468 240 169 -156 -563 -473 -388
7582 -388 -24 629 107 350 109 -112 -476 -508 -90 -209 202 535 368 17 -240 -525 -339 -329 -135 186 319
$$ packed form
7427e11P96m2L60k02m19k45l89O5M28J35L23J68j71q8j48o89J95o4M06M34J59
7448E01j13m28J24n57r1j3M04M35N15j77j66m57m32n3n2L29O01N5P8j31k54m40
7470c22j79K7J18M49M20K24m93j87j69m31K50j04N54L94k15K47m58j95j31o7j0
7491b78K98L62n4J87n33l58j39j57N63m7M74J72q0L7p93m5pK1K31O45J81j77j81
7514C22n70l31N2K55R4L05L48j75p3n58r8j79K17K77O41R2k51j22l78l44rO4P4
7537c47N70M05j85j33j77k56l23o0L74K51P40m97r3j16l17k08K3R2N00K87P9k51
7559C58l94o16L53k58N07J4N04K8k07l44l23q4l8L53J04N10Jk28p1l25m07R0Q5
7582c88L64O53n22K43k41k21l64l2M18j19M11L33j67l51k57k85J86J0J94L21J33
$$ plain form
7603 319 494 230 -52 -325 -347 -340 27 265 563 702 324 -29 -495 -582 -408 -102 174 477 488 195 -71 -310
7625 -310 -580 -404 6 -19 368 411 365 -134 -321 -711 -702 -249 -60 653 269 457 185 -202 -421 -317 -76 -108
7647 -108 432 471 241 84 -378 -490 -518 -367 -31 539 398 587 91 -314 -514 -110 -414 155 263 512 129
7668 129 271 -40 -345 -320 -256 -201 256 745 352 297 -232 -396 -549 -480 155 364 380 200 190 -85 -379 -657
7690 -657 -337 -205 146 357 367 266 57 -171 -712 -209 -86 159 567 662 384 -80 -383 -402 -368 -267 143
7711 143 307 492 122 175 -260 -664 -547 -168 41 623 502 409 358 -198 -473 -504 -388 -109 565 499 406 288
7733 288 -159 -318 -233 -140 59 135 135 514 -20 -298 -128 -901 -409 -181 225 703 390 158 170 -414 -490 -295
7755 -295 20 430 303 474 38 107 -362 -623 -540 -134 214 419 251 562 -27 -261 -219 -478 -112 232 648
$$ packed form
7603C19J75k64k82k73k2PL67K38K98J39l78l53m66q7J74L06K76L03J1k93k66k39
7625c10k70J76M10k5L87M3m6m99j87l90RM53J89P13l84J88k72l87k19J04K41l2
7647a08N40L9k30j57m62j12k8J51L36N70j41J89m96m05k00M04l04N69J08K49l83
7668A29J42l11l05K5O4N5M57M89l93n5n29j64j53O9O35K09J6j80j0k75k94k78
7690f57L20J32L51K11J0j01k09k28n41N03J23K45M08R5k78m64l03j9L4J01M10
7711A43J64J85l70N3m35m04J17L79K09N82j21r3n1n56k75l1J16K79O74o6r3j18
7733B88m47j59Q5R3J99P6%L79n34k78J70p73M92K28M06M78l13k32J2n84p6J95
7755b95L15M10j27J71m36O9m69k61Q3M06L48K05j68L11n89k34M2k59L66L44M16
$$ plain form
7776 648 343 325 75 -169 -650 -353 -21 -145 364 506 590 6 -122 -495 -456 -137 -129 531 527 505 -102 -227 -359
7799 -359 -382 -63 135 370 285 534 222 -302 -645 -668 -287 -115 306 350 415 418 -210 -317 -429 -195 -32 153
7821 153 566 329 128 -300 -246 -430 -513 -246 191 568 448 197 120 -420 -409 -550 -218 153 393 219 191 -35
7843 -35 -481 -357 -506 -132 137 502 419 258 -53 -447 -558 -314 -8 78 575 321 576 44 -232 -285 -291 -22
7865 -22 26 273 535 184 209 -32 -599 -453 -330 -5 119 327 272 -16 -302 -478 -687 -236 1 540 567 430
7887 430 42 -368 -330 -517 -203 -38 456 440 617 25 -415 -260 -341 -323 37 221 597 368 -11 18 -432 -659
7909 -659 -521 -213 118 255 415 262 -51 -618 -326 -376 -406 319 473 436 213 192 -376 -436 -307 -115 51 319
7931 319 571 441 118 -505 -334 -122 -333 -4 422 294 183 281 -179 -444 -600 -224 -30 131 304 353 -1
$$ packed form
7776F48l05j8k50k44m81K97L32j24N09J42Q4n84j28l73L9L19QO60mk2o07j25j32
7799c59k3L19J98K35q5K49l12n24l43k3L81J72M21M4O5Lo28j07j12K34J63J85
7821A53M13k37k01m28N4j84q3K67M37L77j20k51p7n40J1j41L32L71K40j74k8k26
7843c5m46J24j49L74K69L65q3j61l11l94j11K44L06Q6M97k54K55n32k76n3oK69
7865b2M8K47K62l51K5k41n67J46J23L25J24K08n5k88k86j76k09M51K37N39K7j37
7887D30l88m10L8j87L14J65M94j6J77n92m40J55q1J8L60J84L76k29l79K9m50k27
7909f59J38L08L31J37J60j53l13n67K92n0l0P25J54l7k23k1n68o0J29J92J66K68
7931C19K52j30l23o23J71K12k11L29M26j28j11R8m60k65j56L76J94J61J73M9l54
$$ plain form
7952 -1 -406 -644 -24 -189 -3 202 584 448 -122 -232 -403 -382 -230 -2 164 542 360 217 -184 -231 -280 -381
7974 -381 -134 167 466 563 496 -209 -526 -144 -499 -80 187 300 235 34 -301 -328 -318 -432 101 262 389 277
7996 277 187 -319 -354 -510 -389 -92 91 557 392 361 -135 -344 -491 -371 -77 342 366 349 249 96 -137 -611
8018 -611 -445 -189 286 354 491 505 198 -147 -527 -527 -1 18 452 429 353 103 -96 -372 -488 -82 86 369
8040 369 528 301 326 -17 -539 -390 -514 77 440 654 321 105 107 -421 -374 -354 -43 187 300 389 153 41
8062 41 -186 -433 -343 -445 206 475 403 58 -62 -225 -17 -311 -120 341 520 315 269 62 -283 -344 -234 -108
8084 -108 195 428 334 90 -43 -316 -585 -461 -208 216 270 402 206 -104 -352 -497 -381 36 -24 290 422
8105 422 463 186 -212 -310 -334 -228 113 343 358 295 65 -370 -378 -403 -116 -327 286 397 376 75 -56 -425 -324
$$ packed form
7952am05k38O20j65J86K05L82j36n70j10j71K1J52K28J66L78j82j43m01m7m9j01
7974c81K47L01K99R7o7p05l17L82l55M19K67J13o5k01l35k7J0j14N33J61J27j12
7996B77r0n06l5j56J21K97J83M66j65l1m96k09j47J20K94M19K4j7j00j53k33m74
8018f11J66K56M75O8J37J4l07l45l80%N26J9M34k3p6k50j99k76j16M06J68K83
8040C69J59k27K5l43n22J49j24N91L63K14l33k16Kn28M7K0L11K30J13Q9k36j12
8062D1k27k47R0j02O51K69p2l45j20j63K08k94J91M61J79k05m6k07l45o1J10J26
8084a08L03K33r4k44j33k73k69J24K53M24N4J32j96l10k48j45J16M17o0L14J32
8105D22M1k77l98r8k4J06L41K30J5o3k30m35qk5K87k11O13J11k1l01j31l69J01
$$ plain form
8128 -324 -612 -19 412 373 374 110 -137 -227 -602 -339 93 263 262 418 338 -329 -223 -495 -189 -15 171 113 341
8151 341 210 60 -340 -312 -392 -129 172 354 524 297 103 -192 -224 -670 -164 348 570 343 326 212 -261
8172 -261 -422 -459 -257 -9 314 608 211 -19 -205 -517 -545 -540 100 197 185 367 42 36 -288
$$ packed form
8128c24k88N93M31l9Jk64k47r0l75K63M32J70jJ56q0o67J06k72L06J74J86n8K28
8151C41j31j50m00K8q0K63L01J82J70k27j94k95l2m46N06N12K22k27j7j14m73
8172b61j61l7K02K48L23K94l97k30j86l12k8NO40R7j2J82l25ol24
8191b88
$$ Imaginary data points
##PAGE= N=2
##DATA TABLE= (X++(I..I)), XYDATA
$$ plain form
0 0 0 0 0 0 0 0 0 0 0 0 0 -8 0 -8 8 -8 11 -16 16 -23 24 -32 32 -40 48 -54 64 -72 83 -95 108 -124 140 -158 179
35 179 -200 224 -252 280 -315 348 -387 427 -475 524 -578 637 -703 773 -854 939 -1035 1142
53 1142 -1260 1395 -1545 1719 -1922 2155 -2436 2775 -3198 3741 -4464 5480 -7014 9586 -14702
68 -14702 28777 -151695 -491882 -204030 21022 -8405 47826 286833 280607 40353 -105466
79 -105466 -128779 -248738 -282681 -32622 251485 260517 156096 99838 -23344 -218529 -255739
90 -255739 -140455 -50632 46903 241523 315578 108981 -131284 -167344 -154452 -205639 -132565
101 -132565 118918 272628 202386 88399 11679 -127863 -261859 -207047 -22823 92922
111 92922 142348 200823 185195 26225 -151567 -226789 -203976 -91677 89839 210615 177728
$$ packed form
0@%%%%%%%%%%%qQqJ6j6J9k7L2l9M7n6O4p2Q8j02J18j36J55j78K03k32K64k98L37
35A79l79M24m76N32n95O63p35Q14r02R99j102J215j340J476j627J793j974K177
53A142k402K655k940L264l641M077m591N211n973O939q205R944j2494J6600k4288
68a4702M3479j80472l40187K87852K25052k9427N6231K39007o226k40254j45819
79a05466k3313j19959l3943K50059K84107R032j04421n6258j23182j95185l7210
90b55739J15284Q9823R7535J94620P4055k06597k40265l6060J2892n1187P3074
101a32565K51483J53710p0242j13987p6720j39542j33996N4812J84224J15745
111I2922M9426N8475j5628j58970j77792p5222K2813J12299J81516J20776l2887
$$ plain form
122 177728 91232 44998 -45254 -205972 -254731 -101580 81971 158623 184623 175188 46369
133 46369 -136714 -197642 -135656 -81011 -26472 106509 229827 195298 39314 -97744 -170955
144 -170955 -186570 -115013 22641 129038 161892 152229 89512 -48956 -179758 -193531 -108978
155 -108978 -6848 96325 181356 175781 65040 -58646 -129182 -162605 -148985 -43354 111062
166 111062 189487 150059 64034 -21874 -110773 -171408 -148103 -43475 78648 161219 171673
177 171673 97997 -25494 -127370 -160458 -126752 -47720 52417 136546 161960 113291 8322
188 8322 -107272 -173532 -147746 -48613 60150 128906 145212 108436 21882 -82528 -153076 -150920
200 -150920 -76486 35703 130657 160053 110969 16517 -76363 -135334 -140750 -84617 15316 111271
$$ packed form
122A77728q6496m6234r0252j60718m8759J53151J83551P6652K6000r435j28819
133D6369j83083o0928O1986N4645N4539J32981J23318l4529j55984j37058p3211
144a70955j5615P1557J37654J06397L2854r663o2717j38468j30802j3773Q4553
155a08978J02130J03173Q5031n575j10741j23686p0536l3423J3620J05631J54416
166A11062P8425l9428q6025q5908q8899o0635K3305J04628J22123Q2571J0454
177A71673p3676j23491j01876l3088L3706P9032J00137Q4129K5414m8669j04969
188H322j15594o6260K5786R9133J08763O8756J6306l6776q6554j04410p0548K156
200a50920P4434J12189R4954K9396m9084r4452r2880n8971n416N6133R9933R5955
$$ plain form
212 111271 154404 123902 35791 -68130 -137668 -141242 -82485 8099 94124 143346 129689 51888
224 51888 -53629 -130881 -143588 -91166 -668 87874 137158 125283 59465 -34187 -116323 -146301
236 -146301 -104165 -11366 81719 133128 125778 64291 -26018 -105537 -137349 -107122 -29644 64286
248 64286 131460 135524 72324 -21110 -98634 -131043 -108479 -38296 51509 120050 133249 84378
260 84378 -4007 -90454 -133701 -114342 -43087 44411 111142 128378 88433 8191 -76597 -128341
272 -128341 -120654 -55282 34649 105809 127743 93549 17361 -67656 -121572 -119680 -63354 20562
284 20562 96524 128568 99904 25321 -58123 -113815 -119909 -72235 10335 88865 125002 102832
296 102832 35316 -47857 -109833 -120172 -76120 824 77075 119650 108271 45301 -38715 -103155
$$ packed form
212A11271M3133l0502q8111j03921o9538l574N8757R0584Q6025M9222j3657p7801
224E1888j05517p7252j2707N2422R0498Q8542M9284j1875o5818r3652q2136k9978
236a46301M2136R2799R3085N1409p350o1487r0309p9519l1812L0227P7478R3930
248F4286O7174M064o3200r3434p7524l2409K2564P0183Q9805O8541J3199m8871
260H4378q8385q6447m3247J9359P1255Q7498O6731J7236l9945q0242q4788n1744
272a28341P687O5372Q9931P1160K1934l4194p6188q5017n3916J892N6326Q3916
284B0562P5962L2044k8664p4583q3444n5692o094M7674Q2570P8530L6137k2170
296A02832o7516q3173o1976j0339M4052P6944P6251M2575j1379o2970q4016o4440
$$ plain form
308 -103155 -120006 -83172 -8309 70579 115965 107508 52499 -25365 -93708 -120362 -90040 -17258
320 -17258 61262 110711 110718 61112 -18045 -88620 -117074 -91632 -26407 50059 105289 112124 66934
333 66934 -8143 -78469 -114030 -98010 -36540 42837 101311 112055 72090 578 -71001 -110006
345 -110006 -98810 -43143 30799 92601 112956 80711 9831 -64217 -107213 -101647 -50674 24178
357 24178 87322 108341 80937 20659 -50148 -102374 -107193 -58426 16498 79236 106202 88671
369 88671 29591 -46425 -99321 -102893 -61404 3033 67542 105749 94275 36181 -37755 -91346
381 -91346 -103780 -70516 -4526 63764 102218 94076 42983 -28556 -85571 -101370 -72882 -14972
393 -14972 51609 100088 100641 49256 -22582 -77379 -99312 -80720 -23643 49976 97377 94267 51827
$$ packed form
308a03155j6851L6834P4863P8888M5386q457n5009p7864o8343k6654L0322P2782
320a7258P8520M9449Pm9606p9157p0575k8454K5442O5225P6466N5230O835m5190
333F6934p5077p0326l5561J6020O1470P9377N8474J0744l9965p1512p1579l9005
345a10006J1196N5667P3942O1802K0355l2245p0880p4048m2996N566N0973P4852
357B4178O3144K1019k7404o0278p0807n2226m819M8767P4924O2738K6966j7531
369H8671n9080p6016n2896l572M1489O4437O4509L8207j1474n8094p3936n3591
381i1346j2434L3264O5990O8290L8454q142n1093p1539n7015j5799K8488N7910
393a4972O6581M8479N53n1385p1838n4797k1933J8592N7077P3619M7401l110m2440
$$ plain form
406 51827 -8079 -66375 -101025 -87814 -29466 42033 91210 97585 60565 -2416 -63776 -97532
418 -97532 -87865 -35596 33920 83582 93813 66837 11782 -54881 -100836 -93848 -37893 28828
430 28828 75997 92994 73106 16781 -51113 -92975 -89366 -48396 13080 71091 98656 79009
442 79009 20906 -45761 -88753 -89763 -51563 6505 61853 93608 83889 30634 -38340 -84721
454 -84721 -90165 -58677 -3508 57663 94552 84403 33483 -29006 -75732 -91069 -67099 -9945
466 -9945 53682 90610 83685 40365 -17925 -68656 -92365 -74260 -17401 49329 88309 83655 44680
479 44680 -10471 -63016 -89810 -74300 -24551 35656 80477 90708 56557 -6994 -63581 -86532
491 -86532 -73059 -30602 28421 76472 86580 57551 6796 -50030 -90656 -84783 -32322 30088
$$ packed form
406E1827n9906n8296l4650J3211N8348P1499M9177O375l7020o2981o1360l3756
418i7532R667N2269O9516M9662J0231k6976n5055o6663m5955O988N5955O6721
430B8828M7169J6997j9888n6325o7894m1862L609M0970O1476N8011K7565j9647
442G9009n8103o6667m2992j010L8200N8068N5348L1755r719n3255o8974m6381
454h4721n444L1488N5169O1171L6889j0149n0920o2489m6726j5337K3970N7154
466i945O3627L6928o925m3320n8290n0731k3709J8105N6859O6730L8980m654l8975
479D4680n5151n2545k6794J5510M9749O0207M4821J0231l4151o3551n6587k2951
491h6532J3473M2457N9023M8051J0108k9029n0755n6826m0626N873N2461O2410
$$ plain form
503 30088 68844 81126 65225 15043 -48426 -84111 -78008 -43218 9882 67935 94172 65472
515 65472 9016 -38119 -70984 -83900 -55240 10021 65114 81611 67860 29750 -31385 -82503
527 -82503 -84052 -44225 2748 45501 80603 81181 33127 -31032 -72323 -80447 -57534 -5248 51232
540 51232 78160 70112 38913 -11918 -68134 -89356 -59480 -7333 39426 74014 81867 43150
552 43150 -19847 -61527 -71003 -63078 -29915 32545 83910 81965 39386 -9196 -51067 -77983 -68956
565 -68956 -23456 28651 65209 78822 57588 838 -55702 -77406 -65636 -31819 20596 69849
577 69849 78857 47129 6354 -32755 -72768 -84416 -39573 28813 65703 66392 53965 21831 -34519
590 -34519 -78147 -73704 -35689 8457 51244 79570 66736 15794 -36563 -65587 -70183 -46743
$$ packed form
503C0088L8756J2282j5901n0182o3469l5685O103L4790N3100N8053K6237k8700
515F5472n6456m7135l2865j2916K8660O5261N5093J6497j3751l8110o1135n1118
527h2503j549L9827M6973M2753L5102N78m8054o4159m1291q124K2913N2286N6480
540E1232K6928q048l1199n0831n6216k1222K9876N2147M6759L4588P853l8717
552D3150o2997m1680r476P925L3163O2460N1365j945m2579m8582m1871k6916R027
565f8956M5500N2107L6558J3613k1234n6750n6540k1704J1770L3817N2415M9253
577F9849R008l1728m0775l9109m0013j1648M4843O8386L6890O89j2427l2134n6350
590c4519m3628M443L8015M4146M2787K8326j2834n0942n2357k9024m596K3440
$$ plain form
602 -46743 2440 51557 73139 63987 29582 -24877 -72118 -76140 -40920 1453 36948 67586
614 67586 73530 34768 -24688 -63527 -69496 -52807 -12833 41321 75009 66013 29616 -11964 -50459
627 -50459 -73078 -61051 -15967 36123 69379 70550 38052 -11675 -51542 -66120 -57216 -25133
639 -25133 25073 67630 72610 41356 -3043 -44032 -70462 -64135 -23147 26538 57711 65463 50075
652 50075 9288 -42591 -72702 -63943 -26726 17979 54968 69078 50714 9640 -34651 -64011
664 -64011 -66945 -37055 13245 54846 67777 51783 15470 -29512 -63076 -65841 -37574 4530
676 4530 45312 68745 60173 19742 -29257 -59916 -63107 -41507 -2195 41560 66299 59368 25608
689 25608 -19319 -56723 -68044 -45781 -3204 38140 61706 59713 31291 -13324 -52757 -66954
$$ packed form
602d6743M9183M9117K1582r152l4405n4459m7241m022L5220M2373L5495L0638
614F7586N944l8762n9456l8839n969J6689L9974N4154L3688q996l6397m1580l8495
627e0459k2619J2027M5084N2090L3256J171l2498m9727l9867j4578Q904L2083
639b5133N0206M2557M980l1254m4399m0989k6430O327M0988M9685L1173P752j5388
652E0075m0787n1879l0111Q759L7217M4705L6989J4110j8364m1074m4291k9360
664f4011k934K9890N0300M1601J2931j5994l6313m4982l3564k765K8267M2104
676D530M0782K3433q572m0431m8999l0659l191K1600L9312M3755K4739o931l3760
689B5608m4927l7404j1321K2263M2577M1344K3566j993k8422m4615l9433j4197
$$ plain form
701 -66954 -49853 -10652 33454 62299 61523 32714 -9238 -46355 -64311 -53667 -16840 28057
713 28057 59242 62925 37951 -4376 -44332 -63038 -52892 -20842 20328 54536 64917 42984
725 42984 381 -39928 -60980 -55748 -25774 17457 52106 61995 43723 7462 -33179 -60011
737 -60011 -58854 -29213 13189 48090 61439 47254 11672 -29200 -56598 -58756 -34201 7342
749 7342 45320 60981 48608 15707 -23852 -54276 -59845 -36933 2927 40154 59542 52097 20988
762 20988 -21138 -52303 -58079 -38938 -2835 34796 58075 54150 25056 -15364 -48659 -59596
774 -59596 -42652 -6282 31626 55008 54054 28985 -9870 -44789 -58749 -45797 -11874 27021
786 27021 53897 55648 31879 -5923 -40500 -57001 -48062 -16403 22460 50662 56271 35825 -1157
$$ packed form
701f6954J7101L9201M4106K8845p76k8809m1952l7117j7956J0644L6827M4897
713B8057L1185L683k4974m2327l9956j8706J0146L2050M1170L4208J0381k1933
725D2984m2603m0309k1052N232K9974M3231L4649R889j8272l6261m0641k6832
737f0011J157K9641M2402L4901J3349j4185l5582m0872k7398k158K4555M1543
749G342L7978J5661j2373l2901l9559l0424n569K2912L9860L7227J9388p445l1109
762B0988m2126l1165n776J9141L6103L7631K3279l925k9094m0420l3295j0937
774e9596J6944L6370L7908K3382r54k5069l8855l4919j3960J2952L3923L8895
786B7021K6876J751k3769l7802l4577j6501Q939L1659L8863K8202N609k0446l6982
$$ plain form
799 -1157 -37117 -55550 -49171 -21029 17162 48181 56744 38594 3277 -32864 -54309 -50622 -23879
812 -23879 13058 43802 55324 42664 9188 -29456 -53626 -51616 -27058 8540 40824 55309
824 55309 43439 11666 -23908 -48671 -53201 -33420 4095 39498 54302 44336 16294 -19008
836 -19008 -47175 -53951 -34272 500 33839 52193 47728 21274 -16419 -45778 -52732 -36555 -5359
849 -5359 29302 51303 49677 23830 -11973 -42013 -52672 -39802 -8295 26471 48088 48955 28196
862 28196 -6039 -39057 -53227 -41960 -12149 21844 47458 50889 30173 -3821 -34382 -49145
874 -49145 -43982 -18904 17708 46640 51321 32060 536 -30671 -49841 -46032 -19947 14537 41405
887 41405 49729 36683 6082 -27856 -48801 -46947 -23802 10854 39295 49516 37265 10049
$$ packed form
799a157l5960j8433O379K8142L8191L1019Q563j8150l5317l6141k1445L687K6743
812b3879L6937L0744J1522j2660l3476l8644k4170K010K4558L5598L2284J4485
824E5309j1870l1773l5574k4763m530J9781L7515L5403J4804r966k8042l5302
836a9008k8167o776J9679L4772L3339J8354m465k6454l7693k9359o954J6177L1196
849e359L4661K2001j626k5847l5803l0040j0659J2870L1507L4766K1617Q67k0759
862B8196l4235l3018j4170J1267K9811L3993K5614L431k0716l3994l0561j4763
874d9145N163K5078L6612K8932M681j9261l1524l1207j9170L809K6085L4484K6868
887D1405Q324j3046l0601l3938k0945J854K3145L4656K8441J0221j2251k7216
$$ plain form
899 10049 -22466 -47584 -49836 -25781 8653 35145 46547 40929 16218 -20842 -47080 -47233 -27287
912 -27287 924 30460 50106 44725 14821 -19280 -40373 -45430 -32971 -4371 29011 48256
924 48256 44453 20324 -13177 -40652 -47929 -33085 -5612 23804 45500 46701 22445 -10877 -34877
937 -34877 -45051 -39002 -13276 24171 48178 43614 21705 -3769 -29567 -47629 -42208 -12806 20740
950 20740 41366 44353 29265 -228 -30582 -46417 -40766 -16666 15882 39841 44354 30286 4897
963 4897 -25326 -47185 -44157 -16953 13712 34099 42495 36528 9873 -26054 -46372 -40778 -20345
976 -20345 5723 31924 46350 37269 9117 -20935 -40448 -42664 -26257 3004 30857 45502
988 45502 39042 13350 -19257 -39992 -40582 -26890 -3132 25984 46204 41057 14423 -14899 -35283
$$ packed form
899A0049l2515k5118k252K4055L4434K6492J1402n618k4711l7060k6238j53J9946
912b7287K8211K9536J9646n381k9904l4101k1093n057J2459K8600L3382J9245
924D8256l803k4129l3501k7475p277J4844K7473K9416K1696J201k4256l3322k4000
937c4877j0174O049K5726L7447K4007m564k1909k5474k5798j8062N421K9402L3546
950B0740K0626K987j5088k9493l0354j5835N651K4100L2548K3959M513j4068k5389
963D897l0223k1859L028K7204L0665K0387Q396n967k6655l5927k0318N594K0433
976b0345K6068K6201J4426r081k8152l0052j9513k216J6407K9261K7853J4645
988D5502o460k5692l2607k0735n90J3692K3758K9116K0220n147k6634k9322k0384
$$ plain form
1001 -35283 -42427 -32228 -4212 27168 42703 38074 18318 -8299 -32977 -44460 -34078 -6881
1013 -6881 23414 41806 39666 20684 -5651 -29896 -43526 -36785 -10316 20674 39026 39817 25276
1026 25276 -1317 -29617 -44085 -35237 -11687 14511 35318 42316 28796 329 -27614 -41436
1038 -41436 -37005 -16079 12026 34237 40626 29797 5455 -23339 -41701 -38638 -17855 8603
1050 8603 31481 41579 32135 6218 -21130 -37204 -38309 -23447 4188 31267 41731 31861 9363
1063 9363 -16172 -36467 -40564 -24177 2530 26297 39507 36229 14009 -15588 -35580 -38459 -25560
1076 -25560 -2501 24105 39778 35554 16019 -9589 -32341 -41273 -29588 -2786 22684 36601
1088 36601 35841 19960 -6862 -30856 -39078 -29994 -8918 17573 37836 38980 20078 -5972 -26805
$$ packed form
1001c5283p144J0199K8016L1380J5535m629j9756k6617k4678j1483J0382K7197
1013f881L0295J8392k140j8982k6335k4245j3630O741K6469L0990J8352P91j4541
1026B5276k6593k8300j4468Q848K3550K6198K0807O998j3520k8467k7943j3822
1038d1436M431K0926K8105K2211O389j0829k4342k8794j8362L063K0783K6458
1050H603K2878J0098r444k5917k7348j6074j105J4862K7635K7079J0464r870k2498
1063I363k5535k0295m097J6387K6707K3767J3210l278k2220k9597j9992k879J2899
1076b5560K3059K6606J5673m224j9535k5608k2752q932J1685K6802K5470J3917
1088C6601p60j5881k6822k3994q222R084K1076K6491K0263J144j8902k6050k0833
$$ plain form
1101 -26805 -37493 -32745 -11744 16309 35106 37616 23744 -270 -25632 -39015 -32745 -12435
1113 -12435 12016 32003 38136 26514 2161 -22731 -36784 -34501 -16566 9816 30947 37225
1125 37225 27082 5838 -18978 -36081 -36121 -18570 7129 28466 37331 29128 8157 -16827 -34172
1138 -34172 -35600 -21433 2495 26147 37830 31291 10186 -14391 -32078 -35869 -22964 257
1150 257 23051 35543 32388 14474 -10846 -31753 -37027 -24868 -2025 20487 34218 33252 16845
1163 16845 -7935 -28574 -36338 -27151 -5751 18157 34059 34035 18177 -5119 -26265 -35634 -28779
1176 -28779 -8383 15387 32256 34640 21095 -2709 -24955 -34620 -29080 -11275 11501 30957
1188 30957 36039 22475 -774 -22084 -33208 -30895 -14429 10283 29387 34343 24028 3379
$$ packed form
1101b6805j0688M748K1001K8053J8797K510j3872k4014k5362j3383O270K0310
1113a2435K4451J9987O133j1622k4353k4892j4053K283J7935K6382K1131O278
1125C7225j0143k1244k4816j7103m0J7551K5699K1337Q865q203k0971k4984j7345
1138c4172j428J4167K3928K3652J1683o539k1105k4577j7687l791J2905K3221
1150B57K2794J2492l155j7914k5320k0907n274J2159K2843K2512J3731r66j6407
1163A6845k4780k0639p764R187K1400K3908J5902k4j5858k3296k1146r369O855
1176b8779K0396K3770J6869K384j3545k3804k2246r665N540J7805K2776J9456
1188C0957N082j3564k3249k1310j1124K313J6466K4712J9104M956j0315k0649
$$ plain form
1200 3379 -18901 -33627 -32516 -15588 7910 27128 34178 25504 5863 -16461 -31683 -32892 -18943
1213 -18943 4744 26043 34293 26205 8086 -13707 -30434 -33790 -20502 2776 22929 32692 28650
1226 28650 11758 -11711 -30334 -33014 -20757 -479 19156 32047 30709 14329 -9736 -28563
1238 -28563 -33299 -23040 -3170 17412 31135 30772 15907 -6592 -25667 -32710 -25071 -6548 15346
1251 15346 30758 31623 17336 -4455 -23146 -31885 -26450 -9629 12701 29806 32167 19268 -1479
1264 -1479 -20819 -31177 -28096 -11926 10406 27898 32036 21437 1707 -18809 -31186 -28903 -13298
1277 -13298 7978 25521 31317 23576 4753 -16312 -30752 -30037 -15417 6338 24125 30686 24221
1290 24221 7631 -13630 -28924 -30091 -17610 2649 21990 31247 26090 8601 -12408 -27003
$$ packed form
1200C379k2280j4726J111J6928K3498J9218P050q674j9641k2324j5222j209J3949
1213a8943K3687K1299Q250q088j8119k1793j6727l356J3288K3278K0153R763m042
1226B8650j6892k3469j8623k680J2257K0278J9635J2891j338j6380k4065j8827
1238b8563m736J0259J9870K0582J3723l63j4865k2499j9075p043P639J8523K1894
1251A5346J5412Q65j4287k1791j8691q739N435J6821K2330J7105K361j2899k0747
1264a479j9340j0358L081J6170K2332J7492M138j0599j9730k0516j2377K283J5605
1277a3298K1276J7543N796p741j8823k1065j4440P15J4620K1755J7787O561o465
1290B4221j6590k1261j5294j167J2481K0259J9341R257n157j7489k1009j4595
$$ plain form
1302 -27003 -29536 -19464 -559 19486 30902 27530 11110 -9954 -25868 -30097 -21196 -2102 17655
1315 17655 29292 27599 14131 -7032 -24493 -30647 -22386 -4442 15360 28243 28283 15411 -4527
1328 -4527 -22050 -29951 -24692 -7459 13895 27943 28162 16817 -1655 -19573 -29727 -25859 -9253
1341 -9253 10844 25526 29250 19217 50 -19447 -28725 -24832 -11215 7509 24030 29900 20865
1354 20865 2397 -16355 -28045 -27287 -13517 6872 22780 27843 21615 5866 -13778 -27727 -27791
1367 -27791 -15074 3763 20908 28967 23378 6739 -12272 -25215 -27300 -17742 932 19647 28473
1380 28473 24185 9346 -9547 -25173 -28279 -17759 -827 16121 27127 26664 12241 -8483 -23702
1393 -23702 -27444 -20041 -3760 15299 27048 25486 12734 -4659 -20482 -28522 -22324 -4881 13777
$$ packed form
1302b7003k533J0072J8905K0045J1416l372j6420k1064j5914m229Q901J9094J9757
1315A7655J1637j693j3468k1163j7461o154Q261J7944J9802J2883M0j2872j9938
1328d527j7523p901N259J7233K1354J4048K19j1345j8472j7918j0154L868J6606
1341i253K0097J4682L724j0033j9167j9497r278L893J3617J8724J6521N870r035
1354B0865j8468j8752j1690P58J3770K0389J5908N063o228j5749j9644j3949o4
1367b7791J2717J8837J7145Q059n589j6639j9011j2943k085R558J8674J8715Q826
1380B8473m288j4839j8893j5626l106J0520J6932J6948J1006m63j4423k0724j5219
1393b3702l742P403J6281J9059J1749j562j2752j7393j5823q040O198J7443J8658
$$ plain form
1406 13777 25353 26226 15253 -2893 -19833 -26404 -22496 -8616 10624 25933 27068 15051 -1352
1419 -1352 -16176 -26611 -24886 -9505 10211 22838 25283 18722 3024 -16810 -27937 -23693 -9812
1432 -9812 6336 20298 26796 20463 3566 -14199 -25275 -25311 -13584 5420 20859 25252 20148
1445 20148 6705 -11377 -25481 -25555 -13640 2228 16694 26796 23991 7129 -12545 -22915 -23227
1458 -23227 -16493 -1560 16669 26983 22965 8718 -7890 -21521 -26062 -17980 -1647 14687 24752
1471 24752 23960 11490 -6662 -20502 -24557 -19440 -5184 13589 25767 23598 11123 -3161 -16972
1484 -16972 -26328 -22723 -5434 13209 22865 23059 15005 -678 -17653 -25633 -20613 -7667 8593
1497 8593 21955 25389 16066 -328 -15612 -24449 -22757 -9361 8375 20222 23079 17836 4391
$$ packed form
1406A3777J1576Q73j0973j8146j6940o571L908J3880J9240J5309J135j2017j6403
1419a352j4824j0435J725J5381J9716J2627K445o561j5698j9834j1127M244J3881
1432i812J6148J3962O498o333j6897j7765j1076l6J1727J9004J5439M393n104
1445B0148j3443j8082j4104p4J1915J5868J4466J0102k805j6862j9674j0370l12
1458b3227O734J4933J8229J0314m018j4247j6608j3631m541Q082J6333J6334J0065
1471B4752p92j2470j8152j3840m055N117J4256J8773J2178k169j2475j4284j3811
1484a6972r356L605J7289J8643R656J94q054j5683j6975p980N020J2946J6260
1497H593J3362L434r323j6394j5284q837J692J3396J7736J1847K857n243j3445
$$ plain form
1510 4391 -14368 -25960 -22380 -9476 4783 17731 25360 19970 2970 -13237 -21714 -22253 -13926
1523 -13926 2570 18712 25166 19015 5695 -9794 -21864 -23781 -13838 1505 15454 23934 21652
1536 21652 7457 -9618 -20520 -22417 -16399 -2110 14871 24520 20983 8777 -5577 -19005 -24734
1549 -24734 -17478 -1412 13399 21411 21265 12027 -4026 -18838 -23663 -17929 -5014 11164 22712
1562 22712 22556 11896 -2604 -15476 -23129 -20247 -6577 10036 20622 22308 14961 55 -15759
1575 -15759 -23452 -19113 -7584 6625 18918 23537 16060 767 -13683 -21728 -20903 -10319 6247
1588 6247 18788 22083 16281 3961 -11511 -22239 -21657 -10701 3866 16268 22596 18573 4730
1601 4730 -10937 -20397 -20979 -13126 1174 15924 22752 18220 6276 -8040 -19478 -22454 -14052 405
$$ packed form
1510D391j8759j1592L580J2904J4259J2948P629n390j7000j6207q477n39Q327
1523a3926J6496J6142O454o151j3320j5489j2070j917R943J5343J3949Q480k282
1536B1652j4195j7075j0902j897O018J4289J6981R649l537j2206j4354j3428n729
1549b4734P256J6066J4811Q012j46r238j6053j4812m825N734J2915J6178J1548
1562B2712j56j0660j4500j2872p653K882J3670J6613J0586J686p347j4906j5814
1575a5759p693M339J1529J4209J2293M619p477j5293j4450q045Q25J0584J6566
1588F247J2541L295n802j2320j5472j0728N82J0956J4567J2402O328m023j3843
1601D730j5667r460n82P853J4300J4750O828m532j1944j4316j1438k976Q402J4457
$$ plain form
1615 405 13773 21230 20051 9001 -7271 -19073 -21460 -14637 -2127 12203 21823 20280 9145
1628 9145 -4951 -16595 -22053 -17081 -3084 11834 20147 19948 11404 -2707 -16454 -22009 -17122 -4680
1642 -4680 9033 19647 21369 12492 -2028 -14440 -20423 -18274 -7352 7795 19263 20923 13772
1655 13772 678 -13118 -21300 -18899 -7580 6023 16743 21083 15392 1845 -12270 -19894 -19075
1668 -19075 -10141 4142 17194 21274 15204 3692 -9248 -19358 -20716 -11068 3335 14884 20014
1681 20014 16920 6037 -8879 -18781 -19959 -12193 390 13558 20660 17689 6572 -6726 -17337
1694 -17337 -20690 -13822 -337 12605 19141 18164 9291 -5142 -17620 -20475 -13639 -2135 10008
1707 10008 19084 19517 9572 -4322 -15127 -19468 -15913 -4579 9710 19026 18794 10632 -1496 -14122
$$ packed form
1615D05J3368P457j179j1050j6272j1802k387O823J2510J4330R620j543j1135
1628I145j4096j1644n458M972J3997J4918Q313j99q544j4111j3747n555M887J2442
1642d680J3713J0614J722q877j4520j2412n983K149J0922J5147J1468J660p151
1655A3772j3094j3796q182K401J1319J3603J0720M340n691j3547j4115p624Q19
1668a9075Q934J4283J3052M080o070j1512j2940j0110j358R648J4403J1549N130
1681B0014l094j0883j4916r902j178P766J2583J3168P102k971j1117j3298j0611
1694a7337l353O868J3485J2942O536r77q873j4433j2478k855O836J1504J2143
1707A0008R076M33r945j3894j0805m341L555J1334J4289R316k32q162j2128j2626
$$ plain form
1721 -14122 -20078 -16485 -5201 7220 17287 20009 12476 -1316 -13265 -18733 -17050 -8075 5907
1734 5907 17541 19751 12435 943 -10592 -18779 -18795 -8453 5433 15866 18542 14166 3658 -9843
1748 -9843 -19106 -18280 -9172 3476 14536 19046 15164 4351 -8346 -17563 -19016 -10942 1979 13192
1762 13192 18484 16122 6378 -7201 -17257 -18446 -11537 -183 11118 18466 17540 6974 -6379
1775 -6379 -15916 -17968 -12781 -1905 10449 18096 17161 8274 -4165 -14444 -18587 -14167 -3493 9402
1789 9402 17656 17519 9080 -2822 -13022 -18187 -15258 -5234 8435 17079 17511 10121 -863 -11667
1803 -11667 -18110 -15942 -5789 7330 15850 17291 11720 733 -11344 -18199 -16359 -6552 5125
1816 5125 14344 17667 13116 2366 -10333 -17769 -16457 -7723 3558 13578 18050 14069 3282 -8726
$$ packed form
1721a4122n956L593J1284J2421J0067K722p533j3792j1949n468J683Q975J3982
1734E907J1634K210p316j1492j1535q187j6J0342J3886J0433K676m376j0508j3501
1748i843r263Q26R108J2648J1060M510l882j0813j2697r217j453Q074J2921J1213
1762A3192N292k362r744j3579j0056j189O909J1354J1301P348r26j0566j3353
1775f379r537k052N187J0876J2354P647r35q887j2439j0279m143M420J0674J2895
1789I402Q254j37q439j1902j0200n165K929J0024J3669Q644M32p390j0984j0804
1803a1667o443K168J0153J3119Q520J441n571j0987j2077o855J840R807J1677
1816E125R219L323m551j0750j2699p436J312Q734J1281J0020M472l981j0787j2008
$$ plain form
1830 -8726 -16612 -16967 -9236 2154 12965 17758 14424 4412 -7529 -15560 -16749 -10490 57 11439
1844 11439 17702 15385 5487 -6368 -14544 -16666 -11930 -1349 10725 17535 15184 6752 -4184 -13399
1858 -13399 -17617 -13207 -1810 9507 16096 15603 8610 -2625 -12937 -17423 -13419 -3149 8314
1871 8314 15661 15967 9363 -1214 -11631 -17256 -14599 -4483 7257 14501 16213 11004 -100 -11239
1885 -11239 -16833 -14167 -5695 4725 13668 17067 11749 668 -10075 -15540 -14722 -7276 3932 13324
1899 13324 16600 12389 2778 -8683 -15955 -15555 -7971 2345 11865 16915 13466 3244 -7475 -14602
1913 -14602 -15237 -10065 723 11853 16626 13128 4691 -5585 -13845 -16466 -10339 335 10242 15392
1927 15392 14189 6443 -5045 -13742 -15775 -10959 -1540 8847 15641 14517 7018 -3404 -12103 -16334
$$ packed form
1830h726p886l55P731J1390J0811M793l334j0012j1941q031j189O259J0547J1382
1844A1439O263k317r898j1855q176k122M736J0581J2074O810k351q432j0936r215
1858a3399m218M410J1397J1317O589m93o993j1235j0312m486M004J0270J1463
1871H314P347L06o604j0577j0417n625K657J0116J1740P244J712n209j1104j1139
1885a1239n594K666Q472J0420Q943L399n318j1081j0743n465Q18P446J1208R392
1899A3324L276m211r611j1461p272M00P584J0316R520N050l449j0222j0719p127
1913a4602o35N172J0788J1130M773l498q437j0276q260k621O127J0674R907N150
1927A5392j203p746j1488q697k033M816R419J0387O794j124p499j0422q699m231
$$ plain form
1941 -16334 -12528 -2313 8427 14499 14232 8815 -2162 -11869 -16096 -12295 -3707 6316 14248 15463
1955 15463 9061 -1535 -10561 -14971 -13443 -5282 5457 13662 15015 10027 677 -9430 -15195 -13584
1969 -13584 -5957 4144 12432 15358 11101 1521 -8377 -14622 -13893 -7198 3167 12009 15088 11663
1983 11663 3164 -6904 -14151 -14752 -8023 2013 10665 14901 12543 4097 -6512 -13454 -14129 -9247
1997 -9247 -63 9698 14990 12911 4818 -5058 -12611 -14534 -9797 -833 8475 14211 13374 6514 -3824
2012 -3824 -12259 -14287 -10624 -2058 7588 14272 13676 6980 -2675 -10539 -14341 -11751 -3209 6720 13378
2027 13378 13630 7959 -1321 -9884 -14237 -12135 -4268 5601 12718 13938 8911 -398 -8844 -13823 -12486
2042 -12486 -5405 4817 11794 13853 9644 1151 -8059 -13813 -12962 -5813 3396 10932 13996 10503 2589
$$ packed form
1941a6334L806J0215J0740O072k67n417j0977r707m227L801Q588J0023P932J215
1955A5463o402j0596r026m410J528Q161J0739Q205J353m988r350j0107n765J611
1969a3584P627J0101Q288K926m257r580r898o245P29O695J0365Q842L079l425
1983A1663q499j0068p247o01O729J0036Q652M236k358q446j0609o942o75M882
1997i247R184R761N292k079q093r876p553j923M737Q964R308N736q37o860j0338
2012c824q435k028L663Q566R646O684n96o696r655p864l802K590Q542R929O658
2027A3378K52n671r280q563m353K102P867R869P117J220n027r309q446m979J337
2042a2486P081J0222O977K059m209q493r210n754Q51P149R209P536L064l493p914
$$ plain form
2057 2589 -7005 -13554 -13377 -6563 2311 10166 13609 11323 3758 -6162 -12877 -13120 -7848 828 9086
2072 9086 13713 12027 4437 -5483 -12158 -13141 -8803 -660 8201 13721 12524 5128 -4066 -11214 -13283
2087 -13283 -9742 -1925 7660 13254 12600 6047 -2926 -10295 -13308 -10555 -2968 6666 12757 12760 6867 -1595
2103 -1595 -9256 -13215 -11408 -3889 6223 12365 12523 7649 -33 -8394 -13359 -11906 -4348 4940 11060
2118 11060 12409 8792 793 -7978 -13134 -11531 -5113 3460 10358 12850 9434 1770 -7270 -12558 -12269
2133 -12269 -5934 2875 9480 12364 10395 2827 -6570 -12445 -11845 -6604 878 8682 13402 11130 3140
2148 3140 -5229 -10949 -11990 -8220 239 8572 12973 11155 4061 -4120 -10697 -12352 -8507 -1089 7285
2163 7285 12463 11545 5145 -3461 -9885 -12052 -9603 -2021 6921 12362 10918 5946 -1398 -9177 -13025
$$ packed form
2057B589r594o549J77O814Q874P855L443k286p565r920o715k43N272Q676Q258
2072I086M627j686p590r920o675r83M338Q143Q861N520j197p396r194p148k069
2087a3283L541P817R585N594o54o553q973p369l013K753P587R634O091Ln893q462
2103a595p661l959J807P519J0112O142J58m874p682q361m965J453P558R288O120
2118A1060J349l617p999q771n156J603O418Q573O898K492l416p664r040n288K89
2133a2269O335Q809O605K884j969p568r397n875O00N241P482P804M720k272p990
2148C140q369n720j041L770Q459Q333M401j818p094q181o577j655L845P418Q374
2163G285N178r18o400q606o424k167K449P582Q942N441j444m972p344p779l848
$$ plain form
2178 -13025 -10062 -2062 5835 10854 11721 7269 -683 -8532 -12131 -10174 -3700 4659 10826 12075 7391
2193 7391 2 -7427 -11861 -10743 -4414 3882 9709 11730 8683 1294 -7019 -11828 -10592 -5030 2139
2208 2139 9303 12602 9137 1395 -6191 -10762 -11147 -6626 1780 8936 11649 9129 3359 -5063 -10949
2223 -10949 -11535 -6666 697 7497 11394 10363 3725 -4397 -9844 -11188 -8085 -529 7615 11691 10005
2238 10005 4499 -2837 -9690 -12043 -8012 -1001 6054 10733 11145 5938 -2873 -9451 -11239 -8553 -2502
2253 -2502 5363 10960 11052 5599 -1664 -7804 -11360 -9552 -3008 4884 10096 10832 7052 -72 -7634 -11030
2269 -11030 -9448 -3854 3469 9715 11111 7416 215 -6381 -10632 -10304 -4939 3040 9006 10625 8160
2284 8160 1931 -5710 -10836 -10355 -4890 1820 8092 10831 9036 2209 -5302 -10186 -10333 -6171 1044
$$ packed form
2178a3025K963Q000P897N019Q67m452p952p849l599J957O474Q359O167J249m684
2193G391p389p429m434J118O329Q296N827K021l047p389q313m809J236N562P169
2208B139P164L299l465p742p586m571l85M521Q406P156K713k520n770q422n886
2223a0949n86M869P363O800L897j031o638q122n447j344L103P556Q144M076j686
2238A0005n506p336o853k353M031P011P055M679M12n207q811o578j788K686O051
2253b502P865N597R2n453p263o140l556J808O544P892N212P36l780p124p562l396
2269a1030J582N594P323O246J396l695p201o596m251L28N365P979N966J619k465
2284H160o229p641n126M81N465O710O272K739j795o827p511m884j47M162P215
$$ plain form
2299 1044 7516 10706 9003 3395 -3935 -9675 -10681 -6697 218 6599 10763 9869 3870 -3739 -8963
2314 -8963 -9970 -7634 -1285 6396 10685 9465 4319 -2122 -8279 -10476 -8256 -1532 5626 9899 9911
2329 9911 5535 -1355 -7665 -10499 -8659 -2766 4754 9577 10044 5989 -560 -6883 -10466 -9146 -3023
2344 -3023 3925 8896 9960 7169 560 -6556 -10179 -8977 -3847 2354 8156 10172 7524 1093 -6005
2359 -6005 -9975 -9387 -4478 1977 7551 10186 8105 1906 -5411 -9214 -9134 -5415 844 7165 10168 8263
2375 8263 2061 -4279 -8575 -9664 -6321 109 6858 10081 8553 3437 -3263 -8521 -9813 -6898 -429
2390 -429 6049 9742 8813 4054 -2242 -7717 -10098 -7365 -1373 5583 9366 8598 4858 -1337 -7301 -10145
2406 -10145 -7540 -1730 4444 8819 9031 5629 -666 -7030 -9574 -7972 -2636 3686 8531 9541 6150
$$ packed form
2299A044O472L190j703n608p330n740j006L984O915O381M164q94n999p609n224
2314h963j007K336O349P681M289j220n146o441o157k197K220O724P158M273J2
2329I911m376o890o310k834J840N893P520M823M67m055o549o323l583J320O123
2344c023O948M971J064k791o609p116l623J202N130O201N802K016k648o431p098
2359f005l970N88M909O455N574K635k081o199p317l803Q0L719O259O321L003j905
2375H263o202o340m296j089L343O430O749L223j528n116o700n258j292K915O469
2390d29O478L693r29m759o296n475k381K733N992O956L783p68l740o195n964k844
2406a0145K605N810O174M375K12l402o295o364k544J602N336O322M845J010l391
$$ plain form
2421 6150 -249 -6181 -9382 -8332 -3435 2700 7994 9623 6729 555 -5687 -8921 -8582 -4268 1965
2436 1965 7494 9788 7062 1435 -4896 -8961 -8841 -4812 1323 6967 9428 7289 2157 -4420 -8504
2451 -8504 -8709 -5641 540 6336 9525 7515 2707 -3589 -7916 -9077 -6391 -185 6092 9158 8181
2466 8181 3844 -2506 -7720 -9185 -6515 -1148 4963 8855 8402 4320 -1910 -7161 -9302 -6918 -1656
2481 -1656 4458 8281 8600 4910 -1009 -6537 -9131 -7504 -2320 3779 8106 8677 5358 -494 -5872
2496 -5872 -8900 -7675 -3084 3066 7696 8647 5974 625 -5387 -8969 -8078 -3675 2154 6980 8751
2511 8751 6659 1101 -4678 -8279 -8184 -4401 1652 6723 8937 7014 1884 -4079 -7882 -8320 -4629 593
2527 593 6081 8629 7208 2577 -3334 -7704 -8394 -5381 -32 5504 8365 7513 3357 -2631 -7132 -8369
$$ packed form
2421F150o399n932l201J050M897O135N294J629k894o174o242l234L39M314O233
2436A965N529K294k726n627o331m065J20M029O135N644K461k139n132o577m084
2451h504k05L068O181N796L189k010m808o296m327j161K686O206O277L066r77
2466H181m337o350n214j465K670N367O111L892m53m082o230n251k141K384N262
2481a656O114L823L19l690n919n528k594J627N184O099M327N71l319n852n378
2496e872l028J225M591O150M630R51k673n349o012l582Q91M403N829M826J771
2511H751k092n558n779l601R5L783O053N071K214j923n130n963l803m38L691N222
2527E93N488K548j421m631n911m370o90L013N349N536K861q52m156n988m501j237
$$ plain form
2543 -8369 -6003 -530 5052 8427 7647 3622 -2070 -6771 -8127 -6189 -1460 4384 7909 8035 4195
2558 4195 -1314 -6330 -8639 -6570 -1829 3735 7613 8046 5208 -508 -5952 -8296 -7177 -2572 3049
2573 3049 7202 8083 5371 210 -4932 -8225 -7443 -3437 2330 6839 8255 5587 796 -4456 -7824
2588 -7824 -7653 -3733 1538 6203 8266 6465 1528 -4002 -7574 -7745 -4166 1147 6232 7779 6646
2603 6646 2465 -3379 -7420 -7900 -4829 222 5259 7997 6959 2754 -2863 -6727 -7597 -5289 -674
2618 -674 4587 7986 7207 3100 -2136 -6518 -7904 -5695 -1031 4141 7462 7583 3601 -1442 -5948 -7716
2634 -7716 -6255 -1734 3555 7271 7483 4535 -637 -5473 -7929 -6713 -2080 3140 6641 7223 4785
2649 4785 -59 -5074 -7556 -6907 -2848 2701 6368 7427 5399 674 -4315 -7428 -7102 -3262 1673
$$ packed form
2543h369K366N473N582L375p80m025n692m701j356J938M729N844L525J26l840
2558D195n509n016k309K069M741N564L878M33k838n716n444k344J119M605N621
2573C049M153Q81k712n161n142l293P82M006N767M509J416k668m791n252l368
2588g824J71L920N271M665K063j801m937n530l572j71L579N313N085J547j133
2603F646m181n844m041m80L071N051N037K738j038m205n617l864q70K308M615
2618f74N261L399p79m107n236m382j386K209M664N172L321J21l982n043m506j768
2634g716J461M521N289L716K12k948n172m836k456J216M633N220L501N82k438
2649D785m844n015k482O49M059N549L667J059k028m725m989l113L26L840M935
$$ plain form
2664 1673 6131 7642 5503 1018 -3938 -6841 -6876 -3695 1315 5704 7594 6050 2037 -3304 -6902
2679 -6902 -7306 -4187 443 4709 7230 6570 2350 -2867 -6317 -6878 -4763 -476 4639 7305 6495 2703
2695 2703 -1714 -5836 -7510 -5199 -672 4244 6879 6584 3514 -1427 -5656 -7259 -5642 -1708 3560
2710 3560 7078 6798 3673 -916 -5167 -7308 -6230 -1597 3246 6301 6953 4436 168 -5209 -7444
2725 -7444 -5895 -2193 2204 5761 7084 5067 151 -4235 -6667 -6436 -2875 1833 5558 7008 4993
2740 4993 719 -3824 -6706 -6510 -3310 1114 5183 7431 5584 1402 -3440 -6322 -6559 -4119 507
2755 507 5029 6954 5432 2023 -2370 -6282 -7048 -4276 251 4473 6294 6124 2705 -2021 -5933 -6737
2771 -6737 -4551 -795 4129 6492 6224 3064 -1321 -5109 -6874 -5329 -833 3589 6346 6410 3562 -689
$$ packed form
2664A673M458J511k139m485m956k903l5L181N010M389J890j544m013n341l598
2679f902m04L119M630M266K521o60m220n217l450n61K115M287N115K666q10l792
2695B703m417m122j674K311M527M916K635k95l070m941m229j603J617L934N268
2710C560L518k80l125m589m251k141J078M633M843L055O52k517m268n377k235
2725g444J549L702M397L557J323k017m916m386k432K31L561M708L725J450k015
2740D993m274m543k882J96L200M424M069K248j847m182m842k882k37K440M626
2755E07M522J925j522l409m393l912p66K772M527M222J821j70l419m726l912q04
2771f737K186L756M924K363k68l160m385l788j765J545M496M422K757O4k848m251
$$ plain form
2787 -689 -5082 -6822 -5201 -1682 2661 6022 6628 3867 -480 -4736 -6384 -5742 -2288 2364 5651 6041
2803 6041 4220 169 -4198 -6300 -5903 -2553 1740 5334 6766 4799 593 -3659 -6174 -5789 -3485
2818 -3485 1197 5327 6567 4799 1234 -2808 -5984 -6234 -3421 797 4550 6521 5545 1952 -2657
2833 -2657 -5662 -6204 -4014 -56 4237 6396 5281 2135 -2001 -5387 -6649 -4570 -260 3845 5980
2848 5980 5734 2788 -1361 -5206 -6243 -4579 -916 3187 5935 5741 3188 -1105 -4539 -6328 -5032
2863 -5032 -1506 3062 5781 6009 3645 -371 -4436 -6179 -4952 -1929 2144 5167 5990 3878 201
2878 201 -3714 -5894 -5461 -2353 1545 4878 6166 4035 453 -3292 -5865 -5615 -2826 1058 4838 6300
2894 6300 4694 1134 -2758 -5560 -5631 -3290 671 4423 6010 4980 1417 -2212 -5230 -5682 -3540 103
$$ packed form
2787f89m393j740J621L519M343L361O06k761m347m256j648O42L454M652L287L90
2803F041j821m051m367k102L97L350M293L594J432j967m206m252k515L85K304
2818c485M682M130J240j768l565m042l176k50K813M218L753J971r76l593m609
2833b657l005n42K190L958M293K159j115l146m136l386j262K079M310M105K135
2848E980k46k946m149l845j037J664L663M103K748j94k553m293l434j789J296
2863e032L526M568K719K28k364m016m065j743J227L023M073L023Q23k112l677
2878B01l915k180M33L108L898L333J288k131l582l745k573K50K789L884L780J462
2894F300j606l560l892k802p1K341L961L752J587j030l563l629l018m52K142L643
$$ plain form
2910 103 4004 6020 5171 2118 -2023 -5116 -5743 -3930 -334 3709 5757 5256 2263 -1559 -4678 -6086
2926 -6086 -4296 -531 3160 5531 5248 2811 -777 -4619 -5904 -4437 -1261 2562 5359 5696 3495
2941 3495 -547 -4088 -5799 -4938 -1719 2383 5267 5772 3737 160 -3710 -5524 -4819 -1971 1543 4827
2957 4827 5692 3859 371 -3060 -5444 -5091 -2674 1310 4590 5609 4106 714 -2918 -5191 -5209 -2856
2973 -2856 681 4052 5579 4605 1435 -2502 -4946 -5316 -3237 219 3924 5490 4806 1622 -1827 -4759
2989 -4759 -5717 -3753 -92 3235 5035 4811 2078 -1486 -4458 -5572 -3596 -540 2952 5422 5109 2639
3005 2639 -1158 -3952 -5487 -4370 -1073 2618 5091 5387 3109 -759 -4125 -5337 -4323 -1469 2039
3020 2039 4619 5230 3479 -168 -3390 -5108 -4365 -1900 1706 4580 5056 3436 445 -3160 -4788 -4939
$$ packed form
2910A03L901K016q49l053m141l093o27J813L596M043K048n01k993l822l119j408
2926f086J790L765L691K371k83k437l588l842j285J467L176L823K797L37k201
2941C495m042l541j711Q61L219M102K884N05k035l577l870j814P05K848L514L284
2957D827Q65j833l488l431k384L53K417L984L280J019j503l392l632k273j8K353
2973b856L537L371J527r74l170l937k444l70K079L456L705J566o84l184l449k932
2989d759r58J964L661L327J800k24k733l564k972j114J976L056L492K470l13k470
3005B639l797k794j535J117L297L691K473K96k278l868l366j212J014K854L508
3020B039K580O11j751l647l222j718P43K465L606K874M76j620k991l605j628j51
$$ plain form
3036 -4939 -2229 1473 4303 5477 3885 772 -2680 -4691 -5074 -2743 873 3912 5241 4085 1014
3051 1014 -2117 -4474 -5147 -2848 388 3503 5082 4158 1478 -1959 -4661 -5001 -3065 40 3287 5055
3067 5055 4469 1853 -1375 -4363 -5141 -3762 -654 2758 4973 4650 2307 -1131 -3850 -5087 -4153 -863
3083 -863 2399 4489 4628 2846 -690 -3547 -4969 -4163 -1229 2106 4507 4870 2975 -154 -3406 -5006
3099 -5006 -4272 -1751 1733 4194 4933 3370 188 -2831 -4768 -4539 -2273 1237 3774 4816 3361 497
3115 497 -2485 -4702 -4505 -2835 780 3696 4942 3800 1276 -2046 -4326 -4835 -2811 583 3305 4692
3131 4692 3977 1480 -1696 -4283 -4764 -3190 72 3250 4797 4125 1836 -1255 -3896 -4814 -3085 -298
3147 -298 2682 4488 4106 2282 -1123 -3531 -4510 -3450 -942 2293 4383 4406 2315 -577 -3241 -4696
$$ packed form
3036d939K710L702K830J174j592l113l452k011l83K331L616L039J329j156l071
3051A014l131k357o73K299L236L115J579r24k680l437k702l40J936L105L247J768
3067E055n86k616l228k988p78J379L108L412K215l23k343l438k719j237R34L290
3083h63L262K090J39j782l536k857j422Q06K934L335K401L63j895l129l252j600
3099e006P34K521L484K461P39j563l182l019j937K29K266L510K537J042j455k864
3115D97k982k217J97J670L615K916J246j142k524l322k280n09K024L394K722J387
3131D692p15k497l176k587m81J574L262L178J547o72k289l091k641r18J729K787
3147b98K980J806l82j824l405k408r79J060K508L235K090K3k091k892k664j455
$$ plain form
3163 -4696 -3660 -981 2097 4069 4359 2870 -131 -3147 -4637 -3870 -1600 1482 4266 4437 2953 334
3179 334 -2655 -4458 -4089 -1845 1361 3669 4318 3320 789 -2305 -4189 -4081 -2217 721 3497 4714
3195 4714 3654 997 -2051 -4189 -4271 -2699 382 3199 4505 3626 1201 -1898 -3902 -4493 -2713 -35
3211 -35 2833 4559 3738 1719 -1172 -3509 -4254 -3202 -456 2690 4174 4025 1939 -1029 -3381 -4565
3227 -4565 -3352 -691 2020 4071 4086 1969 -628 -3081 -4389 -3774 -1092 1845 3803 4044 2622 60
3243 60 -2784 -4381 -3787 -1353 1379 3306 4198 2886 232 -2845 -3985 -3574 -1807 1013 3542 4292
3259 4292 3041 664 -2312 -4110 -3805 -1817 864 3034 4170 3153 701 -1771 -3725 -3907 -2376
3274 -2376 369 2972 4229 3261 1159 -1434 -3630 -4078 -2667 77 2558 3901 3462 1531 -1254 -3561
$$ packed form
3163d696J036K679L078J972K90j489l001l016j490P67K270L082K784J71j484k619
3179C34k989j803L69K244L206K308O49r98k531l094j884J08J864K938K776J217
3195D714j060k657l048k138q2J572L081K817J306q79k425l099k004n91J780K678
3211c5K868J726q21k019k891k337p45J052K746L146J484j49k086k968k352j184
3227d565J213K661K711K051J5k117k597k453j308O15K682K937J958K41j422k562
3243F0k844j597N94K434K732J927Q92j312k654l077j140M11J767K820K529P50
3259D292j251k377k976j798L05J988K681K170J136j017k452k472j954j82J531
3274b376K745K603J257r68k102k593k196m48J411K744K481J343m39j931k785k307
$$ plain form
3290 -3561 -4181 -2891 -533 2288 3991 3780 1562 -896 -3024 -4008 -3123 -664 2158 3740 3589 1999
3306 1999 -476 -2873 -3924 -3062 -1126 1912 3745 3831 2187 -223 -2706 -4045 -3514 -1356 1200 3340
3322 3340 3802 2391 51 -2583 -3981 -3307 -1674 1012 3128 3938 2958 215 -2076 -3405 -3514 -1872
3338 -1872 842 3266 3764 2860 910 -1583 -3437 -3520 -2133 97 2755 3779 3361 1069 -1496 -3506
3354 -3506 -3502 -2130 -68 2577 3746 3252 1111 -1238 -3273 -3490 -2725 -302 2247 3760 3456 1631 -775
3371 -775 -3302 -3854 -2725 -540 1593 3259 3549 2165 -404 -2862 -3738 -3168 -1110 1451 3367 3577
3387 3577 2175 -218 -2616 -3585 -3187 -1088 1245 3287 3450 2462 174 -2317 -3741 -3451 -1514 871
3403 871 3042 3692 2536 320 -2213 -3225 -3498 -1500 575 2560 3604 3056 947 -1516 -3387 -3161
$$ packed form
3290c561o20J290K358K821J703k11k218k458k128r84Q85K459K822J582j51j590
3306A999k475k397j051Q62J936L038J833Q6j644k410k483j339N31K158K556K140
3322C340M62j411k340k634j398O74J633K686K116Q10r80k743k291j329j09J642
3338a872K714K424M98r04j950k493j854q3J387K230K658J024m18k292k565k010
3354c506MJ372K062K645J169m94k141k349k035k17P65K423K549J513l04j825k406
3371g75k527n52J129K185K133J666K90j384k569k458q76N70K058K561J916K10
3387C577j402k393k398r69L98K099K333K042J63r88k288k491j424K90J937K385
3403H71K171O50j156k216k533j012k73J998K075J985J044n48k109k463j871K26
$$ plain form
3419 -3161 -1951 428 2568 3537 2874 1095 -1377 -3213 -3429 -2217 106 2442 3547 3091 1141 -1111
3435 -1111 -2856 -3606 -2419 -90 2163 3365 2881 1506 -800 -2854 -3465 -2258 -552 1549 3357 3434
3451 3434 1720 -719 -2563 -3434 -2870 -580 1502 3121 3288 2028 -46 -2472 -3343 -2948 -972 1186
3467 1186 2899 3345 2412 244 -2217 -3321 -3075 -1353 1004 2579 3259 2447 332 -2033 -3127 -3229
3483 -3229 -1844 673 2587 3455 2800 533 -1460 -3019 -3250 -2061 440 2486 3221 2711 865 -1124
3499 -1124 -2868 -3507 -2178 -16 2114 3240 2785 1109 -1033 -2660 -3258 -2261 24 1651 2994 2913
3515 2913 1390 -529 -2589 -3228 -2475 -473 1518 3035 3007 1665 -751 -2386 -3197 -2670 -690 1249
3531 1249 2838 3111 1967 -214 -2084 -3263 -2611 -946 1520 2697 3047 1815 -5 -1957 -2938 -3044
$$ packed form
3419c161J210K379K140R69o63j779k472j836k16J212K323K336J105m56j950k252
3435a111j745p50J187K329K253J202m84j375k306k054o11J207J706K101J808P7
3451C434j714k439j844q71N64K290K082J619J67j260k074k426q71L95J976K158
3467A186J713M46r33k168k461j104K46J722K357J575O80q12k115k365j094j02
3483c229J385K517J914Q68o55k267j993j559k31J189K501K046P35n10j846j989
3499a124j744o39J329K162K130J126m55j676k142j627n98R97K285J627J343q1
3515B913j523j919k060o39P53K002J991J517k8j342k416j635q11N27J980J939
3531A249J589K73j144k181j870j179O52J665K466J177L50j232j820j952r81j06
$$ plain form
3547 -3044 -1199 857 2531 3056 2066 362 -1653 -2923 -2978 -1543 468 2579 3219 2426 522 -1451
3563 -1451 -2610 -3155 -1902 344 2119 3126 2434 857 -1276 -2780 -2893 -1855 137 2005 3074 2690
3579 2690 1211 -768 -2555 -3237 -2076 -141 1660 2919 2913 1124 -732 -2622 -3064 -2155 -580 1506
3595 1506 2849 2899 1781 -396 -2395 -3061 -2339 -766 1168 2790 2877 1578 -149 -2030 -3216 -2856 -1060
3612 -1060 1081 2560 3048 2075 22 -1778 -2938 -2558 -1324 619 2553 2765 2291 409 -1631 -2691
3628 -2691 -2511 -1218 487 2202 3175 2194 600 -1325 -2846 -2584 -1587 377 2213 2843 2145 1103 -1105
3645 -1105 -2669 -2887 -1742 251 1635 2928 2463 1230 -759 -2308 -2684 -1948 -191 1758 2589 2532 1207
3662 1207 -702 -2004 -2774 -2062 -566 1363 2770 2801 1406 -286 -1966 -2954 -2190 -839 1268 2530
$$ packed form
3547c044J845K056J674N25r90j704k015j270n5J435K011K111O40p93j904j973
3563a451j159n45J253K246J775J007o92j577k133j504j13J038J992J868J069l84
3579B690j479j979j787o82J161J935J801J259oj789j856j890m42R09J575K086
3595A506J343N0j118k177j999o66P22J573J934J622Q7j299j727j881j186L60J796
3612a060K141J479M88r73k053j800j160L80J234J943J934K12m74j882k040j060
3628b691J80J293J705J715R73r81j594j925j521K62R97J964J836O30o98j042k208
3645a105j564k18J145J993J384J293m65j233j989j549l76P36J757J949Q31n7j325
3662A207j909j302p70P12J496J929J407L1j395j692j680r88P64J351K107J262
$$ plain form
3678 2530 2509 1840 0 -1798 -2732 -2433 -907 1075 2432 2693 1845 169 -1621 -2732 -2241 -1277 648
3695 648 2102 2657 1854 330 -1462 -2583 -2457 -1325 257 2030 2615 2196 552 -1079 -2402 -2634 -1634
3712 -1634 284 1955 2850 2229 740 -1226 -2221 -2658 -1942 139 1775 2785 2386 1056 -1012 -2465
3728 -2465 -2619 -2024 -368 1651 2595 2433 1253 -418 -2080 -2840 -2062 -283 1247 2503 2337 1287 -470
3745 -470 -1929 -2768 -2182 -570 1210 2012 2549 1369 -207 -1678 -2413 -2448 -1014 1211 2214 2462 1805
3762 1805 -122 -1507 -2631 -1872 -863 474 2154 2569 1620 374 -1368 -2569 -2232 -969 492 1930
3778 1930 2416 1846 706 -1247 -2320 -2664 -1444 298 1893 2486 2142 819 -876 -2400 -2410 -1444 147
3795 147 1585 2442 2293 905 -850 -2004 -2341 -1958 -404 1416 2399 2367 1151 -494 -2217 -2673 -1818
$$ packed form
3678B530k1o69j840j798r34K99J526J982J357K61q48j676j790j111M91R64J925
3695F48J454N55q03j524j792j121J26J132J582J773N85m19j644j631j323k32J000
3712a634J918J671Q95o21j489j966r95m37P16K081J636J010l99j330k068j453
3728b465j54N95J656K019R44j62j180j671j662p60P78J779J530J256j66j050j757
3745d70j459q39N86J612J780Q02N37j180j576j471p35l5J434K225J003K48o57
3762A805j927j385j124P59J009J337J680M15r49j246j742j201L37J263J461J438
3778A930M86n70j140j953j073l44J220J742J595N93l44j323j695j524j0R66J591
3795A47J438Q57j49j388j755j154l37L83J554J820R83l2j216j645j723m56Q55
$$ plain form
3812 -1818 -266 1284 2223 2242 1454 -411 -1761 -2231 -2118 -672 1071 2256 2491 1232 -216 -1680 -2214
3829 -2214 -2227 -767 958 2046 2395 1604 130 -1569 -2446 -2220 -992 662 1807 2345 1759 220 -1390
3846 -1390 -2198 -2375 -1041 325 2035 2368 1863 466 -916 -2343 -2068 -1369 -76 1639 2230 2382 596
3863 596 -1006 -2051 -2320 -1425 -6 1649 2322 1987 947 -589 -2061 -2212 -1704 -156 1395 2377 2014
3880 2014 1051 -576 -1842 -2381 -1891 -510 1236 2129 1991 1194 -366 -1712 -2481 -1763 -554 1212 2114
3897 2114 2256 1345 -54 -1772 -2271 -1775 -752 857 1885 2101 1580 -198 -1170 -1990 -1985 -892 423 1757
3915 1757 2292 1587 323 -1208 -2223 -2020 -933 465 1587 2359 1963 419 -1002 -2064 -2285 -1295 31
3932 31 1695 2277 1867 676 -779 -2096 -2135 -1515 103 1366 2112 1839 799 -734 -1924 -2001 -1436 -93
$$ packed form
3812a818J552J550R39J9p88j865j350m70J13J446J743J185K35j259j448j464n34
3829b214j3J460J725J088L49p91j474j699q77K26J228J654J145N38n86j539j610
3846a390q08j77J334J366J710L33n05j397j382j427K75O99J293J715N91J52j786
3863E96j602j045k69Q95J419J655O73l35j040j536j472j51N08J548J551R82l63
3880B014r63j627j266n39M90J381J746Q93j38p97j560j346p69P18J209J766R02
3897B114J42r11j399j718m99M96J023J609J028K16n21j778r72q20NJ093J315J334
3915A757N35p05j264j531j015K03J087J398J122P72l96j544j421j062k21R90J326
3932C1J664N82m10j191j455j317l9O20J618J263P46k73j040j533j190p7N65J343
$$ plain form
3950 -93 1239 2060 2014 1055 -330 -1662 -2299 -1764 -396 1011 2143 2051 1243 -217 -1441 -2172 -1680 -679
3968 -679 814 1999 2458 899 -312 -1286 -2288 -1622 -960 826 1872 2084 1536 213 -1355 -2092 -1738
3985 -1738 -947 676 1891 2237 1830 212 -1242 -2007 -1863 -1123 270 1624 2298 1600 460 -745 -1866
4002 -1866 -2004 -1179 92 1635 2250 1766 662 -445 -1761 -2259 -1325 -149 1523 2162 1787 819 -557
4019 -557 -1633 -2088 -1409 -293 1088 1886 2175 1167 -393 -1647 -2103 -1527 -502 990 1923 2048 1263
4036 1263 -347 -1424 -1943 -1729 -544 680 1849 1884 1124 -2 -1570 -2104 -1788 -804 676 1504 1752
4053 1752 1351 198 -1481 -2019 -1943 -861 714 1576 2126 1635 139 -1005 -1822 -1837 -1073 113 1528 1989
4071 1989 1570 483 -1022 -1547 -2017 -1214 11 1324 1864 1595 504 -554 -1798 -1783 -1348 -137 1391
$$ packed form
3950i3J332Q21m6r59j385j332o37N35J368J407J132r2q08j460j224p31M92J001
3968f79J493J185M59j559j211r74j002O66O62J786J046K12n48j323j568p37L54
3985a738P91J623J215L46m07j618j454p65J44P40J393J354O74o98j140j205j121
4002a866j38Q25J271J543O15m84j104j107j316m98R34J176J672O39l75r68j376
4019e57j076m55O79J116J381P98K89j008j560j254m56N76J025J492R33J25p85
4036A263j610j077n19K14J185J224J169L5p60j126j568n34L16R84J480Q28K48
4053A752m01j153j679n38P6J082J575Q62N50m91j496j144q17j5P64J186J415M61
4071A989m19j087j505n25m70Q03J225J313N40k69j091j058j244J5M35J211J528
$$ plain form
4088 1391 2002 2131 838 -441 -1459 -1768 -1284 -294 1174 1667 1670 869 -676 -1456 -1953 -1418 -450 919
4106 919 1726 1784 1115 -113 -1515 -1826 -1653 -580 692 1672 1736 1162 37 -1233 -1938 -1580 -577 652
4124 652 1653 1789 1085 164 -1184 -1914 -1609 -688 380 1501 1957 1546 34 -1264 -1822 -1775 -964 425
$$ packed form
4088A391O11J29j293j279j018l09M84R90J468M93Lq01j545p80m97N35R68J369
4106I19Q07N8o69j228j402l11J73J073J272R80O4n74j125j270p05L58J003J229
4124F52J001J36p04r21j348p30L05R21J068J121M56m11j512j298n58M7Q11J389
$$ [...]
8191b48
##END NTUPLES=NMR FID
##END=
