##TITLE=1H_SR10_K2_2rd2O
 D2O, 8 sc, 
 2.9.2020
##JCAMPDX= 6.0         $$ Bruker NMR JCAMP-DX V2.0
##DATA TYPE= NMR FID
##DATA CLASS= NTUPLES
##ORIGIN= UXNMR, Bruker Analytische Messtechnik GmbH
##OWNER= root
$$ XWIN-NMR		Version 3.5
$$ Thu Sep  3 12:08:13 2020 Russian Standard Time (UT+4h)  she@DPX200
##.OBSERVE FREQUENCY= 200.1315066352
##.OBSERVE NUCLEUS= ^1H
##.DELAY= (6, 6)
##.ACQUISITION MODE= SIMULTANEOUS
##.ACQUISITION SCHEME= undefined
##.AVERAGES= 8
##.DIGITISER RES= 18
##SPECTROMETER/DATA SYSTEM= spect
##.PULSE SEQUENCE= zg30
##.SOLVENT NAME= D2O
##.SHIFT REFERENCE= (INTERNAL, D2O, 0, 15.7039)
##AUDIT TRAIL= $$ (NUMBER, WHEN, WHO, WHERE, WHAT)
$$ ##TITLE= Audit trail, XWIN-NMR		Version 3.5
$$ ##JCAMPDX= 5.01
$$ ##ORIGIN= Bruker BioSpin GmbH
$$ ##OWNER= she
$$ F:/spectra/data/she/nmr/H-F/1/audita.txt
$$ ##AUDIT TRAIL=  $$ (NUMBER, WHEN, WHO, WHERE, WHAT)
(   1,<2020-09-03 12:07:01.04 +0400>,<she>,<DPX200>,
      <created by zg, POWCHK disabled, PULCHK disabled
       configuration hash MD5:
       00 E9 B6 7A A2 85 ED C7 34 08 36 98 17 FE 4E 26
       data hash MD5: 16K
       71 D9 FE A3 35 E7 FE 13 CD 05 09 E8 F9 DB 96 EA>)
$$ ##END=
$$ 
$$ hash MD5
$$ 62 84 71 83 3E 46 B9 D8 B6 60 18 E7 56 8E B3 95
##$RELAX= 
##$RELAX= 
##$RELAX= 
##$RELAX= 
##$RELAX= 
##$RELAX= 
$$ Bruker specific parameters
$$ --------------------------
##$DU= <F:/spectra>
##$EXPNO= 1
##$NAME= <H-F>
##$PROCNO= 1
##$TYPE= <nmr>
##$USER= <she>
##$AMP= (0..31)
100 100 100 100 100 100 100 100 100 100 100 100 100 100 100 100 100 100 
100 100 100 100 100 100 100 100 100 100 100 100 100 100 
##$AQSEQ= 0
##$AQ_mod= 1
##$AUNM= <au_zg>
##$AUTOPOS= <>
##$BF1= 200.13
##$BF2= 200.13
##$BF3= 200.13
##$BF4= 200.13
##$BF5= 200.13
##$BF6= 200.13
##$BF7= 200.13
##$BF8= 200.13
##$BYTORDA= 1
##$CFDGTYP= 0
##$CFRGTYP= 5
##$CHEMSTR= <none>
##$CNST= (0..31)
1 1 145 1 1 1 1 1 1 1 1 1 1 1 1 1 1 1 1 1 1 1 1 1 1 1 1 1 1 1 1 1 
##$CPDPRG= <>
##$CPDPRG1= <>
##$CPDPRG2= <>
##$CPDPRG3= <>
##$CPDPRG4= <mlev>
##$CPDPRG5= <mlev>
##$CPDPRG6= <mlev>
##$CPDPRG7= <mlev>
##$CPDPRG8= <mlev>
##$CPDPRGB= <>
##$CPDPRGT= <>
##$D= (0..31)
0 1.2 0 0 0 0 0 0 0 0.06 0 0.03 0 0 0 0 0.0002 0 0 0 0 0 0 0 0 0 0 0 0 
0 0 0 
##$DATE= 1599120420
##$DBL= (0..7)
120 120 120 120 120 120 120 120 
##$DBP= (0..7)
150 150 150 150 150 150 150 150 
##$DBP07= 0
##$DBPNAM0= <>
##$DBPNAM1= <>
##$DBPNAM2= <>
##$DBPNAM3= <>
##$DBPNAM4= <>
##$DBPNAM5= <>
##$DBPNAM6= <>
##$DBPNAM7= <>
##$DBPOAL= (0..7)
0.5 0.5 0.5 0.5 0.5 0.5 0.5 0.5 
##$DBPOFFS= (0..7)
0 0 0 0 0 0 0 0 
##$DE= 6
##$DECBNUC= <off>
##$DECIM= 32
##$DECNUC= <off>
##$DECSTAT= 4
##$DIGMOD= 1
##$DIGTYP= 9
##$DL= (0..7)
0 120 120 120 120 120 120 120 
##$DP= (0..7)
150 150 150 150 150 150 150 150 
##$DP07= 0
##$DPNAME0= <>
##$DPNAME1= <>
##$DPNAME2= <>
##$DPNAME3= <>
##$DPNAME4= <>
##$DPNAME5= <>
##$DPNAME6= <>
##$DPNAME7= <>
##$DPOAL= (0..7)
0.5 0.5 0.5 0.5 0.5 0.5 0.5 0.5 
##$DPOFFS= (0..7)
0 0 0 0 0 0 0 0 
##$DQDMODE= 0
##$DR= 18
##$DS= 0
##$DSLIST= <SSSSSSSSSSSSSSS>
$$ [...]
##$SUBNAM2= <"">
##$SUBNAM3= <"">
##$SUBNAM4= <"">
##$SUBNAM5= <"">
##$SUBNAM6= <"">
##$SUBNAM7= <"">
##$SUBNAM8= <"">
##$SUBNAM9= <"">
##$SW= 16.880792210976
##$SWIBOX= (0..15)
0 0 2 0 0 0 0 0 0 0 0 0 0 0 0 0 
##$SW_h= 3378.37837837838
##$TD= 16384
##$TD0= 1
##$TE= 0
##$TE2= 300
##$TE3= 300
##$TEG= 300
##$TL= (0..7)
0 120 120 120 120 120 120 120 
##$TP= (0..7)
150 150 150 150 150 150 150 150 
##$TP07= 0
##$TPNAME0= <>
##$TPNAME1= <>
##$TPNAME2= <>
##$TPNAME3= <>
##$TPNAME4= <>
##$TPNAME5= <>
##$TPNAME6= <>
##$TPNAME7= <>
##$TPOAL= (0..7)
0.5 0.5 0.5 0.5 0.5 0.5 0.5 0.5 
##$TPOFFS= (0..7)
0 0 0 0 0 0 0 0 
##$TUNHIN= 0
##$TUNHOUT= 0
##$TUNXOUT= 0
##$USERA1= <user>
##$USERA2= <user>
##$USERA3= <user>
##$USERA4= <user>
##$USERA5= <user>
##$V9= 5
##$VALIST= <valist>
##$VCLIST= <CCCCCCCCCCCCCCC>
##$VD= 0
##$VDLIST= <DDDDDDDDDDDDDDD>
##$VPLIST= <PPPPPPPPPPPPPPP>
##$VTLIST= <TTTTTTTTTTTTTTT>
##$WBST= 1024
##$WBSW= 4
##$XGAIN= (0..3)
0 0 0 0 
##$XL= 0
##$YL= 0
##$YMAX_a= 20527
##$YMIN_a= -19688
##$ZGOPTNS= <>
##$ZL1= 120
##$ZL2= 120
##$ZL3= 120
##$ZL4= 120
##$ABSF1= 10
##$ABSF2= 0
##$ABSG= 5
##$ABSL= 3
##$ALPHA= 0
##$AQORDER= 0
##$ASSFAC= 0
##$ASSFACI= 0
##$ASSFACX= 0
##$ASSWID= 0
##$AUNMP= <proc_1d>
##$AZFE= 0.1
##$AZFW= 0.1
##$BCFW= 1
##$BC_mod= 2
##$BYTORDP= 1
##$COROFFS= 0
##$CY= 11.3945322036743
##$DATMOD= 1
##$DC= 2
##$DFILT= <>
##$DTYPP= 0
##$F1P= 16.9975609425685
##$F2P= -3.02152046262296
##$FCOR= 0.5
##$FTSIZE= 0
##$FT_mod= 4
##$GAMMA= 1
##$GB= 0.15
##$INTBC= 1
##$INTSCL= 1
##$ISEN= 128
##$LB= 0.24
##$LEV0= 0
##$LPBIN= 0
##$MAXI= 10000
##$MC2= 0
##$MEAN= 0
##$ME_mod= 0
##$MI= 1.114404
##$NCOEF= 0
##$NC_proc= 0
##$NLEV= 6
##$NOISF1= 3.799351
##$NOISF2= 2.8
##$NSP= 1
##$NTH_PI= 0
##$NZP= 0
##$OFFSET= 15.70392
##$PC= 1
##$PHC0= -10132.06
##$PHC1= 7.800904
##$PH_mod= 1
##$PKNL= yes
##$PPARMOD= 0
##$PSCAL= 0
##$PSIGN= 0
##$REVERSE= no
##$SF= 200.130013532006
##$SI= 16384
##$SIGF1= 3
##$SIGF2= 2
##$SINO= 400
##$SIOLD= 16384
##$SREGLST= <1H.CDCl3>
##$SSB= 0
##$STSI= 0
##$STSR= 0
##$SW_p= 3612.71676300578
##$SYMM= 0
##$S_DEV= 0
##$TDeff= 0
##$TDoff= 0
##$TI= <>
##$TILT= no
##$TM1= 0
##$TM2= 0
##$TOPLEV= 0
##$USERP1= <user>
##$USERP2= <user>
##$USERP3= <user>
##$USERP4= <user>
##$USERP5= <user>
##$WDW= 1
##$XDIM= 8192
##$YMAX_p= 0
##$YMIN_p= 0
$$ End of Bruker specific parameters
$$ ---------------------------------
##NTUPLES= NMR FID
##VAR_NAME=  TIME,          FID/REAL,        FID/IMAG
##SYMBOL=    X,             R,               I
##VAR_TYPE=  INDEPENDENT,   DEPENDENT,       DEPENDENT
##VAR_FORM=  AFFN,          ASDF,            ASDF
##VAR_DIM=   8192,          8192,            8192
##UNITS=     SECONDS,       ARBITRARY UNITS, ARBITRARY UNITS
##FACTOR=    0.000296,      1,               1
##FIRST=     0,             0,               0
##LAST=      2.424536,      0,               0
##MIN=       0,             -19688,          0
##MAX=       2.424536,      20527,           0
$$ Real data points
##PAGE= N=1
##DATA TABLE= (X++(R..R)), XYDATA
$$ [...]
839f81j582P57K090J750o55k532j393O59K366J386p21j956j894Q17K424J352n70
$$ -681 -2263 -1506 584 2334 1679 -853 -2246 -1587 779 2165 1444 -512 -2406 -1589 835 2187 1617
856A617k406j383P50J948J833p20k430j356O23K311J363p26j951j760P06K350
$$ 1617 -789 -2172 -1422 526 2359 1639 -791 -2147 -1524 787 2150 1424 -527 -2287 -1581 769
872G69J366o81k175j407P18K019J508n65k288j436Q02K100J439p15k110j369N18
$$ 769 2135 1454 -721 -2128 -1410 609 2117 1552 -736 -2172 -1370 730 2169 1454 -656 -2025 -1507
889a507K206J547r30j961j425N82K286J164m52k078j679J002J950J293n15k224
$$ -1507 699 2246 1316 -645 -2070 -1488 798 1962 1510 -568 -2247 -1245 705 1998 1483 -741
905g41j192N40K021J577r14k006j253N07K201J256o70j794j702Q50K130J053m33
$$ -741 -1933 -1393 628 2205 1291 -715 -1968 -1461 740 1996 1326 -468 -2170 -1320 810 1863 1430
922A430k097j387P99J793J490o15k186j084N66J859J538q79j769j420N07K239
$$ 1430 -667 -2054 -1255 538 2028 1413 -773 -1857 -1291 568 2106 1227 -542 -1962 -1455 784
938G84J145p48j698j549P68K031J075l96k187j298R60J647J416o49k026j028M62
$$ 784 1929 1181 -517 -2066 -1298 733 1808 1412 -775 -2073 -1113 534 1950 1301 -725 -1753 -1291
955a291J875J438r17j704j213M05K182J012n03j788j592R64J738J126k89k230
$$ -1291 584 2022 1105 -599 -1812 -1407 775 1787 1284 -504 -2096 -1132 606 1732 1443 -787
971g87j061P49J554J478p47j915r23L32J960J212p76j559j358N99J887J010l51
$$ -787 -1848 -1099 455 1933 1186 -729 -1652 -1320 640 1852 1076 -483 -1841 -1242 645 1655 1304
988A304j916j279P72J663J228m56k125q90O18J548J458q95j741q73L25J880J166
$$ 1304 -612 -1891 -1119 544 1772 1316 -809 -1699 -1081 467 1925 1030 -711 -1584 -1259 621 1787
1005A787r02j302j341O07J861P98k30j785j376R23J406J312n21k004p70L59J713
$$ 1787 885 -417 -1758 -1151 710 1508 1278 -507 -1883 -960 446 1758 1237 -767 -1537 -1178 535
1022E35J389r03j607j051M80J921Q14n89j489j208O12J692R18l45j767j123P25
$$ 535 1924 1021 -586 -1637 -1157 764 1578 989 -500 -1708 -1096 596 1514 1169 -598 -1721 -996
1039i96J361J252l79j919q65M67J548J281q64j330j165M08J986P90o43j341j302
$$ -996 365 1617 1238 -681 -1546 -1079 469 1750 886 -444 -1609 -1201 785 1575 932 -409 -1711
1056a711Q40J394Q72k08j836q87O26J326J252o50j583q74K20J713J148p24j481
$$ -1711 -871 523 1395 1187 -649 -1536 -910 416 1668 1018 -565 -1439 -1219 494 1642 918 -563
1073e63j028N75J705P54m17j476j178P30J511Q07l81j621q06M63J243J315o56
$$ -563 -1591 -1016 689 1443 1026 -450 -1628 -898 613 1420 1039 -582 -1388 -925 318 1633 977
1090I77j571p64L08J580R80n46j339j267O26J674P17l89j538r94O68J333J035
$$ 977 -594 -1358 -1050 530 1510 964 -375 -1642 -1016 658 1375 986 -552 -1546 -878 455 1490
1107A490n27j598p44M82J331R92n02j363r56L99J530R53o48j272r86M92J368R40
$$ 1490 963 -635 -1379 -897 434 1426 924 -439 -1395 -996 534 1487 839 -433 -1419 -927 441 1381
1125A381l44j577j012Q11J229R31m05j567p43K89J547R34o96j239q83M06J449
$$ 1381 1037 -540 -1552 -741 488 1419 1014 -553 -1296 -1007 540 1474 778 -461 -1344 -938 511
1142E11Q01l06j510r66O68J274Q64m12j391r45N07J409Q71m97j398q07N61J188
$$ 511 1312 1006 -504 -1470 -802 472 1336 924 -467 -1412 -905 504 1375 878 -520 -1327 -766 422
1160D22R38m42j400q57M72J439O51l79j242j026N76J343Q30m16j496o82N51J108
$$ 422 1360 918 -482 -1339 -867 572 1223 844 -398 -1424 -848 495 1325 909 -587 -1269 -718 390
1178C90R77m44j410q35M37J416P25m45j233r20N53J238Q68m31j429p46N64J166
$$ 390 1367 923 -487 -1322 -885 531 1256 811 -422 -1342 -789 449 1317 886 -543 -1289 -725 441
1196D41Q45m57j214r43N52J229P80m06j295q04M63J233Q87n05j319o67L90J223
$$ 441 1286 829 -385 -1328 -776 453 1233 827 -468 -1272 -809 424 1311 806 -513 -1180 -790 433
1214D33P14l47j230q83O02J173Q04m61j283o88L54J244Q28m77j208q44N32J201
$$ 433 1147 800 -430 -1313 -711 462 1266 805 -478 -1166 -812 432 1260 783 -425 -1269 -737 464
1232D64O89l18j280p66M72J164Q52n94j097p47L67J208P94l94j262p94N68J115
$$ 464 1153 835 -445 -1211 -739 425 1277 683 -414 -1161 -794 414 1208 814 -448 -1242 -674 441
1250D41P47m11j207p18L64J265P36n51j055p98N05J123O91l35j279o88M51J091
$$ 441 1188 777 -430 -1148 -784 481 1217 666 -389 -1187 -682 441 1132 797 -482 -1170 -719 372
1268C72Q63n38j138p05L83J222O42l93j092p70N07J019P48l67j224o26M18J087
$$ 372 1235 697 -441 -1146 -763 459 1101 708 -384 -1154 -647 372 1120 753 -471 -1097 -679 408
1286D08P27m81r95q16M66J140O93l98j206n80L29J119P30m81r78p94M04J216N51
$$ 408 1135 654 -341 -1157 -691 449 1142 744 -462 -1042 -713 406 1136 655 -323 -1117 -713 503 1054
1305A054l26j099p32M81R94P24l69j186o16L75J111O58m72r47p53M42J092O13
$$ 1054 728 -371 -1103 -622 372 1096 727 -459 -1075 -700 411 1069 597 -350 -1103 -661 431 1044
1323A044l29j120o80M53J000P34m69j031o27M25J061N94l22j169o07L73J046O80
$$ 1044 715 -405 -1085 -632 368 1102 633 -398 -1025 -600 461 1055 733 -436 -1043 -670 376 1056
1341A056m44j006o15L49J065O02l83r88o56L95J040N68k60j094n95L49R36P34
$$ 1056 612 -394 -1009 -660 405 1007 624 -364 -1020 -625 415 983 723 -371 -966 -617 319 1053
1359A053m48r92n68K82J070O40l91r28p07L30J036O34l70j013o10M85Q74O26l64
$$ 1053 605 -387 -955 -673 397 1037 646 -282 -989 -659 377 1011 641 -372 -982 -497 377 1003 639
1378F39j028n61M01Q70P27n02r43m91K22J015O28m13q17p53L94J019N07k12j054
$$ 639 -389 -950 -549 321 1048 546 -397 -888 -666 349 977 564 -253 -1006 -612 407 914 702 -352
1397c52o60M25R58N96m03r96m97L68Q90P22n30q25n66K39J051M53k73q72p19L59
$$ -352 -1012 -587 371 967 564 -432 -929 -561 329 1051 521 -304 -870 -631 420 873 600 -272 -991 -632
1417f32R90N31k08j029n97M33Q37O69l14j118m18K81R74N72n21p89n12K49R97
$$ -632 358 889 681 -348 -945 -512 325 994 680 -438 -856 -575 399 971 450 -339 -851 -602 395
1436C95M75k99p96p39M98P30N99j62j079n50L91P83Q03m53j040m05K91R24N96
$$ 395 870 571 -225 -964 -466 264 863 701 -378 -928 -537 246 1049 596 -444 -849 -558 366 962
1455I62n16p42n99L75R45L38j58r15o36M43P58N72j44j047m34K54P86P60m35r38
$$ 962 446 -296 -895 -520 425 763 605 -310 -946 -503 255 827 683 -364 -798 -544 242 1002 567 -371
1475c71m94K15J013N59m77p59o09M44Q97L69k89q27n35M24O62N75j94r46m27K04
$$ -371 -865 -650 363 922 445 -314 -923 -479 418 787 498 -329 -864 -440 222 797 603 -343 -770 -566
1495e66Q48O85m78q18n22K61J009M55l68p76o30M55Q15L74j97r72m31M53O63N55
$$ -566 282 967 489 -329 -851 -590 419 874 506 -270 -900 -445 370 744 547 -425 -856 -403 260 815
1515H15k47q81l84J85Q01O25n03o69n40K32R64L75k98p45o50M87Q21L73k64q68
$$ 815 568 -313 -697 -512 289 914 411 -258 -798 -566 398 773 475 -270 -920 -433 388 761 497 -371
1535c71m24L86O75N92l54p71m09J38P94N44l11o69n87K27R22L61k31p93n75M58
$$ -371 -795 -409 266 858 504 -267 -676 -538 256 800 489 -180 -767 -540 382 743 512 -281 -856 -398
1555c98P03N07k48r17l80K91P04N43l69p28l89J62Q11M48l03o10o23L39P61M11
$$ -398 305 812 564 -353 -733 -442 262 805 436 -292 -681 -519 292 740 437 -173 -796 -457 304 715
1575G15j70q55m80L73O90N10k91q48l31J81P79N37l66p12m57K41Q24M13l25o28
$$ 715 545 -310 -790 -417 273 783 492 -356 -687 -506 273 810 444 -268 -725 -484 340 753 428 -200
1595b00n37K45P77M08k16p14m81K68P06M98k45q34l74K38O86N51m01o67m11K62
$$ -200 -737 -492 285 693 477 -237 -718 -450 256 754 509 -325 -699 -461 225 776 375 -292 -703 -441
1615d41P74L78l21o14n29M14N83M94k19q51l47K30O85N03l18o95n10L43P04M27
$$ -441 333 711 390 -224 -753 -339 244 738 519 -332 -679 -449 236 739 421 -274 -784 -441 263 690
1635F90k88p57l56L02O50M44k34p01m17K82O55M40l09o93m14L31O43M18k10p26
$$ 690 402 -355 -711 -409 241 685 451 -250 -667 -385 270 710 401 -292 -706 -375 268 686 476 -250
1655b50l64J75O76M68l22n86m93K65P42L40k49o78m06K63O58M44k73o36m09K30
$$ -250 -614 -439 237 705 383 -203 -696 -431 311 651 402 -276 -682 -419 239 683 410 -226 -635 -405
1675d05O32M02k35n97m25K24O37L90j99p16l44K22O36M68l20n68m36K43O19L98
$$ -405 227 629 394 -203 -628 -404 233 623 424 -292 -636 -414 222 690 370 -198 -634 -391 228 626
1695F26k02o32m35K58N99M32k71o11l81J43P26L43j65o59m47K81O01M05j98o85
$$ 626 424 -208 -643 -385 214 646 375 -236 -617 -474 252 595 430 -229 -676 -395 206 611 413 -272
1715b72l78K29O35L99k23o46l35J80O33M05k25o46l85K42O43L63k32o16l91K20
$$ -272 -650 -421 214 613 390 -256 -591 -411 222 627 402 -244 -629 -387 256 619 387 -229 -620 -400
1735d00N98L76j93n92m17K82N53M55k71o25l72K56N40M39l26n04l94K08O12L63
$$ -400 198 574 381 -211 -628 -346 207 662 391 -234 -606 -350 190 629 303 -201 -595 -387 225 588
1755E88k05n67m29K40N67M04j99o60l07J87N79M10k26n77l62K39N47L16k02n34
$$ 588 383 -184 -613 -373 194 598 399 -261 -568 -381 198 608 382 -195 -557 -318 229 545 343 -191
1775a91l63J95N64L32k31n32l64K41N32M01j99n73l77L01M35M14k53n46l30K03
$$ -191 -554 -359 205 537 306 -226 -590 -349 183 584 385 -188 -565 -264 171 585 332 -214 -544 -341
1795c41N42L16j70n53m16K96N68K95j90n53l09J25N95L65k22m89l79J85N41K75
$$ -341 201 517 347 -206 -622 -326 242 537 347 -206 -515 -390 205 570 348 -141 -520 -335 206 481
1815D81j74m90l24J19N86L65k00m97l91J77O12K54k01m99l38J99M91L61k05n39
$$ 481 307 -183 -507 -388 198 563 363 -134 -525 -348 264 518 317 -182 -520 -321 170 531 326 -213
1835b13l07J83N07L78k41m44l43J25N56K82r1n53l77K58M46L35j10o04l44K96
$$ -213 -520 -337 170 548 307 -137 -480 -355 201 483 392 -161 -538 -280 166 501 391 -213 -557 -261
1855b61L89M34k82m85k58J30M76L64k02m95l35J80N17K90j27n09l40K50M37L56
$$ -261 128 562 280 -205 -463 -333 143 507 305 -190 -525 -345 172 462 335 -174 -514 -264 173 529
1875E29j77n35l15J63M35M19k47m81k56J58N33K36k47l71l59K62M76J93p0n16
$$ 529 352 -183 -498 -335 100 519 272 -209 -465 -307 226 462 215 -156 -515 -253 223 416 346 -170
1895a70k94K14M12L52j76m80k84R1M98L68k79l72l55J39N20K04j25m14l36K49
$$ -170 -464 -250 162 514 338 -142 -426 -335 163 531 252 -120 -475 -336 184 388 263 -151 -487 -238
1915b38L97K62p4m85k79K05L00M52k15m53l18J69M75K94k21m14k73J49N11J68
$$ -238 159 421 347 -138 -417 -212 88 540 325 -128 -446 -277 198 492 271 -143 -416 -267 244 412
1935D12j05m99k94K95M08K02j10m90k55J60M13L47k07m27k23L4N04L09k31l69
$$ 412 307 -192 -486 -191 217 419 309 -181 -436 -276 137 484 277 -150 -373 -339 165 474 243 -126
1955a26l53J78N12K10j49m40l42K95L87K34j17n08j50J10L92L12j99m07k80K01
$$ -126 -479 -301 211 421 272 -168 -510 -215 172 406 289 -219 -369 -259 133 445 246 -161 -441 -240
1975b40L67K91j37m13l38K19M45K43j53m75k12J57L29K99j49m54k07J50M10K59
$$ -240 127 418 281 -132 -470 -251 194 437 284 -191 -403 -246 83 382 233 -221 -428 -278 132 391
1995C91j88l25k69R9M63J83q2l52l66K35L82K11n1n17k37K09L37L05j65m48j42
$$ 391 203 -122 -391 -292 171 354 272 -80 -446 -211 171 382 331 -186 -423 -214 123 428 263 -185 -327
2016c27Q2L99K69j92l81k05J44M00J91j75l59k47K00L28K71j55m17j75J76K99
$$ -327 -245 154 423 231 -150 -355 -211 189 380 205 -154 -401 -201 127 398 243 -174 -349 -173 126
2036A26K59j41m57j41J17L61K58j62l07l13J57L76J82r5l74k12J50L33K59r3l76
$$ 126 385 244 -213 -354 -237 124 382 220 -87 -400 -243 133 315 220 -154 -366 -216 117 376 283 -93
2057i3k03J06L05K93j52l75k15J22L16K30j38k40k98J13L81K01j15m07j71J29
$$ -93 -296 -190 115 408 256 -119 -334 -212 104 334 196 -44 -342 -229 152 353 238 -169 -340 -211
2077b11L83J87j37l74j46N0L34K34j08l43j96R6L50K28j56k83l06J95L31K38j58
$$ -211 172 359 222 -152 -298 -248 86 320 212 -131 -327 -231 119 347 191 -92 -398 -203 128 366 208
2098B08l18k37J30L67J81j39l75j38Q4L72K04j52l48j57N8L76K08q9l52k28J32
$$ 208 -110 -347 -217 150 331 192 -183 -321 -237 135 339 187 -161 -318 -260 116 324 235 -117 -345 -213
2119b13L99J36j00l19k14J28K84K34j35l13k40P0L52K18p6l34k56K35K74J91j22
$$ -213 186 322 222 -97 -311 -183 101 335 200 -113 -353 -283 69 287 211 -123 -379 -144 130 321 199
2140A99l32r8L8L35K31j58k95j95N6L52J90r9l57j84Q2L65K22k01k50k30J34L05
$$ 199 -133 -231 -193 142 373 215 -80 -275 -219 133 323 224 -133 -317 -235 130 352 151 -99 -329 -195 110
2162A10K36q3l99j48M5L29K91j71l23j62J06L15J59p8l66j82J38K97J79j04l05
$$ 110 346 263 -136 -284 -239 90 381 210 -113 -275 -169 146 305 227 -139 -321 -183 114 293 189 -116
2183a16k06J37K94K17j83k53k40J62K81J71n8l26j86J58K84J89j46k87j43P3K74
$$ -116 -322 -185 109 326 143 -110 -350 -188 93 264 206 -120 -306 -148 136 325 179 -108 -251 -178 96
2204I6K03j20k32k33J04L20J82q9l51j42J36K69K08j68k75j78R7K61J38n3k90
$$ 96 299 179 -53 -286 -182 138 320 231 -120 -262 -126 143 351 183 -92 -270 -173 88 226 173 -117
2225a17j56P4L71J34j49k65j24Q9K54J83j03k58k46J41K85J38r4k72j93J42K67
$$ -117 -273 -199 172 306 157 -108 -232 -143 111 294 191 -67 -313 -172 113 251 157 -115 -308 -166 101
2246A01J47n8l08j51J40K59J36m3l28j92J52K11K27j12k53k32P1L80J23q0l55
$$ 101 248 190 -118 -269 -129 130 266 223 -105 -297 -145 66 293 181 -72 -304 -233 147 270 190 -165
2267a65o4L4K77K06j05l10j06O2K68K04j51k84j27P7K81J94j46k19j71O2L61J13
$$ -165 -229 -195 82 288 183 -127 -233 -171 97 301 150 -134 -261 -184 97 291 145 -74 -245 -183 178 291
2289B91j52k56p5P0K51J41q5k58j59J24K69Q3p9l09j02J26K43J49j27k43j23P2
$$ 291 139 -117 -192 -122 129 270 185 -73 -232 -108 161 244 165 -144 -246 -120 123 272 145 -98 -221 -149
2311a49K49J45j54j54k07J30K34K01j32k53k04J91J90J91j14k76j55J57J99K11
$$ -149 100 245 91 -63 -270 -140 94 295 163 -90 -294 -103 87 278 164 -112 -267 -110 89 300
2331C00j67k23j52K8L08J78j62k00k20J85K42J00m8k30j79J33K03J89j64k26q5
$$ 300 133 -90 -242 -214 94 272 110 -90 -310 -125 117 217 169 -61 -240 -107 96 285 121 -105 -190
2352a90N1K45J48j63j74j35Q7K58Q2j06j45k02J17K18O6L0k71j18N3K25J92j37
$$ -190 -139 106 254 91 -83 -218 -131 127 209 103 -42 -244 -127 91 157 187 -84 -202 -149 76 268 131
2374A31k12j23O1K37J64j15k21j80J04K69P9n8j81j84O1K67J08q7k43q2Q7J58
$$ 131 -81 -204 -143 94 258 143 -78 -258 -154 115 194 136 -45 -229 -168 99 207 120 -123 -205 -118 40
2396D0K02j51k17n8O4K10J76j54k08j74J78K25J13j32k10j45J02K36J28o5k70
$$ 40 242 91 -126 -184 -120 90 266 112 -96 -270 -92 133 246 114 -96 -241 -139 97 225 160 -110
2417a10j15J26J66J52q3k93k4P0J56J74r4k19j40R6K53J09q5j88j90J42J86J75
$$ -110 -225 -99 67 219 136 -157 -181 -111 45 219 125 -94 -234 -138 115 224 139 -49 -239 -97 89 264
2439B64j54j97r3J4J97K04j04k62m9N8K54N3r5j35j58N8K36N7m6j91r8J08J84
$$ 264 110 -87 -180 -166 31 235 131 -131 -180 -122 132 185 90 -45 -203 -145 91 148 102 -89 -187 -79 105
2462A05J05j25j99r3J04K03J14j66j02j64R8K45N2j16j53j36J27K02O6m7k57o1
$$ 105 210 85 -114 -207 -103 100 214 48 -54 -218 -120 125 177 61 -92 -228 -101 101 167 120 -137 -198
2484a98J13J48J44j39j41j43J26J86J42j19j93j17L6K35R3j17j46j04P2K30R1
$$ -198 -85 63 207 68 -73 -216 -90 96 238 119 -74 -191 -155 80 173 56 -90 -194 -122 108 199
2505A99m6k01j25P6J98J08p7j89j35M4K38K6k0j95n7N2K15J24j26j48j07O5J16
$$ 199 153 -48 -173 -97 101 209 132 -57 -192 -148 90 116 96 -99 -156 -104 111 235 109 -39 -146 -81 35
2528C5J47l7k36l0J3J89J07j40j65l2O1J79O7l7k48l8O3J68J27j52j40l1P1J13
$$ 35 182 145 -91 -121 -108 81 188 48 -117 -149 -88 91 158 121 -127 -165 -102 66 193 41 -99 -130 -59 54
2552E4R7m1j47j43J02J26J17n4k30n8R1J88N0n1j99j37J71J11J10l4k03n9J8J81
$$ 54 151 110 -37 -180 -78 48 165 111 -119 -177 -86 102 152 101 -98 -235 -64 47 157 123 -80 -139 -121 60
2576F0J66j24j61j22J37J38O0n3j41j27O7J10J54o8j08j42Q0J99k5l8j37p0M8
$$ 60 226 102 -59 -181 -44 94 154 101 -40 -167 -100 10 164 96 -12 -154 -74 125 100 62 -75 -145 -97
2599i7J49Q6k0j75j05O1J85M8r6j21j02J17J92j4l8j45l4N4J15Q5n1j16j20P3
$$ -97 52 138 118 -57 -162 -101 84 132 36 -85 -187 -70 122 108 70 -75 -109 -55 60 145 94 -22 -142 -69
2623f9J47L4m0j78k4N4J83P7j77p4o2K2J95O7p0j73j00R6J50J01m7j58j38J22
$$ -69 78 112 72 -106 -130 -76 107 184 7 -67 -129 -107 88 155 85 -88 -188 -92 58 159 112 -46 -184 -62
2647f2J07R1q0j34o5O4J15P6q7r1p7P2J66L8n8j22n5N2J29L6m5j42n0Q9J34K1
$$ -62 45 136 56 -78 -143 -79 36 112 25 -66 -143 -71 95 133 75 -47 -102 -50 79 115 70 -72 -122 -33 101 122
2673A22m0j46q7J30R4J03o8j86RO3O3Q5o6j32r1M5J29J62j31j40n5N2K09k6o2
$$ 122 82 -64 -151 -21 73 176 108 -78 -69 -6 57 142 76 -56 -147 -102 27 189 58 -82 -137 -85 124 98 36
2698C6j09n4O7J11Q9j28j00l5J00Q2O0o7j31%J9J10J19q7j40n4L3J51N2p8j42
$$ 36 -73 -127 -60 51 140 12 -88 -123 -23 59 119 52 -79 -79 -60 50 169 82 -58 -112 -79 72 124 46 -96
2723i6l7J14N1J34j20j39o2J04J59j1l6j40l8MJ87M9p1r2k9L0J14L9l5j64l0Q3
$$ -96 -133 -19 32 166 46 -93 -155 -51 108 97 61 -79 -117 -113 74 123 52 -40 -69 -39 75 114 79 -85 -115 -32
2749c2J00N4j20j10L5L3Q7J11j05j34k0JJ59P9n9j22p8R0N1O3o9m3j09J05R7N1
$$ -32 68 122 2 -108 -73 -40 47 158 53 -81 -101 -100 59 138 79 -43 -121 -31 20 83 14 -29 -138 -33 64 115
2775A15l7r7n1lR9O5n5j06p0R4N8L5k3q0p0J14J14l4J3j37m9R5Q1K9l6j01p6J04
$$ 115 78 -19 -70 -73 26 91 36 -70 -140 -46 12 47 24 -56 -126 -12 102 68 81 -56 -105 -10 71 100 64 -37 -113 -9
2803iP4J8m9n8m6L5J13K1n6j35m2R1Q2P4l5j31pK2J14L0n5j27J7OJ35L4j7j50
$$ -9 65 83 34 -24 -70 -35 78 99 43 -92 -134 -43 39 113 78 -53 -60 -38 76 106 51 -76 -59 -53 82 116 99 -51
2831e1o1J07L7Q3o9j19J4M6P6L5n6j03k3J17j6M1l9p4pJ3J48%q6q2m1N0J07N0
$$ -51 -112 -5 32 115 46 -73 -59 -13 63 98 42 -61 -84 33 17 58 19 -55 -62 -49 99 99 13 -69 -110 -60 47 97
2859I7n9l5k9K7J7O4l7n3j22J16jP9l3j20J4RQ2N9p8j0p5M4J48k0j20j0n8J06
$$ 97 38 3 -26 1 18 82 45 -8 -130 -14 -15 64 31 -89 -75 -66 16 75 -3 -13 -88 -44 104 84 -36 -46 -104 2
2887BL9K2k7r9j3L3J25K9p3p4o2P3P7P3p0q6o0K2J01L6k6r6o3L9Q2P3m1j20k5
$$ 2 41 63 36 -63 -76 -43 82 111 38 -36 -98 -25 52 125 55 -31 -91 -69 32 68 42 -54 -117 -78 4 77 36 -84 -109
2916a09M6J20Ro9k7o2O8Q0Km1p7l3N7J22j3m8j45L0Q5N2O4q6o0RJ8M2Kk9k6m6
$$ -109 -63 57 66 -3 -30 -92 -24 56 58 17 -60 -93 -36 86 73 25 -120 -90 -5 47 111 25 -35 -26 -8 34 36 7 -19 -65
2946f5MR0K2o8M2p6M5O5k0l2k7o4J61j7k8m0Jm4O4PN3p8k7m4L1Q2Rk1n5l1M2J08
$$ -65 -61 29 51 -17 25 -51 -6 59 39 7 -20 -84 77 60 32 -8 -7 -51 13 20 73 -5 -32 -76 -45 37 46 25 -30 -61 -19 89
2978H9m5m8k7l5L0O3K0k1j22J9L6O6N5r0n6pOR6K0j3o6PJ3J4N4l2n7k0L5N1M6
$$ 89 44 -4 -31 -66 -36 27 47 26 -96 -77 -41 25 80 -10 -66 -73 -67 29 49 36 -30 -23 -10 4 58 26 -31 -51 -16 35 81
3009H1o8Kl1K3O8o6M2m5q6J35lMo2k1nJ0P1L5m4n1j1o7R9M0l1q0L2K4O0Lo6kK
$$ 81 13 15 -16 7 75 9 51 6 -80 55 52 56 -6 -27 -32 -22 49 84 40 -11 -22 -89 10 50 19 -61 -29 -5 55 58 -8 -10 -8
3042hj8O5K1l9o9N0rO1j1n4q8J8N0O0L0n8m7OK8K5K2j1m4m9O2K0K1o6J8o5O0K0
$$ -8 -26 39 60 21 -48 2 -7 54 43 -11 -99 -81 -31 29 59 1 -46 -40 -12 13 35 24 -20 -69 -7 13 34 -32 -14 -79 -19 1
3074APm8j9l0L2R5K3l0r2pJ05k8O0o4k7J2m4O5J3m8j5m2L9J03L8j07J2o4O9M4
$$ 1 8 -40 -59 -89 -57 38 61 31 -61 -68 37 9 69 5 -22 -10 -54 11 24 -24 -39 -81 -42 61 99 -8 4 -60 9 53
3104E3n6k8rJ9OK6K7pj39K5L7P2lk3m9j3L9Q3l5Qq1n4O8L7J3j0j6m0L4M7j2l0
$$ 53 -3 -31 -40 -21 -15 11 38 31 -108 -83 -46 26 23 0 -49 -62 -23 60 25 33 -48 -102 -34 3 16 6 -10 -50 -16 31 19 -11
3136a1m3pQP5k2j1k0L2L1m0M7p1N3n8rN8L1q1L2k4K0QL5Mq2L4j3N1k5No1M1K1
$$ -11 -54 -61 -53 22 0 -11 -31 1 32 -8 39 -32 21 -37 -46 12 43 -38 -6 -30 -10 -2 33 37 -45 -11 -24 27 2 7 -54 -13 8
3169HM2Rl6o8k1K8R7j9j0n3l8J3J11l2j8J6m3K7L0m8K5n5j1QJ4K9m8j1PN4L4j
$$ 8 50 59 23 -45 -66 -38 59 40 30 -23 -61 -48 63 31 13 29 -14 13 43 -5 20 -35 -46 -38 -24 5 -43 -54 -47 7 41 40
3201D0l6mMj3J1M5m8k3J1O1m2L6Rj18O1J3K2n5J3K9n7R1j9j7K1m4J4k3L7n1M4
$$ 40 4 0 4 -9 2 47 -1 -24 -13 48 6 42 51 -67 -6 7 29 -26 -13 16 -41 50 31 14 35 -9 5 -18 19 -32 12
3232A2o5J6K5K6L5o5m4M2L8K8j4k9m0j1N8ON8r9M5m8L9M0m3L6p4Om3Q0J0n4K6
$$ 12 -53 -37 -12 14 49 -16 -60 -18 20 48 34 5 -35 -46 12 18 76 -23 22 -26 13 53 10 46 -28 -22 -65 15 25 -29 -3
3263cJ1Kk1M4Op4l1O6M4k0kk5j3j0M1N6m8p4M0lmJ0Lm2N4J1J4Oo1oj9L7J2O0n9
$$ -3 8 10 -11 33 39 -35 -66 0 44 24 22 -3 -16 -26 15 71 23 -51 -11 -14 -18 -8 -5 -47 7 18 32 38 -23 -29 -48 -11 1 61 2
3298Bk5L8j6qQ2j10MO4M0p6N0p3J9OKK0k5kL4o9qO2k6J6l4L1K4l5M5o9K3J0n5
$$ 2 -23 15 -1 -9 73 -37 -33 31 71 -5 45 -28 -9 -3 -1 19 -6 -8 26 -43 -51 11 -15 1 -33 -2 22 -13 32 -37 -14 -4 -59
3331e9N0M7No6l3P3K7q7PR2q7P4n6J0Qq0J01k3K3k7k6k7O6J3l3M7m9n0J5M8K8
$$ -59 -9 38 43 -23 -56 17 44 -43 -36 56 -31 43 -13 -3 5 -75 26 3 26 -1 -27 -54 12 25 -8 39 -10 -60 -45 3 31
3362C1M7o8J0q7L2N4n2K7J8o1M5M7o2L5omMrK3mn0P3k3J1l2qj6Rj7K8LJ0k6NM0
$$ 31 78 10 20 -67 -35 19 -33 -6 12 -49 -4 43 -19 16 10 6 10 1 24 20 -30 43 20 31 -1 -9 -25 -16 -33 -5 -2 8 -18 -13 27
3397B7K5l4m1QO1l7j8O6n6n3M5N4k0j8j8J1mL2j0Lqk5J7n1nO0pJl7K6M1j5p0M5
$$ 27 52 18 -23 -15 46 9 -9 57 1 -52 -7 47 27 9 -9 2 -2 30 20 23 15 -10 7 -44 -49 11 4 5 -32 -6 35 20 -50 -5
3431ej0jK2J0l4k0L9M1pj3L0l9roj0Rj2J2Ok6J5j0K8J1Kj3j9M2o1j8O5J1j3K6
$$ -5 -15 -16 6 16 -18 -38 1 42 35 22 52 13 4 -2 -12 -3 -15 -3 3 -23 -8 -18 10 21 23 10 -9 33 -28 -46 19 30 17 43
3465D3o7j1Lk6N6j6l2M6K5j9km2P5l8j5OJ3rj1kJ1J2L1j3n8N1J6j8J1k7J9l0%
$$ 43 -24 -35 -32 -58 -2 -18 -50 -4 21 2 0 -42 33 -5 -20 -14 -1 -10 -21 -23 -12 0 31 18 -40 11 27 9 20 -7 12 -18 -18
3498a8O3q8Q0m6rJ1J0Kk0n0M7kq%O0m1K1N5n4jK7q4O2k6LN9m1lK5j9jK1p2oL8
$$ -18 45 -43 37 -9 -18 -7 3 5 -15 -65 -18 -20 -28 -28 32 -9 12 67 13 12 39 -45 17 -9 -6 53 12 9 34 15 14 35 -37 -43 -5
3533em9P1k2J3l1J1K4j9j7Nm8Q1J7kK3k2J8l8J6k5MK4l5PL0LJo9K8jN9ln5k4K5
$$ -5 -54 17 -5 8 -23 -12 12 -7 -24 -19 -67 14 31 29 52 30 48 10 26 1 5 29 -6 1 31 34 35 -34 -6 -7 52 49 -6 -30 -5
3568erL0m5LPK6j8J7J7nm5K4pj2J5l2%j1P1Rj3k2Oj2MN7k1Nj6l8L6l6Q1p3L5n0
$$ -5 -14 16 -29 -26 -19 7 -11 6 23 18 -27 -3 -10 -22 -7 -39 -39 -50 21 30 17 -5 1 -11 -7 50 29 34 18 -20 16 -20 61 -12 23 -27
3604b7rK2M2Jp7LO7O8p4lk3JJ7pJ3j7Nm3RM1j3J3n3RoN5j2Plj2J0lP0l4k0ql0
$$ -27 -36 -14 28 29 -48 -45 22 90 16 13 -10 -9 8 1 14 -3 2 -41 -32 9 -4 9 -44 -35 -41 14 2 9 6 -6 4 1 71 37 17 9 -21
3641b1N7Pp4K1m8O9j6M2qk6M2n8LN5o2L1j5oRk6M1o8k8R1K6K6m9j3l8J1JN1Nj6
$$ -21 36 43 -31 -10 -58 11 -5 37 29 3 45 -13 -10 45 -17 14 -1 -7 2 -24 17 -51 -79 12 38 64 15 2 -36 -25 -24 27 32 16
3675A6J0Ml3J2lL0n8O2L7o5Pl2k1j6P5m0N1o6K9MP6p7J3j1M5kqkOl4n3L4PJ4m1
$$ 16 26 30 -3 9 6 36 -22 40 77 12 19 -13 -34 -50 25 -15 36 -30 -1 3 79 2 15 4 49 47 39 37 43 9 -44 -10 -3 11 -30
3710c0N5k8m9O5L7l7k3k3J0jJ2J8l9L0K4L0o2K7k3o7O0L1J0n9kRJ2L7K8r8P2l7
$$ -30 25 -3 -52 13 50 13 -10 -33 -23 -24 -12 6 -33 -3 21 51 -11 16 -7 -74 -14 17 27 -32 -34 -25 -13 24 52 -46 26 -11
3742a1lL3J1j2p5O9JN9m2l9l8J5M8k1O2m9k6qOM8j8j5j5KL6m4Q4m2l5pRK8L3j1
$$ -11 -14 19 30 18 -57 12 13 72 30 -9 -47 -32 16 -5 57 8 -18 -26 -20 28 10 -5 -20 -18 18 -26 58 16 -19 -26 -17 11 44 33
3776C3m7m5O1l2J5L8l8J7J3k1P4q2nk5J7N3l2j6L0j0J9J5o6J4j4L7omK8l4MK8
$$ 33 -14 -59 2 -30 -15 23 -15 2 15 -6 68 -14 -19 -44 -27 26 -6 -22 8 -2 17 32 -34 -20 -34 3 -3 -7 21 -13 -9 19
3808A9k3k6N8m4K6k6LK6K7k3j1rJ9mk6N9p8qK9L5L0l6m1Rj7J04q2K3k4J1j8O2
$$ 19 -4 -30 28 -16 10 -16 -13 13 40 17 6 -3 16 12 -14 45 -33 -41 -12 23 53 17 -24 -15 -32 72 -10 13 -11 0 -18 44
3840D4k3po8K5N3k3Q8q3m6qP3qpJk2j0P8p9L5m2PnP1l7p5J15l7kJ0kJ4k1l0Or
$$ 44 21 14 -54 -29 24 1 89 6 -40 -48 25 17 10 11 -11 -21 57 -22 13 -29 -22 -27 44 7 -68 47 10 8 18 16 30 9 -21 -15 -24
3875b4J1oL6o2k1O3K8J6j6o1J9K7%K0L1j02K3jO5m1l2K3J8Qk9qK5n6O0j1j8J4
$$ -24 -13 -19 17 -45 -66 -3 25 41 25 -36 -17 10 10 30 61 -41 -18 -19 46 5 -27 -4 14 22 -7 -15 10 -46 14 3 -15 -1
3907ampl8O6K3J4Lp6m1P7K5k8J3m4j9J9O5qNo7JM9pPjOj15P9L5J9q3N1rk8NL1
$$ -1 -5 -12 -50 16 39 53 56 -20 -61 16 41 13 26 -18 -37 -18 47 39 44 -23 -22 27 20 27 26 32 -83 -4 31 50 -33 18 9 -19 -14 17
3943A7j2l8J6J3M0n7O4r8K6mL3j1K3L3m0Lj7L5n6Mj3L3K1l7M6l4j2j6N8J6k3J5
$$ 17 5 -33 -17 -4 36 -21 43 -55 -29 -33 0 -11 12 45 5 8 -9 26 -30 -26 -39 -6 15 -22 24 -10 -22 -38 20 36 13 28
3975B8l3l0K5K5o0K8PJ8K7nm4L9m7K5n4P6L2m9q6J05nKm1M9j0m1ML0k1J2n8M8
$$ 28 -5 -35 -10 15 -45 -17 -10 8 35 30 -14 25 -22 3 -51 25 57 8 -78 27 22 24 -17 32 22 -19 -15 15 -6 6 -52 -4
4007dNj0%K6Kn5O8j1J4k8o1N7K8N6m8m6j3rP6oq3J9oK8m0J05m1r1J04n3O6k3j2
$$ -4 1 -9 -9 17 19 -36 32 21 35 7 -54 3 31 87 39 -7 -20 -29 47 41 -42 -23 -29 -1 -41 64 23 -68 36 -17 49 26 14
4040A4m2M0l5R8o6l0K1m3J3O3l6jJ0m8O5l9%k0L9J9q2Q2J3l0m3N2L6m1Oj3Qm2
$$ 14 -28 12 -23 75 9 -21 0 -43 -30 33 -3 -4 6 -42 23 -16 -16 -36 3 22 -60 22 35 5 -38 14 50 9 15 2 10 -32
4072c2N9k4NO9j12k3O9N4r2K8j0k6J3K4j7LJ1j9M1JK6l7mo7J01k6p5Q7k7k6L3
$$ -32 27 3 8 77 -35 -58 11 65 -27 1 -9 -35 -22 2 -15 -12 -1 -20 21 22 48 11 7 -60 41 15 -60 27 0 -26 7
4103Gj9L9J6n2k6K5J1P4m7n5N8m2j0Q4j20O9m1O0o2K1L3m2QK4J9jm8%k1lO3j2
$$ 7 -12 27 43 -9 -35 -10 1 75 28 -27 31 -11 -21 63 -57 12 -29 31 -31 -10 23 -19 -11 13 32 31 -17 -17 -38 -41 22 10
4135A0N1m2Qm0O6l5l6QMj4N8no6P0o2L3nj3j3J8j6K6L5m3N9o9LrJ6K4K0n7RlM5
$$ 10 61 19 27 -13 53 18 -18 -10 -6 -20 38 33 -33 37 -25 8 3 -10 -23 -5 -21 5 40 -3 56 -13 -10 -19 -3 21 41 -16 -7 -10 35
4170C5pm9J0k6P9n2K3k7m1pP7Lm1K4Pj8M5K5k5l4p6N2L9Mj3J2l7Jj4N6k8p1K0
$$ 35 28 -21 -11 -37 42 -10 13 -14 -55 -62 15 18 -23 1 8 -10 35 60 35 1 -75 -23 16 20 7 19 -18 -17 -31 25 -3 -74 -54
4203e4j7Q5nL9o3k0K9K8O6n5lj8k1ML0Rl5n0P3k6L0m8N5p0M7M1j0k2Kr5Q3K9m3
$$ -54 -71 14 9 48 -15 -35 -6 22 88 33 30 12 -9 -5 25 34 -1 -51 22 -4 26 -22 33 -37 10 51 41 19 21 -74 9 38 -5
4236eMj6j3j0N5J0o3K6plN5nm2J6m5M9j5O6o1L4o1k9J08p7K6K8l5l2O3O2p1n0
$$ -5 -1 -17 -30 -40 15 25 -38 -12 -19 -22 33 28 -14 2 -43 6 -9 57 -4 30 -31 -60 48 -29 -3 25 -10 -42 21 83 12 -38
4268c8l6L3K4P8j4o9K7l8N4Pjm9l4R3m0N1lp4rK9R8n5j6k7k1L2mK5M4m9n5O5m8
$$ -38 -74 -41 -17 61 47 -22 5 -33 21 28 27 -22 -56 37 -3 48 45 -29 -38 -9 89 34 18 -9 -30 2 -2 23 67 18 -37 28 -20
4301b0L8J5p2M9j6JK3%j1m6J2M8kPqpj1j3K9m4m4N3L9k1K3Ol0l1J4J5N1m6On0
$$ -20 18 33 -39 10 -6 -5 18 18 7 -39 -27 21 19 26 18 11 0 -13 16 -28 -72 -19 20 -1 22 28 -2 -33 -19 -4 47 1 7 -43
4335d3J5O2j7lj0o4L3L3R2j37M0K8K3k2K8n8l1K6l0M0L7k5l0k3oQP3m0j2k0K5
$$ -43 -28 34 17 14 4 -60 -27 6 98 -39 1 29 52 30 58 0 -31 -5 -35 5 42 17 -13 -36 -42 -34 39 -1 -13 -33 -8
4366hP1l7J8m3rl5K3M8jK2j09J8M0k3L2m2nJ3L4L1m7J8m8M7l9R7m3m1k4J8L7L4
$$ -8 63 26 44 1 -8 -43 -20 28 27 49 -60 -42 -2 -25 7 -35 -40 -27 7 38 -9 9 -39 8 -31 66 23 -18 -42 -24 13 47
4398D7m3j9m3L7O5l3Qj7q2N0J6M4mrm0n6R2N0l7m1K5MLj9K5n4O6n8M7Rj7l8m8
$$ 47 4 -15 -58 -21 44 11 19 2 -80 -30 -14 30 26 17 -23 -79 13 63 26 -15 10 14 17 -2 23 -31 35 -23 24 33 16 -22 -70
4431g0kQ8K3N1q6k3K6j2M3j9l7oQk7R3m0n0M2m6N5KM4p7j2LN3kom1m8J01J0K4
$$ -70 -72 16 39 90 4 -19 7 -5 38 19 -18 -24 -16 -43 50 10 -40 2 -44 11 13 57 -20 -32 -29 24 22 16 -25 -73 28 38 62
4464F2l8l8K9m3L8j4J6mj3K1m2N1k1K3q0J2M7L9Jo8qK1J3M3ko2J9N9o8K9K9n6
$$ 62 24 -14 15 -28 10 -4 12 8 -5 16 -26 25 4 27 -53 -41 6 45 46 -22 -30 -9 4 47 45 -17 2 61 -7 22 51 -5
4496en4N8J7pK3m3l0K2j0O8m3j5j7M8K8k3Rj2m9l4M3O3o8%QJ0M0k7N2m5l5k0K3
$$ -5 -59 -1 16 9 32 -11 -41 -19 -29 39 -4 -19 -36 12 40 17 26 14 -35 -69 -26 37 -31 -31 -23 -13 27 0 52 7 -28 -48 -25
4529b5P9Kp0m9M1N2L9o6j9K4p4Q2Q%k4J5l0NL9m8k7L0kMO9n3l1K1J7J4N3k7q4
$$ -25 54 56 -14 -63 -22 30 69 3 -16 8 -66 16 24 24 0 15 -15 -10 29 -19 -46 -16 -18 -14 55 2 -29 -8 9 23 76 49 -35
4562c5K1N2j9J0K5n3n2K8N0L7l7r3L9L0kJL0n4N1k3j5M1l4J3o7L1N9rrk4l4j4
$$ -35 -14 38 19 29 54 1 -51 -23 27 64 27 -66 -27 3 1 2 32 -22 29 6 -9 32 -2 11 -56 -25 34 25 16 -8 -42 -56
4594e6R9j6j6m5J9k8N8M1lo7K1k6L7L7m4N4q3l0O6k1PJ6j6n7M9L1ppm1QN1M8q1
$$ -56 43 27 11 -34 -15 -43 15 56 53 -14 7 -19 18 55 11 65 -18 -48 18 -3 4 20 4 -53 -4 27 20 13 -28 -20 31 79 -2
4627bLL3k6J2J5j9m2J7n5M8M6J1o0Jl6N1OO7q8o0M8j9RQ1j06J8lM7J8k3J1m4M5
$$ -2 1 34 8 20 35 16 -26 -9 -64 -16 30 41 -19 -18 -54 -3 3 70 -18 -78 -30 -49 -40 41 -65 -47 -50 -3 15 -8 3 -41 4
4660Dj1J5k7K6l1k3LM9M7j17M0N2k7N0J6q4Kj6K5M7l8KMKl8M5l0j0j1L5K8j1q
$$ 4 -7 8 -19 7 -24 -47 -44 5 52 -65 -25 27 0 50 66 -18 -16 -32 -7 40 2 4 8 10 -28 17 -13 -23 -34 1 29 18 10
4693A0j2l9L6P8n7j3K0m0l0M3K5j0Mk0rM5j9L0m5k6M6K1j1Oo0N2m9O6j4P5j09
$$ 10 -2 -41 -5 73 16 3 23 -17 -47 -4 21 11 15 -5 -14 31 12 42 -3 -29 17 38 27 33 -27 25 -24 42 28 103 -6
4724fj2J4L0J1q3L4j8M8J6m0Nk9%j2M5Mj4M1m7L7K4o1OL7p9K7Kk1Q6m5N0q4R0
$$ -6 -18 -4 26 37 -46 -12 -30 18 34 -6 -1 -30 -30 -42 3 7 -7 34 -13 24 48 -13 -7 30 -49 -22 -20 -41 45 0 50 -34 56
4757E6o1nK6p3j3L9O0j4m7lk0P3M9k2o0M3n2K3K9l7l1L2J7n1O6Rj2Mo2O1L0m6
$$ 56 -5 -10 16 -57 -70 -31 29 15 -32 -35 -55 18 67 45 -15 28 -24 -1 28 -9 -40 -8 9 -42 24 33 21 25 -37 24 54 8
4789Hj4%m8L2L0L7m7j0RP9np0K4o1O3Qj2Kj0m3J7M2L4l0m9p2Q2l7P0kq2O9k8K5
$$ 8 -6 -6 -54 -22 8 45 -2 -12 -3 76 71 1 25 -36 27 35 23 25 15 -28 -11 31 65 35 -14 -86 -4 -41 29 27 -55 14 -14 11
4823A1J6M8q2k8M9j2nPm8K9k8JR7k3q7M1K9j7J0OJ2%q6P9O5o5q4P3l5K6rkk3l7
$$ 11 27 75 -7 -35 14 2 -3 4 -44 -15 -43 -42 55 32 -55 -14 15 -2 8 14 26 26 -60 19 84 19 -65 8 -27 -1 -10 -12 -35 -72
4857g2O1qM4j8j2m7M2J8K3q3P2q9kJ02K4n8J2p0Q5J6l4Ok0k7j1K2M8k7Qo8M1N8
$$ -72 -11 -19 25 7 -5 -52 -10 8 31 -52 20 -69 -71 31 55 -3 9 -61 24 40 6 12 -8 -35 -46 -24 24 -3 5 -63 -22 36
4889C6K0o3l3k6L7L8L5Jq4J7K6N6o5K3j2n0J9K9K1j7l4j9Q6m1P3mr8KoJ1N4j07
$$ 36 56 -7 -40 -66 -29 9 44 45 -39 -22 4 60 -5 18 6 -44 -25 4 25 8 -26 -45 41 0 73 69 -29 -27 -33 -22 32 -75
4921g5N9J1%jk7K1pjk2P1Oqn2j6OR5l8J3o8NN9l8O6q0KPo5O2O4j8r8K6K0L7L7
$$ -75 -16 -5 -5 -6 -33 -12 -19 -20 -42 29 35 27 -25 -41 -35 60 22 35 -33 -28 31 -7 59 -21 -19 -12 -77 -15 49 31 -67 -41 -21 16 53
4956E3l6m1k0M5k6L9n8J4M5l3L8rJ1J1n2j5K9K4k3n0j6L7M0M1l2m7J9l1R8n2q
$$ 53 17 -24 -44 1 -25 14 -44 -30 15 -18 20 11 22 33 -19 -34 -5 19 -4 -54 -70 -33 7 48 16 -31 -12 -43 55 3 -5
4987eK4n6J7J6K9n7N6m9j6R7On7mm1K1L3j8K0ok1J3%L4l2k6j3L6j2M2m2l6OO1
$$ -5 19 -37 -20 -4 25 -32 24 -25 -41 56 62 5 1 -40 -19 14 -4 16 10 -11 2 2 36 4 -22 -35 1 -11 31 -11 -47 -41 20
5020B0J4k8J7m0LL0K4Pr5L8JpNP1k1n3p3R3l1P4q5K8L5j8j5P2j02J4j9K7N3k4
$$ 20 34 6 23 -17 -14 16 40 47 -48 -10 -9 -16 -11 60 39 -14 -87 6 -25 49 -36 -8 27 9 -6 66 -36 -22 -41 -14 39 15
5052A5J7n1l4K6Q5k6np3%O0J5pRl6l2M0noL5r7Q3m5N1N7j27OL3kK4j1L8p3K6P4
$$ 15 32 -19 -53 -27 58 32 27 -46 -46 14 29 22 31 -5 -37 3 -2 -8 27 -70 13 -32 19 76 -51 -45 -12 -14 10 -1 37 -36 -10 64
5086F4o3Kk4K4o7J6M6Rl9K1l0K2Q9m3kq3N0M2k1Nl7jj5K8K2k0P6r2L5p3O4J8m5
$$ 64 1 3 -21 3 -64 -48 -2 7 -32 -11 -41 -19 70 27 25 -58 -8 34 13 18 -19 -20 -35 -7 15 -5 71 -21 14 -59 5 23 -22
5119b2k3K9m4O8Onm5J3JN1pl3J0l0RK0J9j4m8K0N1NJ0m6k7J4M4k5K4j1J9p5L4
$$ -22 -45 -16 -60 8 14 9 -36 -23 -22 29 22 -11 -1 -31 -22 -2 17 3 -45 -25 26 31 41 -5 -32 -18 26 1 25 14 33 -42 -8
5152hM9k5K6o0%L8KJ1rm5QmL9k6qj0kj7N9j1On8QL3J9ln4N4k6QJ8k7L0k3J6l7
$$ -8 41 16 42 -18 -18 20 22 33 24 -21 -13 -17 22 -4 -12 -22 -24 -41 18 7 13 -45 -37 -4 15 12 -42 12 -14 -6 12 -15 15 -8 8 -29
5188b9l2J10n4J1j8l4P1K7n6j8J4N4k5M1K2q8oK1k4L9pm3QM8p3P7m5L1p6L6L6
$$ -29 -61 49 -5 6 -12 -46 25 52 -4 -22 -8 46 21 62 84 -4 -10 11 -13 26 19 -24 -16 32 -41 36 -9 22 -54 -18 18
5219A8L1K2q0k5M0j7K5j2K3n2L3LM0k8n8K7n4R5kn1J5loQ0m4Qn6J0mN9m2l4j3
$$ 18 49 71 -9 -34 6 -11 14 2 25 -27 6 9 49 21 -37 -10 -64 31 29 -22 -7 -10 -16 64 20 28 -28 -18 -22 37 -5 -39 -52
5252e2L0n3J17J4k3Np1J6J9M1k1k9j7k4Q5qJm9pL3rL2j8m5N1j9NQr0N2k6jN8K8
$$ -52 -22 -75 42 56 33 38 -33 -17 2 43 22 -7 -24 -48 37 29 30 -19 -26 7 -2 30 12 -33 18 -1 4 12 -78 -26 -52 -53 5 33
5286C3l4m9qN6MM0J3n3%qL2K7k0l5Nj7rO6p3J4OL9j0Kn4J0RJ3j6M3q0mK1L4J6
$$ 33 -1 -50 -58 -2 2 42 55 2 2 -6 26 53 33 -2 3 -14 -23 43 -30 -16 -10 29 19 21 -33 -23 -14 -1 -17 26 -54 -58 -37 -3 13
5321A3pnqk5L2K3NKo9lL8N5J3r5J0L1o8L2M7Lq0L2J2L9NL3j08oL0K7N4p9J8k3
$$ 13 6 1 -7 -32 0 23 28 30 -39 -42 -4 51 64 -31 -21 10 -58 -26 21 24 -56 -24 -12 27 32 65 -43 -49 -19 8 62 -17 1 -22
5355b2O3n7K3l3j0N1M1m0PmMp6M8O9q4Q1j00L2lR9j24R6m6l3k3O8j1k6j5jL6k5
$$ -22 41 -16 7 -26 -36 15 56 16 23 19 23 -53 -5 64 -20 61 -39 -7 -10 89 -35 61 15 -18 -41 27 16 -10 -25 -26 10 -15
5387a5M4mn9j5L3M6m3JK9m4qJ4O1o5J5m1jP3O6p3m3o7N6R2n3pl9K0LN1n1L9l6
$$ -15 29 25 -34 -49 -16 30 -13 -12 17 -27 -35 -21 40 -25 -10 -51 -52 21 87 14 -29 -96 -40 52 -1 -8 -47 -27 -24 27 -24 15 -21
5420b1l7M9L5j2l1J8k1K7N0rl6J4q8O0OK7k6Qn4O9m9J5J0J1k3k7M2k2K1kmk9M8
$$ -21 -58 -9 26 14 -17 1 -20 7 57 48 12 26 -62 -2 4 31 5 13 -41 28 -21 -6 4 15 -8 -35 7 -15 6 4 0 -29 19
5453A9N4r0JK6L6j1q6N1k7K4q2R6M5k2m2k0J3M2n1J8J2Ok1M8l2k0pj8J07ok6m2
$$ 19 73 -17 -16 10 46 35 -51 0 -27 -3 -85 11 56 34 -8 -28 -15 27 -24 -6 6 12 -9 39 7 -13 -20 -38 69 63 37 -5
5485enj3N4oMo5J7%L1k0J2lNl3M9j5O2q7K8m1L5L0rk1k2P7m9K4l8K5o4j0N9N2
$$ -5 -10 -23 31 25 29 -36 -19 -19 12 -8 4 1 6 -27 22 7 69 -18 10 -31 4 34 25 4 -18 59 10 34 -4 21 -43 -53 6 58
5519E8q2N9nq5L5pO7l2m3J7j2Q1p1M3m5J5j4K1K0k1pj5M0JM3n8l0K9qLpk3L2o0
$$ 58 -24 35 30 -55 -20 -27 40 8 -35 -18 -30 51 -20 23 -22 -7 -21 0 20 -1 -8 -23 17 18 61 3 -27 2 -6 -3 -10 -33 -1 -61
5553f1Q4ko0P0rm7PN2l7k2j7M0oM2j4q3M5j6K8J7j6LKl9J02n1L5k2j04M5J5L8
$$ -61 23 21 -39 31 22 -25 -18 34 -3 -25 -42 -2 -8 34 20 -63 -18 -34 -6 11 -5 -2 0 -39 63 12 47 25 -79 -34 -19 19
5585A9oml3J8kN7l6j2k4nJ7K3k7Llj0l2N8OKJ6l0J2j2M1n8o8P4J0M6Mk7k0Rk9
$$ 19 13 9 -24 -6 -8 49 13 1 -23 -28 -11 12 -15 -12 -15 -25 -57 1 7 9 25 -5 7 -5 36 -22 -90 -16 -6 40 44 17 -3 6 -23
5620b3O9m3Klk7J5L5k2N5q5K4j5M4j1mk8J9J1K8L2j24M3k1J4L2LJ7qp6M3M0n3
$$ -23 46 3 5 2 -25 -10 25 3 58 -27 -3 -18 26 15 11 -17 2 13 41 73 -51 -8 -29 -15 17 20 37 29 -47 -4 36 -17
5652a7R6o3kk1J8K6n0k7qK1K2qM5n0k1N4K0j7p1K8m5K0L4J9Kl0M0l4L7j5J1k4
$$ -17 79 16 14 -7 11 37 -13 -40 -48 -27 -5 -13 32 -18 -39 15 35 18 -53 -25 -70 -50 -16 3 5 -25 15 -19 18 3 14 -10
5684a0l0O1K5Pm2o8P3k4pP3j2q0M3jL3j1m7j4J1M3J5L8p1j7L3m2J0K2oRq0J14
$$ -10 -40 21 46 53 11 -57 16 -8 -15 58 46 -34 9 8 41 30 -17 -31 -20 23 38 76 5 -12 21 -21 -11 11 5 14 -66 48
5716D8m8N0o7k9k3L4J05o1Q9j04QpP6l5p1J8K5NK2Mn1oO5m9k0QN2n6J0L6NJ1m5
$$ 48 0 50 -17 -46 -69 -35 70 9 98 -6 2 -5 71 36 -35 -17 8 13 35 39 -12 -18 47 -2 -22 -14 38 -18 -8 28 33 44 -1
5749aL5l8QJ9m7L7Nn1R4p4NL9n8KK2KJ0qk0oR4n3J5k9L1l5oK6Jj4m7L6M7p2J6
$$ -1 34 -4 4 23 -24 13 18 -33 61 -13 -8 31 -27 -25 -3 -1 9 1 -19 -25 69 16 31 2 33 -2 -8 18 19 5 -42 -6 41 -31 -15
5784a5R0o4j5mL1l7K9k9M5k7L6k2q3N6j2J5M4q7Q4L6o1L2Nl0l4j2OL1M1j2l1l9
$$ -15 75 11 -4 -8 23 -14 15 -14 31 4 40 18 -65 -9 -21 -6 38 -49 35 71 10 42 47 17 -17 -29 -23 8 49 37 6 -33
5816c3K6K9M7n6p4N8L4Rj6k8J3j6j3J2J3N5j8m3l3P5k5j6J7j5J7k9M5j6l5MJ0
$$ -33 -7 22 69 13 -61 -3 31 40 24 -4 9 -7 -20 -8 5 60 42 -1 -34 41 16 0 17 2 19 -10 35 19 -16 -12 -2
5847bJ5m0M8Mn9K1M4k8L6p1j3K4J3L3J8k5J5m2M9J9n0K4m1qK7opKk8j1L4J8L7
$$ -2 13 -27 21 25 -34 -13 31 3 39 -32 -45 -21 -8 25 43 18 33 -9 40 59 9 33 -8 -16 11 5 -2 0 -28 -39 -5 13 50
5880E0q7M2Jk7K7Nk6j9K9L6J7r0K8k3J6J8KQmn1M9n5M6N4m5K7m7J1K3n9P1r5N8
$$ 50 -37 5 6 -21 6 11 -15 -34 -5 31 48 -42 -14 -37 -21 -3 -1 7 3 -48 1 -54 -8 46 1 28 -19 -8 15 -44 27 -68 -10
5913a0rO3k8k3l1lK7%kJ4%j8J8P2l9o3L8k5K1oJ3k7J1Qj0m5J19o8nk4L0M1ko2
$$ -10 -19 44 16 -7 -38 -41 -14 -14 -16 -2 -2 -20 -2 70 31 -32 6 -19 2 -4 9 -18 -7 1 -9 -54 65 -3 -8 -32 -2 39 37 -25
5947b5L0j4L5Ro3%L2QqQ4j31L3qJ3K3j0L9qo1J4L3j7K2mQn2K0J1J2l8k9M6QL3
$$ -25 5 -9 26 35 -28 -28 4 12 4 88 -43 -10 -18 -5 18 8 47 39 -22 -8 25 8 30 26 34 -18 2 13 25 -13 -42 4 12 45
5981D5j5K1j3o4L9K3m9L8j6j6J9K2L9n4p3P1l8P0n8lqk2N1K0r2M3K0j4%Q6n1o2
$$ 45 30 51 38 -26 13 36 -13 25 9 -7 12 34 73 19 -54 17 -21 49 -9 -12 -20 -42 9 29 -63 -20 0 -14 -14 72 21 -41
6013d1L0mQ2o5jk0L4n7N8J5Op5qJ7j3M7j5M7q4K6N3JJj9j8j9P8o1k2K7lK7l2N
$$ -41 -11 -15 67 2 1 -19 15 -42 16 31 37 -38 -46 -29 -42 5 -10 37 -47 -21 32 33 34 15 -3 -22 56 -5 -27 0 -3 24 -8 -3
6047cOkmj2K5pJ8j2pm6K9PJ6K0k1j7K2L7k5k4Rj5L9m3K1l8k3M8j5j0K2j2o0M0
$$ -3 3 1 -3 -15 10 3 21 9 2 -44 -15 -8 8 28 7 -10 12 49 24 0 9 -6 33 -10 11 -27 -50 -2 -17 -27 -5 -17 -77 -37
6081c7M2rPj6K3NoL9k1k7j2MQqJ6K3n8K5k4M1mlk2K2L6p3J7j3M1k4J2M3k0k7j0
$$ -37 5 -4 3 -13 10 15 9 48 27 0 -12 -8 0 -8 8 31 -27 -2 -26 15 11 8 -14 8 44 -29 -12 -25 16 -8 4 47 27 0 -10
6116a0k3M0l3J3Pl1N3OKkn9J1K9L3K5q3K0jq1R6k1j5M4j3l3L7L0m1m5K3PM5M5
$$ -10 -33 7 -26 -13 -6 -37 16 22 24 22 -37 -26 3 36 61 -22 -2 -3 -84 12 -9 -24 20 7 -26 11 41 0 -45 -22 -15 30 75
6149G5l1n3j8j4L2Nj2K1lL1Nl6k1M6q3N0J2m0Q9n4l4L3j3j0N2pp5J02m6L1m1J4
$$ 75 44 -9 -27 -41 -9 -4 -16 5 2 33 38 2 -19 27 -56 -6 6 -34 55 1 -33 0 -13 -23 29 22 -53 49 3 34 -7 7
6181GkonJ4N5q1k4L6m2Q0k4J8o3M3m2Q2n1K1n5P4l0rnRl9K3M4nJ5o0n1Q9n3J7
$$ 7 5 -1 -6 8 63 -18 -42 -6 -48 32 8 26 -37 6 -36 46 -5 16 -39 35 5 -4 -9 0 -39 -16 28 23 38 -22 -73 16 -37 -20
6215b0M7m9L8MJ0K5K0j21MR3j00L9K4m8J3oK1L1kp1J0LLK0L6j9mJj5K6n6J1j6
$$ -20 27 -22 16 20 30 55 75 -46 -42 51 -49 -10 14 -34 -21 -27 -6 25 23 -48 -38 -35 -32 -12 24 5 1 2 -13 13 -43 -32 -48
6248d8JN0M4Mj22jM3pJ6Qll4J7J00r3M5K2l7q4O6N3k1k8oJ8Ok3M4n4K9m5K2RQ3
$$ -48 -47 3 47 51 -71 -72 -29 -36 -20 -12 -15 -49 -32 68 -25 20 42 5 -79 -13 40 19 -9 -15 3 9 -14 30 -24 5 -40 -18 -9 74
6282G4o3J2l7M1K5l0poM9p0J4j9%J4m5O5j4Rk3k3kP2MJ0n7l2K5K6N5o7m9nM9M0
$$ 74 11 23 -14 27 52 22 15 9 58 -12 2 -17 -17 -3 -48 17 3 12 -11 -34 -36 36 40 50 -7 -39 -14 12 67 0 -49 -54 -5 35
6316C5l5K4m7K5j7%L8lmn2L9l6L7P1q6k6J8L6K9k4o0M3K9j03Q1qm3nK5N5K5k4
$$ 35 0 24 -23 2 -15 -15 23 20 16 -36 3 -33 4 75 -11 -37 -19 17 46 22 -38 5 34 -69 12 4 -39 -44 -19 36 61 37
6348C7j03Q0m8J7J1j4J9pj0J5O8n7Qj2J4j8J4Plo2P2L2k5m7j9M3m3M1J6q4M6N3
$$ 37 -66 14 -34 -17 -6 -20 -1 -8 -18 -3 65 8 16 4 18 0 14 21 18 -44 28 60 35 -12 -31 12 -31 10 26 -58 -12 41
6380D1m5K2J6k7l6j0K2M0nJ2l1j1LK4k7j0J9j5J3L0J3j4NM7o6J8L0p8L3mq6J01
$$ 41 -4 18 34 7 -29 -39 -17 23 18 30 -1 -12 -9 15 -12 -22 -3 -18 -5 25 38 24 29 76 10 28 58 -20 13 9 -77 24
6412B4L6jq9K7j3O9l2j8k9L8O7k8k9K8j9j2k5M6m7J1k7QK6o7Q4k9k3kj3P6n9M4
$$ 24 60 59 -30 -3 -16 53 21 3 -26 12 79 51 22 50 31 19 -6 40 -7 4 -23 -15 11 -56 28 -1 -24 -26 -39 37 -22 22
6444B2m0K4NNj0j6K5Nm0M0j5K8K1q1LN5L2q4qJ6J3pN0k6p3J4nN3K2m0j5J5l2K6
$$ 22 -18 6 11 16 6 -10 15 20 -20 20 5 33 54 -27 -24 31 63 -21 -29 -13 0 -7 43 17 -56 -42 -47 6 28 -12 -27 -12 -44 -18
6478a8k5J09p9JN1j2j3Pm5J4L1qK9n1j6pK6l1N0o0M0k8J6K9K7o9nJ4MRk3M9j5
$$ -18 -43 66 -13 -12 39 27 14 21 -24 -10 21 13 42 -9 -25 -32 -6 -37 13 -47 -7 -35 -19 10 37 -32 -37 -23 -19 -10 -33 16 1
6511Am8M4l6Q4m8Pl0K4N2m7Kj9nP4l0k8Pl0oK3M8k8J5r1RK8L8kK9Lp2M7J5Jj3
$$ 1 -47 -3 -39 45 -3 4 -26 -2 50 3 5 -14 -19 55 25 -3 4 -26 -32 -9 39 11 26 -65 -56 -28 10 8 37 40 -32 15 30 31 18
6546A8m3O7k4k9R5j19L0oN8m5kK6m5l3L1O9k4Qn1M3q6J18k9j1m1L3jL4l7rk8J8
$$ 18 -25 42 18 -11 84 -35 -5 -11 47 2 0 26 -19 -52 -21 48 24 32 -19 24 -62 56 27 16 -25 8 7 41 4 -5 -33 -15
6578a5J4L7ol3l2mK7RK9Lrj2j8K1j8K2l4rQ3k2j8K3ro4N6K5Nj7oj1o3N9k1K7m9
$$ -15 -1 36 30 -3 -35 -39 -12 -3 26 29 20 8 -10 11 -7 15 -19 -28 55 33 15 38 29 -35 21 46 51 34 28 17 -46 13 -8 19 -30
6613c0L4k5L6k8kK4Mk9M3l8N1r3O0l9mO1j2rnj2M2J1m4J7n0K5J8m4N2m5JJ9L2
$$ -30 4 -21 15 -13 -15 9 13 -16 27 -11 40 -53 7 -32 -36 25 13 4 -1 -13 29 40 -4 13 -37 -12 6 -38 14 -31 -30 -11 21
6646B1pLmn0O6jl9J9m4J8L0L1j7n0k5K7K4k8L4L4o5K9m0N4JJ2j2m7M7pK2l8k1
$$ 21 14 17 13 -37 29 28 -11 8 -36 -18 12 43 26 -24 -49 -22 2 -26 8 42 -23 6 -34 20 21 33 21 -26 21 14 36 -2 -23
6679b3j3K2M4l8K6k6j6K0l5O7J2j08K3L1O6j6Mm3MkPK4j0l6M9lmL2n5l1M0k5j2
$$ -23 -36 -14 30 -8 18 -8 -24 -4 -39 28 40 -68 -45 -14 52 36 40 -3 1 -1 6 30 20 -16 33 30 26 58 3 -28 12 -13 -25
6712b5L9JK8q5O7kn4k0K8L4j5jPJ1KO2q1k2M2J5j8m1L5k1%J6Qk6M3m5j6O8o9M4
$$ -25 14 15 43 -42 25 23 -31 -51 -23 11 -4 -5 2 13 15 77 -4 -26 16 31 13 -28 7 -14 -14 2 10 -16 27 -18 -34 34 -35 9
6746Ink4L7j6k0mO7k2o2J8L6J9M3q6N3l5k7K7N4k0k0Jk2Rpj3k4O8j8k0MO0o4L1
$$ 9 4 -20 17 1 -19 -23 44 22 -40 -22 14 33 76 -10 43 8 -19 8 62 42 22 23 1 10 3 -10 -34 34 16 -4 0 60 -4 27
6780B7oJ0L%m0M0Or7L1P8k2rk2mL4Mln3L8m1K1N0Lk0l4mN8l3j7M2k6p3NJ00k8
$$ 27 21 31 34 34 -6 34 40 -57 -26 52 30 21 -1 -5 29 33 30 -23 15 -26 -5 45 48 28 -6 -10 48 15 -2 40 14 -59 -54 46 18
6815A8pn9oJ16m3%j5Mn8O0J2l0n0P2K7n9P6m8Ol9M1mmpl1NrnL8qjml4Q6J2n7K3
$$ 18 11 -48 -54 62 19 19 4 8 -50 10 22 -8 -58 14 41 -18 58 10 16 -23 18 14 10 3 -28 -23 -32 -37 1 -7 -8 -12 -46 40 52 -5 18
6852A8m4K3Qk4L6j0p1P0kK4m2M2l5K1l0O2m2k7LK2l0K8P8m6n1J5mJ4L4j1m6l7
$$ 18 -26 -3 5 -19 17 7 -64 6 4 28 -14 28 -7 14 -16 46 4 -23 -20 2 -28 0 78 32 -19 -4 -8 6 40 29 -17 -54
6884e4M1OP3o2K0k6K9n8N3m6j9M7QRN5r8N5l3M5l8J9Oq6K9O1j2o2l6L3N1k7Q9
$$ -54 -13 -7 66 4 24 -2 27 -31 22 -24 -43 4 12 21 76 -22 33 0 45 7 26 32 -54 -25 36 24 -38 -74 -41 10 -17 72
6916G2n9J9n7%K8k0PK2k0k7K5M1j1L4q4LO9n1OPNm1L4J9K9j6n4J7Nj1JNk6j2K9
$$ 72 13 32 -25 -25 3 -17 -10 12 -8 -35 -10 31 20 54 -30 -27 42 -9 -3 4 9 -32 2 21 50 34 -20 -3 2 -9 -8 -3 -29 -41 -12
6951a2L7K2q6N7m0J6pLK4n9N3k3RJ6k7J9m8N4j9L5k8J1n5lN8o3R9m3nM1Kk7K4
$$ -12 25 47 -39 18 -22 -6 -13 -10 14 -45 8 -15 -6 10 -17 2 -46 8 -11 24 -4 7 -48 -51 7 -56 43 0 -5 36 38 11 35
6984C5l6m0nL0Q7o6J3k3k3K4M8o9K7k5P1pm5N4j05M6J2J3N2o5j3N1m1K9j7M2l0
$$ 35 -1 -41 -46 -16 71 5 18 -5 -28 -4 44 -25 2 -23 48 41 -4 50 -55 -9 3 16 68 3 -10 41 0 29 12 54 24
7015B4m5JJ4M6l0j1Qj9N6l7m3O0%j4mK4n4L5KJ4j5k7J9p8R2J3k9J8jnpK9kn0M
$$ 24 -21 -20 -6 40 10 -1 7 -12 44 7 -36 24 24 10 6 30 -24 11 13 27 12 -15 4 -74 18 31 2 20 19 14 7 36 34 -16 -12
7050a2nJ0J3LK4m5J9m6L4L5J3l2k5j5lQ4k4m8Pl5N5qM2m9L7j8n6P2l3j8j4K3J3
$$ -12 -17 -7 6 9 33 -12 7 -39 -5 30 43 11 -14 -29 -32 52 28 -20 -13 -48 7 -1 41 -8 29 11 -45 27 -6 -24 -38 -15 -2
7083bl7O2om4j6O6j0K4m4QL3j5j5l6L0qmpL4On3OM3qLLl1pkN9j2m6K6J1l6N7n6
$$ -2 -39 23 17 -27 -43 23 13 37 -7 1 34 19 4 -32 -2 -10 -14 -21 13 19 -34 -28 15 7 10 13 -18 -25 -27 32 20 -26 0 11 -25 32 -24
7120b4QJ8pM5j0L2p3K2m8O2k0j8k1N9om3KN6L6r3l5L4K1l4K1K3o2Q3k1Kk9pj3
$$ -24 -16 2 -5 40 30 62 -11 11 -37 25 5 -13 -34 25 19 -24 -22 34 70 -23 -58 -24 -3 -37 -16 7 -55 28 7 9 -20 -27 -40
7153d0L8K6Nr0O0J2m1N7%k5pj4QRK4k4k1Np1J08K3k3l1L4j03P2J01n3n1L7o6L3
$$ -40 -2 24 29 -61 -1 11 -30 27 27 2 -5 -19 -11 -2 22 -2 -23 -18 -89 19 42 19 -12 22 -81 -9 92 39 -12 25 -41 -8
7185hJ03p1j6qJ9j0Ll3L8j5m5J7O0m4K8l5J1P3n2J3k5pj0%K3J9n2L4P%M7l2lo3
$$ -8 95 24 8 0 19 9 12 -21 17 2 -43 -26 34 -10 18 -17 -6 67 15 28 3 -4 -14 -14 9 28 -24 10 17 17 64 32 29 -34
7219c4M9l7M0l3nJ5J7%j9N7o5lL6qm2O8Mq3k9O6J6Omq7R3j7lj4L9nm0L7j8L3m5
$$ -34 15 -22 18 -15 -20 -5 12 12 -7 50 -15 -18 18 10 -32 36 40 -43 -72 -6 10 16 12 -75 18 1 -2 -16 23 18 -22 15 -3 30 -15
7254a5Pk4J7L3k7mk3R%N8M2j22N7m0J3N6m6rj8j7L8L3l6K2m5r%N8k5%K3l5N6l8
$$ -15 -8 -32 -15 18 -9 -13 -36 -27 -27 31 73 -49 8 -32 -19 37 -9 -18 -36 -53 -15 18 -18 4 -41 -50 -50 8 -17 -17 6 -29 27 -11
7288a1j1M8om8J2J3Rm8N5j3%L5j3n2K2J9Nl4L8j8l0J4M5O1q3m3j1L6NO6j03L2
$$ -11 -22 26 20 -28 -16 -3 6 -42 13 0 0 35 22 -30 -8 11 16 -18 20 2 -28 -14 31 92 9 -34 -45 -9 -4 62 -41 -9
7320ik4N1k6L8j9j6K5Nj6O0l2p9L0k1J6M3Pk9J0m0K3L7nK9n5j6qNN3o5K1o3P9
$$ -9 -33 18 -8 30 11 -5 20 25 9 69 37 -42 -12 -33 -17 26 33 4 14 -26 -3 34 29 58 3 -13 -21 -16 37 -28 -7 -70 9
7353Im3P9q0P5l5l5L3qL1o1N5m6Q1n1m0J9QJ8M1J4l4k5j0j6M2J8m9p9J12lQl6
$$ 9 -34 45 -35 40 5 -30 3 -5 26 -35 20 -26 55 4 -36 -17 -9 9 50 64 30 5 -5 -21 21 39 -10 -89 23 20 28 -8
7385hL1j7PjK1Rj13J11m9NQ5m0k9l0J0k4M4j0l1K7j0J2j7L3j9j4O4k5L9p9O0m0
$$ -8 23 6 13 12 33 42 -71 40 -9 -4 81 41 12 -18 -8 -32 12 2 -29 -2 -12 0 -17 16 -3 -17 47 22 61 -18 42 2
7417Bl6O2pj8k0PL2l9K0l2K3jj4L4J4l4pk7K9k2J8Q1m4l7jL1J1k3K0k4l4Q1n2
$$ 2 -34 28 21 3 -17 -10 22 -17 3 -29 -6 -7 -21 13 27 -7 -14 -41 -12 -34 -16 65 21 -16 -17 14 25 2 22 -2 -36 45 -7
7450gN9m8j7oj9M4Lmj2l7O9l9O3k8l7K0pk2R8o1o1QL3P8o2l5J4J2l3L1L5oqoJ0
$$ -7 52 4 -13 -19 -38 6 9 5 -7 -44 25 -14 49 21 -16 4 -3 -25 73 12 -49 -41 -8 70 8 -27 -13 -1 -34 -3 32 26 18 12 22
7485B2J3k3rj7Pj6N1M2p7lJ1M9j5l1ko7O4l4J3mQj3JM5J3l2l9P7n1J7J6m0O2j02
$$ 22 35 12 3 -14 -7 -23 28 70 -7 -10 1 50 35 4 2 -65 -1 -35 -22 -26 -18 -31 -30 15 28 -4 -43 34 -17 0 16 -24 38 -64
7519f4N4J8l4M2k8k1J7M9Rj5k7k2M2Mn0M9L3n1k4M7l5Pl5k5L7J3K8k2K0k8J8M6
$$ -64 -10 8 -26 16 -12 -33 -16 33 42 27 0 -22 20 24 -26 23 56 5 -19 28 -7 0 -35 -60 -23 -10 18 -4 16 -12 6 52
7551E2j6Pp7j1M2rK8kn9P7m7N0m5RK5l6KM0K2l5rk0MJ7m4M2Ml2K3J9K9m9mK4J0
$$ 52 36 43 -34 -45 -3 -12 16 14 -45 32 -15 35 -10 -1 24 -12 -10 30 52 17 8 -12 -8 9 -35 7 11 -21 2 21 50 1 -3 21 31
7586C1m3l0J4n5O8QL6K6q1O6o8K1pOL3k1k8OR5j05LL1k8j5M8jn1N2J1qJ8o0qM6
$$ 31 -12 -42 -28 -83 -15 -7 29 55 -26 40 -28 -7 -14 -8 25 4 -24 -18 77 -28 -25 6 -22 -37 11 10 -41 11 22 14 32 -28 -36 10
7620A0k2jQJ2nl3K6NJ2Pk6J9jk5k3J5n3P9k7J5J7n3P9p8M8Qk1J9k5K5j0KQPmj8
$$ 10 -12 -13 -5 7 2 -31 -5 0 12 19 -7 12 11 -14 -37 -22 -75 4 -23 -8 9 -44 35 -43 5 13 -8 11 -14 11 1 3 11 18 14 -4
7656dJ0N2l4k4N5Kp6P9p6M8m7M7k2j5J1K3Ol8J1QnJl3j8N7n1O2n0M6j7NL4n2k5
$$ -4 6 58 24 0 55 57 -19 60 -16 32 -15 32 10 -5 6 29 35 -3 8 16 11 12 -21 -39 18 -33 29 -21 25 8 13 47 -5 -30
7690c0K0L6PJ2ok7M0l6Kon0O3J1n9O0l7K6k2J1%k1J1jK6j4l9j0K2N2m1%k2mJ5
$$ -30 -10 26 33 45 39 12 52 16 18 12 -38 25 36 -23 37 0 26 4 15 15 -6 5 4 30 16 -23 -33 -11 41 0 0 -22 -26 -11
7724a1O4k2j2l6K6lk8K2j5PLJ4mL2q5J13j02K1M3rL0p4OK2l4M4k0Lk4OL9J4n0
$$ -11 53 31 19 -17 9 6 -22 0 -15 -8 -5 9 5 37 -48 65 -37 -16 27 18 48 -26 -20 2 -32 12 -8 -5 -29 -23 16 30 -20
7757b0J4J4k5rl5Q0p9K1j0L8M5rj3L3k9k1Q2q2j0J4j5JL8m3OLj4L2K4m1j6O5q2
$$ -20 -6 8 -17 -26 -61 19 -60 -39 -49 -11 34 25 12 45 16 -5 77 -5 -15 -1 -16 -15 23 -20 -14 -11 -25 7 31 -10 -26 39 -43
7790d3P3k3J1k4K3J1j0K0j1o3L1M0k3OJ8p3nO2j6k0Ok5J6O0%n8P2jpk5L8j8n4
$$ -43 30 7 18 -6 17 28 18 38 27 -36 -5 35 12 18 36 -37 -42 20 4 -16 -10 -35 -19 41 41 -17 55 54 47 22 60 42 -12
7823a2L2Jj5K2J6q7L4Ok2Q6m1m7J9qJ9L2n3M9ol1L0j3k7L6k4K9J4p3P4n7k1rP1
$$ -12 20 21 6 28 44 -43 -9 -3 -25 61 20 -27 -8 -16 3 35 -18 31 25 -6 24 11 -16 20 -4 25 39 -34 40 -17 -38 -47 24
7856B4j7%J0nL0l8k5N5n1j0K3L2k1j6j3k0L%%MQ3n7j6njN4l6J9Nk4K6Rm7J3K9
$$ 24 7 7 17 12 42 4 -21 34 -17 -27 -4 28 7 -9 -22 -42 -39 -39 -39 -35 48 -9 -25 -30 -31 23 -13 6 11 -13 13 22 -25 -12 17
7891A7L5j2k2j7l4O1k9j0J4K7k2l9J6J9nj8j1K1j1M7m4oj9L0L0Rm0rP2r5J6M7
$$ 17 52 40 18 1 -33 28 -1 -11 3 30 8 -31 -15 4 -1 -19 -30 -9 -20 27 -17 -23 -42 -12 18 27 -13 -22 50 -45 -29 18
7923A8jl3l4K6nL7k2nJ9K8n1J5j2K1Lk4J4ML0m3L7ll4jM3m5ojJ6L1K0n8Qm0O0
$$ 18 17 -16 -50 -24 -29 8 -14 -19 0 28 -23 -8 -20 1 4 -20 -6 -2 28 -15 22 19 -15 -16 27 -18 -24 -25 -9 22 42 -16 -8 -48 12
7958A2o1O3J2l9K8lM6n0jk3K2kL6k6K5m9QM0lkL3r0KR0q1mJ8JJ3o5N2Nl4K5j6
$$ 12 -49 14 26 -13 15 12 58 8 7 -16 6 4 40 14 39 -10 -2 38 35 33 66 -24 -22 68 -13 -17 1 2 15 -50 2 7 -27 -2 -18
7993a8m1Q5Nk6J6j7m0N4L5p7J4j1J6l0J6j6k7L6Rj7K7j4Lk1K9L1k5J3j8j3O2k6
$$ -18 -59 26 31 5 21 4 -36 18 53 -24 -10 -21 -5 -35 -19 -35 -62 -26 -17 -34 -7 -21 -18 -39 -10 21 -4 9 -9 -22 40 14
8025A4NNj8Orj9J08j29j5QN1Kj2l4N1N6j5l8k2K6J5k3k9M0Ok8J4m5lL9J6o7P2
$$ 14 19 24 6 12 3 -16 92 -37 -52 -44 7 9 -3 -37 14 70 55 17 -5 21 36 13 -16 24 30 2 16 -29 -32 7 23 -44 28
8058B8m8PK8n6J01p8ML6Nk5N0k6k8J8nk7K4OkMqK2j5j0qlpj0O2o0J2j2k0K0RK8
$$ 28 -20 -13 15 -41 60 -18 -14 22 27 2 52 26 -2 16 11 -16 8 14 12 16 8 30 15 5 -3 -6 -13 -23 39 -21 -9 -21 -41 -21 -12 16
8094A6l2M2J8j9k9M2m4n0M6N3m9r%J6N3n9j7KO6l7J6Mqk2oM1nNK5o6lJ1k6k0P9
$$ 16 -16 26 44 25 -4 38 -6 -56 -10 43 -6 -15 -15 1 54 -5 -22 -20 46 9 25 29 21 -1 -7 34 29 34 59 -7 -10 1 -25 -45 34
8129C4m1m3O2m1O1o4J1J5J5K8l8K4pn9K4M1ql3Q1q1O5l5Jlo1J5J9N4n4lk5K1j2
$$ 34 -7 -50 12 -29 32 -32 -21 -6 9 37 -1 23 16 -43 -19 22 14 -19 62 -19 46 11 12 9 -52 -37 -18 36 -18 -21 -46 -25 -37
8162c7N3J7k2m1j1O0j2mJ8l5O5o7J1J6L1m0p1O7P4n6L2l2%qJ7j7Nrl
$$ -37 16 33 11 -30 -41 19 7 3 21 -14 51 -16 -5 11 42 2 -69 -2 72 16 48 16 16 8 25 8 13 4 1
8191A
$$ Imaginary data points
##PAGE= N=2
##DATA TABLE= (X++(I..I)), XYDATA
0@%%%%%%%%%%%%%%%%%%%%%%Qj6J6j6J6j6J6k2L0l2L2l8M6m8N5o3O8p6Q5r4J05
$$ 0 0 0 0 0 0 0 0 0 0 0 0 0 0 0 0 0 0 0 0 0 0 0 8 -8 8 -8 8 -8 8 -14 16 -16 16 -22 24 -24 31 -32 36 -40 45 -49 56
43E6j16J27j42J58j74J90k08K32k56K81l11L43l79M20m69N26n90O66p62Q84j039
$$ 56 -60 67 -75 83 -91 99 -109 123 -133 148 -163 180 -199 221 -248 278 -312 354 -408 476 -563
64e63J250j554K023k853M753j7103n641K5226l002J6413j6354j4945K828R29K1142
$$ -563 687 -867 1156 -1697 3056 -14047 -19688 5538 2536 18949 2595 -12350 -9522 -8593 12549
79A2549K528j5004p763n752J1463P753Q197p039j8881p0O796J5210L505j1064
$$ 12549 15077 73 -7690 -13442 -1979 5774 13971 6932 -11949 -12019 -5223 9987 13492 2428
93B428p723j1894J3581J5384o99m982j9282J881J0626N990J0213j4282j0068j848
$$ 2428 -5295 -17189 -3608 11776 11077 6095 -13187 -11306 -680 5310 15523 1241 -8827 -10675
107a0675N384J7290l826m134r887r041J4398N590P870o886j8926M647K970J3182
$$ -10675 -5291 11999 8173 4039 -5848 -14889 -491 5099 12969 6083 -12843 -8196 -5226 7956
121G956O295j4489m934q511R752J6391m832l747j2090l207J0743O112O449q923
$$ 7956 14251 -238 -5172 -13683 -3931 12460 7628 3881 -8209 -11416 -673 5439 11888 2965
135B965j1502j128O407J1591P0l800j0855o769J1523Q052M899q363j2647K017
$$ 2965 -8537 -9665 -3258 8333 8403 4603 -6252 -13021 -1498 6554 11453 3090 -9557 -7540
149g540K770J2318M222j0997o710n901J0663R519k111p60j3328k271Q886N816
$$ -7540 -4770 7548 11770 773 -5937 -11838 -1175 8344 6233 5473 -7855 -10126 -1240 4576
163D576P282j0512q727N04J403J3113K109p361q004n813J0284P853J414m261j1270
$$ 4576 11858 1346 -7381 -6877 -5474 7639 9748 2387 -5617 -11430 -1146 6707 8121 3860 -7410
178g410j329N860R553L047q588o775l180O475Q476J824m015j1047j546O781O930
$$ -7410 -8739 -2879 6674 9721 1133 -5642 -8822 -2347 6129 7953 3938 -7109 -8655 -1874 5056
193E056M565p858p380k454L911J1684N87n881p658m096Q439O241K825m397j0734
$$ 5056 9621 1763 -5617 -8071 -4160 7524 8111 2230 -5428 -9524 -1085 5156 7981 3584 -7150
208g150l31N049P893L365p516o085l273M954R424J124m624q514k537O463O567
$$ -7150 -7481 -2432 5461 8826 1310 -4775 -8048 -3094 6330 7454 2830 -5684 -8221 -1758 4809
223D809L395n636q462j677M937Q477J813n543p249k702N746P086K843n451q169
$$ 4809 8204 2568 -5894 -7571 -2634 5843 7656 2113 -5136 -7838 -2092 4994 7837 2386 -5783
238e783j173M327P795K638o064o400k921N122Q108J335m573p482k386N493O781
$$ -5783 -6956 -2629 5166 7804 1740 -4660 -7581 -2459 5649 6984 2411 -5071 -7457 -1964 4817
253D817K690n486p137j770M359P785J898n316o465k645N156P188J753m586p144
$$ 4817 7507 2021 -5116 -6886 -2527 5258 7156 1840 -4625 -7270 -2114 5074 6827 2241 -4903
268d903k216N104O941J863m901o605k303M937P025J780m620o997j882N062O249
$$ -4903 -7119 -2015 4926 6789 1888 -4717 -7020 -2083 4942 6722 2102 -4895 -6777 -1715 4534
283D534K079m372p103j861M993O335K005m704o651j621M393O425K350m884o875
$$ 4534 6613 2241 -4862 -6723 -1730 4605 6610 1906 -4745 -6366 -1973 4452 6802 1918 -4957
298d957j303M693N799K203m420o709j584M396O474J902n009n925j474L835O350
$$ -4957 -6260 -1567 4232 6435 2015 -4694 -6278 -1882 4592 6494 1485 -4440 -5914 -2079 4271
313D271K270m682o687j184M535N497K191m417o225j506L870O574J815n081n446
$$ 4271 6541 1859 -4828 -6012 -1477 4020 6211 1794 -4431 -5937 -2067 4507 6322 1241 -4205
328d205j433L640O107K085m429o262j357M337N715J498l998n582k127M135O315
$$ -4205 -5638 -1998 4109 6194 1765 -4497 -5854 -1517 4198 5696 1698 -3884 -6011 -1876 4439
343D439J272m250n717j301M043N197K286m166o292j206M363N359J380l832n405
$$ 4439 5711 1461 -4256 -5557 -1514 3683 5969 1803 -4489 -5695 -1332 4027 5407 1575 -3830
358c830j845L936N834J669m330n701q09L538N119K235m162n856j220M030N592
$$ -3830 -5675 -1739 4095 5764 1434 -4267 -5076 -1538 3581 5816 1654 -4202 -5422 -1392 4200
373D200R89l923m802j838L659N761J332m110n251j097L934M553J801l322n996
$$ 4200 5189 1266 -3536 -5374 -1715 4046 5378 1268 -3983 -5080 -1146 3407 5208 1886 -4110
388d110j227M019N050J472m084m756j312L081N752J550m312n007j071L729M788
$$ -4110 -5337 -1318 3732 5204 1120 -3636 -4948 -1867 3885 5435 1123 -3884 -4955 -1226 3562
403C562J279l250n261j569M043M960J024l609m694j162L096N001J963m192n029
$$ 3562 4841 1591 -3670 -5239 -1196 3764 4788 1179 -3515 -4677 -1581 3420 5383 1191 -3838
418c838p18L114N100J061l491m417k222M257N288J63k978m899j059L644L910K197
$$ -3838 -4556 -1442 3658 4719 1228 -3189 -5411 -1154 4134 4297 1319 -3580 -4639 -995 2915 5112
434E112l823n180k21K689M738J349l574m052j996L475N389N73l382m446j240L312
$$ 5112 1289 -3891 -4112 -1423 3315 4664 1090 -2962 -4958 -1483 3906 4479 1097 -3349 -4589 -1277
450a277M579J461l494m914r25L812M022R14k919m507j034K868M642J529m111l549
$$ -1277 3302 4763 1269 -3645 -4570 -758 3264 4178 1259 -3248 -4282 -1414 3228 4757 646 -2903
466b903j223K370N259O42k695m599j995M778L451R41k293n535j13K757M052K099
$$ -2903 -4126 -1756 3503 4145 1450 -3149 -5144 -366 3085 4026 1733 -3802 -3915 -1158 2894 4993
482D993m741l338n07J936N051O14k878l853j845L718M010O72k418m358j434L206
$$ 4993 252 -3086 -3593 -1657 3394 4008 1130 -2723 -4568 -850 3160 3832 1414 -2944 -4378 -1172
498a172M309J138l118m536o24L238L425J664l340m396k26K399M473O61l495k482
$$ -1172 3137 4275 1157 -3379 -4003 -765 2660 4324 984 -3412 -3638 -1239 3234 3895 400 -2082
514b082k241L107M573Kj742m738j137L843K624K104l102m737J4K186M586P97l756
$$ -2082 -4323 -1216 3357 3359 1617 -3121 -4258 -415 2209 4313 1211 -3526 -3512 -1326 3260 4057 301
531C01k647j690K997M301J14k204m075j003L338L142J055k243m270j105L235L402
$$ 301 -2346 -4036 -1039 3262 3376 1172 -2903 -3906 -568 2574 3629 1386 -2884 -3989 -754 2648
547B648J123k560m378m17K567L562J768l801l411n27K167M497L7k410l254j828
$$ 2648 3771 1211 -3167 -3584 -1017 2545 4313 512 -2899 -3426 -1259 3238 3275 865 -2389 -4217
563d217L817K980P01j830m607q0K253L145K150l709l277o73J924M607K99k711
$$ -4217 -400 2580 3281 1451 -3156 -3236 -983 2162 4312 603 -2674 -3347 -1423 3184 3483 772
579G72l149j612L309L540M44k361l671o69K670L176R84k492l597p49K603L161
$$ 772 -2377 -3989 -680 2860 3304 943 -2728 -3397 -727 2449 3433 941 -2656 -3405 -802 2359
595B359J292k817l470n89J884M130Q28l163k609j537K763L896m9j759l741j027
$$ 2359 3651 834 -2636 -3225 -1341 2789 3617 454 -2155 -3692 -929 2967 2918 1159 -2582 -3609
611c609L334K464J191k363l788j80J928L411J094k939k767j093K229L762M75k245
$$ -3609 -275 2189 3380 1017 -2771 -2951 -1023 2388 3482 543 -2224 -3317 -1088 2674 3149 904
627I04l279j134K861L026Q18k328l492n83K525K986Q92k414l235n90K183L236
$$ 904 -2375 -3509 -648 2378 3196 868 -2624 -3207 -682 2304 3196 782 -2453 -3043 -860 2376
643B376Q62k601k805r59K145L489N01k136l102j139K895K782O18j876l660m63
$$ 2376 3238 637 -2168 -3127 -982 2507 3008 872 -2230 -3369 -474 2308 2926 1050 -2610 -3073
659c073K528K684J141k594l186k44J796L246Q01k559k607j014K291L214L00j901
$$ -3073 -545 2139 3280 686 -2500 -2744 -948 2298 3099 540 -2067 -3081 -790 2424 2724 823
675H23k984j063K647K828O75k131l175n41K217K903Q46k364k976o67K383K828
$$ 823 -2161 -3224 -577 2251 2926 795 -2380 -2921 -704 2199 3045 681 -2295 -2962 -579 2249
691B249O13k123k935o96K178K956O67k246k852o18K105K877O41k065l012o11K289
$$ 2249 2862 739 -2196 -2892 -714 2242 2909 663 -2189 -2807 -702 2175 2816 751 -2261 -2872 -583
708e83K654Q15k305k709n28J801L122N67k346k501q23K258K664N62j803l073m84
$$ -583 2071 2886 581 -2128 -2656 -855 2267 2834 488 -2013 -2836 -578 2086 2648 845 -2228 -2712
725b712K145K668P41k343k491o23J736L123M76k103k584q07K302K444O28j784
$$ -2712 -567 2101 2842 499 -1992 -2615 -879 2244 2720 617 -1967 -2774 -472 1972 2600 816
741H16k949o16K060K859L97k055k359q75K087K655N05j818k967k62K129K105J018
$$ 816 -2133 -2749 -689 2170 2567 512 -1847 -2722 -635 2020 2525 707 -2260 -2522 -393 1712 2730
758B730k118k636o23J988K836J89j761k456p66K136K303R01k066k944j6J738K350
$$ 2730 612 -2024 -2647 -659 2177 2366 605 -1851 -2617 -481 1822 2723 657 -2287 -2303 -565 1785
775A785P51j995k384p83K105K570K97j757k600l81J790K340R79k229k452l22J657
$$ 1785 2536 541 -1843 -2626 -521 2049 2346 589 -2011 -2392 -602 1738 2717 488 -1964 -2286 -629
792f29K536M38j748k465o45K026K328O50j976k510k32J524K570O19k113k129o56
$$ -629 1907 2345 597 -1868 -2513 -487 1841 2491 515 -1995 -2227 -703 1867 2486 373 -1756 -2412
809b412J963K414K04j501k442n95J868K345O34k095k239l10J562K490L82j729
$$ -2412 -449 1965 2169 668 -1774 -2369 -501 1844 2478 383 -1856 -2166 -604 1886 2268 539
825E39k287o66K089K063M28j590k371m54J643K423N16j968k133m01J726K170M65
$$ 539 -1748 -2414 -325 1738 2166 576 -1795 -2249 -606 1817 2333 365 -1768 -2169 -443 1727 2192
842B192j579k481l63J811K194M78j910j892o53J580K589K05j708k179n24J926
$$ 2192 613 -1868 -2231 -420 1774 2252 342 -1550 -2203 -623 1966 2171 463 -1716 -2240 -314
858c14J880N90j508k515k41J725K048M84j811j891n60J501K385L49j715k095l89
$$ -314 1566 2156 648 -1867 -2108 -383 1665 2149 338 -1553 -2113 -612 1773 2122 407 -1688 -2077
875b077J718K000M41j535k193n34J811K035L89j642k035l26J471K048O77j907
$$ -2077 -359 1641 2082 547 -1646 -2180 -369 1666 2055 413 -1622 -1948 -477 1571 2248 341
891C41k012k43J403K230K81j634j806p16J791K045J59j337k113l86J662J765O17
$$ 341 -1671 -1914 -511 1719 2000 366 -1440 -2156 -365 1680 1839 502 -1611 -1997 -335 1430 2047
908B047j630k162j07J411K013M17j671j802n43J517K249R8j510j829m79J607J861
$$ 2047 417 -1745 -1852 -441 1572 1989 318 -1484 -2027 -510 1739 1837 327 -1502 -1981 -374 1487
925A487L85j320k235k03J602J625P08j632j945k73J292K108L98j824j512n39J418
$$ 1487 1872 552 -1683 -1886 -284 1341 2049 417 -1528 -1801 -509 1599 1997 173 -1339 -1878 -460
942d60K123J02j336j911n25J821J664K41j241k038k31J459J677N79j704j722j06
$$ -460 1663 1765 429 -1482 -2007 -186 1478 1719 478 -1560 -1791 -332 1345 1924 220 -1502 -1608
959a608J116J994L69j601j550o40J597J882Q3j132j953m84J828J369N16j415k025
$$ -1608 -492 1502 1871 270 -1280 -1920 -323 1559 1642 510 -1443 -1927 -99 1270 1786 371 -1654
976a654R0J213J631N85j676j571k77J217J934J74j337j585o35J612J710K14j195
$$ -1654 -1564 -351 1280 1865 189 -1382 -1659 -442 1492 1666 329 -1256 -1891 -279 1431 1645 450
993D50j915l63J673J394N02j401j927R8J113J608O08j735j341k74R89K000N6j205
$$ 450 -1465 -1828 -155 1239 1741 340 -1587 -1489 -376 1232 1840 105 -1236 -1510 -521 1479 1535 330
1011C30j373p19J520J580K89j108j990j31J373J377O57j550j660j43J143J785
$$ 330 -1043 -1762 -242 1338 1627 519 -1471 -1602 -229 1148 1805 255 -1405 -1548 -405 1380
1027A380K16j430j336l89J155J802O7j186j478m69J356J482K95r34j906k21J370
$$ 1380 1596 166 -1170 -1559 -404 1398 1465 279 -1199 -1668 -312 1170 1465 531 -1375 -1596 -226
1044b26J377N79j499j518j30R78J819J98j446j267m24J353J547n3q69j586m37
$$ -226 1151 1730 231 -1287 -1417 -439 1380 1578 132 -1135 -1559 -206 1341 1288 419 -1167 -1604
1061a604J453J245L74j104j706p3J054J506N29j514j416j69J139J605J21j270
$$ -1604 -151 1094 1468 364 -1342 -1415 -361 1145 1674 160 -1256 -1425 -286 1319 1440 170
1077A70j231n03J270J580J0r96j454l31J290J250M17j070j721LJ010J474M02j325
$$ 170 -1061 -1564 -294 1286 1296 300 -1154 -1485 -195 1055 1472 402 -1319 -1316 -306 1168 1570 245
1095B45j344l51J099J698j4j081j310m32J301J292K45j031j559j76J295J168L08
$$ 245 -1099 -1450 -351 1347 1333 252 -1058 -1490 -189 1103 1348 317 -1242 -1418 -123 1045 1353
1112A353j072j430j62R65J526K75j363j168l09J018J558J83j087j345m43J339
$$ 1353 281 -1149 -1311 -346 1180 1455 92 -1076 -1385 -367 1191 1374 287 -1058 -1501 -162
1128a62J252J85r58j465j78J157J219L78j247j269r9Q70J413J83j024j209n03
$$ -162 1090 1275 317 -1148 -1326 -169 1050 1428 181 -1088 -1187 -317 1096 1279 255 -954 -1457
1145a457J275J260Q9q96j341k47J105J274K66j129j314j31J063J209K14r81j331
$$ -1457 -182 1078 1167 271 -1070 -1317 -212 1062 1328 199 -1115 -1246 -183 1026 1240 259 -1072
1162a072k17J069J302J69j085j042m34J043J359J24q91j358k42J193J034K99r15
$$ -1072 -1289 -220 1082 1251 166 -876 -1310 -267 1092 1216 325 -1033 -1275 -82 952 1251 336
1179C36j397j76R86J327J21j076j073k89R86J341P3r66j254j63J066J086K56r54
$$ 336 -1061 -1237 -251 1076 1197 121 -952 -1241 -255 1086 1159 193 -1061 -1224 -158 928 1184 230
1197B30j204k99J093J246J54j010j263j49R95J123L01r87j276r6R54J188J45r05
$$ 230 -974 -1273 -180 1066 1220 210 -1053 -1202 -207 916 1217 230 -1046 -1142 -188 1000 1145 240
1215B40j115l73J091J203P9r09j221j12R19J095K81j001j135k48R74J224N7q51
$$ 240 -875 -1248 -157 1046 1125 216 -1005 -1117 -198 897 1178 177 -958 -1206 -232 992 1049 198
1233A98j203j85J025J105K91j085j118j31Q92J132K31r87j093k61J076J038J86
$$ 198 -1005 -1190 -165 940 1231 146 -972 -1103 -211 921 1152 165 -928 -1189 -113 925 1111
1250A111r16j109j61Q53J113K69j012j050j71R07J105R3q23j181k15J035R86K40
$$ 1111 195 -914 -1075 -222 891 1160 148 -902 -1073 -166 939 1032 209 -972 -1187 -152 834 1074
1268A074r30j144o2Q34J158J77r89r68k30R42J022J55q40j171j10R45J029J88
$$ 1074 144 -1000 -1062 -228 930 1107 118 -850 -1080 -138 884 1039 199 -972 -1082 -137 892 1080
1286A080r58r54j70Q64J047J61q74j088q7Q40R92K33r83j007j04P88J133M5q02
$$ 1080 122 -832 -1002 -138 909 1070 196 -892 -979 -139 853 1086 103 -904 -1008 -220 913 958 156
1305A56r58k89R39J064P6p92j129o7Q51R55K55r27j011j28Q26J104M1p93j020
$$ 156 -802 -1091 -152 912 988 196 -933 -1000 -149 806 1061 134 -877 -1005 -179 925 966 173 -847
1324h47j90R28R51J57q51r86j92Q88J032N0p46r48k55R01Q66K28q09j063p4P52
$$ -847 -1037 -109 842 999 148 -838 -1030 -142 890 940 194 -754 -1009 -108 758 986 177 -886 -960 -208
1344b08J076J56r77q46j99Q70J009n2o66r69j29Q80P89J93p78j011kO85R02K89
$$ -208 868 1024 47 -799 -998 -128 881 829 163 -806 -935 -55 734 927 149 -862 -864 -179 723 1012
1364A012q80r33j83Q10J029P2p82r34j69Q79Q91J24p64r82j05Q61P56K65q35r40
$$ 1012 132 -801 -984 -174 855 927 145 -789 -958 -79 812 936 172 -810 -915 -54 702 967 132 -808
1384h08l9O56R38J64q02q79j20P04R96R1p86q61j99P97Q86J57p07j083M0P96P40
$$ -808 -847 -191 747 911 109 -770 -890 -186 810 901 115 -746 -945 -148 738 895 188 -895 -855 -59 681
1405F81K69q63q55M8N41R08J57p71p26k80O81R97P7o48r42k42Q75Q02J77o71j099
$$ 681 950 87 -768 -720 -179 729 886 115 -611 -891 -210 787 864 216 -726 -968 -93 709 886 215 -884
1426h84N4P72P01K43q18q70M9N75R43L8p26o95k50P14R00kn49r36k05Q86P53J93
$$ -884 -830 -58 643 886 68 -802 -753 -178 765 803 77 -618 -868 -154 746 744 195 -741 -946 -60 693 886
1448H86o70j056O1O63Q00K41r21p50jN77R08m6o45o26k96P76Q16Rn11r56j29P45
$$ 886 216 -840 -779 -116 684 925 4 -746 -747 -170 738 692 47 -579 -875 -99 717 726 215 -741 -870 -125
1470a25O78L21p01r77j4O71Q10K35q60p15j63O64R42k7o66p24k09P99P01O7m73
$$ -125 553 874 173 -804 -818 -147 663 898 38 -677 -840 -176 766 739 73 -651 -860 -61 640 707 234
1491B34r40p6O72P02K46o59q93n0N12R75J66q37p35r9O75Q70p0o38p43j36P36
$$ 234 -706 -782 -110 592 838 179 -714 -764 -252 723 889 52 -683 -782 -107 763 693 55 -688 -824 -88
1512h8P08N2n15p93j30O30P08K94p34p97j1M72Q43K04p54o79k33P08Q48lo33p13
$$ -88 620 672 157 -636 -766 -136 572 866 132 -665 -676 -204 639 843 89 -590 -823 -115 733 730 97 -616
1534f16j42P54O21J17o12q02L4N32O73K51p14o64j55N16Q65Q4o71o93k14P42P23
$$ -616 -758 -4 617 734 122 -680 -646 -114 559 810 96 -568 -723 -207 658 742 71 -622 -836 -94 629
1555F29R5o62p77j0O75O77J11o14p98O3N24O66J62o59o41q7M87Q38N5n82o88k54
$$ 629 724 62 -715 -725 -50 627 738 124 -674 -611 -87 579 741 82 -559 -646 -159 679 734 152 -536 -790
1577g90P12P07N9n34p92o8O35O29J85o79p13L5M75P22J22o55o11j37N64P36R1
$$ -790 -78 629 688 154 -638 -706 -71 558 743 64 -649 -614 -139 583 705 50 -561 -698 -134 602 693
1598F93n84o77j59O56O67Q7n12p81r8O35O20J85o38p11RM90P43L6n82o08j35N49
$$ 693 109 -568 -727 -71 596 683 171 -610 -708 -73 547 732 94 -617 -608 -118 625 661 79 -529 -664 -115
1620a15P47m3m12p37j41O14O18J30n86o58r8N59O38J70o49n93q7N22O83M4m92
$$ -115 632 589 177 -560 -701 -87 531 661 75 -583 -681 -122 516 686 37 -556 -643 -121 562 606 114
1641A14o01j41N53O26O1m95o16j72O08O23Q7m69p72%M48O90M9n63n79q6N17O68
$$ 114 -487 -628 -75 551 612 117 -499 -671 -63 560 647 178 -594 -594 -146 544 593 30 -549 -635 -118 550
1663E50M0m92n73j93O27N32J21n14o22j03M63O51J32n22o06j43N20O52J43n13
$$ 550 590 98 -475 -668 -41 491 612 98 -524 -627 -164 487 619 97 -509 -652 -132 520 663 150
1683A50o67r0N41O02P8n08o05j26N20O62nm18n53j92N36N78Q3n10n92p7M53O58
$$ 150 -517 -607 -66 536 614 106 -499 -625 -105 557 552 134 -419 -611 -75 503 586 76 -516 -593 -140 518
1705E18N5m55o06j01M79O43N6m45o33j07N05N82J35n57n58n1M48N96P8m93n47
$$ 518 573 118 -488 -589 -110 533 589 144 -489 -596 -91 491 626 69 -489 -540 -92 504 582 89 -458
1726d58j25N14N99K5m04o79rM71N64Q6n03n30j28N00N85Q1m60n65j70N62M34J86
$$ -458 -583 -69 530 555 151 -528 -537 -66 498 584 81 -449 -577 -77 508 589 129 -436 -606 -44 390 576
1748E76m76n95p0M60N93O2m80n10j32M85N47Q3m49o13l5N08N14N8m65n03j02M70
$$ 576 100 -495 -565 -105 488 550 70 -440 -572 -87 460 543 94 -519 -554 -46 468 526 61 -442 -544 -74
1770g4N51N6m35n02j41M85M75J76n00n50j08M65N52L4m01n36j03M65M44J60m07
$$ -74 477 533 98 -404 -545 -60 415 591 91 -459 -567 -102 450 484 83 -453 -556 -91 353 513 106
1791A06n80j00M42N47J30m86m40j34L89N78N6l71n64j33M93M55J59m59n32n1L77
$$ 106 -474 -574 -132 415 545 59 -381 -515 -126 452 508 137 -427 -560 -67 388 547 88 -444 -495 -118
1812a18N76P8m40m72j51M62M84Q7l97n74o7M21N75L6m30m85n5L81M77J63m55n52
$$ -118 458 536 96 -376 -527 -65 419 506 109 -465 -532 -111 464 500 70 -415 -470 -89 388 551 96 -456
1834d56nL68M54J60m83m59K1L07N67M1m16m28k06M36N43K6k82n90k9M08M14J01
$$ -456 -461 -93 361 521 38 -421 -400 -93 474 515 99 -329 -535 -99 444 470 188 -402 -431 -23 391 492
1856D92l75n50l6L59M50J30m79l83q4L39N82J6m38m35j18M91M26J0k67n35r8M29
$$ 492 117 -433 -469 -110 340 470 -9 -392 -476 -137 445 461 23 -412 -530 -39 387 397 130 -405 -503 -74
1878g4L97J29m20m78j1L46N25N5m63l32j35L69N22j9k58m69j61L79M16P2k96m90
$$ -74 323 452 32 -446 -457 -111 414 469 6 -326 -461 -92 430 411 153 -316 -477 -98 318 390 94 -396
1900c96k1L07M92Q8m18m78J0L17M54P6l68m19r0L69M49N4k99m43j74M87L50L0
$$ -396 -417 -110 382 470 52 -426 -416 -99 355 431 63 -356 -446 -77 372 426 127 -316 -490 -3 347 377
1922C77k38m83q7L09M56J03l69m07n5L22M58K9l52l37j26L87M37j05k38m25q0
$$ 377 139 -344 -431 -122 334 437 68 -339 -394 -72 386 415 63 -274 -400 -13 424 319 81 -344 -424
1943d24L92L03J40l16m41l4K54L74J83m12l66o1K42N44j7k57m11j39M08L66Jk08
$$ -424 -32 271 411 95 -346 -380 -126 248 431 19 -347 -408 -166 378 361 104 -307 -446 -38 328 329 121
1965A21m85k3M00L05J54m11l69p4K99L79J39l81l05k06L68M42pl12l57j21L71
$$ 121 -364 -387 13 318 472 61 -308 -382 -83 296 435 54 -251 -457 -89 353 346 34 -323 -444 -73
1986g3L68M9k39m50k6L24L05J02l16l71j7K63L95L9k88m09q0L89L93pk41l69p9
$$ -73 295 344 105 -345 -371 -47 258 360 44 -327 -344 -81 314 353 65 -344 -424 -35 358 351 110 -259 -338
2009c38K90L72L5l30l31l4K61L84J36m07l07p2K27M77j3l39l35o7L11L67M9k72
$$ -338 -48 324 359 29 -302 -336 -75 309 445 38 -269 -341 -114 363 350 11 -324 -391 -80 287 336 64
2031F4l63r1L42L18O9k64m29K7K99L65Ml08l37j7K37M24K0l13l26n3L48K95Qk15
$$ 64 -299 -390 -48 270 339 75 -354 -327 -28 337 341 33 -304 -321 -84 340 360 47 -279 -332 16 311 319 104
2055A04l72j00L20L23P7l06l17n4K21L20J58m05k23q2K80L23N2k35l44q8K41L84
$$ 104 -268 -368 -48 275 352 46 -271 -325 -104 216 374 -31 -254 -336 -56 267 319 84 -260 -348 -107 277
2077B77N4k72l81jK90K98J09l13l40p4K89L66N1l14k81r0K94L27k6k13l52o3L28
$$ 277 331 59 -322 -323 -33 265 374 61 -279 -353 -64 302 353 39 -242 -332 -38 289 263 50 -302 -365 -37
2100c7K82N6k36l42n3K36K41J22j97l40m9K84L22L6k57m01m4L45K93K7k33l50
$$ -37 245 301 65 -277 -330 -94 147 269 72 -268 -317 -33 289 325 68 -333 -377 -32 261 288 55 -295
2122b95j6K83K65Q4k76l18L1K01L07O7l05l18OK60L07K3k81k80j8K63K77N1l16
$$ -295 -311 -28 237 321 45 -273 -242 -41 266 333 28 -290 -284 -24 283 306 25 -255 -273 -10 267 318 2
2145Bk62n3L00K40Q6k89l06m1K31L04J04k68l09m7K60L20J1k53k79m1K61K59N6
$$ 2 -260 -313 -13 227 313 24 -282 -323 -92 212 316 48 -261 -308 -48 272 283 30 -249 -290 -29 230 286
2168B86k08k79o9K37L23rk93k31o6K70K55O6k74k90%K18L32k1k21k70p6K16L20
$$ 286 78 -201 -270 -33 290 281 -12 -243 -309 -39 216 282 8 -282 -282 -64 268 247 26 -244 -320 -104 216
2191B16O6k55k11j74L16K76L8j95k94m0J79L44Kk86j93r9K77K19Q3k03k78p7K66
$$ 216 282 27 -184 -358 -42 234 272 77 -217 -257 -78 266 268 -18 -211 -310 -33 186 269 66 -212 -289 -23
2214b3K38Q4k65k88NJ70L53mk46k34n7K29K59R9k59l27m6K90K57L9k45k80l9K63
$$ -23 215 299 34 -254 -249 -79 274 270 24 -210 -267 -38 221 320 61 -266 -312 -22 235 274 29 -251 -290 -27
2238b7K53L3k12l10K6K00K72L8k42k70l1K18K86j8j47k77r3K48K94j1k34k73L8
$$ -27 226 259 47 -263 -237 -37 235 273 31 -239 -270 -52 234 216 69 -208 -301 -53 241 230 -4 -277 -239
2261b39K21K27O8k69k11n9J79L15N0k77k32K5J28K50N7k55k12j8J81K58J01k84
$$ -239 -18 209 277 8 -203 -262 -83 232 282 5 -227 -202 -74 176 233 -22 -234 -252 -71 187 288 4
2283Dk31l4K68K11N3j63l30K6J81K15O2k72j79r0L01J83lj84k47n3K57K01%j36
$$ 4 -227 -261 7 218 271 108 -222 -196 -15 200 262 -10 -189 -279 22 205 202 18 -229 -282 -25 176 176 40
2307D0k69k1K41K21J2k21k03l7K29K68k1j99k63J6J76K41M8j59l34L1J92K12J04
$$ 40 -229 -250 -9 212 224 3 -200 -237 -8 260 239 40 -223 -207 -31 210 258 99 -235 -204 -12 200 304
2330C04k42k75L1J58K07J01k78j93l9J49K93k6j39k15j36K37K09P1j69k53o7K73
$$ 304 62 -213 -182 -24 183 284 6 -187 -226 -77 216 190 51 -164 -300 -63 146 217 48 -205 -272 1
2352AJ59O4k35j88K6J28K62j3j90j45p5J89J89j9j39j76o3K42J82N4j99k63K4
$$ 1 160 224 -11 -199 -173 -45 217 204 14 -131 -206 -17 172 153 14 -162 -225 17 199 253 54 -209 -185
2375a85J99J78K3j44k68LJ50K33M5k11j77o3J99K15l2j36k70L2J44K57K3k46j40
$$ -185 14 192 215 71 -197 -194 -44 189 234 23 -154 -217 -18 197 165 29 -241 -209 -65 192 215 -31 -171
2398a71J5J61J73O7k54j20o9J49K51mj89k10J0J84K09k9j40j88l4J74K01Q9k71
$$ -171 -156 5 178 245 -9 -129 -198 -49 202 198 9 -201 -191 -7 202 173 33 -155 -189 -15 186 275 4
2421Dk42JK34J54O8k45j76J9J43K50o1j32j58j08K40K07jj28k31K1J23J25J0j11
$$ 4 -238 -237 -3 151 219 -26 -202 -183 -40 210 149 17 -141 -249 -9 198 197 69 -162 -141 -18 107 117 6
2445Fj69pJ52J91J2j55j39j04J88J75nj32j28n7J87J83m2j47k19L2J78R0K4j49
$$ 6 -163 -170 -18 173 185 30 -109 -213 -25 150 145 13 -115 -172 15 198 156 9 -210 -178 0 90 114 -35
2469c5j62lJ81J85k1j44j34k1J36J64L5r9k44K1R3K12N9k11j74K3J37J39M2j98
$$ -35 -197 -200 -19 166 145 1 -133 -154 -18 146 181 82 -162 -141 -48 164 223 12 -162 -139 -2 137 179 -19
2493a9j19OP0J79M2p2k28l3J64J35l1r4j95L4J72J03M9j64j93K4J43K12L0j59
$$ -19 -138 -132 -62 117 159 87 -141 -174 -10 125 94 0 -195 -161 11 114 163 -1 -194 -170 -27 185 215 56
2517E6j65p1K17J04l1j04j60KJ71K09q3r1k17K5J67J11K1j19j90k5J58J95M0k29
$$ 56 -109 -180 37 141 110 6 -154 -152 19 228 145 54 -163 -138 29 140 161 42 -148 -173 -15 180 220 -9
2541ij68K7J29J96j04n5j30q8J85J37mr1j69m1K63O1Rk09k7o7J75Q9n1m7j82M2
$$ -9 -177 -150 -21 175 71 16 -114 -202 -17 120 116 25 -144 -185 78 139 148 -61 -88 -155 20 109 58 11 -171 -129
2567a29J58J17k8j06j10n3J70J48p0r1j27m1J05J49M0j46j44L6R9J67j9j35j50
$$ -129 29 146 118 12 -98 -151 19 167 97 6 -121 -162 -57 92 132 -14 -158 -122 -23 144 125 -10 -160
2590a60K7J45J08N1j58j51j2J62J23l9o0j60N4R0J31Lj32j99M0J32J50L2j91j00
$$ -160 -133 12 120 171 13 -138 -150 12 135 96 36 -124 -70 20 151 154 22 -177 -137 -5 145 177 -14 -114
2614a14m5J75J48J8j95r3j4J20Q0N7r7j87L0J31J40k7j24j28j5J03J73Rj26j35
$$ -114 -159 16 164 182 -13 -106 -120 0 80 137 40 -147 -117 14 154 127 3 -125 -140 -37 136 145 19 -116
2638a16K3J05J21Jj19q4m2J40J42m4j23j07k6J07J37L7j55j16NJ62J04p1j57j2
$$ -116 -93 12 133 134 15 -69 -111 29 171 127 4 -103 -129 -22 115 152 -3 -119 -114 48 152 81 -76 -88
2662h8l1J43N1Q3j62j15J4R7J17j9rj72o0J57J11j6j18n4oR8R1M2j55r8pP0J09
$$ -88 -119 24 75 158 -4 -119 -105 -8 109 90 81 -91 -151 6 117 101 -17 -71 -77 21 112 154 -1 -99 -106 -36 73
2689G3Q0j48n6k3O6J08Rp2j73k8J87J15o1r7p6n9J43J19rj08j00M8N6Q2K3j03
$$ 73 153 5 -51 -74 -8 100 109 37 -136 -164 23 138 77 -20 -96 -155 -12 107 98 -10 -110 -62 -6 76 99 -4
2715dr8rL7J77l1q7p1j9O2J66K2j46n5K8O1P1j4r0p4l7J19Q5j2j09p8OQ9O4L2
$$ -4 -102 -111 -74 103 72 -15 -86 -105 -43 123 145 -1 -56 -28 33 104 90 0 -74 -111 8 93 81 -28 -106 -100 -11 53 85
2744H5r4j04N9M7R5k0o7j12L5J00Q8pj20j04M9Q2J03J9j26j87J51J4J12Mq8q0
$$ 85 -9 -113 -54 -7 88 68 1 -111 -76 24 112 105 -15 -119 -70 12 115 134 8 -179 -28 -14 98 102 14 -66
2770f6kQ2P7J7j12r0mP5M5J03r6j66M9R4P5o1k3j05m3J64Q5l3n5j21L5O0N7J7
$$ -66 -68 14 91 108 -4 -94 -98 -23 22 125 29 -137 -88 6 81 20 -3 -108 -151 13 98 65 10 -111 -76 -16 41 58
2798E8p4q1QQ7K2O7n2j02N4K7J19l6j12n3mR0J03mq8j13j7J57N8n7n6j33M9Q6
$$ 58 -16 -97 -89 -2 20 87 35 -67 -13 14 133 97 -15 -68 -72 18 121 117 29 -84 -101 56 114 57 1 -132 -83 3
2826CP4L8j04q0m1J32N6K9j48j04Q6M5R6nn6p8j2R5R2o1o0j10Q0O0M9L2j03m6
$$ 3 77 115 11 -69 -110 22 78 107 -41 -145 -59 -14 82 77 21 -57 -69 26 118 57 -3 -113 -33 27 76 108 5 -41
2854d1j5O5J11m9j04n3K5RJ85r3n5j00RR6L8L4j02q6O7Q8K0Mq9NJ2M3L1L5j08
$$ -41 -56 9 120 71 -33 -86 -61 -52 133 40 -15 -115 -106 -10 28 62 -40 -126 -59 29 49 53 -36 -31 -19 24 55 90 -18
2883a8m9k3J03K4N4j52l1O9M7O9l7p8l0m1N0J12Jpj28j9J8J49k6q7o8O7j0R9m7
$$ -18 -67 -90 13 37 91 -61 -92 -23 24 93 56 -22 -52 -93 -43 69 70 63 -65 -84 -66 83 57 -30 -98 -31 -41 58 11
2912A1o7K0rJ09n7O6q6n1L5K1J6M5n1p7L1O9Q9n8m8n3k8J27NLp0q2K9N2K0K3m6
$$ 11 -56 -36 -45 64 7 73 -13 -64 -29 -8 8 53 2 -75 -44 25 114 56 8 -45 -73 54 59 62 -8 -90 -61 -9 11 34 -12
2943a2k3r5Q8J38q3Lq8J4N0L1jo8l4J7O0O5l8p9j3J6Q8K9m2nq8K6P6P7p1k5p7
$$ -12 -35 -130 -42 96 13 16 -72 -58 -8 23 22 -46 -80 -63 -3 62 24 -55 -68 -52 36 65 23 18 -70 -44 32 109 38 13 -64
2974f4M5N6NK9p9p0O9L4pK3j02pk6J26N7qq7l0k1QO1J8j9o0rR4N2Ro4p3N3M6K2
$$ -64 -19 37 42 71 -8 -78 -9 25 18 41 -61 -68 -94 32 89 81 -6 -36 -57 -49 12 30 11 -49 -58 36 88 97 33 -40 13 59 81
3007H1l8q1JJ1M4L3k7k7q4K5Q0J1k4K2r7QO7M0kn3q5N0J8L9j0j4k2KN1j1O5n8
$$ 81 43 -38 -37 -26 18 51 24 -3 -87 -62 18 29 5 27 -70 -62 5 45 43 -10 -95 -45 -27 12 2 -12 -34 -32 19 8 73 15
3039A5q0Q0LO7k0l1j09L9N8L8j7r7L3j0Q0rJ4q8l5P6ML2l7j4q0j4N7J03J8r0l9
$$ 15 -65 15 18 85 65 34 -75 -36 22 60 43 -54 -21 -31 49 40 54 -34 -69 7 11 43 6 -8 -88 -102 -45 58 76 -14 -53
3070e3K1J2Q5k9l6k8j0N2lK6l3n1K4Q9Qj8q0j3kP0orJ4o6L5QO2Qj01m9P0L9M3
$$ -53 -32 -20 65 36 0 -28 -38 14 11 37 4 -47 -23 66 74 56 -24 -37 -39 31 25 16 30 -36 -1 7 69 77 -24 -73 -3 36 79
3103G9q5m8L4j4L7oO0r9j8oO5M5j9q0LK3K2O7no0lk3P9oj0l7j2K2N3Qj1l5j07
$$ 79 -6 -54 -20 -34 3 -3 57 -42 -60 -66 -1 44 25 -55 -52 -29 -7 60 55 -5 -8 -31 48 42 32 -5 -17 5 58 66 55 20 -87
3136h7Q9MO9l6m3o7O3L1%k9nl2k5P6L2k8m4k8M9%Q1n0o4M9NqL3J0k7m1rO0M1j7
$$ -87 2 6 75 39 -4 -71 -8 23 23 -6 -11 -43 -68 8 40 12 -32 -60 -11 -11 70 20 -44 5 10 2 35 45 18 -23 -32 28 69 52
3170E2p5L7m3L8K5K1q5J3OL7RK3p6j4k9M6N3l1n4K6k5N3L3K6n2MN8p2N1J2o6l5
$$ 52 -23 14 -29 9 34 55 -30 -17 -11 26 35 58 -18 -32 -61 -15 38 7 -47 -21 -46 7 40 66 14 18 76 4 55 67 1 -34
3202c4KL2qM3l4l6M2%j2O1p0J2l7J08n3K0l7k0K0k2N0j9l9M1l9rK6J6n7N0lJN1
$$ -34 -32 0 -8 35 1 -35 7 7 -5 56 -14 -2 -39 69 16 36 -1 -21 -1 -23 27 8 -31 10 -29 -38 -12 4 -53 -3 -6 -5 46
3235D6k4m7kPN0K9r0J05q2rOK6LL7n1L3k6J8lk0J3m0Q4n3K4m1J3j3J4Rkj9l6M4
$$ 46 22 -25 -27 -20 30 59 -31 74 -8 -17 -11 15 18 55 4 37 11 29 26 6 19 -21 63 10 34 -7 6 -7 7 16 14 -5 -41 3
3269Cm2N1nkk7J6J4k4JJ4J1JJ6J1Qn1j6K9K5K2k3l8M5o2O4kk2o5qO0M8q4O0n7
$$ 3 -39 12 7 5 -22 -6 8 -16 -15 -1 10 11 27 38 46 -5 -21 8 33 55 32 -6 39 -23 41 39 17 -48 -56 4 52 -32 28 -29
3303b9L4l0pM7j5m1jQ0k5K8k9o4L8RQJ5K3j9m5L7j2K1lk5j3K7NO2on7o2L8J7j9
$$ -29 5 -25 -32 15 0 -41 -42 38 13 41 12 -52 -14 -5 3 18 41 22 -23 14 2 23 20 -5 -18 9 14 76 70 13 -49 -11 6 -13
3337a3M6n6K6J7j1k4Pp1N8L7nKJ0m6Rk1L1K3Mn5j4O9kj3k3J1m6K4K1K8j2Ok2K9
$$ -13 33 -23 3 20 9 -15 -8 -79 -21 16 11 13 23 -23 -14 -35 -4 19 23 -32 -46 23 21 8 -15 -4 -50 -26 -5 23 11 17 -5 24
3371B4n1O6K6r3ML4mpj3k0N4ol2l5K4L8m7M5N0p4M6p2RM0j7L4m8J5O5k3m3O3m0
$$ 24 -27 39 65 -28 -24 10 6 -1 -14 -34 20 14 -18 -53 -29 9 -38 7 57 -17 29 -43 -34 6 -11 23 -25 -10 55 32 -11 52 12
3404A2k5lJ9j1LN2n6pkM3l6K8m4N2j6K3j0pj2K1rj1Rm7J7K5j5L8p0J8J2N5j1l2
$$ 12 -13 -16 3 -8 -5 47 -9 -16 -18 25 -11 17 -27 25 9 32 22 15 3 24 15 4 13 -34 -17 8 -7 31 -39 -21 -9 46 35 3
3438Cj7K4J2o2J6N4Ljl9qJ8K8m0l3j4O6n2J20j10L7k7J2M4n4K8JK0n3Rk8J8O0
$$ 3 -14 10 22 -40 -24 30 33 32 -7 -15 3 31 -9 -42 -56 10 -42 78 -32 5 -22 -10 34 -20 8 9 29 -24 -15 -43 -25 35
3470C5n7kN1ppol8pQP2Ml7LnK4L5p7L5K8l1J2m2L5o1M5k6lK1K8k4l6L6N2nj0q9
$$ 35 -22 -24 27 20 13 7 -31 -38 -30 42 46 9 12 7 31 66 -11 24 52 21 33 -9 26 -35 10 -16 -19 2 30 6 -30 6 58 53 43 -46
3506d6LJ8K4m0K4M9k3l9J2L9m6K8L1j7K7Lp7N3j2k2N1L4n4n7nM6N8l2m9Q5j02
$$ -46 -43 -25 -1 -41 -17 32 9 -30 -18 21 -25 3 34 17 44 47 -30 23 11 -11 40 74 20 -37 -42 4 62 30 -19 66 -36
3537c6O2l7L8m6JJ2k6M0j8K2l6J6k4J7K3m6KJ3l4R0Lj5j8l0L2L2k9k3K0K1%J6
$$ -36 26 -11 27 -19 -18 -6 -32 8 -10 12 -24 -8 -32 -15 8 -38 -36 -23 -57 33 36 21 3 -27 5 37 8 -15 5 26 26 42
3569D2l2K4k7oQ7m4k8nnok3mK8l0N1jMK5n9PJ5m2Qn0O3j4N4l5j8J7N9m3%l4M6
$$ 42 10 34 7 1 88 44 16 11 6 0 -23 -27 1 -29 22 21 25 50 -9 -2 13 -29 -21 -71 -8 -22 32 -3 -21 -4 55 12 12 -22 24
3604B4J3%J8q1O0o0R1o4l6K1rM0k1L6o4j6L4mL3k2M8m6j5mL3L0l2m2OJ3O2l8j1
$$ 24 37 37 55 -26 34 -26 65 1 -35 -14 -23 17 -4 32 -32 -48 -14 -18 15 -7 41 -5 -20 -24 9 39 7 -35 -29 -16 46 8 -3
3637cj6OK7mJ4j1l0rJ9K7k3N2m8pJ7K6j7J0p0K2J6J1k1Kjl5K1J6%k5n0M0N4J4
$$ -3 -19 -13 14 10 24 13 -17 -26 -7 20 -3 49 1 -6 11 37 20 30 -40 -18 -2 9 -12 -10 -11 -46 -25 -9 -9 -34 -84 -44 10 24
3671B4p8N2j0l0M5L2k5Kk5k6M9j9N6j8m3M0q3O1K1k0j7KM7m1lJ2J7n9K2K7O1q9
$$ 24 -54 -2 -12 -42 3 35 10 12 -13 -39 10 -9 47 29 -14 26 -57 4 25 5 -12 -10 37 -4 -7 5 22 -37 -15 12 73 -16
3703a6oM6m6mlL0m9L7L1Ok9j5qm0L2N6Pn8j4N0L8QK2o3Qk0K2Kl4oJ5QJ9n8O5j5
$$ -16 -22 24 -22 -26 -29 1 -48 -11 20 26 -3 -18 -26 -66 -34 22 29 -29 -43 7 45 53 75 12 20 0 22 24 -10 -16 -1 7 26 -32 33 18
3739A8p3N1m8O7nOn6L0QK8n6j6J9PJ7j4K4rj3k4N8MJ4rj7k4M4j6j1Pj3l6M3N1
$$ 18 -55 -4 -52 15 10 16 -40 -10 -2 26 -30 -46 -27 -20 -3 -17 7 -2 -15 -39 19 23 37 28 11 -13 31 15 4 11 -2 -38 5 56
3773E6o7JK5n6O7m9K5l8k4J4N9%Pk0m9K4L7j0j6M7k4J7q6P3k1J5m6K6k9P1L0m6
$$ 56 -11 -10 15 -41 26 -23 2 -36 -60 -46 13 13 20 0 -49 -25 12 2 -14 33 9 26 -60 13 -8 7 -39 -13 -42 29 59 13
3805A3J0k9J4j0K9j8qJ3pL1Pj4j34P0L5rK2n5J7j8M5P1j1m6r2Q4JO2r4pL5j2L3
$$ 13 23 -6 8 -2 27 9 1 14 7 38 45 31 -103 -33 2 -7 15 -40 -23 -41 4 75 64 18 -74 10 11 73 -21 -28 7 -5 28
3838B8J4K7n9RJPJ5k6mJ3pK0l0O7j02N2n0rP9j5m4K6n9N7K6Kn9Nj4J0L4k4lj8
$$ 28 42 69 10 19 20 27 42 16 12 25 18 38 8 75 -27 25 -25 -34 45 30 -14 12 -47 10 36 38 -21 -16 -30 -20 14 -10 -13 -31
3872c1oM9N7l6m2Mk8P9k3Rj6p%LNoJ6p4N5%M1n7Pk4O2p4O6j0ok2lK8J4l2j8l0
$$ -31 -37 12 69 33 -9 -5 -33 46 23 32 16 9 9 12 17 11 27 -47 8 8 49 -8 -1 -25 37 -37 29 19 13 -9 -12 16 30 -2 -20 -50
3908e0L8O2o3N4l7m2j5K9J3l5N4n1M9L8k0K6m4Mk4L0O6l7m9l0J3OK5Rl4l3O8o6
$$ -50 -12 50 -13 41 4 -38 -53 -24 -11 -46 8 -43 6 44 24 50 6 10 -14 16 82 45 -4 -34 -21 -15 10 19 -15 -48 20 -46
3940d6L7L0k1J2J0k9J3j4l3plL7J0M0n5L9km3P9n1j5K4kK8Kpj7k6J9L0m1J0ml5
$$ -46 -9 21 0 12 22 -7 6 -8 -41 -48 -51 -14 -4 36 -19 20 18 -25 54 3 -12 12 10 38 40 33 16 -10 9 39 -2 8 4 -31
3974c1J1J2P6p6M9k0k6l7M2mJ3j29P4N4K5l4k8K1k0O8jo6N7o6J2N5j8J8l7k0j3
$$ -31 -20 -8 68 -8 41 21 -5 -42 0 -4 9 -120 -46 8 33 -1 -29 -8 -28 40 39 -27 30 -36 -24 31 13 31 -6 -26 -39
4005c9M5K2k8j4Qn9O3j7P3l0k6lOj3J4j3LJ3k8N8o9J6m0O0L5l4J7pm0JKL6L7l8
$$ -39 6 28 0 -14 -6 -65 -2 -19 54 24 -2 -5 1 -12 2 -11 -8 5 -23 35 -34 -18 -58 2 37 3 20 13 -27 -26 -24 12 49 11
4039A1k2ML0M9o2Rm3L4QjJ3k6Q%pN9k9j6n3kN2l1J1q7Q9k1j6M6L0m4J5J3L1n5
$$ 11 -11 -7 23 72 10 19 -24 10 18 17 30 4 12 12 5 64 35 19 -34 -36 16 -15 -4 -91 -2 -23 -39 7 37 -7 8 21 52 -3
4073cj4Rm4N2mM3k9pk5K8J8J6o4RL2J7o3J11r9J8%j0NL0k8m1JK1N5Kj4n3ojL8
$$ -3 -17 -8 -52 0 -4 39 10 3 -22 6 24 40 -24 -15 17 34 -29 82 -17 1 1 -9 -4 26 -2 -43 -42 -21 34 36 22 -31 -37 -38 0
4108@N1j4o9M0L4rQm8oj7LO6%l6j5m2J02K6k4j5m7LL7j3L6pm2m6M5j8nK0J6l0
$$ 0 51 37 -32 8 42 33 41 -7 -13 -30 -27 39 39 3 -12 -54 48 74 50 35 -12 -9 28 15 51 44 2 -44 1 -17 -22 -2 14 -16
4142a6OP0j02L4m2N1n5M2L9Or6N6k0K7J00m9p1l3J16l3J0J3n2q1Q2M0Mp3J9Km0
$$ -16 -10 60 -42 -8 -50 1 -54 -12 27 33 -63 -7 -27 0 100 51 -20 -53 63 30 40 53 1 -80 2 42 46 -27 -8 -6 -46
4173d6J30n2K3j28M5J4K0J6Pn1J1J0NK3j6p0M7J2JN2Pk5k8p5J11Om0L2p1Q9n9
$$ -46 84 32 55 -73 -28 -14 6 22 29 -22 -11 -1 4 27 11 -59 -12 0 1 53 60 35 7 -68 43 49 9 41 -30 59 0
4204@J3J3Om0L1N9m4lo5k1O7M1m2J7k8k7M3Mnk4j8NJK1mK0j0rj5O0Ml9Rl3kP4
$$ 0 13 26 32 -8 23 82 38 35 -30 -51 16 57 15 32 4 -23 20 24 19 -5 -23 -18 -17 4 0 20 10 1 -14 46 50 11 20 -13 -15 59
4240E9k4Lj11P5j1j0M6M5n4o8N4O5o9k7M9j5k7K3M8mm9k2N4k2n1J8J4j8J0NO8
$$ 59 35 38 -73 2 -9 -19 27 72 18 -50 4 69 0 -27 22 7 -20 3 51 47 -2 -24 30 8 -43 -25 -11 -29 -19 -14 54
4271E4m8r9K2Q2J0MOl3m1R0L4m8k2l9K1MJ9M2m6k7kJ4O0k6l9K6l8K8j2N7n8m2
$$ 54 6 -93 -71 11 21 25 31 -2 -43 47 81 33 11 -28 -7 -3 16 58 12 -15 -17 -3 57 31 -8 18 -20 8 -4 53 -5 -47
4303d7N0mJ0rl0J9K3l8J03l3n3l1M3j1K6j2j7M8p1K8LP3n6lj0j8N7pn7J5M8o1
$$ -47 3 -1 9 0 -30 -11 12 -26 77 44 -9 -40 3 -8 18 6 -11 37 -34 -6 -3 70 14 11 1 -17 40 33 -24 -9 39 -22
4335b2K9lRl0o7N9M9L1o3qOJ5M5n2j7k6K5K5k0O1ml8m3j8J01nl5Mj1K3NL5nn8
$$ -22 7 4 13 -17 -84 -25 24 55 -8 -16 -10 5 50 -2 -19 -45 -20 5 -15 46 42 4 -39 -57 44 39 4 8 -3 20 25 60 55 -3
4369cnN0ojk9k0qj0N6J1rk0r2R0j7J4Ll2J3J0%K7Jm8J3O9p3J8mj6j0n1J45o0n
$$ -3 -8 42 36 35 6 -14 -22 -32 24 35 26 6 -86 4 -13 1 4 -28 -15 -5 -5 22 23 -25 -12 57 -16 2 -2 -18 -28 -79 66 6 1
4404Al4O9n3L8k6j5kj4Q7Pp5K2l1J0j8K7P0n4l2K2j1L4J3pp0k5K1O6O3j5p3L7
$$ 1 -33 36 -17 21 -5 -20 -22 -36 51 58 -17 5 -26 -16 -34 -7 63 9 -23 -1 -12 22 35 28 -42 -67 -46 20 83 68 -5 32
4436C2m5O7j9j1l9J0J4mpQj2l5N4J3mnpm6M9K5j2j6k7j1j9P3mn5l9M8KK8J5l1
$$ 32 -13 54 35 24 -15 -5 9 5 -2 6 -6 -41 13 26 22 17 10 -36 13 38 26 10 -17 -28 -47 26 22 -33 -72 -24 -22 6 21 -10
4470a0m1L2J5N4l8qn0K7kMN4k0n7mO9pM6k3o3M2k8MN0j0l1j4o8N5P4k7j03L4L0
$$ -10 -51 -19 -4 50 12 4 -46 -19 -21 -17 37 17 -40 -44 25 18 64 41 -22 20 -8 -4 46 36 5 -9 -77 -22 52 25 -78 -44 -14
4503a4N5l8m2N3m7O0J4Pk1n5L0J1J3L2k6m0k5K0O1j3OKl0m6L7J8qJ9o6M8K0jR
$$ -14 41 3 -39 14 -33 27 41 48 27 -28 2 13 26 58 32 -8 -33 -13 48 35 41 43 13 -33 4 22 14 33 -33 15 35 34 43
4536D3n0n5N3Qj7j0l7lO7K6J0m3j1k6J7N4J2p3kK7KK5M0n2k4mJ8N1MQr0K3JM9
$$ 43 -7 -62 -9 -1 -18 -28 -65 -68 -1 25 35 -8 -19 -45 -28 26 38 -35 -37 -10 -8 17 57 5 -19 -23 -5 46 50 58 -32 -9 -8 41
4570D1lj3l8J0lL8K5n6k8LNN3m9J5Po0Q7l9K6l2j5l6N1P0N5j17m5M4L4j4Ok0l
$$ 41 38 25 -13 -3 -6 32 57 1 -27 -24 -19 34 -15 0 7 -53 34 -5 21 -11 -26 -62 -11 59 114 -3 -48 -4 30 16 22 2 -1
4603an2R4mk0Nn1J3P3q6J03j07j6M9j0N3k2Kn3Pj5O2k3j3kj5J4J8J7n3K8k3Q0
$$ -1 -53 41 37 17 22 -29 -16 57 -29 74 -33 -49 0 -10 43 21 23 -30 -23 -38 24 1 -12 -14 -29 -15 3 20 -33 -5 -28 52
4635E2o3O0m7o2k4J29Pqj1l1l4N4l0M0k4qMoj0L0j2r4J43r4O3j5k4no6Q0pK5M4
$$ 52 -11 49 2 -60 -84 45 52 44 33 2 -32 22 -8 32 8 0 4 -2 -12 18 6 -88 55 -39 24 9 -15 -20 -86 -6 -13 12 56
4668E6r7J6j7N9M9p0L5j4j8O5q1L4J4m0N2qLl8l0L9m8O1l1k8N8o4O3k5QRk9J4
$$ 56 -41 -25 -42 17 66 -4 31 17 -1 64 -17 17 31 -9 43 35 38 0 -30 9 -39 22 -9 -37 21 -43 20 -5 3 12 -17 -3
4700cnj3K3K4m5PJ6J7LMm4k7J7L4K0olm6K1J2J0k0l2K8K7k1jK7q7L6P1m9J4K7
$$ -3 -8 -21 2 26 -19 -12 4 21 24 28 -16 -43 -26 8 28 22 19 -27 -6 6 16 -4 -36 -8 19 -2 -3 24 -63 -27 44 -5 9 36
4734C6m7NnM4K9n5q8M0R1q2M2J6r7O9J0P6p7J1j7l6O3n1M2m5L7mKL6n1%k0n4P7
$$ 36 -11 -6 -11 33 62 7 -81 -41 50 -32 10 26 -71 -2 8 84 7 18 1 -35 28 -23 19 -26 11 7 9 45 -6 -6 -26 -80 -3
4767cL5k5pN1q7k7M9M1r9K9l2L5R7l7o3k6N0J4k4L5ol3k4O4j1K2j7o3J0N6L4n8
$$ -3 32 7 0 51 -36 -63 -14 27 -72 -43 -75 -40 57 20 -43 -69 -19 -5 -29 6 0 -33 -57 7 -4 18 1 -62 -52 4 38 -20
4799b0J1p1J11k5k1k7K5J8lR0o9Np0j4j2M7O7l1l8qpN5q3R8o2l5kO6K3m5K5l1
$$ -20 -9 -80 31 6 -15 -42 -17 1 -2 88 19 24 -46 -60 -72 -25 42 11 -27 -35 -42 13 -70 28 -34 -69 -71 -5 18 -27 -2 -33
4831c3MRN4K1o2k3N2J5Nj5j8n8j3M7M9J1J7q9l3J08N6p9n6n0M7O2l5M7m0m9j1
$$ -33 -29 -20 34 55 -7 -30 22 37 42 27 9 -49 -62 -15 34 45 62 -27 -60 48 104 25 -31 -81 -34 28 -7 40 0 -49 -60
4862f0Q7J1m8j7pj3J04j00O0J4n5K9q6R9M8o4k7JM6K2k7n1M1j8N1O9r1Nn5J1O
$$ -60 27 38 -10 -27 -34 -47 57 -43 17 31 -24 5 -81 18 66 2 -25 -24 22 44 17 -34 7 -11 40 109 18 23 -32 -21 -15
4893a5K7j0q7N4k0O7j2J0l1l8L0n4Q3L1l0Km8L8N7l9K4K4j3o8M0pM7j02K8M4K
$$ -15 12 2 -85 -31 -51 16 4 14 -17 -55 -25 -79 4 35 5 7 -41 -3 54 15 39 63 50 -18 22 15 62 -40 -12 32 34
4924C4Jk1rJ5j2J1J7n5P9o8N6m2L5mo6k0pM5M8o2j2MJ0K4k5k0J4j0M4J8j5J2o7
$$ 34 35 14 5 20 8 19 36 -19 60 -8 48 6 41 37 -29 -49 -56 -11 37 -25 -37 -33 -23 1 -24 -44 -30 -40 4 22 7 19 -48
4957d8N6kMP4q6nM8l4oJ0M1p6M0KL0nl6K4l0RN5l5m7m6J20p5O1Mo5jMP5k2J2m9
$$ -48 8 6 10 84 -2 -7 41 7 1 11 52 -24 16 18 48 43 7 31 1 10 65 30 -17 -63 57 -18 43 47 -18 -19 -15 60 38 50 1
4992Aj0l5P7N0k4n6k1pM7j9j7J9mL8l1j1K5l7rL5j5P%j3Kl7P2J8j2q5M9l8L4M2
$$ 1 -9 -44 33 83 59 3 -18 -25 22 3 -14 5 1 39 8 -3 22 -15 -24 11 -4 3 3 -10 -8 -45 27 45 33 -52 -3 -41 -7 35
5026C5J5l8n0jj7J02m5Km2JN7mJ2n5k1RN2L4j3n8J1kM9k2J0j2l9K7P4j8m1Oq4
$$ 35 50 12 -38 -39 -56 46 1 3 -39 -38 19 15 27 -28 -49 -40 12 46 33 -25 -14 -16 33 11 21 9 -30 -3 71 53 12 18 -66
5059f6K3PP0k7n8K7M6k0M2o0K5m4L4%j8K6k8j2K3M0M7n8k4k5m2N2N4j2J5r7L2
$$ -66 -43 -36 34 7 -51 -24 22 2 44 -16 9 -35 -1 -1 -19 7 -21 -33 -10 30 77 19 -5 -30 -72 -20 34 22 37 -60 -28
5090b8L6J7L0o3K9o4M3K7kn8L8j0J6JL9p2J3J3l5J22l9m8j1l1nM5l6J3krL8J6
$$ -28 8 25 55 -8 21 -43 0 27 25 -33 5 -5 11 12 51 -21 -8 5 -30 92 53 5 -6 -37 -42 3 -33 -20 -22 -31 7 23
5122B3M1o8p5K1R1J3l7J4q0L4L5N3n9ok0j6Q2p4L2Kl3l7O9J9l4L3m6j2M5M0n3
$$ 23 64 -4 -79 -58 33 46 9 23 -57 -23 12 65 6 0 -20 -36 46 -28 4 6 -27 -64 5 24 -10 23 -23 -35 10 50 -3
5153cM4o3p9J44J3m8l1KQ7l0oK4o6ljJ0L1rl2K1n4rJ39o3k9OnM6q0Q6rm0olkp
$$ -3 41 -22 -101 43 56 8 -23 -21 66 36 30 54 -12 -15 -16 -6 25 16 -16 5 -49 -58 81 18 -11 -5 -10 36 -44 42 33 -7 -13 -16 -18 -25
5189b5K9Pq0P5L7M1r2l5M0K3J5j6j4j4k3jN7Pk0m3L8rK8K6p5%M8k0rK4l5o4N1
$$ -25 4 11 -69 6 43 84 -8 -43 -3 20 35 19 5 -9 -32 -33 24 31 11 -32 6 -3 25 51 -24 -24 24 4 -5 19 -16 -80 -29
5222b9R0m2k7k9M5n5M6L0l5%k5J9J1L7mk4n1M9J5%%n5QK3L4om7k8J1M1Nk4J3%
$$ -29 61 19 -8 -37 8 -47 -1 29 -6 -6 -31 -12 -1 36 32 8 -43 6 21 21 21 -34 -26 -3 31 25 -22 -50 -39 2 7 -17 -4 -4
5256dk5N7mn1K8k0l1J3K5%O4p5j1J3k4P4kn4j1RLJ9J9l4N6n5mP4p4ok3J9M6O6
$$ -4 -29 28 24 -27 1 -19 -50 -37 -12 -12 52 -23 -34 -21 -45 29 27 -27 -38 -29 -26 -7 12 -22 34 -21 -25 49 -25 -31 -54 -35 11 77
5290G7k5l9k7LJ1pJ6p1j7L0M4l0M4k5K7k2%K9o6K3Ml4N3M3K8o8k4OK9Nn4L3K1
$$ 77 52 13 -14 -11 0 -7 9 -62 -79 -49 -5 -35 9 -16 11 -11 -11 18 -48 -25 -21 -55 -2 41 69 1 -23 -17 12 17 -37 -4 17
5323A7l2M8L1l0mm4Kj2O2k5j0l6k1M3J7j2qJ0J8j2J9ok4l3rL6O3o0M5o3J8rJ08
$$ 17 -15 33 64 34 30 -14 -12 -24 38 13 3 -33 -54 -11 6 -6 -14 -4 14 2 21 15 -9 -42 -51 -15 48 -12 33 -30 -12 -21 87
5356H7p0m9L7m6M9J6K6m2j9j5L7Nn3K3n5P5m6K6kl5N3rJ6kQn7j2K9KM9o7K1k7
$$ 87 17 -32 5 -41 8 24 50 8 -11 -26 11 16 -37 -14 -69 6 -40 -14 -16 -51 2 -7 9 7 15 -42 -54 -25 -23 26 -41 -20 -47
5389d7L4mk7O5k8l8R6k8%mQm4oM1L6o1Nk4L6k0K3j6j2K2lQ7l6r4MJ9J9j9K8k3
$$ -47 -13 -17 -44 21 -7 -45 51 23 23 19 27 -17 -23 18 54 -7 -2 -26 10 -10 13 -3 -15 7 4 91 55 -39 -35 -16 3 -16 12 -11
5423a1j1j2J7lJ5K8m2j0Qk2Q7k9pn0M6K5mn4J6Pm5M5K5k1o0P7n0L7l8N4Qk8j9
$$ -11 -22 -34 -17 -20 -5 23 -19 -29 -21 -43 44 15 8 -42 4 29 25 -29 -13 -6 -51 -6 19 -2 -62 15 -35 2 -36 18 26 -2 -21
5456b1l3R6m9K2Nk1mM7p0krL6m8L5J1J3k8K4K8KJ7o1j8OK0N2q1j7J3L5K6K0p8
$$ -21 -54 42 -7 15 20 -1 -5 42 -28 -30 -39 -3 -51 -16 -5 8 -20 4 32 34 51 -10 -28 -22 -2 50 -31 -48 -35 0 26 46 -32
5489c2mqM4pK7l9k1roL4N6q5J0ML6M3j3j6l7j5L4L4l6lm4K2J1M7pn2M4j2kJ7M
$$ -32 -36 -44 0 -7 20 -19 -40 -49 -55 -21 35 -50 -40 -36 0 43 30 14 -23 -38 -4 30 -6 -9 -53 -31 -20 27 20 -32 12 0 -2 15 19
5524A9J2n6k9K3L6J2l1Mj8K6K7l8MJ1J7j5j0M8j5k5o3M2qQ6m0Oo6M4J3l4J4Nm
$$ 19 31 -25 -54 -31 5 17 -14 -10 -28 -2 25 -13 -9 2 19 4 -6 42 27 2 -61 -19 -27 59 19 25 -41 3 16 -18 -4 1 -3
5557cK5j3NL1l7jl2J6K7j3J1m4J7JL6k8QM4q0J9K7l2k3M3k8QJ5O0r4k8L7L2L0
$$ -3 22 9 14 45 8 7 -25 -9 18 5 16 -28 -11 -10 26 -2 6 50 -30 -11 16 -16 -39 4 -24 -16 -1 59 -35 -63 -26 6 36
5590C6p2Nj7K3N4M4q1Lk2j5O8L3l1qJ2m8K2Nk3Ok2L0k3N0po3j7O1nP9p0p3P2k4
$$ 36 -36 -31 -48 -25 29 73 -8 -5 -27 -42 26 59 28 20 32 -16 6 11 -12 -6 -28 2 -21 29 22 -41 -58 3 -2 77 7 -66 6 -18
5624a8K3Jpk9J1k0M6O5r9Pk6K6M9lj6k2NMJ1L6m1k8pK5j0RQK8o1O8n6J0O8q2K
$$ -18 5 6 -1 -30 -19 -39 7 72 -27 -20 -46 -20 29 26 10 -12 -7 -3 8 44 3 -25 -32 -7 -17 -8 0 28 -33 35 -21 -11 57 -25 -23
5659b3K6Kj2J7l3Nj1QN2k%Lk9kK4J9p7j3K5J1P6l1j9qm0N9j9l2lK0rP2l5J0Jl2
$$ -23 3 5 -7 10 -23 -18 -29 -21 31 29 29 32 3 1 25 44 -33 -46 -21 -10 66 35 16 8 -32 27 8 -24 -27 -7 -16 56 21 31 32 0
5695@K7j3lJk4k0j3Q3km0jm4K8p0J09l1mj6N8K3k1k1m2L7mk4LM2pKj9M5k1K2k5
$$ 0 27 14 11 12 -12 -32 -45 38 36 -4 -5 -49 -21 -91 18 -13 -17 -33 25 48 27 6 -36 1 -3 -27 -24 18 11 13 -6 39 18 40 15
5730A5q0Q6pK0j3n0kL2J4M9r1K1rJ3KMm8K0k2N8m3J9Qk0K6oJ1l7N5n5K2M6nJ0
$$ 15 -65 21 14 34 21 -29 -31 1 15 64 -27 -6 -15 -2 0 4 -44 -24 -46 12 -31 -12 -4 -24 2 -4 7 -30 25 -30 -8 38 33 43
5764D3j5nn4M3O6r4k0N3p0L5J2k1K5k0k0O2k8j4K2p4M1j0L5Q1j08J7RlN4k3o0
$$ 43 28 23 -31 12 78 -16 -36 17 -53 -18 -6 -27 -2 -22 -42 20 -8 -22 0 -74 -33 -43 -8 73 -35 -18 -9 -12 42 19 -41
5795d1M1j7K4K3l4Qnkp9J42Mk1n0j1M6jqkm7M9l3L4M2j05m0N3M2pj6J1k%j3NJ5
$$ -41 0 -17 7 30 -4 4 -1 -3 -82 60 64 43 -7 -18 28 27 19 17 -30 19 -14 20 62 -43 -83 -30 12 5 -11 0 -2 -2 -15 -10 5
5830Ej9L5l5qN3Qo3L7ok8J02k2k4k2l9P1n8L6o7P4n5K3J00j29O1j8k1oJ1K9j6
$$ 5 -14 21 -14 -22 31 39 -24 13 7 -21 81 59 35 13 -26 45 -13 23 -44 30 -25 -2 98 -31 30 12 -9 -15 -4 25 9
5861Il3k7O0j4lJ3K8n0OJ2M1k6J6l7pK0O1o3m5J4rN2jJ5n3j1L6j9L3j1j1Lo1J03
$$ 9 -24 -51 9 -5 -8 5 33 -17 -11 1 42 16 32 -5 -12 8 69 6 -39 -25 -34 18 17 32 -21 -32 4 -15 18 7 -4 -1 -62 41
5895D1oMl2l2J7MO1l0j5l7PL8l5N4m1L3m1MK5KK3m2J2OroK4rn5P4Nl1pR%L4m0
$$ 41 35 39 7 -25 -8 -4 57 27 12 -25 -18 20 -15 39 -2 31 -10 -6 19 21 44 2 14 20 11 5 29 20 -35 39 44 13 6 15 15 49 9
5932Ipk2K2J1L2l2pn5RL0PJ0jlj4Oj1K9k6j4RJ6rRLm9M9kj2J5o1L0n8J04l9L6
$$ 9 2 -20 2 13 45 13 6 -49 -40 -10 -3 7 6 3 -11 -5 -16 13 -13 -27 -18 -2 -11 -2 1 -48 1 -1 -13 2 -59 -29 -87 17 -22 14
5968A4L6m8J7qK3j7k0j5nM0j2j1J8m5J0k6R6j1k1l1l3O7rkK2l5l3M8J1l2K8l7
$$ 14 50 2 19 11 34 17 -3 -18 -23 17 5 -6 12 -33 -23 -49 47 36 15 -16 -49 18 9 7 29 -6 -39 9 20 -12 16 -21
6000b1J1MLQ7m6pj3oj7L9o7M6Jl6M2Rn1J8m9QK9%L8r1R9o6P7Kj8pk9j1qK9J1q
$$ -21 -10 -6 -3 84 38 31 18 12 -5 34 -33 13 14 -22 20 29 -22 -4 -53 -45 -16 -16 22 -69 30 -36 41 43 25 18 -11 -22 -30 -1 10 2
6036BOnK3J7j3Rn3qO6j2n7M9o2M4K8l9j6J3PnLL3no8L5l1K5RJ7p0P9l1k3j7R1
$$ 2 8 3 26 43 30 39 -14 -22 44 32 -25 24 -38 6 34 -5 -21 -8 -1 -6 -3 30 25 -43 -8 -39 -14 -5 12 -58 21 -10 -33 -50 41
6071D1m6J6j2rK5K9r4L7j6J2L4k3J9n1N9RK4p2M6n3QOO9m3ln1J5K1Knl5j9N3R
$$ 41 -5 11 -1 -10 15 44 -50 -13 -29 -17 17 -6 13 -38 21 30 54 -18 28 -25 -17 -11 58 15 12 -39 -24 -3 -1 -6 -41 -60 -7 2
6105BN4j7j9j6l9PO2n6J8k9M6L6NJm1Qm0L4M0n0qJ2j04J58m6K1l6oj1J4kM6m3
$$ 2 56 39 20 4 -35 -28 34 -22 -4 -33 13 49 54 55 14 22 -18 16 56 6 -2 10 -94 64 18 39 3 -3 -14 0 -2 44 1
6138Ak4J3L6Jm0j8M1Jl7P1m3l7L5N5k9rl5k2JP7k4J8K4l6q1K4Q7k2nk9K4j2j2
$$ 1 -23 -10 26 27 -13 -31 10 11 -26 45 2 -35 0 55 26 17 -18 -40 -39 38 14 32 56 20 -61 -37 50 28 23 -6 18 6 -6
6171fl8N2J2k1l4lL4j4J5k3L3K0l2l7L6Ro6P3QJ1l9l1Q2lk0oM0n4jQ0n3J4J2o0
$$ -6 -44 8 20 -1 -35 -38 -4 -18 -3 -26 7 27 -5 -42 -6 3 -63 10 18 29 -10 -41 41 38 18 12 52 -2 -3 77 24 38 50 -10
6205a0L8j3L9l7l4rk1J21m4l1n7P5lL0k3l6l1M7KJ0p1K7l7J05J1j5o0M0n1j1O0
$$ -10 28 15 54 17 -17 -26 -47 74 30 -1 -58 17 14 44 21 -15 -46 1 3 13 -58 -31 -68 37 48 33 -27 13 -38 -49 11
6236A1pJ8k6Kj0Qj2M3Nj9k9J03n7Kl7j8L5j2PN9j12K4J3KN3L9j22N7l5J5K4j2
$$ 11 4 22 -4 -2 -12 -4 -16 27 32 13 -16 87 30 32 -5 -23 12 0 7 66 -46 -22 -9 -7 46 85 -37 20 -15 0 24 12
6268A2m8k2K1J3L7k5k2lK2M4l2K0J1p4K3L0J7l0J2k4N3J2j6j7k0m3L9m9M6M9l2
$$ 12 -36 -58 -37 -24 13 -12 -34 -37 -15 29 -3 17 28 -46 -23 7 24 -6 6 -18 35 47 31 14 -6 -49 -10 -59 -13 36 4
6299Dn4J1L3k5O8p0J6j8P0Rq7M5pl0K1lN5J6r8R5n0K9J8o0k4M0q%K5l8J8j6N9
$$ 4 -50 -39 -6 -31 37 -33 -17 -35 35 44 -43 2 -5 -35 -14 -17 38 54 -44 51 1 30 48 -12 -36 4 -4 -4 21 -17 1 -15 44
6332D4m7K4plj1j0M9Jq1O4l1NJ9j8L5q8L0Q2l1J2pl3K2pj1J3J2m1l0%Q2nm3P5
$$ 44 -3 21 14 11 0 -10 39 40 -41 23 -8 -3 16 -2 33 -55 -25 57 26 38 31 -2 20 13 2 15 27 -14 -44 -44 38 33 -10 65
6366F5m3n1K8K3m0L4j0k7J9R3j08l1ML3K6l1l2MO1j3J3nj4M5q9L5K3Ko6L0n6P0
$$ 65 22 -29 -1 22 -18 16 6 -21 -2 91 -17 -48 -44 -11 15 -16 -48 -44 17 4 17 12 -2 43 -46 -11 12 14 -52 -22 -78 -8
6398hK5j1j7n0J8L6O1lm1K5k9J2Ko8M4k6RJ7M6m8lprJ7K6Ql7l3P2m7M1Km4j0l7
$$ -8 17 6 -11 -61 -43 -7 54 51 10 35 6 18 20 -48 -4 -30 -21 -4 42 -6 -9 -16 -25 -8 18 26 -11 -44 28 -19 22 24 -20 -30 -67
6433f7N0J3L8m3j3kJ5L6n6M2k7K7k7rJ0kj9j3P5L9m3pn5KM2k2RJ3ol0M6k9L7n
$$ -67 -17 -4 34 -9 -22 -24 -9 27 -29 13 -14 13 -14 -23 -13 -15 -34 -47 28 67 24 17 -38 -36 6 -16 -7 6 0 -30 16 -13 24 19
6467A9r5O9m3M9k5K0n5M1P8l1KL3m9m8P2l6K7J8p7P1k3l6kNk0N0l1P0k1J7m0k4
$$ 19 -76 -7 -50 -1 -26 -6 -61 -20 58 27 29 62 13 -35 37 1 28 46 -31 40 17 -19 -21 -16 -36 14 -17 53 32 49 9 -15
6499a5l8K2K2Mk6PK2j2J9qJj6O0k3k1K1r9L1Q2plm4K0%RJ7l7J06m4n6L2K9l8K1
$$ -15 -53 -31 -9 -5 -31 -24 -2 -14 5 -3 -2 -18 42 19 -2 19 -80 -49 33 26 23 -21 -1 -1 8 25 -12 94 50 -6 26 55 17 38
6533C8n2QK5j1j3l7O4r0Q1JJPk9j2j0K3K6j7Lnkk2P3o1k0O7k5K6j2mr7P5J4M3
$$ 38 -14 -6 19 8 -5 -42 22 -68 13 14 15 22 -7 -19 -29 -6 20 3 6 1 -1 -23 50 -11 -31 36 11 37 25 21 -76 -1 13 56
6567E6j0m8k1pK9lM5pm5n4J04J7p8K6n7K8k1O5Pn4%j1J04l7j1ol5k1Q2kq2M3J9
$$ 56 46 -2 -23 -30 -1 -4 41 34 -11 -65 39 56 -22 4 -53 -25 -46 19 26 -28 -28 -39 65 28 17 11 -24 -45 37 35 -47 -4 15
6600A5mPJ3J2n5j0M4J1J7l7j4p3L4J9M8j9l5K6pL0k4k7Q3q2k2K9L1L1J6n1j8N7
$$ 15 11 18 31 43 -12 -22 22 33 50 13 -1 -74 -40 -21 27 8 -27 -1 -8 22 -2 -29 54 -28 -50 -21 10 41 57 6 -12 45
6632D5K6pl9J5m4M0ol2k%M8l6JJ6j7J2kO5o7L6n0Kj0J4j0J0m4K6o8K9O4m0K0l
$$ 45 71 64 25 40 -4 36 30 -2 -4 -4 44 8 9 25 8 20 18 83 16 52 2 4 -6 8 -2 8 -36 -10 -78 -49 15 -25 -5 -8
6666hj0L3Pk9P6j18Q0n2L0M3k7k1J0l0J14k7m8j6nL6m8rOk3MK0j9mJ7j8M8o7J4
$$ -8 -18 15 22 -7 69 -49 31 -21 9 52 25 4 14 -16 98 71 23 7 2 38 -10 -19 -13 -36 -32 -12 -31 -35 -18 -36 12 -55 -41
6699d1O5m7M5j1L3po2N8p4J2N4l0J2l3J5k2K5K4pk8K8j7K8M2n3K1k9j1K9OLl5
$$ -41 24 -23 22 11 44 37 -25 33 -41 -29 25 -5 7 -26 -11 -33 -8 16 9 -19 9 -8 20 62 9 30 1 -10 19 25 28 -7
6731gk6K8J5J6k8m9M3l6P7lm6Kl5N9RK0p1L6nL5l3l0L6L4Nj9PK9n3m8jK1N5l7
$$ -7 -33 -5 10 26 -2 -51 -8 -44 33 30 -16 -14 -49 10 19 39 -32 4 -1 34 1 -29 7 41 46 27 34 63 10 -38 -39 -18 37 0
6765@l7N4Nm2P7n0k1k4L7n3K6L7k9lk0J9Mm9Q6l3L4lL6k0l8L7m9PM0M0n6k1k5
$$ 0 -37 17 22 -20 57 7 -14 -38 -1 -54 -28 9 -20 -23 -43 -24 -20 -69 17 -16 18 15 51 31 -7 30 -19 -12 28 68 12 -9 -34
6798c4K3J5mJ3l4K0l3N4J9l8j8Pk2J7NK1JLm6K7J7k7pl3N6K0J2j3l8l0LM3PP4
$$ -34 -11 4 0 13 -21 -1 -34 20 39 1 -17 -10 -32 -15 -10 11 12 15 -31 -4 13 -14 -21 -54 2 22 34 21 -17 -47 -44 -1 6 80
6832H0q2k1O5l8k8O7m0j6M4k6K9mRj13N5L3m0O2l4n7N3L3l3K1l2j2j3M2kNn8O3
$$ 80 -2 -23 42 4 -24 43 3 -13 31 5 34 30 39 -74 -19 14 -26 36 2 -55 -2 31 -2 19 -13 -25 -38 4 2 7 -51 12
6864A2Pj47J19j1l1O4j4M7lk1J4j20O9K6j1mPk7K3L7K7n3k2m4R3k5Mj2l2m5N8
$$ 12 19 -128 -9 -20 -51 13 -1 46 43 22 36 -84 -15 11 0 -4 3 -24 -1 36 63 10 -12 -56 37 12 16 4 -28 -73 -15
6895a5PN3n1olk2M0O4o0o9j4R8Llk8j6L6l3lN1m7O0p4Q1lo3k7K9K6k2PK9K3p8
$$ -15 -8 45 -6 -12 -15 -37 3 67 7 -62 -76 22 25 22 -6 -22 14 -19 -22 29 -18 42 -32 49 46 -17 -44 -15 11 -11 -4 25 48 -30
6929c0mm8P2RJ9l9K1k2N6k5k1K9l5kO6m1oK0m1K0PJmJ5K3n6M3j1k2l2K8rK6k1
$$ -30 -34 -82 -10 -1 18 -21 0 -22 34 9 -12 17 -18 -20 46 5 -1 19 -22 -2 5 6 2 17 40 -16 27 16 -6 -38 -10 -19 7 -14
6963a4J9j2k7O2j7J3J1n5Lm6M9Q4q1o4M0J7pP8q9J4kLL1p4P8m1k8O8j7O3m4jM2
$$ -14 5 -7 -34 28 11 24 35 -20 -17 -63 -14 70 -11 -75 -35 -18 -25 53 -36 -22 -24 -21 10 -64 14 -27 -55 13 -4 59 15 14 56
6996E6l5M0o0L%K2k8N7l8J4Nk6l5JL4o9N0oJ5K2J0n2M5pj3j1K3Nj8l4l2R0J2o
$$ 56 21 61 1 4 4 26 -2 55 17 31 36 10 -25 -24 10 -59 -9 -15 0 22 32 -20 25 18 5 -6 17 22 4 -30 -62 28 40 34
$$ [...]
8191b5
##END NTUPLES=NMR FID
##END=
