##TITLE=1H_SR10_2_2
 CDCl3, 32 sc, 
 8.7.2020
##JCAMPDX= 6.0         $$ Bruker NMR JCAMP-DX V2.0
##DATA TYPE= NMR FID
##DATA CLASS= NTUPLES
##ORIGIN= UXNMR, Bruker Analytische Messtechnik GmbH
##OWNER= root
$$ XWIN-NMR		Version 3.5
$$ Wed Jul  8 13:21:45 2020 Russian Standard Time (UT+4h)  she@DPX200
##.OBSERVE FREQUENCY= 200.1315
##.OBSERVE NUCLEUS= ^1H
##.DELAY= (6, 6)
##.ACQUISITION MODE= SIMULTANEOUS
##.ACQUISITION SCHEME= undefined
##.AVERAGES= 24
##.DIGITISER RES= 18
##SPECTROMETER/DATA SYSTEM= spect
##.PULSE SEQUENCE= zg30
##.SOLVENT NAME= CDCl3
##.SHIFT REFERENCE= (INTERNAL, CDCl3, 0, 15.7039)
##AUDIT TRAIL= $$ (NUMBER, WHEN, WHO, WHERE, WHAT)
$$ ##TITLE= Audit trail, XWIN-NMR		Version 3.5
$$ ##JCAMPDX= 5.01
$$ ##ORIGIN= Bruker BioSpin GmbH
$$ ##OWNER= she
$$ F:/spectra/data/she/nmr/H-F/1/audita.txt
$$ ##AUDIT TRAIL=  $$ (NUMBER, WHEN, WHO, WHERE, WHAT)
(   1,<2020-07-08 13:20:51.43 +0400>,<she>,<DPX200>,
      <created by zg, POWCHK disabled, PULCHK disabled
       configuration hash MD5:
       00 E9 B6 7A A2 85 ED C7 34 08 36 98 17 FE 4E 26
       data hash MD5: 16K
       0B 4E 34 BF D4 30 4A 8C A2 31 8A CA F8 1C 97 76>)
$$ ##END=
$$ 
$$ hash MD5
$$ 5B 63 1C F2 F4 4A 87 B9 ED 1D 0C 99 4B CE E7 BD
##$RELAX= 
##$RELAX= 
##$RELAX= 
##$RELAX= 
##$RELAX= 
##$RELAX= 
$$ Bruker specific parameters
$$ --------------------------
##$DU= <F:/spectra>
##$EXPNO= 1
##$NAME= <H-F>
##$PROCNO= 1
##$TYPE= <nmr>
##$USER= <she>
##$AMP= (0..31)
100 100 100 100 100 100 100 100 100 100 100 100 100 100 100 100 100 100 
100 100 100 100 100 100 100 100 100 100 100 100 100 100 
##$AQSEQ= 0
##$AQ_mod= 1
##$AUNM= <au_zg>
##$AUTOPOS= <>
##$BF1= 200.13
##$BF2= 200.13
##$BF3= 200.13
##$BF4= 200.13
##$BF5= 200.13
##$BF6= 200.13
##$BF7= 200.13
##$BF8= 200.13
##$BYTORDA= 1
##$CFDGTYP= 0
##$CFRGTYP= 5
##$CHEMSTR= <none>
##$CNST= (0..31)
1 1 145 1 1 1 1 1 1 1 1 1 1 1 1 1 1 1 1 1 1 1 1 1 1 1 1 1 1 1 1 1 
##$CPDPRG= <>
##$CPDPRG1= <>
##$CPDPRG2= <>
##$CPDPRG3= <>
##$CPDPRG4= <mlev>
##$CPDPRG5= <mlev>
##$CPDPRG6= <mlev>
##$CPDPRG7= <mlev>
##$CPDPRG8= <mlev>
##$CPDPRGB= <>
##$CPDPRGT= <>
##$D= (0..31)
0 1.2 0 0 0 0 0 0 0 0.06 0 0.03 0 0 0 0 0.0002 0 0 0 0 0 0 0 0 0 0 0 0 
0 0 0 
##$DATE= 1594200050
##$DBL= (0..7)
120 120 120 120 120 120 120 120 
##$DBP= (0..7)
150 150 150 150 150 150 150 150 
##$DBP07= 0
##$DBPNAM0= <>
##$DBPNAM1= <>
##$DBPNAM2= <>
##$DBPNAM3= <>
##$DBPNAM4= <>
##$DBPNAM5= <>
##$DBPNAM6= <>
##$DBPNAM7= <>
##$DBPOAL= (0..7)
0.5 0.5 0.5 0.5 0.5 0.5 0.5 0.5 
##$DBPOFFS= (0..7)
0 0 0 0 0 0 0 0 
##$DE= 6
##$DECBNUC= <off>
##$DECIM= 24
##$DECNUC= <off>
##$DECSTAT= 4
##$DIGMOD= 1
##$DIGTYP= 9
##$DL= (0..7)
0 120 120 120 120 120 120 120 
##$DP= (0..7)
150 150 150 150 150 150 150 150 
##$DP07= 0
##$DPNAME0= <>
##$DPNAME1= <>
##$DPNAME2= <>
##$DPNAME3= <>
##$DPNAME4= <>
##$DPNAME5= <>
##$DPNAME6= <>
##$DPNAME7= <>
##$DPOAL= (0..7)
0.5 0.5 0.5 0.5 0.5 0.5 0.5 0.5 
##$DPOFFS= (0..7)
0 0 0 0 0 0 0 0 
##$DQDMODE= 0
##$DR= 18
##$DS= 0
##$DSLIST= <SSSSSSSSSSSSSSS>
$$ [...]
##$SUBNAM2= <"">
##$SUBNAM3= <"">
##$SUBNAM4= <"">
##$SUBNAM5= <"">
##$SUBNAM6= <"">
##$SUBNAM7= <"">
##$SUBNAM8= <"">
##$SUBNAM9= <"">
##$SW= 24.9337058887773
##$SWIBOX= (0..15)
0 0 2 0 0 0 0 0 0 0 0 0 0 0 0 0 
##$SW_h= 4990.01996007984
##$TD= 16384
##$TD0= 1
##$TE= 0
##$TE2= 300
##$TE3= 300
##$TEG= 300
##$TL= (0..7)
0 120 120 120 120 120 120 120 
##$TP= (0..7)
150 150 150 150 150 150 150 150 
##$TP07= 0
##$TPNAME0= <>
##$TPNAME1= <>
##$TPNAME2= <>
##$TPNAME3= <>
##$TPNAME4= <>
##$TPNAME5= <>
##$TPNAME6= <>
##$TPNAME7= <>
##$TPOAL= (0..7)
0.5 0.5 0.5 0.5 0.5 0.5 0.5 0.5 
##$TPOFFS= (0..7)
0 0 0 0 0 0 0 0 
##$TUNHIN= 0
##$TUNHOUT= 0
##$TUNXOUT= 0
##$USERA1= <user>
##$USERA2= <user>
##$USERA3= <user>
##$USERA4= <user>
##$USERA5= <user>
##$V9= 5
##$VALIST= <valist>
##$VCLIST= <CCCCCCCCCCCCCCC>
##$VD= 0
##$VDLIST= <DDDDDDDDDDDDDDD>
##$VPLIST= <PPPPPPPPPPPPPPP>
##$VTLIST= <TTTTTTTTTTTTTTT>
##$WBST= 1024
##$WBSW= 4
##$XGAIN= (0..3)
0 0 0 0 
##$XL= 0
##$YL= 0
##$YMAX_a= 1079064
##$YMIN_a= -537667
##$ZGOPTNS= <>
##$ZL1= 120
##$ZL2= 120
##$ZL3= 120
##$ZL4= 120
##$ABSF1= 10
##$ABSF2= 0
##$ABSG= 5
##$ABSL= 3
##$ALPHA= 0
##$AQORDER= 0
##$ASSFAC= 0
##$ASSFACI= 0
##$ASSFACX= 0
##$ASSWID= 0
##$AUNMP= <proc_1d>
##$AZFE= 0.1
##$AZFW= 0.1
##$BCFW= 1
##$BC_mod= 2
##$BYTORDP= 1
##$COROFFS= 0
##$CY= 11.3945322036743
##$DATMOD= 1
##$DC= 2
##$DFILT= <>
##$DTYPP= 0
##$F1P= 16.9975609425685
##$F2P= -3.02152046262296
##$FCOR= 0.5
##$FTSIZE= 0
##$FT_mod= 4
##$GAMMA= 1
##$GB= 0.15
##$INTBC= 1
##$INTSCL= 1
##$ISEN= 128
##$LB= 0.24
##$LEV0= 0
##$LPBIN= 0
##$MAXI= 10000
##$MC2= 0
##$MEAN= 0
##$ME_mod= 0
##$MI= 1.114404
##$NCOEF= 0
##$NC_proc= 0
##$NLEV= 6
##$NOISF1= 3.799351
##$NOISF2= 2.8
##$NSP= 1
##$NTH_PI= 0
##$NZP= 0
##$OFFSET= 15.70392
##$PC= 1
##$PHC0= -9784.932
##$PHC1= 5.600851
##$PH_mod= 1
##$PKNL= yes
##$PPARMOD= 0
##$PSCAL= 0
##$PSIGN= 0
##$REVERSE= no
##$SF= 200.130013532006
##$SI= 16384
##$SIGF1= 3
##$SIGF2= 2
##$SINO= 400
##$SIOLD= 16384
##$SREGLST= <1H.CDCl3>
##$SSB= 0
##$STSI= 0
##$STSR= 0
##$SW_p= 3612.71676300578
##$SYMM= 0
##$S_DEV= 0
##$TDeff= 0
##$TDoff= 0
##$TI= <>
##$TILT= no
##$TM1= 0
##$TM2= 0
##$TOPLEV= 0
##$USERP1= <user>
##$USERP2= <user>
##$USERP3= <user>
##$USERP4= <user>
##$USERP5= <user>
##$WDW= 1
##$XDIM= 8192
##$YMAX_p= 0
##$YMIN_p= 0
$$ End of Bruker specific parameters
$$ ---------------------------------
##NTUPLES= NMR FID
##VAR_NAME=  TIME,          FID/REAL,        FID/IMAG
##SYMBOL=    X,             R,               I
##VAR_TYPE=  INDEPENDENT,   DEPENDENT,       DEPENDENT
##VAR_FORM=  AFFN,          ASDF,            ASDF
##VAR_DIM=   8192,          8192,            8192
##UNITS=     SECONDS,       ARBITRARY UNITS, ARBITRARY UNITS
##FACTOR=    0.0002004,     1,               1
##FIRST=     0,             0,               0
##LAST=      1.6414764,     0,               0
##MIN=       0,             -537667,         0
##MAX=       1.6414764,     1079064,         0
$$ Real data points
##PAGE= N=1
##DATA TABLE= (X++(R..R)), XYDATA
0 0 0 0 0 0 0 1 0 17 -24 24 -24 48 -48 72 -72 96 -120 144 -168 192 -231 265 -310 357 -412 474 -544 616
28 616 -699 792 -895 1006 -1128 1265 -1414 1574 -1752 1948 -2162 2402 -2659 2939 -3258 3607
44 3607 -3992 4429 -4914 5468 -6098 6824 -7678 8694 -9924 11448 -13401 16009 -19673
57 -19673 25238 -34787 55495 -199119 516942 677935 -486462 -484495 273451 202609 -537667
68 -537667 -312368 327964 136973 -413405 -115703 342494 41633 -401492 -112962 269735
78 269735 135270 -66529 34396 -18184 -214831 -70186 252556 158838 -115158 -56416 94582
89 94582 -42808 -124247 68426 123933 -64160 -25193 180107 37882 -254341 -100358 221982
100 221982 110924 -127328 29126 174860 -98089 -254624 71714 259198 -20611 -141907
110 -141907 109682 108072 -193426 -128081 217020 133629 -187378 -46132 249936 18949 -303755
121 -303755 -41164 288206 40793 -217739 64036 240420 -137319 -311553 117226 326566
131 326566 -64952 -247627 92148 188944 -153044 -185965 168298 171640 -161092 -121893 189672
142 189672 94178 -232672 -131854 196206 137789 -122362 -77775 80799 -9816 -117616 19680
153 19680 121151 -8374 -91525 5620 40054 -42850 -35818 32196 -2381 -32110 48133 47592
165 47592 -97465 -105845 69273 100238 -53467 -67201 60567 21528 -112259 -33737 117253
176 117253 26684 -119965 -14892 114484 -12886 -134061 2669 113027 -17893 -90561
186 -90561 48244 76731 -91512 -100060 89935 98898 -82561 -76771 85132 48666 -108408
197 -108408 -42773 114064 37199 -109060 -18089 112052 1469 -119314 1451 115960
207 115960 2151 -92032 19008 84245 -36215 -83140 44159 89363 -29059 -64831 33791
218 33791 51862 -35343 -35097 44786 35680 -29971 -14601 34013 9784 -27669 1677 29920 6460
231 6460 -5298 12753 1284 -19683 7386 34544 2132 -22236 14475 27098 -17966 -21498
243 -21498 32619 29534 -28988 -18374 43251 22997 -43818 -19040 48244 22028 -39108 -7620
255 -7620 44222 1255 -46461 5663 52717 -1883 -47061 6273 43136 -11521 -41198 14455
267 14455 37301 -16138 -32493 19405 26587 -26812 -28800 23907 24199 -22935 -22577 17199 10813
280 10813 -23333 -11230 19222 4557 -22998 -8622 13702 -736 -18764 -4529 10303 -1865
292 -1865 -13191 -3248 1942 -6288 -8795 -214 2006 -4944 -6842 -4885 -4615 -1564 -273 -5280 -7499
307 -7499 -20 1614 -7901 -9110 2474 4042 -8279 -8225 4701 3680 -10867 -9174 6862 6293 -9407
322 -9407 -7802 5793 4229 -8240 -4960 6963 3269 -6486 -3225 6237 2001 -5490 -1842 5526
336 5526 3015 -2539 -160 4243 1175 -767 2404 5022 2343 -1203 2011 4680 2700 336 2030
351 2030 4975 4080 -152 219 5971 4845 -647 -505 7264 6982 -1882 -1582 7503 7816 -1532 -1350 7297
368 7297 7311 -1896 -1535 8392 6139 -2141 122 7472 3672 -3881 905 8328 1810 -4351 2735 8223
384 8223 -235 -4423 3387 7267 -1367 -4242 3379 4906 -2214 -3093 3447 2558 -3393 -1978 3019 -439
400 -439 -3946 -179 2844 -1408 -4101 1032 1657 -4432 -3477 1818 -163 -5432 -2640 1619 -1552 -5926
416 -5926 -1654 2219 -3832 -6669 199 1648 -5634 -6722 1084 1605 -6707 -6562 2073 973 -6654 -5392
432 -5392 1632 -1032 -6476 -2462 2089 -2679 -6717 -579 2131 -4337 -5617 567 2620 -4732 -5222
447 -5222 2309 2256 -5134 -4652 3390 2711 -4159 -3208 3087 1232 -3456 -1554 2600 288 -2249 548
463 548 2831 -320 -1310 1928 2105 -365 -340 2539 1540 -648 1136 3164 1158 -254 1774 3715 1128
480 1128 271 2463 3284 347 1130 3943 3717 435 726 3611 2102 562 1800 3559 1924 1159 2185
497 2185 3467 1812 642 2156 2969 1669 1474 2663 2614 488 1064 2992 2544 -561 225 3148 1839
514 1839 -582 -494 3092 2544 -1661 -862 2507 1408 -2338 -1447 2648 2196 -2244 -2377 2022 1541 -3228
531 -3228 -2602 2453 1844 -4291 -3125 1699 1682 -4408 -3563 2806 2044 -5344 -4784 2160 1244 -5319 -3686
548 -3686 2300 218 -5841 -4242 1054 -251 -4310 -3099 823 -634 -4665 -3507 21 -1312 -2605
563 -2605 -1818 -336 -1234 -3106 -1782 -1084 -1321 -625 -933 -1698 -1470 -166 -1613 -2323 481 1011 -1354 -2876
581 -2876 269 1519 -2479 -2794 2298 2618 -3645 -3565 2550 2014 -4638 -1979 5434 4217 -5601 -2042
597 -2042 5923 2266 -5820 -529 8580 2020 -6547 -1029 7162 797 -5635 2152 8956 795 -6294
612 -6294 2270 8130 140 -5196 4488 8437 -868 -5583 3553 6683 -1298 -2968 4827 6179 -1400
627 -1400 -2549 3556 4247 -825 -412 4205 2649 -1446 -569 2478 1690 897 2037 1467 198 1037 536
644 536 -782 74 3551 2086 -2111 -905 2633 1195 -3692 217 5209 905 -5266 -612 4940 -1128
660 -1128 -5743 1545 6306 -1794 -7378 1057 4992 -4027 -6735 3511 6747 -4762 -7998 3666
674 3666 4381 -5941 -5478 4836 4027 -7316 -6795 4556 3418 -7365 -4337 5962 1951 -7917 -4098
689 -4098 4204 971 -6503 -2238 4119 -255 -6270 -2432 2647 -727 -4081 147 1137 -1834 -3455
704 -3455 -1731 512 -341 -653 -614 -1113 -1138 249 -1042 -2220 1150 2592 -1597 -2760 1351 2367 -2377
721 -2377 -2786 3417 3649 -3083 -3627 3464 2945 -3861 -1761 5833 3488 -4155 -2523 6451 2443 -5467
737 -5467 -435 7452 2241 -5050 -495 7110 598 -4696 1067 7152 545 -4643 1921 6623 -642
752 -642 -3717 2766 4945 -1512 -3586 1991 5497 335 -3055 3473 4019 -1497 -2764 1970 2205 62
768 62 -592 2172 2051 -190 -521 1107 1492 515 254 140 616 620 20 -918 1058 2476 2 -2214 6
787 6 1737 -340 -2741 491 2863 -1480 -4023 456 2977 -1425 -3924 1018 3244 -2730 -4425 1433
803 1433 2499 -2706 -3851 1802 3107 -3355 -3943 1453 1945 -3530 -2562 2040 1727 -3995 -3555 1769
819 1769 1470 -3234 -2290 1457 118 -3400 -1941 1429 -420 -2883 -1757 1318 236 -2963 -1773 927
835 927 165 -1763 -950 742 -16 -1781 -1408 660 374 -831 -813 -238 847 -638 -982 -78 1635 623
853 623 -1151 -362 1625 435 -1368 483 2456 330 -1762 -207 1842 685 -1330 593 3089 589
869 589 -1644 286 2533 934 -735 1512 2700 234 -1011 888 2307 189 -1055 1444 2260 666
885 666 -1613 637 2095 763 -489 800 2149 544 -397 815 2380 626 168 751 921 445 -329
902 -329 58 1625 417 -586 238 1085 347 -1126 227 956 735 -788 35 1319 260 -765 -525
919 -525 437 476 -1284 -152 521 -33 -1292 -1111 1695 -200 -987 -1038 145 -742 -1532 -802 787 -517
937 -517 -1693 -905 -40 -635 -857 -488 126 -720 -1226 -791 -227 -88 -1077 -703 -469 -953 -887 -1165 -392 33
957 33 12 -1109 -1118 352 -45 -722 -432 387 86 -661 -1007 665 -413 -1022 301 612 222 -1196 -526 1157
977 1157 -571 -1232 431 776 265 -384 86 1072 -457 -436 804 1294 -164 -196 655 1039 -404 72 1367
996 1367 1463 -837 442 1371 430 -334 478 852 487 211 -60 514 276 130 769 881 162 372 741 447
1016 447 242 922 1176 563 346 946 463 48 417 993 672 -427 464 990 466 -482 686 1456 62
1035 62 36 386 1172 -778 -849 578 874 -522 -866 252 614 -692 -439 994 62 -708 -285 578 584 -852
1055 -852 97 601 -361 -544 136 449 -864 -752 -38 89 -894 -1291 -10 -297 -840 -678 452 -684 -1763
1074 -1763 -787 -715 -85 -1537 224 -851 -802 -1211 -383 -459 -1951 -933 -197 -1381 -1789 756 333 -54
1092 -54 -792 -503 253 -364 -608 -246 122 -236 -984 208 324 -362 -703 -318 -65 -342 -77 323 110 -674
1112 -674 -173 587 47 -561 602 1240 -279 -217 171 226 154 -452 283 472 52 339 634 -34 -49 16 1041
1133 1041 379 -512 561 942 -445 -64 815 355 438 289 979 586 543 244 1018 737 320 422 784 511
1153 511 45 550 1241 686 201 267 154 -176 40 416 259 104 128 -18 297 -224 63 825 463 -268 279
1174 279 463 223 -261 268 449 320 -605 215 140 212 299 106 -125 -603 -231 272 -199 -721 -385 242 -107
1195 -107 -639 -304 393 -334 -204 -288 -404 -50 -121 65 -101 -248 -968 -582 -37 -549 -586 39 -456 -710 472
1216 472 -133 -303 -484 -354 -379 -342 -147 -197 -207 -225 -354 408 -880 -27 540 -341 513 259 105 -154 188
1237 188 -238 765 319 -254 -552 731 -38 -178 364 146 -202 -409 44 538 -365 424 526 361 103
1256 103 108 619 545 756 -127 -330 678 -391 919 1018 340 -142 -483 1011 977 237 793 45 279 108
1276 108 431 570 36 433 449 -89 272 349 -163 26 651 96 121 427 348 31 -158 449 260 421 -604
1297 -604 -69 264 -117 356 113 410 51 -120 -210 12 -194 -205 449 620 -429 -533 -209 -311 178 -94
1317 -94 -268 84 -341 -114 -135 -71 -199 -588 -116 8 167 -154 -21 -90 -193 -157 -324 282 386 -361 -742 -317
1339 -317 -600 -151 8 278 181 -891 -480 -161 -311 -234 -356 -100 -211 -169 42 43 -476 -564 -286 -172 -120 -568
1361 -568 -600 80 31 -46 -208 -106 189 -111 -207 -3 101 4 -154 383 442 359 -577 281 238 176 -28 765 -33
1384 -33 -228 311 123 483 -147 684 210 406 61 -152 284 136 103 111 211 310 499 19 188 127 332 391
1406 391 278 427 -28 89 617 531 514 317 530 310 -190 -89 250 473 437 448 202 600 311 -326 277
1427 277 -150 -172 438 140 470 -709 485 -388 315 -39 -76 330 384 -207 105 -400 -216 320 251 -853
1447 -853 -379 217 393 -84 292 -666 -283 -180 -589 8 -388 -34 -30 -52 -616 -353 -478 169 -209 422 -29
1468 -29 -107 79 -185 369 -508 48 -40 256 -533 -413 167 21 8 -639 -305 157 -15 -179 -235 477 652 82
1490 82 435 188 4 237 0 443 -288 -15 -215 -102 -322 -787 -322 340 -112 97 218 106 74 554 -203
1511 -203 435 339 -53 -330 -193 474 271 -278 10 234 -254 32 -278 506 149 273 54 18 -128 227 -199
1532 -199 144 81 -31 163 156 -185 -212 17 338 -24 517 -25 -174 657 -31 457 132 184 86 -29 -74 -3 -185
1555 -185 224 -102 192 133 -73 43 156 -327 211 178 139 -44 329 786 28 -121 340 -192 250 -35 -146
1576 -146 -277 -66 -41 -270 -447 -81 -160 -547 -695 -435 184 -341 -234 -100 -8 -197 -573 -241 -103 -220 375
1597 375 -362 -506 205 45 -339 -71 94 240 -553 -1055 12 153 85 7 125 47 207 -35 -336 226 -24
1618 -24 245 -14 -99 89 -226 -271 -345 129 -122 -215 383 9 -204 143 222 338 -227 -326 -275 146 -84 14 -18
1641 -18 -302 35 -51 440 31 35 193 38 150 68 192 300 63 -237 -913 439 46 47 402 -72 279 -159
1663 -159 -59 195 196 123 451 507 370 275 -109 79 58 -80 -271 147 452 220 262 79 -146 -455 609 -343
1685 -343 -465 86 -477 633 -785 -280 459 417 -36 275 -73 -632 -20 254 -777 27 78 190 186 361
1705 361 47 -340 0 -206 -466 250 -372 121 -674 -581 -116 -119 193 245 -42 -745 44 -1 -239 -658 -66 -102
1727 -102 -255 371 22 -87 119 151 -72 12 -12 -266 425 -182 415 494 -540 242 -240 -201 -731 156 -777
1748 -777 -415 -189 44 154 -25 -225 -158 286 329 233 -380 26 -235 396 -110 -488 122 -471 75 47 544
1769 544 -827 443 22 -311 -165 176 -181 253 51 -270 452 302 -26 254 152 599 38 -379 42
1788 42 158 13 138 858 8 190 -75 -67 -9 -123 537 343 74 2 109 81 472 -168 475 -49 65 -468
1810 -468 186 97 -98 468 -190 393 -1 25 -116 -273 -9 195 1036 -112 -566 -92 -94 -70 56 -65 -133 149
1832 149 -117 688 40 -145 -63 -315 -31 530 599 -133 -459 44 514 -410 117 169 -432 46 380 409 266
1853 266 -393 -543 -321 -161 -406 233 218 96 194 242 -386 329 254 -460 -289 -524 -375 64 101 -68 63 -633
1875 -633 -466 633 -126 -36 -178 73 -70 41 173 246 -52 -247 -279 164 444 -450 -279 219 150 -74 10
1896 10 -340 130 -43 -369 -71 116 75 -418 -28 106 -23 -289 -221 217 -252 -104 88 468 145 268 138
1917 138 127 203 437 -229 -20 306 508 -106 370 9 -82 13 188 571 45 97 106 -462 144 281 -132 171
1939 171 115 -16 79 409 317 -584 -110 323 -339 -59 90 -271 -87 -77 270 495 108 -159 17 -228 -511
1960 -511 -308 469 361 282 0 -56 279 -80 219 -69 -134 626 137 100 44 -259 7 -228 -359 232 23 173
1982 173 -36 -435 243 62 198 52 109 257 -296 -20 -230 -673 -322 607 153 -209 47 -212 484 -69
2002 -69 -414 246 -412 -385 -443 206 -388 178 28 -56 -171 256 300 -277 -398 24 112 32 -5 -345 -252 524 181
2025 181 -103 310 -118 13 113 372 -16 -347 -181 182 -182 57 69 -42 -274 -171 360 -252 285 -292
2045 -292 388 -360 67 295 -110 273 245 465 671 598 -156 238 -184 250 100 117 -402 153 -273 -206 -104
2066 -104 8 633 76 106 -177 725 446 -336 557 -97 -22 -333 662 -652 -246 34 -115 -417 -235 136
2086 136 23 53 434 216 49 -807 -412 -711 -126 -47 -604 496 598 -330 421 -78 260 -307 -94 13
2106 13 -154 -266 -213 55 -300 420 230 -281 -477 -119 -265 83 -171 68 116 576 280 161 49 -193 -2
2127 -2 34 -492 61 207 -108 -219 94 -145 26 517 124 -154 47 -185 24 332 237 -145 66 334 -213
2148 -213 -140 215 172 -411 -34 28 88 120 5 607 154 -588 318 -85 89 526 160 -67 -240 -74 -362 55
2170 55 172 -109 -218 -123 349 -9 -1 172 54 265 194 215 450 597 10 -507 -33 752 788 -959 -257 650
2192 650 536 -430 -341 -60 74 220 311 19 196 1 80 -21 -266 257 -267 -485 162 -230 173 19 -300
2213 -300 -120 253 139 -206 -334 91 -9 -481 -218 193 203 217 -298 -89 -22 135 -552 46 279 -293 -113
2234 -113 -257 -163 -542 -5 185 -171 378 147 111 -71 341 213 374 148 59 676 -597 -121 -86 -17 6 270
2256 270 -131 -111 386 -253 -125 45 -170 50 209 -653 -318 69 138 -350 225 -165 324 73 63 302 -121
2277 -121 223 -63 -93 414 -28 -493 165 428 31 28 -119 56 -117 -52 467 -139 112 31 285 -381 343 351
2299 351 -191 -318 -110 -222 -13 -115 84 -4 -48 -167 168 -443 -32 12 -827 -514 69 -342 -253 -176 351 121
2321 121 -266 288 -23 218 107 291 429 -23 -72 21 42 -122 -398 460 316 3 152 312 -163 419 -94
2342 -94 273 -319 -1 177 -441 331 -271 100 -222 20 -322 341 105 399 -427 394 -384 71 -62 28 -80
2363 -80 -62 75 -404 1 -48 105 -227 -300 288 -493 -245 199 495 489 233 13 -410 154 165 -211 -132 -24 54
2386 54 454 238 157 -15 84 138 -53 265 -127 41 54 174 -229 -143 -117 -549 -100 -218 -150 519 -250 5 -398
2409 -398 -313 -461 452 -145 -109 464 216 -69 -231 156 -468 -281 6 421 -15 191 -55 -56 -77 162 207 -167
2431 -167 272 687 -28 145 161 -235 -114 133 -133 463 106 -191 43 -10 229 307 90 135 44 -70 -426 98
2453 98 158 68 -124 -137 -182 -187 -682 -231 -146 230 203 66 419 17 270 -229 -342 200 129 -383 575 -70 -166 -168
2477 -168 219 84 195 498 -328 -244 137 -111 -538 83 -71 32 -120 -89 62 -245 -195 -194 -226 7 21 239
2499 239 226 -59 172 -468 63 25 -263 -217 299 -378 269 -152 25 -65 483 -333 -56 -133 -546 -521 -117 -289
2521 -289 -166 -260 -310 58 306 17 134 204 -158 -241 -543 69 137 -272 672 204 -19 111 -170 84 -538 276
2543 276 435 52 516 -82 -553 -271 -286 -115 159 310 -96 -677 -201 221 732 231 -360 160 -98 -219
2563 -219 -42 87 118 223 245 312 -158 588 221 95 -557 -115 -119 303 -265 -126 38 -152 91 -105 43 473
2585 473 -582 -416 524 -240 -369 -67 -281 149 127 45 210 30 173 62 341 -199 -166 -247 174 32 441
2606 441 287 -298 221 -98 454 -454 -17 -241 -135 130 250 -295 -192 -318 3 83 -181 232 -147 -110 -218
2627 -218 -307 134 235 -47 298 141 76 -136 -63 -266 43 137 -305 -305 397 564 -388 -250 -36 -209 385 -55
2649 -55 -330 -229 260 417 -772 37 -242 -136 173 53 71 -272 -252 -512 -456 33 -319 -187 -7 -188 350
2670 350 125 207 120 -215 -305 106 -100 -72 -35 -138 -64 277 -679 220 225 -366 -295 361 -567 -547 -10 145 -69
2693 -69 342 -153 309 -335 146 -409 342 -438 -79 305 -416 -309 577 -298 -195 -580 49 -684 -310 -418
2713 -418 -433 413 370 52 -154 79 930 78 838 412 18 274 111 -502 -543 536 -492 -242 -89 130
2733 130 314 -73 -106 273 -289 201 224 474 -24 201 18 -32 -47 38 -138 -307 394 -55 364 63 266 -107
2755 -107 -231 -381 -127 35 33 -89 -101 -20 179 20 -222 -28 392 162 -45 788 99 -246 -138 -88 312 -191
2777 -191 -457 -125 265 -495 -331 85 4 94 -520 -361 123 -390 69 -226 100 -113 182 522 63 162 -59
2798 -59 201 58 110 -578 -53 111 -360 -539 303 89 -368 -66 -295 88 -308 -1 43 -205 -553 -59 -160
2819 -160 504 -60 14 403 407 -449 190 -21 -122 268 419 -392 172 -731 -151 -228 166 26 -205 240 -422
2840 -422 -361 -343 -7 274 91 264 338 223 131 22 2 -138 74 -400 -576 223 -24 426 84 -169 23 71
2862 71 -198 -187 -10 -209 -376 248 170 447 -186 -379 -97 0 -143 67 373 -271 -287 94 -246 84 86 -94
2884 -94 -74 -65 267 -374 87 -644 -317 236 342 -38 -288 -179 107 -179 -329 440 762 106 174 489 -20 169
2906 169 -508 -619 109 -370 -477 324 -354 -19 -349 -67 109 -66 -396 150 -12 74 -20 -202 -83 -185 14
2927 14 58 -416 -226 -447 -228 400 36 -370 291 21 -48 160 -140 -149 -276 226 -104 29 -344 -38 519 -8
2949 -8 49 -57 313 105 123 58 -82 -15 127 505 259 -267 114 166 48 133 339 413 434 580 -567 179 -512
2972 -512 -8 -23 177 -352 174 -110 285 203 353 570 41 237 109 -505 -301 -134 -113 -61 341 95 47 -186
2994 -186 -15 483 -225 12 -717 -109 71 -124 -394 81 87 -333 -528 187 508 -54 163 117 -419 -305 76
3015 76 87 99 305 151 48 144 157 -453 41 613 -235 -225 -219 162 11 268 -92 -220 331 144 281 -232 -33
3038 -33 -398 45 -189 395 359 -29 -343 -167 -232 38 -412 51 282 -10 -60 -148 -272 -259 -126 322 300 -223
3060 -223 -612 57 -293 -295 294 -118 260 204 -127 -364 214 0 57 -240 268 303 -196 -174 -362 100 585 113
3082 113 269 -46 318 140 -396 92 -98 -126 262 -181 391 67 173 -7 232 223 226 -249 -18 -45 -192 -390
3104 -390 -252 -180 418 -108 148 -64 330 154 131 -118 203 -64 211 -89 66 224 139 67 282 -32 -274
3125 -274 158 84 111 581 33 -106 441 -467 55 -193 -689 483 -382 -109 233 -78 -254 202 414 -229
3145 -229 -138 -335 -470 -710 -285 -218 150 -512 239 359 217 7 305 266 -64 306 134 -11 -416 138 -185
3166 -185 -146 188 -86 230 -549 460 311 19 15 -28 -167 -261 58 -12 -416 -494 21 76 -30 422 -495 61
3188 61 41 -644 -102 19 17 -135 158 -351 -7 747 -57 -227 -226 -174 165 237 -458 -60 -119 -269 83 -326 72
3211 72 -80 -482 -144 102 -214 143 19 -157 477 452 -523 538 -208 -328 -27 175 20 -93 -260 314
3231 314 -120 206 919 -303 58 264 253 -456 296 442 -160 80 -74 28 -36 60 101 -210 14 -87 -432
3252 -432 220 -480 -14 13 217 355 4 -220 -179 3 -248 237 -73 -39 337 -521 -393 -14 93 247 182
3273 182 65 -225 -44 -10 438 -476 -435 -290 -313 86 581 -54 -397 248 -281 -41 -20 -161 -243 249 -2 -96
3295 -96 345 225 131 -476 -536 109 177 382 -240 38 -216 -161 213 -191 392 155 -188 90 281 -211 489 79
3317 79 189 -559 -454 -50 -30 373 -42 -45 394 335 263 -76 38 -15 -347 170 310 -427 -365 55 -157 -683 131
3340 131 -125 107 205 -153 380 -292 -59 409 273 -6 -231 39 -28 -168 -180 -8 377 -53 -318 225 350
3361 350 146 -259 -222 99 594 -49 28 576 258 340 44 -40 60 206 316 -162 508 -88 -106 -279 126 -13
3383 -13 -115 88 -22 -203 -494 -85 128 -204 382 275 -133 215 164 -348 -282 87 97 169 -182 322 579 202
3405 202 68 182 -287 -292 -48 -253 -97 166 138 499 253 49 -450 -254 487 672 262 -86 592 -468 -295
3426 -295 -109 144 -417 -427 -100 -560 -408 -56 -21 -217 -104 -75 44 171 430 -180 192 416 -91 114 -345
3447 -345 56 44 -390 -388 249 -207 -61 -173 216 330 -124 -382 218 -86 163 -181 181 169 124 -532 410 253
3469 253 252 217 396 -521 -88 404 466 49 -61 439 191 -460 413 103 -361 81 86 109 271 259 57 123 -103
3492 -103 -76 64 -415 533 -224 16 460 -213 315 -22 -285 206 513 -275 151 115 311 -201 -141 -164 -130 503
3514 503 -649 -148 100 122 168 286 -91 -145 -96 317 287 262 342 51 397 370 48 -22 98 25 231 -146 -585
3537 -585 -364 -154 81 -25 147 595 111 -397 -346 320 137 -14 352 535 -139 -242 -325 -58 400 86 355
3558 355 -261 -272 650 170 100 458 -463 -407 -628 816 229 -650 42 224 -117 -64 -121 123 113 -821 393
3579 393 347 313 -465 19 -103 282 239 3 -138 198 165 106 706 318 -247 513 125 119 -329 -454 433 749
3601 749 151 49 424 658 378 435 156 113 -640 -813 -203 -388 47 -298 -531 -292 -1 -268 24 -255 -130
3622 -130 -257 330 494 42 -293 209 225 -5 -214 -121 34 75 -189 176 142 248 -232 257 137 -75 317
3643 317 129 295 20 590 74 250 -447 -39 -14 83 -543 -93 -631 560 345 -129 263 182 147 -125 -14
3664 -14 -84 133 369 212 44 -128 405 158 58 -79 -85 -96 80 -40 -147 234 93 -28 -338 188 -340 387
3686 387 158 -149 283 -92 -146 252 -245 -24 -126 -138 -377 -143 -26 173 -114 238 -135 -112 85 -89 -453
3707 -453 176 -289 267 239 -251 -31 406 -180 393 -575 -18 292 -600 -39 263 -167 -39 -210 -146 -55 41
3728 41 292 -7 -100 -302 -42 -261 -574 -337 120 -330 186 -46 -116 -377 393 33 -8 73 587 255 11 62
3750 62 206 -105 161 -243 -63 -70 -37 38 12 -161 -142 78 201 -439 121 190 241 258 14 -52 -189 -75 127 300
3774 300 -318 30 -320 -164 -425 82 -158 -36 -480 154 193 155 79 10 -16 103 82 473 39 -46 85 -10 121
3797 121 -542 130 258 -316 225 -378 310 -438 106 83 -125 286 -467 70 -87 433 87 379 -499 170
3817 170 158 -332 35 -68 -614 189 -250 -525 364 464 -410 166 72 -28 196 -226 95 -417 59 -78 65
3838 65 251 378 -148 110 144 550 171 68 -418 -134 -164 -262 80 75 -100 -21 -422 52 -225 -64 796 262
3860 262 -1 44 16 -105 -93 -448 432 -166 525 -166 -488 -90 -326 -184 286 -317 -58 -317 -639 -293 -222
3881 -222 -71 -557 -331 -216 75 -59 -127 260 -38 -42 -195 -36 448 -739 -270 69 305 -32 401 408 144
3902 144 13 551 -48 -164 -62 -914 -430 208 -494 -240 -11 -237 -332 214 118 -320 99 -47 265 -77 -238
3923 -238 15 -25 55 690 103 -419 -298 -59 172 -215 -108 31 149 68 -640 -30 383 -220 -407 -16 523
3944 523 67 22 357 98 55 507 -362 -63 -16 135 -541 -698 -451 55 -157 541 417 49 206 -151 -23
3965 -23 -502 -229 171 -262 -39 185 214 -14 -6 414 -364 -28 446 -5 61 117 -57 132 35 -321 51 102 -48
3988 -48 -414 227 458 -115 -257 54 96 111 -689 -482 323 48 -6 244 413 -234 34 373 -24 627 24
4009 24 -10 -225 470 -16 229 -129 376 -73 138 -88 206 -334 -40 -84 -258 -54 137 804 197 -12 146
4030 146 -153 -98 176 200 -105 -231 299 244 -304 63 -7 36 -720 -224 -363 235 46 -395 -515 267 -196 102
4052 102 157 -99 -398 198 235 -566 254 -123 -702 654 111 275 67 -356 290 -5 -27 333 -366 -197 305
4073 305 -69 519 -434 313 -153 435 -255 299 9 -124 436 530 284 -31 -722 -102 -210 -239 558 34 -327
4094 -327 -503 -167 386 256 267 -209 163 211 361 129 535 130 -589 -43 -409 186 -214 -776 769 190
4114 190 -149 170 -837 130 54 572 716 -340 230 275 78 -189 103 519 -190 -329 329 86 -5 -324
4134 -324 -261 -89 -73 198 -51 96 -318 97 -453 137 193 214 605 234 10 94 244 -348 143 -34 284 -345
4156 -345 -572 -83 -65 461 -388 99 417 -145 472 213 57 4 57 51 308 509 37 -315 -264 -260 -53 -65 -417
4179 -417 -234 611 5 176 524 -390 -272 333 248 205 -102 417 170 508 219 -161 255 62 -167 150 -2
4200 -2 -51 -8 147 118 186 168 88 89 389 150 30 -433 33 402 218 -88 416 -100 408 -16 38 226 191 -121
4224 -121 -265 16 -292 -208 476 -106 -223 -170 161 41 -23 537 -153 745 -10 89 315 -59 42 -73 210
4245 210 111 5 237 111 -251 -758 256 113 -12 237 -224 -315 17 -188 -550 89 4 663 -319 190 -209
4266 -209 260 -170 -173 122 -76 104 -168 -380 203 249 190 -7 51 26 79 142 -221 231 442 159 -261 -20 -137
4289 -137 118 132 222 -38 -179 -378 91 -31 -188 -60 -59 109 -438 -483 -34 -354 74 489 591 124 -332 206
4311 206 299 -396 -113 -301 -147 -179 395 341 259 -224 2 171 102 -164 371 257 23 -49 235 434 264 -291
4333 -291 674 509 226 386 -368 356 -411 343 229 -24 -47 -105 29 154 362 259 -207 -61 -127 112 -281
4354 -281 -525 -464 32 -293 -12 -45 -288 -256 91 -135 187 136 -110 26 14 -33 -183 -102 212 415 140 167 512
4377 512 -188 107 -349 -121 345 -174 395 414 -268 -25 106 -206 -151 -96 -72 191 -168 229 -102 -323 -462
4398 -462 -283 -281 -243 130 -286 -48 -230 -10 230 92 -13 176 -177 -346 -320 -491 -328 49 -32 -270 140 244
4420 244 359 144 48 382 -25 71 77 82 55 222 -197 71 220 -156 453 230 -424 250 134 321 119 144 -81
4443 -81 9 -266 213 368 -450 -284 393 121 43 570 479 73 -185 -399 -141 471 412 164 -126 42 -494 -319
4465 -319 -481 49 -43 -488 -22 312 -81 -329 429 209 109 19 -15 158 181 -41 -232 324 -440 -131 228
4486 228 -234 -340 -466 414 -511 -171 318 448 -59 89 102 589 143 468 97 -10 67 264 -186 -323 239
4507 239 -124 495 288 -500 50 301 277 166 34 6 -143 -252 -139 74 217 -372 -104 -60 -100 194 183 -130
4529 -130 -193 -360 152 -194 -146 72 -294 -105 488 -316 126 46 18 308 202 162 -168 -212 -198 -119 -91 -281 -64
4552 -64 138 -369 404 191 77 356 -126 61 15 -76 125 -253 -201 194 193 70 288 -145 21 -156 -168 200
4574 200 274 197 132 50 170 -466 893 -216 138 210 -123 472 76 -388 -602 235 -244 -300 -18 23 541 287
4596 287 -44 311 -290 -6 15 63 300 248 -276 445 -505 0 105 442 233 85 -548 61 -557 -16 -209
4617 -209 -403 -38 221 -140 304 217 -331 -256 98 107 759 -295 -294 735 892 -588 603 -236 20 541 -486
4638 -486 302 -79 -190 13 -416 7 63 41 113 -252 486 29 367 -4 -38 -309 289 -379 -147 176 -161
4659 -161 23 16 -217 373 209 172 11 90 280 -53 342 -171 1 -174 -197 297 110 -291 145 -141 -333 65
4681 65 199 -118 -32 18 80 254 130 -529 260 -265 287 -386 -144 708 -89 216 -596 -89 -168 -8 -270 407
4703 407 97 -107 -273 -251 118 -77 -90 -301 -310 -115 -570 -126 -95 136 -197 212 -27 -283 -288 -85 138 -321
4725 -321 183 -320 -6 449 -128 111 138 278 -66 -65 -79 -170 116 -269 11 261 128 -453 -123 -224 -184 77
4747 77 -268 -16 -81 -247 -397 -86 -235 605 -230 603 61 67 254 -237 -478 -183 343 106 312 -230 248
4768 248 28 -456 187 -127 -65 -420 201 276 -96 -174 -233 317 -235 284 -65 -143 -218 -170 -145 -237 -498 -341 -161
4791 -161 -212 -121 2 -441 504 -12 398 33 134 148 73 -334 -298 256 -123 533 4 447 73 -244 137 -344
4813 -344 -406 304 -378 -442 -44 -423 116 379 -161 -452 -66 137 595 -146 -301 321 -310 592 -411 -88
4833 -88 -284 121 145 -47 295 144 -399 -186 107 -492 -73 -1 132 -596 225 -172 350 128 -474 149 460
4854 460 -29 192 358 -587 291 -532 502 -97 256 206 -436 -565 293 529 201 -337 101 365 377 -7
4874 -7 261 -281 332 -291 -366 43 -331 182 366 263 114 250 -314 -79 202 -53 177 70 -153 101 106 178
4896 178 -19 250 473 -170 42 -31 2 481 -199 -210 -81 14 -37 -226 104 -100 -42 -387 -321 203 -249 -73
4918 -73 340 99 95 -249 189 -160 48 -76 74 -143 616 -180 -51 8 263 143 358 67 66 -124 270 144
4940 144 364 -230 52 52 -198 146 110 840 338 440 547 422 -27 168 -240 -51 -99 -100 369 -764 -58 -394
4962 -394 -179 -193 94 -286 518 179 -21 225 81 110 -128 564 -291 43 37 106 -171 -62 149 -204 -59 336
4984 336 -136 34 141 -537 102 4 169 -452 226 -213 -76 -206 -222 -61 -387 -10 -497 -278 -481 40 -203
5005 -203 76 237 53 -373 20 220 388 153 -290 -29 5 -329 -339 -256 25 245 -225 -167 -263 -704 2 -533
5027 -533 12 -431 247 -339 -250 -31 -157 -234 -178 543 465 -52 128 -289 -491 -250 234 530 163 172 35 250
5049 250 -65 20 177 -23 79 48 164 111 456 285 224 15 -370 -460 133 466 183 175 -705 130 -382 148
5071 148 -37 241 -142 263 149 258 -282 128 360 184 305 -182 931 -204 417 -18 458 512 -63 -191
5091 -191 -10 -226 520 110 3 202 -194 -262 -271 -50 -2 357 -46 403 -327 381 -136 260 -291 -497 115
5112 115 80 -46 -267 187 3 -510 31 -278 191 -93 -127 26 -428 265 93 -71 57 49 28 13 163 146
5134 146 66 780 -232 349 248 174 -249 1149 169 40 -203 -95 -220 256 537 104 -146 69 52 -260
5154 -260 225 -159 61 -78 -197 -91 114 -182 -78 16 -168 -282 -382 271 263 -290 30 89 -44 -10 375 -17
5176 -17 212 168 568 367 397 346 474 -74 20 -63 279 -56 542 -63 4 329 37 241 -144 -429 222 233 -227
5199 -227 -118 236 342 -103 270 -275 262 -48 50 501 -149 -45 282 109 -480 -224 -144 143 -45 175 -1
5220 -1 183 316 396 -145 353 3 -247 165 383 50 -174 -74 194 23 -294 -150 -490 -10 -124 -203 -222 92
5242 92 418 -384 -533 330 -131 455 -287 -213 -215 -100 -781 -27 90 -192 -213 119 302 -10 -424 270 247 121
5264 121 -165 -283 -18 110 -14 -83 14 138 107 -140 -298 318 -450 -402 -338 75 -166 61 128 -47 235 -215
5286 -215 -189 -379 184 235 83 -669 -566 -57 -406 87 -273 -65 -81 40 -431 -375 21 83 113 59 713 -583
5308 -583 -274 135 -322 187 268 219 110 354 740 -206 341 -230 -260 212 -114 302 74 -48 -261 -257 -152 214
5330 214 -364 -358 109 241 -134 118 -267 56 199 177 133 -257 261 164 -198 361 -348 -164 155 -275 55 215
5352 215 -141 277 482 -440 -294 -39 163 -73 337 480 -48 320 -401 110 276 -372 309 -261 -217 171
5372 171 -393 284 530 236 167 -40 325 1 -183 190 272 417 -243 17 307 -103 -40 404 323 238 -67 306
5394 306 317 52 157 -348 -291 650 151 3 251 85 233 332 66 403 278 183 212 245 -260 177 81 154 234
5417 234 193 -140 251 98 243 53 501 313 88 188 -50 18 105 35 -43 120 217 -218 11 164 -176 72
5439 72 -272 -844 -342 325 -287 111 -134 425 -426 527 -97 -412 -93 207 572 -146 301 -219 -322 -96
5459 -96 764 -13 -70 108 475 -398 -367 -784 -164 -157 -121 -102 -126 446 68 493 200 60 -224 43 327 273 -25
5482 -25 -288 -33 -29 -293 -577 -153 55 181 224 444 -567 182 -196 274 -796 -449 235 -291 -160 -161 -21
5503 -21 -437 35 -245 94 -132 166 -202 106 94 -121 -184 -820 -430 92 271 482 -448 968 570 162 324
5524 324 -183 242 -59 159 6 -530 -274 -253 2 549 6 -367 -125 331 -179 -114 118 542 -365 348 -245
5545 -245 132 -508 265 202 -142 -116 -163 244 67 16 110 -42 38 -421 23 -84 189 57 -412 -68 210 -429
5567 -429 17 -26 242 -224 -323 -15 -566 479 426 395 254 362 273 234 269 64 -700 389 -88 -23 470 9
5589 9 -525 -76 -222 36 -183 38 17 -12 323 -40 -111 -119 -261 294 193 123 -155 -50 184 -143 -270 173 30
5612 30 -257 131 -239 439 -354 -122 34 200 283 259 -292 276 -274 363 -4 -66 -203 -400 186 310 182
5633 182 173 -243 -536 88 -117 91 -450 191 68 -278 26 -346 -469 723 -168 -464 -465 68 -95 -24 66 165
5655 165 -256 -6 -218 169 -324 -11 119 -60 -266 -571 382 -118 -470 68 -381 -141 15 103 49 145 104
5676 104 631 22 -298 19 -23 42 -243 -438 164 -190 217 154 88 -200 198 625 218 4 300 56 -269
5697 -269 -400 -118 -232 -146 -55 -164 -109 -301 -103 123 212 -23 121 -177 310 79 -220 315 -284 -335 -195 -341
5719 -341 581 128 59 180 -432 -608 -283 455 -152 -68 -173 130 438 0 159 451 -455 -337 -518 -958 445
5740 445 61 90 -26 700 -36 400 -360 61 56 -40 77 -97 225 -111 141 335 621 -90 257 162 162 293
5762 293 -187 407 243 -573 -136 -159 195 -200 537 219 318 -321 -180 141 289 -126 142 -15 -4 544 -186
5783 -186 -107 252 -685 -276 517 -28 -298 233 -58 3 -327 8 367 -242 180 -352 152 -29 63 -328 69
5804 69 21 8 -191 421 254 36 -145 347 182 -163 429 -471 434 117 293 -80 -26 72 -241 151 -69 -102
5826 -102 -36 -54 -127 204 -172 -125 -390 -214 -216 584 467 -23 115 490 74 -726 57 14 694 -361 465 -528
5848 -528 -211 -267 57 241 9 251 -213 26 -738 -246 -251 -127 -268 261 -32 -162 98 -454 -252 282 -143
5869 -143 107 -53 101 145 -279 79 -378 -119 -259 -153 127 -703 531 82 -473 39 209 -419 -156 403
5889 403 192 -168 -108 -174 -206 146 -179 -438 -76 337 -75 -300 13 75 -18 32 -33 347 -217 353 -108 238
5911 238 -56 187 373 172 162 116 -389 -162 -112 71 84 -98 86 -519 289 453 -341 336 -252 -141 312
5932 312 -281 -180 105 134 -414 -542 246 309 84 310 11 149 38 490 305 -164 -222 -588 -252 -630 -47
5953 -47 61 306 -21 -205 -197 42 17 -105 159 -207 194 -233 70 -78 -356 -341 -4 -172 -209 -205 38 95 541
5976 541 -53 -404 325 -76 -242 -213 -139 386 84 841 136 -315 -86 164 -237 303 -287 -336 427 -172 -74
5997 -74 -80 59 202 -457 -385 -41 58 76 -178 529 294 -146 539 103 -598 -236 42 -58 -276 257 -176 314
6019 314 -563 -366 -177 230 -358 213 -159 -198 425 45 -19 -399 357 18 -296 -148 20 -277 -65 -580 -130
6040 -130 40 269 354 -16 121 -56 520 -245 46 -228 -449 444 329 -9 500 -133 -61 117 -110 -165 9
6061 9 116 -317 137 100 515 -315 -23 -258 -275 -204 -208 505 166 95 343 -133 -180 313 83 -394 -405 -483 296 442
6085 442 119 -68 363 119 508 -221 -206 699 -34 -79 -285 -556 -174 329 -300 -6 -166 86 137 421 -209
6106 -209 0 475 -36 113 159 93 140 -47 94 -36 -168 99 -308 -290 -120 505 464 -7 -239 190 146 -203
6128 -203 359 277 -315 -121 78 -104 -62 340 393 159 252 -622 -10 -492 342 119 353 -86 -117 218 -182 -119
6150 -119 48 -42 19 -540 -35 -229 -208 -69 133 -6 294 56 -180 -275 124 -109 16 3 -382 -68 -428 84
6172 84 -256 61 -167 -360 -229 487 -191 129 164 161 486 -140 -39 -4 381 -212 -581 71 -407 13 2 49
6194 49 -219 257 94 -73 -355 -104 -58 173 27 -409 473 361 -31 -92 -508 -280 -76 268 122 112 -426
6215 -426 -199 -448 257 -186 289 -29 -504 -23 -19 5 143 297 512 -150 -183 -27 151 -143 5 -152 198
6236 198 195 -66 609 -79 449 -111 -162 11 -35 -203 399 -97 273 194 104 187 -312 -8 -978 28 -73 276
6258 276 157 -528 -424 -252 -190 -243 -201 198 -112 -143 -360 585 -354 -368 -480 -66 -62 -130 -115 404 -94 -239 379
6281 379 94 244 115 -123 -22 -23 -227 73 612 295 -390 4 -318 293 -235 -88 684 -7 -476 254 -179
6302 -179 -447 317 242 -116 691 170 53 -357 5 154 -43 428 311 -324 162 -164 -42 273 -59 -163
6322 -163 54 199 401 59 52 -140 -258 -372 -207 -114 137 54 -246 -297 173 -231 141 260 -418 -73 -90 -319
6344 -319 43 155 208 477 -43 -180 -270 182 513 329 -532 -230 -171 1096 -59 -214 127 132 -22 -86 -224
6365 -224 -237 254 90 -175 -36 -17 104 -157 237 210 -105 57 -342 -73 -138 4 -69 56 -114 -275 478 -82
6387 -82 55 -347 149 563 -70 -13 -28 185 67 -188 -446 -410 556 400 631 -355 227 -23 809 33 -881
6408 -881 -213 249 -176 -317 -191 727 9 50 -24 -202 263 -885 141 -18 -135 -603 -225 347 -782 -27
6428 -27 425 -76 605 -320 838 348 77 35 -126 239 -178 18 227 79 -46 -8 264 -406 -37 174 313
6449 313 -656 830 -20 -631 -356 -380 147 -249 -138 -32 179 -32 390 85 145 73 204 -271 -362 -23 74
6470 74 -184 486 -743 -477 -16 -21 336 -117 -326 22 -62 -313 74 58 77 309 404 -9 139 -92 278 -158
6492 -158 54 363 -39 2 314 -538 507 -458 -158 131 -173 260 -238 275 41 -109 236 -83 -4 223
6512 223 -84 -81 -257 121 -190 445 -556 -180 24 -52 484 223 -315 -419 671 -131 199 314 15 -36 294
6533 294 -128 340 -594 186 447 -524 -51 -229 -193 110 169 -306 -109 -85 280 220 -265 -25 110 -223 229
6554 229 174 126 178 -35 -410 -107 66 -39 -269 179 -171 15 -45 -144 -389 30 66 -188 11 -324 -499 15
6576 15 131 -259 430 481 184 -251 319 268 195 653 94 -278 -340 -351 -372 -109 -216 239 -227 -220 273 -46 24
6599 24 204 347 799 370 -593 -457 -123 188 599 -365 513 -679 -99 -175 613 7 102 1216 -271 705
6619 705 -35 69 -428 149 -167 294 -328 175 352 329 -18 535 -280 -272 -461 136 280 -325 -110 -20 -284
6640 -284 202 -158 -302 22 -232 -242 -132 190 -375 188 -147 -83 -242 -56 8 149 -205 -622 354 -47 -68
6661 -68 -210 -220 -393 36 335 -239 -299 134 287 -166 127 -302 -266 6 351 -173 -56 -145 503 -16 218 263
6683 263 88 46 -629 -225 8 177 166 -66 -176 298 101 -114 -313 217 -332 -273 8 243 331 -364 134
6704 134 327 -20 -113 91 223 178 -65 -186 474 663 300 -167 -16 -171 -165 -255 -145 186 -51 32 46 224
6726 224 -244 -131 -480 155 239 -338 -271 -288 235 -309 111 185 104 158 -201 349 224 25 -167 131 -206 571
6748 571 156 -79 -117 -33 -573 107 364 226 -203 119 -119 257 259 -236 207 273 -243 81 -273 -512 252 132
6770 132 637 45 -123 426 366 190 62 38 -223 184 -109 -507 -207 -104 -472 234 207 3 256 -234 -293
6791 -293 -293 92 -440 -483 -532 -7 353 -18 -219 73 77 -519 486 18 -283 497 -249 -152 -317 217 -245 -47
6813 -47 178 190 439 12 662 -194 197 422 285 -459 7 473 399 217 105 -396 -62 -137 -164 1 400 -482
6835 -482 252 -176 320 -387 -415 -178 -387 287 539 -161 -159 923 50 -2 -1 -308 206 241 -262 -136 -59 -110 54
6858 54 -105 -347 195 -53 -178 -279 64 -83 200 147 217 -111 59 -311 -34 107 383 -516 -316 305 -55
6879 -55 -2 250 189 -282 -263 41 -629 406 296 -548 -814 -74 -596 -889 211 -675 -726 535 547 -214 396
6900 396 -569 -64 277 -217 30 -520 -39 143 -1 290 67 -334 93 192 32 568 -159 329 -15 -128
6920 -128 -127 -222 -22 -33 45 -39 -131 -424 290 -145 213 379 -138 119 -279 -817 240 75 -345 556 297 207
6942 207 -1 426 -138 183 169 107 -191 -101 421 88 -162 129 47 47 -187 51 -29 98 -264 -41 -368 64
6964 64 223 -381 -329 147 10 -302 -189 145 -145 271 98 -374 560 -133 -348 -134 -283 -116 -240 -31 310
6985 310 90 86 -271 253 257 80 -451 -13 -9 -41 46 -389 84 209 93 -347 -19 319 -49 159 -155 -98 -130
7008 -130 -818 -220 158 262 -142 -205 -313 84 324 -505 -349 192 320 -477 -20 -242 -2 0 128 -59 -386
7029 -386 209 -272 517 -64 -306 347 37 -46 155 85 -441 127 -177 -195 298 -213 -238 598 -19 277 81
7050 81 52 228 54 -377 80 226 -358 307 812 -142 477 -299 -320 82 -322 298 -61 187 -80 -195 -55
7071 -55 -286 -274 -38 -234 -57 64 -30 -331 -486 -269 -159 -30 -4 -513 -175 -220 -515 47 231 162 153 143 -194
7094 -194 -163 294 162 -477 -48 -92 628 72 27 -240 169 204 -104 227 -195 81 -320 -403 181 155 -81 264
7116 264 40 -255 316 238 -104 -139 158 52 77 -133 129 325 260 -29 375 -9 -184 -68 -16 288 52 -197
7138 -197 -320 -436 248 -110 -273 126 -105 165 -170 248 129 -364 52 32 491 140 -7 415 -341 386
7158 386 120 240 9 -269 -554 -715 1124 -290 -349 -165 -173 -121 -93 181 -44 382 249 61 336 -81 52
7179 52 23 -27 346 243 -150 265 -250 -22 -323 106 -66 -349 85 70 -176 -148 504 -233 -105 -477 -448 98
7201 98 303 286 156 -370 -552 472 -336 -298 -99 75 258 -241 266 -38 -98 -444 573 -86 -68 -65 76 104
7223 104 -193 -266 189 -193 59 80 -183 -47 -236 600 -93 -123 62 -68 -268 -234 209 111 696 233 -65 388
7245 388 239 484 -110 -156 106 -349 -98 -5 221 -143 -502 -58 -625 -67 -271 -33 -69 -194 -245 338 -59
7266 -59 -118 -128 86 529 79 -48 -482 -479 56 75 135 488 -552 -106 112 68 44 220 403 -392 -420 -82 -405
7289 -405 322 56 37 210 -203 -556 194 246 -39 395 629 -244 -584 36 323 271 324 93 126 -310 -6 -25
7311 -25 -118 -115 -14 -341 -347 -304 237 -512 -1083 473 131 -220 290 83 -111 136 320 669 -74 223 -179 -252
7333 -252 -118 -56 335 -182 624 282 189 -547 -332 -295 314 -72 144 -287 -213 -60 -34 -211 306 -330 511 -225
7355 -225 0 210 -337 172 222 -160 -111 704 269 271 229 -125 150 115 86 -359 562 249 414 251 -167 100
7377 100 -12 -473 161 65 -33 148 -143 63 -264 56 -159 -54 -401 -110 138 -9 -349 -324 -834 510 -519
7398 -519 148 -18 -244 -18 26 -125 72 134 0 115 -64 -266 103 -242 -62 246 409 -19 -61 482 448
7419 448 -227 -12 -194 167 -157 -318 65 -280 -157 170 253 -6 159 312 83 -306 -48 -240 -6 -99 -71
7440 -71 -321 -345 -157 29 293 14 -387 -24 112 -262 478 -284 -162 472 595 357 552 -14 -200 48 -79
7461 -79 260 473 123 24 -5 186 -402 -434 460 -123 222 103 -171 33 -67 -267 218 3 253 213 311 205
7483 205 -178 147 -314 -359 55 -158 -258 -210 127 145 -529 -620 -198 400 280 97 -10 131 -82 -483 -234
7504 -234 -618 -414 287 401 -31 214 -263 -228 -96 256 -102 -47 264 484 -117 -246 -588 -373 -418 -3 -43
7525 -43 526 65 110 -751 -139 124 -58 61 97 -243 175 -163 -372 536 99 -117 -294 -32 190 -9 244
7546 244 248 -174 587 -265 -8 811 -45 -417 -217 139 711 -84 -502 -188 442 -49 134 83 -261 26 -484
7567 -484 235 87 124 -283 16 34 -82 -201 277 -84 386 -312 10 166 145 173 -69 316 299 663 277 -58
7589 -58 133 -382 -149 -598 119 148 152 1102 303 62 -842 -830 -342 369 -301 -223 -243 137 -433 340 314 -38 -392
7612 -392 -495 292 -168 -229 214 78 -69 -50 -45 77 -165 -258 -199 253 267 121 -74 101 611 -46 -110 -111 326
7635 326 -72 -200 -102 419 -105 429 -540 62 -377 45 139 -304 42 255 54 -65 209 62 373 34 -481
7656 -481 12 -137 22 -160 -239 -123 -64 -442 -399 137 339 -165 138 -185 179 527 -137 420 -72 -315 295
7677 295 378 -196 217 16 -88 416 -400 18 165 -105 -143 35 87 421 -61 -84 318 464 -20 166 464
7698 464 312 -15 -233 -96 347 249 459 -58 -302 -188 -557 -317 -55 64 57 -428 126 -407 -12 -126 431
7719 431 290 75 -198 -720 118 348 -325 -67 332 208 527 268 275 11 -190 -96 95 -247 87 139 5
7740 5 -537 423 -361 123 255 -249 389 -235 -85 53 -227 -138 4 265 351 85 -11 3 -162 -279 289 -164
7762 -164 -372 273 72 -347 -54 336 -294 -277 323 -86 85 -224 94 -201 6 203 -51 -321 -321 -223 -183 98
7784 98 0 191 -562 192 -74 -710 -503 -401 -188 -249 -48 155 256 173 -404 -67 402 168 -379 -456 134 -344
7806 -344 44 38 146 -2 14 -566 -291 48 445 742 1 -39 131 -36 250 329 -368 -143 29 259 -84 -428
7828 -428 223 -342 257 101 150 -89 -442 -263 -63 -202 272 347 130 511 -184 177 -11 -237 -28 106 -405
7849 -405 89 -659 189 -228 -5 -220 246 3 707 302 -190 -269 177 74 412 -191 51 -423 -194 69
7869 69 -126 -89 139 316 257 -68 251 -157 775 438 -6 337 -96 -84 -482 -313 -282 -237 399 197 -659 182
7891 182 -231 -216 382 387 4 20 -100 -137 313 -53 -87 -103 209 2 -285 393 -301 51 256 -206 36 -160
7913 -160 -66 202 88 -448 -91 89 90 571 129 -244 471 -325 -255 -257 -105 -128 -52 564 -48 -80 294 -165 -445
7936 -445 -59 180 14 22 389 79 50 -95 -177 134 237 597 175 -488 140 -183 -349 3 -501 13 -41 222
7958 222 -149 -89 17 4 -55 -42 -352 -139 70 200 328 -364 41 351 -175 -543 -131 233 -47 -187 -183 -193
7980 -193 17 -443 152 73 -43 -397 410 -458 -15 -389 -379 201 150 -335 -327 460 -68 -104 118 -745 -127 -82
8002 -82 299 -390 -461 -465 -181 157 -139 48 -82 73 502 -315 -216 -136 -11 128 337 1438 3 -98 -611
8023 -611 159 -543 280 471 24 76 -668 322 189 -98 122 215 -172 -129 103 281 -66 106 -53 -56 270 178
8045 178 34 196 68 -72 152 251 -505 -464 6 -408 -18 24 0 -751 180 75 -689 -510 380 713 93
8066 93 -128 320 -77 -150 -362 -160 111 -164 -86 512 198 10 251 -251 20 838 422 116 51 -358 1641
8087 1641 196 1674 162 -396 -257 -230 388 401 -65 -204 -37 218 -245 -32 40 36 -450 414 91 65 -108
8108 -108 148 -51 67 90 57 271 -567 150 -143 -119 84 242 -744 81 11 261 -510 -149 1 -17 -134 -244
8130 -244 -266 -124 393 40 -122 -178 -270 -177 161 173 2 -207 -343 -340 236 -272 -497 -167 -167 362 62 387 18
8153 18 85 213 -5 127 487 -312 -111 274 280 475 -401 -54 96 139 72 238 -199 138 -49 100 -68 265
8175 265 -110 -57 252 -172 28 -128 -221 -77 115 549 42 78 -62 638 -478 68
8191F8
$$ Imaginary data points
##PAGE= N=2
##DATA TABLE= (X++(I..I)), XYDATA
0 0 0 0 0 0 24 0 24 -24 48 -48 48 -72 96 -120 144 -168 210 -240 288 -336 389 -456 529 -606 697 -803
26 -803 910 -1033 1172 -1327 1490 -1678 1878 -2101 2345 -2612 2903 -3224 3578 -3965 4389 -4858
42 -4858 5382 -5955 6600 -7327 8144 -9075 10143 -11392 12872 -14652 16839 -19612
54 -19612 23261 -28292 35697 -47729 70585 -129448 591962 1079064 -386869 -401888 403955
65 403955 409789 -403022 -213233 431217 246426 -386186 -125730 346338 60664 -403342
75 -403342 -76042 336857 138017 -180803 -70858 -9577 -131560 -13219 269001 134797
85 134797 -177530 -119252 96553 2761 -99955 71554 145991 -51351 -66975 117576 21170
96 21170 -227098 -63379 256683 126869 -165031 -46598 134545 -78558 -219384 96704
106 96704 274228 -35948 -204492 50542 109133 -160577 -117521 213737 138987 -201113 -96644
117 -96644 205557 17348 -287975 -31624 304305 48175 -254687 -441 210616 -117040
127 -117040 -282466 132979 327314 -92153 -298178 62017 204714 -130305 -189134 162004
137 162004 178839 -167841 -154838 163817 94664 -221419 -114692 219783 138589 -163917 -120681
148 -120681 86668 24148 -100518 19027 122541 -17329 -114389 -464 59707 -28153 -39146
159 -39146 39808 19914 -31215 21418 32783 -80691 -79193 88021 110810 -58308 -86757 51672
171 51672 40523 -86201 -23069 120678 34433 -116525 -20244 117424 1083 -122613 12333
182 12333 131196 -4167 -97294 33896 82106 -68820 -83301 99980 108160 -81022 -86360
193 -86360 85041 65264 -91866 -38514 118839 45690 -107626 -24181 113261 12542 -111071
204 -111071 5666 124907 6399 -100290 10696 89982 -24972 -79304 47012 92009
214 92009 -33322 -76006 32658 61205 -31446 -39022 43594 38765 -34882 -24044 33120 12981
226 12981 -29901 -1785 31826 3735 -17916 2112 2479 -16690 3835 28840 -3103 -29830
238 -29830 4285 22815 -17465 -25617 23924 24262 -32751 -26693 32823 16929 -46553 -23779 44303
251 44303 18272 -47178 -18540 37143 -19 -48780 -1444 46918 -7144 -54307 430 41262
263 41262 -12864 -45969 9759 36173 -19120 -38927 13777 25803 -27008 -30876 22496 23754
275 23754 -26688 -27778 16544 13380 -22813 -13062 18666 5158 -23431 -8875 16064 1762 -18318
288 -18318 -3308 13498 826 -12908 -2268 6395 -2408 -5812 3573 5319 -2545 -4479 -252 1896
302 1896 2976 2691 -312 -2626 3936 5536 -2139 -3610 7298 8908 -3529 -4320 8894 8234 -5309
317 -5309 -4032 11997 11061 -5360 -4108 10032 8484 -3881 -1036 10628 7399 -3836 -356 9303
331 9303 5708 -2666 1203 8654 5105 -1158 1602 6375 3108 397 3477 5800 2447 -448 1882
346 1882 4248 2159 -61 1099 3946 2315 -1791 -89 4057 3688 -1983 -1878 4663 4017 -4113 -4266
362 -4266 4375 4438 -4679 -5464 4080 3769 -5471 -4648 4079 2553 -6204 -4202 4660 884 -7781 -3468
378 -3468 4335 -2055 -8321 -1623 3927 -3720 -8785 -730 3155 -4859 -8267 -438 2159 -5089 -6891
393 -6891 204 430 -6317 -4841 789 -1165 -6192 -2912 1252 -3426 -6211 -1254 151 -3989 -4548 303
409 303 227 -5301 -3028 1748 -1227 -5228 -804 2952 -2629 -5284 896 3544 -3793 -5472 3028 3889
425 3889 -4146 -4707 4658 3612 -4227 -2786 4421 2822 -3867 -580 4756 1207 -3581 1831 6190
440 6190 -607 -3022 4517 6122 -1416 -1803 4920 5960 -2025 -1378 6271 5412 -1774 -747 6049 4629
456 4629 -1161 340 5357 2839 -237 2217 4481 1811 -206 2787 4148 1257 1000 3814 2713
471 2713 91 1871 3567 2228 -296 1978 3502 710 -42 1937 2146 25 301 2951 2177 -821
487 -821 -463 1876 1014 -1348 -678 1594 572 -1111 -1180 550 -527 -1854 0 690 -1363 -1659 -389
504 -389 -743 -2404 -2153 638 -706 -3440 -2554 -285 -374 -3828 -2771 432 -939 -3577 -3139 -14 -830
521 -830 -4325 -3538 966 -321 -4963 -4328 418 11 -4464 -4182 1221 892 -4355 -4212 1237 844 -4935
538 -4935 -4608 2363 1159 -5506 -3875 1407 2222 -4436 -3330 2754 808 -4616 -3410 2550 1608 -3790
554 -3790 -1931 2556 1164 -3396 -1242 2920 1608 -942 157 2571 411 -1305 174 1867 1514
569 1514 894 964 668 942 2193 532 314 2437 3346 628 -665 2152 3456 -492 -753 4199 4629
586 4629 -1285 -1458 4768 4542 -2020 -533 6621 3991 -4135 -1805 6547 3978 -3963 320 8078 2693
602 2693 -6369 -564 7924 1564 -5819 1200 8826 -278 -7803 984 8167 -250 -5849 2471 6986
617 6986 -2601 -6904 2277 6173 -1840 -4141 3136 4715 -4097 -4911 2283 3344 -2407 -2211 1912 605
633 605 -3187 -2330 889 518 -1435 -1097 -859 -2128 -1369 -1001 -2052 -1168 626 68 -4189 -3205 1344 -207
651 -207 -4854 -1453 3508 -1270 -6886 -2038 3585 -1829 -6789 131 5181 -2689 -8700 348 5290
666 5290 -3137 -7522 2646 5543 -5213 -8096 2781 6008 -4529 -6312 4534 5099 -6910 -5941
680 -5941 5309 4243 -5634 -3678 5924 2825 -6996 -3063 6060 2475 -4626 -1271 5507 626 -4806
695 -4806 -706 5163 1352 -2344 560 3378 -95 -2437 743 2403 1818 299 1225 271 58 1153
711 1153 465 121 2435 3013 72 -1624 2343 3312 -321 -1081 3686 4487 -2298 -1945 4412 3838 -2756
728 -2756 -1432 5851 4132 -4595 -2496 5776 3262 -4828 -396 6958 2352 -6080 -779 7001 1522
743 1522 -5155 484 6655 -166 -5707 971 6104 -687 -5035 2065 5431 -2654 -5611 1230 3877
758 3877 -2361 -4062 1375 3301 -3932 -3075 1581 1988 -1848 -2966 732 988 -2382 -2155 290 429
774 429 -1095 -1787 -1396 -834 -860 -1482 -1931 -366 683 -1717 -2925 -615 1493 -1516 -2864 -202 1659
791 1659 -2261 -4546 -535 2126 -1924 -3732 918 2869 -2820 -4438 1141 3156 -2629 -3697 2307
806 2307 2869 -2853 -3651 1962 3330 -2066 -2530 2944 2406 -3571 -2413 2571 2057 -2617 -1031 2503
822 2503 1591 -3431 -806 3050 1594 -1357 -561 1777 1010 -1424 327 2523 1369 -791 -220 1596
838 1596 851 -132 145 1797 1475 1269 -220 693 1255 638 362 676 1908 892 -146 783 1822 1148
856 1148 -695 919 2657 1357 -1164 168 2566 517 -1184 583 2054 959 -1375 22 2549
871 2549 625 -1564 372 2427 -3 -2080 757 2770 238 -1135 227 1358 -366 -1845 -562
886 -562 1601 -274 -1047 -571 689 -539 -1695 -454 1143 -561 -1495 -751 372 -440 -1606 -259 1042
903 1042 -713 -2284 -1224 166 -473 -1837 -1154 170 -281 -2113 -1106 72 -831 -1397 -973 438 -814
920 -814 -1715 -1275 205 -272 -1380 -790 311 -441 -1641 -897 340 -665 -774 -820 180 372 -1478 -169
938 -169 290 -616 -1164 -399 208 -284 -1087 -8 223 10 -222 339 292 442 -96 -722 314 858 466 -533
958 -533 692 710 556 -747 53 1560 1082 -215 211 1242 418 -387 672 1380 419 -531 645 1554
976 1554 415 -358 1088 1621 759 -309 1552 1737 -136 -415 1235 1407 -210 -35 1171 719 0
993 0 -221 1081 554 62 13 887 618 -380 735 567 246 -220 -129 1016 217 121 570 745 -152 -247 -186 -111
1015 -111 -2 -506 565 -169 -561 -286 70 -334 -641 -131 -78 -537 -165 -355 -434 -1560 -628 -95 -292 -938
1035 -938 -646 166 -751 -992 184 231 -1329 -1006 581 -389 -1360 -1181 470 140 -1183 -597 471 33
1053 33 -734 -390 218 -227 -757 -196 132 -453 -943 166 253 -1052 -430 -24 132 -942 -396 344 227 -959
1073 -959 86 346 -9 -831 -13 514 -391 -980 831 216 646 744 159 782 118 487 1208 471 -761
1092 -761 -13 588 144 -55 651 858 172 -434 895 674 66 236 1391 626 286 39 1136 281 -94
1111 -94 654 818 469 -161 301 1022 433 -512 1092 271 -344 -59 1114 518 41 -350 920 961 -392
1130 -392 55 765 597 432 402 413 -18 -468 755 530 124 -183 197 264 -193 127 618 -125 -608 149 609
1151 609 -89 -782 -387 164 -240 -199 -200 451 -798 -623 166 -163 -221 -121 146 71 -776 -225 -309 -897 -791 9
1173 9 12 -268 -427 -111 -276 -611 -441 -120 -69 -714 -710 248 53 -757 -336 304 -243 -684 -503 326 -544 -467 289
1196 289 22 -581 -365 -545 420 -397 -633 638 368 61 -437 342 -194 -319 -929 526 -394 -318 261 -275
1216 -275 155 203 -24 -838 -214 203 44 102 336 -426 -17 166 511 531 635 527 200 271 382 -176 -386
1237 -386 741 -558 45 764 969 496 199 1121 743 398 441 514 214 478 38 602 371 637 404 391
1257 391 631 839 -355 223 378 178 644 209 -350 333 206 -648 -358 321 691 -999 284 -157 -558
1276 -558 189 173 -255 -344 -332 167 -308 53 -250 -448 -511 -74 -395 247 -51 -559 -90 -557 -480 -479 -99 -298
1298 -298 -173 16 -253 -638 -157 -597 -279 -20 -342 -247 -246 -539 -301 -392 -494 -262 -431 -681 -435 168 -44
1319 -44 -315 -355 140 283 -144 -153 -156 -395 187 -91 93 -372 -284 -130 -325 385 78 -349 -102 -316 108 -67
1341 -67 78 382 220 -347 64 -364 -197 35 99 620 -80 -36 965 -117 549 344 777 157 -277 259
1361 259 588 219 18 60 497 292 -81 288 415 416 47 311 381 371 178 -221 633 -164 405 138 309 92
1383 92 94 -52 114 117 56 51 38 -3 -278 -25 -231 198 -295 116 638 505 -50 -67 -42 167 -55 -123 10 -406
1407 -406 526 -116 78 140 -561 55 273 156 -359 61 -213 176 294 -23 312 291 -55 -463 -656 734
1427 734 -289 470 -115 253 -97 -509 -555 99 -436 -1410 -13 -1064 -1181 541 -9 -292 176 -1011 -336
1446 -336 -58 -197 -205 -650 271 -8 -311 -256 -648 -3 -779 -306 -241 -484 -465 -508 313 -218 356 97 -194 -311
1468 -311 89 53 708 637 274 -89 374 209 131 76 505 108 -55 186 148 -400 -262 -96 -156 313 -231 419
1490 419 -521 54 77 223 140 301 301 70 -4 -146 678 591 198 367 -155 496 -274 682 -640 -142 167 657
1512 657 -58 164 457 -440 289 47 45 524 315 129 324 458 -393 -277 88 -265 -112 -231 -132 -31 -144
1533 -144 -331 -55 -145 17 -98 -276 -560 -98 230 446 -183 -566 -302 163 -501 82 -247 -502 154 132 -4
1554 -4 -396 238 -136 -167 12 99 258 -206 -53 -19 -362 219 -126 387 -403 435 -151 -569 -60 -103 92 -250
1576 -250 -223 190 512 -467 -177 -215 87 -242 34 226 406 193 120 -498 346 313 568 -304 -7 605 -29
1597 -29 328 261 342 478 -87 210 -469 -166 257 47 -56 -419 190 453 215 169 -141 -118 103 -393 -288 598
1619 598 -225 -237 -138 383 -59 -214 -399 -103 211 -114 447 599 311 63 279 268 285 -51 -161 140 323
1640 323 -104 407 260 88 96 -104 26 -309 343 365 631 -496 747 -302 -15 229 379 -120 9 449
1660 449 402 -374 -194 599 -145 -432 32 -19 -115 186 -398 -296 414 -265 -387 158 -274 -6 69 -87 420
1681 420 -241 -247 -175 -357 -546 219 -502 364 -472 332 279 -183 100 211 -229 42 -136 -29 -237 -764 -97
1702 -97 405 -535 117 107 -89 193 -37 43 -218 300 324 -219 286 278 -141 -72 44 -312 247 197 -752 269
1724 269 -240 -122 -310 189 304 408 -5 98 160 41 694 158 -217 -269 150 -130 488 -231 -432 494 253
1745 253 -148 -308 87 237 -104 236 403 19 210 104 164 -291 155 215 619 -9 57 362 111 -525 96
1766 96 -109 -28 82 -284 284 110 70 -246 207 587 249 22 738 -517 26 -265 26 79 288 545 -244
1787 -244 156 -247 42 -430 65 641 -208 -119 70 -529 90 -146 12 196 622 -12 262 -235 -216 192 199
1808 199 -648 76 -543 -84 -251 -108 78 -159 23 99 -59 141 -28 -559 -236 -117 -117 -192 475 -67 136
1829 136 -280 -196 -186 -87 -252 -234 -117 -911 -283 166 -226 375 -354 -93 131 -118 -147 -176 640 -240 292 -42
1851 -42 -284 -21 -65 -125 -93 83 391 171 -101 -209 -252 -318 -352 7 153 -79 173 116 -189 122 -411 3 443
1874 443 -37 -297 -97 322 22 226 175 490 -432 -191 234 179 -162 -58 346 -547 209 419 54 -351 246
1895 246 -95 490 203 -463 618 147 274 -78 -215 615 533 42 -329 123 -235 23 -533 -395 -121 262
1915 262 -401 -218 -235 303 64 519 102 71 -108 122 65 -31 -30 -292 -157 -63 -12 72 -91 -162 124 -207 -228 -550
1939 -550 -1 -333 251 366 254 -77 -14 568 319 -150 -433 -247 -509 -35 -391 67 -928 48 -113 -132 -351
1960 -351 -56 4 -272 14 -15 -263 -351 376 -57 575 -291 208 -168 -40 -440 -576 425 -2 228 299 98
1981 98 -130 -168 -550 361 -372 -336 -6 751 -315 427 221 -76 557 237 93 145 326 8 32 326 365 76
2003 76 112 -196 476 -428 167 -501 16 43 -88 72 202 -266 -469 259 146 -86 -4 -188 -280 306 132 250
2025 250 -274 333 -117 254 500 7 121 169 -329 -368 93 637 648 -26 123 321 -40 108 373 261 171
2046 171 -206 781 143 270 202 392 -138 202 -30 -182 32 -50 -177 -120 125 -135 134 -53 -401 588 -33
2067 -33 -259 -385 576 129 -325 356 -149 403 -528 32 339 96 -340 -700 -324 -759 125 550 189 32
2087 32 1 545 8 -583 -782 -1287 -600 -144 254 -613 -312 -134 49 215 -277 -204 -516 -160 -410 -339 175
2108 175 -315 -575 -449 76 161 -58 120 -322 -174 788 40 -157 -10 128 -422 -299 317 389 106 -11 321
2129 321 196 372 684 -219 -263 -114 -115 101 146 135 579 227 410 -475 -378 53 -322 81 105 157 286 -125 -97
2152 -97 271 -155 197 33 62 339 122 -44 -288 132 -289 -205 522 639 -143 -153 75 219 255 -77 -78 -401
2174 -401 149 57 401 173 146 -203 -5 -601 -308 -269 -416 -433 44 -69 -398 -331 -792 355 -249 -247 69 -153
2196 -153 -331 -279 501 -37 479 -134 82 111 -72 488 4 93 -573 59 109 378 15 -455 353 -80 -18 -136
2218 -136 -148 -55 -127 -315 -426 557 -298 -372 -184 579 285 -18 370 -504 207 324 -303 -332 -76 -403 -59 -278
2240 -278 -268 -57 -222 135 -412 -159 205 685 640 389 -209 -532 616 -127 -29 100 -234 252 -586 -287 -65
2261 -65 -126 -126 -48 -108 -140 -441 294 -466 -89 -54 273 335 -415 272 96 -147 181 74 163 -76 -631 139 -420
2284 -420 16 445 34 643 227 -265 -171 -331 372 -147 -191 -304 50 555 215 231 41 -285 752 -51 -285
2305 -285 469 -70 312 93 120 14 -97 233 242 97 -37 -456 65 -195 -548 -162 -565 -248 -304 20 377
2326 377 -336 58 -361 111 -110 -451 229 -283 -53 -158 273 154 541 241 -174 -78 -375 255 -79 188
2346 188 102 116 -115 87 142 404 -117 -25 -334 265 383 164 116 156 -270 48 584 138 -40 -75 -45 243 -144
2369 -144 193 -218 134 -116 -494 -182 -59 -241 269 62 -175 519 59 -238 349 -24 -426 -138 71 207
2389 207 -88 310 -423 -353 458 61 -292 -557 76 -121 264 461 97 -59 -48 -481 577 -303 -217 161 54
2410 54 479 32 383 -109 -240 20 2 387 75 -90 -213 9 -492 277 151 -121 231 12 235 -690 -19
2431 -19 -121 -464 37 384 -47 319 -278 317 57 242 -90 524 -178 -557 -74 250 243 -97 -254 72 -133
2452 -133 100 262 -275 -474 411 57 164 -116 -331 -95 46 44 4 -489 -189 -40 -230 -124 237 105 359
2473 359 211 -342 -290 -212 -518 218 -166 484 148 -517 -242 -276 101 308 287 -26 -292 -277 -41 -292 -41 -382
2495 -382 196 -71 35 276 -555 -90 426 226 -670 295 -461 -549 33 -343 422 -591 -31 -231 -218 -356
2515 -356 8 -474 -204 -1391 952 -558 -270 -31 -346 175 125 142 166 -66 -425 335 221 156 -21 -205
2535 -205 261 -468 24 -156 70 -198 508 -460 -74 -232 63 380 -144 364 39 225 44 -239 -362 -93
2555 -93 -375 -85 14 -100 127 254 399 59 34 424 -47 -178 302 283 106 169 458 296 128 -701 -290 -275
2577 -275 -300 78 -282 18 83 -471 174 424 -239 86 -203 -35 549 566 -15 -160 -41 108 200 252 171 55
2599 55 51 254 -347 -354 -278 81 -292 326 175 76 -137 67 5 137 -207 -376 -37 -170 -82 200 233 -188 -121 -399
2623 -399 -454 125 -167 640 16 -574 27 -242 177 72 -82 436 116 -198 361 -94 -236 407 197 -89
2643 -89 67 140 121 -243 475 -133 -117 307 -146 303 389 432 -532 -430 -99 -281 -102 -291 87 215 -107 326
2665 326 -62 485 -104 324 -17 138 -423 36 117 626 -277 214 -94 108 -78 41 -98 319 48 -242
2685 -242 -215 301 145 -184 78 -269 93 54 -117 -5 -335 -530 -194 84 -20 484 -186 469 -408 -245 399
2706 399 -197 -273 299 48 38 -109 -494 -452 301 60 -98 -282 -387 -676 -544 795 708 470 -497 815 -710
2727 -710 -95 -8 609 716 -374 -55 21 153 262 -394 120 416 -352 -4 -169 254 -197 195 205 -181 394
2748 394 17 -466 -7 191 269 -143 -56 -300 -39 45 -203 37 265 -268 -304 -405 738 -12 260 331 -136
2769 -136 -16 -261 -9 -31 -403 59 -361 -259 -29 -285 -1 -33 -80 -44 279 -70 -131 489 89 23 339 271
2791 271 89 -45 -59 102 -400 -27 360 109 115 -81 176 -626 -76 -75 131 -250 -510 -854 -569 -138 363 -417
2813 -417 78 78 -345 159 179 402 96 186 -11 189 425 -151 -172 -101 -194 -57 56 242 -164 450 -597 -6
2835 -6 -3 -71 31 -69 325 -309 205 183 -630 50 -367 -193 275 -184 330 -16 -125 -186 57 -126 -155 -162 -121 -452
2859 -452 -324 45 154 -96 11 -425 44 -314 405 -592 -141 518 442 -37 -273 -64 233 -71 -359 -249
2879 -249 388 96 11 567 -201 295 475 129 -182 -71 254 -65 -319 -79 -430 116 -195 538 170 -42
2899 -42 -541 1050 1380 -89 -49 -432 -210 67 97 -165 -423 -1054 205 659 -213 122 619 -27 -103 474
2919 474 -389 -249 -136 -101 138 5 -186 -30 -513 204 -486 76 -445 -143 292 -82 -555 -391 -45 -355
2939 -355 341 -351 -299 -353 -294 -139 -3 -314 -52 -418 42 136 183 192 -172 161 -455 305 -243 64 -38 -267
2961 -267 15 152 318 -72 901 175 -86 -93 -473 422 15 364 52 198 500 61 -53 39 -44 15 197 118
2983 118 51 -267 107 228 89 -273 407 37 381 133 -270 -333 16 310 -545 377 85 -507 -117 236 -307
3004 -307 -715 -1 -126 -177 168 -409 250 -273 85 -190 -488 77 -37 261 33 227 -215 -139 435 -205 107
3025 107 163 -26 -5 39 -5 302 -139 -218 179 30 -253 -195 87 -261 295 -1 -198 -111 83 99 94 37 -139 -68
3049 -68 -60 -205 -179 324 -160 129 256 99 -289 -261 107 -12 -129 -92 -60 -262 188 -330 -112 -49 -32 379 92
3072 92 195 274 117 -216 727 92 18 57 164 -119 177 -34 277 62 20 921 -82 116 312 -348 59
3093 59 -94 66 -84 -164 -83 560 -2 -27 -139 -141 -246 -343 194 -703 -258 337 -172 -452 -502 -308 -51 87 -194
3116 -194 -173 112 7 253 25 -27 367 -78 -76 -215 235 42 -26 -75 315 -316 -588 -39 236 118 -279 -32
3138 -32 84 -37 2 321 4 -211 -284 405 -27 40 -120 -10 828 25 -150 -240 20 -459 -215 43 -160 -104
3160 -104 460 487 -50 59 -81 -114 -169 -398 -420 194 -570 3 -125 117 -211 29 -110 236 32 308 162
3181 162 -416 148 255 -412 -493 377 -63 172 67 168 -195 -495 -49 -794 282 241 508 34 -147 -204 295
3202 295 3 -370 -62 -310 -118 173 -208 426 -269 -228 -186 -103 419 -182 139 -333 73 330 597 -103 374
3223 374 164 -142 20 359 -158 -219 -199 435 -156 -292 156 -62 196 577 -713 328 -193 -221 -204 -127 329
3244 329 -572 -205 -654 231 -329 586 -89 107 291 429 567 -190 125 -240 -736 -20 205 -121 362 -99
3264 -99 -555 -87 53 -308 -19 -28 -149 133 -303 304 44 -285 -301 3 -343 77 -160 254 -399 -659 7
3285 7 -91 -232 505 -136 -93 225 -21 53 -156 -299 45 -228 -84 563 -416 -118 -278 187 -286 55 -701 -288
3307 -288 -105 54 -82 -234 -93 -63 129 -263 -420 65 27 -261 126 120 -74 126 -338 -214 81 39 -194 204
3329 204 -126 -59 -16 210 -48 101 48 128 -47 -75 446 -120 -435 285 279 91 220 287 129 159 310 -91 65
3352 65 -377 -423 -454 207 371 281 119 124 113 -356 -19 -41 -10 -208 67 -272 -168 -41 188 -26 -310 -371 -192
3375 -192 -183 98 -387 -873 194 -302 -313 -248 -107 165 99 -341 -26 437 -55 -403 -140 308 -127 -110 -139 -130 -268
3398 -268 519 249 25 -425 -105 -502 450 179 -414 66 187 -718 410 86 -129 -64 172 315 483 -221
3418 -221 146 278 -418 -278 133 57 -226 -185 113 33 -11 455 87 -214 38 -354 156 -23 -182 -468 -40
3439 -40 -42 25 -137 -203 -175 44 -17 -670 210 -25 -40 -716 80 -353 -285 -171 -368 -322 -57 235 135 359 451 224
3463 224 -185 -179 224 49 -144 -282 -200 171 -282 77 51 -201 43 43 -48 420 -331 -84 -26 -302 140 122 -277
3486 -277 -98 -279 183 -169 301 395 -282 24 -14 -209 348 -24 -132 -388 -91 -467 126 69 186 33 -421
3507 -421 298 -202 -43 -120 -201 -378 371 43 -146 149 445 586 430 8 13 396 277 709 539 -439 410
3528 410 -462 -220 -632 -147 239 -16 426 -733 22 75 2 32 -174 113 -10 296 174 -41 16 222 168
3549 168 20 -169 -85 385 -517 196 -12 -303 -99 587 357 168 240 62 -478 522 -616 -492 57 97
3569 97 461 -976 616 -180 595 1028 -1241 -132 833 318 -509 -176 213 -133 516 178 -732 345 -519
3588 -519 222 -225 149 10 403 -152 208 289 -8 -221 -394 -233 -286 -318 -162 268 598 328 -379 414 98
3609 98 431 53 125 215 37 378 -276 336 156 232 184 -31 149 106 70 348 495 430 -50 -416 -335 -226 475
3632 475 -52 99 668 238 -66 -192 114 196 -132 -307 -608 -147 -288 179 213 -120 -100 165 -149 -129 283
3653 283 275 326 106 -55 415 79 -124 -381 -36 17 488 168 333 333 -55 17 8 38 88 -153 -122 -262 254 -303
3677 -303 -606 159 -165 -179 394 -522 -96 93 181 285 -140 383 -356 80 -274 -266 -330 -63 214 -135 -302 147
3699 147 -268 186 -151 87 283 540 -147 95 -52 93 115 67 628 -471 -303 -349 -52 114 53 428 -43
3720 -43 473 142 -156 -49 59 -275 273 28 241 157 -447 558 90 -406 -127 -100 58 6 197 -14 -17 251
3742 251 172 -73 576 13 -362 37 230 77 260 60 320 -350 358 -69 70 -346 -173 -50 -89 374 109
3763 109 264 -109 -445 211 -341 -380 -73 552 -526 127 -197 110 22 204 308 426 353 -25 -431 33 56
3784 56 -104 490 -377 4 -73 118 -504 -36 -321 -184 67 8 69 497 -339 -68 379 150 231 93 824 250
3806 250 -120 -153 -185 -104 215 112 -527 -109 223 259 -49 276 -313 -798 5 0 -108 670 146 -13 287 75
3828 75 86 -9 -346 144 -111 -188 239 -424 -137 -206 49 -44 187 -789 -140 190 -5 201 -567 346 -11 -49
3850 -49 -697 112 40 -250 75 432 -114 384 66 262 213 78 158 134 152 -598 705 -42 -761 -110 -783 -432
3872 -432 -404 234 171 -197 513 -105 -398 -470 98 -124 -144 -280 -157 125 -122 509 95 -828 -56 459 -278
3893 -278 -112 134 55 -658 235 -335 9 435 -42 -32 -35 -406 -403 57 -228 -363 -134 -254 261 10 -61 155
3915 155 -55 308 36 -266 -320 391 -96 315 -503 -169 279 -63 287 157 -133 -254 -352 83 -47 -230 -156
3936 -156 -82 112 -15 -610 10 -225 -163 128 -717 480 204 104 -273 49 259 519 124 264 810 -100
3956 -100 -749 -427 -345 -212 -26 -462 -266 103 -428 -64 257 -351 197 -98 340 291 -42 722 -450 -61
3976 -61 -7 -60 -14 -677 77 61 23 25 540 426 122 385 -249 -161 -331 -230 -132 222 -252 293 99 -13 -318
3999 -318 205 50 -101 -117 -413 234 -227 340 333 -486 -202 111 336 144 273 444 -186 -120 703 -411 69
4020 69 165 -331 218 154 75 -472 -223 356 -572 148 -270 14 85 322 -501 92 -319 -149 328 -78 -320 25
4042 25 124 -513 235 265 59 224 133 261 -368 -57 -515 556 473 -658 58 -1 120 299 431 -166 68
4063 68 -157 20 482 158 -472 352 -27 -79 40 -237 -210 -386 -30 215 353 -44 154 -563 -93 -154 -353
4084 -353 -131 437 -115 84 -290 53 247 196 -330 611 264 -460 133 -508 669 213 233 336 127 0
4104 0 -271 -450 707 142 593 -13 -245 -302 94 -111 -234 567 300 609 -601 -216 -667 -62 743 -91
4124 -91 137 12 176 -76 -326 871 -223 223 -353 2 -205 -46 -129 -174 -210 -71 -289 106 384 110 -30
4145 -30 -148 493 291 123 -545 133 8 -165 -248 476 -356 255 35 580 134 242 -38 69 -106 312 -16
4166 -16 -388 331 -348 -93 -228 -55 150 -331 497 -578 -53 -339 144 -424 246 186 -265 386 24 -65 -350
4187 -350 -405 -99 200 338 70 184 69 -53 -391 564 62 62 497 184 -76 24 217 -376 -110 -80 26
4208 26 21 -393 226 -238 96 462 -177 293 -56 -103 93 -5 193 -37 -203 322 -229 -9 -284 42 -584 85
4230 85 44 381 190 4 -127 -269 -9 -104 -183 -505 -188 211 -223 -281 609 19 7 184 -48 -90 -107 -234 686
4253 686 -107 -5 -233 118 -106 -93 351 407 237 -193 -403 -383 -196 -171 -141 17 249 108 -60 243 -282 -75
4275 -75 -69 71 271 -201 -406 114 -186 -728 -71 -584 -154 99 183 -163 261 -42 -237 -86 23 -5 141 -130
4297 -130 416 313 64 81 364 -511 -167 -794 4 123 -1 -83 -216 -327 -612 154 223 118 -750 129 528
4318 528 -141 -255 -99 -274 176 217 -830 332 -70 76 -275 57 -144 -180 -280 -124 105 -50 44 352
4338 352 -82 168 -285 -245 544 318 242 -462 10 -1 -113 8 -789 317 629 390 -43 326 183 -127 -290
4359 -290 -576 -967 -109 402 265 906 304 577 -230 -624 -48 -172 78 181 -112 -218 -23 150 -8 229
4379 229 -658 -104 465 166 -269 819 -205 -252 -234 256 115 548 -169 -344 129 247 416 -495 612 529
4399 529 656 138 21 -270 -415 -218 8 -290 380 145 70 50 205 -11 253 -757 28 276 -313 407
4419 407 273 51 -290 -342 13 610 -90 353 -268 106 -375 -364 257 -519 -499 -173 240 50 84 -7 -316 -344
4441 -344 476 108 -83 353 -145 -71 388 18 302 49 -19 595 -30 34 95 -140 327 188 -29 -425 2
4462 2 47 -149 -236 -99 26 595 43 -412 130 -202 -179 140 -307 377 -188 -180 -206 -133 -41 174 -115 69 250
4485 250 -146 526 -454 258 204 736 587 -5 -510 -563 450 -130 188 5 101 619 217 -174 -406 -50 420
4506 420 -71 82 192 -60 -188 -101 -404 99 -172 -166 62 39 -60 -123 -213 -334 48 -168 92 -252 29 -383
4528 -383 -27 52 -368 60 167 0 -310 294 -85 229 451 -176 279 -274 -243 202 111 116 434 248 -200 -117
4550 -117 414 77 -296 -148 -103 183 -362 195 -52 -153 -116 97 -17 213 153 184 -215 28 331 -144 14
4571 14 227 260 -5 -471 552 189 215 -288 490 -82 -140 -534 -224 -163 -107 -552 -643 -75 -380 104 511 -26
4593 -26 -339 -153 -185 343 429 -569 -340 545 -461 -580 33 -41 568 334 -185 -68 -249 309 -369 315 45
4614 45 -49 34 -489 -152 -232 142 -155 -539 105 -254 -68 108 -111 7 -379 -152 158 468 142 312 -866
4635 -866 158 239 -692 284 486 -390 264 237 -39 116 48 -570 33 139 -398 -185 66 346 261 361 -475
4656 -475 592 10 315 306 125 -56 98 5 -209 73 55 82 -189 -322 60 -96 -36 -203 249 146 -56 373
4678 373 -151 201 61 -114 -87 210 150 162 -138 -9 -107 261 323 -47 388 -313 367 633 219 -485 286 26
4700 26 -12 400 285 95 186 -224 220 -109 92 -402 -345 92 -432 50 56 -9 322 -208 -418 106 -361 98
4722 98 147 -131 -466 -359 168 -93 -677 -370 529 323 -68 155 -231 121 17 179 61 147 451 -246 225
4743 225 -226 -40 160 4 324 -18 17 -198 -564 -98 -560 514 421 -275 -254 178 234 218 -463 65 117 -104
4765 -104 -336 53 29 -303 486 339 -80 -422 81 -163 -45 -250 196 -251 105 -132 151 -49 10 370 -540
4786 -540 -79 231 -34 -243 -549 -352 58 224 -211 426 -313 595 18 652 -66 -20 375 -264 389 518
4806 518 -5 -20 175 187 119 -82 170 82 303 229 -19 34 -121 -203 117 -92 -52 256 -37 8 -258 -94 96
4829 96 28 -63 163 -48 -166 -453 -198 10 -54 182 111 253 -156 74 297 -298 -441 94 183 -317 -122 189
4851 189 -235 -274 -402 113 -307 -117 127 -60 452 247 168 -128 -115 -391 155 -104 -61 -160 -188 275 157 44
4873 44 3 -106 127 629 -263 223 -35 347 47 105 -70 -152 -345 -61 468 -535 -44 2 235 -358 131
4894 131 -14 -44 425 -12 248 527 -39 -250 182 290 -138 308 51 14 93 107 566 -180 372 106 310
4915 310 -47 206 -38 -488 -393 -69 148 471 -149 -36 30 69 -288 -112 270 -65 -21 -87 83 542 -1 93
4937 93 147 -79 -286 205 -83 246 31 -540 -41 -527 537 -867 -308 435 274 79 258 -295 -228 -250 -283
4958 -283 166 -231 78 -159 -12 -529 -1 117 358 33 225 -359 -36 -575 -234 -92 238 -96 78 113
4978 113 35 111 -201 290 -377 311 94 -52 439 -476 80 -233 -46 270 -215 -245 147 290 -489 -222 -252
4999 -252 -151 -81 474 -75 -253 43 180 -22 -144 262 -258 -50 19 116 241 -91 -268 -340 282 -5 123
5020 123 -117 572 27 -680 -399 -239 164 240 -28 83 -178 -40 -134 -35 -36 216 136 66 373 96 -106 317
5042 317 538 -73 -85 424 -269 98 290 579 341 -388 259 33 214 302 393 44 -61 -7 256 -114 19
5063 19 116 130 282 211 300 159 278 -128 75 -273 -125 -151 6 109 127 -16 -148 -141 -456 -410 69 -265 -56
5086 -56 -34 -163 137 100 94 33 -284 85 535 184 -202 397 -159 104 -253 -205 178 36 -44 142 209 132 -126
5109 -126 -133 -200 148 -274 206 -338 57 -37 -109 430 -152 355 -9 210 308 -421 -5 -197 73 379 170 -551
5131 -551 -50 45 -231 115 -215 60 -12 -7 -424 191 3 -518 163 -22 -396 -54 -233 165 135 -47 381 156
5153 156 146 54 -84 -132 388 80 -181 -4 89 -109 730 21 -424 130 -16 315 28 43 -356 -264 -51 -94
5175 -94 37 -414 -356 10 -27 94 138 -497 -326 -168 -12 -156 127 -185 -30 451 -116 144 88 197 261 151
5197 151 30 -127 -536 89 -333 662 60 619 -163 532 -410 -92 366 121 86 114 379 -126 749 -502
5217 -502 -288 515 -383 344 228 23 -353 -518 -260 -49 -357 75 59 -345 -233 -196 -89 244 -122 -69 -32
5238 -32 -316 12 27 31 396 -92 -286 -107 -283 5 -202 -379 -120 142 -32 117 -178 51 229 -430 -187
5259 -187 403 114 -343 -356 402 525 -139 347 -98 337 -577 -178 -142 207 438 371 21 -31 -351 74 254
5280 254 19 150 -45 70 -108 117 318 -137 417 -140 31 -290 393 -107 -363 -127 106 -747 -113 -44
5300 -44 58 320 -358 118 167 -209 526 -327 -495 69 -253 -308 -227 -265 -184 200 305 160 111 125 311 52 -190
5323 -190 -228 13 -75 -367 297 226 -259 214 -231 -5 247 -199 2 134 -144 51 -24 115 -97 158 299
5344 299 -387 68 -658 395 -254 -148 302 529 331 -20 17 -202 498 304 418 -303 556 -411 114 -71
5364 -71 39 -312 261 248 -108 353 431 121 256 191 121 237 -375 348 205 -54 -125 349 170 195 34 -745
5386 -745 464 45 -56 -88 -57 53 -227 307 142 232 35 -86 -256 -80 85 -431 100 -297 -399 -387 13
5407 13 -165 -343 -156 -371 535 -49 -604 -52 -224 -425 -619 -137 248 -439 -286 -585 183 -210 -63 -401
5427 -401 227 480 -285 516 350 431 72 -144 -176 -243 -392 -219 64 62 146 -153 234 -53 -75 189 -194 -433
5449 -433 -125 -96 77 334 533 -39 -28 38 100 -424 263 -9 96 -5 -254 -490 60 169 247 187 -78 315
5471 315 497 -485 406 304 597 414 -123 305 352 143 -299 -73 -495 -676 272 58 228 438 -121 -434
5491 -434 589 0 448 -1116 306 253 -424 175 228 2 71 -452 184 61 291 -241 -70 181 274 -372
5511 -372 217 -267 539 -90 -177 -236 -713 -147 -121 144 -184 -41 74 -325 139 -1 -426 342 -154 190 101
5532 101 441 361 255 -198 288 -992 -165 -159 -53 370 -52 -242 -75 219 244 -78 -28 -126 -68 271 -856 -154
5554 -154 237 -168 74 -16 -516 -440 257 -146 -170 291 469 405 -625 23 -5 -387 47 -157 -343 -72 -171 137
5576 137 166 -126 -130 402 152 306 -423 433 -9 -319 614 75 317 1 137 231 4 -45 82 -273 131 -239
5598 -239 119 381 -84 63 213 -40 -564 -115 -551 -79 393 22 -86 351 36 -120 98 281 -309 -41
5618 -41 196 -97 124 -114 211 -46 -267 179 -173 -188 -163 -340 122 106 319 -411 -274 212 252 332 220 -76
5640 -76 -39 69 -123 271 -646 76 632 42 181 342 362 811 102 -819 -305 418 488 187 -25 -350 -108
5661 -108 279 -247 51 -137 582 59 -274 301 -390 -791 1 -121 -267 -534 5 -280 76 246 -197 244
5681 244 36 -110 393 1 469 -199 -54 291 -9 435 26 59 199 94 -330 -238 -190 562 -127 -286 -271
5702 -271 -100 -454 -132 -148 -21 88 245 -188 418 -565 212 -249 -423 -184 209 347 -194 159 54 -436
5722 -436 -323 276 -43 40 313 -119 38 -256 -149 16 306 -729 -128 -409 -171 -229 -385 194 -291 -169
5742 -169 41 116 -532 37 -600 98 363 132 -57 -211 -46 -145 13 32 120 -481 -232 -33 -45 395 -405 -374
5764 -374 213 -321 -77 161 141 -72 -210 -168 418 345 -378 64 466 796 251 -23 69 421 -125 -117 -48 -201
5786 -201 -305 -46 119 -97 -139 -86 -308 69 485 -142 -671 359 -453 95 227 -48 -204 -272 33 -100 -31
5807 -31 422 80 -75 739 -457 -368 -160 -85 -133 13 158 529 72 106 -177 -8 268 81 311 60 24 514
5829 514 -67 -70 -31 309 -188 455 -212 174 -145 157 400 734 938 -398 70 -530 -285 -124 25 -106 -45
5850 -45 170 466 -187 18 31 133 -412 -122 1 255 -201 323 460 -376 -89 14 -165 153 -304 -32 -29
5871 -29 677 -167 -303 -409 -269 91 -125 206 324 98 -123 56 -21 36 -78 13 81 -118 -250 -90 -662 -217
5893 -217 -661 26 -216 255 -123 -297 327 143 166 118 -138 77 142 92 -141 3 463 292 426 -204 -301 -72
5915 -72 -89 -404 29 -387 -228 -478 169 338 -114 -678 -127 55 24 -96 137 799 249 197 -113 -158 -44 -553
5937 -553 -394 -682 303 301 525 -207 -153 4 304 -88 -70 120 -231 -434 34 -209 -162 -168 -105 143 26 -311 88
5960 88 -423 204 -106 -39 -35 108 224 -337 268 -80 -244 148 43 71 190 -296 -242 -278 -479 32 374 -277
5982 -277 278 278 345 344 336 197 606 430 267 -369 135 131 40 -160 -32 -23 -342 -305 303 -86 74 -86 -73 -293 -600
6007 -600 275 113 438 -45 -51 -204 -340 -58 58 157 -87 274 -226 -181 -283 310 -81 358 -7 431 69
6028 69 208 69 -99 -692 14 153 -17 26 -693 745 -87 235 -189 -212 -102 -62 -83 -49 240 158 339 -419
6050 -419 -229 -48 607 -555 -318 -363 -543 -237 -264 -165 -493 -79 -396 11 544 37 17 184 -152 -507 221
6071 221 -163 -122 202 -288 -34 397 264 98 216 -305 118 152 35 -417 340 40 -890 172 60 285
6091 285 297 222 -116 -28 260 114 113 -292 7 -21 -36 260 -136 -100 222 102 -131 -44 111 547 50 -53 -223
6114 -223 -199 -631 -360 100 305 124 303 390 295 -69 -47 299 -160 -210 31 81 179 -500 267 51 263 -72
6136 -72 -101 371 140 -329 -191 127 9 44 -114 -46 -188 -82 232 372 130 -208 -52 -107 302 182 -196 -102
6158 -102 129 -102 36 444 -116 -460 414 0 -231 187 -98 -275 237 -122 -476 230 82 -210 372 -7
6178 -7 120 137 -322 112 215 -450 -901 386 4 -53 131 -306 -83 201 151 -233 -22 -75 -27 146 94 -401
6200 -401 -63 37 -255 -211 683 -8 47 -117 84 156 -90 -110 416 -163 153 -221 -486 -250 -462 -125 -148 243
6222 243 420 41 -121 -192 61 -115 212 -527 101 253 -208 -318 -352 -202 -177 159 143 33 -145 30 82 681
6244 681 287 9 -94 315 -293 -324 -186 188 213 310 -149 540 -129 -136 314 86 -225 -380 -206 267 172 140
6266 140 -197 658 -6 -500 12 234 -102 348 -320 -366 59 -34 -165 -56 129 438 -99 -385 -163 -291 16
6287 16 -248 -68 179 558 283 -415 -121 -264 -441 -47 -486 -21 43 -158 168 -424 -7 108 404 -46 241
6308 241 -319 -564 -119 423 -61 16 -256 302 -24 158 848 119 -29 -42 -429 89 -165 -48 138 -524 -291
6329 -291 -5 -7 66 -318 62 -217 297 173 -287 41 -103 419 266 -77 119 -502 -573 -452 -245 569 371
6350 371 -60 113 908 293 307 637 388 277 59 -140 289 -268 104 105 295 -283 -297 133 -326 -280 7 -167
6372 -167 -73 -238 63 258 152 -16 -89 273 -16 -352 190 -186 -129 57 156 68 142 -23 113 203 -139 -14
6394 -14 68 -33 -268 -13 -330 -174 -363 -287 80 -59 -264 115 260 -279 583 448 306 298 -268 -4 -163 -536
6416 -536 -233 -13 693 328 730 476 259 -448 -249 145 -285 3 78 200 311 417 436 -231 -337 -169 -86
6437 -86 74 165 13 -73 171 448 108 -282 -168 -228 49 90 163 -75 -31 -200 242 137 -536 -181 517 -108
6459 -108 -95 -324 289 134 30 102 -150 -220 -346 328 207 -274 145 140 24 -65 -89 -35 -15 280 -238 108 -450
6482 -450 -385 105 10 -545 -582 81 -52 -93 32 112 125 -753 187 2 -377 353 182 363 -178 162 -427 -260
6504 -260 421 -95 -106 158 -384 436 -90 224 95 -286 -190 47 -337 281 138 117 358 -320 418 -141 -109
6525 -109 -105 250 -72 -401 87 173 59 -66 -353 -158 -331 -133 -283 -262 140 -148 75 -204 84 -166 90
6546 90 540 -524 -84 -401 -239 -30 329 -377 -67 118 -235 -228 8 -366 22 198 -242 348 -337 101 -67
6567 -67 -4 69 -772 -677 249 -329 -270 215 173 -13 -717 -54 -54 -94 330 -280 -171 704 402 288 -224 -377 207
6590 207 334 -290 -318 48 -749 615 -869 275 216 91 228 -139 14 21 519 -639 -217 -439 -404 563
6610 563 324 292 534 403 363 -55 -424 48 536 48 248 -41 408 -198 123 325 335 -310 3 206 -79
6631 -79 266 -281 -131 76 -325 -624 -373 458 -84 54 -281 -147 -59 364 27 -140 44 -377 458 -40 277
6652 277 23 -180 477 98 -59 -138 -30 -416 -400 56 -71 83 -39 -469 -548 -274 -350 92 -187 -192 122 -709
6674 -709 56 28 171 -472 90 -295 35 244 -322 120 83 61 201 83 -288 -93 433 -97 -207 -526 570
6695 570 166 83 -147 -49 729 -339 -524 -202 -175 58 -286 -656 191 159 -5 201 186 -492 144 30 81 147
6717 147 117 144 -103 274 156 114 59 79 -481 -753 -278 100 36 -61 190 -290 -238 -17 -126 -385 51 -231 -68
6740 -68 -270 225 -36 64 66 -56 -151 -104 -82 -87 -27 -109 -9 -378 449 -567 53 76 -41 -106 293 15 169 -32
6764 -32 -76 -82 -85 -524 -9 -260 417 305 -21 -145 98 -17 185 62 527 126 -74 256 17 58 74 207 308
6787 308 -148 -320 91 441 -63 -40 -138 114 -264 -145 -432 195 456 1 -157 -63 -527 141 446 -137 -104
6808 -104 221 -290 -254 86 225 284 -202 407 249 -134 -15 26 266 295 518 -173 -491 -427 276 -185 -43 -320
6830 -320 -77 -442 251 44 88 -292 38 43 747 -113 600 -65 361 78 197 625 266 617 145 -134 -494
6851 -494 304 -225 178 -234 -33 -65 -238 272 -609 -456 42 692 179 -233 292 0 -109 -8 -120 354
6871 354 -125 -187 548 -308 443 -552 602 12 327 -366 -219 -223 228 -626 58 -677 -58 -325 1005 742
6891 742 -380 17 27 -193 -912 -279 -138 -7 -265 285 139 555 -208 193 -215 -213 74 388 -12 165 203
6912 203 14 -160 97 22 58 46 653 283 -195 93 -34 -192 52 -229 -211 -108 242 -165 27 35 269 -562
6934 -562 117 16 -614 -412 16 -62 -41 6 438 274 246 2 -438 279 83 128 -363 -254 -322 -392 6 107
6956 107 369 -180 190 -352 196 -188 -295 -190 -82 -403 -334 129 -224 -150 -101 -373 213 -522 -112 -97 -363
6977 -363 30 301 308 -33 44 125 -81 -188 18 -75 95 -93 465 -185 -235 49 -435 341 323 514 295 141
6999 141 254 39 269 101 242 -369 -357 1 -384 -43 39 428 233 -598 456 32 130 -173 51 40 -909
7020 -909 139 146 161 439 -297 304 -186 54 -70 -56 409 284 -352 190 -122 172 -23 -20 481 -48 76 -136
7042 -136 -165 -28 372 -135 545 31 557 -544 36 3 -103 -117 -126 -441 -100 144 150 -290 -143 496 168 -205
7064 -205 278 29 -24 -289 -186 -245 -91 1 -249 -423 -81 -223 -216 158 -110 340 -173 158 411 180 -57 129
7086 129 -319 -5 -373 -102 -9 -193 237 -156 41 142 43 634 -225 -327 -243 30 470 258 -241 -136 500
7107 500 123 120 -425 -158 -411 118 164 -40 -220 683 -65 -74 -198 125 -37 -152 138 114 -261 316 155 408
7129 408 443 196 -249 -219 14 21 272 -143 492 118 -86 -338 514 -192 268 109 840 -63 -24 68 -142 -102
7151 -102 -312 561 527 272 136 -277 24 315 -138 239 -232 445 252 469 -330 149 29 -282 147 155 298
7172 298 -52 114 329 -22 95 -102 -743 110 315 -380 116 -219 415 -809 -205 211 -286 279 -117 33
7192 33 -266 56 288 -189 413 254 -81 58 -49 -137 226 -282 152 -227 -163 -306 24 -155 3 -393 -117
7213 -117 -295 -47 488 123 -230 22 142 -239 56 -302 645 -127 -229 -447 20 214 87 313 -302 111
7233 111 80 -236 -364 189 369 222 -77 -178 286 -549 26 -147 -249 -49 210 471 -69 -173 189 606
7253 606 -84 -287 -207 191 475 12 -529 -312 -137 614 -104 243 -112 95 71 -361 -51 -215 -249 777 85
7274 85 -342 249 -525 99 218 -8 296 -367 -154 -317 165 -166 -291 -281 35 -203 -212 32 293 -61 130
7295 130 101 -62 -288 -133 -49 321 104 206 399 -358 -8 70 56 -46 -49 173 141 213 32 144 -588 -151 478
7318 478 -253 -59 210 288 -607 422 376 102 10 224 10 116 -338 -532 33 -11 -219 145 -77 72 295
7339 295 548 95 -124 -47 425 -251 -168 -590 -173 661 122 -71 -367 469 117 209 149 198 -383 -189 178 -225
7361 -225 -308 239 329 -35 130 22 242 -274 223 -28 561 313 -539 142 26 -156 348 8 -200 -609 -382
7382 -382 -332 91 97 -78 -94 -242 -155 -538 -134 34 110 296 282 24 -25 56 -38 -149 -145 -187 -8 303 323 -438 -362
7407 -362 -339 -352 178 -275 -308 -361 -524 -229 46 454 148 -91 71 -357 295 -5 99 315 -344 83 341
7428 341 -175 -104 170 -206 -224 277 297 -360 -332 -352 -38 231 116 50 271 253 0 141 125 -440 31 -78 -285
7451 -285 -85 524 78 484 -196 307 398 -46 97 -53 248 -420 331 -45 183 115 -91 -408 -123 -45 262
7472 262 4 -624 150 -405 -379 205 353 -156 -289 -445 502 65 -469 38 146 -341 167 -24 267 51
7492 51 -272 631 -43 154 697 -247 270 -86 202 58 -195 105 -226 108 54 -341 248 63 103 -108 483
7513 483 120 203 -358 109 -462 -117 45 -139 225 -2 -653 -441 325 -168 189 -23 303 -87 -121 151 261
7534 261 -285 55 -169 258 -128 166 -93 -267 260 -658 -222 -203 -452 -489 -145 -151 -532 227 231 -516 262 217
7556 217 2 -249 95 152 5 405 305 -51 -161 111 -85 -442 35 104 -63 80 135 19 -191 227 295
7577 295 70 -226 -145 610 75 -239 618 5 254 -541 797 -157 -47 -187 551 -526 -694 663 -346
7596 -346 -822 126 -128 -358 78 432 163 -754 309 -322 263 -91 125 471 702 265 750 -95 -101 63
7616 63 410 -362 -246 540 77 -199 413 253 -207 -209 98 161 142 -9 -498 -84 12 -96 308 -156 -241 41
7638 41 299 -368 -484 -265 39 -408 -382 232 273 -68 238 168 -365 392 -646 -93 97 463 1 34 197
7659 197 -409 -282 228 -44 -104 -258 -604 -361 -75 -259 -159 -58 275 -565 -222 253 -96 13 165 89 -7
7680 -7 104 -155 -36 -72 22 -6 -107 -85 -560 -253 -264 -160 -368 -484 45 -516 612 -152 -486 211 437 -70
7702 -70 127 -286 236 -5 -296 328 -119 41 -155 -62 218 9 -102 -101 -190 26 -90 -371 -259 248 -15 -179
7724 -179 151 -302 -262 134 -161 241 -73 119 806 665 -72 85 356 -269 -365 561 -337 51 -57 179 38
7745 38 68 -218 -306 -263 -220 306 39 -94 42 -643 -114 -198 -4 224 -188 358 -165 145 -347 -283 -103 -158 172
7768 172 -88 -126 -86 100 452 72 -199 24 -273 58 -399 -382 40 192 184 -44 -147 114 -47 265 68 1
7790 1 17 -145 -209 -74 -366 -225 -175 128 172 97 -27 -152 -108 -194 -57 -196 39 2 -278 41 -338 -58 -10 -744
7814 -744 183 -545 682 -366 88 123 -331 493 -247 -60 145 117 -71 -18 326 -434 144 -335 -116 182
7834 182 -14 -715 -11 -386 -1011 227 373 161 366 165 56 -186 230 -109 317 -67 112 -20 66 444
7854 444 219 -134 -243 503 -476 267 -578 72 44 -38 128 233 -446 -44 160 84 837 -138 244 20 -15
7875 -15 -152 -230 249 -111 -77 -119 252 360 -386 -81 116 -338 64 -87 -327 -313 69 318 180 270 236 -13
7897 -13 235 191 -39 178 527 -28 105 -152 -117 -326 386 308 34 -251 -319 -88 -62 -98 -457 -290 213 -349
7919 -349 149 110 545 -635 -345 -250 -34 35 -182 -215 272 164 -188 294 425 403 429 -86 115 159 69 -90
7941 -90 -413 -137 -128 -447 -88 -14 -233 50 520 -294 -578 20 167 82 48 193 337 -124 207 206 -268 -187 -207
7964 -207 200 -333 100 -285 -110 -188 168 129 252 -291 186 88 -101 96 -526 -97 -554 117 -576 -222 415
7985 415 -355 387 -1 115 -121 -249 -201 -196 -1 -108 256 -354 8 126 -309 -595 -148 -695 -66 171 11
8006 11 245 346 154 -158 369 143 318 -331 -391 358 -264 27 225 -267 -52 846 274 -177 727 297 502
8027 502 219 -148 62 241 87 198 334 -534 -96 155 207 -95 -501 -189 -170 28 -90 164 482 -13 385
8048 385 -34 -471 -165 728 30 184 35 -91 -471 88 52 1191 -63 760 326 -825 -404 15 -391
8067 -391 -274 10 -1057 -24 439 -105 269 170 90 -191 -369 -30 50 383 1 507 -208 -620 -384 271
8087 271 137 307 -622 -206 -827 -76 -350 -131 14 414 9 311 123 -201 115 -131 250 76 -384 -205
8107 -205 194 96 287 117 37 216 246 155 418 421 -422 -144 191 337 -338 -310 184 -242 270 265 56 514 -111
8130 -111 -42 -341 -288 -359 63 161 178 245 -81 25 -253 452 -265 -24 -148 -27 304 43 427 -340 237 -398
8152 -398 -373 -314 -74 220 101 332 67 169 123 -81 -48 -457 -410 -263 -447 399 337 -212 -37 376 -88 -141
8174 -141 265 96 -612 172 59 -231 -25 127 -342 152 349 97 -546 24 497 -161 160
8191A60
##END NTUPLES=NMR FID
##END=
