##TITLE=1H_SR10P
 CDCl3
 8 sc, 
 10.02.2022
##JCAMPDX= 6.0         $$ Bruker NMR JCAMP-DX V2.0
##DATA TYPE= NMR FID
##DATA CLASS= NTUPLES
##ORIGIN= UXNMR, Bruker Analytische Messtechnik GmbH
##OWNER= root
$$ XWIN-NMR		Version 3.5
$$ Thu Feb 10 11:03:54 2022 Russian Standard Time (UT+4h)  she@DPX200
##.OBSERVE FREQUENCY= 200.131346
##.OBSERVE NUCLEUS= ^1H
##.DELAY= (6, 6)
##.ACQUISITION MODE= SIMULTANEOUS
##.ACQUISITION SCHEME= undefined
##.AVERAGES= 8
##.DIGITISER RES= 18
##SPECTROMETER/DATA SYSTEM= spect
##.PULSE SEQUENCE= zg30
##.SOLVENT NAME= CDCl3
##.SHIFT REFERENCE= (INTERNAL, CDCl3, 0, 15.7039)
##AUDIT TRAIL= $$ (NUMBER, WHEN, WHO, WHERE, WHAT)
$$ ##TITLE= Audit trail, XWIN-NMR		Version 3.5
$$ ##JCAMPDX= 5.01
$$ ##ORIGIN= Bruker BioSpin GmbH
$$ ##OWNER= she
$$ F:/spectra/data/she/nmr/H-F/1/audita.txt
$$ ##AUDIT TRAIL=  $$ (NUMBER, WHEN, WHO, WHERE, WHAT)
(   1,<2022-02-10 11:02:10.96 +0400>,<she>,<DPX200>,
      <created by zg, POWCHK disabled, PULCHK disabled
       configuration hash MD5:
       00 E9 B6 7A A2 85 ED C7 34 08 36 98 17 FE 4E 26
       data hash MD5: 16K
       CD FD CD FE 7F E8 41 05 29 99 48 E2 D9 95 91 75>)
$$ ##END=
$$ 
$$ hash MD5
$$ 03 CA 8F 73 EC 14 9C 70 22 46 5C E8 67 50 57 AF
##$RELAX= 
##$RELAX= 
##$RELAX= 
##$RELAX= 
##$RELAX= 
##$RELAX= 
$$ Bruker specific parameters
$$ --------------------------
##$DU= <F:/spectra>
##$EXPNO= 1
##$NAME= <H-F>
##$PROCNO= 1
##$TYPE= <nmr>
##$USER= <she>
##$AMP= (0..31)
100 100 100 100 100 100 100 100 100 100 100 100 100 100 100 100 100 100 
100 100 100 100 100 100 100 100 100 100 100 100 100 100 
##$AQSEQ= 0
##$AQ_mod= 1
##$AUNM= <au_zg>
##$AUTOPOS= <>
##$BF1= 200.13
##$BF2= 200.13
##$BF3= 200.13
##$BF4= 200.13
##$BF5= 200.13
##$BF6= 200.13
##$BF7= 200.13
##$BF8= 200.13
##$BYTORDA= 1
##$CFDGTYP= 0
##$CFRGTYP= 5
##$CHEMSTR= <none>
##$CNST= (0..31)
1 1 145 1 1 1 1 1 1 1 1 1 1 1 1 1 1 1 1 1 1 1 1 1 1 1 1 1 1 1 1 1 
##$CPDPRG= <>
##$CPDPRG1= <>
##$CPDPRG2= <>
##$CPDPRG3= <>
##$CPDPRG4= <mlev>
##$CPDPRG5= <mlev>
##$CPDPRG6= <mlev>
##$CPDPRG7= <mlev>
##$CPDPRG8= <mlev>
##$CPDPRGB= <>
##$CPDPRGT= <>
##$D= (0..31)
0 1.2 0 0 0 0 0 0 0 0.06 0 0.03 0 0 0 0 0.0002 0 0 0 0 0 0 0 0 0 0 0 0 
0 0 0 
##$DATE= 1644476530
##$DBL= (0..7)
120 120 120 120 120 120 120 120 
##$DBP= (0..7)
150 150 150 150 150 150 150 150 
##$DBP07= 0
##$DBPNAM0= <>
##$DBPNAM1= <>
##$DBPNAM2= <>
##$DBPNAM3= <>
##$DBPNAM4= <>
##$DBPNAM5= <>
##$DBPNAM6= <>
##$DBPNAM7= <>
##$DBPOAL= (0..7)
0.5 0.5 0.5 0.5 0.5 0.5 0.5 0.5 
##$DBPOFFS= (0..7)
0 0 0 0 0 0 0 0 
##$DE= 6
##$DECBNUC= <off>
##$DECIM= 32
##$DECNUC= <off>
##$DECSTAT= 4
##$DIGMOD= 1
##$DIGTYP= 9
##$DL= (0..7)
0 120 120 120 120 120 120 120 
##$DP= (0..7)
150 150 150 150 150 150 150 150 
##$DP07= 0
##$DPNAME0= <>
##$DPNAME1= <>
##$DPNAME2= <>
##$DPNAME3= <>
##$DPNAME4= <>
##$DPNAME5= <>
##$DPNAME6= <>
##$DPNAME7= <>
##$DPOAL= (0..7)
0.5 0.5 0.5 0.5 0.5 0.5 0.5 0.5 
##$DPOFFS= (0..7)
0 0 0 0 0 0 0 0 
##$DQDMODE= 0
##$DR= 18
##$DS= 0
##$DSLIST= <SSSSSSSSSSSSSSS>
$$ [...]
##$SUBNAM2= <"">
##$SUBNAM3= <"">
##$SUBNAM4= <"">
##$SUBNAM5= <"">
##$SUBNAM6= <"">
##$SUBNAM7= <"">
##$SUBNAM8= <"">
##$SUBNAM9= <"">
##$SW= 18.0517287032376
##$SWIBOX= (0..15)
0 0 2 0 0 0 0 0 0 0 0 0 0 0 0 0 
##$SW_h= 3612.71676300578
##$TD= 16384
##$TD0= 1
##$TE= 0
##$TE2= 300
##$TE3= 300
##$TEG= 300
##$TL= (0..7)
0 120 120 120 120 120 120 120 
##$TP= (0..7)
150 150 150 150 150 150 150 150 
##$TP07= 0
##$TPNAME0= <>
##$TPNAME1= <>
##$TPNAME2= <>
##$TPNAME3= <>
##$TPNAME4= <>
##$TPNAME5= <>
##$TPNAME6= <>
##$TPNAME7= <>
##$TPOAL= (0..7)
0.5 0.5 0.5 0.5 0.5 0.5 0.5 0.5 
##$TPOFFS= (0..7)
0 0 0 0 0 0 0 0 
##$TUNHIN= 0
##$TUNHOUT= 0
##$TUNXOUT= 0
##$USERA1= <user>
##$USERA2= <user>
##$USERA3= <user>
##$USERA4= <user>
##$USERA5= <user>
##$V9= 5
##$VALIST= <valist>
##$VCLIST= <CCCCCCCCCCCCCCC>
##$VD= 0
##$VDLIST= <DDDDDDDDDDDDDDD>
##$VPLIST= <PPPPPPPPPPPPPPP>
##$VTLIST= <TTTTTTTTTTTTTTT>
##$WBST= 1024
##$WBSW= 4
##$XGAIN= (0..3)
0 0 0 0 
##$XL= 0
##$YL= 0
##$YMAX_a= 209248
##$YMIN_a= -267782
##$ZGOPTNS= <>
##$ZL1= 120
##$ZL2= 120
##$ZL3= 120
##$ZL4= 120
##$ABSF1= 10
##$ABSF2= 0
##$ABSG= 5
##$ABSL= 3
##$ALPHA= 0
##$AQORDER= 0
##$ASSFAC= 0
##$ASSFACI= 0
##$ASSFACX= 0
##$ASSWID= 0
##$AUNMP= <proc_1d>
##$AZFE= 0.1
##$AZFW= 0.1
##$BCFW= 1
##$BC_mod= 2
##$BYTORDP= 1
##$COROFFS= 0
##$CY= 11.3945322036743
##$DATMOD= 1
##$DC= 2
##$DFILT= <>
##$DTYPP= 0
##$F1P= 2.36226072786647
##$F2P= -0.459571619588291
##$FCOR= 0.5
##$FTSIZE= 0
##$FT_mod= 4
##$GAMMA= 1
##$GB= 0.15
##$INTBC= 1
##$INTSCL= 1
##$ISEN= 128
##$LB= 0.24
##$LEV0= 0
##$LPBIN= 0
##$MAXI= 10000
##$MC2= 0
##$MEAN= 0
##$ME_mod= 0
##$MI= 1.114404
##$NCOEF= 0
##$NC_proc= 0
##$NLEV= 6
##$NOISF1= 3.799351
##$NOISF2= 2.8
##$NSP= 1
##$NTH_PI= 0
##$NZP= 0
##$OFFSET= 15.70392
##$PC= 1
##$PHC0= -16228.65
##$PHC1= 11.00078
##$PH_mod= 1
##$PKNL= yes
##$PPARMOD= 0
##$PSCAL= 0
##$PSIGN= 0
##$REVERSE= no
##$SF= 200.130013532006
##$SI= 16384
##$SIGF1= 3
##$SIGF2= 2
##$SINO= 400
##$SIOLD= 16384
##$SREGLST= <1H.CDCl3>
##$SSB= 0
##$STSI= 0
##$STSR= 0
##$SW_p= 3612.71676300578
##$SYMM= 0
##$S_DEV= 0
##$TDeff= 0
##$TDoff= 0
##$TI= <>
##$TILT= no
##$TM1= 0
##$TM2= 0
##$TOPLEV= 0
##$USERP1= <user>
##$USERP2= <user>
##$USERP3= <user>
##$USERP4= <user>
##$USERP5= <user>
##$WDW= 1
##$XDIM= 8192
##$YMAX_p= 0
##$YMIN_p= 0
$$ End of Bruker specific parameters
$$ ---------------------------------
##NTUPLES= NMR FID
##VAR_NAME=  TIME,          FID/REAL,        FID/IMAG
##SYMBOL=    X,             R,               I
##VAR_TYPE=  INDEPENDENT,   DEPENDENT,       DEPENDENT
##VAR_FORM=  AFFN,          ASDF,            ASDF
##VAR_DIM=   8192,          8192,            8192
##UNITS=     SECONDS,       ARBITRARY UNITS, ARBITRARY UNITS
##FACTOR=    0.0002768,     1,               1
##FIRST=     0,             0,               0
##LAST=      2.2672688,     0,               0
##MIN=       0,             -267782,         0
##MAX=       2.2672688,     209248,          0
$$ Real data points
##PAGE= N=1
##DATA TABLE= (X++(R..R)), XYDATA
0@%%%%%%%%%%qJ6j6J6k4L2m0M8n6P2q8J04j20J37j61J92k24K57k97L45l96M52
$$ 0 0 0 0 0 0 0 0 0 0 0 -8 8 -8 8 -16 16 -24 24 -32 40 -48 56 -64 73 -88 104 -120 137 -160 185 -211 241
32B41n14N84o62P45q37R38j048J171j307J456j617J790j981K191k418K668k941
$$ 241 -273 311 -351 394 -443 495 -553 618 -689 767 -850 940 -1041 1150 -1268 1400 -1541
49a541L239l569L933m335M782n278N834o466P189q022Q994j0150J1550j3286J5504
$$ -1541 1698 -1871 2062 -2273 2509 -2769 3065 -3401 3788 -4234 4760 -5390 6160 -7126 8378
64H378j8451K2582k8825L9459o2258J95736k03058k21345M77030j24033k57328
$$ 8378 -10073 12509 -16316 23143 -39115 156621 -46437 -267782 209248 85215 -172113
75a72113J95382Q3404j91258Q7729L9374q5711L0495L795l8576J11550n9797j00359
$$ -172113 23269 106673 -84585 3144 42518 -43193 -12698 -8903 -47479 64071 4274 -96085
87i6085J44731q750j64120J80583N7913k62832J17010K30188k69302p3801K92745
$$ -96085 48646 39896 -124224 56359 114272 -148560 -31550 198638 -70664 -144465 148280
98A48280r6981j82285K01476K080j77947J25570N8485j46512P0159N5826j20625
$$ 148280 51299 -130986 70490 72570 -105377 20193 78678 -67834 2325 58151 -62474
109f2474O0391O3407j27771M3081R3154j13009J4053R0845j16770J1990J38158
$$ -62474 -2083 61324 -66447 -23366 69788 -43221 -29168 61677 -55093 -43103 95055
120I5055j24396n4027J75702p4262j23136J67152j422j61500J24977O8768j67001
$$ 95055 -29341 -83368 92334 18072 -105064 62088 60666 -100834 24143 92911 -74090
131g4090N3407J08062j31657N606J21380j00540m1763J17360n0332o1736Q6164
$$ -74090 -20683 87379 -44278 -38672 82708 -17832 -59595 57765 7433 -54303 31861
142C1861k4395n0101P5606k7713n9305Q5589j1314q1136Q5494J8653j06572O2838
$$ 31861 7466 -42635 32971 5258 -54047 31542 20228 -60908 24586 43239 -63333 -495
154d95O2944j06607K1368Q7125q7032j4989R7361o3103m7274R7077k5648p0269
$$ -495 62449 -44158 -22790 64335 -22697 -37686 59675 -3428 -50702 46375 20727 -49542
166d9542P3633K763p0277N4245J9308o6876L8369K9195o4059K7003L9144o3153
$$ -49542 24091 26854 -43423 10822 30130 -36746 1623 30818 -33241 -6238 32906 -30247
178c0247J6272N3788o0962n643O6525m8441k7239P3295k8362n1292O8006o06o4672
$$ -30247 -13975 39813 -21149 -26792 39733 -8708 -35947 37348 8986 -42306 25700 25094 -39578
191c9578M7727K5582o3086K4339L9728n1744K281M2764l5768q637L7715k4980
$$ -39578 8149 33731 -29355 -5016 34712 -17032 -14751 28013 -7755 -16392 21323 -3657
203c657j3450L4740j9082j7508L5088j4147k4617L6076m947l3372L2892Q289l9421
$$ -3657 -17107 17633 -1449 -18957 16131 1984 -22633 13443 8496 -24876 8016 16305 -23116
216b3116K2798K2275l9389Q164L2941l0364p641L4273j7957j8127K8853n845k0030
$$ -23116 -318 21957 -17432 -9268 23673 -6691 -14332 19941 1984 -16143 12710 6865 -13165
229a3165K1027j6j8433J4709K233j7051J3327L885j8080J2784P543k1664R724
$$ -13165 7862 7846 -10587 4122 6355 -10696 2631 6516 -11564 1220 8763 -12901 -3177
242c177J5429k2226Q24K2779j6490j0238K3891n737j7640J7301M617j7769Q669
$$ -3177 12252 -9974 -9150 13629 -2861 -13099 10792 5055 -12585 4716 9333 -8436 233
255B33Q974j2493J505P997p268m72N725n383K8M790n257o16M875m401j686O148
$$ 233 9207 -3286 -1781 6216 -1052 -1524 4201 -1182 -1154 3636 -1621 -2237 2638 -1763 -3449 2699
271B699l046l818N854j519m367M747O61m823L588K738m302N85L348k469q74K500
$$ 2699 -347 -4165 1689 170 -4197 550 1211 -3612 -24 2714 -1588 -1003 2345 -124 -998 1502
287A502j99p25L58m32J587r21k044J940Q40k778Q04J277k432J29J398k141j90
$$ 1502 1303 578 936 504 2091 1170 -874 1066 1906 -872 -68 1209 -1223 -1094 304 -1837 -2027
304b027K721j607j940K626R92k678k71K594N29j637n75K912J121m093J402L598
$$ -2027 694 -913 -2853 -227 765 -1913 -2184 410 939 -698 -1273 1639 2760 -1333 69 3667
320C667k798k112L896m95l215K194N34l635K341J632m006K23L707l159j420K592
$$ 3667 869 -1243 2653 2158 -1057 1137 1671 -1964 377 2009 -1997 -1774 1933 -1226 -2646 -54
336e4k11j648J389p42k09K871k548j304M529j70m758L533K844m233O2L458j945
$$ -54 -265 -1913 -524 -1266 -1475 1396 -1152 -2456 2073 1903 -2855 678 3522 -711 -649 2809 864
353H64j469K572j268j335K243j51l161J564K004k839j317K956P5k814L51K041
$$ 864 -605 1967 699 -636 1607 1456 -1705 -141 1863 -976 -2293 663 738 -2076 -1725 316
369C16j274l35N95j87L53O58p38m42K161j82k104K115J379k222O50R21j441Q39
$$ 316 -958 -1293 -698 -885 -532 126 -612 -1054 1107 925 -1179 936 2315 93 743 1664 223 1062
387A062O60k157O70K409l781q34M119k450l324M341l21l571K984M65l569L666
$$ 1062 1722 -435 235 2644 -1137 -1971 2148 -302 -3626 715 394 -3177 -193 272 -3297 369
403C69R68n016L656K997n906K224N154o024OO468n574j659Q058n205m220R087
$$ 369 1337 -3679 -23 2974 -2932 -708 4446 -1578 -1572 4896 -678 -2337 5721 516 -3704 5383
419E383l320q224R382Q41j0520P712M167j2375M953Q615j2719J330J2774j1108
$$ 5383 2063 -6161 3221 4062 -6458 1254 5421 -6954 -2001 6614 -6105 -4775 7999 -3109
433c109l978J4095p030q680J4048j916j1503J2276J302j3503J0172N872j4935
$$ -3109 -7087 7008 -22 -8702 5346 3430 -8073 4203 5505 -7998 2174 8046 -6889
446f889O707J0083j5404K069J3417j3386k557J5326j0654p209J6455o889j1377
$$ -6889 -182 9901 -5503 -3434 9983 -3403 -5960 9366 -1288 -8497 7958 1069 -10308
459a0308J6360k114j4715J3861K303j6249J2008P155j8033Q661J2022j9381M021
$$ -10308 6052 3938 -10777 3084 5387 -10862 1146 8301 -9732 -1071 10951 -8430 -4409
472d409J6615j7397k063K1205j5038r382K2932r882j5956K3301k059k1489J9325
$$ -4409 12206 -5191 -7254 13951 -1087 -10469 12463 2581 -13375 9926 7867 -13622 5703
485E703M693k5083J4921J3452k6243P361K0293k3871j790K4580j8102q779K6369
$$ 5703 10396 -14687 234 13686 -12557 -5196 15097 -8774 -10564 14016 -4086 -12865 13504
498A3504j2583j6107K5929n374k1586K3769L624k5619J7278J1329k6766J0634
$$ 13504 921 -15186 10743 5369 -16217 7552 11176 -14443 2835 14164 -12602 -1968
510a968J7922k4742L077K1836k2134m239K5024j7130j0345K6237j2066j7131K5847
$$ -1968 15954 -8788 -5711 16125 -6009 -10248 14776 -2354 -12699 13538 1472 -15659 10188
523A0188n408k2238K5090K219k7286K0731J0827l1198J4100K1446l0209M014K7282
$$ 10188 4780 -17458 7632 9851 -17435 3296 14123 -17075 -2975 18471 -11738 -7724 19558
536A9558k6267o785L1501j8315j5756L2280j0437k3710K8659p06k8638K3983R193
$$ 19558 -6709 -13494 18007 -308 -16064 16216 5779 -17931 10728 10022 -18616 5367 14560
549A4560l0954J5940J6397l0667Q366K4068k8092n33K9033k3665j0940L2261j4286
$$ 14560 -16394 -454 15943 -14724 -6358 17710 -10382 -10915 18118 -5547 -16487 15774 1488
562A488j9181L0426n267k5072K5321L334k7098K0337J0795k8481J2990J6598k8212
$$ 1488 -17693 12733 7466 -17606 7715 11049 -16049 4288 15083 -13398 -408 16190 -12022
575a2022O828K2892k6000j160K7276k2677j0866L2052j5549j9456L1591n020k8095
$$ -12022 -5194 17698 -8302 -9462 17814 -4863 -15729 16323 774 -18682 12909 7889 -20206
588b0206K6027N979k9343J8532J4328k9056J0780J9059k7456M710K4431k4799
$$ -20206 5821 11800 -17543 989 15317 -13739 -2959 16100 -11356 -6646 17785 -7014
600g014l141K8813k1130j3148L1629j1445k2636K9289J77k9871K1657J0836k8662
$$ -7014 -10155 18658 -2472 -15620 16009 4564 -18072 11217 11394 -18477 3180 14016 -14646
613a4646J1817J7577k4615L524J8882k0121m35J9924j7066l996K2228j6016r946
$$ -14646 -2829 14748 -9867 -6343 12539 -7582 -8017 11907 -5159 -9155 13073 -2943 -12889
626a2889K5880j0494j7997K6280j601k5556K0750R439k7008J1809J7166k4268
$$ -12889 12991 2497 -15500 10780 9179 -16377 4373 13812 -13196 -1387 15779 -8489
638h489K651J9752j9218l026K0670j4363p536K0039j1103j1648K1061n784j6522
$$ -8489 -5838 13914 -5304 -8330 12340 -2023 -9559 10480 -623 -12271 8790 3006 -13516
651a3516K0522L73k1594J5920R096k2439R241J5660k0434J262J7917j5117m691
$$ -13516 7006 7379 -14215 1705 10801 -11638 -2397 13263 -7171 -5909 12008 -3109 -7800
664g800J8826j0216q927J6799o313j1181J5021j880j3372J3268K164j6169J0655
$$ -7800 11026 810 -8117 8682 2369 -8812 6209 4329 -9043 4225 6389 -9780 875
677H75O796j6383O226J1417j5370R41J3738j1835l685J4975p454p852J3779l876
$$ 875 7671 -8712 -2486 8931 -6439 -5498 8240 -3595 -7280 7695 241 -7611 6168 2292
691B292r761J1733K18j0723R300K984j1740O321O074j1642L561Q656j0667m62
$$ 2292 -7469 4264 4482 -6241 3059 6043 -5697 624 6698 -4944 -1383 7273 -3394 -3856
705c856R964q178l224J0288n085n892R201j849p237P421Q83p303N562K400o910
$$ -3856 6108 -2070 -5294 4994 -91 -5983 3218 1369 -5868 1553 2436 -4867 695 3095 -3815
720c815L437M176o850K265N296n968k90O104m633j962O032k962l453N032q74m417
$$ -3815 -378 3798 -3052 -787 4509 -1459 -1749 4355 -278 -2240 3792 830 -2623 2409 1535 -2882
736b882M098L44m492L384J207m563K250K158l863J232K742k862m06L015j925q14
$$ -2882 1216 1560 -2932 452 1659 -2904 -654 1504 -2359 -1127 1615 -1247 -1653 1362 -563 -1377
752a377K782p47j359J783R0j287J270k84n71O92n53j99M05o91l40Q15l24q38Q70
$$ -1377 1405 658 -701 1082 1172 -115 1155 871 300 992 439 240 645 -46 -386 429 105 -733 137
771A37m19r43J446o45o65J087m20n36J015J72j305J993j78j836J776P47j992P90
$$ 137 -282 -1225 221 -424 -1089 -2 -422 -958 57 229 -1076 917 739 -1097 679 1426 -566 224
789B24J522k171N79J954k301k63K248k000n39K275j789j330K626j230k061L205
$$ 224 1746 -425 154 2108 -193 -456 1792 -208 -747 1528 -261 -1591 1035 -195 -2256 949
805I49o83k902L279K95l854L069J346l862J885K917l989P12L783l491o11M250
$$ 949 266 -2636 643 938 -2916 153 1499 -2363 -478 2439 -1550 -838 2945 -546 -1157 3093
821C093k976j846M526j787l352M406m58l768L046J209m581K472K217m790J421
$$ 3093 117 -1729 2797 1010 -2342 2064 1606 -2162 884 2093 -2488 -16 2201 -2589 -1168
836a168L538m271k02M037l047j363M530k188k271M238j035l111L927L58m268L345
$$ -1168 2370 -1901 -2103 1934 -1113 -2476 2054 -134 -2405 1833 798 -2313 1614 1972 -2296 1049
852A049J484m291J883K622l946O90L036l490m71L799k851j520L841k419k146L873
$$ 1049 2533 -1758 125 2747 -1199 -509 2527 -963 -1434 2365 -486 -2006 1835 -584 -2730 1143
868A143r20l317L842K82m005L340J428m227K343K545m209Q63L611k844j072M002
$$ 1143 223 -3094 748 1030 -2975 365 1793 -2434 -91 2454 -1755 -892 2719 -125 -1197 2805
884B805k521j986L881j136k884L365K57l644K276J242l532J340J891k909L80K251
$$ 2805 284 -1702 2179 1043 -1841 1524 1781 -1863 413 1655 -1877 -537 1354 -1555 -1175 1076
900A076k254l84K571j338j035K283r01j305J912J13j630J582L17j429J090O17
$$ 1076 -1178 -1562 1009 -329 -1364 919 18 -1287 625 738 -892 690 1007 -422 668 1285
916A285j536M87J140j542K21O13q82j14O96n90n22R70o77o00P86M3n80K31P20
$$ 1285 -251 236 1376 -166 55 668 -214 -328 368 -222 -744 226 -451 -1051 -265 -222 -802 -571 149
935A49p79K55P17p22oR91j88p04O59K59n86K93J098q86p48R84l34j075J144M85
$$ 149 -630 -375 342 -380 -386 605 417 -287 372 631 45 338 1436 550 -198 786 452 -623 521 1006
955A006j854O72R45j974K02J967j796n30K048q58j759K574k30k068J980Q92k567
$$ 1006 -848 -176 769 -1205 -1003 964 -832 -1362 686 -172 -1931 643 413 -1655 325 1217 -1350
972a350J306J869k789O94K483k174p42K736j908j197K801j402j745K936p38k646
$$ -1350 -44 1825 -964 -270 2213 39 -703 2033 125 -1072 1729 327 -1418 1518 780 -1866
988a866K404N84l341K402J325l926J727K145l575J009L378l587l01M034l161j590
$$ -1866 538 1122 -2219 183 1508 -2418 -691 1454 -2121 -1112 2266 -1321 -1622 2412 -749 -2339
1004b339M954j944l250M787m85m429M182J306n610L478K573n578J628M018n241
$$ -2339 2615 671 -2579 2208 1723 -2706 1476 2782 -2828 650 3223 -2355 -727 3291 -1950
1019a950k69N355l801k450N599k695l654O001j043m798N004N36n297L843K144
$$ -1950 -2219 3136 -665 -3115 2484 -211 -3865 2136 1093 -3705 1299 1835 -3462 381 2525
1034B525n245K548L586n678J164N008n222k85N633m145k209N671k972m190O621
$$ 2525 -2720 -172 3414 -2264 -1100 3908 -1314 -1599 4034 -111 -2320 3351 379 -3811 2810
1049B810j398m930N351P3o211M560K594o698K944M358o519Q98N840n634j011P370
$$ 2810 1412 -3518 1833 1906 -4305 255 2849 -3849 -905 3453 -3066 -2168 3672 -1962 -2973 4397
1065D397m625l377P352k698n174O928j84o098N385J613p216L551M346o919J502
$$ 4397 -228 -3605 3747 1049 -4125 2803 2619 -3479 1906 3519 -3697 -146 4200 -2719 -1217
1080a217N343o298n88O298m788j973O592l749l659O401j688m982O203L62o386
$$ -1217 4126 -2172 -2760 3538 -1250 -3223 3369 -380 -4039 2362 674 -4308 1895 2257 -4129
1095d129N259J882o931M006L881o836K027N233o101m71O268m939j861O843l693
$$ -4129 1130 3012 -3919 87 3968 -2868 -841 4392 -1709 -2180 4088 -851 -2712 4131 438
1110D38m202O598j324o024O568M93o807M811K400p093K932N028o506O16O165n291
$$ 438 -3764 2834 1510 -4514 2054 2547 -4260 551 2951 -4142 -1210 3818 -2688 -2072 4093 -1198
1126a198j860O361l359k944N986j764m370N067q2m808M489J122n327L517K422
$$ -1198 -3058 3303 -56 -3000 2986 1222 -3148 1919 1837 -2971 1518 2640 -2687 830 3252
1141C252n949K158L560n011K68M842m618j129N028k852k505N011j536l759M644
$$ 3252 -2697 -539 3021 -1990 -1722 3120 -1498 -2627 2401 -451 -2956 2055 519 -3240 1404
1156A404k01m397M289J258n130L468K195n162J799L926n026N47M634m045j777
$$ 1404 1203 -3194 1095 2353 -2777 691 2886 -2276 -477 3449 -1577 -1030 3604 -441 -2218
1171b218M999k667k548M664j330l894L564P85l761K023J815l331J325J925k961
$$ -2218 2781 114 -2434 2230 900 -2994 570 1355 -2406 -383 1432 -1899 -574 1351 -1610
1186a610O32K703k817L06K551k179o59K913j563j307K537o45k120K172J58k339
$$ -1610 -978 1725 -1092 -786 1765 -414 -1073 1840 277 -1030 1507 862 -1258 914 1072 -1267
1202a267J770P84k275J301P69k527J280J207k047M00J495j747k17K125j544n79
$$ -1267 503 1287 -988 313 1082 -1445 -165 1042 -1005 -605 890 -857 -1074 1051 -493 -1072
1218a072J831p41j221J627K18j506R92Q51j241M07P12r26J65M88m05J34J31n79
$$ -1072 759 18 -1203 424 642 -864 128 979 -262 145 857 -69 96 584 179 313 444 -135
1236a35n0L80l69K27J35q74J85K94m78J36Q64q89M12K50r54P03P60p41J88Q24
$$ -135 -185 195 -174 53 188 -686 -501 -207 -685 -549 315 -574 -162 88 -866 -163 597 -144 44 868
1256H68j091j98J500r01n87J472l24j265J102k93r18R96k1j241J162L47j637Q14
$$ 868 -223 -421 1079 178 -409 1063 739 -526 576 283 -635 361 340 -901 261 608 -1029 -215
1274b15J123j889M41J319j880J14J982j557n14K022q70j158K311q85j578K530
$$ -215 908 -981 -540 779 -1101 -987 995 -562 -1076 946 76 -1082 1229 344 -1234 1296
1290A296n82j455J704L96k631J516J421k967R67K007k979K71K574k419q42L106
$$ 1296 714 -741 963 1359 -1272 244 1665 -1302 -335 1672 -1307 -1036 1538 -881 -1723 1383
1306A383k022j147K878r13k030K535J59k711K278P74k778J783J505k958J038K330
$$ 1383 -639 -1786 1092 179 -1851 684 843 -1868 410 1184 -1594 189 1694 -1264 -226 2104
1322B104l021qL070k528j046L436j787j910L247j123k588L001r8k959K636Q02
$$ 2104 -917 -925 2145 -383 -1429 2007 220 -1690 1557 434 -2154 847 749 -2210 426 1228
1338A228l418J717K019l383J201K543l223j27L581k330j260L526j898k098L736
$$ 1228 -2190 -473 1546 -1837 -636 1907 -1316 -1443 2138 -192 -1452 2074 176 -1922 1814
1353A814j028k374K994J51l243K571Q40l469J592J987l259N80K752k803p60L525
$$ 1814 786 -1588 1406 1557 -1686 885 1725 -1744 -152 1835 -1424 -844 1908 -895 -1655 1870
1369A870k520j147L266j606k010L234m80k868K905P39k889J739J512l198J204
$$ 1870 -650 -1797 1469 -137 -2147 1087 607 -2261 644 1383 -1506 233 1745 -1453 -249
1384b49K406k917K75K606k461m99K519j958j221L057j385k393L202m7l027K687
$$ -249 2157 -760 -485 2121 -340 -839 1680 -278 -1499 1558 173 -2220 982 935 -2092 595
1400E95K47k791J751J573k892J009K129k402L1K476k243n66K586j264j526L043
$$ 595 842 -1949 -198 1375 -1517 -508 1621 -781 -750 1726 -517 -1083 1503 239 -1287 1756
1416A756j006k305K671P8k703J937R44k587J140J496k491L77K191k535j99K075
$$ 1756 750 -1555 1116 1194 -1509 428 1372 -1215 -75 1421 -1070 -693 1498 -1037 -1236 839
1432H39j314q39K220r75j376K064m12j341J730J95k054J566P07k070J364R75j622
$$ 839 -475 -1314 906 -69 -1445 619 207 -1134 596 791 -1263 303 1010 -1060 304 1279 -343
1449c43nJ722j432j63J396j344n94J713o93j298J282Q5j404Q63O10j213N00Q35
$$ -343 -348 1374 -58 -221 1175 -169 -763 950 257 -1041 241 326 -1078 -215 395 -818 -318 517
1467E17j443L07J383j280K15R69q42l12R66j27o15O91J2o77P88k34n00P21Lp26
$$ 517 -926 -619 764 -516 -301 668 -174 -486 480 353 -262 429 441 -236 552 318 -182 539 542 -184
1487a84J52Q4n49J02L42l18J58L08m93p2K50M0JL27k9l37J73P7o8L40o6L6M7j2
$$ -184 -32 52 -497 -395 -53 -371 -213 95 -398 -470 -220 -180 -179 148 119 -218 -45 32 -36 304 238 274 321 309
1511C09R2k04J15p9l56N23p7m31q2K39j46j40k9K36m48k9N36n27J67O74l21m18
$$ 309 401 197 312 233 -123 400 323 -108 -190 49 -97 -237 -266 -30 -478 -507 29 -498 -331 343 22 -396
1533c96O59n7o91P26K49p67N50L53r63K06J102j089K70N04n79m29P37l20m92M45
$$ -396 263 206 -485 241 490 -277 273 626 -337 -131 971 -118 152 656 77 -352 385 65 -427 18
1553A8j64n21O25J09n33M79J36j021Q39J0n86P64K81p19K01N88o57j48J021o31
$$ 18 -146 -667 -42 67 -466 13 149 -872 -33 -23 -609 155 436 -283 -82 506 -151 -299 722 91
1573I1k25R42n08o65J331m91j146J361l2j508O98P54j420K45J350j334j51J203
$$ 91 -134 808 300 -365 966 475 -671 690 658 -850 -152 602 -818 -573 777 -557 -708 495
1591D95o49p13J212l13j088J296k4j043P86N19j032P82R26j214MR12r26l33J076
$$ 495 -154 -867 345 32 -1056 240 216 -827 -41 478 -554 228 1154 -60 -56 856 -70 -403 673
1610F73m49n61Q50r54l05J058k53o62O80Mr58R71J51j140Q20M81j013P24L76j150
$$ 673 224 -337 513 -441 -746 312 59 -603 77 81 -877 94 245 -895 -75 406 -607 117 493 -657
1630f57O16J193j481K84J022q43o03J375j77j258J241n6j517J201J94j306Q33
$$ -657 -41 1152 -329 -45 977 134 -469 906 729 -529 712 656 -861 340 534 -772 61
1647F1K96j019J97Q88j074l02J369p04l18Q91m04n37Q39L3n07J99L63m97K20N98
$$ 61 357 -662 -465 423 -651 -953 416 -288 -606 285 -119 -656 183 216 -291 -92 271 -226 -6 592
1667E92n45L55Nm08J57L67p30K40K97n54J03K17j66o64P59r3l55O20m05m11L69
$$ 592 47 402 407 -1 156 523 -207 33 330 -224 -121 96 -70 -734 25 -68 -423 197 -208 -619 -250
1688b50M63r03P39J38k96K51M66o28j13L50J0l58P07k66k16r6K76l02kk1m61M94
$$ -250 213 -690 49 187 -109 142 608 -20 -133 217 227 -131 576 310 94 -2 274 -28 -30 -51 -512 -18
1710a8J0j26n5J44m7J22j75j85L53j42k53K02j9K19K24k93k60M22K52m81L94J69
$$ -18 -8 -134 -189 -45 -92 30 -145 -330 23 -119 -372 -170 -189 30 254 -39 -299 123 375 -106 288 457
1732D57n05K50K64j004N73L91p94J28M28m35j65O29n10p9N63l93l12Q67n92l47
$$ 457 -48 202 466 -538 35 426 -368 -240 188 -247 -412 217 -293 -372 191 -202 -514 353 -239 -586
1752e86Q99q5o98O52L66p70M96J58p23N69L50p16m9Q55o81l44J028q53k72Q35
$$ -586 313 228 -470 182 548 -222 274 432 -291 278 628 -88 -137 718 37 -307 721 -132 -404 431
1772D31n55p90R86l8r62R45L26j221Q93N42j645J172M98r94K57J068r80j24J035
$$ 431 -124 -914 72 34 -928 17 343 -878 15 557 -1088 84 582 -412 -155 913 -67 -191 844
1791H44o88n22J280m26r80J590l18j897J593L95j725P68R19j507J31J157j435
$$ 844 156 -366 914 488 -492 1098 780 -1117 476 871 -854 -86 833 -674 -543 614 -821
1808h21K23J690j423k91J409r87o83J634o92r62J253L10j261J107M93j729R24
$$ -821 -598 1092 -331 -622 787 -200 -883 751 59 -903 350 660 -601 506 999 -730 194
1825A94Q93j601O59J364k093J14J585j511m37J949r50j268J939o93j538J743K6
$$ 194 1087 -514 145 1509 -584 -470 1115 -396 -833 1116 166 -1102 837 144 -1394 349 375
1842C75j717J536N87k047R62J141j832O40J586j661k06K118j244j234K205j002
$$ 375 -1342 194 781 -1266 -304 837 -995 -355 1231 -430 -636 1482 238 -996 1209 207
1858B07j521K100j71j765J727L5j971J633P57k090Q11J310j942J40J963j826m62
$$ 207 -1314 786 615 -1150 577 612 -1359 274 1031 -1059 -248 1062 -880 -740 1223 -603 -1065
1875a065K191j568n52J919q62j101J593n3j572J833N3j480P86J205j969L54J523
$$ -1065 1126 -442 -994 925 63 -1038 555 502 -1070 763 816 -664 122 1327 -642 -288 1235
1892A235j779M14J373j798j80J687q39j120J935q86j207J458L08j772J382L51
$$ 1235 -544 -130 1243 -555 -735 952 113 -1007 928 42 -1165 293 601 -1171 211 562
1908E62j765J360R03j857Q45R71j673K96J633j229m97J505r60r36J664m47j462
$$ 562 -1203 157 1060 -797 48 1019 -654 -358 1275 46 -451 1054 94 -842 822 375 -1087
1925a087J702N4j593J026P41k010R65J022j700M86J260j488l3J448r60q74J763
$$ -1087 615 669 -924 102 843 -1167 -202 820 -880 -394 866 -622 -655 793 -167 -1041 722
1942G22n95q75J300k72q12J132r6j158P90P39j318M48Q16j163J61Q33r95j14J210
$$ 722 127 -748 552 280 -532 600 504 -654 136 875 -443 5 821 -342 -181 652 -343 -457 753
1961G53r83m56J123o55k77Q25l27q98J171K96j451Q64P99j074J69O77j080L03
$$ 753 -230 -686 437 -218 -495 330 3 -895 276 572 -879 -15 784 -290 -121 556 -524 -221
1979b21R96p51k80J021n65n69P77k73p78R23Q8j073R25J67p97K32N17p87P6O52
$$ -221 775 24 -256 765 200 -369 408 135 -643 280 368 -705 220 387 -410 -178 339 -448 -372 280
1999B80o75n2N07k29k96P29j10n61O24L3l10M71l48j44M16K35o14M36k6o45K55
$$ 280 -395 -447 60 -169 -465 264 154 -407 217 250 -60 411 63 -81 335 570 -44 392 366 -279 -24
2020b4K65n53M63K64q60J06M66k04n42N93P1l13M44j5m41K01L14m53L27R1k80
$$ -24 241 -312 151 415 -445 -339 127 -77 -619 -26 45 -268 176 161 -280 -79 235 -218 109 200 -80
2041h0k94R44l82k42M11K1n98L11k1l15J19M02j47k65n4j82L20j24J36j76J96
$$ -80 -374 570 188 -54 357 378 -220 91 70 -245 -126 276 129 -136 -190 -372 -52 -176 -40 -216 -20
2062b0l14K13j21R5M4OJ78K0j23L28j62l2j02K23j58L9j49qL33n64M14j19j18
$$ -20 -334 -121 -242 -147 -103 -97 81 101 -22 306 144 112 10 233 75 114 -35 -43 290 -274 140 21 -97
2085i7J66J28l64o2kM02l29j02K13mmL16k93R6R5k45n8L65M2k11J51L0j08j08
$$ -97 69 197 -167 -229 -231 171 -158 -260 -47 -51 -55 261 -32 64 159 -86 -144 221 263 52 203 233 125 17
2109A7K48j68pp3J21k41l88O20J4k60r7J19m7M8k43Q6J35J88j43j4N2pL8J54m2
$$ 17 265 97 90 17 138 -103 -491 129 143 -117 -214 -95 -142 -94 -337 -251 -116 72 -71 -85 -33 -40 -2 152 110
2134A10m3j9L21k77J29j95K95m06P8J04l16J55j41J92p7jJ85k13j92k2K67j27
$$ 110 67 48 369 92 221 26 321 -85 -7 97 -219 -64 -205 -13 -90 -91 94 -119 -311 -333 -66 -193
2156a93P4L6J33o4j68M3J93R3L16m44K43j02j60K80j63j7j62J72J09j81N8o6m1
$$ -193 -119 -83 50 -14 -182 -139 54 147 463 19 262 160 0 280 117 100 -62 110 219 38 96 30 -11
2179a1Q6J24m56N2L43j62k16O6j83j17K87L10j91j29L41k94P8J98j9k6J85N8k47
$$ -11 75 199 -257 -205 138 -24 -240 -174 -357 -474 -187 123 -68 -197 144 -150 -72 126 107 81 266 324 77
2202G7jJ58k16P7J60l31R3K30l90L11r5j53J77K2l94O7R0j4j3L27k2j68J94k53
$$ 77 76 234 18 95 255 -76 17 247 -143 168 73 -80 97 119 -275 -208 -118 -132 -145 182 160 -8 186 -67
2226f7l84N27j9q8l9L48k06L8M49l82m91M93k28l33N04k9n02N64p4o75L60M20
$$ -67 -451 76 57 -31 -70 278 72 110 559 177 -314 179 -49 -382 122 93 -409 155 81 -594 -234 186
2248A86m82K03J71m30J56L46m27O7N63k82l06O67j98m44N82k45l59M05j42m8l8
$$ 186 -296 -93 78 -352 -196 150 -277 -210 353 71 -235 432 234 -210 372 127 -232 173 31 -17 -55
2269e5M36n27OL85n24J57L48m74j44N22l78l43O22O5m38L33J17o27N43J38n95
$$ -55 381 -146 -140 245 -279 -122 226 -248 -392 130 -248 -591 31 96 -342 -9 108 -519 24 162 -433
2290d33M71N03q32K56O29p09J33O67o79l20P52l29l98L59J78o65N39J93r20P45
$$ -433 38 541 -291 -35 594 -115 18 685 6 -314 438 109 -289 70 248 -417 122 315 -605 140
2310A40J27m35j15N82o98j95J006n17l43J053m33n61R59l13n57P53j86q40Q25
$$ 140 267 -168 -283 299 -399 -594 412 -105 -448 605 172 -389 570 257 -300 453 267 -573 252
2329B52K28q01L68K33q38M32O01m56l45P25p91O7O46m51l84O03j2p57O03L93q78
$$ 252 480 -321 47 280 -558 -126 475 19 -326 399 -392 -325 321 -130 -514 89 77 -680 -77 316 -562
2350e62N52M99q05K71O83p92J58O17n83k20J059q19m15R27o08n70J057j48r12
$$ -562 -10 489 -316 -45 638 -154 4 621 38 -182 877 58 -357 570 -38 -608 449 301 -611
2369f11O25k1p04P81L64r92M08O45p94K5P78p77J41O19n28m13Q06m53m39J045
$$ -611 14 -7 -711 70 434 -558 -150 495 -299 -274 504 -273 -132 487 -41 -454 352 -101 -540 505
2389E05j76q89Q14J92j008Q51K28r18L18M14m99o3O19n04l27Q38o41j51Q30m03
$$ 505 329 -560 254 446 -562 289 517 -401 -83 331 -168 -231 388 -116 -443 395 -246 -397 433 30
2409C0o25N64L69n55L36J89o40M04M03p08K79N16p16Q7M33l39l48P25m05n34Q24
$$ 30 -595 -31 338 -217 119 308 -332 72 475 -233 46 562 -154 -67 366 27 -321 404 -1 -535 289
2430B89j01o97N28J98q41M27K54p53O58M98j090M03M12n42K44J81l25q6Q98m23
$$ 289 188 -509 19 217 -624 -197 57 -696 -38 460 -630 -227 185 -357 -113 68 -257 -343 555 132
2450A32n43P74r1l89Q2K72o01N13J92p81L25M27p33J26O64m20l37P70m74l25P31
$$ 132 -411 363 272 -117 -35 237 -364 149 341 -440 -115 312 -421 -295 369 -51 -388 382 -92 -417 314
2471C14l78q6J32P6l90M47K02n36K59J97n60K75L90l37K46Ol18j06N00l44p6R3
$$ 314 -64 -150 -18 58 -332 115 317 -219 40 237 -323 -48 342 5 251 257 -61 -167 333 -11 -87 6
2493FQ0m85O14k42m13Q28j27o99L11K57l00J10M63m14K31J28j81l66O14k68l03
$$ 6 86 -399 215 -27 -440 388 261 -438 -127 130 -170 -60 403 -11 220 348 167 -199 415 147 -156
2514a56N73k69p8n2K77k79L33k21k92L18j64j16J26K09l15j90M12k16O8K9J90
$$ -156 417 148 70 18 295 16 349 128 -164 154 -10 -126 0 209 -106 -296 116 -100 -32 -3 187
2535A87j17N0p9j06J89rJ47k90J08m91N02J57j55k6K30j81j15N57o31J6m3N0j91
$$ 187 70 120 41 -65 124 115 262 -28 80 -411 91 248 93 67 297 116 1 558 -73 -57 -100 -50 -241
2558b41K27M6j97L04r5l65L32J4l31K02P1j34J15J84j89P7J36J31k33J66l8o0
$$ -241 -14 32 -165 139 44 -321 11 25 -306 -104 -33 -167 -52 132 -57 20 156 287 54 220 182 122
2580A22j30J54k86J74P3j01l4o0j93L52j14J92j18J17l00L02j40k37m0J97N6q3
$$ 122 -8 146 -140 34 107 6 -28 -88 -281 71 -43 149 31 148 -152 150 10 -227 -267 -70 -14 -97
2602i7K39l2K6K90m35j13K42j64J05K4p5J10K7k35j04M7L00o7N0l90K64k72j00
$$ -97 142 110 136 426 -9 -122 120 -44 61 85 10 120 147 -88 -192 -145 155 88 138 -252 12 -260 -360
2625c60K59O1j94J51J31j8j45n6K11nR8j53N1M5N4l1j20J97k5j62j68J57K0r2
$$ -360 -101 -40 -234 -83 48 30 -115 -171 40 35 133 -20 31 76 130 99 -21 176 151 -11 -179 -22 -2 -94
2649i4j4J49n5r4L8p9J94M6k16M9R2m4j65KM94k22K7k08L18l54J85J55k31R6J93
$$ -94 -108 41 -14 -108 -70 -149 45 91 -125 -76 16 -28 -193 -191 303 81 108 -100 218 -136 49 204 -27 69 262
2674B62j68q5J72K6l09l0K22r8j60K65k15k4J15N4j89L07j52J82Q3m05K07j02
$$ 262 94 9 181 207 -102 -132 90 -8 -168 97 -118 -142 -27 27 -162 145 -7 175 258 -147 60 -42
2696d2Kk48N07q3J42k61k25K61j4n9J12Rj02j35J39k38M05j22j07jM89m43l60
$$ -42 -40 -288 219 136 278 17 -208 53 39 -20 92 101 -1 -136 3 -235 170 48 -59 -60 429 -14 -374
2719c74N69m41j26M03M7k90J39K3Q3k34M28k59K93n5p8k09J75k45K70J55l39J97
$$ -374 195 -246 -372 31 78 -212 -73 -50 33 -201 227 -32 261 206 128 -81 94 -151 119 274 -65 132
2741A32Rr8k47K55k82%K00o5l42M98k98m0J57K10Mj76J45R7j12K9l58J91K32p7
$$ 132 141 43 -204 51 -231 -231 -31 -96 -438 60 -238 -278 -121 89 93 -83 62 159 47 76 -282 -91 141 64
2765F4r0M0J16j14K12l15M7J02m3k27J78r9J29j59K96k20j18J02r2N1J14N4k14
$$ 64 -26 14 130 16 228 -87 -40 62 19 -208 -30 -129 0 -159 137 -83 -201 -99 -191 -140 -26 28 -186
2788a86L80l17J96R6j68j92L31j8j08R5K2k43K49K00n06p6L30j18j30J58J14m56
$$ -186 194 -123 73 169 1 -191 140 122 14 109 131 -112 137 337 -169 -245 85 -33 -163 -5 109 -347
2810c47L65q5p6K39Q1n35L76o5j81k0M49l56M1O01l04k07K53k34j63M46j05m35
$$ -347 18 -67 -143 96 177 -358 18 -47 -228 -248 201 -155 -114 487 183 -24 229 -5 -168 278 173 -262
2832b62O51k38k14M3J83K7l40J59j98J20J47k52O6Q6k77j3L95k17P2J52q7r3M06
$$ -262 389 151 -63 -20 163 190 -150 9 -189 -69 78 -174 -108 -22 -299 -312 83 -134 -62 90 3 -90 316
2855C16l49P1N1K81m35J73ql23J48J91n3k14M15m71J36L60m04rJ36N9l97M42J16
$$ 316 -33 38 89 370 -65 108 100 -223 -75 116 63 -151 264 -207 -71 289 -115 -124 12 71 -326 116 232
2878B32n60L77J7j87J71j28o0O0L71k00j38M22l18l31N20K6k87Q3L5j99L83l07
$$ 232 -328 49 66 -121 50 -78 -138 -78 293 93 -45 377 59 -272 248 274 -13 70 105 -94 289 -18
2900a8j52L23j8l50m7N24m35p9L95l01O4M28l90q4L59n6m19N76j72k21L69k49
$$ -18 -170 153 135 -215 -262 262 -173 -252 143 -158 -94 334 -56 -140 219 163 -256 320 148 -73 296 47
2922D7m24M67J99n34K95K82l64J1k8j84Q0M01k21l58M76k87k31M15j22j70K89
$$ 47 -377 90 289 -245 50 332 -32 -21 -49 -233 -153 248 27 -331 145 -142 -373 42 -80 -250 39
2943C9J89j00j39J1l14N17j24K8n2j04J96m02O11k81l97K95k6m7K63J04p70N32
$$ 39 228 128 -11 0 -314 203 79 107 55 -49 147 -255 356 75 -322 -27 -53 -100 163 267 -503 29
2965B9J82o47K98L25m04J07J75j01k5K51l36r0L62k45j15L64j50j96M18J08m43
$$ 29 211 -436 -138 187 -217 -110 65 -36 -61 190 -146 -236 126 -119 -234 130 -20 -216 202 310 -133
2986a33M6J85l37K07J38l32J55J70k74j20M12n4n0Q2k90K10kJ48l69L33k11p4
$$ -133 -87 98 -239 -32 106 -226 -71 99 -175 -295 117 63 13 95 -195 15 13 161 -208 125 -86 -160
3008a60nQ9j79o5O16l64q6J60OR3J72m91L40n0k61M7j20K70k74K95L4j03o4K27
$$ -160 -165 -76 -255 -320 296 -68 -154 6 12 105 277 -214 126 76 -185 -138 -258 12 -262 33 67 -36 -100 127
3032A27k5k29R0j05J17m3J62j68j79L10l7J42n4j77L62l22L08m77K84Q3j76M5
$$ 127 102 -127 -37 -142 -25 -68 94 -74 -253 57 20 162 108 -69 293 -29 279 -198 86 169 -7 38
3054C8J9P6q0l18J51K20l17J63L48l35k4k16K21q8J10p9K8K46l71J31J47K91l13
$$ 38 57 133 53 -265 -114 106 -211 -48 300 -35 -59 -275 -54 -142 -32 -111 -83 163 -208 -77 70 361 48
3077D8J54j20P2k86o1J74N2o6M4J11o8j76kK79p2q5l02L52k04oL44m27J54m1L36
$$ 48 202 82 154 -132 -193 -19 33 -33 11 122 54 -122 -124 155 83 -2 -304 48 -156 -162 182 -245 -91 -132 204
3102B04m84K80J10q3n1n4p8L02J3j89J35j29q8O4K20k28K45m7l30J31R7n17L48
$$ 204 -280 0 110 27 -24 -78 -156 146 159 -30 105 -24 -112 -48 172 -56 189 142 -188 -57 40 -477 -129
3125a29K09j60l8k8J35k08L38Q7l16J02p2j50M98k59j19K76k57K24k93K77P9j21
$$ -129 80 -80 -118 -146 -11 -219 119 206 -110 -8 -80 -230 268 9 -110 166 -91 133 -160 117 196 75
3147G5O1M1r9J46k75j03j71L30R7j25k21K19M4l21J34O1J99J3j23K48l43K87q0
$$ 75 136 177 78 224 -51 -154 -325 5 102 -23 -244 -25 19 -302 -168 -107 92 105 -18 230 -113 174 94
3170I4k14L39M7k51j57K73J04l71J64j81J72l0j27M8M6N7J0J82q1k12J29j25R
$$ 94 -120 219 266 15 -142 131 235 -136 28 -153 19 -11 -138 -90 -44 13 23 205 124 -88 41 -84 -75
3193g5Pl6N3J14p8j88L57j55K69k59r0jR5k00J80J44j72k08J20oJ83r9k25R8L6
$$ -75 -68 -104 -51 63 -15 -203 154 -1 268 9 -81 -82 13 -187 -7 137 -35 -243 -123 -129 54 -45 -270 -172 -136
3218a36J83K8n97L30J56j82N3K42j79KK05J87k20J4j03O4J16j90R2j07K13M0k41
$$ -136 47 75 -522 -192 -36 -218 -165 77 -102 -100 105 292 72 86 -17 47 163 -27 65 -42 171 211 -30
3241c0J82J58k73J27j86P4k42J1J93J2nL6j32j8K90k26j14O1R3J93J6j51j74L38
$$ -30 152 310 37 164 -22 52 -190 -179 14 26 21 57 -75 -93 197 -29 -143 -82 11 204 220 69 -105 233
3265B33j32k52K66j71O4j9j82L83j34j12Q4J94k89j0R4J50l67K16O8m50K88J39
$$ 233 101 -151 115 -56 8 -11 -193 190 56 -56 28 222 -67 -77 17 167 -200 16 84 -366 -78 61
3287F1j93K08L2l07P4R7Om1L4K16j37o5L06j48K18k35j85K24m61M5OM50j98L0
$$ 61 -132 76 108 -199 -125 -28 -22 -63 -29 187 50 -15 291 143 361 126 -59 165 -296 -251 -245 205 7 37
3311C7N0k11j25O1J05N4J9P9M8q1M8M2k27K53J07m24O0O4l0K79j54m2j43J9J43
$$ 37 87 -124 -249 -188 -83 -29 -10 69 117 36 84 126 -101 152 259 -165 -105 -41 -71 208 54 12 -131 -112 31
3336C1K6R6l63J19k24M74Rk64QNJ52J1k04J28k57P2L02r1l2L01k06k3L13l91n2
$$ 31 57 153 -210 -91 -315 159 168 -96 -88 -83 69 80 -124 4 -253 -181 121 30 -2 299 93 70 383 -8 -60
3361f0Q1J23o4p3K64n48M83j10k21PJ31j92J23k5j86L17Q5j33k10J92j19k0K59
$$ -60 21 144 80 7 271 -277 206 96 -125 -118 13 -179 -56 -81 -267 50 135 2 -208 -16 -135 -155 104
3384A04J8k58K39r5NJ42l50L01j12J88k52J59L3j42O7K0R7k45J02j31O4J11j41
$$ 104 122 -136 103 8 13 155 -195 106 -6 182 -70 89 122 -20 47 67 164 -81 21 -110 -46 65 -76
3407g6Q7J45l39K17j17k39K19J87K46l24n4K19q4l22M18J6k54J83RJ5j12J73j78
$$ -76 11 156 -183 34 -83 -322 -103 84 330 6 -48 171 87 -235 183 199 -55 128 137 152 40 213 35
3430C5p1J00k04J28K58o1m37K70q8j20K27r1Pj73K82n9J99j90n7L29l1n22J15
$$ 35 -36 64 -140 -12 246 185 -252 18 -70 -190 37 -54 -47 -220 62 3 202 12 -45 284 253 -269 -154
3453a54N15l14j16K32J72m71J29J01j34P3O1k23KL10l05Q5q9J95j65J27J00j57
$$ -154 361 47 -69 163 335 -136 -7 94 -40 33 94 -129 -127 183 -122 -37 -126 69 -96 31 131 -26
3475b6n7j4J06j18K97j53J96j68j72J53L5k1K6Kk50K20J23k30J32n1k95L57k49
$$ -26 -83 -97 9 -109 188 35 231 63 -109 44 79 58 84 86 -164 56 179 -51 81 30 -265 92 -157
3498a57K40j65J0r0M6J02J6m0RJ90k2l82O11n33R6N0R7O9j68L31k03M5k34q6J99
$$ -157 83 -82 -72 -162 -116 -14 2 -38 -29 161 139 -243 368 -165 -69 -19 78 147 -21 310 107 152 -82 -168 31
3523C1P0k29M07k03K5o1k31K47j03P9OL26q4m94J97L7r1m6p9Q1J50J48j19J23
$$ 31 101 -128 279 76 101 40 -191 56 -47 32 38 364 280 -214 -17 20 -71 -117 -196 -115 35 183 64 187
3547A87l11K48q0r8R0J4j45J37j64M8R7j43K34M3k05j20k5R9L1q6L51m24j9K46
$$ 187 -124 124 44 -54 36 50 -95 42 -122 -74 23 -120 114 157 -48 -168 -193 -94 -63 -149 202 -222 -241 5
3571Ek49J95j2J43j60k3L6J98K5l24L34q6L8j82K68k32n8K01n1j51J7O6k08K92
$$ 5 -244 -49 -61 82 -78 -101 -65 133 158 -166 168 82 120 -62 206 -26 -84 117 66 -85 -68 -2 -210 82
3595H2o6m2o1L1R7r4K4RJ26j63J87k86L75j47l71N2K52J67q4m8j16J30P7m2j24
$$ 82 16 -26 -87 -56 41 -53 -29 -20 106 -57 130 -156 219 72 -299 -247 5 172 88 40 -76 54 131 89 -35
3620c5J0m8J06K4k2k08K56l6J86n28L76j33Pp8L0K08K6n5q2j98J35l1K25j05J21
$$ -35 -25 -73 33 57 35 -173 83 47 233 -295 81 -52 -45 -123 -93 115 141 86 4 -194 -59 -90 135 30 151
3645A51j66p1j8L09k40K90j45j96R8k5J7J7K7j03K36j95P0q6k6j66J60M6J5N8
$$ 151 -15 -86 -104 205 -35 255 110 -86 12 -13 4 21 48 -55 181 -14 56 -30 -56 -222 -62 -16 -1 57
3669E7l2pj26l6K16r7J74k49J59J62j31R9j84l8J2p7K56n3k18K78k24L51j14p7
$$ 57 25 18 -108 -144 72 -25 149 -100 59 221 90 189 5 -33 -21 -98 158 105 -113 165 -59 292 178 101
3693A01r5k5n1P6J31l3j50L9j02J79j34l27N21j38L6J24j31J4o0m0j54J17l7J87
$$ 101 6 -19 -70 6 137 104 -46 -7 -109 70 -64 -391 130 -8 28 152 21 35 -25 -65 -219 -102 -139 48
3717D8q7n0j66K81k9rN1o1J11o8k17J41j42J67O0k22O9J80j64K24l29J18K69k29
$$ 48 -39 -89 -255 26 -3 -12 39 -22 89 21 -196 -55 -197 -30 30 -192 -123 57 -107 117 -212 -94 175 -54
3741e4N4j7o3K76k14k74K80O9j36oJ91j70K62l3j64j09j6j39K93l1j47j6P1K10
$$ -54 0 -17 -80 196 -18 -292 -12 57 -79 -85 106 -64 198 165 1 -108 -124 -263 30 -1 -148 -164 -93 117
3765A17k6r5K7o0R0j48K22j85J64MP7j69k95L45P9j66q3J81k51M1J09k7p6K11
$$ 117 91 -4 23 -37 53 -95 127 -58 106 110 187 18 -277 68 147 -19 -102 79 -172 -131 -22 -49 -125 86
3789H6Pj98Q1O0O6r0K6k3l14L57L5o3q3J44J16l84P3j31J63K8k9J31k66K46j48
$$ 86 93 -105 -24 36 102 12 38 15 -299 58 93 30 -53 91 207 -177 -104 -235 -72 -44 -73 58 -208 38 -110
3814a10K87j82J22p7q3k8J38J19m30J12N4K06j95l0p0J41%N0J50k47Q8k02M3K13
$$ -110 177 -5 117 40 -43 -71 67 186 -244 -132 -78 128 -67 -97 -167 -26 -26 24 174 -73 15 -187 -144 69
3838F9k57J84m11L95J23J9k79MJ87j59J67k07q8K51Oq5K27j77L27k13j57P0n3
$$ 69 -188 -4 -415 -20 103 122 -157 -153 34 -125 42 -165 -253 -2 4 -81 146 -31 296 83 -74 -4 -57
3861e7J09j67K87j35k2p0J56L1k29J0K16j62j44PJ52Nn4j33J93Q9J2k51K70j52
$$ -57 52 -115 172 37 15 -55 101 132 -97 -87 129 -33 -177 -170 -18 -13 -67 -200 -7 82 94 -157 113 -39
3885c9j07J9K34Mj6J1J4o9k18K36J63j64m6l52M29J1j12j23L61k17J06K9r2r9
$$ -39 -146 -127 107 111 95 106 120 51 -167 69 232 68 22 -330 99 110 -2 -125 236 19 125 154 62 -37
3909c7jm2L05k47j3rk0L0O4M5J4j92K0K9l8K96m45M02k89R5J82j60j38K57k56
$$ -37 -38 -80 225 -22 -35 -44 -64 -34 30 75 89 -103 -83 -54 -92 204 -241 161 -128 -33 149 -11 -149 108 -148
3934a48K29J65j43k71J1J37L2j65J51j8j93L22p1j34o2m5K34j18J40o0J72m4k8
$$ -148 81 246 103 -168 -157 -20 12 -153 -2 -20 -213 109 38 -96 -158 -203 31 -87 53 -7 165 121 93
3957I3l35L72j80J59j04l2J09k17J34R9k80O0R6k22K94j08j48L25o7l0l9j36K94
$$ 93 -242 130 -50 109 5 -27 82 -135 -1 98 -182 -122 -26 -248 46 -62 -210 115 48 18 -21 -157 137
3980A37k76K14J29k14J21j30R6l3q8k4J37J97l52K25J09J0j69j4j67L19k65k5
$$ 137 -139 75 204 -10 111 -19 77 44 -44 -68 69 266 -86 139 248 258 89 75 -92 227 -38 -63
4002f3J99P3j32J13l43K08j0K4j44j25K10J43M3j07j43J71j44m0M0J57j3o4j95
$$ -63 136 209 77 190 -153 55 45 69 -75 -200 10 153 196 89 -54 117 -27 -67 -27 130 117 53 -142
4025a42J93r3K7L30j89j29k4j16O1K8J66j78k08M51j46J62j64j62M6K32M0j0k25
$$ -142 51 -42 -15 315 126 -3 -27 -143 -82 -54 112 -66 -274 177 31 193 29 -133 -87 145 185 175 -50
4048e0j2L70k52j15K8n9J34J1Q2j20J03l28P1J5j35J41j06O7O4J38K7m8O0k54
$$ -50 -62 308 56 -59 -31 -90 44 55 137 17 120 -208 -137 -122 -257 -116 -222 -155 -91 47 74 26 86 -168
4072a68p4K70j00j32k6O9K91o3j25P8m6K62k28m8K55Pn6l08M56l14m5L64l10j00
$$ -168 -242 28 -72 -204 -230 -161 130 67 -58 20 -26 236 8 -40 215 222 166 -142 314 0 -45 319 9 -91
4096i1O3J09k98L87l2l43n4k9L21j85L58k25Q1k02K63j10j49L54m01j24M95j15
$$ -91 -28 81 -217 170 138 -205 -259 -288 33 -152 206 -19 62 -140 123 13 -136 218 -183 -307 188 73
4118G3k26j22K76J48q9j0K01l59P7j99P7R2O4N5l25K47P8p8K3q5p7K24j8L5j45
$$ 73 -153 -275 1 149 60 50 251 -108 -31 -230 -153 -61 3 58 -267 -20 58 -20 3 -82 -159 65 47 82 -63
4143f3q8K96j04J14k45O2O6l24K77r4J88k09K35ql7j52r3K82n3j86J81N1m14K68
$$ -63 -151 145 41 155 -90 -28 38 -286 -9 -103 85 -124 111 103 66 -86 -179 103 50 -136 45 96 -318 -50
4167e0J3L2K07q2j67L17j39J4q9Ml3j36L16k41k5J13j56K63r8Ol4j93L9R9N6k01
$$ -50 -37 -5 202 120 -47 270 131 145 56 60 27 -109 207 -34 -59 54 -102 161 63 69 35 -158 -119 -20 36 -165
4193a65K09J31j97K25m80K36J60j80P3N1m9QMj6j02K19j92J39jP2j43M2q2J37
$$ -165 44 175 -22 203 -277 -41 119 -61 12 63 14 22 26 10 -92 127 -65 74 73 145 2 44 -38 99
4217I9L1l40M29r4l06J37Qm3K4J12j08OJ00l8q4J49l06J75P2r6J04j11L89l20
$$ 99 130 -210 219 125 -181 -44 -36 -79 -55 57 -51 -45 55 17 -67 82 -224 -49 23 -73 31 -80 309 -11
4241a1K85k28L3J23K4l86J79j24M8p1J67j31J73k4q2l0R6Q7l94M16k04q8J14K38
$$ -11 274 46 79 202 226 -160 19 -105 -57 -128 39 -92 81 57 -25 -55 41 128 -266 150 -54 -142 -28 210
4265B10q0N5k35j02M82k80j34J38p2k9J25j61K78l72k6M21j82j72J10J89j06l47
$$ 210 130 185 -50 -152 330 50 -84 54 -18 -47 78 -83 195 -177 -203 218 36 -136 -26 163 57 -290
4287b90K85l4j35J78o5P2l3P1L0l2j96J21p4K41k19L7J33l8L7nk97L42o2j34J49
$$ -290 -5 -39 -174 4 -61 11 -22 49 79 47 -149 -28 -102 139 -80 -43 90 52 89 84 -213 129 67 -67 82
4312H2j0j40J3Q3J13l87L5Q7O5M3J07j04j6J2J63k39K35j04k34P2J95N4j58J37
$$ 82 72 -68 -55 28 141 -246 -211 -124 -59 -16 91 -13 -29 -17 146 -93 142 38 -196 -124 71 125 -33 104
4336A04l9j48P3l6k4Rj17Q8M9o2K10j73m8K7J69k9j10Q6J6k11K05PO1K6j19k36
$$ 104 65 -83 -10 -46 -70 -61 -178 -90 -41 -103 107 -66 -114 -87 82 53 -57 29 45 -166 39 46 107 133 14 -222
4362b22M11j62J16K1k96K28J56k18k2O3j34L6N4K27k79P8J11j50k63O6K12j3j3
$$ -222 189 27 143 164 -132 96 252 34 12 75 -59 -23 31 258 -21 57 168 18 -245 -179 33 20 7
4385GJ41k04K68k35P0o8ol0J96L7k62R0n4J52k6j12J45Qj31k18J18j46K14p6J12
$$ 7 148 -56 212 -23 47 -21 -27 -57 139 176 -86 4 -50 102 76 -36 109 117 -14 -232 -114 -260 -46 -122 -10
4410a0p7J53j11J41j74j58K57J39j14L3J19k85K30k16j27J69K84l48J96O8p3j20
$$ -10 -87 66 -45 96 -78 -236 21 160 46 79 198 -87 143 -73 -200 -31 253 -95 101 169 96 -24
4432b4J28K1j22m6J06K26r3l73L11L1j17M3l15M94m55Q6R0R1j85M1K01j70M4J81
$$ -24 104 125 3 -43 63 289 196 -177 134 165 48 91 -224 270 -185 -99 -9 82 -103 -62 139 -31 13 194
4456A94n25N12n0k18L38k72J7j3m4R1J8j53P8j6q2L26m07%L87j11j03pQ0m7o7
$$ 194 -331 181 131 -87 251 -21 -4 -17 -61 30 48 -105 -27 -43 -125 201 -206 -206 181 70 -33 -40 40 -7 -74
4481g4M6O2r5R9j76L01k65j8L2P5Q3J58l33J94%j09K54m17K53Q3j35J2Q8k38Q2
$$ -74 -28 34 -61 38 -138 163 -102 -120 -88 -13 70 228 -105 89 89 -20 234 -183 70 153 18 30 118 -120 -38
4506c8J04j48j17J63J59r6J62k68j48J83L29l57r7K91o6p4J21j83P2r3K49j72
$$ -38 66 -82 -199 -36 123 27 189 -79 -227 -44 285 -72 -169 122 56 -18 103 -80 -8 -101 148 -24
4528b4P6qoj43J17J85j80N2J12r3k6j60J6J10p4K8K29M5k68l9r7R2R5m1J56j73
$$ -24 52 44 38 -105 12 197 17 69 181 88 62 -98 -82 28 -46 -18 211 256 -12 -51 -148 -56 39 -2 154 -19
4554a9r9J46J80k72J32Q4j25j4J56O8j05k77K6m0K24r0J83l4j54K51m27J97p7
$$ -19 -118 28 208 -64 68 152 27 13 169 237 132 -145 -119 -159 65 -25 158 124 -30 221 -206 -9 -86
4577h6l6J92O8L1k56r3J15J96r1R8J48k09k90J55n4p4M2K87Rr5k66K5L81k56J52
$$ -86 -122 70 138 169 -87 -180 -65 131 40 138 286 77 -213 -58 -112 -186 -144 143 152 57 -209 -184 197 -59 93
4602I3j86K36r4p1o1k17J84K54j01j62J78l7K19k12j20K77j79M2P1R2j54j60N1
$$ 93 -93 143 49 -22 -83 -300 -116 138 37 -125 53 16 235 23 -97 180 1 43 114 206 52 -108 -57
4625e7j0K66k37J30r0k03L70M7m04K3K68O9j33k47J13o8l3n0K39LL03k59k36L80
$$ -57 -67 199 -38 92 2 -201 169 216 -188 -165 103 172 39 -208 -95 -163 -196 -246 -7 -4 299 40 -196 184
4649A84k57J41j94J23N0M5O0j77J13j57K54k9l81K74k16J39J28l04P9J39O7N9
$$ 184 -73 68 -126 -3 47 92 152 -25 88 -69 185 156 -225 49 -167 -28 100 -204 -125 14 81 140
4671A40r2K7m9p9O3J93j95r0K97k47j66J80K8j30K45l02J49j68J28j48K30r3o0
$$ 140 48 75 26 -53 10 203 8 -82 215 -32 -198 -18 10 -120 125 -177 -28 -196 -68 -216 14 -79 -139
4694a39J95j77J45n8R4Np9N4k11R6J55m3K4r2O7J18l96K43nJ91k71J11J76k28
$$ -139 56 -121 24 -34 60 65 -14 40 -171 -75 80 37 61 -31 36 154 -242 1 -4 187 -84 27 203 -25
4718b5J3J50j62r9Q9J46J2p7j09P5j02j36R4N9L5L62k30q3p3K24k7k08K78j10
$$ -25 -12 138 -24 -123 -34 112 124 47 -62 13 -89 -225 -131 -72 -37 325 95 12 -61 163 136 -72 206 96
4742I6j93J46j95oK02J2p2r6K16K4r5j03R1K22k67J18k6K42j87K47k42k82M7J98
$$ 96 -97 49 -146 -152 50 62 -10 -106 110 134 39 -64 27 249 -18 100 74 316 129 376 134 -148 -101 97
4766I7r6n1j81K91M1q1L1k1j56K10N3n5l06J47l1J8P0M1qk35N35n58O9J64J73
$$ 97 1 -50 -231 60 101 20 51 30 -126 84 137 82 -224 -77 -108 -90 -20 21 13 -222 313 -245 -176 -12 161
4791A61j39K26k20R7J4l29J71j13j3K30j52K56j36k11L10m4l38L65k99P9j18J73
$$ 161 22 248 28 125 139 -190 -19 -132 -145 85 -67 189 53 -158 152 108 -230 135 -164 -85 -203 -30
4813c0j33K91j3j92P1l3J4m51M41j6l3J25J24j43j09J20j90J62j45Q8J51J9k68
$$ -30 -163 128 115 -77 -6 -39 -25 -476 -35 -51 -84 41 165 22 -87 33 -157 5 -140 -52 99 118 -150
4836a50J11N8M6p5N5M9J0p5J33n9nK23m59N6O1j20J43Q0K4j33j33K1M51l75j20
$$ -150 -39 19 65 -10 45 94 104 29 162 103 98 321 -138 -82 -21 -141 2 82 106 -27 -160 -139 312 -63 -183
4861a83K08k00K66j27J9R5o9J16j45L38n17J50n1K4N4j28J12n9J13R2k5q7o3J99
$$ -183 25 -175 91 -36 -17 78 9 125 -20 318 -199 -49 -100 -76 -22 -150 -38 -97 16 108 83 -4 -67 132
4885A32k16J35K4j7j44L5K9J05N8k73J93L8j37QkK39l93J1K20J09k00K21k18o4
$$ 132 -84 51 75 58 -86 -51 -22 83 141 -132 61 99 -38 -30 -32 207 -186 -175 45 154 -46 175 -43 -107
4909a07J21o6K4O1j12j66J90j09K14j76J86j67J86l5L7M2k15L4K33p2Q4l25J67
$$ -107 14 -52 -28 33 -79 -245 -55 -164 50 -126 60 -107 79 44 81 123 -92 -58 175 103 187 -138 29
4932B9q2J88k33O9O4k32J79K9j06m0K66j30L55m36O4m5J03j33n8kJ38j43K16k08
$$ 29 -53 135 -98 -29 35 -197 -18 11 -95 -135 131 1 356 -80 -16 -61 42 -91 -149 -151 -13 -156 60 -148
4956a48L53k57J01j6J35j15j0p7j32M00j03j23j27J71j10O2j02L7r3Q8O5p3L42
$$ -148 205 -52 49 33 168 53 43 -34 -166 234 131 8 -119 52 -58 4 -98 -61 -154 -66 -1 -74 268
4979B68K6m89K06O3l3j88K6J13l8mL5J05j67K27o8oj69j40K32J46l89M79l01P6
$$ 268 294 -195 11 74 41 -147 -121 -8 -46 -50 -15 90 -77 150 82 76 -93 -233 -1 145 -244 235 -66 10
5003A0Q2j59o6R3K54j0k48J43j02j34K05M8Mj67M08m48j03N0N5K06M3Q7j05K4
$$ 10 92 -67 -133 -40 214 204 -44 99 -3 -137 68 116 120 -47 361 -87 -190 -140 -85 121 164 251 146 170
5027A70j33O6j27n5J80l0rJ77l62J41K7p4M2M8J36k90K10k12Q9j8L3Q2j13J81
$$ 170 37 103 -24 -79 101 71 62 239 -123 18 45 -29 13 61 197 -93 117 -95 -6 -24 9 91 -22 159
5051A59Qk49p9J97P7rJ17j74J84k84J34j43L02l17K0o9L41j83j26LJ28l7%oP5
$$ 159 167 -82 -161 36 113 104 221 47 231 -53 81 -62 240 -77 -57 -126 215 32 -94 -91 37 0 0 -6 69
5076F9j55K74k1J3rj79J36o7m0j74Q9n0Q8J12mj23pj25P0n4j34Q4L30j49j19R3
$$ 69 -86 188 167 180 171 -8 128 61 21 -153 -64 -114 -26 86 82 -41 -48 -173 -103 -157 -291 -207 123 -26 -145 -52
5102e2K2j58J24K14k08Q8K3j31R0R9j48J68k29J19j85J69J02J05j13q5J65j11
$$ -52 -30 -188 -64 150 -58 30 53 -78 12 111 -37 131 -98 21 -164 5 107 212 99 14 179 68
5124F8j76L46j78L4K7m5l3j67j50K42J41o7Q9K6k49o3J70J75m2j34j8j04J5J86
$$ 68 -108 238 60 94 121 76 43 -124 -274 -32 109 42 131 157 -92 -155 15 190 148 14 -4 -108 -93 93
5148I3q2nM0j60J87Oj28r2K56m22L74j8J72q0k60J41J3n5j53N3J99Q3j51J96k37
$$ 93 11 6 46 -114 73 79 -49 -141 115 -307 67 49 221 141 -119 22 35 -20 -173 -120 79 162 11 207 -30
5173c0n2K15j69J2k68K53J34k4k15L16p1l3k67J08J0J82J45j50K56l39j16M8M4
$$ -30 -82 133 -36 -24 -292 -39 95 71 -144 172 101 68 -199 -91 -81 101 246 96 352 13 -103 -55 -11
5196a1l5M5N7j01R9m44N46l29J25O1r1kP8Q0R8j79P9j49j04J49j95L69j64Q1N2
$$ -11 -46 -1 56 -45 54 -390 156 -173 -48 13 -78 -80 -2 78 176 -3 76 -73 -177 -28 -223 146 -18 63 115
5221A15j39Qn3Mpk31J49L02J2k91L53J7n01L25q3K27j39J22l39r1J26RK2J25l9
$$ 115 -24 -16 -69 -65 -72 -303 -154 148 160 -131 222 239 -262 63 -20 207 68 190 -149 -240 -114 -105 -83 42 3
5246Ck6J76l8r2R2j56J62j15k80K78r2K59l35Q2K75m56M07lj07m8j18N0k5J28
$$ 3 -23 153 115 23 115 -41 121 6 -274 4 -88 171 -164 -82 193 -263 144 141 34 -14 -132 -82 -107 21
5270B1j39K01p4J9K23j16q9J58k12q5K45r3j69K30k15J17J4N3L6J59k80QO4k41
$$ 21 -118 83 9 28 251 135 46 204 -8 -93 152 59 -110 120 -95 22 36 89 125 284 4 12 76 -165
5294a65K26j32r8K38j1j10K88l19k19L32lj0l4J66P6k17Q0r6j17K07J6j30K17
$$ -165 61 -71 -169 69 58 -52 236 -83 -302 30 27 17 -17 149 225 8 88 -8 -125 82 98 -32 185
5317A85P5l82k8J43q8K12K6k71O9J21k34J26oN7J7Q0j55J95L7k26O5l51M03j37
$$ 185 260 -122 -150 -7 -95 117 143 -128 -59 62 -172 -46 -52 5 22 102 -53 142 179 -47 18 -333 70 -67
5341f7QJ01j38L56m12M9M1J6O6r9K08k5l33K07P8j48kR9j05K07k15M53k36j5J08
$$ -67 -59 42 -96 260 -152 -103 -62 -46 20 -79 129 104 -229 -22 56 -92 -94 5 -100 107 -108 345 109 94 202
5366B02k81rm0KN9m0J62JN8j67J01K14l36J38r8P1MJ1L1j14Lj0j75K33p4K99j59
$$ 202 -79 -88 -128 -126 -67 -107 55 56 114 -53 48 262 -74 64 -34 37 41 52 83 -31 -28 -38 -213 20 -54 245 86
5393H6j43Q4R5j52q5K0J63m1L03l39k8L0Jn8N0M4O0j12J98Q0n17K83r0m7OJ43
$$ 86 -57 27 122 -30 -115 -95 68 27 330 -9 -37 -7 -6 -64 -14 30 90 -22 176 256 -261 22 -68 -115 -109 34
5419C4M9J51l27J56m2Q9j67o1K44l11n7M50j70p5p4K01j71Q6J97k20J44p0j53
$$ 34 83 234 -93 63 21 110 -57 -118 126 -185 -242 208 38 -37 -111 90 -81 5 202 -18 126 56 -97
5442i7Q7K06n14L40R4J50j58l75M02k96K58k98M12k63kj5J44J39j80k75K09k0
$$ -97 -10 196 -318 22 116 266 108 -267 135 -161 97 -201 211 -52 -54 -69 75 214 34 -241 -32 -52
5464e2o0J88O2J27n9l99Q9M0R7q9M49k03k65Q0p2n2J24j73jk9J68J07j58K26p2
$$ -52 -112 76 138 265 206 -193 -104 -64 33 -56 393 190 -75 5 -67 -119 5 -168 -169 -198 -30 77 -81 145 73
5489G3J35l96J69p4K0P6N2l97L68K1j8n5k0K7K02j06JL0n7k5L8J96m17K17k22
$$ 73 208 -188 -19 -93 -73 3 55 -342 26 47 29 -26 -46 -19 183 77 78 108 51 26 64 260 -157 60 -162
5514a62J17K21k15jK10l4O9j05j45J72J54q2q1j25K6L8J59p0l38N05o71L67p4
$$ -162 -45 176 -39 -40 170 136 205 100 -45 127 281 199 118 -7 19 57 216 146 -192 313 -358 9 -65
5537f5R9k35P7J10p6j17R0J32M0j56k6J06J57p1J65j27k84L49m2n9q2r8O9j41
$$ -65 34 -201 -124 -14 -90 -207 -117 15 55 -101 -127 -21 136 65 230 103 -181 168 126 67 -15 -113 -44 -185
5561a85L55j84P8j97J67J5j88OJ54J01j09K82m38K32q9R3r7K59k03p9J45j48j05
$$ -185 170 -14 64 -133 34 49 -139 -133 21 122 13 295 -143 89 0 93 -4 255 52 -27 118 -30 -135
5584a35J02Q2j81J63K0n8j5J8P1J24j6l35L34r4J05Q7k59K19l03J57j28J05j17
$$ -135 -33 49 -132 31 51 -7 -22 -4 67 191 175 -160 174 80 185 272 13 232 -71 86 -42 63 -54
5607e4J23k31K01q3m6K72p3k07K25N8l00J66r3m9K24P0k05m4K17r2p3r4N2q3l0
$$ -54 69 -162 39 -44 -90 182 109 -98 127 185 -115 51 -42 -91 133 203 -2 -46 171 79 6 -88 -36 -119 -149
5632a49K85P7j20l6j57J23m4J02j75J7M1K27o7k60L43k53R5j61J76j48R8K2l7
$$ -149 136 213 93 57 -100 23 -21 81 -94 -77 -36 191 124 -136 207 -46 49 -112 64 -84 14 36 -1
5655aj3L2J47j05j4j94J05K7j8Q3k65K79Rj13J81k50J84k75J71k64K05O9k2k37
$$ -1 -14 18 165 60 46 -148 -43 -16 -34 49 -216 63 72 -41 140 -110 74 -201 -30 -294 -89 -20 -42 -279
5679b79L53oj35J55K8m4l9j31p4K32j57mO0M0j40N3K10o1J09l9n2k87J78k8kJ50
$$ -279 74 68 -67 88 116 72 33 -98 -172 60 -97 -101 -41 -1 -141 -88 122 61 170 131 79 -208 -30 -58 -60 90
5705I0j32J68J34j37k31J3P8O5j9Pl5J66j45K8p0j5K5R5j04pJ65m2P4m41M81k50
$$ 90 -42 126 260 123 -108 -95 -17 48 29 36 1 167 22 50 -20 -35 -10 85 -19 -26 139 97 171 -270 211 -39
5731c9Jj19K01n0o8K21p9K88m89J80k81K42Kj52L39l85M3K45k5j34j40K56k34
$$ -39 -38 -157 44 -6 -74 147 68 356 -133 47 -234 8 10 -142 197 -188 -145 100 75 -59 -199 57 -177
5754a77l8M28m7n4l31K93m5R0J30j15r8m5P4j94J02Q3P9K4j56l8l5J40n5L4K4
$$ -177 -215 213 166 112 -219 74 29 119 249 134 36 -9 65 -129 -27 56 135 159 3 -35 -70 70 15 49 73
5779G3j71L2L13N3m10J13J31Q8M5r7k35K07j75J78r8P5r8N0P3k23O3J01jk1n0
$$ 73 -98 -66 247 300 -110 3 134 222 267 170 -65 142 -33 145 47 122 24 74 147 -76 -13 88 87 66 16
5804A6l2P7J14j27M6k1R3j65k24Q6m5J91j75P8k5Q7j52K19k1j98L18n6Rp9J04
$$ 16 -16 61 175 48 94 73 166 1 -223 -137 -182 9 -166 -88 -113 -26 -178 41 20 -178 140 84 93 14 118
5829A18N9l20L48n5p5l5j60J16K28l45J26N8J01j67K98j49J7j07Q3j61r3k26N2
$$ 118 177 -143 205 150 75 40 -120 -4 224 -121 5 63 164 -3 295 146 163 56 139 -22 -115 -341 -289
5852b89L42o8K6n8l10M31n1j04N2j61J21J43j22O8m0J22j81L8q2N7J92j56J8J23
$$ -289 53 -15 11 -47 -357 74 23 -81 -29 -190 -69 74 -48 20 -20 102 -79 -41 -123 -66 126 -30 -12 111
5876A11q2k07K66k00J60M5R3q7q4n9K04j99L2J11j16N1J91j90J35r0Q3l06K45
$$ 111 29 -178 88 -112 48 93 186 99 15 -44 160 -39 -7 104 -12 39 230 40 175 85 168 -138 107
5899A07L4l9j51J03O4k51K40k43K05l44K01J36PN0L1K5k2j65k36P8R0J18j0n5
$$ 107 141 102 -49 54 118 -133 107 -136 69 -275 -74 62 69 119 150 175 153 -12 -248 -170 -80 38 28 -27
5923b7P8j31l8K64j64J46m2P1j91Q6j59K2J74o3j47L57m2o0j41j44k8j0J15L13
$$ -27 51 -80 -118 146 -18 128 86 157 -34 52 -107 -85 89 26 -121 236 194 134 -7 -151 -179 -189 -74 239
5947B39k59J6q1P8P1k47RJ24m5O1J59M4k59J77jk3j98J41L6J90m35L68m6l5r5
$$ 239 -20 -4 -85 -7 64 -183 -174 -50 -95 -34 125 169 -90 87 86 63 -135 6 42 232 -203 165 119 84 -11
5972a1K33j58j21L25l11J67j15r2J64Ll70K66J12j72K18m34O9J88J64k10M6R9
$$ -11 222 64 -57 268 -43 124 9 -83 81 84 -286 -20 92 -80 138 -296 -227 -39 125 -85 -39 60
5994F0Q2k78L39l08j02K00Q4J52o7J90m03P5J00k7K73l70J1m5o6K24j49j17J97
$$ 60 142 -136 203 -105 -207 -7 77 229 162 352 -51 24 124 97 370 0 11 -34 -100 124 -25 -142 55
6017E5k3J9j11P0q3K30o3K26k19k11J90J0J8j58K13p2k02L7J10j93L53r4j96K14
$$ 55 32 51 -60 10 -73 157 94 320 101 -110 80 90 108 -50 163 91 -111 -74 36 -157 196 102 -94 120
6041A20J9l83P9L48J16m8m74%O4R3J01n9j2o1k3K19j03K11j78k60J2L72j19l7
$$ 120 139 -244 -165 183 299 251 -223 -223 -159 -66 35 -24 -36 -97 -120 99 -4 207 29 -231 -219 153 34 -3
6065cM7l26L85ro4K40m87K57K02k73p0L07n90M01O6n6k1O0j77K0j37L11M2j57
$$ -3 44 -282 103 94 30 270 -217 40 242 -31 -101 206 -384 17 83 27 6 66 -111 -91 -228 83 125 -32
6089c2R4j69Q6N7k04L46j50P5j61K09j86J98r6j31K46k17K57k68OK04l7l53J10
$$ -32 62 -107 -21 36 -168 178 28 103 -58 151 -35 163 67 -64 182 -35 222 -46 -40 164 127 -226 -116
6112a16j15K13n0K04k12J89j17j60L29j79L27n34L46q2r1K55j30J03j74j00nP3
$$ -116 -231 -18 -68 136 -76 113 -4 -164 165 -14 313 -221 125 43 -48 207 77 180 6 -94 -99 -26
6134b6M0n2P4j22J01R5j13j90R2Q4J27K8j23R1r7J03k45L69j22m44N18l38L9K2
$$ -26 14 -38 36 -86 15 110 -3 -193 -101 -17 110 138 15 106 9 112 -133 236 114 -330 188 -150 -111 -89
6158h9J14J08J30m82M2K44l4Q5j70J15k42K02P1L5k24K40j41j99J64J46O2j07
$$ -89 25 133 263 -219 -177 67 33 118 -52 63 -179 23 94 129 -95 145 4 -195 -31 115 177 70
6180G0j63j9K05P7l39K11K8k06J64j90J62n2J24k23L95j4k27R2k01n1l9J82J64
$$ 70 -93 -112 93 170 -169 42 70 -136 28 -162 0 -52 72 -151 244 230 3 95 -106 -157 -196 -14 150
6203A50k26J32n0j41J87J0j30j32K42J26N6l23J51q4J39j04M4k6k13J34L24k77
$$ 150 -76 56 6 -135 52 62 -68 -200 42 168 224 -99 52 -32 107 3 47 21 -192 -58 266 -11
6225a1l2k05M50j72j81O6J25L1J57l82K34m0j49J88n3r3j09J79j03J30j34J32
$$ -11 -43 -248 202 30 -151 -85 40 71 228 -154 80 40 -109 79 26 -67 -176 3 -100 30 -104 28
6247B8p8P5j57P8J78q5L2q8O0j5j29l5J69J14l59J12J51j82N01l60j96R0J77j21
$$ 28 -50 25 -132 -54 124 39 71 -17 43 28 -101 -136 33 147 -212 -100 51 -131 370 10 -186 -96 81 -40
6271d0J7J29j09J12j93n3L90l64ML56l21j4J76j5r9J58j95o2J65j78P3r4K82j11
$$ -40 -23 106 -3 109 -84 -137 253 -111 -107 249 -72 -86 90 75 -24 134 -61 -123 42 -136 -63 -157 125 14
6295A4j76K21n6K44l57K31p5J37k81N47k34j09R2j86K48k79L8k24K27J0q7J15
$$ 14 -162 59 3 247 -110 121 46 183 -98 449 215 106 198 12 260 -19 19 -205 22 32 -55 60
6317F0J90j84k95K99j90K45r9l3J33n6k56J97J69k43MR7nN1K89l45j7k77J25N1
$$ 60 250 66 -229 70 -120 125 26 -7 126 70 -186 11 180 -63 -59 38 33 84 373 28 11 -266 -141 -90
6341i0P9KJ62L7k39J35Q6k22R4k4j30R7K37j67O1k12k7R5J50m14K71J36k05m1
$$ -90 -11 -9 153 190 -49 86 172 -50 44 20 -110 -13 224 57 118 -94 -121 -26 124 -290 -19 117 -88 -129
6365a29J76M9k82Q4J52k15R1MK85k61o7J99K8m3j47J89K3n6l6R1j03N6o1J22r5
$$ -129 47 96 -186 -102 50 -165 -74 -70 215 -46 -113 86 114 71 -76 113 136 80 44 135 32 88 27 149 54
6390E4m4l2j3J16q8LN0K4N4j34n0K2j93K95m4J51K20l17rj83q4J89J3j93K03J85
$$ 54 10 -22 -35 81 -7 -4 46 70 124 -10 -60 -38 -231 64 20 171 391 74 65 -118 -202 -13 0 -193 10 195
6416A95k67J83j83P7k05K91j76K2qk2K69j42m6r1P6J11J9J0m7n6N1K3K27l82K77
$$ 195 -72 111 -72 5 -200 91 -85 -63 -71 -93 176 34 -12 -103 -27 84 103 113 66 10 61 84 311 -71 206
6441B06r3j70r0L37l04J32j25L9L20j46m5j22J60k58l5J74J75k37o3K36n4j08
$$ 206 113 -57 -147 190 -114 18 -107 -68 252 106 61 -61 99 -159 -194 -20 155 -82 -145 91 37 -71
6463g1j31L36j31q3J86%m1L6P2l89L46j23l10N08n51M23j4q7mj65J80j26M3L80
$$ -71 -202 134 3 -80 106 106 65 101 173 -216 130 7 -303 205 -346 77 63 -24 -28 -193 -13 -139 -96 284
6487B84r1n7o2j01J53j19N9O9m4l3M2l84J29J34K75j82j15P8n6p1m4P5J00l7o
$$ 284 193 136 74 -27 126 7 66 135 91 58 100 -284 -155 -21 254 72 -43 35 -21 -92 -136 -61 39 2 -4
6512dk0L8j00J77k11O6R1k14J24K80k21r1J39k86O06l43K65m64M4j63Q4K28j5
$$ -4 -24 14 -86 91 -120 -54 37 -177 -53 227 6 -85 54 -232 374 31 296 -168 -124 -287 -203 25 10
6535A0J06j90J3l5K80j70M3k23L28l91J21N0L4Q0j40k1K15j10L0Q2j46L1k8q2
$$ 10 116 -74 -61 -96 184 14 57 -166 162 -229 -108 -58 -24 56 -84 -105 110 0 30 112 -34 -3 -31 -113
6559a13J10k51j07L57l6j2n0J43k37K44p4J10l05J4M26k11j74J3P1K2j56L47n27
$$ -113 -3 -254 -361 -4 -40 -52 -102 41 -196 48 -26 84 -221 -207 219 8 -166 -153 -82 -60 -216 131 -396
6582c96O54k33k2p6J18j47K08P3j61jJ04r8K8J91q7J1k18K79j92k2j00j1J29n4
$$ -396 258 25 3 -73 45 -102 106 179 18 17 121 23 51 242 155 166 -52 227 35 13 -87 -98 31 -23
6606b3oK27l84M45N4n90M94k9k33J63r6p7N2j2n1R9k66J54L0K8K24j18m7J83j54
$$ -23 -29 198 -186 259 313 -277 217 188 -45 118 22 -55 -3 -15 -66 33 -233 -79 -49 -21 203 85 38 221 67
6631F7Q9n5l63K87P0j29k5n9J49j43K2Q3k08K72O2l10L26p0M7k70K58l4q4Q5p9
$$ 67 156 101 -262 25 95 -34 -59 -118 31 -112 -90 -7 -215 57 119 -191 135 65 112 -158 100 66 -18 67 -12
6656a2K00k49M9j53L68l4k18K18q2j17M0j7K42j53k80K47n8J13k92L00j40J73
$$ -12 188 -61 -12 -165 203 169 -49 169 87 -30 10 -7 235 82 -198 49 -9 104 -188 112 -28 145
6678A45l0k9l72M30j25RJ13k20J23J24l05M7mL5o4J11P9p6J97%j10o4j52l9l04
$$ 145 115 86 -286 144 19 28 141 -79 44 168 -137 -90 -94 -59 -123 -12 67 -9 188 188 78 14 -138 -177 -481
6703d81N53J76n5j12l36L4M26l05O3R3k10M29l66j00Q0j50K65k17J09P1l7P3N
$$ -481 72 248 193 81 -255 -221 205 -100 -37 56 -154 275 -91 -191 -111 -261 4 -213 -104 -33 -70 3 8
6726HJ11k19R6R6k65L11R8j07J5k6j62L32k82o1m1J21j85O9L01j97o8L6J48k27
$$ 8 119 -100 -4 92 -173 138 236 129 144 118 -44 288 6 -55 -96 25 -160 -91 210 13 -55 -19 129 -98
6750i8L0J26j67O2K18l26K85J02k81q4P7q5L33n04L41P3l37K49j71K32J15l5L2
$$ -98 -68 58 -109 -47 171 -155 130 232 -49 -133 -56 -141 192 -312 29 102 -235 14 -157 75 190 155 187
6773A87jj23R0o1j51K26l51M33k62N1L7J56q9k21Q9n6L0K6r9o3L16j54j03L47
$$ 187 186 63 153 92 -59 167 -184 249 -13 38 75 231 142 -79 10 -46 -16 10 -89 -152 164 10 -93 254
6797B54jm80J60l4K0Q9J61lj2M6k14K4k17J60j07Q9K55j60J00o7k6J27k60j38
$$ 254 253 -227 -67 -101 -81 8 169 166 154 200 -14 10 -207 -47 -154 -65 190 30 130 63 37 164 -96 -234
6821b34K37J72r0j49rj30J05L88o22M67J26l93K14j41J77j86J86j27L4j79K09
$$ -234 3 175 85 -64 -73 -203 -98 290 -332 135 261 -132 82 -59 118 -68 118 -9 25 -154 55
6842E5k1J72j38k90L63j11l11K09l4K2J46j1o1k58K59N0J5k77K39J93j22J8k69
$$ 55 34 206 68 -222 141 30 -281 -72 -106 -84 62 51 -10 -268 -9 41 56 -221 18 211 89 107 -162
6865a62L49l28L2P3j01J03lj7P1j22M15l78R1l12L50o6j56O3j00J42J77q1r9r
$$ -162 187 -141 -109 -36 -137 -34 -37 -54 17 -105 310 -68 23 -289 61 -5 -161 -98 -198 -56 121 40 -59 -68
6889f8K7p1L25l86K49J6K4k4j91J98k71K55m03L64j21L0q4R6l6J1k23K06P6JJ76
$$ -68 -41 -112 213 -173 76 92 116 92 -99 99 -172 83 -320 44 -77 -47 -131 -35 -71 -60 -283 -77 -1 0 176
6914A76p7J70m56LJ09J2j8k0J02N5rL6r4r5L9R7N1r8j43K56k63K36k51L43l4j89
$$ 176 99 269 -187 -184 -75 -63 -81 -101 1 56 47 83 -11 -106 -67 30 81 -17 -160 96 -167 69 -182 161 127 -62
6940f2ML3K58k21K29j89j39P1J19j78P6qO9k37J3K34j29j7P3K4J55Kk81J52J2
$$ -62 -58 -25 233 12 241 52 -87 -16 103 -75 1 -7 62 -175 -162 72 -57 -74 -1 23 178 180 -101 51 63
6965F3j1O7jQ1q3o1j79J23K4j47J18O5l19K59O0K5j07L3l9p6J47j21K40j78Q3
$$ 63 52 119 118 199 116 55 -124 -1 23 -124 -6 59 -260 -1 59 84 -23 10 -29 -105 42 -79 161 -17 66
6990F6lk49L27j50q9J21k07K86r5Lr0NJ80q3j62J62l21J77N3l9J61Q4J32m50J40
$$ 66 63 -186 141 -9 -98 23 -184 102 7 10 -80 -75 105 22 -140 22 -299 -122 -69 -108 53 137 269 -181 -41
7015d1LN2j43K25R4j23k61J82oj08J51Q0l28J73K41j28j32l69M49J30r0J12k59
$$ -41 -38 14 -129 96 190 67 -194 -12 -18 -126 25 105 -223 -50 191 63 -69 -438 11 141 51 163 -96
7038i6K20l6P6j58N0o5O0p4J57J94k62p8N3k01J99Ok2J71j52N4j39j8K75l63J36
$$ -96 124 88 164 6 56 -9 51 -23 134 328 66 -12 41 -160 39 45 23 194 42 96 -43 -61 214 -149 -13
7063a3M6r0Q9j17M6R0j53J86k85L24J7m4R4j30P7j64Q1J57l2k45J69j43J48j39
$$ -13 33 -57 32 -85 -39 51 -102 84 -201 123 140 96 190 60 137 -27 54 211 179 -66 103 -40 108 -31
7087c1K08o2k34J53p3O4j7j28R3j9J62p0n2P9j8j02P7j70J18J10K9k67m3l7J53
$$ -31 177 115 -119 34 -39 25 8 -120 -27 -46 116 46 -6 73 55 -47 30 -140 -22 88 117 -150 -193 -230 -77
7112g7J46R9k64P8L4N6Q1q9j63J53o2N1J14M2k28j0P6l5O1q5O9j17J62R4j65r
$$ -77 69 168 -96 -18 16 72 153 64 -99 54 -8 43 157 199 -29 -39 37 2 63 -22 47 -70 92 186 21 12
7138A2r4J44J17j49Q8j97%J9J3j06L85m22J86K24l21K37m38M47j07k3J19k86P2
$$ 12 -82 62 179 30 118 -79 -79 -60 -47 -153 232 -190 -4 220 -101 136 -302 145 38 15 134 -152 -80
7161h0K12k79J59J41l30K22K3M1j69J60k22M5j01J74K5rn9n7K37j54r6o6K35o
$$ -80 132 -147 12 153 -177 45 68 109 -60 100 -122 -77 -178 -4 21 12 -47 -104 133 -21 -117 -183 52 46
7185D6J3P2j78n6J53j75M18j07r3j21J32k03J7J61k27K92j07R0j60l7J45J09l33
$$ 46 59 131 -47 -103 50 -125 293 186 93 -28 104 -99 -82 79 -148 144 37 127 -33 -70 75 184 -149
7208a49J66N8O1j83J0R5Q0j11R7j17j77L22k47n0K38o2K0j11J25j21J1J5K4o9
$$ -149 17 75 136 -47 -37 58 138 27 124 7 -170 152 -95 -145 93 31 51 -60 65 -56 -45 -30 -6 -75
7232g5j04R1K40k49J73J61l06M7k83J11L28m0l71J31p0K86J46j65l7O6j75K96
$$ -75 -179 -88 152 -97 76 237 -69 -22 -305 -194 134 94 -277 -146 -216 70 216 51 14 80 -95 201
7254B01k21Q9k0O3n3mJ67j42o2J3pJ1j70P4O7J9J59m05K36m7J1J7j28J52Jl07
$$ 201 -20 69 49 112 59 55 222 80 18 31 24 35 -135 -61 6 25 184 -221 15 -32 -21 -4 -132 20 21 -286
7280b86K41L5l9J98j52O0k32M29j61J38j12J55k68J7J80j83J26k7k15Q8k11K69
$$ -286 -45 -10 -49 149 -3 57 -175 254 93 231 119 274 6 23 203 20 146 119 -96 -8 -219 50
7302E0k19O6M55l12K2k4L1m48K65K31j06m3Q7k49K89o8j59J82j00L62l78m6J87
$$ 50 -169 -103 352 40 62 38 69 -379 -114 117 11 -32 55 -194 95 27 -132 50 -50 312 -66 -112 75
7325G5M7k36K65k12l0j46K43n4j39L00k4m4J56j91R4j59L98l37j10j35J42P3J23
$$ 75 122 -114 151 -61 -91 -237 6 -48 -187 113 89 45 201 10 104 -55 343 6 -104 -239 -97 -24 99
7348I9j09Jl61K38J64j08M1J72m4J32l56R2k19J93L1P8K63l96Q3j18k00K18J22
$$ 99 -10 -9 -370 -132 32 -76 -35 137 93 225 -131 -39 -258 -65 -34 44 307 -89 -6 -124 -324 -106 16
7371A6J27k42O5J06m22M01j00M6K3j4j11P3j06L1j0J95m5M8K5p8m5n2O1R9n2q5
$$ 16 143 -99 -34 72 -350 51 -49 -3 20 6 -105 -32 -138 -107 -117 78 33 81 106 28 -17 -69 -8 91 39 -46
7397d6K9j62J79MK95l48Q7P8l66M5K64j77J15R0l72M35J3j20L1j50Q7N7n9n4O
$$ -46 -17 -179 0 4 299 -49 38 116 -250 -205 59 -118 -3 87 -285 150 163 43 74 -76 11 68 9 -45 -39
7422c9J33j49P2j75J72j10J30J24k99j8M5l03M38j51J64J68j49r6l54K90PJ05
$$ -39 94 -55 17 -158 14 -96 34 158 -141 -159 -114 -417 21 -130 34 202 53 -43 -397 -107 -100 5
7444Ek73L58L1k53R3J19j37O7o9m9O7k6J23J07l54k9J98m5K0J97k00J48J17k81
$$ 5 -268 90 121 -132 -39 80 -57 10 -59 -108 -41 -67 56 163 -191 -220 -22 -67 -47 150 -50 98 215 -66
7468f6n5J1J03J15o5r3r9K27j67J10K7L8j73J71K38l04M1q8J35j92J92k88K72
$$ -66 -121 -110 -7 108 43 -50 -149 78 -89 21 48 86 -87 84 322 18 59 -29 106 -86 106 -182 90
7491I0pJ53j38j01K0J72l16J30n2P0k4J60j20M5p9L7k05J03J58l82K97n7K29j62
$$ 90 83 236 98 -3 17 189 -127 3 -49 21 -3 157 37 82 3 40 -165 -62 96 -286 11 -46 183 21
7515B1j06k4L8P4J61k50K96m27L56L4p5k57k8K81l43J42J57O3J56j15k83K87j8
$$ 21 -85 -109 -71 3 164 -86 210 -217 139 173 98 -159 -187 94 -249 -107 50 113 269 154 -129 158 140
7538A40l5N5j05R4J33j82j57P2k64L91l18K83p2K5J71j86j85o9L64k49J68k08
$$ 140 105 160 55 149 282 100 -57 15 -249 142 -176 107 35 60 231 45 -140 -209 155 -94 74 -134
7560a34j8J52j83K09p8l2r3N7J03j79J54N70l94r6k4M1m8J35n9J45r2k91M1R1
$$ -134 -152 0 -183 26 -52 -84 -177 -120 -17 -196 -42 528 134 38 14 55 7 142 83 228 136 -155 -114 -23
7584b3K2Jr3J09k1P9Q1k35j8N1j35KK85n3N9j58r8K07K1j59R4o6J20p4j94K73
$$ -23 -1 0 -93 16 -5 74 155 -80 -98 -47 -182 -180 105 52 111 -47 -145 62 83 -76 18 -48 72 -2 -196 77
7610G7o1J43j11j48N04m20J18j95K45l52K39R0q9L8MK01k30J06k40L6J2r2J23
$$ 77 16 159 48 -100 404 -16 102 -93 152 -200 39 129 40 78 82 283 53 159 -81 -45 -33 -125 -2
7633bj07J9L20k44J36j63P3j2K2O9j36L38m94K90L40n36R2lj17j20J43J71J00
$$ -2 -109 -90 230 -14 122 -41 32 20 42 111 -25 313 -181 109 449 -87 5 2 -115 -235 -92 79 179
7656A79k34N7l1J4k02M99m10K28k30J83J40l08K72k26M4o6M9J46j30M8O7p6j93
$$ 179 -55 2 -29 -15 -217 282 -128 100 -130 53 193 -115 157 -69 -25 -91 -42 104 -26 22 89 13 -180
7679a80N7K50J12m48K72k18l6J39K46m18J75r5l5K9J94N3k7j18K88j88j79J40
$$ -180 -123 127 239 -209 63 -155 -191 -52 194 -224 -49 -144 -179 -150 44 97 70 -48 240 52 -127 13
7701A3J97k74k38M18j74L23j91NK4k14K84j81K6J53l96N38k69O9j85l4J92l0j50
$$ 13 210 -64 -302 116 -58 265 74 79 103 -111 173 -8 18 171 -225 313 44 113 -72 -106 86 56 -94
7724i4L23J0l14J39K34l78M24k8n08P7K20l4O2l7j81O6n1Q2J04j63J35j08n3O4
$$ -94 229 239 -75 64 298 -80 344 316 -192 -115 105 71 133 96 -85 -19 -70 12 116 -47 88 -20 -73 -9
7748iN4P3kr2j27p9J67mJ24N6j69R4l0j72K82l06n2M31kk48L1N5k11K71k95M54
$$ -9 45 118 116 24 -103 -182 -15 -19 105 161 -8 86 56 -116 166 -140 -192 239 237 -11 20 75 -136 135 -160 294
7774B94j00k19l9K03Q0l42M2J15J2j35j29K85l7m1K7n9N5j53J80J94l12L00M3
$$ 294 194 -25 -64 139 219 -123 -81 34 46 -89 -218 67 30 -11 16 -43 12 -141 39 233 -79 221 264
7797B64k2l37J85j36j23J93Q6j38J13P4l38J05j28K66J2k52L2J60j71M7K01o5
$$ 264 242 -95 90 -46 -169 24 110 -28 85 159 -179 -74 -202 64 76 -176 -144 16 -155 -108 93 28
7819B8j28J28J60k27N1j31J07K58l83R3m0J65p9m3j31R5J65j44J78k91L56m0k01
$$ 28 -100 28 188 -39 12 -119 -12 246 -137 -44 -84 81 2 -41 -172 -77 88 -56 122 -169 187 147 -54
7842e4J45j33j0mk65J32K59n7o1j76J65J92j26P5k6q6q6K1O7Q8J95j62l9k5Ro2
$$ -54 91 -42 -52 -56 -321 -189 70 13 -48 -224 -59 133 7 82 56 -30 -116 -95 -28 60 255 93 54 29 38 -24
7868b4J59k01J31n7p5O6j79L39j2l02J76K9o3l1N7N3l47L12j01J33P8m9J03K0
$$ -24 135 -66 65 8 -67 -1 -180 159 147 -155 21 50 -13 -44 13 66 -281 31 -70 63 141 92 195 215
7892B15m5J00m26K20j33j81L51j72J73m6r7M3j50L31k11O2J03k42O2K49l1j1j53
$$ 215 170 270 -156 64 -69 -250 101 -71 102 56 -41 2 -148 183 -28 34 137 -105 -43 206 175 164 11
7915A1Q5j91M9L31j99j74N8K83n27L79J25j10j56J47q3j36L54q6p9j80M6J65n6
$$ 11 96 -95 -46 285 86 -88 -30 253 -274 105 230 120 -36 111 28 -108 246 160 81 -99 -53 112 56
7938E6J02j89j10M7MJ1J9J49k62O3K89j41p2l7o3J64l26K24P9j1N9Q5k58J84m8
$$ 56 158 -31 -141 -94 -90 -79 -60 89 -173 -110 179 38 -34 -71 -134 30 -296 -72 7 -4 55 140 -118 66 18
7963A8q0j32K99j95N2OJJ27J07j65R0j54K04m78L18r6O2J8j35m9J00Q7J14j26
$$ 18 -62 -194 105 -90 -38 -32 -31 96 203 38 128 -26 178 -300 18 -78 -16 2 -133 -182 -82 5 119 -7
7987gK58p1n8l1P4j62n7K51j98j4m1J29m7MN7J89k11p3j98K78k8N3N8k79J92k7
$$ -7 251 180 122 91 165 3 -54 197 -1 -15 -56 73 26 30 87 276 65 -8 -206 72 44 97 155 -124 68 41
8013D1k7k2J24rr8Ol4Q4kK61l92J90k04J35j7j38L54l82Q1R2J64k58j43K27L9
$$ 41 14 -8 116 107 9 15 -19 65 63 324 -68 122 -82 53 36 -102 252 -130 -49 43 207 -51 -194 33 72
8038G2j35N2J05k40Q9k1J90k42K98m3J23j82j42L0R6M3p6k30K35m3J13p6L10n49
$$ 72 -63 -11 94 -146 -57 -78 112 -130 168 125 248 66 -76 -46 50 93 17 -213 22 -21 92 16 326 -223
8062b23M20l24R3J31j10K13j77L1j46Q8j24J41J13q4K2j90J97j01N4q%K3j41j80
$$ -223 197 -127 -34 97 -13 200 23 54 -92 -4 -128 13 126 42 64 -126 71 -30 24 16 16 39 -102 -282
8086b82J08Q9j3m5Q7L67k40o5K33p4k86J86nj70K01n2j79L63l70o0J08o8J11K49
$$ -282 -174 -85 -98 -143 -56 311 71 6 239 165 -121 65 60 -110 91 39 -140 223 -147 -207 -99 -167 -56 193
8110A93K3r4k06J25K39l57nJ82k62O8J06n6J56L7l20J44J76j91L00k27j18k04
$$ 193 216 122 -84 41 280 -77 -82 100 -162 -94 12 -44 112 149 -171 -27 149 -42 258 31 -87 -291
8132b91L50k56K59Qk89L43j55R4J70q6l29oK73j02k33J14J25N2Kr3j37K61j86
$$ -291 59 -197 62 70 -219 124 -31 63 233 147 -182 -188 85 -17 -250 -136 -11 41 43 -50 -187 74 -112
8155a12J39k5k30P3R7j7J18K02p9k66M50k08l36nJ36M08m07k4J75j23R2J06l00
$$ -112 27 2 -228 -155 -58 -75 43 245 166 -100 350 142 -194 -199 -63 345 -62 -86 89 -34 58 164 -136
8178a36Lmj24O7r2J80K80j73K22k48J4Lp
$$ -136 -133 -137 -261 -194 -286 -106 174 1 223 -25 -11 -8 -15
8191a5
$$ Imaginary data points
##PAGE= N=2
##DATA TABLE= (X++(I..I)), XYDATA
0@%%%%%%%%%%%%%qJ6j6J6j6K4l2L2m0M8n6O4p2Q7r8J10j27J47j68J88k13K44k75
$$ 0 0 0 0 0 0 0 0 0 0 0 0 0 0 -8 8 -8 8 -8 16 -16 16 -24 24 -32 32 -40 47 -51 59 -68 79 -89 99 -114 130 -145
36a45L07l41L79m22M70n25N83o44P10p84Q66r55J051j157J277j409J552j710J891
$$ -145 162 -179 200 -222 248 -277 306 -338 372 -412 454 -501 550 -607 670 -739 813 -897 994
55I94k097K330k599K910l278L725m275M972n888P146q984J1921j7325L0276j11988
$$ 994 -1103 1227 -1372 1538 -1740 1985 -2290 2682 -3206 3940 -5044 6877 -10448 19828 -92160
70i2160p8686L34119j28058j69952K04083m5677j65002K24149l399k26612J74810
$$ -92160 -170846 163273 35215 -134737 69346 23669 -141333 82816 79417 -147195 27615
81B7615R6366k48081R9303J69620k16990q240K08977j27667p4112J44794q3026
$$ 27615 123981 -124100 -24797 144823 -72167 -80407 128570 903 -73209 71585 -11441
92a1441n6509J60713p7618j15966J50632k851j20405R6821q69r5747J18476p89
$$ -11441 -67950 92763 15145 -100821 49811 46960 -73445 23376 22507 -73240 45236 44447
104D4447j46572J27873N7181j92890R6768J48409k13227j1723K24460j30276j21574
$$ 44447 -102125 25748 82929 -109961 -13193 135216 -78011 -89734 134726 4450 -117124
115a17124J93074k8017j39681J35256J6128j41991R2285N6019j20536N0400N7261
$$ -117124 75950 47933 -91748 43508 59636 -82355 9930 65949 -54587 -4187 53074
126E3074j00712M1106N9807j04396L4209Q1009j11784J4430J16451j17452m1781
$$ 53074 -47638 -6532 53275 -51121 -16912 64097 -47687 -33257 83194 -34258 -76039
137g6039J57575o4252j07105J37670J630j27842R4801M7436j25566N1139Q1217
$$ -76039 81536 17284 -89821 47849 49479 -78363 16438 63874 -61692 -10553 70664
148G0664j04473N184Q5598p3599j9287Q0368m6184l0978O3493l4945k6023O3566
$$ 70664 -33809 -28625 56973 -16626 -35913 44455 -1729 -32707 30786 -4159 -30182 33384
160C3384l9615l7115Q2538k6318o9769Q2207Q025r1061O5092M6001r9280K8319
$$ 33384 -6231 -43346 39192 12874 -56895 25312 33337 -57724 7368 53369 -45911 -17592
172a7592P8016q3277j3201Q7989n1144m2593P7903j9741n5835N7744K970n1508
$$ -17592 60424 -22853 -36054 51935 791 -41802 36101 16360 -39475 18269 21239 -30269
184c0269L9807R345m7741L3277J5674m8328K7937K5463n2132J8481L9414n2473
$$ -30269 9538 18883 -28858 4419 20093 -28235 -298 25165 -26967 -8486 30928 -21545
196b1545J867N4359m1639k0519N7676k3273l9074N2031o62m7378L5891J7212m5335
$$ -21545 -19678 34681 -6958 -27477 30199 6926 -32148 19883 19221 -28157 7734 24946 -20389
209b0389J7045K5942l4986M166K6200k5597j800K3635k1351m269K4885j8448q982
$$ -20389 -3344 22598 -12388 -8222 17978 -7619 -9419 14216 -7135 -11404 13481 -4967 -13949
222a3949K7801j4949j6496K9454o251k4467K6478M774k9575J8944J5383k8702
$$ -13949 13852 -1097 -17593 11861 5610 -18857 7621 12395 -17180 1764 17147 -11555
234a1555P212K1918k2969k693K2800j5043r015K0573q386j2969J6885k879j4526
$$ -11555 -4343 17575 -5394 -8087 14713 -330 -9345 11228 2842 -10127 6758 3879 -10647
247a0647J3907J776j4269R226M900j3158O197O925j1717M065R230j1051J082J0763
$$ -10647 3260 5036 -9233 -7 4893 -8265 -2068 4857 -6860 -2795 6435 -4616 -3534 7229
261G229r165l418J2672m581q310J0634Q34r861N160M698p279k60M958k834j966
$$ 7229 -1936 -5354 7318 2737 -5573 5061 5895 -3966 1194 5892 -1387 -1647 3311 477 -1489
276a489J086o49L58j004o58K138k99k736K377J405l347J359L115k766j63M113
$$ -1489 -403 -1052 -694 -1698 -2356 -218 -517 -3253 -876 529 -2818 -1459 1656 -1110 -1273 2840
292B840j999k558L938M27l278J348J894j101j380N80R18k46k330K96K140j688
$$ 2840 841 -1717 2221 2648 -630 718 2612 1511 131 711 1629 1383 -947 -651 1489 -199
308a99j741J658j9j230M82o36q1K327j477j848L124M98k987J232K552j589j06
$$ -199 -1940 -282 -301 -1531 -1049 -1685 -1766 561 -916 -2764 360 858 -2129 -897 1655 66 -40
325d0J317j036J056P84k676J182K641l177p29L500k033k080K485j305k198L492
$$ -40 1277 241 1297 2081 -595 587 3228 51 -678 2822 789 -1291 1194 -111 -2309 1183
341A183j131m170M107J645n779J169N315l548k757M753R99l645J691J718j770
$$ 1183 52 -4118 -11 1634 -4145 -2976 2339 -1209 -3966 787 1786 -1859 -168 1550 -220
356b20J078J035j517M34J990j960q92J622M03j962o45J565l52j143o21K34K76
$$ -220 858 1893 376 810 2800 840 -52 1570 1973 11 -634 931 579 -564 -1185 -951 -675
373f75K64j453o1K193p53k332K207J617k976R45K796j894k25K549k239o68L718
$$ -675 -411 -1864 -1925 268 -485 -2817 -610 1007 -1969 -1024 1772 -122 -347 2202 -37 -705 3013
390C013k038k547M093J13m527K868J786m210R56K421l300J090J974m496R51M274
$$ 3013 975 -1572 2521 2634 -1893 975 2761 -1449 -493 1928 -1372 -282 1692 -2804 -1853 2421
406B421n492J76N782m728k065O610l030m573Q056j256o960Q016J539j0197P178
$$ 2421 -3071 -2895 2887 -1841 -3906 2704 -326 -4899 3157 1901 -5059 2957 4496 -5701 1477
421A477N390j0777K975Q414j0565J18J0687r531m051J3090o654q880J3037j565
$$ 1477 6867 -3910 -935 7479 -3086 -2968 7719 -1812 -5863 7227 573 -8307 4730 3165
435C165j2073J0998K995j3868Q568O321j3831N200J0721j3664M66J4194j2080
$$ 3165 -8908 2090 5085 -8783 -215 6106 -7725 -2525 8196 -5468 -5002 9192 -2888
448b888m289J6079p785q579J5937m522j2921J4812M99j5343J2106N391j6734Q009
$$ -2888 -7177 8902 1117 -7462 8475 3953 -8968 5844 6343 -9000 3106 8497 -8237 -228
462b28R058j6923N023J3004j6566O50J6272j5640l920J9929j2184j0264K1771
$$ -228 8830 -8093 -3070 9934 -6632 -5982 10290 -5350 -9270 10659 -1525 -11789 9982
475I982o963j6686K0966M58k1647J8240P744k4376J1528J5053k4166N233K1235
$$ 9982 3019 -13667 7299 7757 -13890 4350 12094 -12282 -754 14299 -9867 -4634 16601
488A6601k2295l740K4996j7200j2329K6539r327j8111K3899k449k3035K0602O057
$$ 16601 -5694 -9434 15562 -1638 -13967 12572 3245 -14866 9033 6584 -16451 4151 10208
501A0208k5984J5908J3923k7171P642K0228k4188O79K4319j9195p717K5893j3899
$$ 10208 -15776 132 14055 -13116 -5474 14754 -9434 -8755 15564 -3631 -11348 14545 646
514F46j4796K6401o621j9510K3719q36k4222K0785N939k6237J6233J3568k9128
$$ 646 -14150 12251 5630 -13880 9839 9003 -15219 5566 11505 -14732 1501 15069 -14059
527a4059R859K0938k8778J494K8747k4117r633L1803j6519j8515L1949o349k5515
$$ -14059 -4200 16738 -12040 -10546 18201 -5916 -15549 16254 -265 -18780 13169 6820 -18695
540a8695K7595L168l0528K1691J2793l1051J3416K0827l0284L920K5668k5444
$$ -18695 8900 12068 -18460 3231 16024 -15027 -1611 19216 -11068 -7148 18520 -6924
552f924m504K9711k0095j3657L0880j2760k2250L0584j931k8262K4714P499l0706
$$ -6924 -11428 18283 -1812 -15469 15411 2651 -19599 10985 9054 -19208 5506 13005 -17701
565a7701J6686J5814k8681R662K0782k6497R59K5437k2555n368K8362j7601j3627
$$ -17701 -1015 14799 -13882 -4220 16562 -9935 -8976 16461 -6094 -11462 16900 -701 -14328
578a4328K9495j1880k1053L0040k467k8316K5357Q121l2919J7132J8104l0723
$$ -14328 15167 3287 -17766 12274 9807 -18509 6848 14969 -17950 -818 17286 -13437
590a3437P166K3756k6729j522K6205k1390p295K8726j6223j5559K9633r553k2845
$$ -13437 -6271 17485 -9244 -10766 15439 -5951 -13246 15480 -743 -16302 13331 3778 -19067
603a9067K9246J091k9568K2703J2494l2165J1755K2061k7221O84K5210k0646p756
$$ -19067 10179 11270 -18298 4405 16899 -15266 -3511 18550 -8671 -7987 17223 -3423 -11179
616a1179K3927j3618j0746K2483r502j3602K1837o844j8416K3266K18k3991J9501
$$ -11179 12748 -870 -11616 10867 1365 -12237 9600 2756 -15660 7606 7824 -16167 3334
629C334R597k8183J2077J9455k5987J613K4185j9676p736K4315j2000j2533K2131
$$ 3334 12931 -15252 -3175 16280 -9707 -8094 16091 -3585 -11321 12994 994 -11539 10592
642A0592o374j5528J8926k102j7670J7665L159k0758J3971R414k3056Q075J6974
$$ 10592 4218 -11310 7616 5514 -12156 5509 8668 -12090 1881 11295 -11761 -3686 13288
655A3288k1426L15K0469j6327p340K0792r226j1753J8454k855j4934J5147J340
$$ 13288 -8138 -7823 12646 -3681 -11021 9771 545 -11208 7246 4391 -10543 4604 5944
668E944j5254J2180M987j5587Q489Q726j6361M566J2501j4737l49J4756j1664
$$ 5944 -9310 2870 7857 -7730 759 9485 -6876 -2310 10191 -4546 -4895 9861 -1803
681a803o201J5701p230r613J4949k497j2474J1534K259j2898Q465N558j2153N197
$$ -1803 -8004 7697 467 -9146 5803 3306 -9168 2366 4625 -8273 192 5750 -6403 -1206
695a206P701j1532K238J0157r903j289J0964p573m869J1409m737o625R965j379
$$ -1206 6495 -5037 -2799 7358 -2545 -3834 7130 -443 -5312 6097 1360 -5265 4700 3321
709C321q834P553K317r556M869M697q356K355N478p132Q47N856n473j005O516
$$ 3321 -5513 2040 4357 -5199 -330 4367 -3989 -1634 3844 -3288 -2441 3415 -2058 -3063 3453
724C453m521l005O854k205l986O022p15m886M544J075m887K940K599m859J726
$$ 3453 -1068 -4073 2781 576 -3410 2612 1897 -2989 1555 2630 -2257 683 3282 -1577 149
739A49K813l985J05L609l543p91L678k340k169L457r37k646K855J88k107J316
$$ 149 2962 -1023 -918 2691 -852 -1643 2035 -305 -2474 983 46 -2600 255 443 -1664 -348
755c48O27j254O24P96p34L61L02n18O79J50o82R38J61j282R07J62j061Q03J21
$$ -348 279 -975 -351 445 -289 72 374 -144 535 685 3 941 1102 -180 727 889 -172 631 752
774G52j278O70J29j011P00J41j665J069Q20j898Q27J395j886r0K294j427o05K244
$$ 752 -526 144 273 -738 -38 103 -1562 -493 327 -1571 -744 651 -1235 -1325 969 -458 -1063 1181
792A181j074j073K201o81j211K386p56j979K593n55k335K248M63l170K152J408
$$ 1181 107 -966 1235 554 -657 1729 973 -1006 1587 1032 -1303 945 1408 -1762 390 1798
808A798l985J252K775l759M5L510l066r04M004k144k285M628j179l215M212J20
$$ 1798 -2187 -935 1840 -1919 -1874 1636 -1430 -2334 1670 -474 -2759 1869 690 -2525 1687 1807
824A807m426L550J741m659K143L081m683J064L667m268m45M477l104k290M823
$$ 1807 -2619 931 2672 -1987 156 3237 -1446 -382 3285 -983 -1428 3049 -55 -2345 2478
839B478k242l144M269q06l624L438P20m145K801K000m408J861L015m063N25M058
$$ 2478 236 -2908 1361 555 -3069 369 1089 -3056 -255 1745 -2663 -802 2213 -1850 -1325 2733
855B733l363j067M316k415j928M281j521k879L764p24l204L393J65l678K728J373
$$ 2733 -630 -1697 2619 204 -1724 2557 1036 -1843 1921 1197 -2007 1386 1551 -2127 601 1974
871A974m329J404K803l928L22L672l208r63L992k235k089M257r92l142L686L18
$$ 1974 -2355 -951 1852 -2076 -1754 1918 -1290 -2253 1739 -496 -2585 1672 680 -2462 1224 1542
887A542l303K339J572l423J295K278k889K96K426k112j022K600j650j580K536
$$ 1542 -1761 578 2150 -1273 22 2300 -589 -293 2133 21 -1001 1599 -51 -1631 905
902I05m69k224K218j67j962J214P00j699J026Q35j531O57J406j455J91J084p31
$$ 905 436 -1788 430 263 -1699 -485 215 -1484 -458 377 -1154 -497 909 -546 -355 729 -2
919bl20J282n22q63J539k08j146R25m7r27N13L29j005K93K44n72l03Q81o37j27
$$ -2 -322 960 438 -425 1114 906 -240 685 638 -289 224 553 -452 -159 85 -487 -790 91 -546 -673
939f73M99J82j093N36O17l09m17J414m58r07J075L70j317R24J035j509J15J395
$$ -673 -174 8 -1085 -549 68 -241 -658 756 298 -609 466 836 -481 443 1478 -31 84 1479
957A479j453m81J903r67j508J669k08k098J729J130k859J010J647k665L74K539
$$ 1479 26 -455 1448 481 -1027 642 434 -1664 65 1195 -1664 -654 993 -1672 -1298 1241
973A241j993n78K868j596j659K738m60k191K956m3k562K232M15k471J458J497
$$ 1241 -752 -1330 1538 -58 -1717 1021 561 -1630 1326 1283 -1279 953 1368 -1103 355 1852
989A852k990J182K278l694K65L207k980p69M017k770k169L998j571k838M316k89
$$ 1852 -1138 44 2322 -1372 -1107 2100 -880 -1649 2368 -402 -2571 1427 -144 -2982 1334 1045
1005A045m067L600J265m839K911L055m757J130M410m908o04N430l691k404N787
$$ 1045 -3022 578 1843 -2996 -85 2970 -1787 -657 3753 -1155 -1759 3671 -20 -2424 3363
1020C363k406l836N098o22m962M747J058n463K667L024n660J466M251n085K86
$$ 3363 957 -2879 2219 1597 -3365 1382 2440 -3023 -356 2668 -2992 -1526 2725 -2360 -2074
1035b074N248m880j211N649l221k537O376k104m782N980j91n579N327J099o209
$$ -2074 3174 -1706 -2917 2732 -489 -3026 3350 1246 -3536 2444 2253 -3326 2001 3100 -3109
1050c109L727L103o804K209N155o393J29N979n506j950O863l792l517O817j846
$$ -3109 618 3721 -3083 -874 4281 -2112 -1983 3996 -1510 -3460 3403 -389 -3906 2911 1065
1065A065o054O745O74o945N085L392p587K942M620p037J258O445n583j531O575
$$ 1065 -4989 1756 2430 -4515 570 3962 -3625 -683 3937 -3100 -1842 4603 -980 -2511 4064
1080D064m182l113O624k143m441O060j127n527N363N56o123M295L031p209L012
$$ 4064 -118 -3231 3393 1250 -3191 2869 1742 -3785 1578 2134 -3989 306 3337 -3872 -860
1095h60M325o790J347N732n572j349O978m530k870O999k569m374O452q48n925
$$ -860 3465 -3325 -1978 3754 -1818 -3167 3811 -719 -3589 3410 841 -3533 2919 2071 -3854
1110c854N694J122o551M458L266p139K079N101o494m6O604n357k584P134l251
$$ -3854 1840 2962 -3589 869 4135 -3004 -925 4176 -2318 -2364 4240 -1117 -3701 3433 182
1125A82m391O233r16m842N011R21n926L822K522n468K732L368n378J499L797m681
$$ 182 -4209 2024 1108 -3734 1277 2198 -3728 94 2616 -2852 -120 3248 -2130 -631 3166 -1515
1141a515k32N368l842j878N283k865l495N686j146m473M697l1m936L647J736n095
$$ -1515 -1747 3621 -221 -2099 3184 319 -3176 2510 1364 -3109 1588 1557 -3379 268 2004 -3091
1157c091K457L064m818R05L741m332J15M859l633j742N296k484l307N143k50m495
$$ -3091 -634 2430 -2388 -1483 2258 -2074 -1959 2900 -733 -2475 2821 337 -2970 2173 1923 -2572
1173b572L893J229m662K125K381l758Q20K949l361M2K643k236r39K928k180q77
$$ -2572 1321 2550 -2112 13 2394 -1364 -544 2405 -956 -914 1729 -507 -1446 1482 -698 -1575
1189a575K871j527j689K867l18k432K342N67k640J517J548k690J026J716k037
$$ -1575 1296 -231 -1920 947 629 -1803 539 1106 -1534 -17 1531 -1159 -133 1583 -454
1204d54K72J647j964P3K232k050n69K153j230j244K118m45k053J771M61k328J267
$$ -454 -182 1465 -499 -426 1806 -244 -813 1340 110 -1134 984 539 -1514 257 718 -1610 -343
1221c43J002j715M16J150j229J88Q95m91l06J011n15P9N36m34J58K19k93j70L26
$$ -343 659 -1056 -640 510 -719 -531 364 -127 -433 578 63 142 678 244 402 621 328 158 484
1240D84m93o2M03j49l26K73l47j60O70n33k32O58o29n99R35k65l73Q73J17j003
$$ 484 -9 -71 332 183 -143 130 -217 -377 293 -240 -472 186 -443 -1042 -107 -372 -745 128 245 -758
1260g58J109oj088J258M09j486Q92Q35j482M70R19j371Q0J540j671q8J252j049
$$ -758 351 345 -743 515 924 -562 330 1165 -317 153 1072 -299 -219 1321 -350 -438 814 -235
1278b35n96J592p42j459K012n13j656J974j87j600J801M72k325J459J322k428
$$ -235 -831 761 19 -1440 572 59 -1597 377 190 -1410 391 863 -1462 -3 1319 -1109
1294a109N72K420k365l7K622k053q68K588j439j648K873q93k499K320P34l106
$$ -1109 -537 1883 -482 -519 2103 50 -818 1770 331 -1317 1556 663 -1836 484 1218 -1888
1310a888J915J520l238J228J922k882M07K410k557l86K981j877j128L245j424
$$ -1888 27 1547 -1691 -463 1459 -1423 -1016 1394 -1163 -1549 1432 -445 -1573 1672 248
1325B48k071L073k35k955L112L59k933K117J300l343J100K294l345L15K921k813
$$ 248 -1823 1250 1015 -1940 1172 1531 -1402 715 2015 -1328 -228 2066 -1279 -964 1957 -856
1341h56m82L265k491j584L554j322k295L125j22l222L020Q77l466K029J591l291
$$ -856 -1338 1927 -564 -2148 1406 84 -2211 914 792 -2430 590 1467 -1999 30 1621 -1670
1357a670J451K605l510M60K859k738n96L314j919j889L382j352k497L413j30l401
$$ -1670 -219 2386 -1124 -664 2195 -543 -1139 2175 256 -1633 1749 397 -2100 1313 1183 -2218
1373b218K567R13l293J847J900l476R15K622k976k15L150k514p91L304j869j323
$$ -2218 349 1262 -2031 -184 1716 -1760 -845 1777 -1199 -1414 1736 -778 -1569 1735 -134 -1457
1389a457L167j014k302K754K77k674J914Q70l069J445K208l414R23K259k871m4
$$ -1457 1710 696 -1606 1148 1425 -1249 665 1535 -1534 -89 2119 -1295 -372 1887 -984 -1028
1405a028K550k049j126K883j457j713K866l73k558K505N66k532J620J147k689
$$ -1028 1522 -527 -1653 1230 -227 -1940 926 553 -2005 500 1066 -1466 154 1301 -1388
1420a388J257J946k506M27K055j985n13K459j619j212K284r40j453K010k33j840
$$ -1388 -131 1815 -691 -264 1791 -194 -707 1752 133 -1079 1205 265 -1188 822 589 -1251
1436a251J460M03j896J270O34j689N82J489j875J84J617j339n94K257j264o68
$$ -1251 209 612 -1284 -14 620 -1069 -487 1002 -873 -689 928 -411 -1005 1252 -12 -680
1452f80J652l64j315J447J69j638J120O61j659O21Q20j313J54J136j068l98J151
$$ -680 972 608 -707 740 909 -729 391 1052 -607 14 834 -479 -325 811 -257 -655 496
1469D96o56o82J369q03n54Q30L80j197J125J58r14N64L15o69M73L02m34l8M28
$$ 496 -160 -842 527 -276 -830 0 380 -817 308 466 -448 116 431 -238 235 537 103 65 493
1488D93o03n3N40J4j82R3j97l37K38J3l39L03J4n84L98j32k12L90L12n54j46O02
$$ 493 -110 -163 377 391 209 302 105 -232 6 19 -320 -17 -3 -587 -189 -321 -533 -143 169 -385 -531 71
1510G1k25j80M47Lj3l25Q52m30N9J62K70n18l2J19m86K80L66o35j89P68o73l48
$$ 71 -154 -334 113 116 103 -222 630 200 259 421 691 173 141 260 -226 54 420 -215 -404 364 -309 -657
1532f57Q31Rp96M30M23r58K46O06o41J15Q34m56n08J178m53m82P71L1m87L31m7
$$ -657 174 183 -613 -183 240 -718 -472 134 -507 -392 442 -14 -522 656 203 -279 492 523 36 367 320
1553C20n18M92N1l38q5P19j026K05L92p00L12M21n43l84P28m92k62J205n28p91
$$ 320 -198 294 345 7 -78 641 -385 -180 212 -488 -176 245 -298 -682 46 -446 -708 497 -31 -822
1573h22J245j76j166J347M08j400Q15Q49j411L88Q98q82k83J195j138q08J484
$$ -822 423 247 -919 428 836 -564 251 1100 -311 77 975 93 -190 1005 -133 -941 543
1590E43o13q23J175J31j315R16L66j478R30P58j194J63Q54r98K8J216n71l66J204
$$ 543 -70 -893 282 413 -902 14 380 -1098 -168 590 -604 -441 413 -585 -557 659 88 -278 926
1609I26l41r90R83k38o84J030j39o80O34L2j328P33M98q46M61M49r21p2Q69r79
$$ 926 585 -405 578 340 -344 686 547 -133 501 533 -795 -62 436 -410 51 500 -421 -493 376 -603
1629f03l0J146p86o01J170k72r79J551L13j590J042K56j307O93J337j983M62J316
$$ -603 -633 513 -273 -874 296 24 -955 596 909 -681 361 617 -690 3 1340 -643 -181 1135
1647A135j157m91J018l71n87R57k30p98N49J96j029M98K61m19L04K29q06M25P28
$$ 1135 -22 -513 505 134 -453 504 274 -524 25 221 -808 -310 -49 -468 -164 65 -741 -316 412
1666D12r61M98L58m16Q9O19o34l29R25k60k28N59m79n50R88r6o20K24J62p86L22
$$ 412 -549 -51 307 -109 -20 599 -35 -364 561 301 73 632 153 -397 591 495 -125 99 261 -525 -203
1687b03L56p31J95N14o07%O58n23r7N85l6m73N96k24J29J42pj50K61r7m37J37
$$ -203 153 -578 -383 131 -476 -476 182 -341 -438 147 111 -362 234 10 139 281 274 124 385 288 -149 -12
1709a2J15j85K69Jn2r2k49k4J33j12j76M87m30k6M12p0l49P1M27m89J46N04m11
$$ -12 103 -82 187 188 136 44 -205 -229 -96 -208 -384 103 -327 -353 59 -11 -360 -289 138 -351 -205 299 -112
1732a12q9P49o23r1P77p89j9P34n21j47L74J84r05N62Km67N13J74p29K91J69p24
$$ -112 -201 548 -75 -166 611 -178 -197 537 16 -131 243 427 -478 84 86 -381 132 306 -423 -132 37 -687
1754f87M47L22p00L98L53m36j98J068n65m11J053n56n14J120j98q86J010nj356
$$ -687 -240 82 -618 -220 133 -303 -501 567 2 -409 644 88 -426 694 496 -390 620 615 -741
1773g41Q37M55j074M78Q73j309L66Q34j276j66J285q25o86J566n86r29J695q03
$$ -741 96 551 -523 -45 828 -481 -115 719 -557 -723 562 -263 -949 617 31 -898 797 -6
1791fq81J290O8j204R28P14j615Q01Q38j519M62J103j178j70J533j260l75J489
$$ -6 -887 403 471 -733 195 909 -706 95 933 -586 -124 979 -199 -369 1164 -96 -471 1018
1809A018j159r64J931n01j785J732J89j759J063J081j963P38J058j726L14J625
$$ 1018 -141 -1105 826 325 -1460 272 461 -1298 -235 846 -1117 -379 679 -1047 -733 892
1825H92j277k04J773j064p20J750n28j458J801j67j962J724L83j912J101J036
$$ 892 -385 -589 1184 120 -600 1150 622 -836 965 798 -1164 560 943 -969 132 1168
1841A168k333Q97J134j741J95J730j704l73J882j425m63J575l02j487J782M6j551
$$ 1168 -1165 -268 866 -875 -680 1050 -654 -1027 855 -570 -1033 542 240 -1247 535 581 -970
1858i70J576M1j554J254J093k513R80J464j947OK132j579o59J788j358q28J990
$$ -970 606 647 -907 347 1440 -1073 -93 1371 -576 -570 1562 -17 -676 1112 -246 -1074 916
1875I16q04j476J627R4j634J570M73j708O90J117j637L89J746j885j79J933j266
$$ 916 112 -1364 263 357 -1277 293 766 -942 -252 865 -772 -383 1363 -522 -701 1232 -34
1892c4r88K241o91j478J973k04j644J554l7j685J288N06j663Q15Q07j649K54J535
$$ -34 -1022 1219 528 -950 1023 819 -825 729 692 -993 295 801 -862 -47 760 -889 -635 900
1910I00j608k94J855j107p14J676p25j123J786L2j766J372L66j623J075J003j735
$$ 900 -708 -1002 853 -254 -968 708 -17 -1140 646 678 -1088 284 650 -973 102 1105 -630
1927f30O24J175j654L67J146j291j28J209q23r67J563k50j397J536k53j081P87
$$ -630 -6 1169 -485 -118 1028 -263 -391 818 -5 -972 591 341 -1056 480 227 -854 -67
1944f7N55j463P51P94j432P33R15j054pJ254j042k26J403r38o90J332m39j229
$$ -67 488 -975 -224 570 -862 -129 786 -268 -275 979 -63 -289 1114 176 -514 818 379 -850
1962h50J534k60j137P25M27j032P17N23j265L08Q81j060K45O67p48l42J186n60
$$ -850 684 424 -713 12 439 -593 124 647 -618 -310 571 -489 -244 423 -325 -667 519 -41
1980d1p21R58J30j037P96N00r21N55N39p57N1P68q72%O84q85MN86n60l10Q82m25
$$ -41 -762 196 326 -711 85 585 -336 219 758 1 52 820 -52 -52 632 -253 -249 337 -223 -533 349 -76
2002g6l78N67j32n54L22M03n93K06M14o52L19N58m74j55P66n74j71Q01m56n7M17
$$ -76 -454 113 -19 -573 -251 152 -441 -235 179 -473 -154 404 -70 -225 541 -33 -204 597 141 84 501
2023E01n94O9M80j52q70P32R3o98N55q0l38q6L63m03K19M92k50m39L84J26m16
$$ 501 -93 -24 456 304 -566 166 259 -439 116 36 -302 -388 -25 -428 -209 283 33 -406 -22 104 -312
2044c12L63q9r8K19K32k18j13K07R2k21K87k29l5Q5R8o7j55m53L83j78j31R6M19
$$ -312 51 -38 -136 83 315 97 -16 191 283 62 349 120 85 170 268 201 46 -407 -24 -202 -333 -237 182
2067A82k38k42J51p6p8M13j69j41K46J61k51J69L81l62rM7j80J72Q3k19j24K86
$$ 182 -56 -298 -147 -223 -301 112 -57 -198 48 209 -42 127 508 146 137 184 4 176 259 40 -84 202
2089B02k51K98O2k15j89JM31l23n84N87k24o0l6L34j49L4J64j90N2Q2K03j16l8
$$ 202 -49 249 311 96 -93 -92 339 16 -568 19 -205 -265 -301 33 -116 -82 82 -108 -56 26 229 113 75
2112G5J91k83N4m5K98k25k5l5j5L3K52j26l30L73m74N9k16L66oJ00k91J04P8L04
$$ 75 266 -17 37 -8 290 65 40 5 -10 23 275 149 -181 192 -282 -223 -439 -73 -79 21 -270 -166 -88 216
2136B16j51n6K67j86P1j57N9P1J48j08J68k95q2L42j16m94L92K76m68j00J03J1
$$ 216 65 9 276 90 161 4 63 134 282 174 342 47 -35 307 191 -303 89 365 -103 -203 -100 -89
2158h9j47J38q6J7k59N30j02k34L15p6M0J70k79J5P2P3J85NJ47m65K26j19K51
$$ -89 -236 -98 -184 -167 -426 104 2 -232 83 7 47 217 -62 -47 25 98 283 288 435 -30 196 77 328
2181C28j92j72M1J19nk3j35o5K29j21n60N38r5k05J00j24L61k04K43m78L68L45
$$ 328 136 -36 5 124 119 96 -39 -104 125 4 -556 -18 -113 -318 -218 -342 19 -185 58 -420 -52 293
2203B93j58k94N28k83k7R5m7oJ58k74L0j18q9J01J39l7k05Q3K64j88j02J69j80
$$ 293 135 -159 369 86 59 154 107 101 259 -15 15 -103 -192 -91 48 11 -194 -111 153 -35 -137 32 -148
2226a48j27K19j13k84O42j01k92K62J58k92J85K30m23N20Ln21j2M47l87j35N94
$$ -148 -275 -56 -169 -453 189 88 -204 58 216 -76 109 339 -84 436 439 -82 -94 353 -34 -169 425
2247D25k98j9K23m51j76M73l93J26J9J72m73L48J85k64P8J40j53O5K84n90K92
$$ 425 127 108 331 -120 -296 177 -216 -90 -71 101 -372 -24 161 -103 -25 115 -38 27 311 -279 13
2268A3L51m09q1Q00n96r1M04l87k49L85K68q04M85On92M03P9n35M03M49n35j82
$$ 13 364 -45 -126 674 78 -13 391 4 -245 140 408 -396 89 95 -497 -94 -15 -550 -147 302 -233 -415
2290d15O84m81k54Q21m64m95Q49nn94P20k5p12M04P55j099L45P31j094J35O98
$$ -415 269 -212 -466 355 -109 -604 245 240 -354 366 341 -371 33 788 -311 34 765 -329 -194 504
2310E04q66pM88k58l39N44o9m94Q43l37p20O56L50p52M32L53o34J39O07p53J09
$$ 504 -362 -369 119 -139 -478 66 -3 -497 346 9 -711 -55 295 -457 -25 328 -306 -167 440 -313 -204
2331b04P65o33n8O82m32m67Q28m78l53J010j95j087P70O9o37K71L80p89N81M66
$$ -204 561 -72 -130 552 120 -347 481 3 -350 660 465 -622 148 217 -420 -149 231 -558 23 489
2351D89j106M45N33n38m23J155n65m98P51j10o34J040mj013Q24p8o69M85J92o93
$$ 489 -617 -172 361 -177 -600 555 -10 -508 243 133 -501 539 535 -478 346 268 -401 84 276 -417
2371d17P2J041j041L3Q51n60l42O91j89o15O80j81o14Q50l03m67M84Q9m75K62
$$ -417 -345 696 -345 -312 539 -21 -363 328 139 -476 204 23 -591 259 -44 -511 -27 62 -413 -151
2391a51P59r90J14R56p67k77J044o59m58R34n25m58P29k35n86O23L87p91M34L54
$$ -151 608 -382 -268 688 -79 -356 688 29 -429 505 -20 -478 251 16 -570 53 440 -351 83 437
2411D37q63M91M88j045J93O73m73R1L41n65j95O98k30n44J013l30o24O90P4n21
$$ 437 -426 65 553 -492 -299 374 -99 -8 333 -232 -427 271 41 -503 510 180 -444 246 320 -201
2431b01N67K69j022K91L86m28P0L44o31l2N37k61k09M68k36n20P89k2o20O55M9
$$ -201 366 635 -387 -96 290 -138 -68 276 -355 -387 150 -111 -320 148 -88 -608 181 159 -461 194 243
2452B43n58L89o0k54K40O13o46j03O97o25j85P63n04k56P82o10k97N03n9m38K85
$$ 243 -315 74 14 -240 0 613 -33 -136 561 -64 -249 514 10 -246 536 -74 -371 132 73 -365 -80
2473h0J73o10M33J51l44K41N5j68j31M6J29Q4J80j1K0J22j76l07M28Q4l11L21
$$ -80 93 -517 -84 67 -277 -36 19 -149 -280 -234 -105 -21 159 148 168 290 114 -193 235 319 8 329
2495C29j5o69L47K78k66l39O49n19q0L75l80K32J96k16rP8J8m32M52R3n08M21
$$ 329 314 -355 -8 270 4 -335 314 -205 -285 90 -290 -58 138 -78 -87 -9 9 -423 29 122 -386 35
2517C5K77m78k9L04K4j53j49q4K21J09ln5K35j13k81K76j76j07K16m3m43K59K21
$$ 35 312 -166 -195 109 133 -20 -169 -253 -32 77 74 19 254 141 -140 136 -40 -147 69 26 -417 -158 63
2540F3l68L42o3j84N1K50j02l7L31j66j80K44r9k07M60k09j04M0L5p9J27J4k66
$$ 63 -305 37 -26 -210 -159 91 -11 -48 283 117 -63 181 82 -125 335 126 22 62 97 18 145 159 -107
2563a07L2K82l88M4M58k12j79o0k3J69p5J72k93J62J86M8j58m1l4o5J67l1o4J89
$$ -107 -75 207 -181 -137 321 109 -70 -130 -153 16 -59 113 -180 -18 168 216 58 17 -17 -82 85 54 -10 179
2587A79m9o4J21j78q7J80q1P7O2j36k47L03Ok62N2K62m36J06J83n2k6K47m16K69
$$ 179 130 66 187 9 -78 102 21 98 160 24 -223 80 86 -176 -124 138 -298 -192 -9 -61 -87 160 -256 13
2611A3pJ18j21P1%j50K72p0m8j76J10J48k25N7j66K28j26l4J68l43J32j55l8L08
$$ 13 6 124 3 74 74 -76 196 126 78 -98 12 160 -65 -8 -174 54 -72 -106 62 -281 -149 -304 -342 -34
2635c4P0k72P3M8K31R0K6m53K97j02R5n0r2J97o8j59K42P9j83j30L41j78j72k3
$$ -34 36 -236 -163 -115 116 206 232 -221 76 -26 69 19 -73 124 56 -103 139 218 35 -95 246 68 -104 -127
2659a27j22R6J41l5k8Q3j14j13J27K63k09J9J13j27j5j05L73nj4k35R1J89l86
$$ -127 -249 -153 -12 -47 -75 8 -106 -219 -92 171 -38 -19 94 -33 -48 -153 220 215 201 -34 57 246 -140
2682a40J42jn6J17j02l73N50j82k10J28j20J90%LJ61l17oJ28P9R6j16L8j83K90
$$ -140 2 1 -55 62 -40 -413 137 -45 -255 -127 -247 -57 -57 -54 107 -210 -216 -88 -9 87 -29 9 -174 116
2706A16J92l30J09J38l42Q1K88l70L02j21n7l54M20p3q2K25k32j88J32q9J6K36
$$ 116 308 -22 87 225 -117 -36 252 -118 184 63 6 -348 72 -1 -83 142 -90 -278 -146 -235 -219 17
2728A7m7j01j54J83J00M9K05J23m81m2Q7K26j54j29R9K33k87J56J2J4j19j19M39
$$ 17 -30 -131 -285 -102 -2 47 252 375 -106 -148 -61 165 11 -118 -19 214 -73 83 95 109 -10 -129 310
2751C10l57N6K44l89oL01r9j68J60k89J65J36K70m13J05K02n54K35L54m33K32
$$ 310 -47 9 253 -136 -142 159 60 -108 52 -237 -72 64 334 -79 26 228 -326 -91 263 -170 62
2772F2K76o82J86M53j85j25M54j51j36J5m1l69L86N5k81K12l52j15L54Q6j54k59
$$ 62 338 -344 -158 295 110 -15 439 288 152 167 126 -243 143 198 -83 129 -223 -338 16 102 -52 -311
2794c11O62o81L85p3r5O8J12Km07O30l10k11M72K0l88J56o3j42L85n7m12K02K36
$$ -311 351 -330 55 -18 -113 -45 67 69 -338 292 -18 -229 243 263 -125 31 -32 -174 211 154 -258 -56 180
2817A80k31q6N86n48k53L46k54J06J57J70m41L24Mj97J64j17J40J85q5n19M18
$$ 180 -51 -137 449 -99 -352 -6 -260 -154 3 173 -268 56 60 -137 27 -90 50 235 150 -369 49
2838D9L21o33L13L63l09m37K89k25l2N48l40l2Q0K34m22K38K82o46J65M82n54
$$ 49 370 -263 50 413 104 -333 -44 -269 -301 247 -93 -125 -45 189 -233 5 287 -359 -194 288 -266
2859b66J26M21k67o8L83k73j06J96J21l05KK5k03L91j85j74O1M5j67J82M5q9j17
$$ -266 -140 281 14 -54 329 56 -50 146 267 -38 -36 -11 -214 177 -8 -182 -121 -76 -243 -61 -16 -105 -222
2882b22M17m88M52m8j77j10J75j4n0K20j79j99J78J78j65J92Q4m60M59K0l12L
$$ -222 195 -293 159 111 -66 -176 -1 -15 -65 155 -24 -223 -45 133 -32 160 244 -216 243 263 -49 -46
2904d6N70p20N1J73J7l83M74k70j78K38K84m97J38M33m00J9J2O5JM39l45j69L11
$$ -46 524 -196 -145 28 45 -338 136 -134 -312 -74 210 -287 -149 284 -116 -97 -85 -20 -19 420 75 -94 217
2927B17l95j23O67m25m5L97q0n35M17J44m97K70J59j72J22J34k81j69L94j61k66
$$ 217 -178 -301 366 -59 -104 293 213 -322 95 239 -258 12 171 -1 121 255 -26 -195 199 38 -228
2948b28N10m28r2M31J75p04M14n7j71L19j71j80M97l41P8Q3J25l02j54L75j49
$$ -228 282 -146 -238 193 368 -336 78 21 -150 169 -2 -182 315 -26 52 135 260 -42 -196 179 30
2969C0j98N01l04j55J34k80K32O6J57l85J65O9m57M28r8N4J88K06n83J95K78l28
$$ 30 -168 333 29 -126 8 -272 -40 26 183 -202 -37 32 -425 3 -95 -41 147 353 -230 -35 243 -85
2991h5L21ok86k51M61Pj52J52j26M0J40k20j06j42J55j86L24J18l04Q4J96j51
$$ -85 236 230 -56 -307 154 161 9 161 35 75 215 -5 -111 -253 -98 -284 40 158 -146 -62 134 -17
3013a7L8J80j79k7l1p5j13O5L18m05K60L20l17k43L70j84Q4J71j80j22Q6p2j60
$$ -17 21 201 22 -5 -36 -111 -224 -159 159 -246 14 334 17 -226 144 -40 44 215 35 -87 -1 -73 -233
3036b33J74L2q6J08K6o3J62j03l05PO04l41PmJ15o7K04kl2k26J28L4k8k93K07
$$ -233 -59 -27 -113 -5 21 -42 120 17 -288 -281 323 -18 -11 -15 100 33 237 235 203 -23 105 139 111 -182 25
3061B5L27n93K28m5P5J04k42J60j34l5l7JP7J16J41r7K46l31K2N1%k46P8J90J74
$$ 25 352 -241 -13 -58 17 121 -121 39 -95 -130 -167 -166 -89 27 168 71 317 -14 8 59 59 -187 -109 81 255
3086B55k93K23k68K80j32jp1n0p9N2jJ13l7J76k13l01L30J90j33j06P3%K6k28
$$ 255 -38 185 -83 197 65 64 -7 -57 -136 -84 -85 28 -9 167 -46 -347 -17 173 40 -66 7 7 33 -195
3110a95J54J67l19K74oO7j39j05J21N0L36l72R6k6l45L09p6n8J96k34m1M4K02
$$ -195 -41 126 -193 81 75 142 3 -102 19 69 405 33 129 103 -242 67 -9 -67 129 -105 -146 -102 100
3133A00j58NL0l1j05J17M1j7oMM19k78j55J42P5k08J61p9O6j02qM1P6M5l4k79
$$ 100 -58 -53 -23 -54 -159 -42 -1 -18 -24 -20 399 121 -34 108 183 -25 136 57 123 21 13 54 130 175 141 -138
3159a38j10J46J58nK2K2j52J2J41J5k06J19J92l19R5J31l55K47K86k10K1k20P7
$$ -138 -248 -102 56 51 73 95 -57 -45 96 111 -95 24 216 -103 -8 123 -232 15 301 91 112 -108 -31
3182c1p6K52M8l78O7J7K53m4k48R4k7m6J58j82K47k31o7k6M57q4m08K16j16R6
$$ -31 -107 145 193 -185 -118 -101 152 108 -140 -46 -73 -119 39 -143 104 -127 -194 -220 237 153 -255 -39 -155 -59
3206e9Q2k25qM05m1m79K86K60o5l00O7J98j40P5P7l13n4L53j30k54K05MK17m20
$$ -59 23 -202 -210 195 154 -325 -39 221 156 -144 -77 121 -19 56 133 -180 -234 119 -11 -265 -60 -56 161 -259
3230b59L09m4L76n75M48k71N1l49K43J0L3L22m31J14J37j02J98j03p5j1K89j67
$$ -259 50 6 382 -193 255 -16 35 -314 -71 -61 -28 294 -137 -23 114 12 210 107 32 21 310 143
3252A43J9n04J28J64J40Pk50K2L32l82N9J38j15J33q5l9J53r3k39N02J32n8k02
$$ 143 162 -342 -214 -50 90 97 -153 -131 201 -181 -122 16 -99 34 -51 -90 63 -30 -269 233 365 307 105
$$ [...]
8191c12
##END NTUPLES=NMR FID
##END=
