##TITLE=1H_SR109_k
 D2O
 8 sc, 
 13.04.2022
##JCAMPDX= 6.0         $$ Bruker NMR JCAMP-DX V2.0
##DATA TYPE= NMR FID
##DATA CLASS= NTUPLES
##ORIGIN= UXNMR, Bruker Analytische Messtechnik GmbH
##OWNER= root
$$ XWIN-NMR		Version 3.5
$$ Wed Apr 13 13:57:52 2022 Russian Standard Time (UT+4h)  she@DPX200
##.OBSERVE FREQUENCY= 200.13135
##.OBSERVE NUCLEUS= ^1H
##.DELAY= (6, 6)
##.ACQUISITION MODE= SIMULTANEOUS
##.ACQUISITION SCHEME= undefined
##.AVERAGES= 8
##.DIGITISER RES= 18
##SPECTROMETER/DATA SYSTEM= spect
##.PULSE SEQUENCE= zg30
##.SOLVENT NAME= D2O
##.SHIFT REFERENCE= (INTERNAL, D2O, 0, 15.7039)
##AUDIT TRAIL= $$ (NUMBER, WHEN, WHO, WHERE, WHAT)
$$ ##TITLE= Audit trail, XWIN-NMR		Version 3.5
$$ ##JCAMPDX= 5.01
$$ ##ORIGIN= Bruker BioSpin GmbH
$$ ##OWNER= she
$$ F:/spectra/data/she/nmr/H-F/1/audita.txt
$$ ##AUDIT TRAIL=  $$ (NUMBER, WHEN, WHO, WHERE, WHAT)
(   1,<2022-04-13 13:56:55.12 +0400>,<she>,<DPX200>,
      <created by zg, POWCHK disabled, PULCHK disabled
       configuration hash MD5:
       00 E9 B6 7A A2 85 ED C7 34 08 36 98 17 FE 4E 26
       data hash MD5: 16K
       8A 07 1D 0C 1F 4F 15 76 1B CB 4C 05 68 99 9B BD>)
$$ ##END=
$$ 
$$ hash MD5
$$ 10 AB E9 A3 E0 11 98 EF 42 65 C3 D8 06 DD C7 92
##$RELAX= 
##$RELAX= 
##$RELAX= 
##$RELAX= 
##$RELAX= 
##$RELAX= 
$$ Bruker specific parameters
$$ --------------------------
##$DU= <F:/spectra>
##$EXPNO= 1
##$NAME= <H-F>
##$PROCNO= 1
##$TYPE= <nmr>
##$USER= <she>
##$AMP= (0..31)
100 100 100 100 100 100 100 100 100 100 100 100 100 100 100 100 100 100 
100 100 100 100 100 100 100 100 100 100 100 100 100 100 
##$AQSEQ= 0
##$AQ_mod= 1
##$AUNM= <au_zg>
##$AUTOPOS= <>
##$BF1= 200.13
##$BF2= 200.13
##$BF3= 200.13
##$BF4= 200.13
##$BF5= 200.13
##$BF6= 200.13
##$BF7= 200.13
##$BF8= 200.13
##$BYTORDA= 1
##$CFDGTYP= 0
##$CFRGTYP= 5
##$CHEMSTR= <none>
##$CNST= (0..31)
1 1 145 1 1 1 1 1 1 1 1 1 1 1 1 1 1 1 1 1 1 1 1 1 1 1 1 1 1 1 1 1 
##$CPDPRG= <>
##$CPDPRG1= <>
##$CPDPRG2= <>
##$CPDPRG3= <>
##$CPDPRG4= <mlev>
##$CPDPRG5= <mlev>
##$CPDPRG6= <mlev>
##$CPDPRG7= <mlev>
##$CPDPRG8= <mlev>
##$CPDPRGB= <>
##$CPDPRGT= <>
##$D= (0..31)
0 1.2 0 0 0 0 0 0 0 0.06 0 0.03 0 0 0 0 0.0002 0 0 0 0 0 0 0 0 0 0 0 0 
0 0 0 
##$DATE= 1649843814
##$DBL= (0..7)
120 120 120 120 120 120 120 120 
##$DBP= (0..7)
150 150 150 150 150 150 150 150 
##$DBP07= 0
##$DBPNAM0= <>
##$DBPNAM1= <>
##$DBPNAM2= <>
##$DBPNAM3= <>
##$DBPNAM4= <>
##$DBPNAM5= <>
##$DBPNAM6= <>
##$DBPNAM7= <>
##$DBPOAL= (0..7)
0.5 0.5 0.5 0.5 0.5 0.5 0.5 0.5 
##$DBPOFFS= (0..7)
0 0 0 0 0 0 0 0 
##$DE= 6
##$DECBNUC= <off>
##$DECIM= 32
##$DECNUC= <off>
##$DECSTAT= 4
##$DIGMOD= 1
##$DIGTYP= 9
##$DL= (0..7)
0 120 120 120 120 120 120 120 
##$DP= (0..7)
150 150 150 150 150 150 150 150 
##$DP07= 0
##$DPNAME0= <>
##$DPNAME1= <>
##$DPNAME2= <>
##$DPNAME3= <>
##$DPNAME4= <>
##$DPNAME5= <>
##$DPNAME6= <>
##$DPNAME7= <>
##$DPOAL= (0..7)
0.5 0.5 0.5 0.5 0.5 0.5 0.5 0.5 
##$DPOFFS= (0..7)
0 0 0 0 0 0 0 0 
##$DQDMODE= 0
##$DR= 18
##$DS= 0
##$DSLIST= <SSSSSSSSSSSSSSS>
##$DSPFIRM= 0
$$ [...]
##$SUBNAM2= <"">
##$SUBNAM3= <"">
##$SUBNAM4= <"">
##$SUBNAM5= <"">
##$SUBNAM6= <"">
##$SUBNAM7= <"">
##$SUBNAM8= <"">
##$SUBNAM9= <"">
##$SW= 18.05172834244
##$SWIBOX= (0..15)
0 0 2 0 0 0 0 0 0 0 0 0 0 0 0 0 
##$SW_h= 3612.71676300578
##$TD= 16384
##$TD0= 1
##$TE= 0
##$TE2= 300
##$TE3= 300
##$TEG= 300
##$TL= (0..7)
0 120 120 120 120 120 120 120 
##$TP= (0..7)
150 150 150 150 150 150 150 150 
##$TP07= 0
##$TPNAME0= <>
##$TPNAME1= <>
##$TPNAME2= <>
##$TPNAME3= <>
##$TPNAME4= <>
##$TPNAME5= <>
##$TPNAME6= <>
##$TPNAME7= <>
##$TPOAL= (0..7)
0.5 0.5 0.5 0.5 0.5 0.5 0.5 0.5 
##$TPOFFS= (0..7)
0 0 0 0 0 0 0 0 
##$TUNHIN= 0
##$TUNHOUT= 0
##$TUNXOUT= 0
##$USERA1= <user>
##$USERA2= <user>
##$USERA3= <user>
##$USERA4= <user>
##$USERA5= <user>
##$V9= 5
##$VALIST= <valist>
##$VCLIST= <CCCCCCCCCCCCCCC>
##$VD= 0
##$VDLIST= <DDDDDDDDDDDDDDD>
##$VPLIST= <PPPPPPPPPPPPPPP>
##$VTLIST= <TTTTTTTTTTTTTTT>
##$WBST= 1024
##$WBSW= 4
##$XGAIN= (0..3)
0 0 0 0 
##$XL= 0
##$YL= 0
##$YMAX_a= 71156
##$YMIN_a= -107415
##$ZGOPTNS= <>
##$ZL1= 120
##$ZL2= 120
##$ZL3= 120
##$ZL4= 120
##$ABSF1= 10
##$ABSF2= 0
##$ABSG= 5
##$ABSL= 3
##$ALPHA= 0
##$AQORDER= 0
##$ASSFAC= 0
##$ASSFACI= 0
##$ASSFACX= 0
##$ASSWID= 0
##$AUNMP= <proc_1d>
##$AZFE= 0.1
##$AZFW= 0.1
##$BCFW= 1
##$BC_mod= 2
##$BYTORDP= 1
##$COROFFS= 0
##$CY= 11.3945322036743
##$DATMOD= 1
##$DC= 2
##$DFILT= <>
##$DTYPP= 0
##$F1P= 2.36226072786647
##$F2P= -0.459571619588291
##$FCOR= 0.5
##$FTSIZE= 0
##$FT_mod= 4
##$GAMMA= 1
##$GB= 0.15
##$INTBC= 1
##$INTSCL= 1
##$ISEN= 128
##$LB= 0.24
##$LEV0= 0
##$LPBIN= 0
##$MAXI= 10000
##$MC2= 0
##$MEAN= 0
##$ME_mod= 0
##$MI= 1.114404
##$NCOEF= 0
##$NC_proc= 0
##$NLEV= 6
##$NOISF1= 3.799351
##$NOISF2= 2.8
##$NSP= 1
##$NTH_PI= 0
##$NZP= 0
##$OFFSET= 15.70392
##$PC= 1
##$PHC0= -18391.62
##$PHC1= 9.00078
##$PH_mod= 1
##$PKNL= yes
##$PPARMOD= 0
##$PSCAL= 0
##$PSIGN= 0
##$REVERSE= no
##$SF= 200.130013532006
##$SI= 16384
##$SIGF1= 3
##$SIGF2= 2
##$SINO= 400
##$SIOLD= 16384
##$SREGLST= <1H.CDCl3>
##$SSB= 0
##$STSI= 0
##$STSR= 0
##$SW_p= 3612.71676300578
##$SYMM= 0
##$S_DEV= 0
##$TDeff= 0
##$TDoff= 0
##$TI= <>
##$TILT= no
##$TM1= 0
##$TM2= 0
##$TOPLEV= 0
##$USERP1= <user>
##$USERP2= <user>
##$USERP3= <user>
##$USERP4= <user>
##$USERP5= <user>
##$WDW= 1
##$XDIM= 8192
##$YMAX_p= 0
##$YMIN_p= 0
$$ End of Bruker specific parameters
$$ ---------------------------------
##NTUPLES= NMR FID
##VAR_NAME=  TIME,          FID/REAL,        FID/IMAG
##SYMBOL=    X,             R,               I
##VAR_TYPE=  INDEPENDENT,   DEPENDENT,       DEPENDENT
##VAR_FORM=  AFFN,          ASDF,            ASDF
##VAR_DIM=   8192,          8192,            8192
##UNITS=     SECONDS,       ARBITRARY UNITS, ARBITRARY UNITS
##FACTOR=    0.0002768,     1,               1
##FIRST=     0,             0,               0
##LAST=      2.2672688,     0,               0
##MIN=       0,             -107415,         0
##MAX=       2.2672688,     71156,           0
$$ Real data points
##PAGE= N=1
##DATA TABLE= (X++(R..R)), XYDATA
$$ [...]
2500g0K137O64m77r36k360j607L1P45J826J795J168m38j637k182j111n21J331
$$ -70 2067 2731 2254 1318 -1042 -2649 -2618 -1873 -47 1748 2916 2478 841 -1341 -2452 -2973 -1642
2517a642K111J403R46n55j498k494o55l00R07K470K064R5p66j568j999j379N39
$$ -1642 469 1872 2818 2263 765 -1729 -2384 -2684 -1777 693 2757 2852 2086 518 -1481 -2860 -2321
2534b321Q46K112J897L59r91j543j706j550N01J390J923J399O86j047j856j739
$$ -2321 -1475 637 2534 2893 1902 359 -1347 -2897 -2396 -1006 917 2316 3002 1955 99 -1640
2550a640p00n8J340K226J311J51p94j704k137p93N15J412K091J406J41j247j518
$$ -1640 -2340 -2398 -1058 1168 2479 2630 1836 132 -2005 -2798 -2283 -871 1220 2626 2767 1520 2
2567Bj877j000Q39J255J637J625L61j361j890j631m32N41J465J831J231j6j268
$$ 2 -1875 -2875 -2036 -781 856 2481 2842 1481 -409 -2040 -2472 -1931 -466 1365 2596 2580 1312
2584A312k036j471l52P87J217J829J332k92j058k101j421m18J034J877J161J165
$$ 1312 -724 -2195 -2547 -1760 -543 1286 2618 2326 1268 -833 -2254 -2672 -1638 239 1400 2565
2600B565j52j492j665j490m62R53J796J794J082o53j612j771j128m01J208J459
$$ 2565 2413 921 -744 -2234 -2696 -1743 53 1847 2929 2276 664 -1107 -2235 -2636 -1428 31
2616C1J769R19m60j884j459j235l71J120J992J601K82l9j983j688r44k19Q67K206
$$ 31 1800 2719 2259 375 -1084 -2319 -2690 -1570 422 2023 2305 2266 283 -1405 -2349 -2568 -1701 505
2634E05J778K06p24j481j580j463K82J109J873J557O28p47j935j508j121K19J339
$$ 505 2283 2489 1765 284 -1296 -2759 -2477 -1368 505 2062 2690 1943 8 -1500 -2621 -2402 -1063
2651a063J717J549L25p87j761j659q95L95J549J642J467l2p97j545j663j127M86
$$ -1063 654 2203 2528 1741 -20 -1679 -2574 -2179 -630 1012 2479 2447 1650 105 -1558 -2685 -2199
2668b199J599J620J470j17j145j666j501m99L99J473J823J015K97j089j885j561
$$ -2199 -600 1020 2490 2373 1228 -438 -1939 -2438 -2039 -566 1257 2272 2569 1480 -405 -1966
2684a966o32N94J475J802J216j64j303j417j888j61Q16J538J535Q91Lj288j754
$$ -1966 -2598 -2004 -529 1273 2489 2325 1022 -395 -2283 -2444 -1628 -90 1445 2336 2339 1051 -703
2701g03j298m94Q13J831J311R06k33j243j943r85n5L44J781J771P11m80j386j545
$$ -703 -2001 -2495 -1682 149 1460 2366 2133 890 -1053 -2038 -2093 -1749 32 1803 2514 2034 648 -897
2719h97j287j82J037J335J761P01q48q94j741j156j43J142J800J474N11r87j216
$$ -897 -2184 -2366 -1329 6 1767 2468 1620 726 -1015 -2171 -2314 -1172 628 2102 2613 1626 410
2736D10j709j111J15J125J940J395K01m35j498j808j011M26J017J445J750rn70
$$ 410 -1299 -2410 -2295 -1170 770 2165 2366 1931 433 -1375 -2386 -1960 -943 502 2252 2243 1673
2753A673j777j181j296L89J181J844J339K17r38j526j481r50N85J404J452J210
$$ 1673 -104 -1285 -2581 -2192 -1011 833 2172 2389 1451 -75 -1556 -2506 -1921 -517 935 2145
2769B145K79j126j262j849o21M91J391J628J265p2r76j717j220n49L09J513J637
$$ 2145 2424 1298 36 -1813 -2434 -1943 -552 1076 2341 2269 1293 -424 -1644 -2193 -1884 -371 1266
2786A266R03Or68j689j174p94O45J460J847P23m19q09j752j345j78O71J501J322
$$ 1266 2169 2175 1207 -482 -1656 -2450 -1805 -345 1502 2225 1806 997 -755 -2100 -2278 -1607 -106 1216
2804A216J143k00j026k112j148l4N97J692J470L60j59j002j743j395L82N24J927
$$ 1216 2359 2159 1133 -979 -2127 -2161 -1564 128 1598 1958 1799 797 -946 -2341 -1959 -1435 492
2821D92J130P45n67j171j671r76r5Q14J599J449O97p65j237j375j146k39J388
$$ 492 1622 2367 1800 629 -1042 -2018 -2113 -1299 300 1749 2446 1681 444 -931 -2077 -2316 -928
2838i28J353J585J96n67j272j388j215L7J198J560J302L94o68j322j394j272O01
$$ -928 425 2010 2206 1639 367 -1021 -2236 -2199 -1001 559 1861 2255 1587 265 -1129 -2401 -1800
2855a800Q17J562J325M40j136j327j310p01L28R64J704J008J53o80j652j246n94
$$ -1800 -983 579 1904 2344 1208 -119 -1429 -2130 -1802 -838 866 1874 2027 1347 -305 -1551 -2145
2872b145K45J428J354J261P3j059j483j241p53Q77J023J552R97k03r40j329j262
$$ -2145 -1900 -472 882 2143 2216 1157 -326 -1567 -2320 -1443 -420 1132 2129 1926 986 -343 -1605
2889a605n08L78J524J502N50J18j075j478j066p23Q16J480J148J030r3j316j394
$$ -1605 -2113 -1735 -211 1291 1841 1959 884 -594 -1660 -2383 -1567 -87 1061 2091 1998 682 -712
2906g12j021m41P58J496R80J004j07j085j642r50O1K88J423J420P41n86j124j409
$$ -712 -1733 -2174 -1416 80 1060 2064 1957 872 -770 -1720 -1659 -1371 52 1472 2213 1627 503 -906
2924i06j040m1Q32J397J087P59n84r74j512p78k34P25J525J336K64jj662j503
$$ -906 -1946 -1987 -1155 242 1329 2088 1504 530 -982 -1760 -1994 -1269 256 1592 1856 1855 193 -1310
2942a310m81p7O59J681J092M52m87j237j509r05O19O31J542J096K95o34j114j669
$$ -1310 -1791 -1868 -1209 472 1564 2016 1529 292 -1217 -2122 -1503 -872 670 1766 2061 1427 313 -1356
2960a356p58J84J106J384R24M02o61j540j202m13K10R36J476R88J90o51j097j599
$$ -1356 -2114 -1930 -824 560 1484 1886 1225 -315 -1517 -1930 -1720 -784 692 1680 1870 1219 122 -1477
2978a477l23J44J162J451J100j73p14j303j370n48L41J392J128J233n2j344j180
$$ -1477 -1800 -1656 -494 957 2057 1884 1170 -133 -1503 -2051 -1710 -318 810 2043 1991 647 -533
2995e33j050m97M97J212J387Q38p0j073j243j252o1M54J230J516O58l55q51j423
$$ -533 -1583 -2080 -1583 -371 1016 1854 1784 711 -532 -1784 -1845 -1391 -161 1355 2013 1658 807 -616
3013f16j025l93J034J069J100R73l70j399r41q29m34N69J722Q18M57k25r90j409
$$ -616 -1641 -2034 -1000 69 1169 2142 1772 373 -568 -1397 -1831 -1262 460 1278 1735 1510 520 -889
3031h89j097J13N84J519J362L53n27j224q78j063k69J199J041J193N29n33j044
$$ -889 -1986 -1873 -1289 230 1592 1945 1418 194 -684 -1747 -2016 -817 224 1417 1946 1413 369
3048C69j323q95M7R73J406R19N36n23j512j377k84j63J006J422N46M59j88j287
$$ 369 -954 -1849 -1802 -829 577 1496 2032 1509 -3 -1380 -1664 -1827 -821 601 1147 1606 1418 131
3066A31j414o06L90Q23J567P83K35j106o97j259p66M37J128J285P57L07r70j309
$$ 131 -1283 -1889 -1499 -676 891 1674 1909 803 106 -1153 -1919 -1482 -354 931 1688 1995 1025 -284
3084b84j301k32J14J165J465Q31k63p15j018j370k05L90Q41J569P35q2p28j418
$$ -284 -1585 -1817 -1703 -538 927 1758 1495 780 -238 -1608 -1813 -1423 -582 987 1722 1640 912 -506
3102e06q59l20K42J370J504K57Kj069j131j056k75N62J151J267P65k09j080j509
$$ -506 -1365 -1685 -1443 -73 1431 1688 1690 621 -510 -1566 -1841 -1279 -128 1139 1904 1695 615 -894
3120h94p51kM40J266J242O45m99q22j127j367J64N61J424J130O13m93j154j383
$$ -894 -1645 -1647 -1207 59 1301 1946 1447 625 -502 -1869 -1705 -1144 280 1410 2023 1530 376 -1007
3138a007o76K1P66J270R05M92m74q93j155j008j34J090J303R02L16m91r99r95
$$ -1007 -1683 -1662 -896 374 1279 1771 1297 404 -751 -1759 -1893 -803 500 1402 1718 1227 228 -767
3156g67j009K70N19J546J063j38k62j232r25j024L09Q51J311J045o0l26j227j060
$$ -767 -1776 -1506 -987 559 1622 1484 1222 -10 -935 -1959 -1650 -799 512 1557 1497 1171 -56 -1116
3174a116p00K40J250R72Q05L00r06j037j195m27L78Q72J390P25P8r52q82j124
$$ -1116 -1816 -1576 -326 646 1451 1751 845 -192 -1387 -1814 -1436 -564 826 1551 1629 677 -205 -1329
3192a329j22J82Q32J491N68R1r22j219j137N7K10J273J012P35r5q28j136q63k64
$$ -1329 -1451 -1269 -437 1054 1622 1713 791 -428 -1565 -1508 -1298 -25 987 1722 1627 799 -337 -1200 -1464
3211a464J26J456P70Q88m31m96j350q74j02L24J246J197L87k00j057j237n41j68
$$ -1464 -1338 118 888 1776 1345 849 -501 -1375 -1477 -1153 93 1290 1677 1477 420 -817 -1358 -1526
3229a526M37J357P96P82n38q09r94r68j34M81J278J112L57l47q03j104p60k9O06
$$ -1526 -1089 268 1064 1846 1308 499 -495 -1463 -1597 -1116 162 1274 1631 1284 481 -623 -1383 -1412 -806
3248h06J327P19K83l11j160r35n94l30R42J329P78O46m85j317q72o36j26Q22J053
$$ -806 521 1240 1523 1212 52 -883 -1477 -1807 -865 464 1242 1888 1403 86 -786 -1422 -1548 -726 327
3267C27J256Q7p74p46j027o97jR84J398K77N17n19j034j265k43K28P40J153Q78
$$ 327 1583 1670 896 150 -877 -1574 -1575 -591 807 1084 1601 1082 48 -1217 -1460 -1232 -492 661 1539
3286A539Ko24j082r90o39N21J124Q88N82J87n30j075j214l58N64J048P61Q31J82
$$ 1539 1541 917 -165 -1155 -1794 -1273 -149 739 1321 1508 978 -97 -1311 -1669 -1105 -57 704 1535 1717
3305A717r85j054r97m16R21O34J148L62J4p35j027n99n68L40J037J198M93k60
$$ 1717 732 -322 -1319 -1735 -814 -180 968 1330 1344 609 -418 -1017 -1585 -1245 -208 990 1483 1223
3323A223o75r27j089o6O32Q53R96N05m47n76j138p61j08O85J192R04J82j07p29
$$ 1223 548 -379 -1468 -1534 -902 -49 947 1452 1005 429 -709 -1470 -1578 -893 299 1203 1385 1278 549
3342E49j081p68j44N67J238R83M65m32j052r05q89m6P05R93J036N22o03j069p66
$$ 549 -532 -1300 -1444 -877 361 1344 1809 1377 325 -580 -1469 -1515 -810 183 1219 1741 1138 69 -697
3361f97p44K4P47J198O47N50o03r87r88k60O3K94J287O69L62n21j013j146n46
$$ -697 -1441 -1417 -670 528 1175 1725 1122 135 -853 -1113 -1050 -756 531 1200 1562 1041 28 -1118 -1664
3380a664N61N07J179R12O3p18j069q61m16L61R31J056N30M6q58p74p90p38O85
$$ -1664 -1103 -596 583 1495 1558 840 -229 -1090 -1506 -1145 -214 842 1372 1418 560 -214 -1004 -1742 -1057
3399a057Q87R35P02jq94p32j023k07L43P21J058O51r2q87o30q67m22O64P32Q64
$$ -1057 -170 765 1467 1466 572 -160 -1183 -1390 -1047 -326 732 1383 1291 404 -226 -1093 -1515 -851 -119 745
3419G45M66j4o10j020o88m78O93P99R97M99j79o25q88r48k4N69P91R61L20l94
$$ 745 1211 1197 587 -433 -1121 -1599 -906 -107 890 1389 1210 585 -303 -1251 -1275 -706 85 1046 1366 972
3439I72n41j026o34m7N75Q83O74N81l06q43j003n35oM03J025J038l2j78q08o74
$$ 972 431 -595 -1229 -1276 -701 182 856 1437 1131 288 -715 -1250 -1256 -853 172 1210 1178 1000 192 -482
3459d82q83J05Q48O75Q05L13k26r49j170n39M29K54J299Q88O9n90r25o52o46J67
$$ -482 -1365 -1260 -412 263 1068 1381 1155 206 -964 -1503 -1074 -820 479 1367 1436 846 -79 -731 -1377 -1210
3479a210N37J085O49K69n63o44j193l84J59J044O93P41K55p22q47p19m35J90P87
$$ -1210 -673 412 1061 1330 767 123 -1070 -1454 -1295 -251 442 1183 1438 716 -131 -850 -1285 -1095 -308
3498c08R24N16L4l29j035p79m12M31N66J078O41K04p45j017q18j95J54P11J043
$$ -308 616 1132 1166 837 -198 -977 -1389 -958 -392 686 1327 1531 786 -231 -1049 -1244 -1090 -379 664
3517F64P66k83m94j065o94j78L53O96J100N13l85n15j033n97M3L70O45P22O50
$$ 664 1430 1147 653 -412 -1106 -1284 -931 -235 865 1378 993 478 -555 -1152 -1109 -739 -94 628 1278
3536A278j75m40j111p80j81P33Q77Q59J03j31p79o72p64n8Q15P31O16L90n41n50
$$ 1278 1103 663 -448 -1228 -1409 -676 201 1060 1163 1032 253 -419 -1183 -1241 -426 305 921 1311 770 220
3556B20n78p26j29P69O44Q77P6k63n25j183k80j35O19J078P07o3l51n76p91p32
$$ 220 -358 -1084 -1213 -444 200 1077 1153 890 365 -818 -1098 -1233 -614 464 1171 1108 757 181 -610 -1342
3576a342L64M83J016L90K81n03r27n86m44p3R38J065M34K57l97j227m15n22Q8
$$ -1342 -978 -495 521 911 1192 689 -238 -824 -1268 -1341 -403 662 1096 1353 956 -271 -686 -1208 -1120
3595a120J064O55O47n4m09q25o89p64N18N01J049M35K30n58r37q28rK77R93O56
$$ -1120 -56 599 1246 1192 783 -42 -731 -1495 -977 -476 573 1008 1238 680 -257 -1085 -1094 -817 176 832
3615H32N66k72o13o01r38j68K25Q01R49N18k09n26q09p58k02L92M74J061O09k81
$$ 832 1398 1126 513 -88 -1026 -1194 -969 -168 781 1299 1090 564 -245 -1003 -1205 -813 -339 722 1331 1050
3635A050o54p82q03K35n2J080Q99M99o68m78r80m77j37M59J078M21M73j94m79
$$ 1050 396 -386 -1189 -954 -1006 74 973 1472 804 326 -654 -1131 -1268 -809 269 690 1163 969 490
3654D90r84n77L1N77M77Q65K90j33r24q08l10j71O76Q15O79K41m95k55o96o94
$$ 490 -494 -1071 -1040 -463 14 879 1169 1036 112 -696 -1006 -1177 -501 314 993 1234 739 484 -212 -906
3674i06k43O75Q62M14K54m4p84j063n27L46N09Q70P66p5k05q59n93m19Q6O62N90
$$ -906 -1149 -474 388 802 1056 1012 228 -835 -1362 -1016 -507 363 1129 1054 849 -10 -603 -1022 -936 -274 316
3695C16M46L62o56m64n90m36P2O64O67M00N48o41j003o38l56N08M56P24N30L09
$$ 316 762 1124 468 4 -586 -1022 -950 -286 381 781 1329 688 -315 -953 -1309 -801 -345 379 909 1218
3715A218m81p62p10l47J37R54N41N42j54m81p33o47l46K69J026O33M01m1n79o58
$$ 1218 737 -25 -735 -1082 -945 9 550 1092 938 457 -276 -923 -1269 -1000 26 659 1060 1019 440 -218
3735b18o47m64P32N72P27O06l36o73o66n41l12M68Q81L61N40k21l70o21r12J2
$$ -218 -865 -1329 -597 -25 702 1308 972 299 -367 -908 -1220 -752 129 490 1030 809 439 -182 -1094 -1082
3755a082N36O62O47M38l66m76q12m72K48J52O57P87P9q6o73o31o17q8N17P67O47
$$ -1082 -546 116 763 1201 835 359 -453 -925 -677 -525 132 919 998 912 239 -392 -1009 -1097 -580 187 834
3776H34J35q0q33o87k80l55P79Q73M49M3J02r54o04l77J83K22O42O24K92k0j149
$$ 834 969 889 56 -631 -911 -1266 -487 386 835 878 980 26 -578 -955 -772 -550 92 716 1008 988 -161
3797a61l25m18R4N77N70O12J70l78q17o80j90l8Q26O26P57j97k27j046n39k3K01
$$ -161 -486 -904 -810 -233 337 949 1119 741 -76 -756 -946 -984 -158 468 1225 1028 801 -245 -784 -807 -606
3818f06K53J049K50j37l27p43p23r7K08Q39N43L04K07o16p88l81k71K77N67Q79
$$ -606 -353 696 946 809 482 -261 -984 -1081 -873 -34 509 813 1020 404 -384 -765 -1036 -759 -192 687
3838F87M37J73q15o18o84Q3K66L17Q31M82k70l68q89n82Q7J92R15O20K45l76l79
$$ 687 1124 1297 482 -136 -820 -737 -471 -154 677 1159 889 521 -368 -950 -863 -671 244 864 1109 733 354
3859C54p92m72J06J92M81J073M1n3p05q06m12k31N98R85L49K40L20j069o93n38
$$ 354 -438 -910 -804 -612 -131 942 983 930 225 -581 -993 -1224 -626 359 708 948 1268 199 -494 -1032
3879a032J75K85Q08N77M89o76k95r53m93K16M65P57L80M14l09n21q86m48K19N01
$$ -1032 -857 -572 236 813 1302 626 331 -622 -1115 -899 -434 323 703 1117 808 287 -599 -1047 -828 -327
3899c27P42M60K98n74o96o86j75K78M47Q26L12L18o59n62p47l52L98K99R06M43
$$ -327 415 875 1173 599 -97 -783 -958 -680 -233 593 905 1223 564 2 -745 -1097 -699 -400 506 949
3919I49J44m82r89m25k91K21P59N81P38k18m79o58o75J6qQ28L77J84L81l64o56
$$ 949 1093 611 -378 -803 -1094 -873 -114 467 1205 987 508 -150 -825 -809 -817 11 388 572 953 589 -67
3940f7r47l8L58N79O08K58J02p85l90m17QLL98Q03M01m6k98r42m89P9J86O63P41
$$ -67 -1014 -1052 -694 -115 493 751 853 68 -322 -739 -731 -728 -330 473 874 828 530 -412 -901 -822 -636 27 768
3963G68K47Mo42q35l07j32M15N40O30L43J7o40p87m94n4K53R68K80M38l56l20
$$ 768 1015 1019 377 -458 -765 -897 -482 58 688 1031 1048 408 -379 -873 -927 -674 294 574 1012 656 336
3984C36q62n15R2M12O72O02L95j74r28n16o11L70L41M74M90K95j08m91q93k36
$$ 336 -526 -1041 -949 -537 135 737 1132 958 30 -486 -1097 -727 -386 88 578 873 765 274 -619 -855
4004h55kO58N46L92K55l06o16q05Ll21J031M87K85J11k26q25o17j76L14N10L02
$$ -855 -857 -199 347 739 994 688 72 -733 -730 -1051 -20 467 752 863 637 -188 -805 -981 -667 -157 145
4025A45P35P1l86o71p77j87J99O03P22L08j9m30l08m58l52K1P48M75J99J77m88
$$ 145 880 951 565 -106 -883 -1070 -871 -268 454 762 743 313 5 -453 -805 -784 -36 439 638 815 327
4046C27l46n58l67K27P95M79M04k12l59n55o94O8l0R77P63j04J90p61o34k73k24
$$ 327 -19 -577 -944 -717 78 557 961 749 390 -165 -859 -791 -821 156 919 815 1005 244 -390 -663 -887
4067h87J04P38O99K66j43l20q94O3l97L22N92M49K60k22j60o97n03l97O39P11
$$ -887 -783 -45 654 920 777 457 -437 -374 -771 -449 143 592 852 630 470 -227 -730 -1127 -488 223
4087B23K97M62l51m66m88l50l14O59N43O95k01j34l22o85l91k1M20O60L92J21
$$ 223 520 982 631 165 -323 -673 -987 -328 215 910 709 575 253 -432 -823 -844 -424 236 628 749
4107G49k39m44m41m74j89Q09M31L32J73k8n40o77m08K79M71L34N85l7j16n03n60
$$ 749 510 66 -375 -849 -1038 -229 202 534 707 679 139 -538 -946 -667 -196 138 723 686 570 67 -493
4128d93l92K79J05Q95N36o3l58o56j58o58M27K93O92M82j60l56m81m72l92O03
$$ -493 -885 -606 -501 394 930 867 509 -147 -305 -963 -536 -243 449 931 771 415 -66 -538 -930 -327
4148c27L11M33M59j65m29m40m35k97K11M16Q50M20j90p25l66m66j94K77Q70O0
$$ -327 -16 417 876 711 282 -158 -593 -890 -679 -263 587 1007 817 92 -274 -740 -934 -657 213 273
4168B73M46J13n17p93l73Q1L35N39M53L86k22l91o41m21l17Q81K04N19L51k62
$$ 273 719 832 315 -478 -851 -770 -435 104 557 943 721 330 -311 -732 -1049 -168 36 555 906 644
4188F44j65r90M3l79L23Q24L72J71k69k06p32k87j62J58P81O20m5K04j040k28
$$ 644 479 -511 -468 -847 -524 300 672 843 574 368 -364 -651 -813 -655 126 746 701 905 -135 -363
4208c63m08M2N42M14N91n3j16o15m35o15L06K43O70N70j90N7n18q38j97J19N57
$$ -363 -771 -729 -187 227 818 765 649 34 -401 -1016 -710 -467 203 773 583 640 122 -716 -913 -794 -237
4229b37L53N01K06o74l15l29m43L19J74O15N96Jl21l71m82k31O7O08N61J1M2m00
$$ -237 116 617 823 149 -166 -495 -938 -619 -445 170 766 767 446 75 -407 -638 -571 37 598 609 651 251
4251B51m08o22p9M19M12O92J00J8l99l63q07O3K28N37K51O17k60k50p83k06j53
$$ 251 -157 -779 -858 -439 -27 665 765 783 384 21 -786 -723 -495 42 293 910 650 400 -383 -589 -742
4272g42J36N98N00M16k09m50o15m66P3L58L99M50J68j4k85o26m11L40j7O53J48
$$ -742 -606 -8 492 908 699 249 -366 -832 -759 -401 -2 448 616 602 317 -309 -720 -380 -397 256 404
4293D04J43Q6l53o33m51j7K80O67N82J05k18l07n37k58j95M17L15O14M7n4o35
$$ 404 547 633 280 -353 -804 -821 -541 126 708 813 595 288 -249 -507 -702 -285 30 644 691 637 2
4314Bk91m02o5M96M69N26R8k05n17n13k87K6M11O99J76J10k78k45o32j83k50M93
$$ 2 -289 -691 -756 -260 209 735 833 628 111 -402 -689 -663 -252 447 623 733 455 210 -422 -605 -855 -362
4336c62P06M95J54o51l15m58l53L61M06J71M91q4l05l02m02l06M56J26N04L99
$$ -362 344 839 993 342 27 -431 -784 -423 -17 154 645 561 256 -46 -448 -754 -298 -172 332 731
4356G31l51r8l77o62J56K53K9P36M71l70j35n03m37j35J66K80P62J43K5m40o83
$$ 731 380 282 -95 -757 -601 -348 -319 417 888 518 383 -120 -557 -692 -526 -246 516 659 684 244 -439
4377d39k72P8qQ94L74K76k89k03o96k57l51M23K44P13L89k15l98l45n36J70j44
$$ -439 -711 -633 -641 253 627 903 614 411 -285 -542 -893 -470 -226 487 876 661 263 -82 -618 -448 -592
4398e92P61M00R5J30o72n29m02j7M40P70J21N4L5o53k46m11j07L57L61O74J69
$$ -592 169 569 664 794 122 -407 -809 -826 -386 384 505 559 594 -59 -305 -716 -823 -466 -105 569 738
4419G38o2l85m58m99q2L31Q27J23L98n22k84m90m75M6M76O72K15L6j00m64p20
$$ 738 676 291 -167 -666 -748 -417 410 533 931 409 125 -365 -840 -794 -318 354 569 605 505 41 -679
4440f79j4J49J54P47J11K42k97m50m27m13N27K98O66Q0k2o44j72m45k24L54K33
$$ -679 -693 -544 -390 357 468 710 413 -37 -464 -877 -350 -52 614 694 672 28 -144 -589 -813 -459 -226
4461b26O28K72M9j62o47k72m18J95L59M99M07n9l42k87n14l59L33L36M05M35k13
$$ -226 402 674 723 561 -86 -358 -776 -581 -222 277 684 625 283 -4 -518 -877 -544 -208 197 632 419
4482D19k49l27m79lL68K17O81n5Q7m96m86l20N0J67M02M38L85m92L3k61n40k90
$$ 419 170 -157 -636 -639 -271 -54 627 572 659 163 -323 -643 -593 -426 -24 414 799 307 340 79 -461 -751
4504g51O26K21J02N83j88l92n45k14j86N18J12M75L10l09n26k41j25k8M66K56
$$ -751 -125 96 198 781 593 201 -344 -558 -744 -226 -114 361 671 362 -164 -405 -530 -558 -92 164
4524A64J37R3M32q20l34m16J59N9N57N29l6L9l17n59o18M85L29L06M85Q0k98n23
$$ 164 301 394 826 6 -328 -744 -585 -526 31 560 524 563 246 -313 -931 -446 -117 189 674 754 456 -67
4546f7m99r4J23K81N59K30L88l30m72p33j17jO31L57L38J05l61n76j97l04M89
$$ -67 -566 -660 -537 -256 303 533 921 591 119 -614 -731 -732 -101 256 594 699 338 -238 -435 -739 -250
4567b50Q9O36J52m7j12p25k96p9J11P02J42L36k90j4m82m77j3N4O67J10M77k88
$$ -250 -161 475 627 580 468 -257 -553 -632 -521 181 323 659 369 355 -127 -604 -617 -563 104 214 691 403
4589D03Ol59n50k05L76K75M38K16j0n49j45l62j58J65L26N78K13k8k73o36ol76
$$ 403 409 50 -500 -705 -329 -54 384 600 590 41 -104 -466 -624 -459 -133 445 658 630 357 -279 -285 -661
4611f61J88Q23J33L28j76n77l64m78M48p5K66P17O3j92k80k81l48k30L49K95M63
$$ -661 -473 350 483 811 635 58 -306 -784 -336 -411 -145 572 635 443 163 -118 -466 -696 -347 -52 411
4632D11K24k82k51m86k05K25j64Q06K20J39j33l77l01n03J64M24K02P26q9l01
$$ 411 635 353 102 -384 -589 -364 -528 278 498 637 504 127 -174 -677 -513 -89 113 839 750 449
4652D49k67p39j18J4M00K51N64K11k21n73k41l62J48L94J95M84j56m5n39l57K1
$$ 449 182 -557 -675 -661 -261 -10 554 765 544 -29 -270 -632 -484 -90 105 589 433 388 -151 -508 -487
4673d87R0P5O44L84k30k51k88l52k50J32N30L30K20j65L8o16k61j36J41N13L28
$$ -487 -397 -322 322 706 476 225 -63 -415 -665 -533 -3 327 547 382 420 -196 -457 -593 -452 61 389
4694C89K3J13k42n03j33k91K41M05K06K06J99l45l63m36O6K44K70M45J04K02p51
$$ 389 412 525 283 -220 -353 -644 -403 2 208 414 613 268 -95 -531 -465 -221 49 494 598 800 49
4715D9m40j96k85O30J88M40K57k67n0n56m16K00J05N57L06J40k88l59o17k10J28
$$ 49 -391 -587 -872 -242 -54 386 643 376 326 -230 -646 -446 -341 216 522 662 374 15 -602 -812 -684
4736f84N75K76L17n5p3m58k76p1l44M76J89O16K56l56l55m49k71K63J84L78M73
$$ -684 -109 167 484 429 356 -102 -378 -449 -793 -317 -128 488 744 388 33 -416 -687 -424 -240 138 611
4757F11k37K10n66m27l64J01M52N62L13j90j90l84m3m26j52O92L62L94k45k57
$$ 611 374 584 18 -409 -773 -672 -220 342 655 465 275 -109 -152 -578 -730 -38 324 718 473 216
4777B16j09m60K4J4K68L35j9K56k99l39m63j23J56N87J70Q7J22j85o94o3jJ42
$$ 216 107 -353 -329 -315 -47 288 269 525 226 -113 -576 -699 -543 44 214 301 423 238 -456 -519 -520 -378
4799c78K42L00L86K72o35k20l74j77L00L56L81J86m5k54n32j87l27M68J62N49
$$ -378 -136 164 550 822 187 -33 -407 -584 -284 72 453 639 594 340 -192 -379 -706 -238 -76 473
4819D73K20l50l55j09k17n1M7L71K62J38j4m70j15j87j97Q2P04J55P9k93j42l62
$$ 473 693 343 -12 -121 -338 -389 -342 29 291 429 415 -55 -170 -357 -554 -472 232 387 466 173 31 -331
4841c31m13M2M97L04K82L24l08l46m17lj69K28N44M12m8o3m74n12j87O1O03J57
$$ -331 -744 -702 -205 99 381 705 397 51 -366 -369 -538 -310 234 646 598 535 61 -451 -638 -577 26 183
4863A83L59K6r2m35m17l44k0K91N66L97K17o65j15l42j12j01N80K64J18J20k36
$$ 183 542 568 476 41 -376 -720 -740 -449 117 514 731 66 -49 -391 -503 -604 -24 240 358 478 242
4884B42l61k92k56J84K14K14O84O5l20n95k57k59K45K63N27P1J69r1p30l82L7
$$ 242 -119 -411 -667 -483 -269 -55 629 694 374 -221 -478 -737 -492 -229 298 369 538 447 -283 -665 -628
4905f28Q3P11L24L22l76j98k35n08K0J53N69N1L87M7n06l06m94o8K68M80M2M09
$$ -628 -545 166 490 812 436 238 3 -505 -485 -332 237 288 675 722 216 -90 -584 -652 -384 96 138 547
4927E47K7m57l31p9l33M01Q1N67J65l15j97l89l57O1K86J55O12O2j66k58l68l52
$$ 547 574 117 -214 -293 -626 -225 -144 423 588 273 76 -313 -670 -609 -323 -168 444 506 340 82 -286 -638
4949f38l5L37M69M11j2j8n47k73M7N0j3M18L17L73l48l99n90j03K32J33L81J34
$$ -638 -673 -336 133 544 532 514 -33 -306 -259 -209 -222 196 513 886 538 139 -451 -554 -322 -189 192 326
4971C26J31J2l86n43k70L58J25L21M36m0j83l03n38k35M53L87J72M39p1k16m10
$$ 326 457 469 83 -460 -730 -372 -247 74 510 470 287 -16 -554 -789 -336 51 223 662 591 375 -35
4992c5l39j50K34K58L26J46p0Qm20k93l74J22O22J15M12K04m67m35n85R2J75M71
$$ -35 -374 -524 -290 -32 294 440 370 378 -42 -335 -709 -587 35 150 562 766 299 -136 -721 -629 -454 17
5014A7K17L08j40p5o07k33k6l7O96K98K44j03l29m57p7j31n3N84M85M9J54m90
$$ 17 234 542 402 327 -280 -513 -539 -576 120 418 662 559 230 -227 -304 -435 -488 96 581 630 784 294
5036B94m34l53nJ40O87L9K45j11o9l94l94k92N57J69K74nJ10q1p00l72K70K89
$$ 294 -140 -493 -498 -358 329 368 613 502 433 39 -355 -647 -90 79 353 348 458 377 -323 -695 -425 -136
5058a36q9M76K42J03n82k51r9J0O8J75P05J95l84m52m74O4j91M53K00J99L98k43
$$ -136 -225 251 493 596 14 -237 -336 -326 -258 -83 622 817 433 -19 -493 -429 -620 -167 33 232 630 387
5080C87r6m72l44J4L73M28K28J9n1n03n74J27R5K20L94K06K09k87m19m40j30L41
$$ 387 291 -181 -525 -511 -138 290 518 537 486 -17 -591 -464 -369 -149 245 451 660 373 -46 -486 -616 -275
5102b75k2L01L60Oj46n22%k15J99L39J70N25k78k22k09k89k85J47N40K99K20K2
$$ -275 -297 4 364 370 224 -298 -298 -513 -314 25 195 720 442 220 11 -278 -563 -416 124 423 643 665
5124F65l97o21K5j57O8M18J18M55p7n02l36j95k8J57N38K54R0K57o15m46k3j21
$$ 665 268 -353 -328 -485 -417 1 119 574 497 -5 -341 -536 -564 -407 131 385 475 732 117 -329 -352 -473
5146d73L18K87J09J43N3l58j40j12k96J26M66j23M57O5m63j81m62P9K30J25Q09
$$ -473 -155 132 241 384 437 79 -61 -173 -469 -343 123 0 457 522 59 -122 -584 -505 -275 -150 659
5167F59j02k30l60p3l21M7L00K27J96L44m56k87k75k9o7K76L69L94k1l40O0r14
$$ 659 557 327 -33 -106 -427 -380 -80 147 343 687 231 -56 -331 -360 -427 -151 218 612 591 251 311 -603
5189f03J50J00L51L79J50K35l53l27l94n3Q5J65N04l1J78j81l67n42L37l12N27
$$ -603 -453 -353 -2 377 527 762 409 82 -312 -365 -280 -115 389 358 536 355 -12 -554 -217 -529 -2
5210bJ76J91J68k48l59m06k06L16J13N88K81p2j82l88m02k29J41J73M74L45P5
$$ -2 174 365 533 285 -74 -480 -686 -370 -257 331 612 540 358 -30 -432 -661 -520 -347 127 472 547
5231E47j91n12j93J5kM81J34j3L50l48n36j88j2L63Q1N05L7p6l35k94k70L2J47
$$ 547 356 -156 -349 -334 -336 145 279 266 616 268 -268 -456 -468 -105 -24 481 518 442 107 -187 -457 -425 -278
5254b78L60J66P3q6J17n30k91q3K59L16M40n4j26l28l44k2j48K13M52M06K4l39
$$ -278 82 248 321 235 352 -178 -469 -552 -293 23 463 409 283 -45 -389 -411 -559 -346 106 512 536 197
5276A97j04l62k03k6L79K38J50Q9N0l54l06k65M8L36L63K87J78l36j92l23k02
$$ 197 93 -269 -472 -498 -119 119 269 358 408 54 -252 -517 -469 -133 230 517 695 359 167 -156 -358
5297c58q2L69M89o3k4q2j40n77j48K38J88L11L95N6l14j21l68j29l5J36O09k51
$$ -358 -440 -71 418 355 331 249 109 -468 -616 -378 -190 121 516 572 258 137 -231 -360 -395 -259 350 99
5319I9J56j2l46l63m5J99K86L73K63j95j28j93l20k71k4N08L24K61O4l64l83l0
$$ 99 255 243 -103 -466 -511 -312 -26 347 610 415 287 94 -226 -497 -521 -13 311 572 636 272 -111 -141
5341a41j29M0J69K92K77k04k43j28j86m01N25p1M25K91m5l39m80k1j6J60M48J13
$$ -141 -270 -230 -61 231 508 304 61 -67 -253 -654 -129 -200 225 516 471 132 -348 -369 -385 -225 223 336
5363C36K36j46l56k36m19K34J09M38L69n2j44k88l40j15J3J84K97J29J99k74j53
$$ 336 572 426 70 -166 -585 -351 -242 196 565 513 369 81 -259 -374 -361 -177 120 249 448 174 21
5384B1k95k04K4M62L3M28j39Q8o08j39k08P5M63j1N47K12l04m73k79r1q4O05m6
$$ 21 -274 -478 -454 8 41 469 330 418 -190 -329 -537 -462 1 -10 537 749 445 -28 -307 -398 -482 123 77
5407G7O30j65n19k77L5m53L98L70J45L14k81J66n34l48K80k13L91L95j87K13j25
$$ 77 707 542 23 -254 -219 -672 -274 96 241 555 274 440 -94 -442 -162 -375 16 411 224 437 312
5428C12k33m08k74N21N3O0L87Mj97k36l22j91K93o8O42K80p6k93l54m75N6L24
$$ 312 79 -329 -603 -82 -29 31 418 422 225 -11 -333 -524 -231 -299 343 623 547 254 -100 -575 -519 -195
5450a95L67J59L31k38n21j1k96OJ96K21K91K60j21k95k26m29M6k0M50K77M55n60
$$ -195 172 331 662 424 -97 -108 -404 -398 -202 19 310 570 449 154 -72 -501 -455 -475 -25 252 707 147
5472A47k26p3p0q9L6M06K29J06k58k42l52J32j40m5M13M88l4K12k87p77J22L8
$$ 147 -79 -152 -222 -311 -275 131 360 466 208 -34 -386 -254 -394 -439 -26 462 428 640 353 -424 -302 -264
5494b64J32L89J70n7k16k17j7l32J19J96L67K26q0k22l85j00l8J45R3J32L71J56
$$ -264 -132 257 427 370 154 -63 -80 -412 -293 -97 270 496 416 194 -191 -291 -329 -184 -91 41 412 568
5516E68l83q3m14k12K60K26J00K91J28k90k91k96N5p0K40M20L92j30k58l83j76
$$ 568 185 102 -312 -524 -264 -38 62 353 481 191 -100 -396 -341 -411 -171 249 641 511 253 -130 -306
5537c06j61K87J12R1M54j70k02r1k25r2p0N73N4K75j24m10k41k47J08n9L73L66
$$ -306 -467 -180 -68 23 477 307 105 14 -211 -303 -373 200 254 529 405 -5 -246 -493 -385 -444 -71 295
5559B95J10K8k75m87m4r5K88K31K85N3k29Q8p61o5P0J75M10L25J0j42k51l20O7
$$ 295 405 433 158 -329 -373 -468 -180 51 336 389 160 248 -513 -578 -508 -333 77 402 412 270 19 -301 -234
5582b34k24K69M18J74J59k93k46n21R8J5M54L89j79J12J62n19m13k81N53j85L37
$$ -234 -458 -189 229 403 562 269 23 -498 -400 -385 69 458 279 391 553 34 -379 -660 -107 -292 45
5603D5L91N2Q1p42l01J22j07M61L05l09N02j53n19k49j41n7L79K61J98P9P1n40
$$ 45 436 488 569 -173 -474 -352 -459 2 307 -2 500 347 -172 -421 -562 -619 -240 21 219 298 369 -171
5625a71k28r4J40M33O5L67L2k55l09l38j73J52K31L37K32m1k58j94n11j67N66
$$ -171 -399 -493 -353 80 145 512 544 289 -20 -358 -531 -379 -148 189 421 380 122 -72 -583 -750 -184
5646a84J82L36J52n8j35l45l58q8L18K02L23O8j64j33j69m77m0K87L37L51J56
$$ -184 -2 334 486 428 293 -52 -410 -498 -180 22 345 413 249 116 -53 -530 -570 -283 54 405 561
5667E61J20o63k42k18Lk5P02J28Q4On81k29o7L7p9P27K64j32k23l46q0k4k1J7
$$ 561 681 18 -224 -442 -439 -464 238 366 450 456 -125 -354 -421 -384 -463 264 528 396 173 -173 -253 -277 -298 -281
5691b81M97J83L40l55n51k44n0J72J0N01pM38j73o47j0n34J46K28O47R1Q2j27
$$ -281 216 399 739 384 -167 -411 -461 -289 -279 222 215 653 480 -167 -177 -711 -565 -337 310 401 483 356
5713C56l87n80J1J88J91L75L09j63r6m06j66j56O6K37M61R4J08k45k78j61k70
$$ 356 -31 -611 -600 -412 -221 154 463 300 204 -202 -368 -524 -458 -221 240 334 442 197 -81 -242 -512
5734e12J26L38J47L65J23k61l92m40N2K78j81O59J42K47m25l68l52p8K97J57M59
$$ -512 -386 -48 99 464 587 326 -66 -506 -454 -176 -357 302 444 691 266 -102 -454 -532 -235 -78 381
5755C81J04o8k28j89l35o2K0M55J97K8J23l68p7k82O4K31q5M05P2j93k24J25m87
$$ 381 485 417 189 0 -335 -397 -377 78 275 303 426 58 -19 -301 -237 -6 -91 314 386 193 -31 94 -393
5778c93%P6M18L92k93K3J52n18k76p3K8M40L11K50j96l74M7k68q5K64K4N27J05
$$ -393 -393 -317 101 493 200 223 375 -143 -419 -492 -464 -24 287 537 341 -33 14 -254 -339 -75 -51 476 581
5801E81m57j13k75k97K49L09L1L42N5n3j01n76Pj44L64L50J36K14k91k84l09j83
$$ 581 124 11 -264 -561 -312 -3 28 370 425 372 271 -305 -298 -442 -78 272 408 622 331 47 -262 -445
5823d45L36l2L40R5P5o1m21j46j29j48M23K20M07jm58k85j22l0J75k4L22M26p
$$ -445 -109 -141 199 294 369 308 -113 -259 -388 -536 -113 107 514 513 55 -230 -352 -382 -207 -231 91 517 510
5846E10l01j31l52l07M96J3J07N79k02j62l11k87j25j2L48M38K12M5l64l09l30
$$ 510 209 78 -274 -581 -85 -72 35 614 412 250 -61 -348 -473 -485 -137 301 513 558 194 -115 -445
5867d45L8K84M98r4J81k22k00o6l78M5pJ09N25J46J11l33l89k77K99k5J57L97
$$ -445 -407 -123 375 281 462 240 40 -26 -404 -359 -366 -257 268 414 525 192 -197 -474 -175 -200 -43 354
5889C54J32k23k09j06l70l10P45qN53Kk55k05m53k7m8L19L35K06K1j16j89l80
$$ 354 486 263 54 -52 -422 -732 13 5 558 560 305 100 -353 -380 -428 -109 226 432 453 337 148 -232
5911b32k04m1J40L51M17K30l03k96l90j19M02k28K47M03J56l32j70p8n23L19L00
$$ -232 -436 -477 -337 14 431 661 358 62 -328 -447 -45 -273 -26 377 533 201 31 -47 -570 -251 49
5932D9jL91J31j99l79k55k40J12L83R7L17K9j57l91k77j8O6R4M74K60m0m07j98
$$ 49 48 439 570 371 -8 -263 -503 -391 -8 89 406 435 278 -113 -390 -408 -342 -248 226 486 446 39 -159
5955a59l60RK92J98O7L53j66n5j99l82Q5P5K31L18P4k12j3l58r6j6m5O73KN57
$$ -159 -519 -510 -218 -20 47 400 234 179 -20 -402 -317 -242 -11 307 381 169 156 -202 -298 -314 -359 314 316 873
5979H73p08J25k90l33j2J37K27M44j44L9l22j40ol94M72K58R1K92l31j54j53l73
$$ 873 165 290 0 -333 -345 -208 19 463 319 358 36 -104 -110 -504 -32 226 317 609 278 124 -29 -402
6001d02j19L40J09M31J36j73j65m14K7k20K57J84L65j02P7p5n12k17K14mM65Q0
$$ -402 -521 -181 -72 359 495 322 157 -257 -230 -450 -193 -9 356 254 331 256 -256 -473 -259 -263 202 282
6023B82J11m7l02j98k17N4L58N8J95L65l22m01j09k64J06L33K42j74K53n4l46
$$ 282 393 346 44 -154 -371 -317 41 99 294 659 337 -64 -173 -437 -331 2 244 70 323 269 -77
6044g7r2j89J05K81K08l0K34k00j48l29k91K46J00M53J90m7k42k33j18m33K93
$$ -77 -169 -358 -253 28 236 206 440 240 92 -237 -528 -282 -182 271 461 414 172 -61 -179 -612 -319
6065c19K18K10M43j03m03k81k53M0J11K86J4M03J70m10j66m02L3R6M75M39q4p4
$$ -319 -101 109 552 449 46 -235 -488 -448 -337 -51 -37 366 536 126 -40 -442 -409 -313 162 601 517 443
6087D43l20j64j77j92M29J2L23O2r3j64l64j46j05L05J72M75k63R1k86l15Q1o8
$$ 443 123 -41 -218 -410 19 31 354 416 323 159 -205 -351 -456 -151 21 496 233 324 38 -277 -196 -264
6109b64j43N09O2K47j58j07l94l29K3L74L15K97n9j51k70o1j59J56j6K98K21j
$$ -264 -407 102 164 411 253 146 -248 -577 -554 -180 135 432 373 222 -48 -109 -268 -112 -128 170 391 390
6131C90j39j70k75m2l51O51JL04m4n16L93m25m8j51N90JP7J52r5k81j99k19n9
$$ 390 251 81 -194 -236 -587 64 65 369 325 -191 202 -223 -271 -422 168 169 246 398 303 22 -177 -396 -455
6154d55M04L42J62k55mj60m87R4J09M15m9L40Q5l90k83q3j12J3L74K93k57K62
$$ -455 -51 291 453 198 194 34 -453 -359 -250 165 116 456 541 151 -132 -215 -327 -314 60 353 96 358
6176C58j52j40m75N2OJ66M81M4%k98k74j27JP3M21j0K69k67j90K3j78l75N13J08
$$ 358 206 66 -409 -357 -351 -185 296 340 340 42 -232 -359 -358 -285 136 126 395 128 -62 -39 -217 -592 -79 29
6200B9Q1L61k63L8n98O2j18L58L46m3Q6o2j98j89l81J63M22jL03j00j69K32o96
$$ 29 110 471 208 246 -352 -290 -408 -50 296 253 339 277 79 -110 -491 -328 94 93 396 296 127 359 -337
6223c37L9k4P0N46J99l14K7k39j44m6k45L08O32j87K59k03k77m97m5J24L14M25
$$ -337 -298 -322 -252 294 493 179 206 -33 -177 -223 -468 -160 472 285 544 341 64 -433 -478 -354 -40 385
6245C85M5m0j33l46l46j00K74M1M83M31m74nk59k7j97K67l1J84J62J12m10M1m47
$$ 385 430 390 257 -89 -435 -535 -261 -220 263 694 220 215 -44 -71 -268 -1 -32 152 314 426 16 57 -390
6268c90l2J47L47J00M3K24m3l98k74k08K73L21M3J27K6l3m99m3R8j72N52Mk7J31
$$ -390 -422 -275 72 172 215 439 396 -2 -276 -484 -211 110 153 280 306 273 -226 -269 -171 -343 209 213 186 317
6292C17kk49n03K78J7K7K69J72l2j31j75k23j54L84J0K24M19k64k86k31j70LJ01
$$ 317 315 66 -437 -159 -142 -115 154 326 294 163 -12 -235 -389 -5 5 229 648 384 98 -133 -303 -300 -199
6315a99L30M23r9k72k17o5j24l48M37K75Q3N5rj36l90k38l4O43J69j02J78r0l23
$$ -199 131 554 455 183 -34 -99 -223 -571 -134 141 224 279 270 134 -256 -494 -528 115 284 182 360 270 -53
6338e3l09n6j01L94K37J75K02k80j57l49J53k89K26L69r2L57j44j30n54LK51J2
$$ -53 -362 -418 -519 -125 112 287 489 209 52 -297 -144 -433 -207 162 70 427 283 153 -401 -398 -147 -135
6360a35O03j22J09k22l91o5k18J29K75P6K25L72n25l97J52j93J68J91R8L43j89
$$ -135 468 346 455 233 -158 -223 -441 -312 -37 39 264 636 111 -286 -134 -327 -159 32 130 473 284
6381B84q6l67K15n93K81J82N90k3j64j88l30k92K1L71pK47J81J25k64k99j56n6
$$ 284 198 -169 46 -547 -266 -84 506 483 319 131 -199 -491 -470 -99 -106 141 322 447 183 -116 -272 -328
6403c28P6L18K13n8K1L8m08q3j98L27J52K78j5p4j77m41J8J03j8M50Q9k6L04l15
$$ -328 -252 66 279 221 242 280 -128 -211 -409 -82 70 348 333 259 82 -359 -341 -238 -256 194 283 257 561 246
6427B46n74j80J53O16p2K44K6k58Q1p47K80k08K50J99K60J66k13k45k74j12J08
$$ 246 -328 -508 -355 261 189 433 459 201 282 -465 -185 -393 -143 56 316 482 269 24 -250 -362 -254
6448b54K48kN7J58q5j74o24M32l1L07J21K40k4j44j63l27K0m1K24J86J49J66l5
$$ -254 -6 -8 49 207 122 -52 -676 -244 -275 32 153 393 369 225 62 -265 -245 -286 -62 124 273 439 404
6471D04n02j8k38k1K92K15L10j7k15j30n06l2J44L69J49J49r6n9l28p4L5j75L46
$$ 404 -98 -116 -354 -375 -83 132 442 425 210 80 -426 -458 -314 55 204 353 257 198 -130 -204 -169 -344 2
6494BL36j8j08m7l30l59L55K2K79J66O4k56j54m6l99L0L14J23L19j01p7L8k47
$$ 2 338 320 212 165 -165 -524 -169 -147 132 298 362 106 -48 -94 -493 -463 -149 -26 293 192 115 153 -94
6517i4l50J10L04P2J73j52J19k39k15OJ16j93M00K75N0l2j3o63p0J7K64L5L34
$$ -94 -444 -334 -30 42 215 63 182 -57 -272 -266 -150 -343 57 332 382 350 337 -326 -396 -379 -115 -80 254
6540B54K88j56l93k29j58J47J84K31K17npm43j41ro5J63J57M01j18om08k12k11
$$ 254 542 386 -7 -236 -394 -247 -63 168 385 380 373 -70 -211 -220 -285 -122 35 436 318 312 -96 -308 -519
6563e19M70pM09N8k71lj18l09r7m3M94O4K72r5j94j95j42j9mK0L77J84J89l49
$$ -519 -49 -56 353 411 140 137 19 -290 -387 -430 64 128 400 305 111 -84 -226 -245 -249 -229 148 332 521 172
6587A72k70q7J2j89M28J03Q5N7P1m58k11J69j8J62K65J70l51j34n7k91l0J25L31
$$ 172 -98 -185 -173 -362 66 169 254 311 382 -76 -287 -118 -136 26 291 461 110 -24 -81 -372 -402 -277 54
6610E4K81K0J10l61k91m17L40K49r1K57M1O2n6k52k54R1J76j18O20J91k58n20
$$ 54 335 355 465 104 -187 -604 -264 -15 -106 151 192 254 198 -54 -308 -217 -41 -159 461 652 394 -126
6632a26M0l06J87KO1M65J31j19l65o9k56j98M27J86K20J09j64k54j57j29j87N88
$$ -126 -86 -392 -205 -203 -142 323 454 335 -30 -99 -355 -553 -126 60 280 389 225 -29 -186 -315 -502 86
6654H6J15N3m7Q5m99j5m6Q4K48j6J90KN0j91m30qNM40j85L84j47J02k40l40j2
$$ 86 201 254 207 292 -207 -222 -268 -184 64 48 238 240 290 99 -331 -339 -334 106 -79 305 158 260 20 -320 -332
6679c32NL78J32K02r3P4l30j38N4k75J16O27k40J24l9l22n28J29K11K52K82j7
$$ -332 -327 51 183 385 292 366 36 -102 -48 -323 -207 420 180 304 265 -57 -585 -456 -245 7 289 272
6701B72nl14j77k69J6M38RK59K67k98N7m63l25J01K73J40M92j67J20m42%j45j69
$$ 272 267 -47 -224 -493 -477 -39 -30 229 496 198 255 -208 -533 -432 -159 -19 473 306 426 -16 -16 -161 -330
6724c30kL56K41K30k74k33j1j83m22M02J99N63q8k25j79m60K2r7L49L97N8p9L1
$$ -330 -332 24 265 495 221 -12 -23 -206 -628 -226 -27 536 448 223 44 -416 -394 -491 -142 255 313 234 265
6747B65k05l18n2K45j0Q5J86K17k19j66j44j6m45M96J22J72M04j42m57k17K6K0
$$ 265 60 -258 -310 -65 -75 10 196 413 194 28 -116 -132 -577 -81 41 213 617 475 18 -199 -173 -153
6769a53r3M63J54k65nJ2l39l2K64J73O4q8K09k05k33r2J09j48J38J05L81o4Q4
$$ -153 -246 217 371 106 101 113 -226 -258 6 179 243 155 364 159 -74 -166 -57 -205 -67 38 419 355 439
6792D39n90j03j33J38J03L52J15p7j87j59j10j69J75K35K38P6J52n48k7l87R7
$$ 439 -151 -254 -387 -249 -146 206 321 244 57 -102 -212 -381 -206 29 267 343 495 -53 -80 -467 -370
6813c70j32M35M20L5j75L8m23l1j84K32J09K38L39m0n45k87j24L50J3L18J9J93
$$ -370 -502 -67 353 388 213 251 -172 -203 -387 -155 -46 192 531 491 -54 -341 -465 -115 -102 216 235 428
6835D28j31k18l02m7r5L08K92p4km7j87j34m3R1o0M9K50J65j49k64m8j61L54k7
$$ 428 297 79 -223 -270 -365 -57 235 161 159 112 -75 -209 -252 -161 -221 -172 78 243 94 -170 -218 -379 -25 -52
6859e2M9L79j38j10j26M8m51K23J69J92J00J71m94Q8j05l29N4J03K21K57K91m76
$$ -52 -3 376 238 128 2 50 -401 -178 -9 183 283 454 -40 48 -57 -386 -332 -229 -8 249 540 64
6881F4k84K0j57M0J93L12K97m03M7j40k74J45RJ35QM47j77k53K0j80J0j2L02n8
$$ 64 -220 -200 -357 -317 -124 188 485 82 129 -11 -285 -140 -131 4 12 459 282 29 49 -131 -121 -133 169 111
6905A11J19M2O0n65m0j84K45K49L11j05J69l19m75J36j99K45K47K86j72N39q21
$$ 111 230 272 332 -233 -273 -457 -212 37 348 243 412 93 -382 -246 -445 -200 47 333 161 700 -121
6926a21k6l21J82J76K35K29lk1l37j00J07m05J88K59K55rm6o5m07q1J71Q2j9K86
$$ -121 -147 -468 -286 -110 125 354 351 330 -7 -107 0 -405 -217 42 297 288 242 177 -230 -311 -140 -58 -77 209
6950B09J0K9j79l20MJ81k35M33J92J4r4j82j22l68K46j56M69K23j03kl21k63J25
$$ 209 219 248 69 -251 -247 -66 -301 132 324 338 244 62 -60 -428 -182 -338 131 354 251 249 -72 -335 -210
6973b10R7J79j27M65j07j27o4m95N40m77M28R3n5L9j8k73l16J14J14J32K98J19
$$ -210 -113 66 -61 404 297 170 106 -389 151 -326 102 195 140 179 161 -112 -428 -314 -200 -68 230 349
6995C49k74K66k75k80L2M8K49k3L12Q1m04L2k67l29l7L27M41r4o9J0p8L2ql47
$$ 349 75 341 66 -214 -182 -134 115 92 404 485 81 113 -154 -483 -520 -193 248 154 85 95 17 49 41 -306
7019c06K48K60Q2Q8j98k10l26O8O1K64K01J67l22N3j47l46j63L84J31J99K7P9
$$ -306 -58 202 284 372 174 -36 -362 -294 -233 31 232 399 77 130 -17 -363 -526 -142 -11 188 215 294
7041B94j58l86k0K3j0K43J58N2j70P0l54l7J95K4n6K67K34m03J02j49r5j11L27
$$ 294 136 -250 -270 -247 -257 -14 144 196 26 96 -258 -295 -100 -76 -132 135 369 -34 68 -81 -176 -287 40
7064D0J21R5P3M5k58k48l60M82j63M86J22n64K43q2j53m4k96M00J52K97N9l95
$$ 40 161 256 329 374 116 -132 -492 -10 -173 313 435 -129 114 32 -121 -165 -461 -61 91 388 447 52
7086E2k09j09j29P6L86K87k70L84k49k72j90j07J87K88N1K78p3k86k52j14j81
$$ 52 -157 -266 -395 -319 67 354 84 468 219 -53 -243 -350 -163 125 176 454 381 95 -157 -271 -452
7107d52M31M5J9K70L8j00n91J87M3K02o0l5J55L05m01j54j15j57K23k7N51k62
$$ -452 -21 24 43 313 351 251 -340 -153 -110 92 32 -3 152 457 56 -98 -213 -370 -147 -174 377 115
7129A15K37k90l02MK07k6K85J11q3Q6k06o6k60JJ17J40K74q6M7k75j74j83J51
$$ 115 352 62 -240 -236 -29 -55 230 341 258 344 138 72 -188 -187 -70 70 344 258 305 30 -144 -327 -176
7152a76O9K21K60n3k7j95k74j01n6L86J40Q8j28J89j87m48j12J45J47K75K6n9
$$ -176 -107 114 374 321 294 99 -175 -276 -332 54 194 282 154 343 156 -292 -404 -259 -112 163 189 130
7174A30j1j26n32L16J81j9Q3L19k5l6l37ok65J93J78Q3J68O3k25l30R0or5K87
$$ 130 119 -7 -539 -223 -42 -61 22 341 316 280 -57 -63 -328 -135 43 126 294 357 132 -198 -108 -114 -209 78
7198G8j8K34m1l07Jj69j03J22j78M11M67l20q6j07k89mR1j3K31K68j1N3n42J8
$$ 78 60 294 253 -54 -53 -222 -325 -203 -381 30 497 177 91 -16 -305 -309 -218 -231 0 268 257 310 -232 -214
7222b14l6J8L96k83L89j20L9n17M4j21J15L17L88j19j30J43o09K41j63j13N13
$$ -214 -250 -232 164 -119 270 150 189 -328 -284 -405 -290 27 415 296 166 309 -300 -59 -222 -335 178
7243A78n4L86j50j44m10j07J24M0P9K54rj67K58m94j39J92j6L27l69O83k24k32
$$ 178 124 510 360 216 -194 -301 -177 -137 -58 196 187 20 278 -216 -355 -163 -179 148 -221 462 238 6
7265Fm02J80o8J14K37R4o0j49M31o18J59j39K23j0L56j46J75n82q0K14n51P39
$$ 6 -396 -216 -284 -170 67 161 101 -48 383 -235 -76 -215 8 -2 354 208 383 -199 -279 -65 -616 123
7287A23p7J88J33r6j94K7m12M7J30M70j83j2J92m89J26j01j7J2N7K00J83j49j24
$$ 123 46 234 367 271 77 104 -308 -261 -131 339 156 144 336 -153 -27 -128 -145 -133 -76 124 307 158 34
7310C4k52l17M76n7K47J1j13J4j63j59j62L47M7K3L78O9l03j29j06o7K8L31J06
$$ 34 -218 -535 -59 -116 131 142 29 43 -120 -279 -441 -94 -47 -24 354 423 120 -9 -115 -182 -154 177 283
7333B83k05K42j75k57m5n3J29J27J54J24o8l97k35L82k75kP3M48l5J09m92Q5l07
$$ 283 78 320 145 -112 -157 -210 -81 46 200 324 256 -141 -376 6 -269 -271 -198 250 215 324 -168 -83 -390
7356c90J99j14L81K06j21j26J06l10j43L13l20M31J68k40J29k6l65KP7m1K30K08
$$ -390 -191 -305 76 282 161 35 141 -169 -312 1 -319 112 280 40 169 143 -222 -220 -143 -184 46 254
7378B54J22j68q3k74k42MK36J85L20K7l04k45j79J97p7O2K76k1L16l65M5j77k24
$$ 254 376 208 125 -149 -391 -387 -151 34 354 381 77 -168 -347 -150 -227 -165 111 90 406 41 86 -91 -315
7401c15J19r1M16M9K76l85m6k04r5j03M27K1M72l17k24Q6l82p6M6L47O1L95M3
$$ -315 -196 -287 129 178 454 69 23 -181 -276 -379 48 69 541 224 0 86 -296 -372 -326 21 82 477 520
7424E20m28l05q0m7J61QM09n1K78k81k45m57M19j63J22K37RM9%l38k7m5J71R5
$$ 520 92 -213 -293 -340 -179 -171 238 187 465 184 -61 -518 -99 -262 -140 97 106 155 155 -183 -210 -255 -84 11
7448A1J88k01R7l3j3l63J15jJ55L76J12k22l27j30j63L17j77N02l4k9m4N4l72
$$ 11 199 -2 95 62 49 -314 -199 -200 -45 331 443 221 -106 -236 -399 -82 -259 243 209 180 136 190 -182
7471a82j47j46K32L97K73j33p2o2m00J15j63J32%L28J82J5m48j58R9L2k07L85
$$ -182 -329 -475 -243 154 427 294 222 160 -240 -125 -288 -156 -156 172 354 369 -79 -237 -138 -106 -313 72
7493G2K61j11k01r6k51PR4J89K8K54J68k28m19OJ73j06R5N6P5J86N8n87r1K71
$$ 72 333 222 21 -75 -326 -319 -225 -36 -8 246 414 186 -233 -227 -54 -160 -65 -9 66 252 310 -277 -368 -97
7517i7j87L37lK83R8j74o05J18J14j12P3L07K03p4k70o8k56Q4J02L11J19J4P0
$$ -97 -284 53 50 333 431 257 -348 -230 -116 -228 -155 152 355 281 11 -57 -313 -229 -127 184 303 317 387
7540C87j58m09j42J21J77J78N4N11q15Q7l80J90q6j12L73J92q2K29m30pL6j98
$$ 387 229 -180 -322 -201 -24 154 208 719 -96 -9 -389 -199 -285 -397 -24 168 86 315 -115 -122 -86 -284
7562b84J55K58R2J24k18o3l31J39j16p0L55J27O5j7k85k16K47l46K32M05J27o4
$$ -284 -129 129 221 345 127 64 -267 -128 -244 -314 41 168 233 216 -69 -285 -38 -384 -152 253 380 316
7584C16K0l89j47j67J96o3M18K4q7J44l22l34K15J54k68K43R4J70J89o57l7R4
$$ 316 336 -53 -200 -367 -171 -234 184 208 121 265 -57 -391 -176 -22 -290 -47 47 217 406 -251 -288 -194
7606a94j80L56K30J4k11L98p21j74K71j49K79L14J48j81l3r7m47J13O7L15R4K5
$$ -194 -374 -18 212 226 15 413 -308 -482 -211 -360 -81 233 381 200 167 70 -377 -264 -197 118 212 237
7628B37l8l99J27k94J62n3L44j2L68k01j49k67Pl29K98K15R5j61L62r0k99j19
$$ 237 199 -200 -73 -367 -205 -258 86 74 442 241 92 -175 -168 -497 -199 16 111 -50 312 222 -77 -196
7650a96j74K99N2K65j6k1k79j97K88l10N38l41K74N2K57k36m58J94j72j10M50
$$ -196 -370 -71 -19 246 230 209 -70 -267 21 -289 249 -92 182 234 491 255 -203 -9 -181 -291 159
7671A59K7J59l8k10l30J80p5J7K21m4J81j60kl30j39J40M50q7J60j66n6J67l48
$$ 159 186 345 307 97 -233 -53 -128 -111 110 66 247 87 85 -245 -384 -244 206 119 279 113 57 224 -124
7694a24o3J46K20k82K13L63m10n3O7l39j1L9J71L39j66j23k44j42k9L04m5K59
$$ -124 -187 -41 179 -103 110 473 63 10 77 -262 -273 -234 -63 276 110 -13 -257 -399 -428 -124 -169 90
7716I0K89p6l43k02r4L2k0L92Q4K0K29n18J0k83K37j2J79K19Jn5J37o70M24l06
$$ 90 379 303 -40 -242 -336 -304 -324 68 152 172 401 -117 -107 -390 -153 -165 14 233 234 179 316 -354 70 -236
7740b36o4K68K94J24k00m5Oj35m07J67K69P5oJ54r9j79m04J2K04M06k50J59J75
$$ -236 -300 -32 262 386 186 141 147 12 -395 -228 41 116 110 264 165 -14 -418 -406 -202 204 -46 113 288
7763B88q9k95j51m3K3O79l07J07j15m8k85J76j48j61M96j61K45P4j79k47l73K48
$$ 288 199 -96 -247 -290 -267 412 105 212 97 49 -236 -60 -208 -369 127 -34 211 285 106 -141 -514 -266
7785b66M4M29J58p7k34r0o6l38J88R2L16k2J26j72k8m39K11Oo2N35K0k28J98l56
$$ -266 -222 207 365 288 54 -36 -102 -440 -252 -160 156 134 260 88 60 -379 -168 -162 -224 311 331 103 301 -55
7809e5p0J7j14R3M13p5k3m2j33j93k00Q9R8L46K65k87J62n73NR5o2J99P1J69m6
$$ -55 -125 -108 -222 -129 284 209 186 144 11 -182 -382 -293 -195 151 416 129 291 -282 -277 -182 -244 -45 26 195 149
7834A49j13j9k95j13K27K58m5K8J04l10L22n35O9K89O2J10j12R6M5l56k87P6l0
$$ 149 36 17 -278 -391 -164 94 49 77 181 -129 193 -342 -273 16 78 188 76 172 217 -139 -426 -350 -380
7857c80M19J99j90q7Nk30L0MO3L12j44L23j4k67k24j21j02M7L88L17j31J1l95
$$ -380 39 238 48 -39 -34 -264 -234 -230 -167 145 1 324 310 43 -181 -302 -404 -357 31 348 217 228 -167
7880a67n2j29L44J53k90N29k48l5k71L29o65L91J31J94n3K34j12j48n56L1M11
$$ -167 -219 -348 -4 149 -141 388 140 105 -166 163 -502 -111 20 214 161 395 283 135 -421 -390 21
7901B1JR7K13j97l00K84j15k20J39J39j11K17Q6Q4n64M0J35K1J69R5k38J12P3
$$ 21 22 119 332 135 -165 119 4 -216 -77 62 -49 168 254 338 -226 -186 -51 -30 139 234 -4 108 181
7924A81k66R5k16J38P9p6K21J8k41k83Q6J49j08J88M00k06J01m16q4r2L70j21
$$ 181 -85 10 -206 -68 11 -65 156 174 -67 -350 -264 -115 -223 -35 365 159 260 -156 -240 -332 38 -83
7946h3K39K05j25R8k87k19j28O7J69Q7J32K15l16K40n12J01OJ00l2JK32k94J45
$$ -83 156 361 236 334 47 -172 -300 -233 -64 23 155 370 54 294 -218 -117 -111 -11 -43 -42 190 -104 41
7969D1j86K3J28L2L43k87J50l11J37k03Q0l41K29J53K67J25j97k96J44k04k78
$$ 41 -145 -122 6 38 381 94 244 -67 70 -133 -53 -394 -165 -12 255 380 183 -113 31 -173 -451
7990d51K80L22R6j41L09m93l9j39R1J27N6J56L7j96M8j06j62n9K01K11o0J78l1
$$ -451 -171 151 247 106 415 -78 -117 -256 -165 -38 18 174 211 15 63 -43 -205 -264 -63 148 88 266 235
8013B35k66p5j44J98J54j01L62n1j00k17j55O3P4P8L95j56j51L3k83q7rJ93K1
$$ 235 -31 -106 -250 -52 102 1 363 312 212 -5 -160 -97 -23 55 450 294 143 176 -107 -194 -203 -10 11
8036A1N9K24k3k32k4k33p8J31L21N8j02Q1k67M8k91J32J33M9J60J42k39m22J25
$$ 11 70 294 271 39 15 -218 -296 -165 156 214 112 193 -74 -26 -317 -185 -52 -3 157 299 60 -362 -237
8059b37J08j44K05l0K64K27k02j95j75m4L0K60l3J02K60j37k49j58j90J28l4N35
$$ -237 -129 -273 -68 -98 166 393 191 -4 -179 -223 -193 67 34 136 396 259 10 -148 -338 -210 -244 291
8081B91J18M7l53j21l02J78k60K67L93oj25M4k23Q7l59k4L74j21L21J04m1l24
$$ 291 409 456 103 -18 -320 -142 -402 -135 258 252 127 171 -52 35 -324 -348 26 -95 226 330 289 -35
8103c5r1j22R7j97L08K83j56jj01j08k32L62j14J43K12l6k34J58k42N0L07m26
$$ -35 -126 -248 -151 -348 -40 243 87 86 -15 -123 -355 7 -107 36 248 212 -22 136 -106 -56 251 -175
8125a75L02J88P8k37p7l92J53J41J23Jk2Q7l0j11j97R4j45p9O58k25K12j46j47
$$ -175 127 315 393 156 79 -313 -160 -19 104 105 83 170 140 29 -168 -74 -219 -298 360 135 347 201 54
8148E4m10J81J10l4K24Q0M5j76j87k62L75j77J99L0J08M9K9l15P9j67N5K47Q6
$$ 54 -356 -175 -65 -99 125 205 250 74 -113 -375 0 -177 22 52 160 209 238 -77 2 -165 -110 137 223
8171B23J18l39j13j26m7K30n9L20J7Q6m18J95j15l20J54R5j8L12k73K52
$$ 223 341 2 -111 -237 -284 -54 -113 207 224 310 -108 87 -28 -348 -194 -99 -117 195 -78 174
8191A74
$$ Imaginary data points
##PAGE= N=2
##DATA TABLE= (X++(I..I)), XYDATA
0@%%%%%%%%%%%%%%%%%jRj6J6j6J6j6K4l2L2l6M4m9N7o5P3q4R3j04J17j32J47j64
$$ 0 0 0 0 0 0 0 0 0 0 0 0 0 0 0 0 0 0 -1 8 -8 8 -8 8 -8 16 -16 16 -20 24 -25 32 -33 40 -44 49 -55 62 -70 77 -87
40h7J83k02K24k49K76l04L34l69M07m49M97n46N99o60P29q10R02j006J129j272
$$ -87 96 -106 118 -131 145 -159 175 -194 213 -236 261 -285 314 -346 383 -427 475 -531 598 -674
60f74J444j662J937k296K794l528M712o920J2351m8123o7450J09279j8459k5647
$$ -674 770 -892 1045 -1251 1543 -1985 2727 -4193 8158 -39965 -107415 1864 -16595 -42242
74d2242J00528J1823o5452K2262k4586p2226J5250L9846J7746L6770O108j1487
$$ -42242 58286 70109 4657 26919 2333 -69893 -54643 -14797 2949 39719 45827 34340
86C4340j2738n1459k3364K5114n713K9406O3849j8517k2072J5130o6117m1387
$$ 34340 21602 -29857 -53221 -28107 -33820 -4414 59435 40918 18846 33976 -32141 -73528
98g3528O1746M58j4553P9186R096n7176J1692k7372o4416M1528M1324j5007L9964
$$ -73528 -11782 -11324 -25877 53309 62405 5229 16921 -10451 -74867 -33339 7985 -7022 32942
111C2942K4531m1542r676k0044m9192K5018M1946J62L0363J5997l5486j3220j9345
$$ 32942 57473 15931 6255 -13789 -62981 -37963 3983 4145 34508 50505 15019 1799 -17546
124a7546l7115K2640L0182M128M0233R437m6695o982j1106m3845K4879M1078p837
$$ -17546 -54661 -32021 -1839 2289 42522 51959 5264 -1718 -12824 -56669 -31790 9288 1451
137A451K9733K5524m6468k2022l443l5575J8147M6101o454J7784L0071m2419l0822
$$ 1451 31184 56708 10240 -11782 -15225 -50800 -32653 13448 6994 24778 54849 12430 -18392
150a8392L909k8827L997N2043Q157J150K0173k5348l3119o008j6892P839L9103
$$ -18392 -14483 -43310 -39313 12730 20887 22037 42210 16862 -16257 -22265 -39157 -31318 7785
163G785J1113J0178J2631l3714k7039K050k0738M804M5799Q027J925J9496l0774
$$ 7785 18898 29076 41707 7993 -19046 -16996 -37734 -32930 12869 20896 22821 42317 11543
176A1543l8405O171q725k682M2726J6461n726J3370k0518l9792p03m74K74L5991
$$ 11543 -26862 -20691 -29416 -32098 10628 27089 21363 34733 14215 -25577 -26280 -26754 -26480 9511
190I511J9466n798O162j8056l5645k306L21K117L5088J9632p844L638j6390l5267
$$ 9511 28977 23179 29341 11285 -24360 -26666 -26345 -24228 10860 30492 22648 26286 9896 -25371
204b5371k913N713R15L0933K3097q185k525j3675l2807n105Q760L842K6670K2560
$$ -25371 -28284 -22571 -21656 9277 32374 24189 21664 7989 -24818 -29923 -21163 -17321 9349 31909
218C1909p432m877j3691l1224n223J1070N109K4377K2500q624p424j1557k9641
$$ 31909 24477 19600 5909 -25315 -30538 -19468 -14359 10018 32518 23894 16470 4913 -24728
231b4728p111J4105O394K0900K4051q736j2617r651k5398j0423J5905J1035J6079
$$ -24728 -31839 -17734 -11340 9560 33611 24875 12258 2607 -22791 -33214 -17309 -6274 9805
244I805K1535l948j6777j2879j9630r231J2363J4269J8382J5874n563j3491j3791
$$ 9805 31340 27392 10615 -2264 -21894 -31125 -18762 -4493 13889 29763 24200 10709 -3082
257c082k1637n552J5455J1392J5798J8907o382j8423j1010j7814r222J6052J6884
$$ -3082 -24719 -30271 -14816 -3424 12374 31281 24899 6476 -4534 -22348 -31570 -15518 1366
270A366J2542J4704l502j9297j4079j3757p332J4058J8441J2476J1529k873j9197
$$ 1366 13908 28612 25110 5813 -8266 -22023 -29355 -15297 3144 15620 27149 24276 5079
283E079j5878j1473m832J2008J9261J4314P676m859j6306j6557j3059j293J4550
$$ 5079 -10799 -22272 -27104 -15096 4165 18479 26155 21296 4990 -11567 -24626 -25919 -11369
296a1369J5779J3134J0409o941k0471j3212r186m549J4014K1794J0411L734l562
$$ -11369 4410 17544 27953 21012 541 -12671 -21857 -26406 -12392 9402 19813 23547 19985
309A9985j7879j7888q383K042J1877J7754J3313M585q022j8065j5033p316J74
$$ 19985 2106 -15782 -24165 -22123 -10246 7508 20821 25406 17384 -681 -15714 -23030 -22856
322b2856J3670J9429J1076K038o896j7402j6721n947L142J2779J8047J2175K35
$$ -22856 -9186 10243 21319 23357 16461 -941 -17662 -23609 -20467 -7688 10359 22534 22769
335B2769r084j5197j6364o890O169J3895J5202J1217K164j1102j7934j2585m899
$$ 22769 13685 -1512 -17876 -24766 -18597 -4702 10500 21717 23881 12779 -5155 -17740 -22639
348b2639L345J5089J7624Q768j116r617j6287j4651l806O381J4182J6744Q984
$$ -22639 -19294 -4205 13419 22187 21071 11454 -4833 -19484 -23290 -16909 -2727 14017 23001
361B3001k986r753j6045j4920k696R290J2530J4262J1753l368j5218j3368j0027
$$ 23001 20015 10262 -5783 -20703 -23399 -14109 -1579 12683 24436 21068 5850 -7518 -17545
374a7545o072P998J7873J3254N075r05j1604j8122j0838K32P351J4364J5397N963
$$ -17545 -23617 -15619 2254 15508 20583 19678 8074 -10048 -20886 -20654 -13303 1061 16458 22421
388B2421m725j2028j5721j0979L70R000J3817J4862O130p349j2260j2875j1734
$$ 22421 17696 5668 -10053 -21032 -20662 -11662 2155 17017 23147 15798 3538 -9337 -21071
401b1071q53J2560J4408J0613O405m907j5682j4127p067j18R523J6709J1740K248
$$ -21071 -21924 -9364 5044 15657 22062 17155 1473 -12654 -19721 -19839 -10316 6393 18133 20381
415B0381n199j2874j6197p536L695R460J4161J3434J760q886j1158j3451j0290
$$ 20381 15182 2308 -13889 -21425 -17730 -8270 5891 19325 21085 12199 1041 -12410 -22700
428b2700M396J3754J1421J0425N218j0317j6185q837o543j0J3874J6542P135J091
$$ -22700 -18304 -4550 6871 17296 22514 12197 -3988 -12825 -19368 -19378 -5504 11038 18173 19264
442A9264o513j5268j4275l236M684J0868J3816J0253L55j0268j3669j1478n378
$$ 19264 12751 -2517 -16792 -20028 -15344 -4476 9340 19593 19948 9680 -3989 -15467 -20845
455b0845N188J4374J2354O886J612j0532j5102r433m523L832J6012J3450M185
$$ -20845 -15657 -1283 11071 17957 19569 9037 -6065 -15498 -20021 -16189 -177 13273 17458
468A7458M07r015j6344r510j355M362J3313J4228N763j846j1140j5282o950j685
$$ 17458 17865 8850 -7494 -17004 -18359 -13997 -684 13544 19307 17461 6321 -8961 -15911 -17596
482a7596L591J5198J4241J891j519p962j7974r330L102N581J1862J4012L462l730
$$ -17596 -14005 1193 15434 17325 15806 7844 -10130 -19460 -16358 -10777 1085 15097 18559 14829
496A4829r224j5422r479J987P277J2783J3622J819m707r409j4468p892J278O353
$$ 14829 5605 -9817 -19296 -17309 -10032 2751 16373 18192 13485 4076 -10392 -18284 -17006 -10653
510a0653J5195J3601j371m176q326j7557o717P341L613J1102J7512o43r864n534
$$ -10653 4542 18143 16772 12596 4270 -13287 -20004 -12663 -9050 2052 19564 18921 9057 3523
524C523j5236j0522R283Q490O976J5119K702j1847q218j0739j0487N088J2933
$$ 3523 -11713 -22235 -12952 -4462 2514 17633 20335 8488 270 -10469 -20956 -15868 -2935
537b935J0196R149R95p220j0543j3575n462O703P257J2269J3916m116j1378m227
$$ -2935 7261 16410 17405 10185 -358 -13933 -19395 -12692 -5435 6834 20750 16634 5256 1029
551A029j3757r625J1926R295M673J6220J073j8255o166o004j2698Q737J7158K770
$$ 1029 -12728 -22353 -10427 -1132 3541 19761 20834 2579 -3587 -9591 -22289 -13552 3606 6376
565F376Q174O603j4936j4123l841n989L496J5506J0421M147p22r069j0639j1082
$$ 6376 14550 21153 6217 -7906 -11747 -17736 -14240 1266 11687 15834 15112 6043 -4596 -15678
579a5678l854J1022R812O404J2944l408j8389m122m196j3392J1005K0272o71O036
$$ -15678 -19532 -8510 1302 7706 20650 17242 -1147 -5269 -9465 -22857 -11852 8420 7749 13785
593A3785P358j9663j4825L729n990J446K0253P778j348L410j1057j7202k602O49
$$ 13785 21143 1480 -13345 -9616 -15606 -14160 6093 13871 12523 15933 4876 -12326 -14928 -14279
607a4279M418J4319R127J847k378j1653j1047m706k844R299J6119L314K809J652
$$ -14279 -9861 4458 13585 15432 13054 1401 -9646 -14352 -17196 -7897 8222 11536 14345 15997
621A5997j7481j2149L530n085L452K2466M802n773M688j1760k0028L582M469j434
$$ 15997 -1484 -13633 -10103 -15188 -11736 10730 15532 9759 14447 2687 -17341 -13759 -9290 -10724
635a0724J7074J2449o656k974o300j6758l382O970M809J2494R006k262l851j0711
$$ -10724 6350 18799 12143 9169 2869 -13889 -17271 -10301 -5492 7002 16008 13746 9895 -816
649h16j3381m06L014N504J6251O503o142q70j0101j6731K870O360Q17J5996J1200
$$ -816 -14197 -14603 -11589 -6085 10166 16669 10527 9657 -444 -17175 -14305 -7945 -7128 8868 20068
664B0068j0245l978m504j7792j044J2255J642J0042J3196p010r796m592j2234
$$ 20068 9823 5845 1341 -16451 -17495 -5240 -3598 6444 19640 12630 2834 -1758 -13992
677a3992l775J0647O495Q765R377n580q197o867j2276q43J0164N475R483R693
$$ -13992 -17767 -7120 -625 8140 17517 11937 3740 -3127 -15403 -16246 -6082 -607 8876 18569
691A8569p680q797m535j2761j735J2440N132P627J0566p768j1698k894j0453l928
$$ 18569 10889 2092 -2443 -15204 -16939 -4499 633 8260 18826 11058 -640 -3534 -13987 -17915
705a7915J3576P795M249R859n204j3707m512o765m049J2129R349M315O972m478
$$ -17915 -4339 3456 7705 17564 12360 -1347 -5859 -12624 -16673 -4544 4805 9120 16092 11614
719A1614j3312n401n965k591J1668R475L967O589n316j3611m793n120l078J2720
$$ 11614 -1698 -7099 -13064 -15655 -3987 5488 9455 16044 10728 -2883 -7676 -12796 -15874 -3154
733c154J0532J725N711l761j4637n719k450k629J0734J1548K324L698l591j4421
$$ -3154 7378 9103 14814 11053 -3584 -9303 -11753 -14382 -3648 7900 10224 13922 10331 -4090
747d090o360j009j844R763J2968J764J423l002j3505p543n00l32R782J1934J798
$$ -4090 -10450 -11459 -13303 -3540 9428 11192 12615 9613 -3892 -11435 -11935 -12267 -2485 9449 11247
762A1247J084l035j4464p194J585l02Q266J3145K144j722l327j2515p639J003
$$ 11247 12331 9296 -5168 -12362 -10777 -11079 -2813 10332 12476 10754 7427 -5088 -12727 -11724
776a1724J816Q406J2263J641k327l315j1842q743K214L299P451J0991L146k815
$$ -11724 -9908 -1502 10761 12402 10075 6760 -5082 -13825 -11611 -8312 -861 10130 13276 10461
790A0461n017j1669p336L021K575P489J2446J305n070l347j0322r406L611O100
$$ 10461 5444 -6225 -13561 -10540 -7965 -476 11970 13275 8205 4858 -5464 -14870 -11259 -5159
804e159N311J0234M008n443o433q687p587K392N763P158R402K727n710n984q843
$$ -5159 152 10386 14394 8951 2518 -6169 -13756 -11364 -5601 1557 10959 13686 7976 1992 -6851
819f851p416L354O603O196R404K887p003o312p838p008K697P978P044P028K650
$$ -6851 -14267 -10913 -4310 1886 11290 14177 7174 862 -6976 -13984 -11287 -3309 3735 10763 13413
834A3413n772p701q429n103L602O867O780P911K063p735p092o270o385L149R683
$$ 13413 7641 -60 -8489 -13592 -9990 -3123 3657 11568 13631 5896 -1196 -7466 -13851 -10702 -1019
849a019O140N357K684o630r332o196l390K268Q616P928M926O93o179q658o941
$$ -1019 5121 10478 13162 6532 -2800 -8996 -12386 -10118 -1502 6426 11352 12045 5866 -2792 -9733
864i733k672L471P697P740N461p39o817p550o376l784N069R260N499M504J012
$$ -9733 -12405 -8934 -1237 6503 11964 11225 4408 -3142 -9518 -13302 -8233 1027 6526 11030 12042
879A2042q390q718m259k691K802J0364P905J841m95n622j0429n301L65L542P632
$$ 12042 3652 -5066 -9325 -12016 -9214 1150 9055 10896 10401 4779 -5650 -10951 -10586 -7044 588
894E88Q406L269k722o957p301o279p48O027P565O644L518k236q026p933m325r16
$$ 588 8994 12263 9541 2584 -4717 -10996 -11744 -5717 1848 8492 12010 9774 1748 -6185 -10510 -11426
910a1426N232R709N443J791j432p899r130l096O33M223R159P894j89l571n801
$$ -11426 -6194 3515 8958 10749 9317 1418 -7712 -10808 -10175 -5952 3207 11101 10912 7341 1540
925A540q552n292K730N891O234P498K405n378q044o171m011R35O984Q236M508
$$ 1540 -7012 -12304 -9574 -3683 2551 10049 12454 7076 -968 -7139 -11150 -10215 -3231 5005 9513
940I513J263l254q324q086k147K024N211R137N271p36l576o881q723k128L527
$$ 9513 10776 7522 -802 -8888 -11035 -9011 -3800 5337 10608 9872 6296 -585 -9308 -11436 -7909
955g909N355P682O680j394o247n688o374l916L397P872O366M192P74o191q563
$$ -7909 -2554 5128 11808 10414 4167 -1521 -7895 -11811 -8414 -542 5824 10016 10790 4599 -3964
970c964n034j178K257O985P971L716j380m682q303o674k48M161O158P001M323
$$ -3964 -8998 -10176 -7919 -934 7037 10753 9373 4691 -3612 -10286 -10534 -6373 -215 6786 11109
985A1109k007n799o715o400j746N456P668N716L213j628o494p011m845j001M374
$$ 11109 9102 3303 -3412 -9812 -11558 -6102 1566 7282 10495 8867 2373 -4638 -9483 -10484 -6110
1000f110P526P153K335k672o801o664m068o53M430P510O170K556k548p163p096
$$ -6110 1416 8569 10904 8232 1431 -5233 -9301 -9954 -5524 1986 8156 10712 8164 1001 -6095
1015f095l722O14M967O920N244K320k288o963p879l696J500N412P058N382J303
$$ -6095 -9817 -9203 -4236 2684 7928 10248 7960 997 -6882 -10578 -9078 -3666 3392 8774 10077
1030A0077l597o172o379m399Q66O564P583M466P85l473p947n413k185L13N554
$$ 10077 6480 308 -6071 -10470 -9604 -3040 4543 9009 9794 6321 -1626 -7039 -9224 -8911 -3357
1045c357Q635M120L5l460p336p299q17K491L993P635N601j123m152o265o821k819
$$ -3357 5278 9398 9433 5973 -1363 -8662 -9479 -6988 -2995 4640 10241 9118 4966 -1299 -8120 -10939
1061a0939M120O356N327M104O25m732p893m961j552J404P335Q493J243j443k668
$$ -10939 -6819 -463 4864 8968 9593 4861 -3032 -7993 -9545 -8141 -806 7687 8930 7487 4819
1076D819p883o301Q72K360M503Q775L980m182m305m949p307j87N130M507N787
$$ 4819 -3064 -9365 -8493 -6133 -1630 7145 11125 6943 2638 -2311 -9618 -9805 -4675 -168 5619
1091E619N166k300p065n362m694j017M258P008N201K136r93n206p784m692J541
$$ 5619 10785 8485 1420 -3942 -8636 -9653 -5395 1613 6814 8950 7957 2751 -5033 -9725 -8184
1106h184L196N711P805J396m689l498n277p166J832O345L422O429M432n941o839
$$ -8184 -4988 723 8528 9924 5235 1737 -3540 -10706 -8874 -2529 893 7322 11754 5813 -1026
1121a026k898n075j059P284O090L130L638l094p990n314k047L34M895O714M556
$$ -1026 -3924 -8999 -10058 -2774 3316 6446 10084 6990 -1000 -6314 -8361 -8027 -3132 3582 8138
1136H138R52l934n018o520m289L236O205M008N334K250o543n767k833m807N70
$$ 8138 9090 5156 138 -6382 -10671 -7435 -1230 2778 8112 10362 3819 -1948 -4781 -9588 -9018
1151i018R099M834J693L269m454q982k920j317m62P146P348J394N70k988q094
$$ -9018 81 4915 6608 9877 5423 -3559 -6479 -7796 -8258 -1112 6236 7630 8200 5212 -2882
1166b882n110n09J940N628N942L575k54m985o376l934k085K486P432M820J617
$$ -2882 -7992 -8501 -6561 -933 5009 8584 8330 3345 -3031 -6965 -9050 -6564 868 5688 7305
1181G305J230n283p946k285n40N60P783O608j06l42k993q898l776J866J216N714
$$ 7305 8535 3252 -4694 -6979 -7519 -6959 824 7432 7326 6984 3991 -4907 -8683 -6817 -5601 113
1197A13P508O09k152l438p075m349J480K973N434O122J055k051m424p147l015
$$ 113 7621 8230 6078 2640 -4435 -8784 -7304 -4331 1103 7225 8280 6229 1805 -5342 -8357
1212h357J398K440O504N969Q2k417l446q027l100K764K133N748O665k73l859k543
$$ -8357 -6959 -4519 1985 7954 8036 5619 2173 -5854 -8954 -6190 -4057 1691 8356 8083 4224 1681
1228A681p313l965L478L674M447O160L89m499l511o049l744L052M294M403N751
$$ 1681 -5632 -9597 -6119 -2445 2002 8162 8551 4052 541 -5508 -9252 -6200 -1906 2497 8248
1243H248k65m160m252n447l174K967M562M539N544o88m840l796n516l132L915
$$ 8248 7983 3823 -429 -5876 -9050 -6083 -1521 3018 8562 7874 3034 -762 -6278 -9410 -5495
1258e495N101L625N041j68n312m327m410l378L978N436L436M627R4o255m508l231
$$ -5495 -394 3231 8272 8104 2792 -1535 -5945 -9323 -5345 91 3527 8154 8248 1993 -2515 -5746
1274e746l309L569O347L504L648j74n760m926l725k399M041O158L208L404j25
$$ -5746 -9055 -5486 861 4365 8013 7839 2079 -2847 -6572 -8971 -4930 1228 4436 7840 7715
1289G715o426n083k195k564L873O440L368K541j89o401n390k186j498L752O865
$$ 7715 1289 -3794 -5989 -8553 -4680 1760 5128 7669 7480 1079 -4311 -6497 -7995 -4243 2622
1304B622K890J800n37o082n385k120p90L551O650L328J390q50n979n792r91n02
$$ 2622 5512 7312 6775 693 -4692 -6812 -7602 -4051 2599 5927 7317 6467 488 -5304 -6295 -6797
1320f797K974P190L162M79j338n598n636j419L44L410O758L191j0j302n833o017
$$ -6797 -3823 3367 6529 7008 5670 72 -5564 -6983 -6639 -3229 3529 6720 6710 5408 -425 -6442
1336f442o94P43L477O669L791j062k002m825o041q06J407L330O389L706r35k680
$$ -6442 -7136 -6393 -2916 3753 7544 6482 4480 -345 -6386 -7192 -5785 -2455 3934 7640 6705 4025
1352D025n153n042j113K007L611N948L214j173k285n653n261r2J921L519O093
$$ 4025 -1128 -6170 -7283 -5276 -1665 4283 7497 6324 4039 -1614 -6875 -6967 -5046 -1527 4566
1367D566L412k496k420m429n764l41L417L321N132L701j831m176m100m670j105
$$ 4566 7978 5482 3062 -1367 -7131 -7472 -4055 -734 4398 8099 6268 2092 -2008 -6678 -7783
1382g783L713M328M448K682j236m125m961l765p6K849M595M890K281k694l558
$$ -7783 -4070 258 4706 7388 6152 2027 -2934 -6699 -6775 -3926 669 5559 7840 5146 1588
1397A588m455m811R20M101L230M688K949l161m640l362m162n32N046M369L360
$$ 1588 -2867 -7678 -6758 -2657 573 5261 8210 5049 409 -2953 -7115 -7647 -2601 1768 5128
1412E128K414j912n890l643k421p08M170N360L410R33j894n030m535k100R86L436
$$ 5128 7542 5630 -260 -3903 -6324 -7032 -2862 2498 5908 6841 4947 -83 -4618 -6718 -5732 -2296
1428b296M462M407Q17l588m241l388l846J295N315L623K838K281l120o185l205
$$ -2296 2166 6573 7390 3802 -439 -3827 -7673 -6378 -1063 2560 5398 7679 4559 -1626 -4831
1443d831j473Q4M631N469K072O7j686n342m726r50J519L683N409L069r20l061
$$ -4831 -6304 -6220 -1589 3880 5952 6019 4333 -1009 -5735 -6685 -5166 -1483 3926 6995 6075 3014
1459C014m361m026j730K104M487M319K488K94m037n056k766j537J671N288M500
$$ 3014 -1347 -5373 -7103 -4999 -512 3807 6295 6589 2552 -2504 -5270 -6807 -5136 152 4652
1474D652J314J9l036n864l188L97J344M024N613J296j594k510m783m434K16L327
$$ 4652 5966 5985 2949 -2915 -6103 -5706 -4362 -338 5275 6571 4977 2467 -2316 -6750 -6534 -3207
1490c207L819L830K359j349m451l903k871r54K728N451L827P40r25m101m723k240
$$ -3207 612 4442 6801 5452 1001 -2902 -5773 -6727 -3999 1452 5279 6019 5094 993 -3730 -5970
1506e970M87K302M417M467J064k206l948m454k680Q43L206M062L661J548k489
$$ -5970 -5483 -3181 1236 5703 6767 4561 613 -3841 -6521 -5678 -2472 1590 5251 6799 4310
1521D310l960m411k675R66L815M420K752J086k127m401m151j978P99L281N126
$$ 4310 350 -4061 -6736 -5770 -1955 2465 5217 6303 4176 -225 -4376 -6354 -5555 -2274 2852
1536B852L219k46k206m135l969j911J256L488M396L274J91l110m395l529j700
$$ 2852 6071 5825 3619 -516 -4485 -6396 -5140 -1652 2744 6018 6209 3099 -1296 -4825 -6525
1551f525J673L762M017K939q7k526m538l968j287K385L344M154K722q8l570m159
$$ -6525 -4852 -1090 2927 5866 5779 3253 -1285 -5253 -6540 -4155 -811 3343 6065 5977 2407 -1752
1567a752l092j741K190M376L777K153m65l055m721k890m86J746L909M251K122
$$ -1752 -4844 -6585 -4395 -19 3758 5911 5446 2391 -2330 -5220 -5706 -3960 -51 4200 6322
1582F322j174l001m836l018k00K480L655L964K200j511l785l730k846p49L292
$$ 6322 5148 2147 -2689 -5707 -5907 -3427 228 4192 6392 4881 1096 -2634 -5480 -6229 -2937
1597b937M233K772J950p11m250m632j595o91K346N280L409L80j287l123m467k866
$$ -2937 1296 4068 6018 5307 1057 -3575 -5170 -5861 -3515 1765 5174 5554 4267 1144 -3323 -6189
1613f189J026K576L937M154P25k523l321l787k694O63L587L815K858J149j924
$$ -6189 -5163 -2587 1350 5504 6229 3706 385 -3402 -6096 -5433 -1846 1969 4827 5976 4052
1628D052m533l676j148J74K954N002K443j31j106m047m829r68J696K157M396L522
$$ 4052 -481 -4157 -5305 -5131 -2177 2825 5268 5137 4031 -16 -4845 -5813 -4117 -1960 2436 5958
1644E958p57k477l266l715k036J995L353L258L302J18l270l866k848j806J466
$$ 5958 5201 2724 -542 -4257 -6293 -4298 -945 2313 5615 5733 2463 -1403 -4251 -6057 -4591
1659d591M192L868K159n84k126m574l542k10J676K982M348K514j525k553l140
$$ -4591 -399 3469 5628 5044 2918 -1656 -5198 -5408 -3732 -750 3598 6112 4587 2034 -1106
1674a106m394o93L048L204L152K706q39l921l022k767j203K678L990K754K086
$$ -1106 -5500 -6193 -3145 59 3211 5917 5078 1157 -1865 -4632 -5835 -3157 833 3587 5673
1689E673q82l249m341k197k04K015L854L743J249j731k924l674k817Q8L173L121
$$ 5673 4791 1542 -2799 -4996 -5200 -3185 669 4412 5661 3930 1006 -2668 -5485 -5397 -2224 897
1705H97L044K027j994l676l165k103p09L835L883K015J586j411m316l387j400
$$ 897 3941 5968 3974 298 -2867 -4970 -5679 -1844 2039 4054 5640 4229 -87 -3474 -4874
1720d874l05K784M615K484J58j247l600l844j403N82L011L786K537Q08k189m078
$$ -4874 -5179 -2395 2220 4704 4862 3615 15 -3829 -5232 -4650 -1639 2147 4684 5492 3303 -775
1736g75k831j534L68L317M167K243J10j800m281l141p07M11L195M585J414l1j598
$$ -775 -3606 -5140 -4772 -1455 2712 4955 5065 3265 -1016 -4157 -4864 -4453 -1258 3327 4741 4710 3112
1753C112m032l620l20J104K740M336J821l93k233l640l410l28J195L108L909K112
$$ 3112 -920 -4540 -4860 -3756 -1016 3320 5141 4748 2515 -1125 -4535 -4863 -3668 -560 3349 5461
1769E461j105j974l979l021k13J394L045M271J240q46j877m421l047M05J747L014
$$ 5461 4356 2382 -1597 -4618 -4831 -3437 -392 3879 5119 4273 2396 -2025 -5072 -4667 -2920 94
1785I4L867J375j603k188l345l089L7K372K740L634J478j836k615l122k982N11
$$ 94 3961 5336 3733 1545 -1800 -4889 -4852 -2480 260 3894 5372 3536 921 -2201 -5183 -4672
1801d672K454K842L500J146j848k767l037k695N37K519L090K995J267k157k970
$$ -4672 -2218 624 4124 5270 3422 655 -2382 -5077 -4540 -2021 1069 4064 5331 3174 204
1816B04k754k651N45L299K590L353P77k415k931k939k148P69K982K629L090Q37
$$ 204 -2550 -5201 -4656 -1357 1233 4586 5363 2948 17 -2922 -5070 -4301 -1319 1310 4400 5237
1832E237k396l077l014j857Q03L398K900K400P79k657l369k453j745Q55L341K942
$$ 5237 2841 -236 -3250 -5107 -4304 -906 1994 4394 5173 2516 -853 -3306 -5051 -4196 -855 2087
1848B087K367N24k829l102k353j527J085L480L091J381O86k685l835k105q09Q38
$$ 2087 4454 4978 2149 -953 -3306 -4833 -3748 -268 2823 4204 4890 2205 -1630 -3735 -4544 -3706
1864c706L819K902J307J91k255m135k181n94R97L712K982J522k97k640l724k043
$$ -3706 113 3015 4322 4513 2258 -1877 -4058 -4652 -3655 57 3039 4561 4264 1624 -2100 -4143
1880d143l99J516L727K635J093j51l084l912j216m69J183L863L065O96p06k189
$$ -4143 -4542 -3026 701 3336 4429 4278 1194 -2718 -3934 -4403 -3220 643 3708 4404 3698 1509
1896A509m291j688M86J363L399L218M10r68k387l811j887M21K195L100K851O70
$$ 1509 -2782 -4470 -3984 -2621 778 3996 4406 3438 1051 -2760 -4647 -4226 -2031 1069 3920 4590
1912D590j222k967l108j487j31K328L824K367J13j155k693m035j071J274J399
$$ 4590 3368 401 -2707 -4194 -4325 -1997 1827 4194 4307 3152 459 -3576 -4647 -3373 -1974
1927a974L529K801k07j451k734l332j522J437K314K490K990M35k564k861k447
$$ -1974 1555 4356 4149 2698 -36 -3368 -4890 -3453 -1139 1351 4341 4776 2212 -649 -3096
1942c096j663J046L080K972J886K82j816l438k859j042J663K081L296K234q04
$$ -3096 -4759 -3713 -633 2339 4225 4507 2691 -747 -3606 -4648 -2985 -904 2392 4626 3822
1957C822k104k652k849p60J776K509K330K646l25l233k520j988j412J856L282
$$ 3822 1718 -934 -3783 -4543 -2767 -258 2072 4718 4393 1160 -1360 -3348 -4760 -2904 378
1972C78J868J835K08k728l238j867q51J555L302K451J373n20k346l242k249j51
$$ 378 2246 4081 4289 1561 -1677 -3544 -4395 -2840 462 2913 4286 3766 1420 -1822 -4071 -4222
1988d222J865K721K857J454j177k908k261k248p11K744K978J727J706p82l548
$$ -4222 -2357 364 3221 4675 3498 590 -1671 -3919 -4630 -1886 1092 2819 4525 3743 195
2003A95k575j288r3J613L384K138L75m67k502l601j320P56J739K773K555N31j353
$$ 195 -2380 -3668 -3761 -2148 1236 3374 3749 3282 780 -2821 -4141 -3385 -1646 1127 3682 4213 2860
2020B860k700k808j864O02K780K788K015P80j565l101k559j207n0K581L547J282
$$ 2860 160 -2648 -4512 -3910 -1130 1658 3673 4453 2888 -213 -2772 -3979 -4029 -1448 2099 3381
2036C381O50j079l471k775n10L57K186L041K288k26j737k871k637r00J547K015
$$ 3381 4031 2952 -519 -3294 -3804 -3447 -1261 1780 4068 3842 2105 -766 -3403 -4303 -2756 -741
2052g41K363K178J31k075k920k261q40J189K722K805J384l22j940k752k516j07
$$ -741 1622 3800 3931 1856 -1064 -3325 -4165 -2976 -254 2551 3935 3613 1673 -1079 -3595 -3702
2068c702O93K785K753J536p20j947k635k253n09J705K359K696J493j029k095k904
$$ -3702 -3009 -224 2529 4065 3345 1398 -1237 -3490 -3999 -2294 65 2761 4254 3225 1130 -1774
2084a774j763m29J753K598K486J261q89k271k621k327K52J675K558K607J137j150
$$ -1774 -3537 -3966 -2213 385 2871 4132 3243 972 -1649 -3976 -3724 -2049 509 3116 4253 3103
2100C103k434k448k002p8J771K954K343Q31j220k292k588j669J24J913K627K427
$$ 3103 669 -1779 -3781 -3859 -2088 866 3209 4040 2820 528 -2060 -3729 -3605 -1692 935 3362
2116C362N12j272k342k694j821Q55K116K483K058P58j618k895k164j147N63J955
$$ 3362 3874 2602 260 -2434 -4255 -3400 -1284 1199 3257 4015 2397 -498 -2662 -3809 -3246 -1291
2132a291K899J537L52j255k555k621o45L65K210K915J558J61j657k257k756q00
$$ -1291 1608 3145 3497 2242 -313 -2934 -3579 -3214 -1004 1911 3469 3630 1973 -284 -3040 -3840
2148c840R06K388K276J992J22k196k554k024q76Q17K570K525J243K17j817k805
$$ -3840 -2934 -546 1730 3722 3844 1648 -906 -2930 -3806 -2989 -419 2106 3349 3566 1749 -1056
2164a056k119p7L78K587K803J173m90j642k516k485j74J286K456K393J425p69
$$ -1056 -3175 -3252 -2874 -287 2516 3689 3199 1557 -959 -3444 -3618 -2332 124 2517 3942 3173
2180C173k247k544j968l39J585K747K303R27k53k391k905j362j85R30L242K119
$$ 3173 926 -1618 -3586 -3925 -2340 407 2710 3637 3384 993 -1912 -3274 -3459 -2529 713 2832
2196B832N68n77k066k697j556L82J360K606K018P13r56k062k429j802K37J955
$$ 2832 3400 2823 757 -1940 -3496 -3114 -1754 852 2870 3583 2627 565 -1864 -3666 -3429 -1474
2212a474K117K260J113j472k411k323r95L5J808K423K101L39j179k389k489r85
$$ -1474 643 2903 4016 2544 133 -2190 -3185 -3150 -1342 1081 3182 3521 2342 -47 -2536 -3521
2228c521N88J832K469K084j22j149k188k142j782J023J898K545K010K51j799k484
$$ -3521 -2933 -1101 1368 3452 3330 2181 -7 -2149 -3931 -2908 -1010 1535 3545 3796 1997 -487
2244d87k123q99R57J716K394J881j20j659k131k251p95R19K220K343J496k96j912
$$ -487 -2610 -3509 -2552 -836 1558 3439 3319 1660 -471 -2722 -3517 -2598 -378 1965 3461 3165 1253
2261A253k198j993p88J088K408K352J343j78k202k234j969o95J643K078K382J192
$$ 1253 -945 -2938 -3726 -2638 -230 2122 3465 3287 1085 -1149 -3118 -3813 -2170 -92 2290 3482
2277C482m02k038k368j685o13J590K640J889R16o51j911k238j456k34J185K264
$$ 3482 3080 1042 -1326 -3011 -3624 -2034 606 2495 3411 2760 849 -1389 -2845 -3079 -1894 370
2293C70K027R69n89k028k477j291k87J490K459J889O82m70k148k712j292L98J652
$$ 370 2397 3366 2777 749 -1728 -3019 -3306 -1816 643 2532 3214 2744 596 -2116 -3408 -3010 -1358
2310a358K339J718N47o26k345k226j159K36J496K451J777L30q34k320k418r40
$$ -1358 981 2699 3246 2620 275 -1951 -3110 -2874 -1378 1073 2850 3180 2346 26 -2392 -3332
2326c332N45J622K397J774M5j009k199k276r96Q50J657K100K016qj461j940k392
$$ -3332 -2787 -1165 1232 3006 3051 2042 -157 -2433 -3429 -2579 -922 1178 3194 3186 1725 -215 -2607
2343b607o92P32J643K652J412p6j236k255k160n99J062J600K121J524j19j662
$$ -2607 -3299 -2567 -924 1728 3140 3064 1828 -427 -2587 -3186 -2124 -524 1597 3121 3002 1340
2359A340j927k127n54J037J970K249Q64pj604k215j836m97J274J915K051J361
$$ 1340 -587 -2714 -3268 -2231 -261 1988 2852 2845 1241 -974 -2810 -3307 -2033 -118 1933 3294
2375C294n06j539k364j656m17J292K067J976J299m09k005k140j823k32J391K237
$$ 3294 2788 1249 -1115 -2771 -3188 -1896 171 2147 3446 3037 1032 -1108 -2931 -3163 -1772 465
2391D65J495J252n83k063j994j546J89J150K389J386R57o47k084j960j132k71
$$ 465 1960 3212 2629 566 -1428 -2974 -2785 -1635 754 2140 3097 2450 366 -1594 -2726 -2997
2407b997J563K115J821P54j039j948j710j652M5J816K195J528P43r58k331k021
$$ -2997 -1434 681 2502 3256 2217 269 -1441 -3093 -3048 -1232 963 2491 3234 2276 -55 -2076
2423b076o27J8J424K589J355l2o76k023k198p43P06J455J964J731j48q37k080
$$ -2076 -2703 -2685 -1261 1328 2683 2651 1975 -48 -2246 -2989 -2283 -828 1136 2867 2719 1882 -198
2440a98j914r57M48K172J885J145K37j114k391j508n94J12K132K328Q62K6j013
$$ -198 -2112 -3069 -2621 -449 1436 2581 2818 1704 -687 -2195 -2789 -2677 -545 1783 2645 2671 1658
2457A658k414j898l01P74J617K210J299m24j221j986j803m68J046J892J706J272
$$ 1658 -756 -2654 -2955 -2181 -564 1646 2945 2521 1300 -686 -2489 -2957 -1911 -19 1687 2959
2473B959l12j738j920j506m17Q77K369J934M01k59j361k322j601L82P01J774K322
$$ 2959 2647 909 -1011 -2517 -2934 -2057 312 2246 2647 2388 1027 -1295 -2896 -2514 -1813 -39 2283
2490B283Q70q51j398k161j938L22J489J441J867J223p48j826j842j383k84J337
$$ 2283 3153 2302 904 -1257 -3195 -2873 -1384 57 1924 3147 2399 573 -1269 -2652 -2936 -1599
2506a599K354J059J103o32j767k359q63J92J078K025J868M36j182j084k396j494
$$ -1599 755 1814 2917 2285 518 -1841 -2704 -2512 -1434 591 2459 2895 1713 629 -1767 -3261
2522c261P45J560J579J816O22j607j611j722q98K84J700J754J559L40j364k007
$$ -3261 -2516 -956 623 2439 3061 1454 -157 -1879 -2777 -2493 -793 961 2520 2860 1496 -511
2538e11j490p40L57J666K164J133k73p07j971j718q34Q90J613J561J468j32j336
$$ -511 -2001 -2741 -2384 -718 1446 2579 2306 1599 -372 -2090 -2924 -2034 -421 1140 2608 2476 1140
2555A140j413j540j210R27J683J916J101r9j417j887j412l88N92J717K076R55
$$ 1140 -273 -1813 -3023 -2096 -413 1503 2604 2505 1088 -799 -2211 -2599 -2007 -290 1786 2741
2571B741k18j343j904j748j37P64J735J884J081m68j301k012j423l81J267J509
$$ 2741 2523 1180 -724 -2472 -2609 -1845 -110 1774 2855 2387 1086 -926 -2349 -2730 -1463 46
2587D6J635J047m76j372k168j230q1R63K120J389P68m69j509k075j247m3J329
$$ 46 1681 2728 2252 880 -1288 -2518 -2599 -1636 484 1873 2641 2172 663 -1412 -2659 -2702 -1373
2604a373J871J532P04p45j551j841j126K2J323J888J452M73p19j704j982n61L9
$$ -1373 498 2030 2734 1989 438 -1403 -2529 -2507 -1184 704 2156 2629 1910 206 -1776 -2337 -2298
2621b298J161K093R85N88m69k057j550j069J22J438K077J391K5n81j806j855r77
$$ -2298 -1137 956 1941 2529 2060 3 -1547 -2616 -2494 -1056 1021 2412 2437 1856 50 -1805 -2782
2638b782O67J194K267J041R8j065j768j732m35L23J758J823Q90J20r74j851j453
$$ -2782 -2115 -921 1346 2387 2485 1420 -348 -2080 -2515 -2192 -434 1389 2279 2399 1425 -426 -1879
2655a879p61P39J503J650J056K41j336j943j416m59P25J469J926R68k32j290j498
$$ -1879 -2640 -1901 -398 1252 2308 2549 1213 -730 -2146 -2605 -1880 -411 1515 2483 2251 961 -537
2672e37j584l19P09J506J931Q72m87j194j592j832K22Q00J541J503J079m22j412
$$ -537 -2121 -2440 -1731 -225 1706 2578 2091 897 -695 -2527 -2305 -1505 36 1539 2618 2196 784
2689G84j784j285l84J351J534J640O97m48j506j833j037l4Q99J831J633N06m93
$$ 784 -1000 -2285 -2669 -1318 216 1856 2553 2105 599 -1234 -2271 -2305 -1406 425 2058 2564 2071
2706B071j749j303j515K22J042J416J871Q08j053j646j444j228M21J060J942J281
$$ 2071 322 -981 -2496 -2274 -1232 184 2055 2863 1810 164 -1280 -2508 -2087 -1027 915 2196
2722B196K40n59j694j703q04R1J168J843J047N94o47j650j890o17L21J275J718
$$ 2196 2436 1877 183 -1520 -2324 -2233 -1065 778 1825 2419 1772 122 -1768 -2385 -2064 -789 929
2739I29J569J3j074j590j590o83K99J592J620J173J5r40j570j376q32L37J531
$$ 929 2498 2511 1437 -153 -1743 -2426 -2127 -535 1085 2258 2273 1333 -237 -1613 -2445 -2108 -577
2756e77J944R14Qr22j950j316n13P48J280J663J139j24j237j372j712l31O72J773
$$ -577 1367 2281 2289 1367 -583 -1899 -2412 -1664 -384 1279 2418 2294 1057 -315 -2027 -2358 -1686 87
2774H7J459O87l6j341j600j335k54O74J463J534J136k76j340j591j156m98R82
$$ 87 1546 2233 2197 856 -744 -2079 -2333 -1659 -196 1338 2474 2198 858 -733 -1889 -2387 -1405
2791a405J490J515P47m85j128j635j100j57Q72J590J289O85n61j197j532j168
$$ -1405 85 1600 2347 1862 734 -901 -2001 -2158 -1286 304 1593 2278 1717 520 -1012 -2180
2807b180L4Q78J501J867K71p19j360j704p50K16J044J631J021N40p07j207j520
$$ -2180 -2146 -1268 233 2100 2371 1652 292 -1412 -2162 -1946 -902 729 1750 2290 1583 376 -1144
2824a144j097J47J094J612J363M50j009j317j485q19J61J562J411Q89M00n96j851
$$ -1144 -2241 -2094 -1000 612 1975 2425 1416 99 -1386 -2205 -2044 -482 929 1818 2218 1622 -229
2841b29j467n20L53J372J244J353J65j005j569j281p00M36J278J632Q50M14j005
$$ -229 -1696 -2216 -1863 -491 753 2106 2271 1266 -303 -1584 -2284 -1848 -570 1062 1912 2326 1321
2858A321j904j185k75L36J393J595Q69j0j192j486j238l21N85J324J474P58M2
$$ 1321 -583 -1768 -2043 -1707 -314 1281 2150 2140 948 -538 -1776 -2097 -1512 -188 1286 2044 2086
2875B086r58j707j429j02M24J496J290J077k27j056j518j481m4P93J367J588O47
$$ 2086 1128 -579 -2008 -2110 -1686 -190 1100 2177 1950 894 -624 -2105 -2149 -1356 11 1599 2246
2892B246m80j070j509j425K82L57J679J467M49m1j287j429j139n4N69J544J275
$$ 2246 1766 696 -813 -2238 -1956 -1599 80 1547 1996 1955 668 -761 -1900 -1954 -1385 159 1434
2909A434L63j02j352j177j214Q3J081J261J462M96j060j109j220j082J60J126
$$ 1434 1797 1695 343 -834 -2048 -1965 -884 377 1839 2335 1275 166 -1054 -2136 -1976 -850
2925h50J357J297M65o23j411j451q23J73J185J436J155K47j111j044j513o96M02
$$ -850 507 1804 2269 1646 235 -1216 -2039 -1866 -681 755 1910 2157 1046 2 -1511 -2207 -1805
2942a805J427R34J297K64r95j161j366q48M60J113J338J191J45q45j471j101m57
$$ -1805 -378 556 1853 2117 1122 -39 -1405 -2253 -1793 -680 658 1849 1994 1149 -322 -1423 -1880
2959a880K95Q87J745J050l95n29j459j416m06P03J214J220J168j76j363j071j183
$$ -1880 -1585 -698 1047 2097 1702 1173 -286 -1702 -2108 -1405 -191 1029 2197 2021 658 -413 -1596
2976a596m59N55J540J064N79K94j122j291j204m71M98J487J517L15Q3j116j339
$$ -1596 -2055 -1500 40 1104 1683 1977 855 -436 -1640 -2111 -1613 -126 1391 1706 1789 673 -666
2993f66j043k92N62J396J516N27l03j219j237j022k57J074J282P75J060l67j428
$$ -666 -1709 -2001 -1439 -43 1473 2000 1697 478 -759 -1781 -2038 -964 318 1093 2153 1786 358
3010C58j166q07n00J019J460J139J99j02j157j543q58K78Q33J282J318L26r57
$$ 358 -808 -1615 -2115 -1096 364 1503 1702 1600 443 -1100 -1958 -1680 -847 435 1753 2079 1122
3027A122q31j673o20M41P19J110J304O86p93j618q47r52K77P88J841O89L33n54
$$ 1122 291 -1382 -2002 -1561 -842 268 1572 2258 1465 -153 -1000 -1952 -1675 -887 954 1643 1976 1422
3045A422j257j588n53M58O15J844Q91m76j49j157j488l55J39J309R14J199J03
$$ 1422 165 -1423 -1976 -1518 -903 941 1832 1356 1207 50 -1438 -1793 -1654 -345 569 1768 1871
3062A871r68j043j378p29Q28J214J205M68L66r74j371r38l47N99R82J306N90j62
$$ 1871 903 -140 -1518 -2247 -1419 -205 1000 1468 1834 860 -511 -1449 -1796 -1197 -215 1091 1681 1519
3080A519p64j246j286q8O66J128J227O02k5j336j206m58o90Q79J148J295M44k33
$$ 1519 755 -491 -1777 -1865 -1199 -71 1156 1758 1733 397 -809 -1267 -1957 -1078 70 1365 1809 1576
3098A576q15j301r78l63Q89J181J160M72o60q63j096r15rQ58J241J022M64m78
$$ 1576 761 -540 -1518 -1881 -992 189 1349 1821 1161 298 -798 -1713 -1722 -864 377 1399 1863 1385
3116A385j167j022p02k46Q97J201J029N41n66j106j185o53k31O91J702Q35K82
$$ 1385 218 -804 -1506 -1752 -855 346 1375 1916 1350 244 -941 -1594 -1825 -1134 568 1403 1685
3133A685m26j331q99o18J12R97R18R73N26n51j330j151q94L92J128J108P91P6
$$ 1685 1259 -72 -971 -1589 -1477 -480 438 1411 1937 1386 56 -1095 -1989 -1597 -469 639 1430 1506
3151A506n65j018j067o04J73J175R61R74K83q02j008j315l76M87Q24J186R11j5
$$ 1506 941 -77 -1144 -1748 -1575 -400 561 1535 1818 1016 8 -1307 -1683 -1196 -372 814 1725 1710
3169A710j045q56j263l21M30R85J316P18j62o42j427r15j59M91J089J021P92k37
$$ 1710 665 -191 -1454 -1775 -1345 -360 956 1674 1512 870 -557 -1472 -1631 -1140 -51 970 1762 1525
3187A525r26j092p30m45L80J213J092N34L2r83q84j220j46N44J288R72N79l32
$$ 1525 599 -493 -1223 -1668 -1288 -75 1017 1551 1583 600 -284 -1504 -1650 -1106 182 1154 1733 1401
3205A401r43j044j021kP17Q73J325M50m28j029j134n63j58M19J339J076M94l78
$$ 1401 458 -586 -1607 -1609 -892 -19 1306 1756 1328 299 -835 -1398 -1556 -1137 202 1278 1772 1394
3223A394r81j198o28n3O63R49J336J44n29o26j371o97o9R59J058Q69Q14q47j152
$$ 1394 413 -785 -1413 -1466 -803 146 1482 1626 1097 471 -900 -1597 -1666 -707 351 1220 2034 1187 35
3242C5q07p34K04O05J268N74M32n74j084j082k57K69P03J148P50Q6q26q83j206
$$ 35 -772 -1506 -1302 -697 571 1145 1577 1003 -81 -1163 -1420 -1151 -448 700 1450 1536 710 -173 -1379
3261a379q0L30P08J210P58j44o43j140q87m92O24P92J218P80j89r23p12r63m87
$$ -1379 -1459 -1129 -421 789 1547 1403 760 -380 -1267 -1759 -1135 -343 875 1655 1466 543 -169 -1132 -1619
3280a619M16R29J218N27o1o83j275n65m18K63J093R63P94q6r51j249o74l01N54
$$ -1619 -1203 -274 944 1471 1410 727 -548 -1113 -1531 -1268 -175 788 1582 1496 545 -704 -1378 -1679 -1125
3299a125R84J191O42n51p27j179o67q6N98Q79J139K81m9r65q44r96M8Q20P46J095
$$ -1125 -141 1050 1692 1141 414 -765 -1432 -1518 -920 -41 1098 1379 1330 365 -479 -1475 -1427 -607 139 1234
3319A234L87l50j073j035p32K56L36J279Q22M02k58r86j079p72P5O51J482M65
$$ 1234 1621 1271 198 -837 -1569 -1313 -977 302 1124 1526 1268 282 -797 -1569 -1494 -843 639 1104
3337A104L65p25n62j102o26J11P41J056R54K61n68q00j075m80M5R32J091P68K11
$$ 1104 1469 744 182 -920 -1546 -1435 -694 362 1316 1577 1009 209 -866 -1346 -1301 -369 722 1490 1701
3356A701q66o73j209n08K97O66J231Q18N7p49q64j033l58K31J071Q45Q78Q2j007
$$ 1701 835 162 -1047 -1555 -1258 -592 639 1457 1514 765 -99 -1132 -1490 -1259 -188 657 1535 1617 610
3375F10q51j089l37M85R24Q88P00K63q63p59j277J33k9R82R20O40j80o18o83j068
$$ 610 -241 -1330 -1667 -1182 -258 630 1330 1593 730 -29 -1306 -1173 -1202 -220 700 1340 1160 542 -141 -1209
3395a209l19N62Q36R91Q36l50p52j168o83k45L29J121J128J71k9o04j331q55N7
$$ -1209 -1528 -966 -130 861 1697 1347 595 -573 -1256 -1501 -1172 -51 1077 1248 1219 615 -716 -1571 -1514
3414a514Q17N61J103L85k43o48j145n52k4N33R80R59J84l27n25j105q04J15K35
$$ -1514 -697 -136 967 1352 1109 461 -684 -1236 -1260 -727 253 1212 1396 1069 544 -561 -1365 -1250 -1015
3433a015J448P80J96k70j178o23n73Q9N45J065P74M51q02q14r15k94j88Q62P07
$$ -1015 433 1213 1409 1139 -39 -662 -1235 -1146 -601 464 1238 1689 887 73 -842 -1136 -1324 -462 245
3452B45R42L04o55r02r53l18K66P17Q36O94J50n04q84r09l69K90P27R22O09R1
$$ 245 1187 1491 836 -66 -1019 -1337 -1071 -354 482 1176 1326 822 -62 -971 -1340 -1050 -323 599 1208 1299
3472A299p01p87o61p84P28N08J126N74J88q97j027l00p20K16J271O35L63J50n90
$$ 1299 598 -189 -850 -1634 -906 -398 728 1302 1490 593 -434 -734 -1454 -1238 33 668 1031 1181 591
3491E91r17p04k95Q3J088P38Q67k84n74j158o30j06N13P38N92Q01m80m59p39p75
$$ 591 -326 -1030 -1325 -1242 -154 584 1451 1167 593 -565 -1195 -1301 -788 -50 542 1343 863 404 -335 -1110
3511a110l77O27J117O82M98l80l11j210o55l51L66J226Q21K89j87o18r33q06J02
$$ -1110 -1487 -860 257 939 1437 1057 746 -464 -1119 -1470 -1104 122 943 1232 1045 427 -506 -1312 -1210
3530a210N01P05J144K81l81r28o90o03o2Q08O40R93Kj46r42q86n96K69M30J135
$$ -1210 -709 -4 1140 1421 1040 112 -578 -1181 -1243 -435 205 1198 1200 1054 112 -774 -1370 -1101 -671 464
3550D64P38j4l42o43j219j30J69N82R29M97L50n54p35r54m42K32O34Q33O68M02
$$ 464 1202 1188 846 203 -1016 -1146 -977 -395 534 1031 1381 827 92 -862 -1304 -1072 -438 395 1063 1465
3570A465l79j139p92j48k34R03R71M99j54l36q75p03l91K01P05R98Q93m80l59
$$ 1465 1086 -53 -845 -993 -1227 -324 647 1146 992 656 -219 -922 -1313 -1112 -407 591 1484 1004 645
3589F45r00o57l24L21N96R33N73k4n73q25q19k85K61R47O57O72j63l54j093o82
$$ 645 -255 -912 -1236 -915 -319 614 1187 1163 590 -235 -1054 -1339 -1078 -131 526 1198 1035 681 -412 -1094
3609a094J12K43O83R70M64n23n81n85o43m02O19Q25P98N91n97m27p13p74j99M65
$$ -1094 -982 -739 -56 914 1378 855 274 -311 -954 -1356 -737 88 886 1477 880 453 -260 -1034 -1233 -768
3629g68R47N98M98k61o74q61n72j70O93Q31O41K05q7o07r76l67j78L70J046P28
$$ -768 179 777 1275 1014 340 -521 -1093 -1263 -570 261 902 1107 1020 413 -563 -930 -1108 -738 308 1036
3649A036J77l70r01p30r4k54Q03R56L99K08n51n84q82l32L4P07P67N47J85l96
$$ 1036 1213 843 -58 -788 -882 -1136 -333 623 1022 1230 679 95 -787 -1119 -1085 -378 389 936 1121 725
3669G25o71p69k76L5M41J090R8Q1p5q84q82r6K09M11R54Q55J15m86j007q59j62
$$ 725 54 -715 -991 -956 -515 575 673 754 679 -205 -1087 -1183 -974 -563 391 1246 1361 875 -132 -991 -1153
3690a153L98M38Q32M28K82o81j026m03k86K02Q88O92O01j93n62p43m07m18L88
$$ -1153 -755 -317 515 943 1225 544 -482 -885 -1171 -969 -81 611 1212 1019 457 -286 -693 -1111 -723
3709g23L64J098K53L7l21j197m53r1N75M32O91M85j59o53o82p78J34J17R07M65
$$ -723 -359 739 992 1029 708 -489 -942 -1033 -458 -26 665 1150 991 338 -344 -1122 -988 -871 36 501
3729E01N82j7p77o15m00k94K57Q85Q58M19m70m02j036n23k6J98R67Q95P4l17m90
$$ 501 1083 1066 289 -326 -726 -1020 -763 122 980 1399 929 527 -509 -1032 -1058 -860 107 1002 1076 759 269
3750B69q22k53j56K48J026O12L58m39o34q18n41J36M05J013O95k3k44q95n95m21
$$ 269 -553 -806 -962 -714 312 924 1282 843 209 -609 -1150 -1014 -609 404 1099 1076 832 -63 -658 -1079
3770a079J48N15P02Q13j57j58r17n24m46L26P19N13O32J99l91o94q53l52M0Q14
$$ -1079 -931 -416 286 1099 942 784 -133 -657 -1103 -777 -58 455 1087 1286 895 201 -652 -1004 -964 -150
3790a50N41N11O1n93l62p32n54O28L61R46L59Lo63k87p58l04R9J021N44K92k70
$$ -150 391 902 963 370 8 -724 -1278 -650 -289 657 1016 1019 356 69 -689 -993 -894 127 671 963 693
3811F93k29p65p31P5%J102M60Q47l50o03q06p07m9M64N46Q43K9O7n06r15o34J32
$$ 693 464 -301 -1032 -957 -957 145 605 1452 1102 499 -307 -1014 -1063 -599 -53 790 819 886 380 -535 -1169 -1037
3833a037L17O22Q86K13l0p12o86n86j63N89M71Q08K47j36o43p41m43J25M92O93
$$ -1037 -720 -98 788 1001 971 259 -427 -1013 -1176 -587 -116 692 939 803 160 -581 -1024 -899 -407 286
3853B86L92O74n77o60n20o94M6N79P96L97M45n80o56m79m31J38M24N82P28n0j46
$$ 286 678 1352 775 115 -405 -1099 -1053 -474 322 719 1164 584 -72 -551 -982 -844 -420 162 890 840 694
3874F94p29m78m29o4O25N03R14K18o38p24m21m81M7P96O57M56l7k15r69n78k45
$$ 694 -35 -513 -942 -1006 -381 122 1036 1254 616 -108 -529 -1010 -963 -167 490 946 909 694 -275 -853 -1098
3895a098K39M62P12O17j3k57o61p59k34M1Q24O16O82k80n71m65o06l05K25P27
$$ -1098 -859 -397 315 932 919 662 1 -758 -992 -951 -127 489 1171 891 320 -145 -751 -1056 -831 -104
3915a04O04M16K49p89o08p20j60L15N52P22K78P4m64q40n74J28M20M32P08M55
$$ -104 500 916 1165 376 -232 -952 -1112 -797 -245 477 755 829 365 -475 -1049 -921 -501 -69 639 1094
3935A094k17o09l57p71j24L33O44O71K17k23n46p75j88k44L90P06P90K28J06r70
$$ 1094 877 268 -89 -860 -984 -651 -7 664 881 658 112 -663 -851 -1095 -705 1 791 1019 1125 155
3955A55m38p13j02M94P82N98K71l04n00m80n64J6M07O73N35K56l18p10p67k50
$$ 155 -283 -996 -1098 -604 178 776 1047 743 243 -237 -801 -785 -378 295 830 1086 768 58 -709 -959
3975i59m0L96J194J95J66m70l44q07k41j58Q78N30M17K44m68n07k76p54J79O07
$$ -959 -999 -603 591 786 952 482 138 -669 -910 -1068 -190 340 757 1001 533 26 -250 -1004 -825 -218
3995b18O96M00Q8k74q65l41k37r3O19O42K95p3k63l62r47m5J61L93Q54M46k0l26
$$ -218 478 878 966 692 -173 -514 -751 -844 -225 417 712 639 376 14 -933 -978 -817 -424 430 876 856 530
4017E30p84k76m53L40M94O11P50l30m70n07o19k53K51R11K93O12j95k86q89m24
$$ 530 -254 -530 -983 -643 -149 462 1212 882 412 -95 -714 -967 -716 195 488 1100 905 619 -270 -694
4037f94k43N09O8R02K51n6p12n92j51k20K41P56N52L29o4o64o25n33J12O29K46
$$ -694 -937 -428 -360 542 793 737 25 -567 -718 -938 -697 59 611 940 876 212 -413 -946 -834 -205 41
4058D1O36K69j78m84q54k84M5K99M62O66NL2m86p39l46K97J79P39N66J87o89p7
$$ 41 677 946 768 284 -570 -854 -809 -510 -48 618 623 655 169 -570 -916 -619 -440 299 865 1052 363 286
4080B86q55l24K93N26K89L65J51j46p17o11k06q3P52O70M68m9m65n48l74m93O28
$$ 286 -569 -893 -600 -74 215 580 731 585 -132 -743 -949 -1032 -280 390 858 809 344 -204 -578 -1071 -443
4101d43K59L88M42J00k56o34n06k13K78K12R03J43L33o23o83m37j03Q5N55Q79
$$ -443 -184 204 646 746 490 -144 -650 -863 -585 -373 530 673 1006 383 -300 -737 -840 -755 -200 679
4121F79K27k4m53p39l55j73K11P35M23K99j56m52n01k27k69J76L63P12L62k38
$$ 679 906 882 429 -310 -665 -838 -627 108 531 830 674 222 -279 -506 -775 -599 -236 476 838 600
4141F00j72p52k46k52N02M33N04J23K55o58o59l97k39N87N51N25J06j93l89k75
$$ 600 428 -324 -570 -822 -320 113 617 740 995 337 -322 -719 -958 -371 180 705 811 618 229 -46
4161d6q63L88n7P16Q41j91k66m14m88k78k07M07Q73J49L68j88n40q49k60n4O41
$$ -46 -909 -521 -578 138 979 788 522 108 -380 -658 -865 -458 415 564 932 744 204 -645 -905 -959 -318
4182c18M09M98L33l60n90n64m96J20N80M37M89L66m27n09p68k06L82K84O75L12
$$ -318 91 589 922 562 -28 -592 -1088 -968 -388 49 538 904 477 -32 -800 -1006 -624 -340 335 647
4202F47K15n66j95q17j28N6M61P13N38k39k20o30j19l38j67M14R39J11O2j93o90
$$ 647 862 296 101 -716 -844 -788 -327 386 924 685 465 -165 -284 -622 -789 -375 564 675 737 544 -146
4223a46m03p5j18N74N19M98j90m94l44k1n82J43P03M15N25l29l02o00m10k06K07
$$ -146 -549 -624 -742 -168 351 849 659 165 -179 -200 -782 -639 64 479 1004 675 373 -227 -637 -843 -636
4244f36L34O91L89P4o17l05m73l60L35N98N56J80n2l63p26l98l5J76O48M86L34
$$ -636 -302 389 778 852 235 -70 -543 -903 -568 30 586 766 714 351 -375 -773 -808 -632 16 502 836
4265H36j04o10n94k10J7L68L99L58M31m20l64m51n39K66Q7O70L69K15j26q38l80
$$ 836 732 122 -472 -682 -665 -297 102 460 891 471 107 -344 -883 -617 -530 140 509 724 598 -240 -620
4286f20L2l02O75K90N95J30j85m68p54j6p4K93P26K93J54j59o09n02m14N4P06
$$ -620 -588 -890 -215 75 670 800 615 147 -607 -623 -697 -404 322 615 769 610 1 -501 -915 -861 -155
4307a55K47N18K25k42o43n10l66K77N30M51M25Rk72n09m45j18p1P33K56K40K30
$$ -155 92 610 835 593 -50 -560 -926 -649 -119 332 757 766 494 -15 -460 -578 -649 84 340 580 810
4328H10m85o12m22k6L33K83O02J92J27m91l93m21j89Q5P71J23O56l65p7q39l41
$$ 810 325 -287 -709 -735 -402 -119 483 675 802 311 -82 -503 -692 -607 164 287 943 578 501 -338 -679
4349f79j32K89L20N80N46l90l56l73p06J04K97O44L07Q9J70o13l70k59j69L96
$$ -679 -811 -522 -202 378 924 534 178 -195 -901 -797 -500 144 451 540 710 97 -273 -532 -701 -305
4369c05M12M96R8j80l37m89l10j57K65N10O51K31m4m98p02l39O5L20M00M30K13
$$ -305 107 603 701 521 184 -305 -615 -772 -507 3 654 885 841 343 -359 -698 -633 -313 87 517 730
4390G30k53m62m40k85J17N16L81K95L22m57o07j86m22O7K87P29L22L7k60n47l06
$$ 730 477 15 -425 -710 -593 -77 304 599 921 464 -143 -329 -751 -684 -397 332 654 691 431 -116 -422
4411d22l07K38K14O21L71q1j66m78m70j48N6L00N85L45R7m45m42l66j39J61L69
$$ -422 -729 -491 -277 344 715 634 468 -10 -480 -628 -572 -272 313 658 755 310 -132 -498 -637 -476 -107
4432a07M26K11P5l13l82p37J40Q6M37L15N64jn49j62p53n0M01N78K90J09Q3l76
$$ -107 319 530 605 292 -90 -827 -687 -601 -164 151 715 714 165 3 -750 -800 -399 179 469 578 661 285
4454B85n07l65R9J26L96L34K22L0k62n06k21j70J4P59J87K83J71o59m99n72P4
$$ 285 -222 -587 -488 -362 34 368 590 620 358 -148 -369 -539 -525 234 421 704 875 216 -283 -855 -781
4475g81K64L60O79p6K80m08o64l79NK02N63N35J25m24k36l93l06q3L47M68O22
$$ -781 -517 -157 522 446 726 318 -346 -725 -720 -518 45 580 705 281 45 -348 -654 -737 -390 78 700
4496G00Jk72k46n55j24l82N35N25L67P8m06k70m35n03L02O92M88K78k29n3n27
$$ 700 701 429 183 -372 -496 -878 -343 182 549 627 221 -49 -484 -987 -685 7 495 773 544 491 -36
4517c6m21k62L6M88M10M32K1k77m22m32l40K13M56M46L17j06j23m43n97P3n4M45
$$ -36 -457 -719 -683 -195 215 647 668 391 -31 -463 -803 -590 -134 312 629 523 400 -43 -640 -567 -621 -176
4539a76L62L40J91k51m74m99k10K21M32L60M25P8n11l64l22k19K02L34M09L05
$$ -176 186 526 717 466 -8 -507 -717 -496 -64 296 721 799 288 -76 -398 -617 -415 -81 328 633
4559F33j14k61n33l18j8J78M24N08K29R6o15o13j95j08K27M92O38K00l40m01l22
$$ 633 519 258 -275 -593 -611 -433 -9 499 728 824 209 -404 -599 -707 -480 12 650 850 510 109 -213
4580b13l53r9K28K64O33K41j42m74m08j44j49L01L61N69K2l33j04n20n10M44j27
$$ -213 -566 -665 -437 -173 460 701 559 85 -323 -467 -616 -315 46 615 637 304 200 -320 -830 -386 -513
4601e13M76M81L70j83l12p30k58rJ3Q55L92l3j18l98o51J14j6MO40M71l4N5m70
$$ -513 -37 444 814 631 319 -411 -669 -678 -665 190 582 549 431 33 -618 -504 -520 -516 124 595 561 616 146
4624A46m84k69J06N53M76K07j57j51m57l51l38J68J87P11Q6j17k2l19l49j90J38
$$ 146 -338 -607 -501 52 528 735 578 427 -30 -381 -719 -551 -364 347 433 316 294 -25 -374 -564 -426
4645d26K97K44L38K40k68l35n93R7J2M35J99K88R5k29n90k37l76M08M01L23M02
$$ -426 -129 115 453 693 425 90 -503 -406 -394 41 240 528 623 394 -196 -433 -809 -401 0 323 725
4666G25j31l71l00l16m77O01J53O43J36j11l47n82l09J83k0O18K02N25m37j91
$$ 725 594 223 -77 -393 -870 -269 -116 527 663 552 205 -377 -686 -503 -523 95 297 822 385 194
4686A94l82k26o7q9P71K70M76m59m81l47o23M23K59J79P43K0k47l58m24k82L9
$$ 194 -188 -414 -481 -570 201 471 947 488 7 -340 -963 -540 -281 -102 641 661 414 56 -368 -650 -611
4707f11J06N72J98L76j54k68p55j48L32K82J51K57K00l74k7m59l43N0N32L68K14
$$ -611 -505 67 265 641 487 219 -536 -684 -352 -70 81 338 538 164 137 -322 -665 -615 -83 285 499
4728D99J02j03p35j1j9k85M71L09K04l8O9o31n12P3J63L42M72L32J35k74m75m45
$$ 499 601 498 -237 -248 -267 -552 -81 228 432 394 463 -168 -680 -607 -444 -102 370 702 837 563 88 -357
4750c57l59M43K91L97K72j33l68l29l69j16J88J84O04L82l3k82k71k89l58J19
$$ -357 -716 -273 18 415 687 554 186 -143 -512 -628 -440 -256 348 730 697 415 144 -145 -503 -384
4770c84M02N21J45k50K0p24n06P6M97J66O70K5n8l96o67r2n1K61L26N27j2Q9J
$$ -384 18 539 684 434 454 -270 -776 -700 -203 -37 633 658 600 204 -463 -555 -606 -345 -19 508 496 585 586
4793E86p25l09j29K89L08L48K75j31k24n07k50j88J35N19N73J52k00m98l14m04
$$ 586 -139 -448 -577 -288 20 368 643 512 288 -219 -469 -657 -522 -3 570 722 522 24 -290 -694
4813f94J00R6O34L41k19K03k64m42l44P2J66P19J84j33j9k25m24l41K32L56K51
$$ -694 -594 -498 136 477 258 461 197 -245 -589 -517 -351 368 552 419 400 175 -249 -590 -358 -2 249
$$ [...]
8191d39
##END NTUPLES=NMR FID
##END=
