##TITLE=1H_SR109
 D2O
 8 sc, 
 17.03.2022
##JCAMPDX= 6.0         $$ Bruker NMR JCAMP-DX V2.0
##DATA TYPE= NMR FID
##DATA CLASS= NTUPLES
##ORIGIN= UXNMR, Bruker Analytische Messtechnik GmbH
##OWNER= root
$$ XWIN-NMR		Version 3.5
$$ Thu Mar 17 13:03:23 2022 Russian Standard Time (UT+4h)  she@DPX200
##.OBSERVE FREQUENCY= 200.131346
##.OBSERVE NUCLEUS= ^1H
##.DELAY= (6, 6)
##.ACQUISITION MODE= SIMULTANEOUS
##.ACQUISITION SCHEME= undefined
##.AVERAGES= 8
##.DIGITISER RES= 18
##SPECTROMETER/DATA SYSTEM= spect
##.PULSE SEQUENCE= zg30
##.SOLVENT NAME= D2O
##.SHIFT REFERENCE= (INTERNAL, D2O, 0, 15.7039)
##AUDIT TRAIL= $$ (NUMBER, WHEN, WHO, WHERE, WHAT)
$$ ##TITLE= Audit trail, XWIN-NMR		Version 3.5
$$ ##JCAMPDX= 5.01
$$ ##ORIGIN= Bruker BioSpin GmbH
$$ ##OWNER= she
$$ F:/spectra/data/she/nmr/H-F/1/audita.txt
$$ ##AUDIT TRAIL=  $$ (NUMBER, WHEN, WHO, WHERE, WHAT)
(   1,<2022-03-17 13:02:23.81 +0400>,<she>,<DPX200>,
      <created by zg, POWCHK disabled, PULCHK disabled
       configuration hash MD5:
       00 E9 B6 7A A2 85 ED C7 34 08 36 98 17 FE 4E 26
       data hash MD5: 16K
       13 A0 65 74 1E 90 0A 5E 1C 04 F5 CA 17 E4 79 B0>)
$$ ##END=
$$ 
$$ hash MD5
$$ E0 67 01 81 4A 34 04 2C 18 C3 B1 60 B4 89 98 9D
##$RELAX= 
##$RELAX= 
##$RELAX= 
##$RELAX= 
##$RELAX= 
##$RELAX= 
$$ Bruker specific parameters
$$ --------------------------
##$DU= <F:/spectra>
##$EXPNO= 1
##$NAME= <H-F>
##$PROCNO= 1
##$TYPE= <nmr>
##$USER= <she>
##$AMP= (0..31)
100 100 100 100 100 100 100 100 100 100 100 100 100 100 100 100 100 100 
100 100 100 100 100 100 100 100 100 100 100 100 100 100 
##$AQSEQ= 0
##$AQ_mod= 1
##$AUNM= <au_zg>
##$AUTOPOS= <>
##$BF1= 200.13
##$BF2= 200.13
##$BF3= 200.13
##$BF4= 200.13
##$BF5= 200.13
##$BF6= 200.13
##$BF7= 200.13
##$BF8= 200.13
##$BYTORDA= 1
##$CFDGTYP= 0
##$CFRGTYP= 5
##$CHEMSTR= <none>
##$CNST= (0..31)
1 1 145 1 1 1 1 1 1 1 1 1 1 1 1 1 1 1 1 1 1 1 1 1 1 1 1 1 1 1 1 1 
##$CPDPRG= <>
##$CPDPRG1= <>
##$CPDPRG2= <>
##$CPDPRG3= <>
##$CPDPRG4= <mlev>
##$CPDPRG5= <mlev>
##$CPDPRG6= <mlev>
##$CPDPRG7= <mlev>
##$CPDPRG8= <mlev>
##$CPDPRGB= <>
##$CPDPRGT= <>
##$D= (0..31)
0 1.2 0 0 0 0 0 0 0 0.06 0 0.03 0 0 0 0 0.0002 0 0 0 0 0 0 0 0 0 0 0 0 
0 0 0 
##$DATE= 1647507743
##$DBL= (0..7)
120 120 120 120 120 120 120 120 
##$DBP= (0..7)
150 150 150 150 150 150 150 150 
##$DBP07= 0
##$DBPNAM0= <>
##$DBPNAM1= <>
##$DBPNAM2= <>
##$DBPNAM3= <>
##$DBPNAM4= <>
##$DBPNAM5= <>
##$DBPNAM6= <>
##$DBPNAM7= <>
##$DBPOAL= (0..7)
0.5 0.5 0.5 0.5 0.5 0.5 0.5 0.5 
##$DBPOFFS= (0..7)
0 0 0 0 0 0 0 0 
##$DE= 6
##$DECBNUC= <off>
##$DECIM= 32
##$DECNUC= <off>
##$DECSTAT= 4
##$DIGMOD= 1
##$DIGTYP= 9
##$DL= (0..7)
0 120 120 120 120 120 120 120 
##$DP= (0..7)
150 150 150 150 150 150 150 150 
##$DP07= 0
##$DPNAME0= <>
##$DPNAME1= <>
##$DPNAME2= <>
##$DPNAME3= <>
##$DPNAME4= <>
##$DPNAME5= <>
##$DPNAME6= <>
##$DPNAME7= <>
##$DPOAL= (0..7)
0.5 0.5 0.5 0.5 0.5 0.5 0.5 0.5 
##$DPOFFS= (0..7)
0 0 0 0 0 0 0 0 
##$DQDMODE= 0
##$DR= 18
##$DS= 0
##$DSLIST= <SSSSSSSSSSSSSSS>
##$DSPFIRM= 0
$$ [...]
##$SUBNAM2= <"">
##$SUBNAM3= <"">
##$SUBNAM4= <"">
##$SUBNAM5= <"">
##$SUBNAM6= <"">
##$SUBNAM7= <"">
##$SUBNAM8= <"">
##$SUBNAM9= <"">
##$SW= 18.0517287032376
##$SWIBOX= (0..15)
0 0 2 0 0 0 0 0 0 0 0 0 0 0 0 0 
##$SW_h= 3612.71676300578
##$TD= 16384
##$TD0= 1
##$TE= 0
##$TE2= 300
##$TE3= 300
##$TEG= 300
##$TL= (0..7)
0 120 120 120 120 120 120 120 
##$TP= (0..7)
150 150 150 150 150 150 150 150 
##$TP07= 0
##$TPNAME0= <>
##$TPNAME1= <>
##$TPNAME2= <>
##$TPNAME3= <>
##$TPNAME4= <>
##$TPNAME5= <>
##$TPNAME6= <>
##$TPNAME7= <>
##$TPOAL= (0..7)
0.5 0.5 0.5 0.5 0.5 0.5 0.5 0.5 
##$TPOFFS= (0..7)
0 0 0 0 0 0 0 0 
##$TUNHIN= 0
##$TUNHOUT= 0
##$TUNXOUT= 0
##$USERA1= <user>
##$USERA2= <user>
##$USERA3= <user>
##$USERA4= <user>
##$USERA5= <user>
##$V9= 5
##$VALIST= <valist>
##$VCLIST= <CCCCCCCCCCCCCCC>
##$VD= 0
##$VDLIST= <DDDDDDDDDDDDDDD>
##$VPLIST= <PPPPPPPPPPPPPPP>
##$VTLIST= <TTTTTTTTTTTTTTT>
##$WBST= 1024
##$WBSW= 4
##$XGAIN= (0..3)
0 0 0 0 
##$XL= 0
##$YL= 0
##$YMAX_a= 146199
##$YMIN_a= -191318
##$ZGOPTNS= <>
##$ZL1= 120
##$ZL2= 120
##$ZL3= 120
##$ZL4= 120
##$ABSF1= 10
##$ABSF2= 0
##$ABSG= 5
##$ABSL= 3
##$ALPHA= 0
##$AQORDER= 0
##$ASSFAC= 0
##$ASSFACI= 0
##$ASSFACX= 0
##$ASSWID= 0
##$AUNMP= <proc_1d>
##$AZFE= 0.1
##$AZFW= 0.1
##$BCFW= 1
##$BC_mod= 2
##$BYTORDP= 1
##$COROFFS= 0
##$CY= 11.3945322036743
##$DATMOD= 1
##$DC= 2
##$DFILT= <>
##$DTYPP= 0
##$F1P= 2.36226072786647
##$F2P= -0.459571619588291
##$FCOR= 0.5
##$FTSIZE= 0
##$FT_mod= 4
##$GAMMA= 1
##$GB= 0.15
##$INTBC= 1
##$INTSCL= 1
##$ISEN= 128
##$LB= 0.24
##$LEV0= 0
##$LPBIN= 0
##$MAXI= 10000
##$MC2= 0
##$MEAN= 0
##$ME_mod= 0
##$MI= 1.114404
##$NCOEF= 0
##$NC_proc= 0
##$NLEV= 6
##$NOISF1= 3.799351
##$NOISF2= 2.8
##$NSP= 1
##$NTH_PI= 0
##$NZP= 0
##$OFFSET= 15.70392
##$PC= 1
##$PHC0= -16954.33
##$PHC1= 14.80078
##$PH_mod= 1
##$PKNL= yes
##$PPARMOD= 0
##$PSCAL= 0
##$PSIGN= 0
##$REVERSE= no
##$SF= 200.130013532006
##$SI= 16384
##$SIGF1= 3
##$SIGF2= 2
##$SINO= 400
##$SIOLD= 16384
##$SREGLST= <1H.CDCl3>
##$SSB= 0
##$STSI= 0
##$STSR= 0
##$SW_p= 3612.71676300578
##$SYMM= 0
##$S_DEV= 0
##$TDeff= 0
##$TDoff= 0
##$TI= <>
##$TILT= no
##$TM1= 0
##$TM2= 0
##$TOPLEV= 0
##$USERP1= <user>
##$USERP2= <user>
##$USERP3= <user>
##$USERP4= <user>
##$USERP5= <user>
##$WDW= 1
##$XDIM= 8192
##$YMAX_p= 0
##$YMIN_p= 0
$$ End of Bruker specific parameters
$$ ---------------------------------
##NTUPLES= NMR FID
##VAR_NAME=  TIME,          FID/REAL,        FID/IMAG
##SYMBOL=    X,             R,               I
##VAR_TYPE=  INDEPENDENT,   DEPENDENT,       DEPENDENT
##VAR_FORM=  AFFN,          ASDF,            ASDF
##VAR_DIM=   8192,          8192,            8192
##UNITS=     SECONDS,       ARBITRARY UNITS, ARBITRARY UNITS
##FACTOR=    0.0002768,     1,               1
##FIRST=     0,             0,               0
##LAST=      2.2672688,     0,               0
##MIN=       0,             -191318,         0
##MAX=       2.2672688,     146199,          0
$$ Real data points
##PAGE= N=1
##DATA TABLE= (X++(R..R)), XYDATA
$$ [...]
$$ plain form
1878 -1223 -1712 -1618 -809 378 1402 1743 1125 190 -1040 -1972 -1375 -795 222 1706 2040 1095 221 -776
1896 -776 -2134 -1503 -425 384 1521 2058 987 192 -787 -1725 -1566 -664 328 1532 1748 1400 139 -1013
1914 -1013 -1477 -1401 -822 423 1619 1786 957 485 -703 -1779 -1443 -538 343 1373 1969 865 -13 -758
1932 -758 -1524 -1711 -580 246 1105 1489 1285 180 -1168 -1442 -1290 -623 173 1306 1431 1179 302 -600 -1672
1951 -1672 -1322 -671 184 1265 1985 1178 158 -458 -1409 -1669 -532 229 1127 1984 1226 84 -462 -1382
1969 -1382 -1569 -683 495 854 1662 1136 324 -620 -1237 -1502 -840 20 1058 1644 1379 326 -358 -1439
1987 -1439 -1655 -722 105 1078 1446 1318 279 -693 -1436 -1460 -720 291 726 1613 1081 439 -456 -1209 -1412
2006 -1412 -1013 167 1202 1410 1001 450 -624 -1570 -1430 -943 268 872 1267 1445 437 -618 -1526 -1066
$$ packed form
1878a223m89R4Q09J187J024L41o18r35j230r32N97N80J017J484L34r45q74r97
1896g76j358O31J078Q09J137N37j071p95r79r38J59R02R92J204K16l48j261j152
1914a013m64P6N79J245J196J67q29m72j188j076L36R05Q81J030N96j104q78p45
1932g58p66j87J131Q26Q59L84k04j105j348k74J52O67P96J133J25k52q77r02j072
1951a672L50O51Q55J081P20q07j020o16r51k60J137P61Q98Q57p58j142n46r20
1969a382j87Q86J178L59Q08n26q12r44o17k65O62Q60J038N86k65j053o84j081
1987a439k16R33Q27R73L68j28j039r72p43k4P40J011M35Q87n32o42q95p53k03
2006a412L99J180J035K08m09n51j074r46J40M87J211O04L95J78j008j055r08M60
$$ plain form
2024 -1066 -822 18 1073 1451 1202 614 -424 -1183 -1469 -896 149 907 1336 1183 736 -386 -1226 -1362
2042 -1362 -936 -108 1047 1402 1243 565 -507 -1021 -1178 -1026 -201 1269 1481 1093 633 -429 -1211 -1094
2060 -1094 -790 -126 695 1383 1244 380 -390 -1047 -1271 -855 -15 904 1288 1203 223 -460 -1061 -1290 -1005 -96
2080 -96 810 1043 1335 321 -545 -1077 -1191 -832 -16 700 1187 1307 521 -297 -1152 -1322 -779 -132 520 1176
2100 1176 1514 700 -58 -749 -1237 -775 57 608 1004 943 533 -502 -856 -1048 -742 -268 804 1330 1027
2119 1027 567 -87 -1004 -1125 -490 -324 526 1235 974 387 -49 -1161 -982 -737 25 410 1109 1466 640
2138 640 -303 -854 -1132 -967 -96 587 897 1019 719 -137 -968 -1367 -945 -379 788 1138 1222 599 -71 -915
2158 -915 -1056 -723 -214 326 1046 986 697 -9 -670 -1199 -947 -265 494 1065 1432 875 -30 -808 -1030 -905
$$ packed form
2024a066K44Q40J055L78k49n88j038p59k86N73J045P58M29j53m47j122q40j36
2042a362M26Q28J155L55j59o78j072n14j57J52Q25J470K12l88m60j062p82J17
2060a094L04O64Q21O88j39q64p70o57k24M16Q40R19L84q5r80o83o01k29K85R09
2080i6R06K33K92j014q66n32j14L59Q16P16M87J20p86q18q55j70N43O47O52O56
2100A176L38q14p58o91m88M62Q32N51L96o1m10j035l54j92L06M74J072N26l03
2119A027m60o54r17j21O35J66Q50P09k61n87m36j112J79K45P62L85O99L57q26
2138F40r43n51k78J65Q71O83L10J22l00q56q31l99M22N66J167L50Q4o23o70q44
2158i15j41L33N09N40P20o0k89p06o61n29K52O82P59N71L67n57r05p78k22J25
$$ plain form
2178 -905 -410 426 857 901 345 95 -780 -1109 -846 -89 270 852 1045 819 13 -761 -1359 -839 -438 452
2198 452 885 826 684 -226 -658 -936 -925 -500 399 1076 760 417 -16 -879 -1106 -887 -482 208 877 968 425
2219 425 -123 -699 -1260 -917 -146 203 779 921 761 -16 -794 -922 -894 -454 210 949 809 629 -61 -538
2239 -538 -830 -682 -386 -14 942 1022 356 193 -523 -1065 -830 -214 251 841 956 690 -34 -399 -1153 -960
2259 -960 -391 297 590 807 636 291 -165 -838 -998 -350 207 612 952 758 -12 -466 -1003 -998 -325 86 862
2280 862 806 399 91 -570 -811 -847 -499 288 555 1108 811 208 -573 -724 -722 -293 270 783 945 609 201
2301 201 -362 -919 -825 -471 -25 625 1302 809 73 -389 -598 -990 -163 169 590 955 528 31 -491 -920
2321 -920 -630 -320 81 615 733 754 333 -568 -849 -743 -389 366 466 797 612 316 -523 -1083 -821 -430
$$ packed form
2178i05M95Q36M31M4n56k50q75l29K63P57L59N82J93k26q06p74n98N20M01Q90
2198D52M33n9j42r10m32k78J1M25Q99O77l16l43m33q63k27K19M05O90O69R1n43
2219D25n48n76n61L43P71L49N76J42j60p77p78j28K8M40O64P39j40j80o90m77
2239e38k92J48K96L72R56Q0o66j63p16n42K35O16M65N90J15k66p24l65p54J93
2259i60N69O88K93K17j71l45m56o73j60O48N57M05L40j94p70m54n37NO73M11P76
2280H62n6m07l08o61k41l6L48P87K67N53k97o03p81j51KM29N63N13J62l36m08
2301B01n63n57R4L54M46O50O77m93p36m62k09l92Q27L32M21L65m27m97n22m29
2321i20K90L10M01N34J18K1m21r01k81J06L54P55J00L31j85k96q39n60K62L91
$$ plain form
2341 -430 -31 384 715 727 208 -333 -848 -826 -501 -64 466 673 699 228 -373 -601 -825 -329 145 556 686
2362 686 691 229 -526 -604 -683 -414 -75 652 717 626 256 -469 -753 -657 -336 108 578 769 797 331 -445 -429 -703
2385 -703 -392 77 376 585 793 66 -378 -402 -703 -550 100 758 837 636 151 -211 -502 -373 -428 -127 834
2406 834 1111 541 497 -360 -630 -505 -457 -122 372 637 606 177 -212 -593 -831 -505 -13 600 715 689 428
2427 428 -386 -480 -568 -458 32 651 744 645 425 -148 -646 -544 -419 -177 223 665 516 269 -114 -518 -732
2448 -732 -489 71 647 873 659 185 -203 -575 -517 -479 172 679 492 531 162 37 -500 -713 -419 -168 285
2469 285 532 329 182 -61 -583 -776 -319 -80 213 764 530 255 -36 -384 -693 -512 89 461 348 413
2489 413 152 -91 -477 -642 -625 -242 435 819 602 236 -83 -379 -676 -491 77 115 604 628 233 -105 -401
$$ packed form
2341d30L99M15L31J2n19n41n15K2L25M37N30K07K6m71o01k28k24M96M74M11J30
2362F86Nm62p55p8p9K69L39P27O5r1l70p25k84R6L21M44M70J91K8m66p76J6k74
2385g03L11M69K99K09K08p27m44k4l01J53O50O58P9k01m85l62k91J29n5L01R61
2406H34K77n70m4q57k70J25M8L35M94K65l1m29l89l81k38L26M92O13J15k6k61
2427D28q14r4q8J10M90O19R3r9k20n73m98J02J25K42M00M42j49k47l83m04k14
2448g32K43N60N76K26k14m74l88l72N8L8O51N07j87L9l69j25n37k13K94K51M53
2469B85K47k03j47k43n22j93M57K39K93N51k34k75k91l48l09J81O01L72j13O5
2489D13k61k43l86j65J7L83O77L84k17l66l19k96k97J85N68L8M89K4l95l38k96
$$ plain form
2510 -401 -639 -681 -15 252 514 528 315 -32 -312 -765 -567 -265 323 848 622 248 -2 -545 -677 -380 -4
2531 -4 35 640 682 333 -86 -529 -495 -478 73 85 585 467 283 -175 -248 -645 -478 -145 486 442 440 332 -7 -392
2555 -392 -517 -420 -67 63 593 650 285 -60 -290 -584 -340 -106 222 553 658 549 -46 -126 -430 -601 -97
2576 -97 438 676 657 273 -174 -113 -530 -508 -189 90 604 450 514 -16 -430 -465 -528 -140 77 461 669 314
2598 314 2 -329 -509 -416 -216 -6 182 450 280 41 -128 -781 -537 -50 250 508 590 347 61 -207 -510
2619 -510 -469 -181 268 369 504 495 -231 -54 -643 -582 -302 36 519 540 391 144 -516 -208 -244 -319 212 543
2641 543 510 373 61 -428 -615 -605 -196 171 501 429 418 13 -390 -365 -312 -151 110 411 395 395 62 -318 -484
2664 -484 -522 -273 250 360 297 441 -40 -202 -714 -547 -132 -1 199 539 82 71 -304 -525 -408 -374 -83
$$ packed form
2510d01k38m2O66K67K62J4k13l47k80m53J98L02N88N25k26l74k50n43j32K97L76
2531dL9O05M2l49m19m43L4J7N51J2N00j18j84m58p3l97J67L33O31m4kj08l39l85
2555c92j25R7L53J30N30N7l65l45k30k94K44K34L28L31J05j09n95q0l04j71N04
2576i7N35K38j9l84m47O1m17K2L19K79N14j54O4n30m14l5o3L88K17L84K08l55
2598C14l12l31j80R3K00K10J88K68j70k39j69o53K44M87L00K58Q2k43k86k68l03
2619e10M1K88M49J01J35rp26J77n89O1K80L38M83K1j49k47o60L08l6p5N31L31
2641E43l3j37l12m89j87J0M09L67L30p2j1m05m03K5N3J61K61L01j6%l33l80j66
2664d84l8K49N23J10o3J44m81j62n12J67M15J31K00L40m57j1l75k21J17L4K91
$$ plain form
2685 -83 259 611 607 -179 -147 -436 -407 -53 202 393 252 234 72 -282 -515 -292 -311 240 513 581 184 1 -424
2708 -424 -312 -481 -297 271 332 596 395 148 -136 -572 -378 -194 -49 169 561 307 113 -108 -573 -498 -370
2729 -370 -44 260 604 440 27 -21 -385 -655 -296 303 253 450 431 -31 -209 -403 -607 -205 66 165 333
2750 333 290 104 120 -512 -423 -159 223 389 300 413 139 98 -282 -397 -28 125 380 519 241 -67 -195 -361
2772 -361 -530 -339 -223 158 303 175 64 -106 -186 -609 -424 75 103 473 565 145 -304 -363 -467 -149 -101 109
2794 109 315 45 205 -52 -370 -328 -481 29 241 494 219 6 -127 -281 -419 -166 158 22 358 478
2814 478 56 -94 -266 -325 -319 -106 402 251 307 307 147 -288 -410 -362 115 198 303 339 -46 91 -157 -485 -325
2837 -325 -173 260 223 635 256 -44 -414 -183 -139 26 307 354 284 287 -130 -336 -287 -197 -232 60 326 302 160
$$ packed form
2685h3L42L52mp86L2k89K9L54K55J91j41j8j62l54k33K23j9N51K73O8l97j83m25
2708d24J12j69J84N68O1K64k01k47k84m36J94J84J45K18L92k54j94k21m65P5J28
2729c70L26L04L44j64m13m8l64k70L59N99n0J97j9m62j78j94k04M02K71R9J68
2750C33m3j86J6o32Q9K64L82J66q9J13k74m1l80j15L69J53K55J39k78l08j28j66
2772c61j69J91J16L81J45j28j11j70q0m23J85M99K8L70R2m20m49n9j04L18M8K10
2794A09K06k70J60k57l18M2j53N10K12K53k75k13j33j54j38K53L24j36L36J20
2814D78m22j50j72n9OK13N08j51N6%j60m35j22M8M77Q3J05L6l85J37k48l28J60
2837c25J52M33l7M12l79l00l70K31M4J65K81M7p0Lm17k06M9R0l5K92K66k4j42
$$ plain form
2860 160 73 -124 -502 -151 24 258 334 345 115 191 -86 -498 -146 33 -60 312 76 87 -8 -340 -349 -370 -276 254
2884 254 266 312 55 27 -295 -143 -241 -80 151 459 289 71 -6 21 -345 -451 25 43 -26 651 151 -141 -287
2907 -287 -477 -337 39 74 277 360 104 -211 -236 -404 -243 -165 -50 285 451 341 -56 -260 -324 -106 8 29
2929 29 444 502 245 -251 -247 -205 -386 54 175 407 340 404 -207 -563 -334 -373 -185 327 194 236 230 68 -420 -507
2953 -507 -143 16 69 236 451 273 46 26 -171 -372 -94 25 230 438 257 -81 -395 -105 -332 -122 8
2974 8 382 306 193 189 22 -261 -168 36 25 283 384 188 142 -365 -229 -114 36 50 365 566 320 -15 -127
2997 -127 -340 -366 -37 293 250 331 566 -89 -201 -271 -531 -280 376 310 309 106 61 24 -356 -202 -214 80 439
3020 439 17 296 163 -104 27 -254 -66 -17 119 255 301 -52 -40 -318 -274 -61 100 169 122 250 69 63 -399
$$ packed form
2860A60q7j97l78L51J75K34P6J1k30P6k77m12L52J79r3L72k36J1r5l32rk1R4N30
2884B54J2M6k57k8l22J52r8J61K31L08j70k18p7K7l66j06M76J8o9O77n00k92j46
2907b87j90J40L76L5K03Q3k56l15k5j68J61P8J15L35J66j10l97k04o4K18J14K1
2929B9M15N8k57m96MM2j81M40J21K32o7O4o11l56K29l9J88N12j33M2oj62m88q7
2953e07L64J59N3J67K15j78k27k0j97k01K78J19K05K08j81l38l14K90k27K10J30
2974HL74p6j13mj67k83R3K04j1K58J01j96m6n07J36J15J50J4L15K01k46l35j12
2997a27k13k6L29L30m3Q1K35o55j12p0k60K51O56o6jk03m5l7l80J54j2K94L59
3020D39m22K79j33k67J31k81J88M9J36J36M6l53J2k78M4K13J61O9m7J28j81om62
$$ plain form
3043 -399 -92 0 30 18 276 115 47 -118 -164 -314 -274 -30 206 225 261 9 -187 -112 -108 -132 -13 98 478 44
3067 44 -9 -56 -309 -232 23 106 80 193 347 11 -233 -268 -101 -150 25 225 160 503 202 -225 -278 17 -244
3090 -244 104 37 114 153 225 -3 -435 -67 -60 -98 87 75 229 23 133 -142 -555 -49 91 205 357 132 46
3113 46 -354 -227 -101 -213 259 -83 219 224 29 -105 -349 -524 -10 -8 7 92 122 370 -56 -73 -375 -354 -106
3136 -106 46 198 54 -15 58 -282 -208 -212 210 274 263 184 300 -183 -68 -136 -88 -69 369 190 69 -221 -68 -305
3160 -305 -759 -107 -165 227 30 158 156 -138 -333 -71 22 -102 90 88 172 106 -34 -221 -300 11 55 128 31 138
3184 138 245 -179 -300 -242 -299 -34 139 230 118 157 196 -20 -268 -371 -43 79 7 63 -188 -208 -367 -308 -378
3207 -378 -10 68 98 404 -131 -205 -109 -406 -29 151 -19 259 48 63 142 -72 -171 -1 128 79 114 406 229
$$ packed form
3043c99L07R2L0j2K58j61o8j65m6j50M0K44K36J9L6k52j96P5Mk4J19J11L80m34
3067D4n3m7k53P7K55Q3k6J13J54l36k44l5J67m9J75K00o5L43l01m27n3K95k61
3090b44L48o7P7L9P2k28m32L68Pl8J85j2J54k06J10k75m13N06J40J14J52k25q6
3113D6m00J27J26j12M72l42L02Nj95j34k44j75N14KJ5Q5L0K48m26j7l02K1K48
3136a06J52J52j44o9P3l40P4mM22O4j1p9J16m83J15o8M8J9M38j79j21k90J53k37
3160c05m54O52n8L92j97J28kk94j95K62R3j24J92kQ4o6j40j87p9L11M4P3r7J07
3184A38J07m24j21N8n7K65J73R1j12L9L9k16k48j03L28J22p2N6k51k0j59N9p0
3207c78L68P8L0L06n35p4R6k97L77J80j70K78k11J5P9k14r9J70J29m9L5K92j77
$$ plain form
3230 229 -6 109 -21 -180 183 99 156 -53 -57 172 -139 -141 -253 -20 35 201 279 218 82 -203 -241 -125 -229
3253 -229 78 153 322 21 -142 -229 -269 -143 -75 -48 82 401 -222 -100 -323 -396 -78 86 161 -126 85 35 47
3276 47 -59 -9 -138 -105 223 34 -206 189 62 42 -99 -174 -238 76 69 146 -175 -13 -171 -137 65 -95 -111 -51
3300 -51 -27 209 250 -43 -57 -139 -53 172 182 262 183 200 -143 -289 -300 -140 114 220 176 31 -17 -365 75 -205
3324 -205 -92 -304 18 252 89 -103 -151 -82 -186 -236 95 179 209 272 -86 -9 -163 -121 -103 126 145 186 24 76
3348 76 124 -62 103 -240 137 -196 248 147 15 -144 -375 -485 -205 40 -75 21 -213 -36 -141 -173 -76 -108
3370 -108 -51 259 299 28 -65 169 -61 -323 71 3 144 76 81 100 -20 130 -37 96 6 76 117 440 31 4
3394 4 -381 -74 -93 246 124 274 233 -170 10 -371 -9 -231 -131 224 -25 280 -106 -225 -27 26 63 152
$$ packed form
3230B29k35J15j30j59L63q4N7k09mK29l11kj12K33N5J66P8o1j36k85l8J16j04
3253b29L07P5J69l01j63q7m0J26O8K7J30L19o23J22k23p3L18J64P5k87K11n0J2
3276D7j06N0j29L3L28j89k40L95j27k0j41p5o4L14pP7l21J62j58L4K02j60j6O0
3300e1K4K36M1k93j4q2Q6K25J0Q0p9J7l43j46j1J60K54J06m4j45m8l48M40k80
3324b05J13k12L22K34j63j92m8O9j04n0L31Q4L0O3l58P7j54M2J8K29J9M1j62N2
3348G6M8j86J65l43L77l33M44j01j32j59k31j10K80K45j15R6k34J77j05l2R7l2
3370a08N7L10M0k71r3K34k30k62L94o8J41o8NJ9j20J50j67J33r0P0M1L23m09k7
3394Dl85L07j9L39j22J50m1m03J80l81L62k22J00L55k49L05l86j19J98N3L7Q9
$$ plain form
3416 152 389 174 442 -177 -113 -17 -64 -109 -175 58 123 -49 102 -66 -252 -217 -175 -316 110 225 277 5 -38
3439 -38 -132 -117 -31 -123 29 98 -129 155 -118 -99 -418 -126 46 -215 -142 -27 12 -133 -171 -190 -25 20 66 -61
3463 -61 119 -48 -204 -120 -191 -118 105 102 2 240 208 54 -79 -280 123 -143 211 245 101 277 -12 -253 -302
3486 -302 -235 -105 -3 60 21 -127 -39 -108 -201 -118 -44 -200 -144 192 309 211 7 -68 -87 61 279 115 95 36 -131
3511 -131 -195 -142 -197 192 -35 97 365 -5 70 -48 -32 -189 116 177 -34 397 168 -129 11 -58 15 72 -71
3534 -71 130 129 107 -147 60 -213 -87 -94 297 36 45 45 -91 7 -44 -140 53 21 -87 108 -188 113 -139 -32 -318
3559 -318 -82 134 -151 -23 -15 -30 37 -117 26 -63 -66 126 185 118 71 -100 -383 -119 -84 -16 89 117 200 215 -217
3584 -217 -57 135 29 103 -9 -10 -16 18 -151 -183 -11 166 48 74 96 255 -101 -114 -257 123 56 -21 79 13
$$ packed form
3416A52K37k15K68o19O4R6m7m5o6K33O5j72J51j68j86L5M2j41M26J15N2k72m3
3439c8r4J5Q6r2J52O9k27K84k73J9l19K92J72k61P3J15L9j45l8j9J65M5M6j27
3463f1J80j67j56Q4p1P3K23lj00K38l2j54j33k01M03k66L54L4j44J76k89k41m9
3486c02O7J30J02O3l9j48Q8o9r3Q3P4j56N6L36J17r8k04p5j9J48K18j64k0n9j67
3511a31o4N3n5L89k27J32K68l70P5j18J6j57L05O1k11M31k29k97J40o9P3N7j43
3534g1K01jk2k54K07k73J26pL91k61R%j36R8n1r6J93l2j08J95k96L01k52J07k86
3559c18K36K16k85J28Qj5O7j54J43q9lJ92N9o7m7j71k83K64L5O8J05K8Q3J5m32
3584b17J60J92j06P4j12joL4j69l2J72J77j18K6K2J59l56j3j43L80o7p7J00o6
$$ plain form
3608 13 -231 -263 105 117 -239 -123 209 189 133 119 13 18 -60 -102 46 93 114 285 117 -188 -97 81 -107 16
3632 16 161 220 160 83 -46 -336 -160 -14 -190 137 21 165 165 106 -149 -183 -95 32 -82 -93 -34 251 174 209
3656 209 15 -32 8 81 168 -2 50 84 7 86 -229 -95 110 -71 184 188 128 -11 -322 -68 22 -149 215 -115
3680 -115 196 50 -234 37 -41 -51 74 111 89 76 1 -78 -150 -143 -90 7 138 221 0 96 123 150 -240 -108 -159 14
3706 14 180 -42 34 -197 -173 -71 -60 193 -63 94 -79 -69 -110 57 -147 -105 60 -49 249 341 67 -238 -98
3729 -98 -43 -141 106 77 -38 37 3 123 -84 -63 -59 32 114 199 224 -196 -13 11 5 14 64 293 0 0 167 -128 -89
3756 -89 12 142 94 308 57 320 -113 -23 23 -125 -44 24 -186 275 174 -184 -73 70 -72 -264 43 172
3778 172 186 85 -47 34 61 -147 1 16 -88 117 -158 -233 -12 119 -89 -12 12 -321 215 197 -35 68 -230
$$ packed form
3608A3k44l2L68J2l56J16L32k0n6j4j06Np8m2J48M7K1J71j68l05R1J78j88J23
3632A6J45N9o0p7j29k90J76J46j76L27j16J44%n9k55l4Q8J27j14j1N9K85p7L5
3656B09j94m7M0P3Q7j70N2L4p7P9l15J34K05j81K55Mo0j39l11K54R0j71L64l30
3680a15L11j46k84K71p8j0J25L7k2j3p5p9p2PN3R7J31Q3k21R6K7K7l90J32n1J73
3706A4J66k22P6k31K4J02J1K53k56J57j73J0m1J67k04M2J65j09K98R2k74l05J40
3729i8N5r8K47k9j15P5l4J20k07K1MR1Q2Q5K5m20J83K4oRN0K29k93%J67k95L9
3756h9J01J30m8K14k51K63m33R0M6j48Q1O8k10M61j01l58J11J43j42j92L07J29
3778A72J4j01j32Q1K7k08J48J5j04K05k75p5K21J31k08P7K4l33N36j8k32J03k98
$$ plain form
3801 -230 32 -59 35 275 89 -60 99 -204 -245 -287 28 39 -7 217 37 73 -11 8 -300 19 164 178 33
3824 33 152 123 -27 10 -135 -330 -144 250 -166 229 107 55 -70 30 281 -28 114 -167 -8 87 230 -166
3846 -166 103 37 -17 240 147 255 66 -97 -181 33 104 110 -103 -41 -38 -45 -99 -182 26 -111 -4 139 7 -10 283
3871 283 8 -145 -230 -253 -78 38 -73 -183 231 158 -132 -375 -44 -56 198 -166 67 57 -126 50 6 -62
3893 -62 54 -262 -45 49 153 -178 -188 -188 -216 142 145 16 -57 154 -91 -137 -57 -97 72 -358 60 174 89 102 -94
3918 -94 -267 -188 -271 -167 136 57 -101 -18 -232 -3 -47 -172 -156 -79 205 -32 74 -104 132 -48 28 65 93 9
3942 9 358 -26 -53 -74 -32 54 31 103 64 -16 -61 -55 3 -155 -174 81 131 123 114 -156 28 -80 -25 -299 -58 128 139
3969 139 73 -49 75 42 -29 -297 34 -142 68 105 -40 -146 -107 163 189 -125 32 -10 -76 328 -136 -27 -102
$$ packed form
3801b30K62r1R4K40j86j49J59l03m1m2L15J1m6K24j80L6q4J9l08L19J45J4j45
3824C3J19k9j50L7j45j95J86L94m16L95j22n2j25J00K51l09J42k81J59R5J43l96
3846a66K69o6n4K57r3J08j89j63q4K14P1Ok13O2Lpn4q3K08j37J07J43j32j7K93
3871B83k75j53q5k3J75J16j11j10M14p3k90k43L31j2K54l64K33j0j83J76m4o8
3893f2J16l16K17R4J04l31j0%k8L58Lj29p3K11k45m6Q0m0J69m30M18J14q5J3j96
3918i4j73P9q3J04L03p9j58Q3k14K29m4j25J6P7K84k37J06j78K36j80P6L7K8q4
3942IL49l84k7k1M2Q6k3P2l9q0m5ON8j58j9K55N0qrk70J84j08N5k74K41J86J1
3969A39o6j22J24l3p1k68L31j76K10L7j45j06L9K70K6l14J57m2o6M04m64J09p5
$$ plain form
3992 -102 35 69 -112 -126 21 -92 27 -231 -197 11 176 123 56 300 80 -35 33 -8 -49 77 -13 72 -85
4015 -85 142 -164 42 -168 -349 24 8 175 210 -64 -80 185 -17 -76 54 81 -69 -17 18 314 -135 -249 -121
4038 -121 -32 166 270 -160 266 7 11 -165 0 47 84 120 -121 -124 -199 -26 -36 68 -52 -23 76 21 -298 -106
4062 -106 -40 46 -112 -56 171 127 94 -2 129 -34 -254 -63 225 -98 219 229 -149 -37 109 -188 4 209
4084 209 50 5 -184 -14 -196 -215 14 166 23 -48 -239 -150 243 70 40 -264 -212 287 -9 63 175 -33
4106 -33 135 -102 -140 -164 61 241 -154 254 -217 -66 270 72 -181 -7 81 -55 147 44 -130 -91 -254 -229
4128 -229 -14 65 -43 -26 -43 -171 -93 -44 54 -30 -112 86 5 78 88 47 51 20 -24 47 151 92 238 9 66 -188
4154 -188 59 -119 36 263 -71 -42 -338 38 126 -127 -262 -35 2 -163 -68 188 -139 63 20 143 90 -5
$$ packed form
3992a02J37L4j81j4J47j13J19k58L4K08J65n3o7K44k20j15O8m1m1J26r0Q5j57
4015h5K27l06K06k10j81L73j6J67L5k74j6K65k02n9J30K7j50N2L5K96m49j14J28
4038a21Q9J98J04m30M26k59Mj76J65M7L7L6k41lp5J73j0J04j20K9R9n5l19J92
4062a06O6Q6j58N6K27m4l3r6J31j63k20J91K88l23L17J0l78J12J46k97J92K05
4084B09j59m5j89J70j82j9K29J52j43p1j91Q9L93j73l0l04N2M99k96P2J12k08
4106c3J68k37l8k4K25J80l95M08m71J51L36j98k53J74Q8j36K02j03j74L9j63K5
4128b29K15P9j08J7j7j28P8M9R8q4q2J98q1P3J0m1Ml1m4P1J04n9J46k29N7k54
4154a88K47j78J55K27l34K9k96L76Q8k53j35K27L7j65R5K56l27K02m3J23n3r5
$$ plain form
4176 -5 -67 235 216 311 103 -181 11 -84 153 54 189 78 -72 -127 -106 -45 -33 117 273 34 -48 -153 30 -143
4200 -143 -136 62 -118 -266 87 -88 -38 -349 38 13 -89 160 112 243 -47 16 113 -40 197 209 241 109 225
4223 225 -109 -102 241 -136 105 156 233 -61 62 45 -43 70 -54 -113 -244 31 -366 -154 65 -229 -19 -53 -166
4246 -166 -125 -122 -42 -205 24 136 -63 -130 -108 -88 -18 76 88 216 42 -209 49 45 116 81 93 211 23 -123 -11
4271 -11 185 -82 117 -22 -313 -24 -124 13 -131 211 44 67 23 3 14 -29 -208 -32 143 -98 225 240
4293 240 -213 70 -26 34 -23 179 -166 -86 167 -121 77 -312 14 -124 -138 -191 -53 -7 20 111 -13 141 48
4316 48 57 -153 -44 -64 -103 192 108 99 -44 -147 -2 -12 -93 59 -3 383 -23 -254 -2 -49 31 -141 -63 -28 -18
4341 -18 33 -141 -25 68 19 64 139 -28 157 114 -43 -26 15 221 -131 194 -61 -196 -27 -176 130 187 271 133
$$ packed form
4176eo2L02j9R5k08k84J92r5K37r9J35j11j50n5K1O1J2J50J56k39q2j05J83j73
4200a43PJ98j80j48L53j75N0l11L87k5j02K49m8J31k90O3R7j53K37J2L2j32J16
4223B25l34PL43l77K41N1P7k94J23j7q8J13j24n9j31K75l97K12K19k94K10l4j13
4246a66M1LQ0j63K29J12j99o7K2K0P0R4J2J28j74k51K58mP1l5J2J18j88j46J12
4271a1J96k67J99j39k91K89j00J37j44L42j67K3m4k0J1m3j79J76J75k41L23J5
4293B40m53K83r6O0n7K02l45Q0K53k88J98l89L26j38j4n3J38M6K7R1j24J54r3
4316D8Rk10J09k0l9K95q4rj43j03J45j0q1J52o2L86m06k31K52m7Q0j72P8L5J0
4341a8N1j74J16R3m9M5P5j67J85m3j57J7M1K06l52L25k55j35J69j49L06N7Q4j38
$$ plain form
4365 133 139 -248 45 183 19 52 -205 -23 -168 143 -25 -114 -24 -118 228 -214 -13 116 55 -44 120 -63 -238
4388 -238 87 -80 -26 138 126 -95 -16 212 50 47 31 14 162 -34 78 -242 109 219 -214 -183 -75 -17 277
4411 277 -206 -68 32 -46 -154 41 -64 -156 17 173 -109 9 -18 122 -117 24 216 15 4 -101 -135 -106
4433 -106 -72 248 121 -138 106 -115 305 -20 -10 -11 -89 151 265 -41 -270 -120 -47 -198 1 -193 108 -250
4455 -250 61 -157 13 -66 80 -120 110 -7 55 -24 -98 -168 152 -50 106 41 211 219 -208 271 -89 -171 -77
4478 -77 -76 -121 -37 67 -22 -71 -141 84 -230 115 -35 26 224 -236 56 -21 24 -21 180 112 21 -121 -52 246 89
4503 89 104 -77 12 133 -222 -165 45 106 184 63 -253 10 -94 48 -21 30 78 35 -7 -35 0 -39 239 40 -4
4528 -4 -255 23 134 87 -165 -314 -7 93 58 -89 154 53 -49 78 -43 -149 21 -74 -18 -154 4 274
$$ packed form
4365A33Ol87K93J38j64L3k57J82j45L11j68q9R0r4L46m42K01J29o1r9J64j83j75
4388b38L25j67N4J64j2k21P9K28j62lj6j7J48j96J12l20L51J10m33L1J08N8K94
4411B77m83J38J00p8j08J95j05r2J73J56k82J18k7J40k39J41J92k01j1j05l4K9
4433a06L4L20j27k59K44k21M20l25J0jp8K40J14l06k29J50P3j51J99j94L01l58
4455b50L11k18J70p9J46k00K30j17O2p9p4p0L20k02J56o5J70Qm27M79l60q2R4
4478g7Jm5Q4J04q9m9p0K25l14L45j50O1J98m60K92p7M5m5K01o8r1j42O9K98j57
4503H9J5j81Q9J21l55N7K10O1P8j21l16K63j04J42o9N1M8m3m2k8L5l9K78j99m4
4528dk51K78J11m7k52j49L07J00l5j47K43j01j02J27j21j06J70r5N6j36J58K70
$$ plain form
4550 274 14 -16 -192 33 75 294 -138 -123 -214 -157 -90 55 221 -2 -77 -165 -31 194 113 -163 -86 0 242 -34
4574 -34 -103 46 -32 216 245 103 67 -205 28 -44 7 -185 93 82 -142 22 -19 -11 -85 89 163 14 -94 97
4598 97 -38 -48 175 220 27 -158 94 183 284 289 131 57 -46 -86 -95 10 69 171 116 -43 134 113 -180 59
4622 59 -139 21 -68 -19 12 -124 50 102 13 69 -207 -69 -207 -16 126 89 113 -193 -47 -144 128 67 -146 -39
4646 -39 -187 153 -213 55 -11 -97 -65 176 -163 321 -140 3 91 -80 88 -9 86 -17 28 -16 217 -107 -194
4669 -194 -246 75 71 -38 -27 39 137 -103 -203 27 71 -169 13 99 -139 -293 -16 146 -255 -15 -47 -15 -46 -90
4693 -90 -164 -42 105 -88 242 213 15 385 -287 -24 -88 170 -16 -306 -165 -61 -31 276 -52 -128 3 26
4715 26 -6 -76 30 -187 -221 -264 107 31 -214 193 94 118 -126 202 -91 -103 -309 -47 102 24 37 158 24 130
$$ packed form
4550B74k60l0j76K25M2K19m32J5r1N7O7J45J66k23p5q8J34K25q1k76P7Q6K42k76
4574c4o9J49p8K48K9j42l6k72K33p2N1j92K78j1k24J64m1Qp4J74P4j49j08J91
4598I7j35j0K23M5j93j85K52Q9J01Nj58p4j03m0rJ05N9J02n5j59J77k1k93K39
4622E9j98J60q9M9L1j36J74N2q9N6k76J38j38J91J42l7K4l06J46r7K72o1k13J07
4646c9j48L40l66K68o6q6L2K41l39M84m61J43Q8j71J68r7R5j03M5m4K33l24q7
4669a94n2L21mj09J1O6R8k40j00K30M4k40J82Q6k38j54K77J62m01K40l2L2l1m4
4693i0p4J22J47j93L30k9j98L70o72K63o4K58j86k90J41J04L0L07l28p6J31K3
4715B6l2p0J06k17l4m3L71p6k45M07r9K4k44L28k93j2k06K62J49p8J3J21j34J06
$$ plain form
4739 130 142 -191 -117 -76 129 -170 56 -75 84 -118 -87 -63 -190 58 -51 -24 79 -48 276 -87 54 181
4761 181 29 -82 282 220 -116 -130 -166 23 -50 -241 36 -94 82 -110 -22 1 -203 42 226 -215 -163 109
4783 109 -120 -287 -108 -96 31 -153 71 110 -155 161 -184 35 -84 -110 147 152 122 -6 -68 -103 125 2 -80
4806 -80 60 191 15 -142 75 41 164 61 42 57 36 50 -129 -92 -96 -321 -66 -40 101 81 73 172 -318 -265 -187
4831 -187 -143 -84 -121 207 -249 -193 54 -48 -119 -22 -4 40 -106 186 97 81 -80 -241 -149 143 1 24 3 273
4855 273 -47 -261 88 134 24 -189 35 70 167 -159 -167 -115 121 -202 -99 86 53 120 -198 -95 -185 264 -105
4878 -105 53 -152 -255 -20 -14 -33 136 -80 -32 -131 -10 307 -341 42 -142 78 71 152 -71 -181 -104 6 100
4901 100 14 -27 12 -61 71 110 -239 261 -49 -44 248 -188 -258 216 211 73 72 -9 325 -4 -29 -110 76 -393 137
$$ packed form
4739A30J2l33P4M1K05k99K26j31J59k02L1K4j27K48j09K7J03j27L24l63J41J27
4761A81j52j11L64o2l36j4l6J89p3j91K77j30J76j92Q8K3k04K45J84m41N2K72
4783A09k29j67J79J2J27j84K24L9k65L16l45K19j19k6K57Nl0j28o2l5K28j23q2
4806h0J40J31j76j57K17l4J23j03j9J5k1J4j79L7mk25K55K6J41k0qR9m90N3P8
4831a87M4N9l7L28m56N6K47j02p1R7J8M4j46K92q9j6j61j61R2K92j42K3k1K70
4855B73l20k14L49M6j10k13K24L5R7l26qN2K36l23J03J85l3O7l18J03r0M49l69
4878a05J58k05j03K35Oj9J69k16M8r9J21L17o48L83j84K20pQ1k23j10P7J10R4
4901A00q6m1L9p3J32L9l49N00l10NK92m36p0M74nj38jq1L34l29k5q1J86m69N30
$$ plain form
4926 137 39 -22 162 -325 104 -31 93 74 136 -21 9 52 108 38 79 -19 82 -219 235 -176 8 -138 -127 290
4950 290 -6 -16 209 -225 78 1 -104 45 -218 -205 36 -7 93 79 124 -149 5 95 51 -76 -53 -77 84
4973 84 146 109 231 140 -2 -281 224 -103 -44 72 -296 -13 -35 -53 186 45 -182 214 -130 -31 63 -24 -5 94
4997 94 120 176 -149 159 -101 180 -33 -301 274 70 -212 63 -31 69 -175 142 -213 119 109 36 -85 220
5019 220 94 -131 -54 133 166 -63 154 125 -30 156 101 -42 82 -184 -106 202 -103 76 25 -69 265 149
5041 149 8 -440 366 239 -118 4 51 -155 156 -16 -21 -4 -139 188 -84 93 111 26 143 65 70 107 45 -167
5065 -167 -91 143 90 -61 -94 16 1 227 202 120 182 155 -59 -144 -77 -290 69 -15 66 11 -143 -18 -205 -5
5089 -5 220 -47 216 -84 -38 -90 -153 165 -73 -30 75 -133 29 131 -49 260 -58 -101 116 115 257 126 -100
$$ packed form
4926A37r8o1J84m87M29j35J24j9O2j57L0M3N6p0M1r8J01l01M54m11J84j46J1M17
4950B90k96j0K25m34L03p7j05J49k63J3K41m3J00j4M5k73J54R0m4j27K3k4J61
4973H4O2l7J22r1j42k79N05l27N9J16l68K83k2j8K39j41k27L96l44R9R4q7J9R9
4997I4K6N6l25L08k60K81k13k68N75k04k82K75r4J00k44L17l55L32j0p3j21L05
5019B20j26k25P7J87L3k29K17k9j55J86n5j43J24k66P8L08l05J79n1r4L34j16
5041A49j41m48Q06j27l57J22M7k06L11j72nJ7j35L27k72J77J8q5J17p8NL7o2k12
5065a67P6K34n3j51l3J10j5K26k5q2O2k7k14q5O7k13L59q4Q1n5j54J25j87K00
5089eK25k67K63l00M6n2o3L18k38M3J05k08J62J02j80L09l18m3K17jJ42j31k26
$$ plain form
5112 -100 -24 119 -102 -6 43 48 53 -116 290 155 -30 61 22 -42 -16 226 -44 62 -101 -25 59 154 -52 -143 163
5137 163 -213 5 115 -93 112 49 -75 -112 -75 -137 -63 67 69 -11 6 43 103 -60 -6 46 -18 55 58 103 123 43 187
5164 187 231 103 11 60 47 68 -8 -54 197 105 -111 30 170 -94 -41 -86 -90 29 -165 -10 341 -73 93 59
5188 59 32 -83 23 39 7 47 222 -197 35 -101 -21 24 63 -20 8 21 323 80 35 -77 -192 -133 16 159
5212 159 85 96 80 212 -61 37 -86 79 -179 -34 -59 -193 -208 -193 -118 55 -96 -186 -11 -70 187 19 156
5235 156 65 -32 -10 -32 198 -89 -18 122 119 -67 -103 -183 -180 -61 104 117 142 297 -83 154 -55 1 -168 -91 148
5260 148 34 -198 50 -6 -325 -29 -71 -11 -87 -178 180 -96 -22 221 126 -14 -107 68 75 -3 -100 11 -213 -80
5284 -80 -258 112 -169 17 -92 131 -83 -45 146 123 -72 -290 195 -34 115 -152 114 -158 -128 47 -144
$$ packed form
5112a00P6J43k21R6M9NNj69M06j35j85R1l9o4K6K42k70J06j63P6Q4R5k06r1L06
5137A63l76K18J10k08K05o3j24l7L7o2P4J30Kq0J7L7O0j63N4N2o4P3LM5K0q0J44
5164A87M4j28r2M9j3K1p6m6K51r2k16J41J40k64N3m5mJ19j94J55L51m14J66l4
5188E9k7j15J06J6l2M0J75m19K32j36Q0M5L9q3K8J3L02k43m5j12j15N9J49J43
5212A59p4J1j6J32k73R8j23J65k58J45k5j34j5J5P5J73j51r0J75n9K57j68J37
5235A56r1r7K2k2K30k87P1J40lj86l6q0LJ19J65J3K5J55l80K37k09N6j69P7K39
5260A48j14k32K48n6l19K96m2O0p6r1L58k76P4K43r5j40r3J75Pp8r7J11k24J33
5284h0j78L70k81J86j09K23k14L8J91k3j95k18M85k29J49k67K66k72L0J75j91
$$ plain form
5305 -144 33 257 -28 95 -116 190 -304 -62 328 -180 7 -38 3 56 208 58 -89 -12 -8 94 -187 -46
5327 -46 -67 85 86 -111 130 104 -8 10 -270 -26 22 27 -29 -80 116 9 76 -102 -41 100 190 -1 154 235 71
5352 71 393 -202 -105 52 174 147 28 43 36 29 -67 -166 -43 -255 -225 -70 97 -101 202 217 119 -186 -42 -153
5376 -153 46 31 -76 -140 -137 175 -127 51 -213 -143 31 37 -71 -8 89 142 -114 59 -88 -23 250 -137 7 -2
5400 -2 132 88 -123 17 216 43 47 84 -57 130 115 -122 -13 39 -24 -142 -163 95 103 4 -44 49 47 210 -27 80
5426 80 141 215 -124 131 111 62 9 214 38 -48 93 -100 -98 -130 90 30 1 -7 -205 116 -175 283 -33 -91 47
5451 47 250 -134 -83 186 98 2 101 35 44 -162 129 166 195 -32 211 -4 301 39 -173 -159 9 273 46 79
5475 79 -222 -230 -98 75 -69 -157 -195 108 161 -133 -143 45 -109 -68 104 170 163 -22 -177 -151 -31 114 -60 -167
$$ packed form
5305a44J77K24k85J23k11L06m94K42L90n08J87m5M1N3J52j50j47P7MJ02k81J41
5327d6k1J52Jj97K41k6j12J8k80K44M8Nn6n1J96j07O7j78O1J41R0j91J55Q1j64
5352G1L22n95R7J57J22k7j19J5ppr6r9J23k12L0J55J67j98L03J5r8l05J44j11
5376a53J99j5j07o4LL12l02J78k64P0J74Oj08O3R7N3k56J73j47O5K73l87J44r
5400bJ34m4k11J40J99j73ML7j41J87j5k37J09N2o3j18k1K58Qr9m8R3kJ63k37J07
5426H0O1P4l39K55k0m9n3K05j76q6J41j93Kl2K20o0k9qj98L21k91M58l16n8J38
5451D7K03l84N1K69q8r6R9o6Rk06K91L7K9k27K43k15L05k62k12J4J68K64k27L3
5475G9l01qJ32J73j44q8l8L03N3k94j0J88j54M1J72O6pj85j55K6J20J45j74j07
$$ plain form
5499 -167 -72 -148 -67 4 44 -66 223 150 193 0 -92 174 179 -221 -12 46 200 254 7 151 -283 -186 -44 87
5523 87 -28 -9 -53 318 -162 24 -39 -89 27 108 -116 -337 -65 146 24 63 -6 15 -64 116 56 78 130 124 130 129
5549 129 179 -262 36 51 120 24 98 -31 174 301 2 -151 -157 -179 89 -1 -42 -15 38 5 53 -60 52 67 223
5574 223 70 27 -35 220 110 -162 239 -81 -229 -30 10 109 -134 125 82 -42 87 55 -59 136 -108 -244
5596 -244 74 78 9 -19 87 -89 7 -154 116 42 -59 -153 -99 128 -83 -241 30 -6 52 -245 -213 101 248 208
5620 208 33 -224 -223 -251 -157 82 -259 57 -259 -95 129 -124 -13 83 140 13 -14 -137 -97 -17 46 -155 187
5643 187 198 6 -38 269 -26 -82 73 -74 37 -102 -65 -76 -72 88 151 -31 -159 63 74 0 10 -126 25 277
5667 277 109 -28 71 -124 24 129 34 120 -162 176 -138 -51 100 -118 139 19 -45 -37 -151 -237 -164 -10 74
$$ packed form
5499a67R5p6Q1P1M0j10K89p3M3j93r2K66Nm00K09N8J54N4k47J44m34R7J42J31
5523H7j15J9m4L71m80J86o3n0J16Q1k24k21K72K11j22L9o9K1p9J80o0K2N2oOj
5549A29N0m41K98J5O9r6P4j29K05J27k99j53ok2K68r0m1K7N3l3M8j13J12J5J56
5574B23j53m3o2K55j10k72M01l20j48J99M0R9k43K59m3j24J29l2j14J95k44j36
5596b44L18Mo9k8J06j76R6j61K70p4j01r4N4K27k11j58K71l6N8k97L2L14J47m0
5620B08j75k57Jk8R4K39l41L16l16J64K24k53J11R6N7j27k7j23M0Q0O3k01L42
5643A87J1j92m4L07k95n6J55j47J11j39L7j1MJ60O3j82j28K22J1p4J0j36J51K52
5667B77j68j37R9j95J48J05r5Q6k82L38l14Q7J51k18K57j20o4Qj14q6P3J54Q4
$$ plain form
5690 74 99 66 -33 -38 101 99 -73 -191 25 -68 62 -69 95 -250 -52 73 -57 -89 -190 -79 -66 129 34 152
5714 152 -8 1 -41 -55 -52 41 36 -43 -214 -111 14 203 -16 -18 53 35 -21 8 -86 -136 -66 92 -157 -84 81 -22 -60
5741 -60 33 295 63 126 -197 130 -101 -85 -68 -154 210 -69 -218 145 -133 91 81 12 -10 154 15 161 18
5764 18 238 -61 133 -183 24 -49 99 -97 174 203 -25 182 340 74 -14 72 185 46 -225 -124 -164 57
5786 57 -10 -126 -128 -77 0 -58 29 87 43 -147 21 119 13 1 -212 -37 -68 61 -56 50 -101 -69 -24 76 -217
5811 -217 94 202 -88 -144 -4 61 -10 175 63 93 -72 260 -96 -110 -59 9 88 148 24 -115 134 -16 131
5834 131 166 -161 137 164 43 70 -69 -20 -237 -11 59 -64 -84 -58 -88 -38 -82 -41 -94 7 115 -277 -25 -114
5858 -114 115 103 143 138 152 -19 4 -79 -52 117 1 214 -3 -41 135 215 106 -178 70 30 22 -42 -125 78 317
$$ packed form
5690G4K5l3r9nJ39kj72j18K16r3J30j31J64l45J98J25j30l2j01J11J3J95r5J18
5714A52j60Rm2j4LR3np9j71J03J25J89k19kP1j8n6K9r4n0P0J58k49P3J65j03l8
5741f0R3K62k32O3l23L27k31J6J7q6L64k79j49L63k78K24j0o9k2J64j39J46j43
5764A8K20k99J94l16K07p3J48j96K71K9k28K07J58k66q8Q6J13j39k71J01m0K21
5786E7o7j16kN1P7n8Q7N8m4j90J68R8j06j2k13J75l1J29j17J06j51L2M5J00k93
5811b17L11J08k90n6J40O5p1J85j12L0j65L32l56j4N1O8P9O0j24j39K49j50J47
5834A31L5l27K98K7j21K7j39M9k17K26P0j23k0K6l0N0m4M1n3J01J08l92K52q9
5858a14K29j2M0nJ4j71K3q3K7J69j16K13k17l8J76Q0j09k84K48m0qo4q3K03K39
$$ plain form
5883 317 223 -121 26 -5 -32 -40 -67 95 -172 119 -256 -41 -76 -49 -97 148 263 -15 -53 -106 -23 -9 -55 63 -81
5908 -81 2 -117 -152 -60 58 -89 -46 188 40 -34 -193 259 -93 -392 128 89 129 114 208 -19 -203 73 -42
5931 -42 88 -187 296 66 35 191 -49 -82 70 185 -71 -130 234 185 -13 -124 -119 -60 25 -72 267 108 -45
5954 -45 -36 16 140 -113 120 12 -31 96 -153 -87 -68 -5 -184 218 -136 -357 8 25 -29 119 -203 150 2
5977 2 -177 -60 138 -119 154 115 -19 -103 18 4 -161 33 -108 -49 -84 -85 -14 66 -20 -36 130 6 42 116 -194
6002 -194 123 -115 -2 -56 -180 111 97 -62 105 -47 8 -134 226 -94 46 -147 32 -11 184 -92 -193
6023 -193 153 177 -61 133 197 -113 92 -77 23 63 221 58 92 -56 -79 -87 -9 118 61 -249 108 76 -53
6046 -53 152 121 -73 74 -90 -87 -34 -95 88 -152 -60 -27 -43 87 70 26 323 106 -27 70 47 -5 -29 81 -22
$$ packed form
5883C17r4l44J47l1k7qk7J62k67K91l75K15l5K7m8K45J15k78l8n3Q3J4m6J18j44
5908h1Q3j19l5R2J18j47M3K34j48p4j59M52l52k99N20l9M0j5R4k27j84K76j15
5931d2J30k75M83k30l1J56k40l3J52J15k56n9L64m9j98j11NN9Q5r7L39j59j53
5954d5RN2J24k53K33j08m3J27k49O6J9O3j79M02l54k21L65J7n4J48l22L53j48
5977Bj79J17J98k57K73l9j34q4J21j4j65J94j41N9l5jP1Q0q6j6J66j24L6P4l10
6002a94L17k38J13n4j24K91j4j59J67j52N5j42L60l20J40j93J79m3J95k76j01
6023a93L46K4k38J94O4l10K05j69J00M0J58j63L4j48k3qP8J27n7l10L57l2j29
6046e3K05l1j94J47j64LN3o1J83k40R2L3j6J30j7m4K97k17j33R7k3n2k4J10j03
$$ plain form
6071 -22 37 -103 -39 24 10 64 156 -110 115 71 -259 -275 -284 83 -10 -123 -228 -273 5 -107 29 -124 -28 15 287
6096 287 -383 -231 7 -93 -125 -113 -150 15 208 166 180 -13 -83 190 73 -64 -32 69 -40 50 150 53 195
6119 195 -55 -69 38 28 101 -125 -26 53 -33 -334 162 -148 -128 20 -62 18 -13 134 30 105 35 -3 263 -347
6143 -347 -38 -54 -197 67 176 50 -98 40 -66 270 -123 -170 -25 107 -34 -158 -318 57 -85 -181 -81
6164 -81 -209 -139 -87 80 74 97 101 -36 76 61 173 -128 202 176 -186 222 66 -30 33 78 217 -61 163 55
6188 55 -321 -35 -57 267 -150 111 -72 -107 -113 81 103 -90 190 179 104 119 15 -54 144 -191 30 -203 -190 -41
6212 -41 -4 41 42 110 14 -197 261 -66 122 62 37 -28 33 -84 -54 -308 -53 -46 -65 82 74 -70 51 -210 50 153
6238 153 -157 -35 -58 -173 -117 -22 -105 208 -102 -93 -142 211 -89 157 16 -45 -191 38 -80 -195 4 -63 -6
$$ packed form
6071b2N9j40O4O3j4N4R2k66K25m4l30j6rL67r3j13j05m5K78j12J36j53R6M3K72
6096B87o70J52K38j00l2J2l7J65J93m2J4j93p0K73j17j37L2J01j09R0J00r7J42
6119A95k50j4J07j0P3k26R9P9q6l01M96l10K0J48q2Q0l1J47j04P5p0l8K66o10
6143c47L09j6j43K64J09j26j48J38j06L36l93m7J45J32j41j24j60L75j42r6J00
6164h1j28P0N2J67oK3Mj37J12j5J12l01L30k6l62M08j56r6O3M5J39k78K24j08
6188E5l76K86k2L24m17K61j83l5oJ94K2j93K80j1p5J5j04o9J98l35K21k33J3J49
6212d1L7M5JO8r6k11M58l27J88o0k5o5O1j17L0k54K55Pj9J47qj44J21k61K60J03
6238A53l10J22k3j15N6R5q3L13l10Rm9L53l00K46j41o1j46K29j18j15J99o7N7
$$ plain form
6261 -6 152 -75 -165 117 34 78 -9 78 -55 140 152 166 17 -26 -9 74 109 143 73 -13 -22 -48 234 53 140 224 -119
6288 -119 -13 1 -252 51 -142 -161 -185 -43 -38 253 83 -202 -100 -208 76 -321 0 -65 -100 -56 149 185 -119
6311 -119 41 -80 -127 -128 -224 -35 -22 -14 112 125 -116 151 -151 186 -10 78 152 152 5 154 -43 -3 -81 -72 177
6336 177 -179 -143 -80 -47 -26 277 -45 -89 -20 132 -94 -68 -153 -122 105 129 -92 -154 -64 138 -22 -100 37 42 -94
6361 -94 36 10 28 -190 -25 -80 -104 156 188 -31 201 188 302 175 145 225 8 11 -15 3 35 -14 -70 22 8 -11
6387 -11 -35 -98 -106 -23 46 -174 64 -63 129 41 81 -134 -252 -123 99 111 276 -13 47 -4 56 23 74 67 -17 -198
6413 -198 99 79 163 8 253 27 -53 3 30 100 -35 45 -88 -38 -44 41 277 -192 178 77 253 22 46 -49
6437 -49 65 231 -138 197 86 -66 -220 -59 -96 -18 -14 38 224 -44 -116 -123 115 144 -41 -260 59 -95 -7 300
$$ packed form
6261fJ58k27r0K82q3M4q7Q7j33J95J2J4j49m3J7Q3L5L4p0q6rk6K82j81Q7Q4l43
6288a19J06J4k53L03j93j9k4J42NK91j70k85J02j08K84l97L21o5l5M4K05L6l04
6311a19J60j21m7jr6J89J3QJ26J3k41K67l02L37j96Q8P4%j47J49j97M0p8RK49
6336A77l56L6O3L3K1L03l22m4O9J52k26K6q5L1K27K4k21o2R0K02j60p8J37Nj36
6361i4J30k6J8k18J65n5k4K60L2k19K32j3J14j27l0Q0k17Lk6J8L2m9n6R2j4j9
6387a1k4o3qQ3O9k20K38j27J92q8M0k15j18J29K22J2J65k89O0n1O0l3N1pq4j81
6413a98K97k0Q4j55K45k26q0N6K7P0j35Q0j33N0oQ5K36m69L70j01J76k31K4r5
6437d9J14J66l69L35j11j52j54J61l7P8MN2J86k68p2pK38K9j85k19L19j54Q8L07
$$ plain form
6461 300 33 -236 69 -175 -14 58 97 22 114 95 -81 -165 215 131 -130 96 2 11 -105 65 -37 -153 63
6484 63 -262 -83 102 37 -53 67 149 27 -108 -70 259 -90 74 -126 -201 174 34 227 178 10 -200 -313
6506 -313 -78 10 96 -117 -57 -18 -107 22 75 17 -124 -38 4 -4 53 -139 86 -153 266 -192 127 76 122 145 -207
6531 -207 58 -171 -138 108 -154 91 21 -68 -47 148 91 -56 152 -75 -46 25 -142 67 170 342 80 -67
6553 -67 -90 -121 23 -58 73 -142 24 -100 13 20 -169 111 57 -213 -53 -87 99 -251 87 191 -10 -109 -44
6576 -44 -29 -128 66 220 -11 -45 -104 2 46 -77 45 -290 48 -44 131 209 271 -32 -49 22 -161 53 27 -2
6600 -2 106 70 301 87 62 92 -2 218 -226 -7 -84 22 151 -5 91 -10 -170 -113 -89 144 142 9 8 -25 69
6625 69 -111 -57 -93 -37 -6 198 -87 -314 141 108 51 80 -33 10 -1 -92 61 -254 -177 -183 -26 49 171 76 -18 40
$$ packed form
6461C00k67k69L05k44J61P2L9p5R2j9j76q4L80q4k61K26r4Rj16J70j02j16K16
6484F3l25J79J85o5r0J20Q2j22j35L8L29l49J64k00p5L75j40J93m9j68k10j13
6506c13K35Q8Q6k13O0L9q9J29N3n8j41Q6M2qN7j92K25k39M19m58L19n1M6K3l52
6531b07K65k29L3K46k62K45p0q9K1J95n7j47K08k27K9P1j67K09J03J72k62j47
6553f7k3l1J44q1J31k15J66j24J13Pj89K80n4k70J60l4J86l50L38J04k01r9O5
6576d4J5r9J94J54k31l4n9J06M4j23J22l35L38r2J75P8O2l03j7P1j83K14k6k9
6600bJ08l6K31k14k5L0r4K20m44K19p7J06J29j56R6j01j60N7K4K33kj33jl3R4
6625F9j80N4l6N6L1K04k85k27M55l3n7K9j13M3j1r1J53l15P7oJ57P5J22r5r4N8
$$ plain form
6651 40 96 27 -43 28 107 -232 -53 56 -34 -56 1 -134 170 34 -79 223 -33 -107 158 -17 -64 -104 -171 -7
6675 -7 194 64 51 -159 -61 -32 -102 172 -173 9 -19 -224 48 -190 -13 -93 234 71 76 34 230 91 97 25 -186
6700 -186 -253 31 138 -1 -43 -101 27 55 260 21 19 -66 -46 134 -253 123 -113 -4 -284 -119 -203 36 -99
6723 -99 -13 -1 -182 -39 185 -217 -8 157 -174 -149 -89 17 -136 -238 -69 298 -106 58 -61 -44 -180 -38
6745 -38 -132 52 -85 109 27 31 -74 -32 -82 117 3 -80 206 56 137 158 299 268 -34 234 -37 118 -43 -155
6769 -155 -34 53 59 215 -78 -17 93 84 60 63 -91 -114 -209 -41 67 -267 205 6 152 28 -196 -167 183 -37
6793 -37 213 -72 -250 161 29 -241 -94 -102 -8 -16 -163 -34 -103 0 -158 10 186 -6 216 -31 -55 -102 128
6816 128 32 -432 20 -241 -7 -121 -7 -264 -57 4 161 101 -84 127 262 141 -69 49 -148 -32 62
$$ packed form
6651D0N6o9p0P1P9l39J79J09r0k2N7j35L04j36j13L02k56p4K65j75m7m0o7J64
6675gK01j30j3k10R8K9p0K74l45J82k8k05K72k38J77q0L27j63Nm2J96j39Op2k11
6700a86o7K84J07j39m2n8J28K8K05k39kq5K0J80l87L76k36J09k80J65q4K39j35
6723i9Q6J2j81J43K24m02K09J65l31K5O0J06j53j02J69L67m04J64j19J7j36J42
6745c8r4J84j37J94q2Mj05M2n0J99j14q3K86j50Q1K1J41l1l02K68k71J55j61j12
6769a55J21Q7OJ56k93O1J10rk4Lj54k3r5J68J08l34M72j99J46j24k24K9L50k20
6793c7K50k85j78M11j32k70J47qR4qj47J29o9J03j58J68J76j92K22k47k4m7K30
6816A28r6m64M52k61K34j14J14k57K07O1J57o0j85K11J35j21k10J18j97J16R4
$$ plain form
6837 62 62 -94 -90 -116 -94 -255 -132 119 123 64 -42 83 -89 33 -57 86 -197 -83 115 8 34 218 84 45
6861 45 184 0 -38 -140 96 -38 -31 -144 74 -128 -87 200 60 166 -131 -19 57 5 186 -92 52 -189
6883 -189 3 146 8 -7 -32 -59 203 179 -5 171 61 154 13 -79 -4 -89 147 46 170 35 87 -32 -160
6906 -160 84 87 18 -14 7 46 -278 -52 -52 54 225 113 104 -163 87 49 -94 101 266 -77 134 -41 -97 -9
6930 -9 -91 51 -49 -132 -22 -134 46 -9 66 3 17 -12 51 -96 255 65 -208 -90 -11 24 -57 -7 51 84 -199
6955 -199 -33 -67 315 -110 235 167 156 -64 -41 143 -128 -48 70 -45 226 -106 166 196 -177 -132 44 131 266
6978 266 82 -74 -42 131 -13 -117 237 16 -56 -22 189 122 -317 -26 -173 -50 231 -19 -111 144 83 -26
7000 -26 -213 107 -79 -2 -139 -100 -176 48 -367 -34 5 8 9 -263 26 -32 -169 162 235 -138 159 216 -57 -101
$$ packed form
6837F2%j56Mk6K2j61J23K51Mn9j06J25j72J22r0J43k83J14J98j07K6J84j34l9
6861D5J39j84l8j02K36j34Pj13K18k02M1K87j40J06k97J12P6n2J81k78J44k41
6883a89J92J43j38j5k5k7K62k4j84J76j10R3j41r2P5q5K36j01J24j35N2j19j28
6906a60K44Lo9l2K1L9l24K26%J06J71j12rk67K50l8j43J95J65l43K11j75n6Q8
6930iq2J42j00q3J10j12J80n5P5o3J4k9O3j47L51j90k73J18P9L5q1N0N8L3k83
6955a99J66l4L82m25L45o8j1k20K3J84k71Q0J18j15K71l32K72L0l73M5J76Q7J35
6978B66j84j56L2J73j44j04L54k21p2L4K11o7m39K91j47J23K81k50r2K55o1j09
7000b6j87L20j86P7j37L9p6K24m15L33L9LJk72K89n8j37L31P3l73K97N7k73m4
$$ plain form
7024 -101 299 -126 22 -119 38 158 91 -52 13 -176 94 24 49 -122 -341 -62 213 12 236 23 40 72
7046 72 -218 -1 135 70 54 -34 -42 -312 180 54 201 161 -229 363 -155 -342 -174 -169 -131 214 -123 -287 -138
7069 -138 -31 53 -48 254 19 20 -145 -5 71 114 -100 -93 -99 45 -59 -37 -156 -40 110 -109 182 186 -11 76
7093 76 -98 -144 2 -4 99 209 -68 107 131 -58 -35 74 108 -172 -44 356 144 -50 71 85 -104 -190 117
7116 117 131 -73 319 -233 206 159 32 26 147 -81 -17 22 -24 158 -93 -103 -70 105 -56 -34 80 71 -201 5
7140 5 -5 9 -55 -138 -62 176 47 87 8 -30 -34 -177 28 6 112 4 182 -5 -298 -58 300 -68 -30 -175 33
7165 33 -141 -100 84 -114 -312 201 76 -114 59 -41 -11 -62 0 -14 24 117 -33 13 -121 237 65 -83 -15
7188 -15 100 205 -88 -255 -177 -135 95 56 48 83 15 64 163 4 45 -34 199 256 -38 41 130 30 -29 -100 92 -83
$$ packed form
7024a01M00m25J48j41J57J20o7j43O5j89K70p0K5j71k19K79K75k01K24k13J7L2
7046G2k90K17J36o5j6q8qk70M92j26J47m0l90N92n18j87J68NL8L45l37j64J49
7069a38J07Q4j01L02k35Jj65J40P6M3k14PoJ44j04K2j19J16J50k19K91Mj97Q7
7093G6j74m6J46oJ03J10k77J75K4j89K3J09L4k80J28M00k12j94J21J4j89q6L07
7116A17J4k04L92n52M39m7j27oJ21k28O4L9m6J82k51j0L3J75j61K2J14rk72K06
7140Ej0J4o4q3P6K38j29M0p9l8mj43K05k2J06j08J78j87k93K40L58l68L8j45K08
7165C3j74M1J84j98j98N13j25j90J73j00L0n1O2j4L8R3j50M6j34L58j72j48O8
7188a5J15J05k93j67P8M2K30l9qL5o8M9R9j59M1p9K33N7k94P9Q9j00n9p1J92j75
$$ plain form
7214 -83 -119 -38 -164 17 -15 -91 74 320 114 -73 -105 -37 -26 -65 -131 42 193 64 -55 185 35 109 -76 220
7238 220 90 86 205 -119 181 -108 -76 -211 68 -3 16 71 -52 -141 -21 21 -123 -4 -11 97 214 -179 8
7261 8 -84 0 -80 -106 -121 -69 88 -9 111 -64 -26 240 132 -233 128 95 57 -158 58 21 -105 -102 158 -146 19
7286 19 165 15 -69 103 69 -260 -42 -16 -90 92 62 -4 -118 -64 100 15 -103 -43 97 85 -162 47 130 6
7310 6 -51 160 47 3 -37 -150 158 -148 -54 51 -93 91 66 70 -62 104 129 62 64 68 14 -63 -72 12 44 -223 -252
7337 -252 23 22 -213 -159 -45 -140 -129 87 59 -101 116 -8 -106 118 125 16 -31 -236 -65 -189 -99 25 -92 83
7361 83 -174 -17 -16 93 -120 -163 -140 105 -122 108 -118 -152 45 92 4 -128 153 -18 -26 283 -65 171 -65
7384 -65 137 -35 26 27 231 80 26 -93 136 348 -134 -188 156 -130 -35 199 -14 -116 326 -12 49 -146 4
$$ packed form
7214h3l6Q1j26J81l2p6J65K46k06j87l2O8J1l9o6J73J51j29j19K40j50P4j85K96
7238B20j30mJ19l24L00k89L2j35K79p1J9N5j23q9J20M2j44J19pJ08J17l93J87
7261Hr2Q4q0k6j5N2J57r7J20j75L8K66j08l65L61l3l8k15K16l7j26LK60l04J65
7286A9J46j50q4J72l4l29K18K6p4J82l0o6j14N4J64q5j18O0J40j2k47K09Q3j24
7310Fn7K11j13m4m0j13L08l06R4J05j44J84k5Mj32J66K5o7KMn4p7rQ4L2k67k9
7337b52K75jk35N4J14r5J1K16k8j60K17j24r8K24Pj09m7k05J71j24R0J24j17J75
7361H3k57J57JJ09k13m3K3K45k27K30k26l4J97M7q8j32K81j71qL09l48K36k36
7384f5K02j72O1JK04j51n4j19K29K12m82n4L44k86R5K34k13j02M42l38O1j95J50
$$ plain form
7407 4 -6 39 69 -45 346 182 63 -137 84 -26 -41 -253 -93 -72 15 82 -122 96 -112 -45 -103 -153 -88 111
7431 111 29 68 -211 -37 -214 8 0 -11 -22 106 127 -57 159 -3 -101 -13 -162 -113 -13 -84 -100 -38 44 -201 -136
7456 -136 -160 221 -174 167 -88 -62 37 249 150 58 -120 -237 -46 129 -13 -66 77 286 -170 90 -8 -145
7478 -145 44 174 2 217 -103 -187 151 85 -56 -133 2 184 66 -298 -43 252 6 -214 52 -201 224
7499 224 -111 80 10 110 138 139 78 -70 53 -11 95 -49 7 218 76 -144 -237 -50 -106 159 156 -165 108 123
7523 123 -180 158 -9 8 -28 -48 109 -174 43 -79 107 37 -70 -116 103 100 -120 -51 92 53 49 -33 -57 34 -70
7548 -70 200 -66 71 -77 39 -70 98 206 -284 116 -93 -57 129 -53 86 128 128 58 -164 -6 177 2
7570 2 -204 -89 174 98 -129 239 -102 162 11 64 228 7 -25 -47 -16 -85 118 -98 -217 -94 -160 -26 -16
$$ packed form
7407Dj0M5L0j14L91j64j19k00K21j10j5k12J60K1Q7O7k04K18k08O7n8n0O5J99
7431A11q2L9k79J74j77K22qj1j1J28K1j84K16j62r8Q8j49M9J00p1j6O2Q2k45O5
7456a36k4L81l95L41k55K6R9K12r9r2j78j17J91J75j42n3J43K09m56K60r8j37
7478a45J89J30j72K15l20q4L38o6j41p7J35J82j18l64K55K95k46k20K66k53M25
7499B24l35J91p0J00K8Jo1j48J23o4J06j44N6K11j42k20r3J87n6K65ll21K73J5
7523A23l03L38j67J7l6k0J57k83K17j22J86p0j07m6K19lk20O9J43l9mq2k4R1j04
7548g0K70k66J37j48J16j09J68J08m90M00k09L6J86j82J39M2%p0k22J58J83j75
7570Bk06J15K63p6k27L68l41K64j51N3J64k21l2k2L1o9K03k16j19J23o6J34J0
$$ plain form
7593 -16 -273 124 -230 29 -22 82 93 13 -188 10 82 -194 57 115 11 -98 -39 144 137 299 -144 -87 331
7616 331 169 263 -58 -61 65 240 23 97 3 106 210 167 20 115 -97 -201 -41 -96 236 48 -154 71 -169
7639 -169 35 45 40 0 44 -47 -146 181 92 -39 21 114 16 164 205 41 -144 -68 -294 -318 19 168 -42 -117 167
7664 167 27 -52 53 -12 -179 -400 -130 -85 -271 -107 34 -205 224 -54 -168 -22 -65 32 -36 -27 -4 122 56
7687 56 -92 -60 -75 -75 194 -113 49 223 80 127 30 -105 -4 26 20 52 128 -20 168 -79 -54 -41 115 -86 -213
7712 -213 -35 47 43 -116 59 -207 -60 76 -154 -80 21 209 -5 -108 -128 -84 124 -195 10 -38 -240 202
7734 202 -54 -37 141 285 111 -56 6 -57 -57 -67 -8 -94 -34 -80 -146 261 46 377 16 -191 60 58 -104 -35 57
7759 57 18 -257 -93 258 -29 -245 72 89 -22 -5 92 132 126 -184 86 117 -178 32 8 151 -253 207 -42
$$ packed form
7593a6k57L97l54K59n1J04J1q0k01J98P2k76K51N8j04j09N9J83pJ62m43N7M18
7616C31j62R4l21lJ26J75k17P4r4J03J04m3j47R5k12j04J60n5L32j88k02K25k40
7639a69K04J0nm0M4r1r9L27q9j31O0R3r8J48M1j64j85P6k26k4L37J49k10p5K84
7664A67j40p9J05o5j67k21K70M5j86J64J41k39M29k78j14J46m3R7o8RK3J26o6
7687E6j48L2j5%K69l07J62J74j43M7r7j35J01L0oL2P6j48J88k47K5J3J56k01j27
7712b13J78Q2mj59J75k66J47J36k30P4J01J88k14j03k0M4K08l19K05m8k02M42
7734B02k56J7J78J44j74j67O2o3%j0N9q6O0m6o6M07k15L31l61k07K51kj62O9R2
7759E7l9k75J64L51k87k16L17J7j11J7R7M0ol10K70L1k95K10k4J43m04M60k49
$$ plain form
7782 -42 156 -208 -180 -81 67 -87 -69 218 -8 120 -136 4 148 21 -68 85 -196 -220 -47 45 -150 23
7804 23 38 51 -188 74 -78 -245 -83 82 -21 -102 186 206 -114 -101 15 174 -26 -87 212 101 -98 -17 92
7827 92 -12 218 -172 107 -84 -5 -106 15 184 172 31 -146 80 42 31 22 106 220 -202 -53 116 49 -75
7850 -75 -279 -218 -52 -243 -34 -176 211 131 -41 -224 -149 210 307 7 -188 50 -317 138 -42 81 75 84 -51
7873 -51 -5 1 -76 -84 130 30 -18 -59 -17 67 77 -50 59 30 99 29 153 76 110 58 -62 -1 -58 -150 136 -32 -67
7900 -67 -11 186 -102 -24 80 -309 183 7 116 -125 -100 -9 141 55 34 110 16 108 202 36 -24 -40 -82 113 190
7925 190 240 -24 178 -78 29 -71 58 -139 -156 -111 -101 -267 -172 8 41 227 -52 -270 197 70 185 155
7947 155 -78 -121 104 258 89 156 -54 74 -67 -16 42 -319 -29 -108 -125 124 -52 -361 24 269 157 -217
$$ packed form
7782d2J98l64K8R9J48j54J8K87k26J28k56J40J44j27q9J53k81k4J73R2j95J73
7804B3J5J3k39K62j52j67J62J65j03q1K88K0l20J3J16J59k00o1K99j11j99Q1J09
7827I2j04K30l90K79j91P9j01J21J69j2j41j77K26l8j1rQ4J14m22J49J69o7j24
7850g5k04O1J66j91K09j42L87q0j72j83P5L59R7l00j95K38l67M55j80J23oRj35
7873e1M6Op7qK14j00m8m1M2Q4J0j27J09k9O9p0J24p7L4n2j20O1n7r2K86j68l5
7900f7N6J97k88P8J04l89M92j76J09k41K5R1J50q6k1P6r4R2R4j66o0j6m2J95P7
7925A90N0k64K02k56J07j00J29j97j7M5J0j66R5J80L3J86k79k18M67j27J15l0
7947A55k33m3K25J54j69O7k10J28j41N1N8l61K90p9j7K49j76l09L85K45j12l74
$$ plain form
7969 -217 -198 -14 8 170 64 -90 37 169 24 129 -166 -24 -299 -161 -80 -99 89 4 265 -122 85 -42
7991 -42 -208 -81 142 -233 -228 -102 44 -151 -11 -30 202 -8 264 46 144 -82 -131 -163 11 59 22 4 100 147
8015 147 -35 89 53 -81 -262 -214 -49 -68 -8 -277 -188 28 87 -94 7 105 -210 -111 171 16 230 -48 130
8038 130 27 162 8 211 48 -138 -10 153 -125 -96 173 -152 -20 -311 -140 -247 -78 192 -235 130
8058 130 190 -39 34 -159 133 -12 145 -154 -138 29 -68 -51 -148 38 50 -141 -166 -61 23 198 6 -39 55 138
8082 138 59 -105 -207 -29 -246 -277 56 137 -85 4 58 -72 -10 202 -366 -59 101 -85 46 30 -7 12 -108
8105 -108 -99 154 6 -209 41 -29 -33 163 -194 108 78 -51 63 125 -99 14 -89 -82 106 -83 91 36 102 -44
8129 -44 -83 -20 86 78 -42 -68 68 12 149 104 22 -158 -45 220 130 -117 -17 89 5 -226 116 22 153 -6
$$ packed form
7969b17J9J84K2J62j06j54J27J32j45J05k95J42k75J38Q1j9J88q5K61l87K07j27
7991d2j66J27K23l75NJ26J46j95J40j9K32k10K72k18R8k26m9l2J74M8l7j8R6M7
8015A47j82J24l6j34j81M8J65j9O0k69Q9K16N9j81J01R8l15R9K82j55K14k78J78
8038A30j03J35j54K03j63j86J28J63k78K9K69l25J32k91J71j07J69K70m27L65
8058A30O0k29P3j93K92j45J57k99J6J67r7J7r7J86J2j91k5J05Q4J75j92m5R4Q3
8082A38p9j64j02J78k17l1L33Q1k22Q9N4j30O2K12n68L07J60j86J31j6l7J9j20
8105a08RK53j48k15K50p0mJ96l57L02l0j29J14O2k24J13j03PJ88j89J74n5O6j46
8129d4l9O3J06qj20k6J36n6J37m5q2j80J13K65r0k47J00J06q4k31L42r4J31j59
$$ plain form
8153 -6 158 85 213 -107 32 -114 22 -18 67 234 -202 21 163 -1 -178 388 -22 -62 289 105 15 205
8175 205 222 70 16 68 -360 268 54 238 -218 22 -107 288 72 -267 41 20
$$ packed form
8153fJ64p3J28l20J39j46J36m0Q5J67m36K23J42j64j77N66m10m0L51j84r0J90
8175B05J7j52n4N2m28O28k14J84m56K40j29L95k16l39L08k1
8191B0
$$ Imaginary data points
##PAGE= N=2
##DATA TABLE= (X++(I..I)), XYDATA
$$ plain form
0 0 0 0 0 0 0 0 0 0 0 0 0 0 0 0 0 -2 8 -8 8 -8 8 -16 16 -16 24 -24 29 -32 40 -42 48 -56 64 -72 81 -90 99
37 99 -114 123 -138 154 -172 190 -211 232 -255 281 -310 342 -377 415 -457 504 -558 615 -684 762
57 762 -851 957 -1083 1237 -1430 1679 -2010 2481 -3198 4402 -6795 13311 -67164 -191318
71 -191318 -24435 -40068 -67715 99942 135085 36566 51706 -5459 -120620 -102515 -50075
82 -50075 -11300 74021 96026 76086 54038 -40448 -100568 -70240 -75270 -23029 93096 83475
94 83475 57375 82353 -37442 -134951 -48066 -36282 -57766 73950 115943 38539 52268 5771
106 5771 -119255 -88673 -25408 -29738 47770 105909 55189 38318 72 -94120 -87716 -39913
118 -39913 -24162 51619 96552 53300 40459 -2314 -92181 -75287 -32081 -36252 39731 103642
$$ packed form
0@%%%%%%%%%%%%%%%kJ0j6J6j6J6k4L2l2M0m8N3o1P2q2R0j04J20j36J53j71J89
37I9k13K37k61K92l26L62m01M43m87N36n91O52p19P92q72R61j062J173j299J446
57G62j613J808k040K320k667L109l689M491n679P600j1197K0106q0475j24154
71a91318J66883j5633k7647J67657L5143r8519J5140n7165j15161J8105N2440
82e0075L8775Q5321K2005j9940k2048r4486o0120L0328n030N2241J16125r621
94H3475k6100K4978j19795r7509Q6885J1784k1484J31716M1993p7404J3729m6497
106E771j25026L0582O3265m330P7508N8139n0720j6871l8246r4192O404M7803
118c9913J5751P5781M4933m3252j2841m2773q9867J6894M3206m171P5983O3911
$$ plain form
130 103642 54267 32560 4790 -86500 -83202 -26900 -27111 29871 96625 54338 29015 13068
142 13068 -78850 -91663 -23083 -18013 17267 92343 64222 16938 7361 -55908 -89875 -39450
154 -39450 -12033 22536 80658 63935 22875 2467 -56904 -79909 -34248 -17115 16126 81274
166 81274 63977 18082 6922 -49372 -84796 -34027 -9050 8377 72605 69906 16451 2695
178 2695 -38632 -83134 -42788 -2692 12912 61621 68743 20936 -1377 -35803 -74308 -45019
190 -45019 -7419 13009 60184 67432 20007 -1688 -31542 -72247 -46593 -4680 11245 52831
202 52831 68669 23609 -5379 -29074 -66276 -49126 -4940 13521 47192 65301 27389 -5321
214 -5321 -28259 -62329 -49740 -7127 14089 44818 63351 27933 -5696 -25305 -58691 -51764
$$ packed form
130A03642m9375k1707k7770r1290L298N6302k11N6982O6754m2287k5323j5947
142A3068r1918j2813O8580N070L5280P5076k8121m7284r577o3269l3967N0425
154c9450K7417L4569N8122j6723m1060k0408n9371k3005M5661J7133L3241O5148
166H1274j7297m5895j1160n6294l5424N0769K4977J7427O4228k699n3455j3756
178B695m1327m4502M0346M0096J5604M8709P122m7807k2313l4426l8505K9289
190d5019L7600K0428M7175P248m7425k1695k9854m0705K5654M1913J5925M1586
202E2831J5838m5060k8988k3695l7202J7150M4186J8461L3671J8109l7912l2710
214e321k2938l4070J2589M2613K1216L0729J8533l5418l3629j9609l3386O927
$$ plain form
226 -51764 -7316 15476 40009 61674 31256 -7351 -25566 -52558 -52285 -10987 17061 38549
238 38549 57125 33382 -4857 -26470 -50195 -49972 -12573 16024 36951 55036 33730 -3936
250 -3936 -25684 -47758 -48908 -13659 15540 35759 53290 34376 -4133 -24471 -44560 -49982 -15946
263 -15946 17629 33536 48393 37411 -1213 -27774 -42164 -45462 -19543 15122 35846 46974
275 46974 34616 1209 -25309 -42730 -44931 -18583 14381 33373 45380 35624 1750 -25929
287 -25929 -40076 -43230 -20665 12516 33984 43955 34525 3272 -23699 -38834 -43066 -20918 12872
300 12872 32381 41082 35561 5934 -25010 -38981 -38665 -22052 8480 33051 42145 32166 5870
313 5870 -21016 -37845 -40699 -21799 9494 31450 39241 33630 8289 -21837 -38088 -37492 -21900
$$ packed form
226e1764M4448K2792K4533K1665l0418l8607j8215k6992K73M1298K8048K1488
238C8549J8576k3743l8239k1613k3725K23L7399K8597K0927J8085k1306l7666
250c936k1748k2074j150L5249K9199K0219J7531j8914l8509k0338k0089n422L4036
263a5946L3575J5907J4857j0982l8624k6561j4390l298K5919L4665K0724J1128
275D6974j2358l3407k6518j7421k201K6348L2964J8992J2007r756l3874k7679
287b5929j4147l154K2565L3181K1468R971r430l1253k6971j5135m232K2148L3790
300A2872J9509Q701n521k9627l0944j3971L16J6613L0532K4571R094r979k6296
313E870k6886j6829k854J8900L1293K1956P791n611k5341l0126j6251N96J5592
$$ plain form
326 -21900 5670 30455 40358 31802 7696 -18555 -36424 -38410 -21770 5726 28803 39109 32206
339 32206 8877 -18061 -34728 -37517 -22159 5446 28310 36985 31673 10932 -17935 -35173 -34903
352 -34903 -22226 1841 27675 38242 29468 10296 -14024 -34605 -36612 -20757 2131 24541
364 24541 37689 30756 9208 -13588 -31508 -37329 -22233 3766 23511 33889 32433 11898 -16109
377 -16109 -31543 -32440 -23363 -1006 25466 35606 27962 11795 -10425 -31853 -35410 -20777 110
390 110 21233 34853 30215 11128 -10822 -29481 -34542 -21729 151 20475 33293 30888 11463
403 11463 -11764 -27284 -32511 -23569 -806 21698 31682 28654 13928 -9487 -28768 -31755 -21476
416 -21476 -2739 19424 31943 28591 13034 -9011 -27607 -31676 -21272 -3105 18217 31950
$$ packed form
326b1900K7570K4785R903q556k4106k6251j7869j986J6640K7496K3077J0306o903
339C2206k3329k6938j6667k789J5358K7605K2864Q675n312k0741k8867j7238K70
352c4903J2677K4067K5834J0567q774j9172k4320k0581k007J5855K2888K2410
364B4541J3148o933k1548k2796j7920n821J5096K5999J9745J0378j456k0535k8007
377a6109j5434q97R077K2357K6472J0140p644j6167k2220k1428l557J4633K0887
390A10K1123J3620m638j9087k1950j8659n061J2813K1880K0324J2818k405j9425
403A1463k3227j5520n227Q942K2763K2504R984l028j4726k3415j9281k987J0279
416b1476J8737K2163J2519l352j5557k2045j8596m069J0404J8167K1322J3733
$$ plain form
428 31950 28328 12619 -7129 -25409 -32234 -21954 -2163 17783 29904 28259 13401 -7640 -25337
441 -25337 -30296 -22236 -4603 17114 30299 27194 13647 -6365 -25168 -29900 -21247 -4977 15850
454 15850 29618 26740 13946 -4601 -24533 -30496 -20162 -4894 14397 28959 26624 13455 -3832
467 -3832 -23203 -30259 -20628 -5876 13601 29519 26417 11939 -2749 -21046 -30649 -20998 -4676
480 -4676 11865 26899 27865 13944 -4332 -21179 -28056 -20935 -7036 11650 27285 25782 13925
493 13925 -1056 -21073 -29635 -18646 -6578 9090 28105 26093 10989 719 -16951 -32103
505 -32103 -20778 -2847 7171 24243 29662 12082 -3915 -15066 -26634 -23211 -6060 10113
517 10113 23066 26604 14917 -1261 -17505 -26933 -19691 -6888 7138 24485 26179 12002 1273
$$ packed form
428C1950l622j5709j9748j8280o825J0280J9791J9946J2121j645j4858k1041j7697
441b5337m959Q060J7633K1717J3185l105j3547k0012j8803m732Q653J6270K0827
454A5850J3768k878j2794j8547j9932n963J0334J5268J9291J4562k335j3169j7287
467c832j9371p056R631J4752J9477J5918l102j4478j4688j8297r603R651J6322
480d676J6541J5034R66j3921j8276j6847o877P121J3899J8686J5635j503j1857
493A3925j4981k0017q562J0989J2068J5668J9015k012j5104j0270j7670j5152
505c2103J1325J7931J0018J7072N419j7580j5997j1151j1568L423J7151J6173
517A0113J2953L538j1687j6178j6244r428P242J2803J4026J7347J694j4177j0729
$$ plain form
530 1273 -14534 -30246 -20373 -2946 4837 21053 29350 11497 -2599 -10019 -27031 -25323 -3140
543 -3140 7967 17626 27979 15521 -3825 -12641 -22587 -24047 -7060 8558 19043 25381 15333
556 15333 -308 -13385 -24839 -21223 -5493 4743 17940 27798 14237 -1386 -9283 -24558 -24964
569 -24964 -3222 6500 13949 27855 16471 -4811 -9220 -19246 -27050 -6853 10255 13467 23401
582 23401 19556 -2390 -12828 -17951 -22772 -9968 7549 16212 22820 16858 103 -10819 -20905
595 -20905 -22884 -6412 6200 12369 24831 18273 -3204 -9150 -16248 -26270 -8995 10657 11441
608 11441 20195 21738 -1195 -13088 -14033 -22456 -12821 9315 14501 17611 19800 1868 -13239 -16103
622 -16103 -19458 -12058 5586 14426 19673 18514 1009 -10593 -15529 -22389 -11271 8337 11599 17609
$$ packed form
530A273j5807j5712R873J7427P783J6216Q297j7853j4096p420j7012J708K2183
543c140J1107R659J0353j2458j9346q816r946j460J6987J5618J0485O338j0048
556A5333j5641j3077j1454L616J5730J0236J3197R858j3561j5623p897j5275m06
569b4964K1742R722P449J3906j1384k1282m409j0026p804K0197J7108L212R934
582B3401l845k1946j0438n123m821J2804J7517Q663O608n962j6755j0922j0086
595b0905j979J6472J2612O169J2462o558k1477n946p098j0022J7275J9652P84
608A1441Q754J543k2933j1893r45q423R635K2136N186L110K189j7932j5107k864
622a6103l355P400J7644Q840N247j159j7505j1602m936o860J1118J9608L262O010
$$ plain form
636 17609 21302 1243 -13492 -12302 -19995 -15319 8379 14867 14003 20131 5505 -13942 -14363 -16715
650 -16715 -15107 4611 15891 15527 17518 5917 -11817 -15309 -17108 -13300 3787 14222 15785 18093
664 18093 5468 -11626 -13477 -16982 -15404 4504 15008 13318 17783 8101 -12809 -15005 -14190 -15796
678 -15796 1828 16717 14160 15275 9068 -10554 -16437 -13664 -13952 91 15382 14598 14275 8893
692 8893 -9183 -16233 -13817 -13493 -298 14510 14415 14379 9200 -8998 -15760 -13145 -13666 -1162 15337
707 15337 14543 12697 9894 -7282 -17427 -13055 -11857 -2765 13888 15519 12140 8941 -6499 -16542
721 -16542 -12822 -11720 -3228 13789 15734 10964 9320 -4401 -17055 -13777 -10174 -3650 12011 16155
735 16155 11289 8648 -3709 -16331 -13843 -9664 -4017 10787 16703 11836 7782 -3115 -15008 -13840
$$ packed form
636A7609L693k0059j4735J190p693M676K3698O488q64O128j4626j9447m21k352
650a6715J608J9718J1280l64J991j1601j7734l492j799L808J7087J0435J563K308
664A8093j2625j7094j851l505J578J9908J0504j690M465r682k0910k196Q15j606
678a5796J7624J4889k557J115o207j9622n883K773k88J4043J5291p84l23n382
692H893j8076p050K416L24J3195J4808r5l6n179j8198o762K615n21J2504J6499
707A5337p94j846k803j7176j0145M372J198R092J6653J631l379l199j5440j0043
721a6542L720J102Q492J7017J945m770j644j3721j2654L278L603O524J5661M144
735A6155m866k641j2357j2622K488M179N647J4804N916m867m054j0897j1893J168
$$ plain form
749 -13840 -10139 -4501 10689 16202 10840 7973 -1769 -15712 -14312 -8815 -4327 8692 16563 11419
763 11419 7185 -1374 -14566 -14736 -8445 -4202 7192 16724 12204 5943 -884 -12746 -15046 -9309
777 -9309 -3575 7397 15513 11952 6868 -747 -12974 -14979 -8641 -3826 6288 15708 12197 5899
791 5899 -252 -11843 -15247 -8658 -3488 4930 15388 12876 5385 -634 -10446 -15241 -9436 -2706 5262
806 5262 14019 12841 6279 -586 -10126 -14876 -9022 -2905 4179 13687 13606 5773 -847 -8993 -14379 -9935
822 -9935 -2960 4661 13089 12548 5933 -11 -8722 -14257 -9881 -2502 4079 12026 13474 6496 -837
837 -837 -8449 -13339 -10344 -3013 4370 11785 12643 6278 -453 -7836 -13465 -10058 -2956 3675 11067 13205
853 13205 6703 -965 -7319 -12593 -10763 -2987 4235 10163 12776 7358 -697 -7383 -12145 -10659 -3489
$$ packed form
749a3840L701N638J5190N513n362k867r742j3943J400N497M488J3019P871n144
763A1419m234q559j3192j70O291M243J1394R532m520o261o827j1862k300N737
777i309N734J0972Q116l561n084p615j2227k005O338M815J0114R420l511o298
791E899o151j1591l404O589N170Q418J0458k512p491o019r812m795N805O730P968
806E262Q757j178o562o865r540m750N854O117P084R508q1p833o620q146n386M444
822i935O975P621Q428n41o615n944q711n535M376P379O581P947J448o978p333
837h37p612m890K995P331P383P415Q58o365o731p383n629L407P102O631P392K138
853A3205o502p668o354n274J830P776P222N928K613n418q055o686m762J486P170
$$ plain form
868 -3489 4202 10113 12132 7410 205 -7326 -11986 -10274 -3513 3446 9953 12263 6965 25 -6256
883 -6256 -12157 -10838 -3212 3476 8645 12267 8055 -705 -6375 -10340 -10690 -4473 3906 9161 10759
898 10759 8046 817 -6981 -10826 -9734 -4423 2769 9365 11297 7150 665 -5830 -11010 -10162 -3922
913 -3922 2784 8496 11258 7722 75 -5717 -9796 -10490 -4872 3261 8401 10224 8062 1245 -6370
928 -6370 -10115 -9007 -4903 2201 8530 10477 7444 1674 -5444 -10182 -9479 -4352 2294 7949 10359
943 10359 7654 1327 -5087 -9393 -9816 -5046 2235 7637 10059 7722 1591 -5163 -8989 -9403 -5221
958 -5221 2114 7472 9689 7748 1911 -5141 -9236 -8721 -4879 1098 6995 10011 7328 1832 -4459
973 -4459 -8891 -9537 -4948 1937 6819 9004 7834 2133 -4459 -8449 -8422 -5274 1246 7150 9306 7036
$$ packed form
868c489P691N911K019m722p205p531m660J712O761O959O507K310n298o940o281
883f256n901J319P626O688N169L622m212q760n670l965l50O217Q379N255J598
898A0759k713p229p798l845J092N311P192O596J932m147o485o495n180Q48O240
913c922O706N712K762l536p647n792m079o94N618Q133N140J823k162o817p615
928f370l745J108M104P104O329J947l033n770p118m738P03N127O646N655K410
943A0359k705o327o414m306m23M770P281N402K422k337o131o754l826m14M182
958e221P335N358K217j941n837p052m095N15L842N977N897L016k683n496o291
973d459m432o46M589O885M882K185j170n701o592l990K7L148O520N904K156k270
$$ plain form
989 7036 1767 -4069 -8378 -8835 -5010 787 6457 9416 7727 1957 -4025 -7924 -8411 -5125 925 6094
1005 6094 8549 7751 2804 -4171 -8301 -8274 -5438 576 6254 8679 6659 2862 -3314 -8150 -8528 -5195
1021 -5195 491 6032 8657 7132 2293 -3087 -7330 -8253 -5622 626 5762 7885 7836 2947 -3949 -7359
1037 -7359 -7543 -5747 -114 6021 7709 6648 3266 -2767 -8035 -7955 -4575 -439 5598 8515 6322 2841
1053 2841 -2218 -6868 -8502 -5364 300 5118 7617 7430 2918 -3181 -6723 -7336 -5955 -771 5635
1068 5635 7609 6456 4006 -2499 -7763 -7006 -4556 -1396 4897 8255 5669 3055 -807 -7453 -8284
1083 -8284 -4148 -584 3718 7739 6940 2253 -1916 -5599 -7788 -5595 -422 5007 7013 6676 3466
1098 3466 -1813 -6641 -6470 -4814 -2041 4690 8028 5640 3370 -591 -6985 -7596 -3469 -1307 2589
$$ packed form
989G036n269n836m309m57L825N797N670K959j689n770n982l899m87L286O050N169
1005F094K455p98m947o975m130K7K836O014N678K425k020l797o176m836l78L333
1021e195N686N541K625j525m839n380m243r23K631O248N136K123m9m889o896l410
1037g359j84J796N633O135J688j061l382o033n268Q0L380M136O037K917k193l481
1053B841n059m650j634L138N664M818K499j87m512o099l542o13J381N184O406
1068E635J974j153k450o505n264P57K450L160O293L358k586k614l862o646q31
1083h284M136L564M302M021p99m687m169l683k189K193N173N429K006l37l210
1098C466n279m828J71J656K773O731L338k388k270l961o394o11M127K162L896
$$ plain form
1113 2589 8202 6535 2250 -574 -5396 -8194 -4812 -245 3178 6631 7134 2864 -1741 -5091 -7004
1128 -7004 -5407 -1185 4050 6910 5509 3389 -765 -6223 -7167 -3965 -1640 2497 7712 6601 2201
1143 2201 -245 -5013 -8165 -4400 -315 2125 6553 7242 2485 -950 -3917 -7537 -5663 -523 2952
1158 2952 5622 6780 3236 -1016 -4813 -6783 -4881 -1334 2422 6610 6526 2931 -287 -4151 -7252
1173 -7252 -4819 -703 1521 5877 7088 2660 -736 -3278 -7309 -5822 -547 1975 5108 6829 3316
1188 3316 -923 -3506 -6815 -5599 -699 2372 5022 6660 3747 -961 -3972 -6111 -5389 -1122 2443
1203 2443 5005 6766 3394 -1047 -3287 -5977 -5812 -753 2269 4355 6678 3324 -836 -3002 -5651
1218 -5651 -6185 -1206 2554 4284 6437 3761 -883 -3355 -5421 -5980 -1405 2299 4038 5990 4273
$$ packed form
1113B589N613j667m285k824m822k798L382M567L423L453N03m270m605l350j913
1128g004J597M222N235K860j401k120m154n458r44L202K325M137N215j111m400
1143B201k446m768l152L765M085K440M428O89m757l435k967l620J874N140L475
1158B952K670J158l544m252l797j970J902L547L756M188q4l595l218l864l101
1173g252K433M116K224M356J211m428l396k542m031J487N275K522L133J721l513
1188C316m239k583l309J216M900L071K650J638k913m708l011k139P22M267L565
1203B443K562J761l372m441k240k690J65N059L022K086K323l354m160k166k649
1218e651n34M979L760J730K153k676m644k472k066n59M575L704J739J952j717
$$ plain form
1233 4273 -727 -3168 -4865 -5794 -1997 2289 3984 5924 4233 -765 -3059 -4971 -5728 -1695 2460
1248 2460 4025 5360 4525 -499 -3073 -4711 -5497 -2002 2474 3809 5118 4493 -450 -3556 -4517 -5442
1264 -5442 -2429 2117 3740 4978 4458 -226 -3430 -4277 -5272 -2854 1948 4087 4557 4490 485 -3613
1280 -3613 -4409 -4961 -2835 1997 4217 4467 4256 568 -3460 -4011 -4726 -2864 1686 4263 4573 4148 504
1297 504 -3422 -4099 -4468 -2993 1758 4218 4246 4119 815 -3641 -4149 -4029 -2999 1266 4129 4183 4128 862
1315 862 -3371 -4268 -4001 -3191 1126 4234 4300 3943 1303 -3033 -4356 -4105 -2880 772 4110 4078 3638 1450
1333 1450 -2759 -4308 -4008 -2833 424 4042 4251 3916 1321 -2710 -4437 -3969 -2817 465 3935 4313
1349 4313 3335 1731 -2468 -4554 -3784 -2749 171 3828 4175 3181 1804 -1915 -4611 -4038 -2579 0
$$ packed form
1233D273n000k441j697r29L797M286J695J940j691m998k294j912p57M033M155
1248B460J565J335q35n024k574j638p86L495M476J335J309o25m943l106r61r25
1264e442L013M546J623J238n20m684l204q47r95K418M802K139M70o7m005m098
1280c613p96n52K126M832K220K50k11l688m028n51p15J862M550K577L10m25l644
1297E04l926o77l69J475M751K460K8j27l304m456n08J20J030M265K863N4n5l266
1315H62m233q97K67Q10M317L108O6l57k640m336j323K51J225L652L338l2m40k188
1333A450m209j549L00J175L257L618K09l35k595m031j727M68J152L282L470L78
1349D313r78j604m199k086P70J035K920L657L47r94j377l719k696N73J459K579
$$ plain form
1365 0 3635 4552 3525 1402 -1724 -4170 -4055 -2644 250 3512 4171 3432 1726 -1947 -4101 -3628 -2609
1382 -2609 -131 3418 4206 3056 2080 -1614 -4537 -4002 -2521 -203 2970 4514 3060 1335 -923 -3734
1398 -3734 -4248 -2536 198 2694 4175 3558 1253 -1792 -3412 -3852 -2802 -144 3053 3838 3286 1626
1414 1626 -853 -3867 -3821 -2266 -710 2623 4528 3056 1416 -804 -3641 -4116 -2085 -246 2107 4244
1430 4244 3522 1459 -1284 -3195 -4106 -2611 232 2271 3653 3374 1790 -1198 -3314 -3602 -2734 -476
1446 -476 2396 3928 3000 1520 -778 -3719 -3640 -2199 -419 1907 3850 3293 1069 -941 -3144 -3735
1462 -3735 -2429 41 1881 3496 3588 1630 -1015 -2950 -3844 -2635 -36 1929 3290 2996 1696 -737
1478 -737 -3004 -3442 -2680 -741 1836 3772 3189 1482 -642 -2914 -3951 -2447 -385 1525 3467 3456
$$ packed form
1365@L635R17j027k123l126k446J15J411K894L262O59p39j706l673k154M73J019
1382b609K478L549P88j150r76l694k923N35J481K318L173J544j454j725k258k811
1398c734n14J712K734K496J481o17k305l045j620m40J050K658L197P85n52j660
1414A626k479l014M6J555J556L333J905j472j640k220k837m75K031J839K353K137
1430D244p22k063k743j911r11J495K843K039J382k79j584k988k116k88Q68K258
1446d76K872J532r28j480k298k941P9J441J780K326J943n57k224k010k203n91
1462c735J306K470J840J615R2j958k645j935q94J209K599J965J361k94j300k433
1478g37k267m38P62J939K577J936n83j707k124k272j037J504K062J910J942j1
$$ plain form
1494 3456 1540 -796 -2778 -3622 -2564 -294 1838 3173 3323 1777 -527 -2483 -3280 -2592 -679 1851
1510 1851 3178 3104 1748 -467 -2417 -3493 -2848 -829 1562 3187 2973 1716 -503 -2349 -3265 -2543
1526 -2543 -733 1392 3020 2993 2008 -396 -2477 -3499 -2473 -441 1288 2823 3326 1870 -283 -1912
1542 -1912 -3309 -2821 -816 1264 2416 3144 1976 -349 -2326 -3124 -2515 -1309 1377 3160 2986 1602
1558 1602 37 -2309 -3141 -2323 -767 966 3002 3396 1887 -160 -1974 -3238 -2710 -473 1113 2357
1574 2357 3124 2261 -180 -1770 -2794 -2745 -859 1301 2506 2874 2083 -265 -2206 -2848 -2344 -1205 1220
1591 1220 2839 2704 1645 -60 -1884 -2952 -2472 -782 978 2469 3295 1934 -84 -1734 -2651 -2606
1607 -2606 -731 1220 1961 2671 2134 -201 -1934 -2549 -2584 -1350 1118 2546 2625 1856 113 -1904 -2679
$$ packed form
1494C456j916k336j982q44J058K270K132J335J50j546k304j956p97O88J913K530
1510A851J327p4j356k215j950j076O45K019K391J625k14j257k219j846r16P22
1526b543J810K125J628k7r85k404k081j022J026K032J729J535N03j456k153j629
1542a912j397M88K005K080J152P28j168k325j977p98O09J206K686J783j74j384
1558A602j565k346q32Q18J556J733K036L94j509k047j814j264N28K237J586J244
1574B357P67q63k441j590j024M9J886K160J205L68p91k348j941o42N04J139K425
1591A220J619j35j059j705j824j068M80J690J760J491Q26j361k018j650r17M5
1607b606J875J951P41P10n37k335j733o15l5J234K468J428P9p69j743k017p75
$$ plain form
1624 -2679 -2282 -1354 609 2665 2887 1892 255 -1383 -2684 -2743 -1110 771 2047 2645 1925 -31 -1702
1641 -1702 -2321 -2635 -1121 754 2456 2226 2273 516 -1936 -2564 -2104 -1436 573 2756 2612 1543 513
1658 513 -1388 -2575 -2121 -1297 504 2266 2603 2136 354 -1295 -2163 -2634 -1430 819 2102 2374 1989
1675 1989 256 -1683 -2548 -2145 -1352 427 2221 2423 1568 768 -1148 -2575 -2141 -1117 108 2267 2347
1692 2347 1958 626 -983 -2115 -2149 -1280 205 1907 2199 1919 656 -1491 -2481 -2323 -1515 201 1886
1709 1886 2229 1780 496 -1213 -2553 -2396 -1351 -22 1697 2501 1652 675 -809 -2371 -2099 -1082 65
1726 65 1623 2605 1696 600 -856 -1849 -2255 -1373 314 1622 2286 1750 765 -888 -2290 -2307 -1293 -19
1744 -19 1543 2172 1894 748 -669 -2157 -2301 -1368 -51 1291 2425 1923 575 -649 -2031 -2200 -1218
$$ packed form
1624b679L97R28J963K056K22r95j637j638j301n9J633J881J276N98p20j956j671
1641a702o19l14J514J875J702k30M7j757k452o28M60O68K009K183j44j069j030
1658E13j901j187M54Q24J801J762L37m67j782j649q68m71J204K249J283K72l85
1675A989j733j939q65M03P93J779J794K02q55q00j916j427M34J024J225K159Q0
1692B347l89j332j609j132l4Q69J485J702K92k80j263k147r90J58Q08J716J685
1709A886L43m49j284j709j340J57J045J329J719Q04q49r77j484j562K72J017J147
1726F5J558R82r09j096j456r93m06Q82J687J308O64n36r85j653j402j7J014J274
1744a9J562O29k78j146j417j488j44R33J317J342J134n02j348j224j382j69R82
$$ plain form
1761 -1218 158 1213 2357 2152 681 -513 -2012 -2288 -1080 -17 1269 2248 1926 645 -432 -1855
1777 -1855 -2267 -1263 -10 1350 2382 1881 498 -454 -1674 -2153 -1293 -93 1039 2307 1974 488
1793 488 -726 -1544 -2220 -1179 -119 1287 2114 2033 635 -570 -1611 -2202 -1031 -41 1115 2149 1833
1810 1833 701 -617 -1558 -1993 -1557 -74 973 1997 2074 774 -464 -1258 -1955 -1683 -32 894 1996
1827 1996 2056 466 -643 -1455 -2114 -1237 25 877 1909 1711 739 -764 -1415 -2132 -1180 -121 911 1814
1845 1814 1740 780 -442 -1387 -1699 -1229 65 843 1474 2162 756 -314 -1066 -1684 -1493 -291 977 1560
1863 1560 1539 1108 -404 -1116 -1543 -1566 -234 893 1442 1759 1088 -380 -1373 -1905 -1484 -392 707 1264
1881 1264 1930 831 -510 -1129 -1597 -1673 -81 976 1298 1985 1238 -343 -1391 -1524 -1717 -455 986
$$ packed form
1761a218J376J055J144k05j471j194j499k76J208J063J286R79l22j281j077j423
1777a855m12J004J253J360J032n01j383r52j220m79Q60J200J132J268l33j486
1793D88j214q18o76J041J060J406Q27q1j398j205j041n91J171R90J156J034l16
1810A833j132j318r41m35M36J483J047J024P7j300j238p94o97K72J651R26J102
1827A996O0j590j109q12o59Q77J262Q52J032j98r72j503o51p17R52J059J032R03
1845A814p4r60j222r45l12M70J294P78O31O88j406j070p52o18J91J202J268N83
1863A560k1m31j512p12m27k3J332J127N49L17o71j468r93n32M21J092J099N57
1881A264O66j099j341o19m68p6J592J057L22O87p47j581j048j33j93J262J441
$$ plain form
1898 986 1433 1515 1180 -377 -1213 -1615 -1542 -619 939 1770 1600 1064 -267 -1231 -1620 -1548 -529 672 1502
1917 1502 1875 964 -419 -1055 -1605 -1594 -611 882 1168 1316 1292 2 -1577 -1493 -1063 -453 888 1653 1473
1936 1473 1186 180 -1401 -1470 -1126 -462 452 1452 1589 1017 0 -928 -1655 -1418 -398 571 1047 1286
1954 1286 1063 -214 -1282 -1358 -1278 -1006 478 1537 1305 1100 99 -1088 -1452 -1259 -774 445 1436 1410
1972 1410 1031 -59 -987 -1314 -1214 -847 267 1093 1603 1024 197 -946 -1198 -1247 -679 208 1098 1277 1021
1991 1021 299 -878 -1389 -1150 -648 382 1294 1285 1049 164 -1014 -1324 -1132 -810 212 1377 1549 1052 314
2010 314 -1035 -1203 -1394 -628 532 1382 1261 1167 264 -918 -1227 -1123 -432 441 1025 1434 1097 159 -583
2029 -583 -1344 -1219 -533 196 1034 1240 1187 238 -770 -1355 -1336 -551 450 1157 1258 1310 248 -457 -1374 -1023
$$ packed form
1898I86M47Q2l35j557q36m02P3R23J558Q31j70n36j331r64l89P2J019J201Q30
1917A502L73r11j383o36n50J1R83J493K86J48k4j290j579Q4M30O10J341P65j80
1936A473k87j006j581o9L44O64R14J000J37n72j017r28p27K37J020R69M76K39
1954A286k23j277j068p6Q0K72J484J059k32k05j001j187l64J93M85J219R91k6
1972A410l79j090r28l27J00L67J114Q26N10n79q27j143k52m9N68Q87Q90J79k56
1991A021p22j177n11K39N02J030R12rk36q85j178l10J92L22J022J165J72m97p38
2010C14j349j68j91P66J160Q50j21r4r03j182l09J04O91Q73N84M09l37r38p42
2029e83p61J25O86P29Q38K06n3r49j008n85J9P85J001P07J01N2j062p05r17L51
$$ plain form
2049 -1023 -501 439 998 1234 1026 127 -577 -1089 -1211 -490 221 814 1328 1108 367 -632 -1208 -1300 -573 182
2069 182 1017 1193 858 359 -572 -1324 -1137 -725 217 994 1568 958 304 -381 -1245 -1287 -515 208 781 1230
2089 1230 776 398 -679 -1203 -1319 -724 78 613 1218 805 326 -520 -1364 -1028 -703 -108 922 1116 955
2108 955 276 -473 -1212 -1052 -500 -72 783 1227 1237 195 -525 -952 -1238 -844 152 787 1044 1024 380 -411
2128 -411 -964 -1146 -718 114 854 1418 758 448 -444 -1402 -1063 -696 -107 565 1118 1204 261 -126 -742 -1242
2148 -1242 -682 263 634 1264 1123 166 -269 -806 -1068 -691 -145 826 942 1131 441 -391 -944 -1113 -623 -120
2168 -120 954 1105 868 232 -75 -776 -1099 -686 -223 316 1102 808 517 -324 -883 -1056 -632 -212 667 926
2188 926 1068 663 -443 -966 -1050 -853 -183 651 1072 866 461 -85 -807 -959 -623 -85 341 1272 1060 370
$$ packed form
2049a023N22R40N59K36k08q99p04n12j22P21P11N93N14k20p41r99n76r2P27P55
2069A82Q35J76l35m99r31p52J87M12R42P77N74o10o54o85q64m2P72P23N73M49
2089A230m54l78j077n24j16N95Q02N35O05m13m79q46q44L36L25N95J030J94j61
2108I55o79p49p39J60N52M28Q55M44J0j042p20m27k86L94R96O35K57k0o44p91
2128d11n53j82M28Q32P40N64o60l10q92r58L39L67N89O72N53Q6r43l87o16n00
2148a242N60R45L71O30j41r57m35n37k62L77N46R71J16J89o90q32n53j69M90N03
2168a20J074J51k37o36l07p01l23M13M63N39P86k94k91q41n59j73M24M20Q79K59
2188I26J42m05j106n23q4J97O70Q34M21k06m05n46p22j52L36N38M26R31k12o90
$$ plain form
2208 370 -382 -735 -814 -936 -175 524 902 609 575 -105 -668 -909 -716 61 790 971 973 531 -39 -1045 -777
2229 -777 -573 -99 463 1015 906 651 -253 -728 -657 -605 56 670 906 1170 648 -164 -970 -896 -858 -242 581
2250 581 906 1004 656 -201 -720 -821 -773 -252 435 979 1011 735 -328 -585 -1090 -950 -119 333 646 1024 560
2271 560 -144 -788 -1089 -793 -253 341 911 1084 689 -94 -814 -638 -710 -216 288 557 861 645 -22 -857
2291 -857 -768 -835 -35 316 853 1001 380 -199 -594 -1014 -811 -382 310 945 1013 685 -180 -713 -958 -846 -338
2312 -338 256 616 898 305 206 -563 -789 -915 -319 212 690 739 602 200 -575 -603 -517 -385 297 700 863
2333 863 426 -130 -546 -1028 -795 -207 227 708 902 574 103 -481 -999 -737 -677 215 632 620 648 221 -331
2354 -331 -683 -557 -424 110 791 824 776 250 -539 -697 -764 -147 120 709 825 742 432 -474 -1058 -599 -180
$$ packed form
2208C70p52l53p9j22P61O99L78k93l4o80n63k41J93P77P29J81Km42n70j006K68
2229g77K04M74N62N52j09k55r04m75P1N2O61O14K36K64n22q12q06P4L8O16Q23
2250E81L25R8l48q57n19j01M8N21O87N44L2k76j063k57n05J40Q31M52L13L78m64
2271E60p04o44l01K96N40N94N70J73l95p83p20J76p2M94N04K69L04k16o67q35
2291h57Q9o7Q00L51N37J48o21n79l95m20K03M29O92O35O8l28q65n33k45J12N08
2312c38N94L60K82n93r9p69k26j26N96N31M78M9j37m02p75k8Q6J32O82M03J63
2333H63m37n56m16m82K33N88M34M81J94l28m71n84n18K62O0Q92M17j2K8m27n52
2354c31l52J26J33N34O81L3m8n26p89j58o7O17K67N89J16q3l10r06n84M59M19
$$ plain form
2375 -180 357 755 829 603 11 -418 -591 -748 -335 48 776 553 494 225 -531 -921 -580 -507 67 548 687
2396 687 612 95 -205 -699 -773 -227 45 748 752 753 11 -282 -541 -764 -487 320 358 758 585 245 -402 -536
2418 -536 -640 -194 -146 595 573 380 159 -337 -678 -465 -329 242 406 827 402 -54 -18 -532 -682 -357 100
2439 100 671 737 544 109 -149 -641 -783 -352 164 478 764 619 74 -283 -619 -892 -496 259 160 560 416
2460 416 390 -523 -592 -552 -346 121 424 752 845 45 -178 -453 -412 -750 22 358 413 423 344 -322 -705 -735 -323
2483 -323 97 342 618 542 328 -165 -234 -475 -308 197 396 412 481 190 -112 -389 -438 -403 -13 449 411 545
2505 545 214 -321 -590 -527 -547 153 444 622 377 277 -331 -556 -431 -628 5 339 599 613 185 -314 -429
2526 -429 -587 -318 -23 314 557 588 494 -349 -502 -272 -542 -64 360 274 407 283 -258 -673 -296 -642 141
$$ packed form
2375a80N37L98P4k26n92m29j73j57M13L83P28k23n9k69p56l90L41P3N74M81J39
2396F87p5n17l00m94p4N46K72P03MJp42k93k59k23K77Q07L8M00j73l40o47j34
2418e36j04M46M8P41k2j93k21m96l41K13J36N71J64M21m25m56L6n14j50L25M57
2439A00N71O6j93m35k58m92j42M31N16L14K86j45n45l57l36k73L96P55r9M00j44
2460D16k6r13o9M0K06M67L03L28R3q00k23k75M1l38P72L36N5J0p9o66l83l0M12
2483c23M20K45K76p6k14m93o9k41J67N05J99J6O9k91l02k77m9L5L90M62l8J34
2505E45l31n35k69O3k0P00K91J78k45j00o08k25J25j97O33L34K60J4m28m99j15
2526d29j58K69K95L37K43L1r4q43j53K30k70M78M24q6J33j24n41m15L77l46P83
$$ plain form
2547 141 219 713 565 151 -138 -662 -571 -534 45 63 651 547 311 -351 -443 -404 -445 93 359 358 706 111 -271
2570 -271 -433 -336 -268 -83 246 594 564 297 -204 -540 -578 -278 17 341 530 292 400 -156 -456 -778 -412
2591 -412 -295 285 492 712 303 -181 -412 -765 -551 -37 143 348 587 221 -30 -420 -412 -402 -87 358 359 138
2613 138 204 51 -337 -368 -322 -243 405 463 512 405 -141 -648 -777 -464 50 62 553 523 285 8 -516 -655 -294
2636 -294 0 273 640 436 526 -39 -326 -406 -515 -23 489 366 475 414 105 -288 -307 -290 -464 209 543 423
2658 423 343 -75 -318 -410 -463 -134 337 441 466 206 76 -395 -315 -495 -256 280 403 464 377 -101 -171 -366 -137
2681 -137 -436 -55 382 546 310 255 -384 -617 -503 -160 166 336 545 311 -26 -124 -363 -422 -128 176 176 640
2703 640 219 233 -127 -655 -342 -324 36 549 453 133 302 -264 -500 -286 -62 -42 246 457 243 -10 -372
$$ packed form
2547A41P8M94j48m14k89n24R1L7N79J8N88j04k36o62r2L9m1N38K66jL48n95l82
2570b71j62R7O8J85L29L48l0k67n01l36l8L00K95L24J89k38J08n56l00l22L66
2591d12J17N80K07K20m09m84k31l53K14N14J80K05K39l66k51l90QJ0L15M45Jk21
2613A38O6j53l88l1M6P9O48N8M9j07n46n07j29L13N14J2M91l0k38k77n24j39L61
2636b94K94K73L67k04R0n65k87q0j09M92N12j23J09o1l09l93j9J7j74O73L34j20
2658D23q0m18k43r2n3L29M71J04K5k60j30m71Q0j80K39N36J23O1q7m78p0j95K29
2681a37k99L81M37J64k36n5o39k33J14L43L26J70K09k34l37r8k39n9K94L04%M64
2703F40m21J4l60n28L13J8L60N13r6l20J69n66k36K14K24K0K88K11k14k53l62
$$ plain form
2724 -372 -534 -317 -381 -68 409 483 89 59 -159 -530 -411 -296 171 518 399 362 -73 -243 -400 -312 -388 44
2746 44 296 404 267 65 -484 -350 -355 -233 170 644 395 104 31 -348 -427 -534 -213 264 315 607 39 209
2768 209 -178 -573 -327 -175 -116 325 291 408 241 -307 -399 -493 -256 159 136 445 317 20 -266 -334 -455 -242
2790 -242 -43 328 385 222 18 53 -443 -401 -130 209 98 391 485 135 -162 -239 -354 -150 263 509 308 302
2812 302 -137 -250 -194 -584 -374 -57 265 414 258 236 -89 -128 -416 -336 -1 339 343 566 16 -193 -430 -281
2834 -281 -11 141 225 496 351 -56 -261 -371 -358 -387 -210 307 438 410 -106 -299 -569 -359 -399 -56 84 462
2856 462 336 166 -23 -429 -700 -305 11 185 635 162 67 -20 -140 -579 -195 -53 338 396 387 321 -305 -332
2878 -332 -252 -157 -15 26 231 294 167 -94 -121 -341 -241 -35 223 315 351 168 -76 -422 -235 -350 -203 279
$$ packed form
2724c72j62K17o4L13M77P4l94l0k18l71J19J15M67L47j19l7m35j70j57Q8p6M32
2746D4K52J08j37k02n49J34nJ22M03M74k49k91p3l79p9j07L21M77N1K92n68J70
2768B09l87l95K46J52N9M41l4J17j67n48r2r4K37M15k3L09j28k97k86o8j21K13
2790b42J99L71N7j63k04L5m96M2K71L39j11K93R4l50k97p7j15K04M13K46k01o
2812C02m39j13N6l90K10L17L22J49j56k2l25l9k88Q0L35L40MK23n50k09k37J49
2834b81K70J52Q4K71j45m07k05j10J3k9J77N17J31k8n16j93k70K10m0L43J40L78
2856D62j26j70j89m06k71L95L16J74M50m73r5q7j20m39L84J42L91N8ro6o26k7
2878c32Q0R5J42M1K05O3j27k61k7k20J00K06K58R2L6j83k44l46J87j15J47M82
$$ plain form
2900 279 364 306 39 -142 -414 -322 -397 18 263 395 197 -17 -112 -345 -120 -209 -48 127 82 489 251 -139
2922 -139 -292 -280 -237 32 331 289 273 256 16 -422 -222 -135 -147 4 261 341 87 -255 -221 -249 -245 -159 107 52 130
2947 130 218 -52 -324 -226 -340 -63 125 224 450 258 -199 -92 -317 -198 -151 26 276 318 78 209 -214 -303
2969 -303 -128 8 237 596 329 240 119 -253 -324 -123 23 148 288 113 134 -151 -205 -234 -260 -70 -116 157
2991 157 345 140 -138 -85 -296 -409 97 123 201 293 125 -35 -212 -274 -185 -352 164 405 68 -25 -65 -311 -131
3014 -131 -94 -130 198 224 411 107 -144 -113 -149 -397 82 43 27 272 184 -10 -212 -250 -199 -153 -59 141 494 97
3038 97 -29 -93 -239 -330 -215 104 -10 167 335 82 -91 -32 -351 -132 -189 146 265 55 71 -29 -352 -363
3060 -363 1 -86 400 466 -30 -5 -270 -212 -109 201 157 73 148 271 31 -184 69 -77 -241 6 312 202
$$ packed form
2900B79Q5n8k67j81k72R2p5M15K45J32j98k14r5k33K25q9J61J75m5M07k38l90
2922a39j53J2M3K69K99m2j6j7k40m38K00Q7j2J51K57Q0k54l42L4k8MQ6K66n5P8
2947A30Q8k70k72R8j14K77J88R9K26j92m57J07k25J19M7J77K50M2k40J31m23q9
2969c03J75J36K29L59k67q9j21l72p1K01J46J25J40j75K1k85n4k9k6J90m6K73
2991A57J88k05k78N3k11j13N06K6P8R2j68j60j77o2Q9j67N16K41l37r3m0k46J80
3014a31L7l6L28K6J87l04k51L1l6k48M79l9j6K45q8j94k02l8N1M6R4K00L53l97
3038I7j26o4j46r1J15L19j14J77J68k53j73N9l19K19n7L35J19k10J6j00l23j1
3060c63L64q7M86O6m96K5k65N8J03L10m4q4P5J23k40k15K53j46j64K47L06j10
$$ plain form
3082 202 155 -9 -217 -176 -38 -134 -40 241 418 66 9 -103 -162 -250 169 274 188 439 205 53 -84 -249 -148
3105 -148 -194 42 253 340 255 -33 -49 -98 -81 -4 8 389 112 31 48 -173 -214 -228 -264 142 16 20 -71 41 18 -173
3131 -173 -278 -187 152 206 111 295 151 -165 -260 -184 8 38 14 421 -29 44 94 -360 -84 7 -180 362 180
3154 180 160 83 -222 -314 -27 -116 25 107 188 316 199 -309 -196 -341 96 -32 198 552 78 -2 -21 -286 -239
3177 -239 -74 20 -37 90 338 -87 -301 -341 -134 -121 183 171 237 300 -74 19 -234 -170 -295 -58 379 -1 58
3200 58 -196 -292 -47 119 -328 20 53 242 60 184 -103 -55 -199 -259 -206 73 57 169 287 65 52 -61 -296
3223 -296 -98 156 182 438 44 150 3 -310 -211 -88 341 387 249 108 64 -161 90 -278 -155 -77 108 182
3245 182 -65 -6 -247 -325 -324 -79 -26 177 245 286 201 -274 -217 -268 -90 -38 172 129 154 -132 -382 -47 -364 27
$$ packed form
3082B02m7j64k08M1J38r6R4K81J77l52n7j12n9q8M19J05q6K51k34j52j37j65J01
3105a48m6K36K11Q7q5k88j6m9J7P7J2L81k77q1J7k21m1j4l6M06j26Mr1J12k3j91
3131a73j05R1L39N4r5J84j44l16r5P6J92L0k4M07m50P3N0m54K76R1j87N42j82
3154A80k0p7l05r2K87q9J41Q2Q1J28j17n08J13j45M37j28K30L54m74q0j9k65M7
3177b39J65R4n7J27K48m25k14m0K07J3L04j2O6O3l74R3k53O4j25K37M37l80N9
3200E8k54r6K45J66m47L48L3J89j82J24k87M8j44o0N3K79j6J12J18k22j3j13k35
3223b96J98K54K6K56l94J06j47l13R9J23M29M6j38j41m4k25K51l68J23P8J85P4
3245A82k47N9k41p8JK45N3K03O8M1q5m75N7n1J78N2K10m3K5k86k50L35l17L91
$$ plain form
3269 27 124 105 382 214 -35 -191 -25 -72 2 108 147 54 129 -145 159 -30 61 -22 -25 128 -136 7 -125 139
3293 139 -190 108 35 77 250 262 -98 -163 -244 -184 -205 -11 -17 187 239 211 148 -106 -105 -21 -218 151 36 83 232
3318 232 9 -290 -280 105 138 127 283 80 -201 -35 -285 -221 -378 -237 23 53 9 29 -178 -332 -139 -283
3340 -283 17 151 359 125 46 -110 -132 -57 -31 -88 100 121 261 255 -82 38 -36 -128 -44 -212 61 259 280 -310
3364 -310 -66 -174 -68 -151 107 89 223 28 -30 -201 -50 179 -3 -133 190 222 272 90 47 -4 -125 -279
3386 -279 -93 130 127 47 -17 -12 24 8 21 198 93 443 308 17 -267 -220 -186 90 80 262 304 195 26 -86
3410 -86 -331 -59 -95 100 277 -142 -10 230 -98 -169 -229 26 -89 35 67 229 25 58 -154 -109 -188 0 -31
3433 -31 75 -2 -29 67 -216 -167 50 -49 5 66 189 -76 -77 -104 0 -179 89 335 140 -36 168 -138 8 -128
$$ packed form
3269B7R7j9K77j68k49j56J66m7P4J06L9r3P5k74L04j89R1q3lJ53k64J43j32K64
3293A39l29K98p3M2J73J2l60o5q1O0k1J94oK04N2k8o3k54JQ4j97L69j15M7J49
3318B32k23k99J0L85L3j1J56k03k81J66k50O4j57J41K60L0m4K0k07j54J93j44
3340b83L00J34K08k34p9j56k2P5K6n7J88K1J40ol37J20p4r2Q4j68K73J98K1n90
3364c10K44j08J06q3K58j8J34j95n8j71J51K29j82j30L23L2N0j82m3n1j21j54
3386b79J86K23lq0o4NL6j6J3J77j05L50j35k91k84M7L4K76j0J82M2j09j69j12
3410h6k45K72l6J95J77m19J32K40l28p1o0K55j15J24L2J62k04L3k12M5p9J88l1
3433c1J06p7k7R6k83M9K17r9N4O1J23k65jk7J04j79K68K46j95j76K04l06J46j36
$$ plain form
3457 -128 -150 149 61 281 -131 -55 131 -66 -65 7 -104 298 170 82 100 -213 -260 -78 161 308 -181 142 113
3480 113 207 -25 -89 -260 -73 -124 -26 66 60 111 -72 -120 -8 -191 -137 177 -15 146 -30 17 37 91 -104 257
3504 257 -10 152 43 -242 -91 63 -92 -321 -45 67 57 -10 35 -56 10 -286 -36 -100 19 -11 145 13
3526 13 147 -8 -214 -182 24 53 150 -99 -136 -144 188 44 131 102 223 148 60 139 23 -232 -31 -140 -1 141
3550 141 179 21 86 76 -167 -167 36 367 132 271 95 13 -37 -428 43 -202 -124 -30 58 -5 -71 274 44 162
3574 162 -33 45 17 70 356 -86 -23 -158 -84 -44 157 -35 146 188 -214 70 -64 -141 -65 -11 -96 380 -256 -28
3598 -28 -12 -423 -199 52 77 -45 48 143 -49 -180 -210 -390 -247 132 110 260 260 126 235 -20 293 70 -80
3621 -80 260 51 68 317 -187 281 -27 13 58 117 189 122 -250 14 -10 -196 -214 -111 -104 132 245 156 -2 44
$$ packed form
3457a28k2K99q8K20m12P6J86j97JP2j11M02j28q8J8l13m7J82K39J47m89L23k9
3480A13R4k32o4j71J87n1R8R2oN1j83m8J12j83N4L14j92J61j76M7K0N4j95L61
3504B57k67J62j09k85J51J54j55k29K76J12j0o7M5r1O6k96K50o4J19l0J56j32
3526A3J34j55k06L2K06K9R7k49l7qL32j44Q7k9J21p5q8P9j16k55K01j09J39J42
3550A41L8j58O5j0k43%K03L31k35J39j76q2n0l91M71k45P8R4Q8o3o6L45k30J18
3574A62j95P8k8N3K86m42O3j35P4M0K01j92J81M2m02K84j34p7P6N4q5M76o36K28
3598b8J6m11K24K51K5j22R3R5j92j31l0j80J43L79k2J50%j34J09k55L13k23j50
3621h0L40k09J7K49n04M68l08M0M5N9P2o7l72K64k4j86j8J03PK36J13q9j58M6
$$ plain form
3645 44 -278 9 -48 55 -37 276 109 11 276 -111 -30 103 112 285 250 63 -302 194 -232 -208 213 -22 -34
3668 -34 -37 -16 -42 54 -271 -217 -179 -145 40 189 164 -22 35 56 -147 -163 93 306 97 -28 -39 -206 66 -140 52
3693 52 -115 264 -134 30 -75 18 -99 -158 -31 -121 178 144 188 -30 55 -83 -251 -277 78 366 372 -84 -122 -230
3717 -230 -32 -105 -38 231 -68 270 197 -16 -119 67 23 -268 -15 58 -69 142 93 -7 137 -82 145 225
3739 225 120 138 -3 40 167 -232 133 -96 193 10 53 194 -16 -86 -20 79 9 -14 212 160 7 -26 -55 77
3763 77 -60 38 97 -377 -22 145 -134 5 310 101 -181 -47 -7 -89 -56 53 61 -130 30 -236 -51 185 -270
3786 -270 -87 -26 181 47 -273 -39 55 236 187 -152 -2 -132 -171 -317 -20 -160 98 -1 25 125 -122 72
3808 72 -25 -145 200 122 85 131 -256 -234 -216 -18 -35 119 200 -106 63 -60 -168 132 38 -71 -95 -33 250 -74
$$ packed form
3645D4l22K87n7J03r2L13j67r8K65l87Q1J33RJ73l5j87l65M96m26K4M21k35j2
3668c4lK1k6R6l25N4L8L4J85J49k5j86N7K1k03j6K56K13k09j25j1j67K72k06J92
3693E2j67L79l98J64j05R3j17n9J27r0K99l4M4k18Q5j38j68k6L55K88Om56l8j08
3717b30J98p3O7K69k99L38p3k13j03J86m4k91K53P3j27K11m9j00J44k19K27Q0
3739B25j05J8j41M3J27l99L65k29K89j83M3J41k10p0O6R9p0k3K26n2j53l3k9J32
3763G7j37R8N9m74L55J67k79J39L05k09k82J34M0q2L3J09Qj91J60k66J85K36m55
3786b70J83O1K07j34l20K34R4J81m9l39J50j30l9j46K97j40K58r9K6J00k47J94
3808G2r7j20L45p8l7M6l87K2J8J98j7J54Q1l06J69j23j08L00r4j09k4O2K83l24
$$ plain form
3832 -74 -70 157 -290 -134 2 -149 22 -52 212 7 -229 -56 26 -417 19 152 202 234 177 -124 -5 -156 26
3855 26 -270 -166 189 153 -99 -13 -69 5 -40 291 128 20 240 -80 8 -188 -11 -189 146 -98 117 103 43
3878 43 -74 97 -145 93 -18 -328 333 114 -47 -124 127 136 109 -74 263 -12 25 -99 10 -18 19 41 118
3901 118 17 271 55 2 -29 -80 25 154 -81 4 152 -23 19 -69 29 137 -40 154 114 -174 233 87 275
3924 275 39 10 -13 -117 -34 145 125 236 -3 19 -17 -54 -19 -159 4 73 -2 -147 156 -300 46 -71 -47 130
3948 130 -48 69 31 -38 -110 -204 26 33 245 195 140 -134 -84 111 18 39 -66 -165 -59 -145 -5 -116 15 -13 -189
3973 -189 4 -29 80 110 25 2 -287 21 -140 172 172 92 -228 75 -38 -17 124 -85 98 -190 76 191 233
3996 233 125 -8 -74 -70 -52 221 170 103 8 38 -118 -159 -149 -176 -95 -23 -27 61 57 -80 -185 -195 -51 -148 190 -205 -144
$$ packed form
3832g4MK27m47J56J36j51J71p4K64k05k36J73Q2m43M36J33N0L2n7l01J19j51J82
3855B6k96J04L55l6k52Q6n6P4m5L31j63j08K20l20Q8j96J77j78L35k44K15j4o0
3878D3j17J71k42K38j11l10O61k19j61p7K51Rk7j83L37k75L7j24J09k8L7K2P7
3901A18j01K54k16n3l1n1J05J29k35Q5J48j75M2q8R8J08j77J94m0k88M07j46J88
3924B75k36k9k3j04Q3J79k0J11k39K2l6l7L5j40J63O9p5j45L03m56L46j17K4J77
3948A30j78J17l8o9p2r4K30PK12n0n5k74N0J95r3K1j05r9J06q6J40j11J31k8j76
3973a89J93l3J09L0q5k3k89L08j61L12%q0l20L03j13K1J41k09J83k88K66J15M2
3996B33j08j33o6MJ8K73n1o7r5L0j56m1J0k7Q1P2mQ8mj37j05j0J44r7L38l95O1
$$ plain form
4023 -144 194 -103 32 1 102 70 38 72 -56 -229 -16 -142 -252 -50 295 -130 140 -106 273 -106 -390
4044 -390 9 -155 26 -28 97 135 16 48 41 83 -113 -16 -76 -154 18 118 43 8 54 104 26 -29 -25 -90 37 -131
4070 -131 -69 32 150 -120 169 139 91 -150 -154 -44 16 83 115 85 -125 82 -185 90 -338 56 -60 69 175
4093 175 -289 36 -191 -48 231 116 90 46 -23 68 14 52 -131 -94 -104 -184 94 -148 49 -107 -122 89 -268
4116 -268 8 135 113 -80 320 170 97 -387 22 63 217 -148 96 -86 -261 -30 126 141 36 77 215 129
4138 129 229 41 -48 90 -44 39 129 236 -124 53 -90 -181 -41 -154 -26 119 26 44 31 -174 -176 -22 59
4161 59 -218 180 -5 120 134 276 -53 114 129 -112 -57 138 -37 61 -221 10 -429 54 42 56 70 -82 -297
4184 -297 -2 -136 -37 76 189 53 -92 -30 -51 59 -153 -134 -109 21 -103 -12 -96 226 -111 -31 -150 116 -31
$$ packed form
4023a44L38k97J35l1J01l2l2L4j28j73K13j26j10K02L45m25K70k46L79l79k84
4044c90L99j64J81n4J25L8j19L2pM2j96R7o0p8J72J00p5l5M6N0p8n5Mo5J27j68
4070a31O2J01J18k70K89l0m8k41mJ10O0O7L2l0k10K07k67K75m28L94j16J29J06
4093A75m64L25k27J43K79j15k6m4o9R1n4L8j83L7j0q0K78k42J97j56j5K11l57
4116b68K76J27k2j93M00j50p3m84M09M1J54l65K44j82j75K31J56J5j05M1J38q6
4138A29J00j88q9J38j34Q3R0J07l60J77j43r1J40j13J28J45r3J8j3k05kJ54Q1
4161E9k77L98j85J25J4J42l29J67J5k41N5J95j75R8k82K31m39M83j2J4J4j52k15
4184b97K95j34R9J13J13j36j45O2k1J10k12J9K5J30j24R1q4L22l37Q0j19K66j47
$$ plain form
4207 -31 139 176 245 82 25 113 -239 -468 21 176 -141 164 -109 -7 103 1 142 -196 -51 136 118 179
4229 179 -135 -3 121 -2 60 -123 -106 -67 177 300 101 -85 -42 17 -69 -179 -3 191 134 46 -61 -80 -31
4252 -31 116 -79 114 -204 67 120 -56 -52 18 43 -142 -41 65 -33 -100 122 26 -104 -60 -82 26 -175 27 -117
4276 -117 68 -40 -40 117 -100 -88 61 -7 -212 -89 33 78 -227 111 2 118 290 159 -251 -26 -18 -169
4298 -169 -7 12 -218 67 72 -184 -49 -118 158 314 232 -117 71 -70 -101 58 6 -140 42 169 137 -60 154
4321 154 -171 35 -20 -192 87 -54 -91 -10 18 6 -10 137 12 51 -232 72 -209 -67 188 -7 53 84 271
4344 271 -59 -20 81 -101 268 -53 29 86 117 69 239 -162 -24 -146 14 -183 70 88 138 40 -329 -122 -99
4367 -99 -71 -113 26 -30 179 -18 29 -66 -11 95 -54 -207 81 -85 60 17 72 -123 -59 -85 26 -343 55 297
$$ packed form
4207c1J70L7O9j63n7Q8l52k29M89J55l17L05k73J02J10j02J41l38J45J87j8O1
4229A79l14J32J24j23O2j83J7L9K44J23j99j86M3N9q6j10J76J94n7q8j07j9M9
4252c1J47j95J93l18K71N3j76MP0K5j85J01J06r8o7K22r6j30M4k2J08k01K02j44
4276a17J85j08%J57k17J2J49o8k05J23J22M5l05L38j09J16J72j31m10K25Qj51
4298a69J62J9k30K85Nk56J35o9K76J56q2l49J88j41l1J59n2j46J82J27l2j97K14
4321A54l25K06n5j72K79j41l7Q1K8j2j6J47j25L9k83L04k81J42K55j95O0L1J87
4344B71l30L9J01j82L69l21Q2N7L1m8J70m01J38j22J60j97K53J8N0r8l69K07K3
4367i9K8m2J39n6K09j97M7r5N5J06j49j53K88j66J45m3N5j95O4k6J11l69L98K42
$$ plain form
4391 297 211 87 6 -126 19 95 28 57 -182 -138 -27 -149 -30 -115 87 166 -134 137 -172 25 -69 -185 -64
4414 -64 -11 -190 -73 -189 123 -130 176 34 -178 -255 268 223 298 123 68 -127 143 376 55 -170 101 -69
4436 -69 75 -49 19 46 -167 -32 -39 -48 256 -21 -54 -106 -171 -223 -88 50 -111 -60 120 86 118 -163 73 -59 -194
4461 -194 14 4 221 147 98 61 -32 62 49 -45 103 -103 25 107 -54 102 -213 -42 176 241 79 33 97 97 294
4486 294 -55 -28 24 -47 231 -149 139 -42 -21 133 27 -103 218 -154 174 7 -127 28 -117 -26 -145 71
4508 71 13 -148 41 77 15 -125 -235 42 91 116 142 43 -142 3 3 15 7 39 24 107 -72 -56 -89 73 9 44 -67
4535 -67 136 -110 213 -149 -170 -90 -31 -51 -22 62 -107 190 -2 -28 -196 -118 -45 299 12 152 -22 -181 151
4558 151 153 76 73 -26 -83 70 32 -42 228 39 67 -157 50 148 239 -104 198 -80 -3 -102 -43 92 157 -339 -146
$$ packed form
4391B97q6j24q1j32J45P6o7K9k39M4J11j22J19q5K02P9l00K71l09J97r4j16J21
4414f4N3j79J17j16L12k53L06j42k12p7N23m5P5j75n5j95K70K33l21k25K71j70
4436f9J44j24O8K7k13J35prL04k77l3n2o5n2J35J38j61N1J80l4L2k81K36j32j35
4461a94K08j0K17p4m9l7r3R4j3r4J48k06J28Q2j61J56l15J71K18O5j62m6O4%J97
4486B94l49K7N2p1K78l80K88j81K1J54j06j30L21l72L28j67j34J55j45R1j19K16
4508G1n8j61J89L6o2j40j10K77M9K5K6r9j85J45%J2qL2j5Q3j79J6l3J62o4L5j11
4535f7K03k46L23l62k1Q0N9k0K9Q4j69K97j92k6j68P8P3L44k87J40j74j59L32
4558A51Kp7lr9n7J53l8p4K70j89K8k24K07R8R1l43L02k78P7r9N9J35O5m96J93
$$ plain form
4583 -146 173 -194 -122 -147 -124 160 194 66 -338 -274 93 -273 106 60 -69 -59 299 -129 -158 -56 -66 81 -173
4606 -173 25 86 9 37 254 -102 -9 126 -58 -76 87 40 -252 -41 36 110 23 -106 -2 -216 -91 39 -66
4629 -66 50 -79 54 -81 81 157 137 93 162 157 106 123 -219 -141 198 -63 132 127 -39 -99 102 -141 -7 -211
4653 -211 -92 48 94 246 -1 -2 -233 -215 -86 346 -92 16 198 57 90 -191 183 16 -212 -78 79 419
4675 419 -114 102 98 69 128 25 -177 208 182 -363 34 6 -183 -131 0 226 6 -17 -82 -280 150 -5 85
4698 85 7 -311 -129 -122 -33 -99 -61 46 -90 -62 27 -106 91 30 -50 -22 115 77 -65 124 -75 70 -30 131
4722 131 -76 -154 39 251 -114 164 -132 -123 120 -104 69 -37 44 -76 -66 -89 180 -89 -34 11 -112 32 -6
4745 -6 -118 -219 -14 -74 -237 -41 -89 143 99 147 88 -85 -266 105 264 137 83 -151 -54 76 -16 -99 -14 317
$$ packed form
4583a46L19l67P2k5K3K84L4j28m04O4L67l66L79m6j29J0L58m28k9J02j0J47k54
4606a73J98O1p7K8K17l56R3J35j84j8J63m7k92K11P7P4q7j29J04k14J25J30j05
4629f6J16j29J33j35J62P6k0m4O9nn1J7l42P8L39k61J95nj66o0K01k43J34k04
4653b11J19J40M6J52k47jk31J8J29M32m38J08J82j41L3k81L74j67k28J34J57L40
4675D19n33K16mk9N9j03k02L85k6n45L97k8j89N2J31K26k20k3o5j98M30j55R0
4698H5p8l18J82PQ9o6L8J07j36K8Q9j33J97o1q0K8J37l8j42J89j99J45j00J61
4722A31k07p8J93K12l65K78k96RK43k24J73j06Q1j20J0k3K69k69N5M5j23J44l8
4745fj12j01K05o0j63J96m8K32m4M8n9j73j81L71J59j27n4k34R7J30r2q3Q5L31
$$ plain form
4769 317 60 59 -130 -5 119 -21 -15 51 -7 33 -80 14 4 -21 -40 69 183 -107 -29 64 42 -78 163 129 -64
4794 -64 -97 74 52 315 104 160 -142 34 -140 110 -212 -42 68 -9 105 145 -22 118 105 55 -201 65 -77
4817 -77 -24 -12 -289 0 -46 45 -43 68 130 -175 -20 -153 -75 -31 -65 207 90 330 -121 -173 128 -50 56 5
4841 5 -160 -152 -191 -114 -44 -60 72 52 -142 60 -239 -95 62 -46 180 136 -84 -11 157 202 -77 92 -32 -178
4865 -178 -137 165 21 100 -31 130 -183 -173 -14 -112 231 97 258 -97 -167 -259 226 -54 36 32 -47 -160 43
4888 43 -83 -168 -45 43 113 -35 -273 151 -185 -183 247 94 -86 37 -92 -13 100 134 39 152 35 -185 -165
4911 -165 158 116 143 201 -44 -18 -116 -79 -81 23 -108 78 227 120 73 -194 -141 -318 -22 -148 -93 -74 82 124
4935 124 -22 26 -50 -14 -83 0 36 -181 -84 -179 155 -55 326 60 206 173 31 -278 122 76 94 -48 -49 251
$$ packed form
4769C17k57jj89J25J24j40OO6n8M0j13R4j0k5j9J09J14k90P8R3k2j20K41l4j93
4794f4l3J71k2K63k11N6l02J76j74K50l22J70J10p7J14M0j67J40j3n0k56K66j42
4817g7N3J2k77K89m6R1q8J11O2l05J55j33P8M4l4K72j17K40m51n2L01j78J06n1
4841Ej65Ql9P7P0j6J32k0j94K02k99J44J57j08K26m4k20P3J68M5k79J69j24j46
4865a78M1L02j44P9j31J61l13J0J59r8L43j34J61l55p0r2M85k80R0mp9j13K03
4888D3j26q5J23Q8P0j48k38M24l36KM30j53j80J23j29P9J13L4r5J13j17k20K0
4911a65L23m2K7N8k45K6r8L7kJ04j31J86J49j07m7k67N3j77K96j26N5J9J56M2
4935A24j46M8p6L6o9Q3L6k17R7r5L34k10L81k66J46l3j42l09M00m6J8j42jL00
$$ plain form
4959 251 110 146 294 -21 -59 120 -8 -58 65 -216 -114 63 -10 147 92 140 -142 -17 58 -53 25 -80 -59
4982 -59 129 -139 277 -21 120 -213 25 -66 87 129 -321 45 -22 309 90 40 -145 -116 -72 -161 -105 16 218
5005 218 165 169 -156 92 -23 -176 -119 123 195 117 170 20 82 218 69 -69 -104 2 25 66 -202 -60 219 259
5029 259 8 38 128 -280 -75 118 -11 60 -139 151 19 184 -4 218 96 64 -261 -24 1 184 -8 -171
5051 -171 159 -157 63 -15 134 2 193 29 -101 401 -143 40 -28 273 11 1 33 79 21 169 -191 6
5073 6 171 6 193 96 -138 -50 -138 18 -22 57 62 -37 198 -100 -63 144 35 9 35 -13 -23 92 -159 -157 -272 102
5099 102 -184 8 8 -158 -30 150 168 -26 127 -68 32 7 2 -40 70 -92 54 -288 111 199 28 -79 -75
5122 -75 -27 47 -170 120 101 73 -81 -267 92 85 -154 -173 104 -206 221 -131 -31 41 -204 -19 -165 -148 53
$$ packed form
4959B51j41L6J48l15l8J79j28n0J23k81J02J77p3J57n5M8k82J25P5j11P8j05K1
4982e9J88k68M16k98J41l33K38r1J53M2m50L66o7L31k19n0j85K9M4q9N6J21K02
5005B18n3Ml25K48j15j53N7K42P2p8N3j50O2J36j49j38l5J06K3M1k68J42K79M0
5029B59k51L0R0m08K05J93j29P1j99K90j32J65j88K22j22l2l25K37K5J83j92j63
5051a71L30l16K20p8J49j32J91j64j30N02n44J83o8L01k62j0L2M6n8J48l60J97
5073FJ65j65J87r7k34Q8q8J56m0P9Nr9K35k98L7K07j09k6K6m8j0J15k51Kj15L74
5099A02k86J92%j66J28J80J8j94J53j95J00k5nm2J10j62J46l42L99Q8j71j07M
5122g5M8P4k17K90j9k8j54j86L59pk39j9K77l10M27l52J00P2k45J85j46J7K01
$$ plain form
5145 53 160 -127 56 -111 33 -14 24 15 86 -68 263 36 -64 13 79 59 -12 -49 -40 62 -56 72 -67 -40 -173
5170 -173 205 -45 -64 27 -247 195 -115 90 -250 -214 -57 -314 1 -95 37 -95 56 -269 -22 104 -184
5191 -184 56 78 94 -175 110 -72 -147 74 -190 -100 -30 83 -144 91 -42 67 372 22 143 199 -42 -57
5213 -57 13 -45 -186 -129 -130 -40 24 -60 138 -186 101 210 -112 -266 -198 -27 5 5 182 -81 50 64 134 151 93 182
5239 182 40 124 -193 -86 52 -98 78 89 90 94 43 -216 -48 -69 -47 -49 -59 -135 1 -68 151 -190 -154 45 203
5264 203 28 155 54 -184 38 -58 63 13 106 -170 18 123 93 -224 -207 -118 -175 -30 -179 21 -132 -12
5286 -12 55 55 167 114 -79 163 20 195 -62 108 115 -149 -29 411 -48 -294 166 -70 225 127 -272 210 91
5309 91 41 -109 -105 61 -44 92 -428 -251 79 -41 -12 114 -87 186 33 46 -198 -197 208 200 21 66 146 -69
$$ packed form
5145E3J07k87J83j67J44m7L8rP1j54L31k27j00P7O6k0p1l7RJ02j18J28j39K7j33
5170a73L78k50j9R1k74M42l10K05l40L6J57k57L15r6J32j32J51l25K47J26k88
5191a84K40K2J6k69K85j82p5K21k64R0P0J13k27K35j33J09L05l50J21N6k41j5
5213e7P0n8j41N7jR0O4q4J98l24K87J09l22j54O8J71L2%J77k63J31J4P0J7n8Q9
5239A82j42Q4l17J07J38j50J76J1JMn1k59J68k1K2kj0p6J36o9K19l41L6J99J58
5264B03j75J27j01k38K22r6J21n0R3k76J88J05l0l17J7Q9n7J45j49K00j53J20
5286a2O7%J12n3j93K42j43J75k57J70Pk64J20M40m59k46M60k36K95r8l99M82j19
5309I1n0j50MJ66j05J36n20J77L30j20K9J26k01K73j53J3k44JM05qj79M5Q0k15
$$ plain form
5333 -69 36 -66 40 -131 -265 124 207 -191 9 -65 -166 7 86 -101 -25 203 -48 -202 153 -108 -305 61
5355 61 -58 393 256 -140 -313 -41 14 275 -54 47 -46 -66 -334 76 48 -235 -81 -171 50 -113 -178 -87 -39
5378 -39 -130 -39 116 -60 -301 148 -16 293 -84 -61 -167 -223 -121 6 -82 -97 -137 52 -23 -148 -143 -38 -158 47
5402 47 -13 27 39 -99 103 121 4 -47 1 98 102 -52 -68 -204 -16 221 -118 26 223 64 34 -35 73 79 1
5427 1 60 -53 86 -126 127 -26 123 -32 98 12 349 96 22 -53 -163 227 -105 -90 2 -98 -54 149 189
5450 189 101 128 -20 99 -168 38 -89 -134 110 295 104 13 -52 185 9 -20 71 137 -2 1 -6 20 142 -69
$$ packed form
5333f9J05j02J06j71j34L89Q3l98K00p4j01J73P9j87P6K28k51j54L55k61j97L66
5355F1j19M51j37l96j73K72N5K61l29J01r3k0k68M10k8k83J54r0K21j63o5R1M8
5378c9r1R1J55j76k41M49j64L09l77K3j06n6J02J27q8j5m0J89p5j25NJ05j20K05
5402D7o0M0J2j38K02J8j17n1M8R7Mj54j6j36J88K37l39J44J97j59l0o9J08Op8
5427AN9j13J39k12K53j53J49j55J30q6L37k53p4p5j10L90l32J5R2j00M4K03M0
5450A89q8K7j48J19k67K06j27m5K44J85j91r1o5K37j76k9R1O6j39LpK6J22k11
$$ [...]
8191G
##END NTUPLES=NMR FID
##END=
