##TITLE=1H_SR104-0
 D2O
 8 sc, 
 17.02.2022
##JCAMPDX= 6.0         $$ Bruker NMR JCAMP-DX V2.0
##DATA TYPE= NMR FID
##DATA CLASS= NTUPLES
##ORIGIN= UXNMR, Bruker Analytische Messtechnik GmbH
##OWNER= root
$$ XWIN-NMR		Version 3.5
$$ Thu Feb 17 10:41:38 2022 Russian Standard Time (UT+4h)  she@DPX200
##.OBSERVE FREQUENCY= 200.131346
##.OBSERVE NUCLEUS= ^1H
##.DELAY= (6, 6)
##.ACQUISITION MODE= SIMULTANEOUS
##.ACQUISITION SCHEME= undefined
##.AVERAGES= 8
##.DIGITISER RES= 18
##SPECTROMETER/DATA SYSTEM= spect
##.PULSE SEQUENCE= zg30
##.SOLVENT NAME= D2O
##.SHIFT REFERENCE= (INTERNAL, D2O, 0, 15.7039)
##AUDIT TRAIL= $$ (NUMBER, WHEN, WHO, WHERE, WHAT)
$$ ##TITLE= Audit trail, XWIN-NMR		Version 3.5
$$ ##JCAMPDX= 5.01
$$ ##ORIGIN= Bruker BioSpin GmbH
$$ ##OWNER= she
$$ F:/spectra/data/she/nmr/H-F/1/audita.txt
$$ ##AUDIT TRAIL=  $$ (NUMBER, WHEN, WHO, WHERE, WHAT)
(   1,<2022-02-17 10:39:57.45 +0400>,<she>,<DPX200>,
      <created by zg, POWCHK disabled, PULCHK disabled
       configuration hash MD5:
       00 E9 B6 7A A2 85 ED C7 34 08 36 98 17 FE 4E 26
       data hash MD5: 16K
       5A 52 9D 96 9C EF F8 9E 26 55 9E D6 90 6A A1 9F>)
$$ ##END=
$$ 
$$ hash MD5
$$ 90 A0 51 5B 61 DD 07 EA 11 27 8C 54 4C 49 13 96
##$RELAX= 
##$RELAX= 
##$RELAX= 
##$RELAX= 
##$RELAX= 
##$RELAX= 
$$ Bruker specific parameters
$$ --------------------------
##$DU= <F:/spectra>
##$EXPNO= 1
##$NAME= <H-F>
##$PROCNO= 1
##$TYPE= <nmr>
##$USER= <she>
##$AMP= (0..31)
100 100 100 100 100 100 100 100 100 100 100 100 100 100 100 100 100 100 
100 100 100 100 100 100 100 100 100 100 100 100 100 100 
##$AQSEQ= 0
##$AQ_mod= 1
##$AUNM= <au_zg>
##$AUTOPOS= <>
##$BF1= 200.13
##$BF2= 200.13
##$BF3= 200.13
##$BF4= 200.13
##$BF5= 200.13
##$BF6= 200.13
##$BF7= 200.13
##$BF8= 200.13
##$BYTORDA= 1
##$CFDGTYP= 0
##$CFRGTYP= 5
##$CHEMSTR= <none>
##$CNST= (0..31)
1 1 145 1 1 1 1 1 1 1 1 1 1 1 1 1 1 1 1 1 1 1 1 1 1 1 1 1 1 1 1 1 
##$CPDPRG= <>
##$CPDPRG1= <>
##$CPDPRG2= <>
##$CPDPRG3= <>
##$CPDPRG4= <mlev>
##$CPDPRG5= <mlev>
##$CPDPRG6= <mlev>
##$CPDPRG7= <mlev>
##$CPDPRG8= <mlev>
##$CPDPRGB= <>
##$CPDPRGT= <>
##$D= (0..31)
0 1.2 0 0 0 0 0 0 0 0.06 0 0.03 0 0 0 0 0.0002 0 0 0 0 0 0 0 0 0 0 0 0 
0 0 0 
##$DATE= 1645079996
##$DBL= (0..7)
120 120 120 120 120 120 120 120 
##$DBP= (0..7)
150 150 150 150 150 150 150 150 
##$DBP07= 0
##$DBPNAM0= <>
##$DBPNAM1= <>
##$DBPNAM2= <>
##$DBPNAM3= <>
##$DBPNAM4= <>
##$DBPNAM5= <>
##$DBPNAM6= <>
##$DBPNAM7= <>
##$DBPOAL= (0..7)
0.5 0.5 0.5 0.5 0.5 0.5 0.5 0.5 
##$DBPOFFS= (0..7)
0 0 0 0 0 0 0 0 
##$DE= 6
##$DECBNUC= <off>
##$DECIM= 32
##$DECNUC= <off>
##$DECSTAT= 4
##$DIGMOD= 1
##$DIGTYP= 9
##$DL= (0..7)
0 120 120 120 120 120 120 120 
##$DP= (0..7)
150 150 150 150 150 150 150 150 
##$DP07= 0
##$DPNAME0= <>
##$DPNAME1= <>
##$DPNAME2= <>
##$DPNAME3= <>
##$DPNAME4= <>
##$DPNAME5= <>
##$DPNAME6= <>
##$DPNAME7= <>
##$DPOAL= (0..7)
0.5 0.5 0.5 0.5 0.5 0.5 0.5 0.5 
##$DPOFFS= (0..7)
0 0 0 0 0 0 0 0 
##$DQDMODE= 0
##$DR= 18
##$DS= 0
##$DSLIST= <SSSSSSSSSSSSSSS>
##$DSPFIRM= 0
$$ [...]
##$SUBNAM2= <"">
##$SUBNAM3= <"">
##$SUBNAM4= <"">
##$SUBNAM5= <"">
##$SUBNAM6= <"">
##$SUBNAM7= <"">
##$SUBNAM8= <"">
##$SUBNAM9= <"">
##$SW= 18.0517287032376
##$SWIBOX= (0..15)
0 0 2 0 0 0 0 0 0 0 0 0 0 0 0 0 
##$SW_h= 3612.71676300578
##$TD= 16384
##$TD0= 1
##$TE= 0
##$TE2= 300
##$TE3= 300
##$TEG= 300
##$TL= (0..7)
0 120 120 120 120 120 120 120 
##$TP= (0..7)
150 150 150 150 150 150 150 150 
##$TP07= 0
##$TPNAME0= <>
##$TPNAME1= <>
##$TPNAME2= <>
##$TPNAME3= <>
##$TPNAME4= <>
##$TPNAME5= <>
##$TPNAME6= <>
##$TPNAME7= <>
##$TPOAL= (0..7)
0.5 0.5 0.5 0.5 0.5 0.5 0.5 0.5 
##$TPOFFS= (0..7)
0 0 0 0 0 0 0 0 
##$TUNHIN= 0
##$TUNHOUT= 0
##$TUNXOUT= 0
##$USERA1= <user>
##$USERA2= <user>
##$USERA3= <user>
##$USERA4= <user>
##$USERA5= <user>
##$V9= 5
##$VALIST= <valist>
##$VCLIST= <CCCCCCCCCCCCCCC>
##$VD= 0
##$VDLIST= <DDDDDDDDDDDDDDD>
##$VPLIST= <PPPPPPPPPPPPPPP>
##$VTLIST= <TTTTTTTTTTTTTTT>
##$WBST= 1024
##$WBSW= 4
##$XGAIN= (0..3)
0 0 0 0 
##$XL= 0
##$YL= 0
##$YMAX_a= 251480
##$YMIN_a= -334798
##$ZGOPTNS= <>
##$ZL1= 120
##$ZL2= 120
##$ZL3= 120
##$ZL4= 120
##$ABSF1= 10
##$ABSF2= 0
##$ABSG= 5
##$ABSL= 3
##$ALPHA= 0
##$AQORDER= 0
##$ASSFAC= 0
##$ASSFACI= 0
##$ASSFACX= 0
##$ASSWID= 0
##$AUNMP= <proc_1d>
##$AZFE= 0.1
##$AZFW= 0.1
##$BCFW= 1
##$BC_mod= 2
##$BYTORDP= 1
##$COROFFS= 0
##$CY= 11.3945322036743
##$DATMOD= 1
##$DC= 2
##$DFILT= <>
##$DTYPP= 0
##$F1P= 2.36226072786647
##$F2P= -0.459571619588291
##$FCOR= 0.5
##$FTSIZE= 0
##$FT_mod= 4
##$GAMMA= 1
##$GB= 0.15
##$INTBC= 1
##$INTSCL= 1
##$ISEN= 128
##$LB= 0.24
##$LEV0= 0
##$LPBIN= 0
##$MAXI= 10000
##$MC2= 0
##$MEAN= 0
##$ME_mod= 0
##$MI= 1.114404
##$NCOEF= 0
##$NC_proc= 0
##$NLEV= 6
##$NOISF1= 3.799351
##$NOISF2= 2.8
##$NSP= 1
##$NTH_PI= 0
##$NZP= 0
##$OFFSET= 15.70392
##$PC= 1
##$PHC0= -16232.59
##$PHC1= 9.200782
##$PH_mod= 1
##$PKNL= yes
##$PPARMOD= 0
##$PSCAL= 0
##$PSIGN= 0
##$REVERSE= no
##$SF= 200.130013532006
##$SI= 16384
##$SIGF1= 3
##$SIGF2= 2
##$SINO= 400
##$SIOLD= 16384
##$SREGLST= <1H.CDCl3>
##$SSB= 0
##$STSI= 0
##$STSR= 0
##$SW_p= 3612.71676300578
##$SYMM= 0
##$S_DEV= 0
##$TDeff= 0
##$TDoff= 0
##$TI= <>
##$TILT= no
##$TM1= 0
##$TM2= 0
##$TOPLEV= 0
##$USERP1= <user>
##$USERP2= <user>
##$USERP3= <user>
##$USERP4= <user>
##$USERP5= <user>
##$WDW= 1
##$XDIM= 8192
##$YMAX_p= 0
##$YMIN_p= 0
$$ End of Bruker specific parameters
$$ ---------------------------------
##NTUPLES= NMR FID
##VAR_NAME=  TIME,          FID/REAL,        FID/IMAG
##SYMBOL=    X,             R,               I
##VAR_TYPE=  INDEPENDENT,   DEPENDENT,       DEPENDENT
##VAR_FORM=  AFFN,          ASDF,            ASDF
##VAR_DIM=   8192,          8192,            8192
##UNITS=     SECONDS,       ARBITRARY UNITS, ARBITRARY UNITS
##FACTOR=    0.0002768,     1,               1
##FIRST=     0,             0,               0
##LAST=      2.2672688,     0,               0
##MIN=       0,             -334798,         0
##MAX=       2.2672688,     251480,          0
$$ Real data points
##PAGE= N=1
##DATA TABLE= (X++(R..R)), XYDATA
0@%%%%%%%%%%%Qj6J6j6K4l2L9m7N6o5P3q8J05j28J51j75K06k38K72l12L56m04
33b15M58n15N84o58P37q28R23j028J142j268J406j554J719j899K096k312K545
50A333k803L090l405L753m144M585n082N651o309P076p990R099j0475J2243j4602
65g980J7933k3036L1918n1792J80760n9556k77271J25502j902j36838K4148K92740
77A14626J13407j13712j00732K024q1033q8494K8424J12184Q5157Q7872J3546
88A73269j26379j37130L684m100q1572N4220K46720J01170j48980r3981O2814
99D9735o0808j90765Q158K31030J13522o9833j4452N1423r0058j81642m5436R5454
111a03672Q4986O3769Q0020L1733n1167p8481q9856q9906L417J15079Q6731K419
$$ plain form
0 0 0 0 0 0 0 0 0 0 0 0 0 8 -8 8 -8 16 -16 23 -24 32 -33 40 -48 57 -71 80 -95 111 -127 145 -167 189 -215
33 -215 243 -272 312 -346 391 -437 486 -542 600 -668 738 -816 903 -996 1100 -1212 1333
50 1333 -1470 1620 -1785 1968 -2176 2409 -2673 2978 -3331 3745 -4245 4854 -5621 6622 -7980
65 -7980 9953 -13083 18835 -32957 147803 88247 -189024 -63522 -65424 -202262 -178114 114626
77 114626 228033 114321 13589 15613 -65420 -153914 -125490 -13306 71851 159723 173269
88 173269 46890 -90240 -86556 -90656 -172228 -118008 128712 229882 80902 -13079 49735
99 49735 -11073 -201838 -193680 37350 150872 81039 66587 118010 27952 -153690 -199126 -103672
111 -103672 -18686 45083 125103 156836 105669 27188 -62668 -152574 -149157 -34078 52653 55072
123E5072K3820M4636p3382j58445m0386R3003N2707n386O7349R5699l8709j37625
135b1647o8436J1085k161N702P5882R1034J9524m4479o0893n9128l6442J0470
147g9489M4935N7427O1755L3896l9294q9270o4570j8936n343K2118Q2407R3550
159I9186K1869m3363n0429m8744n8148k8480L9119P5951N7026J9506j1197m0716
171C1580o1983n1777j0530L5051N9386N6753K9994p779m1280n8141m9285j5244
183h3255K4156M8422M9102L0441m797l8588m9197l5291j0012K2994N1295N2156
195E7426K2459j3372l9779n3492m6164j4048K5921N1791N3507L3369j896l6219
207C9503n0772m2747k0309J3796M7222N5011K7477n463k5476m3692n1897k6619
$$ plain form
123 55072 78892 123528 50146 -108299 -148685 -55682 -2975 -8361 58988 154687 115978 -21647
135 -21647 -90083 -78998 -81159 -75457 425 91459 110983 66504 5611 -53517 -89959 -79489
147 -79489 -34554 22873 84628 118524 79230 -10040 -74610 -93546 -98889 -76771 5636 99186
159 99186 121055 77692 27263 -21481 -79629 -108109 -68990 6961 63987 83493 72296 31580
171 31580 -30403 -82180 -92710 -57659 1727 58480 88474 80695 39415 -18726 -68011 -83255
183 -83255 -59099 -10677 38425 68866 64069 25481 -23716 -59007 -69019 -46025 5270 57426
195 57426 79885 66513 26734 -26758 -72922 -86970 -61049 -9258 44249 77618 75722 39503
207 39503 -11269 -54016 -74325 -60529 -13307 41704 69181 63718 38242 -5450 -57347 -83966
219h3966K1568M7840M2879L0706J4244j8608n0383m8612j8085J0192K7477L8302
231A3554L4338Q707k2185l7985l6687j7944J2137L4429L8350K7361Q698k0658
243D2115m6447m2678j4798J0360K6259L8635L8635J1717k4822m0228l2928j8861
255e3041Q37K8038M4279L4207O281j9524l5516m0074k7112P10K7680M0653L6493
268D3911J6131j1152l1236l6350k6198n715J8605L4713L1076J2338r400k6019
280A0704l1814k4147k198K1715L3061K8855J3573p620k7401l4135k4279l217J7699
293b9204K9637K9575J4782p270k5815l1178k1621l381J7702L1460L0940J5087
305E0714p856k6470l3133k7048q485J4676L1302L1972J9312j56j9928l0624k6809
$$ plain form
219 -83966 -62398 -14558 28321 59027 73271 54663 4280 -44332 -62417 -52225 -24748 13554
231 13554 47892 56599 34414 -3571 -40258 -58202 -46065 -11636 26714 54075 62773 42115
243 42115 -4332 -47010 -61808 -51448 -25189 13446 52081 63798 38976 -1252 -34180 -53041
255 -53041 -52204 -24166 20113 54320 60601 41077 5561 -34513 -61625 -60915 -33235 7418 43911
268 43911 60042 48890 17654 -18696 -44894 -50609 -32004 2709 33785 46123 36723 10704
280 10704 -21110 -45257 -47455 -25740 7321 36176 49749 42129 14728 -19407 -43686 -46903 -29204
293 -29204 433 30008 44790 37520 11705 -19473 -41094 -44475 -26773 4687 35627 50714
305 50714 42858 16388 -16745 -43793 -52278 -37602 -6300 25672 44984 44828 24900 -5724 -32533
318c2533j0104J0076K4845K8091J8174K31j8358k8424k4585r832R612K3506K8060
331A8759J9408J971j6633k5925k3527j1246O418K1122K4929J7294P88j5433k4564
344f639k2136r026Q330K2439K6879J9108J323j7031k6333k4211j3411L435K1090
357a6183K9326K0219K765j0621k0556k5542j6260L364K1101K3762J7037P339q045
370B7706k3729k6179j3481K581J5205K2607K0902R303p584j9321k2043j4971J73
383b8831J4652J9427J5930P738n826j9625k3139j0971L756J2938J8804K0688J0166
396C5707r215k1959j9799j2630k755J0610K1901K0989P941o965j6024j9598j5409
409b7206k565J1657K0649J9236R545m778j5765k0799j6056m862R012J8523J9107
$$ plain form
318 -32533 -42637 -32561 -7716 20375 38549 38780 20422 -8002 -32587 -42419 -32807 -9301 18759
331 18759 38167 40138 23505 -2420 -25947 -37193 -30775 -9653 15276 32570 33358 17925 -6639
344 -6639 -28775 -37801 -29471 -7032 19847 38955 40278 23247 -3086 -27297 -40708 -37273 -16183
357 -16183 13143 33362 36127 25506 4950 -20592 -36852 -33488 -12387 11375 28412 35751 27706
370 27706 3977 -22202 -35683 -33102 -17897 4710 25612 34915 27331 8010 -14033 -29004 -28831
383 -28831 -14179 5248 21178 28916 23090 3465 -19674 -30645 -26889 -13951 4853 25541 35707
396 35707 26492 4533 -15266 -27896 -30651 -20041 1860 22849 30790 23825 7801 -11797 -27206
409 -27206 -29771 -18114 2535 21771 31316 26538 10773 -10026 -26082 -30944 -21932 -3409 15698
422A5698J1279j337j2726j8295j4753m798O686J5814J6697J0240k417j2481j6851
435g244j4442m304P956J5366J6594J1321k02j3105j8124j2973l215L459J2338
448f575J9453J3138m494j3844j1947j1380j0368L119J9372J9864O975k259n388
461A5666j4157j9000j0057N971J4662J4415J1265L235p086j3005j3488j0742J384
474b0937J5772J6213M660M47L33j0937k2335j0205J1501J3662M231Q104J2986
487B3495k907k1382j6449J023M057K594J0784J5827N177r275j3930j2349o069
500a9404L228Q619R581J2393J0554n883k0218j2883R96m17l123J2213K3524N793
514B4973j6142j0592k50p870j2137O250K1375J2153k710m200m290j0182j2082
$$ plain form
422 15698 26977 25640 12914 -5381 -20134 -24932 -18246 -2432 14265 24505 22088 9607 -7244
435 -7244 -21686 -25990 -18034 -2668 13926 25247 25045 11940 -6184 -19157 -22372 -18913 -6575
448 -6575 12878 26016 21522 7678 -4269 -15649 -26017 -22898 -3526 16338 23313 21054 15666
461 15666 1509 -17491 -27548 -21577 -6915 7500 18765 22000 14914 1909 -11579 -22321 -20937
474 -20937 -5165 11048 15708 16155 16488 5551 -16784 -26989 -15488 -1826 2405 10509 23495
487 23495 20588 -794 -17243 -16220 -12163 -9569 1215 17042 22219 12944 -986 -13335 -19404
500 -19404 -16176 -7557 2024 14417 24971 19088 -1130 -14013 -13017 -13434 -16557 -4344 19180 24973
514 24973 8831 -1761 -2011 -9881 -22018 -15768 5607 17760 15050 10850 6560 -3622 -15704
527a5704l674P008J3509J2200K824n942n744m871j0898r707Q620J9462O759n571
541H271J338K223j3592j9188Q20J5851P916O36Q182O787q971j7411q369J848N018
556h641O004Q881P285J126n802j2573j1474N35P848M696M363J0990O557j1020
570H775j6408l571K947j705Q22J3095J3096k946j1211n667k267n857j557Q541
584c913J1240M981j182m775p901o888l198M50N584J0925Q168j705o981m686m722
599d603p301j594R408J1434K818j774q62m687j0198o891L569Q075O066M982L008
614A1450j988p586q524m306Q24M894P359N904J805j740n858p790m927J278N609
629c596N569N196L242j813p032p413l267M76L383O022O545K942k675n445o251
$$ plain form
527 -15704 -19378 -12370 1139 13339 16163 10221 4477 -394 -11292 -20999 -12379 7083 13842 8271
541 8271 9609 11832 -1760 -20948 -20128 -4277 3639 4275 12457 19244 10273 -7138 -15507 -13659 -8641
556 -8641 -2637 6244 13529 14655 8853 -3720 -15194 -14659 -6811 -2115 2248 13238 19795 8775
570 8775 -7633 -11204 -8257 -9962 -9140 3955 17051 14105 2894 -2773 -5040 -10897 -12454 -3913
584 -3913 7327 12308 11126 6351 -1550 -8438 -11636 -11186 -5602 5323 13491 11786 4805 119 -4603
599 -4603 -11904 -13498 -4090 7344 10162 8388 7526 2839 -7359 -14250 -10681 -2606 3460 8442 11450
614 11450 9462 1876 -6648 -10954 -10130 -5236 2123 8027 9832 8092 2234 -5556 -10483 -9205 -3596
629 -3596 1973 7169 10411 8598 1566 -5847 -9114 -8638 -5255 767 7312 10254 7579 2134 -4117
644d117m514m56L644O522N960K459j948n166o406m716q25L973O130N628K990j136
660H022m438o695n000p12L398M972N430L456m92m598o353m027r23K134M799N866
676D839L408m00m208n721m537j534K289M380N582L784k47m128n509l729j364Q83
692f212M753N816L639r34l689m750m074k703J617N008N247L150J79k717m879m568
708e117k149J197M346N100K951K29k480m326m792k071J241L868M833L071P89j975
724D715m529m709k080J163L461M045L547J007k363m135m362j678N50L060M190
739A882L754P51k094m077l870k427K53L237M202L708O75j937l531l701k550J60
755e565L125L914L124J164j548k941m359k317R4K695L711L023J016q33l054l728
$$ plain form
644 -4117 -8631 -9087 -5443 1079 7039 9498 7550 2384 -4022 -8738 -9563 -5590 540 6168 9158 8022
660 8022 3584 -3111 -8111 -8823 -5425 -453 4977 8433 7941 3343 -3010 -7037 -7960 -5826 -1027 4839
676 4839 8247 7847 3639 -2082 -6619 -8153 -5864 -1484 4098 7882 7635 3507 -2002 -5731 -7095 -6212
692 -6212 -1459 4357 7996 7062 3373 -1377 -5451 -8154 -6537 -1529 3718 6868 7047 4330 -549 -5117
708 -5117 -7266 -6069 -1723 3377 6328 6557 4077 -249 -5041 -7112 -5871 -2003 2830 5901 6690 4715
724 4715 186 -4523 -6603 -5440 -1979 2066 5613 6620 4257 122 -4240 -5918 -5368 -2308 1882
739 1882 5636 6387 4293 216 -3654 -6081 -5828 -2591 1611 5319 5994 4057 526 -3175 -5725 -5565
755 -5565 -2440 1474 4598 5762 4214 1273 -3086 -5403 -5309 -2614 1097 4120 5136 4303 1249 -2479
771b479k801L76K022L712K990J588j107k865l906k215l23J929L798K958J466r05
787D238k894l600k035n88J762L438L378J452r08k690l547j932p12J537L170L239
803C308J693r74k662k911k440q92J636L113K781J626l27k145l073k537o45J541
819b908K774K800J321j48j858l108k374r24J257K585K611J741K1k115k653k419
835c397l18J010K047K675J806n05j639k470k141q02Q67K271K438J672J54k022
851A646k165k308r51P27K218K378J797j15j249k114k530p43Q52J822K125J704
867C094J04j183k224k256p77L19J790K183J870K95j149k211j689j218K29J841
883i82K311J310M53j059j994j988j007J39J906J985J572L92j050j987j795q64
$$ plain form
771 -2479 -5280 -4904 -2882 830 3820 5408 4301 1436 -2470 -4685 -5008 -3079 719 3677 5143 4238
787 4238 1344 -2256 -4291 -4879 -3117 321 3699 5151 4243 1553 -1994 -3926 -4638 -3101 69 3308
803 3308 5001 4027 1365 -1546 -3986 -4878 -3242 -129 2652 4278 3951 1806 -1267 -3804 -4449 -2908
819 -2908 -134 2666 3987 3839 1981 -1127 -3501 -4425 -3168 -583 2028 3769 3790 1675 -978 -3397
835 -3397 -3715 -2705 -658 2017 3823 3318 1679 -791 -2932 -3734 -2867 -596 1842 3514 3668 1646
851 1646 -519 -2827 -3778 -3051 -833 1545 3342 3227 1978 -136 -2666 -3409 -2557 -735 1390 3094
867 3094 3198 2015 -209 -2465 -3242 -2923 -1133 1050 2920 3215 2066 -145 -1834 -3052 -2823 -982
883 -982 1329 2639 3092 2033 39 -1949 -2956 -2817 -911 1074 2646 3038 1988 1 -1794 -2658
899b658j88J775J989J426L42m87j644k018j201K84J262J928J134O82o34j676j725
916a409j144K01J723J134J310O57k81j943j827q56L86P41J339J678J226q01j788
933C46j684p63J33O06J266J723R43n72j600j595o18j16K82J528J743J106j234
950A494j136q94p34r64N72J647J773L10r59o06r35j194p45O37J924J259N44o18
968A375k59j342j444o44Q37J884R58J81mn45j351j684k32J280J259O03M22M27
986A721k23j914j509K8J003P76O40R50M26q19j640j065K46M54N66Q10J377K52
1004B079j290j453o48Q6O3M56J325J105q0r85j204l28l98L3K29J622J367k20j302
1023D57o96n40n09k65R33J680O20l24j145M7p96j188L01Q77J495L32k85K40p20
$$ plain form
899 -2658 -2846 -1071 918 2344 2686 2199 555 -1463 -2664 -2380 -1118 810 1944 2626 1992 316 -1409
916 -1409 -2553 -2352 -629 505 1815 2472 2191 248 -1579 -2435 -2049 -1308 31 1709 2935 2134 346
933 346 -1338 -2101 -1968 -1362 -96 1627 2570 1998 398 -1197 -1815 -1931 -1649 -121 1622 2728 1494
950 1494 358 -536 -1270 -2234 -1662 -15 1758 2068 1109 503 -432 -1626 -2371 -1734 190 1449 1993 1375
968 1375 1116 -226 -1670 -2314 -1477 407 1365 1546 1542 997 -354 -2038 -2270 -990 269 872 1294 1721
986 1721 1498 -416 -1925 -1897 -894 -118 522 1472 1898 1079 -561 -1626 -1380 -926 -360 450 1827 2079
1004 2079 789 -664 -1312 -1226 -1163 -707 618 1723 1643 658 -546 -874 -1272 -1239 -1010 612 1979 1759 457
1023 457 -239 -779 -1288 -1553 -620 1060 1680 1356 211 258 -538 -1726 -1425 -548 947 1279 994 1234 514
1042E14j293p89Q4J109J056L25K26j95o70j185r16K85J022J169J77M53k38r27
1060B07j163n13L15P63P51N78Q50l26j431q81k96J16P24N09Q18K54k65q34q74
1079f98n26p5N92Q57P74N77p66o56q55m94J56J72J063Q69L82n37m09j060m70k1
1099a125J88J215P79J76k50r28p33l04k66M16J020O80L22k17q35o07j59n19O46
1118e01R05K25O45m47n58n06p39j7M59L07Q41N75m08l92q27l23n06O85P44L68
1138E30N58j10l61q67o86j32J35Q69N61M32j07k06p92p38j20L70L26Q50N52j96
1158H68j70r10n43k96K31P85O33K42j57j43n52p47o3M57L37M85M07J59m71n83
1178c1n84k42N9P04L29M77K23m46l59p62k64L66K59P60O84r7k13r00n45m66J96
$$ plain form
1042 514 -779 -1568 -1484 -375 681 1006 1232 1037 367 -818 -1734 -1449 -427 742 919 1372 1134 207
1060 207 -956 -1469 -1154 -391 360 938 1788 1462 31 -850 -1146 -1030 -306 203 1021 1275 1010 176 -698
1079 -698 -1224 -1299 -707 150 924 1501 735 79 -776 -1270 -1114 -942 121 990 1372 835 426 -634 -1104 -1125
1099 -1125 -937 278 1057 1233 983 55 -678 -982 -1248 -832 188 868 1190 973 138 -469 -628 -1147 -501
1118 -501 404 629 1274 827 269 -237 -976 -993 -534 -227 614 1189 781 389 -438 -761 -1267 -582 162 530
1138 530 1088 978 617 -250 -936 -1068 -933 -64 497 929 822 616 -176 -914 -1034 -664 -338 512 1064 868
1158 868 698 -212 -755 -1051 -820 -35 598 840 683 540 -12 -759 -822 -365 -28 457 864 1023 552 -31
1178 -31 -615 -857 -798 -94 235 712 935 489 130 -632 -896 -530 -271 489 1173 1076 863 -37 -582 -1048 -852
1199h52K81Q56N79m4r2p74k97o50K26O16M93M22j5k91p09m68Q3j29O97L38J86
1220D56N57l95q39n32J91k23N34L65M48J59K8n58n37m35L0M55N81K34K45r8k07
1241D59q99k63JL22M39N49J24l8m65m75m13q9M63J51N23J88L9o47l02k36l5nO48
1264C9L37K70j69l78k85k62k89L17M17K70K95j43l22l16k60k32N73J31L77N5L02
1285G27l77o16k25j86L88J10O13L15j39j63m92m05j81J88K59O52J68k30R0o35
1305a39q3l78K17L57L70J12Q4K9n82m50k8o2M14K10M95J43k47m41m81k51L62Q0
1327b69N77K59k43K5m70m43j36K89J75K80N81J16m76k78k05l91J84M26n9N01j04
1348C39J82l85m36k79J53M72p6O58o1j30l96j98k91M6N3L92K64K36l29j80l99
$$ plain form
1199 -852 -571 285 864 820 728 -46 -343 -993 -767 -151 342 764 749 458 -251 -719 -636 -765 -68 270 456
1220 456 1013 618 -221 -753 -562 -785 -251 114 562 721 749 191 -346 -781 -751 -296 285 519 764 666 459
1241 459 -440 -703 -702 -380 59 608 732 694 229 -246 -659 -748 -285 -134 389 577 616 -31 -333 -569 -604 -609 39
1264 39 376 646 477 99 -186 -448 -737 -420 -3 267 562 419 97 -219 -479 -711 -138 -7 370 425 727
1285 727 350 -266 -491 -677 -289 -179 434 749 610 447 -45 -450 -631 -443 -184 468 636 406 496 -139
1305 -139 -222 -600 -383 -26 344 456 540 569 -13 -463 -491 -553 -139 71 566 709 462 21 -460 -711 -349 -269
1327 -269 308 567 324 349 -121 -564 -700 -411 -236 44 625 741 265 -13 -218 -609 -425 1 -58 443 339
1348 339 521 136 -300 -579 -426 46 -30 628 567 437 41 -157 -448 -402 -349 43 307 543 214 34 -365
1369c65Jk88L73L34L62J10m6k31k62m83j52L52J67L38K77K02m04l78l31j0O8J95
1391a71N57J0N3k23l67k87P3n0L80L63K59o8j32k54o44L0J17L41M09J08j2j21
1413C71m02n43k38N98J73j3L98O7o7p43Jk76L42L28J7L23K0p0n04j80k00J45K08
1436b45N54N7Q2K0n23k62j2L9j05L62O30j04j17m18o4k90j67J38P11J23nk00L0
1459B34o18k05K07j57N73L05J03L3l90j81k28j19K31M95M46l69k13L8m72m87J37
1480f37N69K29N4J70L4j52n13m6k36M20j9M94N3l6l50m2m39k33N84j9L71RK18
1503D83k32n99l26K34K24q2M05L73j11l06k23n0k76J01J08N56l8J93j92l22m0
1524a20k67J5L08K15L83k59k33J1k24m67J38N38k9K84k8j28j76j74o7j43K85L37
$$ plain form
1369 -365 -364 -652 -279 55 417 527 481 250 -12 -495 -647 -295 -128 210 487 689 285 -93 -424 -434 -366 -171
1391 -171 386 396 449 226 -141 -428 -355 -405 -25 338 597 529 397 143 -501 -471 -354 -13 396 504 492 371
1413 371 -31 -574 -812 -214 -41 -54 344 411 344 -399 -398 -674 -332 -4 13 336 356 286 -218 -398 -598 -453 -245
1436 -245 309 366 448 468 -55 -317 -329 -290 -395 -33 597 493 376 -42 -106 -396 -563 -425 286 409 404 204 234
1459 234 -384 -589 -382 -539 34 339 442 475 85 -96 -324 -443 -212 283 729 360 147 185 -287 -774 -637
1480 -637 -68 161 215 385 419 267 -246 -292 -528 -108 -127 367 420 384 34 -8 -447 -680 -96 -115 256 265 483
1503 483 251 -348 -674 -440 -216 -298 107 480 369 63 -160 -210 -486 -385 -277 279 241 434 242 -80 -120
1524 -120 -387 -372 -64 151 534 275 42 53 -171 -638 -500 38 9 293 265 137 -39 -213 -280 -423 -138 199
1546A99L12j47q3n31J19m29N06M20k11K87R1o44j57p5m3J68O7L98j25J28J09k57
1568A02o45J98o1N07N3PO9o0n3l31j35j13M50J67j10K60n9m16P5k32n0M4P87r2
1592C62j09j7k06o1j91P2p5K35J4J30P7l07k4j17k3J62N1J85J12n1l4m00J41j05
1616a79l4L38Ml5K97l26m25K15j02L1J33L90j41M2j84k32J57n20L45L13J68O3
1638C18qk78k62K2jk4M46o3j6M5P8j73j56J37j40J68J62r8j43N67m65k55k41J
1662c79J75K46%L47l29l99J53K9p7L67k72M38j92J92k33p1j83j65Q4M01j8kR1
1685B03l28r5k7K12J2j75L6K33O7l63Qj8qJ51K38R5p3j94N5j00l09J35N4M01n1
1710A59J39k36Q6k22p6p1p5K69L04k33J1j22l4k71L55K7p6N0J33O6j67k33M6K7
$$ plain form
1546 199 511 364 281 -250 -131 -560 -54 366 155 442 533 -111 -268 -343 -386 -218 -151 247 122 250 359 102
1568 102 -543 -345 -406 101 154 161 230 170 117 -214 -349 -462 -12 155 45 305 246 -170 -95 -327 -377 -333 454 362
1592 362 253 236 30 -31 -222 -150 -225 10 24 154 231 -76 -100 -217 -240 -78 -27 158 270 219 185 -215 -74 -179
1616 -179 -213 125 129 94 391 65 -360 -145 -247 -216 -83 307 166 208 24 -208 -51 -571 -226 87 255 318
1638 318 310 32 -230 -208 -209 -233 213 150 134 179 257 84 -72 65 -75 93 255 157 14 581 116 -139 -380 -379
1662 -379 -204 42 42 389 60 -339 -186 -157 -234 133 -139 299 107 299 66 -5 -188 -353 -269 132 114 112 203
1685 203 -125 -220 -247 -35 -23 -198 -162 71 138 -225 -217 -235 -243 -92 146 241 168 -26 29 -71 -380 -245 -191 210 159
1710 159 298 62 148 -74 -150 -221 -296 -27 277 44 55 -67 -101 -372 -17 10 -66 -16 117 183 16 -217 -171 -144
1734a44o8m2M30j38K15l68m3J04q9K9j82L53L07j85Oj22k52O7q2J99R3k53N34
1757C69j20k83r2l06K49K60J19k38rJ90J22m06K0j73K76R1q9K78k21j07J64l37
1779b43P5K42M3L5N1k24P2k94L6j50L12K65j24K60j08j28n8k69P1J28Q4K66l96
1802e4K93j04l56k9J60l9L8R0J67k65J21P6j84O7j89J56R4J59p8k06M9j92K54
1825B8k53L19M5O0k2j23J33k75J88k64J56J24j02J1K6m7l21M05j15J44j16L41
1847C42j77j13j8l7j68J27P8MJ01K44m22J04j57l22L54l7j00L73M6j57j59K41
1869A47k62J82n6j34L76j82q8J58k65l8Q6n3M7m1K67m37M60l00J55j16j25Q7K69
1892A37l7J3n0j28j44R6j2J73J69r0J41j99j9j84n0j8J88L54l85J78j05o5k13
$$ plain form
1734 -144 -212 -254 176 38 253 -115 -158 -54 -143 -114 -296 57 364 179 185 63 -189 -122 -204 -5 88 -165 369
1757 369 249 -34 -126 -432 -183 77 196 -42 -51 139 261 -145 -125 -298 -22 69 -20 258 37 -70 94 -243
1779 -243 -168 74 117 152 203 -21 51 -243 -207 -357 -45 220 96 356 248 120 62 -207 -136 -8 76 342 -54
1802 -54 239 135 -221 -250 -90 -129 -91 -1 166 -99 22 98 -86 -19 -208 -52 42 201 123 -83 -34 -226 28
1825 28 -225 94 139 199 177 54 187 -88 100 -164 -8 116 14 25 51 4 -317 88 -27 117 1 342
1847 342 165 52 34 -3 -171 -44 34 38 139 383 -39 65 -92 -414 -60 -97 -197 176 222 65 -94 147
1869 147 -115 67 11 -123 253 71 -17 141 -124 -162 -76 -129 -82 -123 144 -293 167 -133 22 -94 -219 -132 137
1892 137 100 113 63 -65 -209 -113 -125 48 217 127 268 69 50 -134 -184 -202 -14 340 -45 133 28 -37 -250
1915b50J42o1n9N6M76L5l54O9m34J99N8N3L44l16J01j84N8j00l8K40J70J47m60
1938a08K37m1l19P0R5j12M5N29k39j58J73l41K6r0L79j63J68L6k17L31k49j75
1960a23j74K42J55p0J90l19P0o5R1j51j39L28J5j0K73l07K5j61j67K71O3l10K64
1983iL5%r1j2J46j02O7l3K78j62k65J43k83P0K52J55k5m06L00j40K11k76o7L09
2007I5J25m6k45J88J09l55J0L39k58m3J0K31o6j21j29j66N43k97J29n8KO5P2j87
2031e3k08J96J11p7Q0K25l93J43j26J01k55J62J00K80m39K26K0O1j9l01P8J2K7
2054d9o2L03k00m6j91Q2J43Q1K4J42lk12q8J1N4j53K98o5l0N7r0l7j5K8j71J0
2080a79M22k33M44m71r6K53j63n8J38NM6p5j74L65j81j96K92l00P5K39j06r3P
$$ plain form
1915 -250 -108 -169 -228 -172 304 339 -15 54 -380 -181 -123 -70 274 -42 59 -125 -67 -167 -205 35 205 352 -108
1938 -108 129 88 -231 -161 -66 -178 -133 396 157 -1 172 -169 -143 -233 146 -17 151 187 -30 301 52 -123
1960 -123 -297 -55 100 30 220 -99 -29 -94 -3 -154 -293 35 50 40 313 6 31 -130 -297 -26 37 -273 -9
1983 -9 26 26 -65 -77 69 -33 34 1 279 117 -148 -5 -288 -218 34 189 164 -242 58 -82 129 -147 -214 95
2007 95 220 174 -71 117 226 -129 -119 220 -38 -81 -71 160 94 -27 -156 -322 221 -76 53 -5 -3 62 134 -53
2031 -53 -261 -65 46 -31 49 274 -119 24 -102 -1 -256 -94 6 286 -153 73 93 154 135 -166 -88 -76 -49
2054 -49 -111 192 -8 -54 -245 -163 -20 61 85 227 224 12 -76 -65 -11 -164 134 69 39 96 6 -31 -46 -18 -189 -179
2080 -179 243 10 454 -17 -113 140 -23 -81 57 62 108 33 -141 224 43 -153 139 -161 -86 153 47 -46 -39
2103c9k35K86k17J14K17j62k6P1o2k29L88k27L39j58p2K28j86j16Q6k56K11j26
2125a71O2l6L49j8j99j13L04l53J97J52l31K80J4L2k31l6J58j14K15l5n5j22q9
2148a40M5K00k73L5J35j33K95j27J33j25j03n7O3J16J9k08M6J27p9k95M33M7m6
2171A08j97K71l4j35j02J83j71o0M46k84j13J63o9j83lJ78M3j48J43L1J51j41
2193G7j61O0J02l5j94J3K52k2k2o8n3nK5p8J83O4O9j74J32j02j82J21p7M42m64
2218i7L79k23p4J0K9J08J5J3l18q7M28k5r0l30J73rj47K61J86k98J80N4j62M9
2242B5k43L85q7k1O3R0k92j1k31K0N03j24l5j03k6J37j9Q0j25K4K08j9n7k17J18
2267D3n9o2j79L18p0J6J54J6j0m5k24jK03J50j63j46J46P2j97k01M40m8r3J70
$$ plain form
2103 -39 -274 12 -205 -91 126 -36 -62 9 -53 -282 106 -121 218 60 -12 216 30 -86 0 -256 -45 -171
2125 -171 -109 -145 204 186 -13 -126 178 -175 22 174 -157 123 137 169 -62 -98 60 -54 161 126 71 -51 -140
2148 -140 -95 105 -168 -133 2 -131 164 37 170 45 -58 -115 -52 64 83 -125 -79 48 -31 -326 107 154 108
2171 108 -89 182 148 13 -89 94 -77 -137 309 25 -88 75 6 -177 -180 -2 41 -107 36 67 218 77
2193 77 -84 -24 78 43 -151 -138 114 92 70 2 -51 -56 -31 -109 74 138 207 33 165 63 -119 2 -75 367 -97
2218 -97 282 59 -15 -5 24 132 147 160 -158 -245 183 158 68 -262 -89 -98 -245 16 202 -96 84 138 -24 25
2242 25 -218 167 80 59 122 212 -80 -91 -322 -302 201 77 42 -61 -87 50 31 111 -14 10 218 199 142 -75 43
2267 43 -16 -78 -257 61 -9 7 161 177 167 122 -102 -103 100 250 87 -59 87 159 -38 -239 201 153 60 230
2291B30m01Q1J45l8K7O3R1l78Q4J10L9k70J42k4O0mK43l11L03j72k29J47j11L16
2315A43k48J47k11O8K17qj87J41k80J53L0J37j0k6k43R5K51k84k1j7K38L5q0R7
2339A37k97K08l04K85J03k97M41k67j04k27L81q5r0O3P4k8l8p4n7M2Q1P6L4J31
2363A88M6l15J10P3l47K81j52J54J00R8k76K05m64J75j91K17P1M78n77J63L9o7
2385Ipj26K38P5j85K90k06j22J87o1o0o3P5m9Q5k17K11l7j48j31J50O9K46k01
2409B2L48l68J40j85Q7J9K77l61K85l0k34J66k75j5K16j17n7L58k73k47J06J13
2431b5N2r6O9p3Q3L4O7r9rl40L60K12j57r3j26K12j93j01J01K7K26k99L30k61
2455i9K67k22r7M6j94L17K1j20r8r3M88k76K2j92L20J61l52J16P1Q9l66L62j54
$$ plain form
2291 230 -171 -90 55 17 44 107 198 -180 -96 14 53 -217 -75 -99 -39 -43 200 -111 192 20 -209 -62 -173 143
2315 143 -105 42 -169 -101 116 108 -79 62 -218 -65 -35 102 92 66 -177 -82 169 -115 -136 -153 85 120 40 137
2339 137 -160 48 -256 29 132 -165 276 9 -95 -322 59 -26 -116 -53 21 -7 -45 -119 -176 -134 -53 23 57 188
2363 188 234 -81 29 102 -245 36 -116 38 138 236 -40 165 -299 -124 -315 -98 -27 451 -126 37 76 9
2385 9 2 -124 114 189 4 294 88 -34 153 92 32 -31 44 -5 80 -137 74 37 -111 -242 -92 -23 223 22
2409 22 370 2 142 -43 44 63 340 -21 264 234 0 166 -109 -124 92 -25 -82 276 3 -244 -138 -25
2431 -25 27 -69 0 -73 10 44 111 12 3 -337 23 235 78 -15 -141 71 -122 -223 -122 -95 131 -168 162 -99
2455 -99 168 -54 -151 -105 -299 18 39 -81 -179 -272 216 -60 -38 -230 90 251 -101 15 86 175 -191 171 17
2478A7K0K7j27J28n2j07M5J90o0k58K04j10L45O4k94l8l6r8O9R8P8pj33O7j07
2503g5O5Q5j42L8K36N1l69K17l74J87N9j50K01N6L8j99J98j24n2k15L28j5n0j49
2527a55J08r1R8P3qo8q2J69O9k5j6k41L00N2k30K38l66K37k2l80K34L83k26p4
2551b3k0L42j80O1k9j97O0n3J10k51J79n1m8k38M87m81J07J58Q4j25j9J75l0J65
2575A83l83K9J9O1J01j14K38j34P3J01n20M25m06N68k53j77J11%j96K75K7j32
2597a04Q9O0j26j0r1K45m5Pk6J01k86J07R8j53J29P1Rk1j70k6m0L15M4J55m89
2622a57R0J0L10k15L20k33q3k7o2O3K28k20j66K10j19j27L09j37mj17K54n3j22
2645d8K84k86pK0J55p7J37l73L81k02j4Lm3J82r0R3P2j87r5P9J84r7k72J93p7
$$ plain form
2478 17 37 64 -63 65 13 -94 -49 141 81 -177 27 -83 262 326 32 -6 -42 -140 -71 27 105 98 -35 32 -75
2503 -75 -10 75 -67 -29 207 258 -111 106 -268 -81 -22 -172 29 85 123 -76 122 -2 -54 -269 59 44 -6 -155
2527 -155 -47 -138 -40 33 25 -43 -125 44 113 88 72 -169 131 183 -47 191 -175 62 40 -340 -106 277 51 -23
2551 -23 -43 299 119 180 151 -46 14 -39 71 -180 -1 -52 -100 -338 149 -332 -225 -67 17 -108 -127 48 18 183
2575 183 -200 -171 -152 -91 10 -104 134 0 73 174 -346 79 -327 241 -12 -189 -78 -78 -274 1 28 -104
2597 -104 -15 45 -81 -91 -182 63 18 25 -1 100 -186 -79 19 -134 -5 66 75 54 -116 -142 -182 133 177 332 -157
2622 -157 -67 -57 253 38 358 125 42 15 -47 16 244 24 -142 68 -51 -178 131 -6 -10 -127 127 74 -48
2645 -48 236 -50 -57 -37 118 41 178 -195 186 -16 -30 -27 -70 112 22 115 187 0 -95 -16 168 71 -201 -8 -85
2670h5J50m0j71p7J87J9kN1n9K01p5k02Q2Q2J07j89K22j98J89k26P4J78j58j13
2694e3R3K76m78L02l24Q9J3K34j11k42J83j69K14J94j38o9Q1j58L43j57J3j84
2716d8L17m80%K33p2J66l34J47K12k6J92k31p1O9J6q8K60m43j3K38J3j36K42p2
2740I1k7Nj79R9m4J48L5mQq2j38Rj03L45m75J81K5N42m13o2J13J05o1j66J5Q5
2766E2l11L43j27po2K44k60K03j48j15J43L30m53K06r2k14L16N3M4k52J62j93
2788a38J03K59m09J04N3J0J28l00J03K59k16K22N2j08j73L59k77L3J70j42k99
2809b07J15J80j58mL30Q3l98p5J48K07k87K24j15n9j96K39n9P2k49L13J5l10L23
2832A32j2kL8k65J60q2J05j69J77j32J04k2m24O60m8m08Q9L48m38K75j43j96M26
$$ plain form
2670 -85 65 25 -146 -223 -36 -17 -19 32 -27 174 99 -103 -21 61 168 -21 201 3 192 -34 40 218 60 -53
2694 -53 40 316 -162 140 -184 -95 -82 152 41 -201 -18 -187 27 221 83 14 95 -63 280 123 136 -48
2716 -48 269 -211 -211 22 -50 116 -218 -71 141 115 307 76 5 74 90 2 262 -181 -194 44 57 -79 163 91
2740 91 64 69 -110 -11 -55 93 128 124 132 50 -88 -79 -182 163 -312 -131 -106 436 23 -39 74 179 118 -48 -33 52
2766 52 -259 84 -43 -50 -112 132 -128 75 -73 -188 -45 285 -168 38 -54 -268 48 101 145 -107 55 -138
2788 -138 -35 224 -185 -81 -28 -18 110 -190 -87 172 -44 178 230 122 -51 308 31 64 234 92 -207
2809 -207 -92 88 -70 -74 256 339 -59 -134 14 221 -66 158 43 -16 -212 27 -32 40 -209 104 119 -191 132
2832 132 120 118 156 -109 51 -31 74 -95 82 -50 54 32 -392 268 220 -188 -99 249 -189 86 -57 -253 173
2855A73j75L52l92J64r0n0J93l48J31L0J30Ko9Nj7J58j95K91l52m6J06J16k10
2878i3L91l00J86j51J87j82J18m1J63o7j0q7N0j31l32K42K24Kn22K61r2K59l78
2901c03L46j01N2l59K38p3j8M77j99m9r1J56k35J49J45M5l47J60j6o2R2P2J02
2924A81l4j2j95J47j8J48l66J75k26J20L42l83J65jM6q5j51p5L25k18K52o6m11
2947c40L73j6m0J76n9p5JN0J01r9p2Q1k29M67m62M16lo9n7l35K62p1j4m2M7J3
2973DJ53l9jq6pJ47n09K24Q9p8J16J02l3l8k49m2K39J89j24L5j35l9J54o1J71
2998A82m0q4k44kK48k69M30l01l5j32J83o0P7K13k6l09K7J78J52k95K45m60K84
3021c8J63k6R2k91o8K54k24O5P6j12L02ol60O9J62k54J26K02n4k4kj24m2J97k43
$$ plain form
2855 173 -2 350 -42 122 32 -18 175 -173 -42 -12 118 120 51 56 39 197 2 293 -59 -105 1 117 -93
2878 -93 298 -2 184 33 220 38 156 115 278 211 201 114 164 33 -299 -57 167 169 -353 -92 -184 75 -303
2901 -303 43 -58 -6 -365 -127 -200 -218 259 60 11 -80 76 -159 -10 135 180 -167 -7 -23 -85 7 79 181
2924 181 147 135 -60 87 69 217 -149 26 -200 -80 262 -121 44 43 89 4 -147 -222 103 -115 137 71 -340
2947 -340 33 17 -23 153 94 19 20 70 171 72 0 81 -148 319 -143 273 270 201 144 -191 71 0 -14 -56 -9 4
2973 4 157 118 117 31 24 171 -338 -114 -25 -103 13 115 82 44 -205 -247 -8 181 57 92 -43 -82 72 11 182
2998 182 142 58 -186 -188 60 -209 221 -80 -115 -247 -64 -124 -47 166 140 -169 -142 36 188 -107 138 -322 -38
3021 -38 125 99 191 -100 -168 86 -138 -73 3 -109 193 187 -173 -104 58 -196 -70 132 78 54 52 -72 -114 83 -160
3046a60K08j7r8Q6j03r5J15k04K62R3r6q6J75j85k4JJ44O4j28J06K38k60J05k89
3070a48K01k26J88j50j00L94Nj44KJ52l70J05R6j90O8j27L45m43L22K47n49M45
3092A23j22K18r4k98J99M7n3p0J43j29O9Q3m3KJJ96j85k4M8l3j94L34r2m55L98
3117F9j2Qj69J5nl2Q4N1k4N2m4r0l7Q8R6j38Nm4L58m08K47p9j12O5M10j94j76
3144a6N6j71N6Q2j2j72J9L23k17r4L8J76k02K60j97q6M11m47K94p6K5j23K06J00
3168B33j99j1J01k74O7J82q0K3J42k25J53k45M7j49N5J78j5mP0K10l23M1J04Q1
3192A62m82M09Q4l74J41p5J91L4j74Q5Q9k42k4K11K94k09L8l25M0L28N8l28N6
3215a3M4l4J94l29Q5j6j04K45K19k36j9K0R1j99J77N8q7o9L5M6O3j45j34R2Q7
$$ plain form
3046 -160 48 31 -67 19 -84 -179 -64 -268 -6 87 -9 -95 80 -105 -129 -128 16 80 -48 58 296 36 141 -148
3070 -148 53 -173 15 -135 -235 159 164 20 22 174 -196 -91 5 -185 -117 -244 101 -342 -20 227 -322 123
3092 123 1 219 125 -173 26 73 20 -50 93 -36 33 116 73 75 76 272 87 63 111 78 -116 218 126 -329 69
3117 69 57 65 -104 -89 -94 -126 -42 9 -15 37 -7 -97 -134 -46 50 -88 -83 -127 231 -177 70 -9 -121 -56 354 160 -16
3144 -16 40 -131 -75 7 -5 -177 -158 165 -52 -146 -108 68 -134 126 -71 -157 254 -193 101 25 50 -73 133 233
3168 233 34 23 124 -150 -83 99 19 42 184 -41 112 -133 -86 -235 -180 -2 -17 -21 49 259 -64 -23 81 162
3192 162 -320 89 173 -201 -60 -135 56 90 -84 1 90 -152 -176 35 329 120 158 -167 -127 201 259 -69 -13
3215 -13 31 -3 191 -138 -53 -69 -173 72 291 55 36 56 147 -52 125 183 96 27 62 108 171 26 -108 -16 71
3240G1M1j39K4r4K77k4k02K05j77o5J12%L4k43nJ71j85K03Q6M8k04K37j45J11
3264A37r0k48J33j6r2K27O3J40l51J18r1Q2r5J77M7j16o0k38M52r4p8M5j12J84
3288A24P1n6k37j16M62m30J15M05m0m18K06j81pJ69l41P4K98m8j57J41j10K02
3310A26k2j35N5R2o8jQ6k74K53o7M5o7K6j46J86p3Q1j98K51r3q5J57pM2j91L5
3336Hj69PJ97k8p2J03j4J96p1l26M42m62K83m5p3l40K99K6J5rJ46j44k7K21r3
3361G0J14k22O6m7j06M5p6J56J00l42j28L25j18J96k55L31r7p2Q0M3J08j63j0
3384bQ0K70j97j50lN7j00R2k60J36J72q6J20k08J61j46J29k5O5k01K34k47K02
3407I3J7L6k07J49k88J69K12r0j01K7J74j31q6j67K12k3J63j45Q0k61K23L3kk88
$$ plain form
3240 71 112 -27 -3 -97 180 156 -46 159 -18 -83 29 29 63 -180 -185 -14 -199 4 90 138 -66 171 26 137
3264 137 47 -201 -68 -84 -176 51 114 254 -97 21 -70 12 -83 94 141 25 -35 -273 179 85 7 52 -60 124
3288 124 195 139 -98 -214 248 -182 -67 338 298 -120 86 -95 -102 67 -274 -200 98 50 -107 34 -76 126
3310 126 104 -31 24 116 48 47 133 -141 112 45 90 23 49 -97 89 16 97 -101 150 57 -28 129 122 164 -27 8
3336 8 -161 -154 43 15 -57 46 32 228 157 -169 273 -189 94 49 -24 -364 -65 -39 -24 -33 113 -31 -58 163 70
3361 70 184 -38 28 -19 -125 -80 -156 0 100 -242 -370 -45 -163 33 -222 109 12 -60 20 63 171 8 -2
3384 -2 78 348 151 1 -2 55 -45 47 -213 -77 95 9 129 -79 82 -64 65 40 105 -96 138 -109 93
3407 93 110 146 -61 88 -200 -31 181 91 -10 17 191 60 -26 -193 19 -4 159 14 94 -167 56 89 87 -201
3431b01K76r6l1K51j63r0J17j69K40n0k17J63N5K55m82J82j75K21kJ83k27Qj34
3454h6k28K67o0L94m38K50q8n7m4q1J38P1k68J71j69K61k56K57Q8K0q8j60K34
3477A28O3k58J4R4J28j91j5n2J32nk7J2J02j90j04j0J74J61R1q3j84j3L28j80
3501A15l8k20J14j17M10k28J12k72M09j06k93Q2K6Q1M2n0k20K84l2j66J25j61
3523a03P7m3O5k4n5J53j34K6k63J35K28k24J69j71J69L2qJ79j78q4Q1j02J47J16
3547A88j94O7J8J1nj76M2j43J89j23N3O1j53J23l0J57k04J15l3l3r1P3J28l45
3571c05K99J5R8o1K4j89j6m8K80j88j69J19r3L00k54K13l8J38j8j58Rn2M39j52
3595A93pM4l71N4j43K50j94J00Q7j02J73k25P5J89P2j25l33J54L60k19l4K12k33
$$ plain form
3431 -201 75 -21 -52 199 36 -54 63 -106 134 84 -133 30 85 340 -142 40 -135 86 84 267 40 48 -86
3454 -86 -314 -47 -107 287 -151 99 11 -46 -90 -171 -33 38 -230 -59 -228 33 -223 34 122 142 54 -106 128
3477 128 191 -67 -53 41 169 -22 -37 -89 43 38 11 23 125 -65 -169 -179 -5 156 247 164 -20 -33 295 115
3501 115 77 -143 -29 -146 264 36 148 -124 285 179 -114 -32 -6 75 117 67 -153 131 99 -67 58 -103
3523 -103 -26 -69 -4 -28 -83 70 -64 -38 -301 -166 62 -162 7 -164 5 37 29 208 30 -54 27 -75 72 188
3547 188 -6 61 79 90 85 -91 -49 -192 -3 -126 -73 -12 -165 -42 -72 85 -119 -4 -37 -70 -161 -88 40 -305
3571 -305 -6 9 107 46 70 -119 -135 -183 97 -91 -260 -141 -234 66 -188 25 -13 125 107 -51 -42 -94 345 193
3595 193 186 230 -141 -87 -230 20 -174 -74 13 -89 84 -141 -66 123 195 70 -263 -109 251 32 -2 210 -23
3618b3j08L28l55K7J30K1J53L6k59j82L99j76l1R5r8j71K58J45k25n2k9M2P4l04
3642c05L65k35J11Q0J18k78k0K94j59J57k58j31M02J19j91K6k33Q9n5q7K23J39
3664A71p9j99M6K89l93J28J43K5k57L26j71m9L2J25j94K74j79%K0K2k51J44J7
3687a0K0ork21L34k51J53N9j13Ko3J10k83L45J28j48J21l66L84l49p8J64n4j01
3711b32K93j67m8K38j33J30m7j68j09K07j20pL78j80k86N57l39J09j94j6L81P1
3733C18m33J43N7k34J63l7M4j05J49j41P9J81m45J98j08J86o8R5J39Q2l25K03
3755A41j88k37M12r8q3k5O7j31J15J64j06l3r9J79r5l7j61K00m0jr5m8NL13j30
3780a1K9Nm1J14j3k38Q2J49j94K46l8N2j69P2J55j65j39j7j53K24Q3J3k2M1k0
$$ plain form
3618 -23 -131 197 -158 -131 -1 20 173 209 -50 -232 167 -9 -40 55 -43 -214 44 189 -36 -88 -117 -75 -1 -305
3642 -305 60 -175 -64 16 134 -144 -164 130 -29 128 -130 -261 141 260 69 95 -138 -49 -104 -191 32 171
3664 171 92 -107 -61 228 -165 -37 106 131 -126 200 29 -20 12 137 -57 217 38 38 58 80 -171 -27 -10
3687 -10 10 4 -5 -226 108 -143 10 69 -44 -42 -105 5 -278 67 195 47 168 -198 186 -163 -241 -77 -131 -232
3711 -232 61 -106 -154 84 -49 81 34 -134 -243 -36 -156 -163 215 35 -251 306 -33 76 -118 -134 247 318
3733 318 -115 28 85 -149 14 -23 21 -84 65 -76 3 184 -261 -63 -171 15 -53 42 181 263 -62 141
3755 141 -47 -284 128 30 -53 -78 -11 -142 -27 137 31 -2 -101 78 -17 -54 -215 -15 -55 -56 -151 -199 -194 119 -11
3780 -11 18 23 -18 96 83 -155 -73 76 -118 128 90 142 -27 45 200 35 -104 -121 -274 -50 33 46 24 65 45
3805D5k68K30j06L69j42k21J6J41k30K87j76Q9k34K68k94Q4J75o3L0P2lj09pp3
3829a20J83P2l3j09J35J17p9k10K3k25K83j99K37J7j70J14k47J43Ok5J18l48M76
3852A59r6o3m1J26l8J69l06J18k42J09P6O8j07K19l46K94p0j49J21j9Q7pr9P9
3876D2L1j65J28j85J60L9j04j34J3L52M9J4l32J56K9j37K92P6k28k34L60k86l5
3899i9K36q9k45J13RM2N1N3q1j41L09l6l54K94q4p2M1k5J49j13q7q1L08qM9r1
3925D8K35l35J15j6k2P8l19J91L16m49L17p0k0j41P0j74K65m2o1J82kj68r7P4
3949b5q4K11k0P9k05Kj98K78K1l6k2j45K00l2J8K18n20L27j73P7q9J59l4o7m0
3974a00P4L6K8O4l61M96k69q8M8J64p6n0Q6J9j02R4j13K2j08r6J30J31p6J42N4
$$ plain form
3805 45 -223 7 -99 270 128 -93 -77 64 -166 121 -55 34 -200 68 -226 -142 33 -30 0 72 69 -40 -47 -120
3829 -120 63 135 102 -7 128 245 166 -44 -21 -246 37 -162 75 92 -78 36 -211 -68 -62 -87 31 -317 159
3852 159 63 0 -41 85 47 216 -90 28 -214 -105 -29 39 -68 151 -195 99 29 -120 1 -18 69 62 -37 42
3876 42 73 -92 36 -149 11 50 -54 -188 -175 177 226 240 -92 64 93 -44 248 324 96 -138 222 -64 -99
3899 -99 137 48 -197 -84 -75 -33 18 71 -10 -151 158 122 -232 62 -22 -94 -53 -78 71 -42 -129 -210 98 90 139 48
3925 48 283 -52 63 47 25 103 -216 -25 291 -158 159 89 69 -72 -2 -176 89 47 -14 168 166 -2 -99 -25
3949 -25 -109 102 82 161 -44 -42 -240 38 59 23 1 -144 56 24 42 260 -260 67 -106 -29 -118 41 7 -60 -100
3974 -100 -26 10 38 102 -259 237 -32 -120 -72 92 16 -34 52 71 -31 63 -50 -28 -136 -232 -102 29 -47 95 149
3999A49J1j71k56J39J93m6j29k9L2n8J55J2p1q6n3J46q1K22k83L60l19jL32l22
4023a54J53l59K36m9J89J9q7O2K8n7K26j71J92j37j03j50N%J63p2M8n1R5J32o0
4048I8O7k17R4k5n4J56k21o8K71k61N6P7J02k07L23P7m29Q5j31K88j45R9j95L61
4072B01ok59J63m22L81L9j00j20J02K01j99Qr0K92k63K50o7k10J24p9j3J78j77
4095f6K92k30K38j86j34J23QJ43j48j86k8K18JP3L9K5j94l3O7p7k4J71L9K9k61
4120a01J77j17J85m8j49K66j09j31J40K9j78j89J50K17j66k0J56Jk72K87j36J51
4142A43k18J09O5j11K14k48J58J43l94R6L3R7J48j86j65R4K76l5o6M8k54J2j86
4165b27m8Q4K52K2J42j14k12O9j60M77k42K0k54K24k09K14j77J19R8o1K13K8j67
$$ plain form
3999 149 160 -11 -267 -128 65 19 -110 -139 -107 -165 -10 2 -69 -155 -208 -62 -143 79 -204 156 -163 -164 168 -154
4023 -154 -1 -360 -124 -173 16 35 -52 10 38 -19 207 36 228 91 -12 -162 -157 -157 6 -66 -18 -69 26 158 98
4048 98 165 -52 42 17 -37 119 -102 -170 101 -160 -104 -27 75 -132 191 268 -161 -76 -207 81 -64 35 -160 201
4072 201 195 -64 99 -323 58 97 -3 -123 -21 180 -19 -11 -101 191 -72 178 111 -99 25 -54 -67 111 -66
4095 -66 226 -4 234 48 -86 37 45 188 40 -146 -174 44 45 118 157 182 -12 -45 22 -55 -79 92 131 160 -101
4120 -101 76 -41 144 96 -53 213 104 -27 113 142 -36 -225 -75 142 -24 -44 112 113 -159 128 -8 143
4142 143 -75 34 99 -12 202 -46 112 255 -139 -43 -10 87 235 49 -116 -22 254 219 153 201 -53 -41 -227
4165 -227 -275 -191 61 83 225 111 -101 -32 -192 285 43 63 -191 33 -176 38 -139 -20 78 17 230 258 91
4188I1k60M00j49j04M6j18J59j32m8K28J78j32p4k00J15r5L52l71K08j18j03K00
4210G3l1j5j18J81m4m8L7K33k84qKq8K31j51K39K3k73L1j26K49r8J41j61o2M8
4235a9K17j51pK3j23J08j7j86O9K28j41J7m0R0pJ32N2l52J49k44J15K32q4k00
4259a39J18J2J9o2j22K72j55po0K4R6K02j71O4j22Q1j06J20k46K58mpk00L16j07
4284G4j04K17l04K98M7l22J35Ml5j45L76l83l5k0J51r1J20N6k21J32J59J97l49
4307d3O1k22N2M9j00P6J48R1Jj89l0K83j12j96J77m3J94k35K13l63J94j72L3R8
4331c5M9q3j1J50j9j56K62j48j51J86J15k49J55j3m7k1j56J16L04L9m17K7lK48
4355A42k02J22q5KJ70j24R8m0q4j92n9M53r1J19l62M1K98k25j81L56l4j04o6k1
$$ plain form
4188 91 -169 231 82 -22 24 -94 65 -67 -115 113 291 159 85 -115 0 -95 257 -114 94 -24 -127 73
4210 73 42 27 -91 90 46 -2 35 268 -16 -24 -22 -110 121 -30 209 232 -41 -10 -136 113 15 156 -5 -67 -19
4235 -19 198 47 40 63 -60 48 31 -155 -86 142 1 18 -22 68 61 193 245 -107 42 -202 -87 145 61 -139
4259 -139 -21 -9 10 -52 -174 98 -57 -64 -124 -100 -4 198 27 91 -31 50 -56 64 -182 76 72 65 -135 181 74
4284 74 -30 187 -117 181 228 -94 41 45 10 -135 241 -142 -177 -197 -46 -137 -17 39 -182 -50 109 306 -43
4307 -43 18 -204 -152 -103 -203 -127 21 112 113 -76 -106 177 65 -131 46 3 197 -38 175 -188 6 -166 -133 -35
4331 -35 14 -69 -80 70 51 -105 157 9 -142 44 159 -90 65 52 5 -16 -172 -56 248 287 -130 -103 -106 142
4355 142 -60 62 -23 -21 149 25 123 83 -1 -193 -252 201 110 229 -133 -92 206 -19 -200 156 122 18 -48 -69
4379f9K18r0m43M29k4J5R5j33Q7K0l6j83J1J01ML8l7k36K99l22K26p2K89o5j32
4404a0J5Nj44K89j90k4J65k25k4K87l2j1k07J14q6O2P6j84L96l75L5J76N3j15
4428D6j29O1O2R8O7k22j21K44K9q6Nk9l5J53J5K41m90M50N4l94p1J45m3r8j23
4453a71J89k20J51n0j1R4j2N5N0k33L7K21k40J64O0J9l13L1L23j8qj42J16j49
4477e7m9K85j05k42M64m49j31L97j59k19L33J1j14J05J06j18m8J75k92O1N0l2
4499b8R6n8J07p8j28j15J39nK07o7m6m7J41k38J50p9j15N34m16K44l49K44j50
4522e7PJ02j96M0K28p6l52L24j84M2j62K04K78j92K8k0J89k00Q1L9j29r1N7L8
4546bl3p6R2j25K80j55P9p2J0k9j14J53j05J14N0j09j7p4J31n1m0K15k03J95j46
$$ plain form
4379 -69 149 59 -384 45 21 36 131 -2 85 105 69 -114 -103 -2 2 40 3 -233 66 -256 -30 -102 187 122 -10
4404 -10 5 10 -134 155 -35 -59 106 -119 -143 144 112 101 -106 8 -78 -16 60 -124 272 -103 -68 108 161 46
4428 46 -83 -22 40 138 205 -17 -138 106 135 49 54 25 -10 143 158 399 -91 359 413 19 -52 93 50 -48 -171
4453 -171 18 -202 -51 -101 -112 -18 -30 25 75 -158 -121 100 -140 24 84 103 -210 -179 144 126 118 -24 92 -57
4477 -57 -106 179 74 -168 296 -153 -284 113 -46 -265 68 79 -35 70 176 58 10 185 -107 -46 4 -28
4499 -28 68 10 117 39 -89 -204 -65 -70 137 70 24 -23 118 -120 30 -49 -164 370 -46 198 -151 93 -57
4522 -57 -50 52 -144 -104 124 48 -304 20 -164 -122 -284 -80 198 6 34 14 203 3 84 123 -6 -97 -40 -2
4546 -2 -35 -111 -19 -144 136 -19 60 -12 -2 -31 -145 8 -97 17 67 -42 -59 -133 -2 -53 -93 122 -81 114 -32
4571c2k8j4L3L21k10K93l49MJ10j47N5l47K38p4K58j79j1l0J53j3J74kQ5l42R5
4596D1N9q9p7K11k00o8K5j08L12k1k49J80rk6P0k35L37m21K21M3R9J45k13k52
4620b25K52j38l9j7J79J33o0jP9j46j15J69R8k73K50K5n5J21m74K39Rj03J4J2
4644f6J84k46J87K4l01L97r8mr9j66OK97K6j87K1j77J30j81K58k55L9L33J31j58
4668I5j76J74k68N04l79L9n4J93j64N3j38J84m0j29K79j70l21L69j55J49q7K1
4690b1MM6j97j21K76j68J69p1m5L39k61n3R6K83l55J04k26M1J33k70J96J55J05
4713A59n8n5j02J31J7l43M25k83N5O0k48J56J56q1j9l7j8J69j88J14j3n9L0q9
4737a21J80K29k40n7j05J36j91K17JJ34j14k64q8L32j42J97j81J5n7L2K60p5p7
$$ plain form
4571 -32 -60 -74 -41 280 70 363 14 18 128 -19 36 -311 -73 -147 111 -68 -79 -109 44 31 205 203 288 -54 41
4596 41 100 11 -66 145 -55 -123 -98 -206 106 85 -164 16 7 -19 51 -184 153 -268 -47 -4 95 240 27 -225
4620 -225 27 -111 -150 -167 12 145 85 84 163 17 -98 71 169 -104 146 171 116 237 -237 2 11 -92 -78 -66
4644 -66 118 -128 59 83 -218 179 81 77 -22 -188 -182 115 141 -46 -25 -202 -72 -253 5 -250 -211 122 253 95
4668 95 -81 93 -175 329 -50 -11 -65 128 -36 17 -121 63 23 -106 173 3 -318 51 -104 45 -42 -21
4690 -21 -17 29 -168 -289 -13 -181 -12 -83 -128 211 -50 -103 -7 276 -79 25 -201 -160 -27 -297 -101 54 159
4713 159 101 46 -56 75 92 -251 174 -109 -54 6 -242 -86 70 -11 -30 -67 -85 84 -104 10 -3 -62 -32 -121
4737 -121 59 288 48 -9 -114 22 -169 48 49 183 69 -195 -283 49 -93 104 -77 -62 -119 -87 173 98 21
4760B1k0q0K20l27J07L51j99n2j08K2j01K51k27K0K39j79J16NL2j15j3k5J48j51
4784f5K40j47J31k95L88l66J45k37J74j9k15M25j15j11J66J2j06K4j53J68j54
4805a10P0J6l9M4j6P1k7K4J39l01K49j3r6j48nJ94j02J58l7k3k15Q9J98k42k4
4830a46K88o6J05k23J45M0k21K09j82k7q1j38M15M6O3k02om5K49j16J2m0k40J08
4854e3J33m1K23m64K48m2RL02j97q3K82j86j12k9J60l0j4o5K2k24J21M6m9k04
4878b47L34m1R2M0j39R3l3Np2r8N7J87p3j09k2J32j55J38k49J96O7k04K90q2r9
4903HK9o8P9j99K26J97k12nj00k4j8PK00j79L24k72p0N7J2J41J00j33k8n3k30
4928b11L50r9J78l42J67J47l60K91p0j44K4K85k9J40l71J48k26J79Mk19J31j69
$$ plain form
4760 21 1 -79 141 -186 -79 272 73 21 -87 -65 -166 85 -142 -122 117 -62 54 59 91 -24 -37 -62 86 -65
4784 -65 175 28 159 -136 252 -114 31 -206 -32 -51 -266 159 44 -67 99 111 5 29 -124 44 -110
4805 -110 -40 -24 -63 -19 -35 36 9 33 172 -129 120 107 11 -137 -142 52 -50 108 71 48 -167 -78 120 -122 -146
4830 -146 142 76 181 -42 103 143 -78 131 -51 -78 -159 -297 118 164 227 25 19 -26 223 107 119 79 -161 -53
4854 -53 80 39 262 -202 46 4 13 315 118 35 317 131 19 -10 150 120 106 41 63 -161 -40 6 -43 -247
4878 -247 87 46 138 178 39 132 99 104 32 -66 -9 178 105 -4 -26 106 -49 89 -160 36 103 -101 189 107 8
4903 8 37 -31 48 -151 75 272 60 55 -45 -69 -87 -80 120 -59 265 -7 -77 -20 -8 133 233 100 72 19 -211
4928 -211 139 40 218 -124 43 190 -170 121 51 -93 -69 216 187 327 -44 104 -122 57 61 -158 -27 -196
4950a96J82o6l6K90r7k69K29J59j79j90J13J59k87M31m88J79k28M31q8k21K84
4971A12k45K14j85J93Pk41j13K38o8M3K75l19k37K83J88j99Q0q4J84k17R5j00
4993i6J08J33q7j39J58j48R2m2Q3Q8k92M53k86K1N7k12J22O0k97J53J33m5K25
5016B42k96J31j5j24M6q5k0J78J30R9l15l75M17l1q6J52N8j24J06j3j21P2m5J85
5040A66pn09L35j75J01j31l3K40J12R4j43j36MK04pj27N4q8P5j6J56m1L42m81
5064a1Ok8n6J05J60j93L9N9l79K99l2K31j58j20J43j83K87l89K74J7l13K87m7
5087bn3J76L7j28k36J7J75j24K95k72l0q0R8L73k42j11K25k55P1J41R4q0m8K9
5111G0O8l13K98j46LJ01j38J76l67K90l1j3k19M54k48j8n7O2J70l22K04j14J34
$$ plain form
4950 -196 -14 -80 -116 174 77 -192 37 196 17 -173 -60 99 -188 243 -245 -66 -294 137 49 -172 112
4971 112 -133 81 -104 89 96 -145 -258 -20 -88 -45 230 -89 -326 -43 145 -54 26 -58 126 -91 4 -96
4993 -96 12 145 58 -81 77 -71 21 -21 62 150 -142 311 25 46 103 -109 13 73 -224 -71 62 17 242
5016 242 -54 77 62 -62 -16 -101 -121 57 187 286 -29 -404 13 -18 -104 48 106 -18 88 75 -46 26 -19 166
5040 166 159 -350 -15 -190 -89 -220 -253 -13 99 193 50 -86 -82 122 115 -12 42 -46 29 13 169 128 470 -11
5064 -11 -5 -33 -89 16 176 -17 22 81 -298 1 -31 200 42 -78 65 -118 169 -220 54 71 -242 45 -2
5087 -2 -55 121 158 30 -206 -189 -14 -138 157 -115 -145 -225 -127 246 4 -107 118 -137 -66 75 169 89 41 70
5111 70 138 -175 123 -23 -20 81 -57 119 -248 42 11 -2 -221 233 -15 -33 -90 -28 142 -180 24 -90 44
5134D4J38j69J1P5j10j69K94J61q8j6j93K21j49p6P8k4o7R2O0m7j93R3QK6O5j06
5160d1O8N3k82K06K04m75M28k02J09r8J2J62k04j81M08q4j59J57o9k63K37P7N6
5183A19%n3j89M4J54k53J64K90j09o00N22K9l62J45j26k5R4K07j04J21o9j93J14
5206h0L2J48o6j8k0jj09J18M3j40O5MK22p9l84P9K28j9k4j64M48m12J90k0q4j04
5232a47J48j51J05L7R8j22o2J11r3r8P5J04j62K8J57J31m15K46O7P7k55J40J05
5255A24r5k06L26j81Q8r4pJ93m58L02P6J0j1j20n0K74j63J7J0j96L99pk83k33
5279b85K35L0n1n0J58k01K95p6o9J29l39L98k61p4J23J24j03N1j2pM2l7p8J80
5303A22k37O6m5o6J27N7k2j89M1K08K60m45L2j52K47J14k0j76K3J3k55J19K10
$$ plain form
5134 44 182 13 24 99 -11 -180 114 275 187 171 -22 199 50 -26 52 28 -39 53 113 66 -127 -34 -26 0 65 -41
5160 -41 27 80 -202 4 208 -267 161 -41 68 -30 -18 144 -60 -241 167 83 -76 81 12 -251 -14 63 119
5183 119 119 66 -123 -79 75 -178 -14 276 167 -433 89 118 -244 -99 -225 -250 -156 51 -53 68 -1 -194 -80
5206 -80 -48 100 34 16 -4 -5 -114 4 47 -93 -28 -24 198 119 -265 -186 42 23 -1 -165 283 -129 61 41 -43 -147
5232 -147 1 -150 -45 -8 90 -32 -94 17 -76 -174 -99 5 -157 -129 28 159 -256 -10 57 134 -121 19 124
5255 124 29 -177 149 -32 56 -38 -45 148 -310 -8 68 78 67 -53 -103 171 8 25 35 -161 238 231 -52 -285
5279 -285 -50 -20 -71 -121 37 -164 131 55 -14 115 -224 174 -87 -161 -38 86 -17 34 22 15 57 20 -58 122
5303 122 -115 -49 -94 -160 -33 24 2 -187 -146 62 322 -123 -91 -243 4 118 98 -78 -55 -42 -297 -178 32
5326C2r8j66J96J32R5o2j61o1K67j60o7J84p2j16LK36j44l9P5q1%r6J13J38j10
5351C8J9Q3j01j28Q2o5K75k56J72k54J37r2n7M33m24L04m4l76K08r0J43J97j26
5374G8j3K60j34j46K62k46j59O5j27J62r0L08k87j55L25j90J67Qk93K1K15m09
5396c78N47k59L01k81j00J54l4R3r4J08o6j6j85J34j08K24j17L15l54J04K24l04
5418i2K58k09or3J46J52k64j6K01j11N9J36j2o2o9o0J1n%Q1n8L2j07K1J07k41
5444b01K89k9j39K44j70q1m3r4M61k07K2j25l8J85rJ76k99J86o6j12o8K43o8J9
5468G6j79J13J09l01J18j2J97m7K28j54j90J42j87K61l51L7L57j00q9J31n6n07
5490d04M18p3Q4J05k89j30L93J48k20J22K9k09j23k8J47j57L92n41L99j50K36
$$ plain form
5326 32 -66 -232 -36 96 191 129 -32 -93 174 14 -53 131 59 -57 -54 182 38 -1 74 -7 -7 -103 10 148 38
5351 38 57 140 39 -89 -7 -72 203 -53 119 -135 2 -90 -147 286 -138 166 122 -254 -46 -136 7 204 78
5374 78 65 325 191 45 307 61 -98 -33 -160 2 -88 220 -67 -222 103 -87 80 88 -205 -184 31 -378
5396 -378 169 -90 211 -70 -170 -16 -50 43 -51 57 -9 -25 -210 -76 -184 40 -77 238 -116 -12 212 -92
5418 -92 166 -43 -49 -142 4 156 -108 -124 77 -34 25 161 149 87 18 -42 -31 -36 -36 45 -13 19 -88 -67 40 -201
5444 -201 88 59 -80 164 -6 -87 -130 -224 237 30 52 -73 -111 74 65 241 -58 128 62 -50 -118 125 57 76
5468 76 -103 10 119 -182 -64 -76 121 74 302 148 -42 100 -87 174 -177 -140 217 117 28 159 103 -404
5490 -404 14 -59 25 130 -159 -289 104 252 32 154 183 -26 -149 -177 -30 -187 205 -336 63 -87 149
5511A49m1k11K05Q1n9r6q8Q8j67j7J6r2J27N4J35k78K87r4J37k23K41j79k39Q
5535b56M5J64K82k95J41M9k43J86l23K33RN2N5m0n0m2o5l5l4L09q4L5M5j09j09
5560h0J10K1j43j64J67P9J54j84M6J52p2o0j01J35J37r1j8j76J95j18k06j4J13
5583a18k9M1J17l2K75l17Q8k19N9R8J93l08J45J08j70r7K93j0p5Rk02J14J03J19
5607A85l48K27j87K0q8J78q5N12l50j42J97R7j96k19j35M32j72L36l67K63j3j09
5629C6rJ28k10k6r8K38jN4k48R5K32l26K10j70M27k05p9j44K07k22j10M05j78
5652FJ3q8q8K15j01KQ6j40J97K6n0j45J10N5o7r1L9n4J63k02J86r9J11J6k31K23
5678I2L1ol24k60L41o2L51N4k42kJ36J76k28K03k80Pk4J59k04J81j63J46j43P4
$$ plain form
5511 149 108 -103 102 183 124 28 -60 28 -139 -156 -140 -232 -105 -51 84 -194 93 -1 136 -87 154 -25 -264 -256
5535 -256 -211 -47 235 -60 81 130 -113 73 -250 -17 -8 44 99 59 9 -33 -98 -133 -167 142 58 93 138 29 -80
5560 -80 30 51 -92 -256 -89 -10 144 -40 6 158 86 26 -75 60 197 106 88 -88 107 -11 -217 -231 -118
5583 -118 -147 -106 11 -21 254 -63 25 -194 -135 -37 156 -152 -7 101 -69 -166 127 117 42 51 -151 -37 66 185
5607 185 -163 64 -123 -103 -191 -13 -98 414 64 -78 119 216 20 -199 -334 98 -74 262 -105 158 145 36
5629 36 27 155 -55 -81 -179 59 58 112 -136 -41 191 -135 75 -95 332 127 48 -96 111 -111 -221 184 6
5652 6 19 -69 -157 58 -43 -41 45 -95 102 128 78 -67 43 98 31 -60 -21 -75 88 -114 72 -27 84 100 -131 92
5678 92 123 117 -207 -467 -126 -188 163 217 -25 -27 109 285 57 260 -20 -13 -37 122 -82 99 -64 82 -61 13
5702A3L2Q9k41K58j09K3j50J7J89m48L76K21m78J27J85l04K35n5j07J01n5J57
5724G6j66N7P8M4j47J03n9J1P7o4N9l9r4j26Q6J45q9J37q0K85o9k71J01m5k85
5749b75M35j41k61K39Kn8J69J57l07Q2J75p9l21J76K6J20l44K99k03l3J50O8N3
5772A29p0j86K60P2j32j19M8K52n10L08o7j75n5K41K5k86M95m50K93j22M1P3k79
5795b14Q6J37J14j80k9J63q5LQ2p6r6N9J28q1N4l77K23P6p1j98L09o1O4J6j76
5820a30J23k60K95J34m96K28K47K8l85L87j30k63L23j48L0J00j3k9j0j03j99L8
5842b33K51j11l7K50j62%j47J76J77Rj83l3M6k73M54l9k34K38q9j44K2j75K62
5865B5k44J78j58L42k21J14k16NK60j0O6j05k0J1j04p7Pr6K56K5j6j8oj32K22
$$ plain form
5702 13 45 134 -107 151 42 65 -85 -68 121 -327 49 270 -208 -81 104 -200 35 -20 -127 -26 -81 76
5724 76 -90 -33 45 89 -58 45 -14 -3 74 10 69 30 -64 -190 -104 41 -48 89 9 294 225 -46 55 10 -275
5749 -275 160 19 -242 -3 -1 -59 110 267 -40 42 217 138 -183 -7 19 139 -205 94 -109 -142 8 76 129
5772 129 59 -127 133 205 73 -46 2 254 -256 52 -15 -190 -245 -4 21 -265 230 -220 73 -49 -8 65 -214
5795 -214 -128 9 123 -57 -86 77 -8 -5 77 1 -95 -36 92 11 65 -312 -89 -13 -84 -282 27 -34 30 46 -130
5820 -130 -7 -267 28 162 -334 -106 141 169 -216 171 41 -222 101 -47 -17 83 70 41 31 -72 -271 -233
5842 -233 18 -93 -130 120 -42 -42 -189 -13 164 173 -10 -43 3 -270 184 145 -89 149 60 -84 -62 -237 25
5865 25 -219 -41 -199 143 -78 36 -180 -175 85 75 141 36 16 27 -77 -154 -147 -243 13 38 22 4 -2 -134 88
5890H8j57P2J22k83K27j6m5Mj11Q5k46K06q3J90pK3j92K23j79J04QR0j15J81j40
5915D9l25K09k8K81l30J68R4k68m3K17m2J51nk19L01l16R6J24k04KJ79M4k59L4
5939i0J4j08L58j32n6J62k05K70j43P3k01Q7l6k05O2J93K1m5j14K51j35p8o8P4
5963e1N6J26j30L53k23O5j96k59L13k7J5N3j95J29j53K78q7p1K37l21J66m9K95
5986C24n50L82j9r7P2k6j99J58K1k8l06L23j46J51l95M14j36L3k8K4J04j50n5
6009a29J33q6K0K19k62L5J96p7O9k39R4n0J15r3J68k19J43j01O7K40j86r2J30
6032I5Q5k53ko9K31j89J16k70N01k38J8K94l04Pl52N37j95J1plO6R1M8j38n56
6057d76M30N1o1K22j94J09J8m5m0k3J71k14J25j49J96j31K84j28j27K3k3m1k98
$$ plain form
5890 88 -69 3 125 -158 69 53 8 12 -99 -14 -260 -54 -137 53 46 69 -123 100 -79 25 33 123 8 189 49
5915 49 -276 -67 -95 186 -144 24 118 -150 -193 24 -18 133 128 -91 210 -106 -10 114 -90 -88 91 135 -124 -90
5939 -90 -76 -184 174 42 -14 148 -57 213 70 143 -58 29 -7 -212 -150 43 64 19 -95 156 21 -57 -125 -51
5963 -51 5 131 1 354 131 196 0 -259 54 27 42 95 -100 29 -124 154 67 -4 233 -88 78 29 324
5986 324 -226 156 137 40 112 86 -113 45 66 38 -268 55 -91 60 -335 79 -57 -24 -52 -28 76 -74 -129
6009 -129 4 -82 -62 157 -105 -70 126 49 118 -121 -27 -77 38 -55 113 -106 37 -64 3 243 57 -35 95
6032 95 180 -73 -75 -144 87 -102 14 -256 245 7 25 319 15 22 -330 207 12 23 16 13 79 170 218 80 -476
6057 -476 -46 5 -56 166 -28 81 99 54 14 -9 162 -52 73 -76 120 -11 273 145 18 41 18 -23 -321
6080c21L54m2l1l2l7L58k03q3P9J7l32J45J07J05j76Q2m2p4K28l20L05j54qj97
6104b72K66Pj50J9J44j10J82J05n8k78P1J56m3k57K92K30m26K37k19J09J59m21
6126b57O3n5K32J9q0K10M5p1j46p2L38k37n8L46k01j13J11m14N19o7k67j81KL30
6150dJ23J15m26K85k8k6j2o4J23n5l7o4L2N4L9n0M3k9N5J7l02J80J7P1l04R3K34
6177H0l26M5M25k86N2k07K44k26L60l47K47j63R0k09K50o4L6j80P3J01k08M47
6199B34m50J74K04Qq5k53J19J45n1J66k10q6M84l98j17m6J32O5J03k37l1L63m38
6222b05J07R8j68J64n8J64p2o1m2Q4om6O4J08k50k03J12K66OK4j65j64L78m0p7
6247A8Jk16J09J44K7m1j10J35k43K44M6l74L26p8p0J90r8K42k3k00m2j91J99J83
$$ plain form
6080 -321 33 -9 -40 -72 -109 249 46 -37 42 59 -273 -128 -21 84 -92 -10 -52 -126 102 -218 87 -67 -75 -272
6104 -272 -6 1 -149 -130 14 -96 86 191 133 -145 -74 82 39 -218 74 304 -122 115 -104 5 164 -257
6126 -257 -194 -249 -17 2 -78 132 177 106 -40 -112 226 -11 -69 277 76 -37 74 -340 179 112 -155 -336 -334 -4
6150 -4 119 234 -192 93 65 39 27 -37 86 31 -6 -70 -38 16 55 5 48 19 74 91 -211 -31 -14 57 -247 -154 80
6177 80 -246 -201 224 -62 -10 -217 27 -199 161 -186 61 -102 -12 -221 29 -35 1 -179 -106 -5 -213 234
6199 234 -216 -42 162 170 85 -168 -49 96 45 211 1 -85 399 1 -116 -162 -30 35 138 -99 -130 233 -205
6222 -205 -98 0 -168 -4 -62 102 30 -31 -73 11 5 -41 23 131 -119 -322 -210 56 62 86 -79 -243 135 95 18
6247 18 19 -197 -88 56 83 42 -68 67 -176 68 114 -260 66 -12 -82 108 10 252 229 29 -13 -204 -5 178
6271A78k68k50M40j39L82k87j65K7J15j17K96m32j83J58J83p7K29Q7j16j66K24
6292A19l44J61J22K38J5k88K75l33M4pm5q2J53r3j30K79j16L7J05j73R5j91L29
6315A70l02L7K6j55J81k29M8L14p0l0J82o6j90J66l2O4m7K18m82R9m3J31KJ58
6339A50k58J8J45l15L29K2m5L9j16n6J3j06K46j25K44nl17J63oj93J47L26m0j84
6363G6l04J64PJ39n3K04j05j51J8J86j33M8p2q8J67m9k8j66L21q6j90l7L9M74
6387C81m22p6P0J8J06o6n8j0M4Q2p7L1K99k87J04j20k3K10R2m73J65L54n64L23
6411A03Lp2P0l16L82k13J79j75J65k95Q3p3m3J89M4J47k97J23J33j30J34j00l1
6434A0R6J06j04l25L11L7j00q8%K5j39J71J64j15K24m04K7LO2j12J14N7k0N0j86
$$ plain form
6271 178 -90 -340 100 -39 343 56 -109 -82 33 -84 212 -220 -403 -245 -62 -139 90 177 61 -105 119
6292 119 -225 -64 58 296 311 23 298 -35 9 2 -43 -125 28 -65 -195 84 -32 5 110 -63 32 -159 170
6315 170 -132 -95 -69 -224 -43 -272 -224 90 20 -10 172 106 -84 82 50 114 67 285 -197 -98 -141 -10 -8 150
6339 150 -108 -90 55 -260 69 91 46 85 -31 -87 -74 -180 66 -59 185 180 -137 26 20 -173 -26 300 260 76
6363 76 -228 -64 -57 82 29 233 128 -23 -5 181 48 96 24 -64 103 54 26 -140 181 95 -95 -132 -93 381
6387 381 -41 -117 -47 -29 77 11 -47 -57 -13 69 -8 23 322 35 139 19 -4 206 298 -175 -10 344 -220 103
6411 103 106 34 104 -212 170 -43 136 -39 126 -169 -86 -159 -202 -13 31 178 -119 4 137 7 141 41 10
6434 10 106 212 108 -217 94 131 31 -57 -57 -32 -171 0 164 49 273 -131 -104 -101 -39 -151 -37 20 0 50 -136
6459a36M29l36n8J4o3K55k48K31N8o0j30j20kL48l04j8L33J38k11j25nJ48l45
6482b07M15j02j95K17qk63L5L10k64K93l02L21m18L28n99M27j63K60J40k02K78
6503C01j83j17l8J37n6J03q8M9o2O9p8J46k4n0L7j54j3J11k2J28l63r7L27j86
6527a23J19N8j58L1j24K93j40j57M5R2Nj5Lp8Q8J75q2Q6K1k03q9P7J43j29p7j11
6553b50L20j24L7K50n01K62n3J28j18J35L5j23n8J15k77K61J02k30J58k36P4J1
6575h2J01L4l24J00K36k69K41q4j1J85k11j7j76K29r3J97k66K4R6J39j50J7R5
6598A1j6k3M1j31Q3J03J0j85r6j30L04k65L33O4qj35q1J15J24k68K68j35J96l50
6622a71O1K72k18o0L7J32j1J31j26n8R2l5j44N6R0m2K4J23k76K93Q2l45N5j49
$$ plain form
6459 -136 293 -43 -101 -87 -150 105 -143 88 146 86 -44 -164 -166 182 -122 -140 193 331 120 -5 -10 138 -207
6482 -207 208 106 -89 128 120 -143 -108 202 -62 231 -71 250 -168 160 -439 -12 -175 85 225 23 301
6503 301 118 1 -37 100 44 147 59 108 46 115 37 183 159 109 146 -8 -21 90 68 196 -167 -264 63 -123
6527 -123 -4 54 -104 -73 -197 96 -44 -201 -156 -64 -59 -74 -71 -149 -61 114 32 118 139 -64 -153 -76 67 -62 -139 -250
6553 -250 70 -54 -17 233 -268 -6 -59 69 -49 86 121 -2 -60 55 -222 39 141 -89 69 -167 -93 -82
6575 -82 19 53 -271 -171 65 -204 37 -47 -58 127 -84 -101 -277 -48 -141 56 -210 -186 -90 49 -101 -84 11
6598 11 -5 -28 13 -118 -35 68 78 -107 -203 -333 -29 -294 39 103 95 -40 -121 -6 118 -150 118 -17 179 -171
6622 -171 -110 162 -56 -116 -79 53 42 173 47 -11 81 46 -98 -42 48 6 30 153 -123 170 252 -93 -38 -187
6646a87J03J86Pn7j82j5J32J95j98J30k93J21Q8P5j34j4J08j91k2jK8L10m52M07
6670A44o7j57k67M48K89l17o7P0k24K42j79M5J79k06kj4L10k87J25m18K20j8M9
6693a02K06l14J78j35N2j08R3K96j21lJl6m0J14j65J89j58M8L11l75O8%O1l89
6717c29M95l74K2J74Q1j03j2K22j37j37J11j27K99l49k0O7J87L8o7N4l1jJ2o1
6741A4J09J53k50j33p1L3r0KJ56j3K14l46J78o2K69j49l2j11K36mJ13k95l9J36
6765A8J27j19j11J99k53Q2Rj34J68J68k06K14j43J03j46J58J88k99K9l8p0J84
6787A28k04K08k49n3J66J3p1J29l6l46M00l02L35k07O9k16L34M5m27L54j75J99
6809I4m8J46l45K11P1l36J58K4Jj80K70j22j3o2J34j08J15O5m0J20q0k60L51k61
$$ plain form
6646 -187 -84 102 109 52 -130 -145 -13 182 -16 114 -179 -58 30 105 -29 -43 65 -126 -148 -149 -121 189 -263 144
6670 144 77 -80 -347 101 390 73 6 76 -148 94 -85 -40 139 -67 -69 -83 227 -60 65 -353 -133 -151 -102
6693 -102 104 -210 -32 -167 -115 -223 -130 166 45 42 43 7 -33 81 -84 105 -53 -5 306 -69 -1 -1 60 -329
6717 -329 166 -208 -186 -12 69 -34 -46 176 39 -98 13 -114 185 -164 -184 -117 70 108 41 95 64 63 75 14
6741 14 123 276 26 -107 -178 -145 -235 -233 -77 -90 124 -222 -44 -106 163 14 -18 -129 107 103 216 -79 -118 18
6765 18 145 26 -85 114 -139 -57 -48 -182 -14 154 -52 162 19 122 -24 134 322 23 52 14 -56 128
6787 128 -76 132 -117 -170 -4 9 -62 67 31 -315 85 -217 118 -89 -20 -236 98 143 -284 70 -105 94
6809 94 46 192 -153 58 129 -207 -49 -25 -24 -204 66 -56 -69 -131 3 -105 10 75 35 155 75 -185 166 -95
6833i5r8m9M26j67nJ50q1m3m4R0R6nk92J68j36J20j21k27M33o3k35L0J76k1J03
6858A10k15l1N62k95n1j18J2J88l33R5m5K19k27Q8m7l6J46m7N9r2J8J21j81O7
6882c3JJ8k2k8L97l05L6n5j59K89K3k57O5J49J04l10J11rk1r4O1J53O0k47m1J15
6908AK14j04m7O6k02J15K1p6R1k77K15J43j71O7n6J34k57J26lj95o9M13k20J95
6932A24l18K59J79m60K76J35k15K20j16q4O0j23J36k50K70J76m26J76J53k74L6
6953f6j60L95k05J47l38K48k82M41O2l44Pj0J46L9O9l89L60l71L20m5lm3rN9J13
6978A41n2M0k83L43l24J14O2j14n7Q4J29k4j27LR3m0K18l15J33j46J90J32k11
7001a1j08j93J53L16r9o0L1J4K3l6k3j07K4K93l93J56K3n5r5J32J60j89M2Q0k96
$$ plain form
6833 -95 -193 -242 184 17 12 162 81 38 -6 84 180 175 -117 51 -85 35 -86 -313 120 57 -178 -148 28 7 110
6858 110 -105 -136 426 131 80 -38 -26 162 -171 -76 -121 98 -129 -41 -88 -124 22 -25 34 -58 -40 81 -100 -33
6882 -33 -32 -14 -36 -64 333 28 64 9 -150 139 162 -95 -30 119 223 -87 24 15 -6 -100 -39 114 174 -73 -114 1
6908 1 215 111 64 130 -72 43 64 -12 79 -198 17 160 -11 56 0 134 -123 3 0 -195 -264 149 -71 124
6932 124 -194 65 244 -216 60 195 -20 200 84 0 60 -63 73 -177 93 269 -157 19 172 -102 -66
6953 -66 -226 169 -36 111 -227 21 -261 180 242 -102 -95 -105 41 80 149 -240 120 -251 69 24 21 -22 -31 28 141
6978 141 89 129 -154 189 -135 -21 41 -73 -130 -46 83 59 -68 -65 28 -12 206 -109 24 -122 68 200 -11
7001 -11 -119 -312 -159 157 58 -2 29 43 66 30 7 -100 -76 217 -176 -20 3 -52 -147 -15 145 -44 -2 78 -218
7026b18J20K51Jr9m5j13KK20j68n8J92k3k7j47L98m79L00j55l4L41m86K11l4k19
7050b69J87N06l94M3j90J4J55q2j32j12M78j10P1j37j89J2J40q9J65r7j9j66L28
7073A13k30l4L92k25q0k9Q1j4p1l0J30O3L8n5R9J5l57J21P7r6N3j65K29n9J85
7098A51j64J48l86K14P2k6R5j56J5r5L62j98k3k1j36R5J59j51R5K39n08K73O2
7121A16l68J64m1J19k11j32K80K0J57j60K0J93j79J38j84K8J50l13J41%J19L3
7143I0j03K54J4l82K77k38K79k75m8L6R8L5P0J2k77J62J7n7j27K07M2n9l6q9J52
7168E4M3n9J35m2j42K7k71Q2K74R3k07p3M1J77k05k1J91l52Q1M34k23r9K29j85
7192a8J04k38K53P2j45K04j98K35J11k51p7P0m53K12K39j98J76R7l17q6L28Q3
$$ plain form
7026 -218 -98 153 154 55 10 -103 -101 119 -49 -107 85 62 35 -112 286 -193 107 -48 -82 259 -227 -16 -50 -269
7050 -269 -82 424 30 73 -117 -103 52 -30 -162 -274 204 94 165 28 -161 -149 -9 -98 67 -30 -49 -215 113
7073 113 -117 -151 241 16 -64 -93 -12 -26 -97 -127 3 66 104 49 148 163 -194 -73 4 -92 -39 -204 25 -34 151
7098 151 -13 135 -251 -37 35 9 104 -52 -37 -132 230 32 9 -12 -148 -53 106 -45 50 289 -219 54 116
7121 116 -252 -88 -129 -10 -221 -353 -73 -53 104 -56 -36 157 -22 116 -68 -40 110 -203 -62 -62 57 90
7143 90 -13 241 255 -127 150 -88 191 -84 -132 -96 2 37 107 119 -158 4 21 -36 -163 44 86 27 -9 -98 54
7168 54 97 38 173 131 -11 16 -255 -173 101 194 -13 -86 -45 132 -73 -94 97 -255 -174 260 37 -62 167 -18
7192 -18 86 -152 101 173 28 232 34 269 380 129 52 122 -331 -119 120 -78 98 195 -122 -208 120 203
7214B03k30q9J97m8J62m75M85j07l22J65K24j36J8k6k27L44Lk88RJ84J23m46L15
7237C8j31N3J39l20L02p7o8n5K23j62j57N24l80j9L12k11J54r4R5m9j26M3L18
7260C52o21M05k46j02K93M5j22l76L17L44k17J75j97l67L04j85K09k6j71M50k7
7281B37j57k02o0KL66l18K52j02J1k7k16K57J9j7K08k47j0K22p8J15l04O7K9j0
7305C7l4m5ml2L12l89N4K19J14k96R5J85j68Q7j27J91j63pj40L09l8l4N2j57r8
7330g7JK00p8N0r5N1%j07R9o8K50k50J28j69O0K07n7k04J13N1j26Q0J08n0r1j53
7356a27K41n9l9K02j81j30j17K85j45j16O0R5l8J78j77L27j49J42l34Q1K1j44
7378a24L6O6J53k74K82j63o1j14J61K93k05J78m13L30L4m0j01k06kK57j76J40
$$ plain form
7214 203 -27 -116 81 33 195 -280 205 98 -224 -59 165 29 47 21 -206 138 141 -147 -138 46 169 -277 38
7237 38 -93 -40 99 -221 81 4 -64 -119 104 -58 -215 309 -71 -90 222 11 165 71 166 117 -9 34 352
7260 352 -269 136 -110 -212 81 126 4 -372 -55 289 72 247 50 -317 -13 -198 11 -15 -186 264 237
7281 237 80 -122 -182 -180 186 -132 120 18 29 2 -214 43 62 45 253 6 -4 218 140 255 -49 18 47 37
7305 37 3 -42 -46 -78 234 -155 -101 118 232 -64 31 216 48 135 8 199 36 29 -111 198 160 126 178 21 -77
7330 -77 -76 124 46 96 1 52 52 -55 44 -24 226 -24 104 -65 -5 202 145 -59 54 105 -21 59 167 117 26 -127
7356 -127 114 55 16 218 37 -93 -210 75 -70 -186 -126 -31 -69 109 -68 259 110 252 -82 -1 20 -124
7378 -124 -88 -22 131 -143 139 -24 -85 -199 -38 255 50 228 -185 145 179 139 38 -168 -170 87 -89 51
7400E1n6J06n0l44N12k38Ql3M87m75Q5m4j38J3K16j14J44k0J15l92Q8J03r6J20
7424D8J5j25J9J52j98M4K07j60J9N8o7m9M7J02k57L06o6k07R3K26k48j35J97N5
7448G6k85J40P3J3j18l3J28P2j71J05J89k52j86M10m7k01j3J91q3j49K42k94P7
7471a16n4L88j81m20L86r2m3J93j52K07j22K0j4k12K87j21Q8K1j35J92R3l05j03
7494a95L32n6Rm4j55K43l39J71j57K75m4J15l16K07k22J54rJ80j42k1Q6J20l53
7517a61R1J38P0k68k2J67rr0J74j31N4R9j79J52k22J15J62j66L9j15J79R1j48
7540B0M2l7k18J88J08j06j04L13l07J70j23J90j98j29L19j68L42o0k95j4p9R6
7562e0J85j71Q9J0K0k8j08q5J26j26J52J9J9r6J84j57KJ8k5P6k45K88K39m30J19
$$ plain form
7400 51 -5 101 51 -293 219 -19 -11 -44 443 -32 53 9 -129 -116 100 -14 130 110 225 -167 -79 24 -72 48
7424 48 63 -62 -43 109 -89 -45 162 2 21 79 12 -37 10 112 -145 161 95 -112 -19 207 -41 -176 21 76
7448 76 -209 -69 4 17 -101 -134 -6 66 -105 0 189 -63 -249 161 114 -87 -100 91 8 -141 101 -193 -116
7471 -116 -170 218 37 -383 3 -89 -132 61 -91 116 -6 14 0 -212 75 -46 42 63 -72 120 213 -92 -195
7494 -195 137 81 90 46 -109 134 -205 -34 -191 84 40 155 -161 46 -176 -22 -31 149 7 -14 72 192 -161
7517 -161 -70 68 138 -130 -152 15 6 -84 90 -41 13 112 -67 85 -137 -22 140 -26 13 -102 77 168 20
7540 20 62 25 -193 -5 103 -3 -107 206 -101 69 -54 136 -62 -191 128 -40 302 242 -53 -67 -146 -50
7562 -50 135 -36 53 63 83 55 -53 -138 -12 -138 14 33 52 -44 140 -17 -15 3 -22 54 -191 97 336 -94 25
7587B5m3p1L38l51J56R8j26J33p4m31L93j84o3J79J37k52l3K07R3l0k76J56o4
7610h3K40j6j19Qj64j44K55j60L07k07J62R9k28J33m0J67r1l22J71L5K24j55k51
7633a79N4K75m20K74pR7mj7J37m52K11J66k83J82N3K9n5j63J30r8j57P6K67lj57
7658d4l2l14M34k6j39K45j68o1Q5K20k76J3J42j7o2J6J1J54j56j77K33j06q1M1
7682f5R4L1p5l14N37l15L8K56r3J1k3PO4o3j56M47n09m5J06J12K00j51k55J3K26
7707G8l08pJ55J41j47l2M1M4K29k32n0K6j8p8K03r8j3J14k01j29J78J96k5n7P2
7732H2%m9K19j62N2l00M1j34J78L4K61k59J13j8j33L01k34j7K8n6n2j02J74K03
7756A70m1k02m2o3M82k87k17J72k64K59j00l7J12j0m4L16m47J12p1K67n6n7j3
$$ plain form
7587 25 -18 -89 249 -102 54 152 26 159 85 -346 47 -137 -200 -21 116 -136 -169 38 131 101 -175 -19 -83
7610 -83 157 141 22 30 -134 -278 -23 -183 124 -83 79 178 -50 83 43 210 119 -203 -32 3 227 72 -179
7633 -179 -125 150 -270 4 -3 94 90 73 210 -242 -31 135 -148 34 87 116 61 -102 28 -70 -227 -151 116 113 -44
7658 -44 -76 -390 44 18 -121 124 -44 -105 -20 200 -76 -63 79 62 0 16 27 181 25 -152 81 -25 -106 -65
7682 -65 29 60 -15 -329 208 -107 -69 187 94 105 82 89 153 90 -66 381 -128 -173 -67 45 245 94 -161 -148 78
7707 78 -230 -237 -82 59 -88 -120 -79 -35 194 -38 -88 -62 -80 -158 45 -53 -66 48 -153 -282 -104 92 67 10 82
7732 82 82 33 252 90 142 -158 -117 -251 -73 -39 222 -37 76 58 -75 226 -8 -25 3 -53 -105 -207 -33 170
7756 170 129 -73 -115 -178 304 17 -200 -28 -292 -33 -133 -170 -58 -68 -112 204 -243 -131 -202 65 9 -48 -61
7779f1Rp9J64O9j92J76j28q1L80j94m4m0p8n7M95l57o3Q2k05L24r9k24J34j3K24
7804A42k09J07k72L84J61l02Kl8P0J42k4j11o2J38j36O1Lk27K72j12P1j98J67
7827B9L3P4N1n05J55J42R3o5L5J06j23j70k24L16R9j48L6J08k9J27l01K15j57
7850a03N51n90R2K32n2L0m01j2L35j65k9M4j13n2J45O7L0K7k33l9K39J5l0N5M2
7875H5k59j8L55m07J81J25J43K6q1k21Q7j32p0J51N8k65K42j4L9k43J70N0o7o
7899g1K91p0Q1k28k66L28k64L68m43K34j3j37N7K30Q7m11K60q4J23k68J44J69
7921A17j34J14q4K66j9k78j97Q3k7r4K71j30l5L28j94J59K8k87J42j02J08p6J35
7944I4q2k6k04L67m06R3K27j65J77j96K26k20J01J08k38J4J35r7J27j74M09n04
$$ plain form
7779 -61 -52 -131 33 102 -90 86 -42 -123 257 63 19 -21 -99 -156 339 -18 -81 1 -204 120 21 -203 -69 -82 142
7804 142 -67 40 -232 152 313 11 13 -25 45 187 163 52 -10 128 -8 53 56 -171 101 -11 60 -138 29
7827 29 62 136 187 -318 -163 -21 72 7 42 148 25 -145 -369 -53 46 -102 -66 42 13 140 -161 54 -103
7850 -103 448 -142 -50 182 130 160 -241 -253 82 -83 -112 -68 -181 -233 -88 -21 9 36 -197 -236 3 18 -12 43 85
7875 85 -174 -192 163 -244 -63 62 205 231 150 -71 16 -116 -186 -35 23 -242 0 -14 25 -218 -48 2 -65 -71
7899 -71 220 150 231 3 -263 65 -199 169 -274 -40 -53 -190 -133 97 184 -227 33 -51 72 -196 -52 117
7921 117 -17 97 13 279 260 -18 -215 -132 -159 -253 18 -112 -147 181 -13 146 174 -113 29 -73 35 -41 94
7944 94 12 -14 -218 149 -257 -164 63 -102 75 -121 105 -115 -14 94 -144 -130 5 -92 35 -139 270 -234
7966b34K39O8Mj56j10J07R6J57m5j53N9j8K6j88K39j50j0N0K2m3L38m52K01p6
7990b9J30j31N7oL09l78K1j54K78k13J44k0LP7k97J52M5r1K19k62J02j75J35j99
8014b83J97K8k75L67k17L23o9j38K20j56j55J74O6M4k49M5M2J58k04K40k15L9
8036a8j11R0Q4L3lj8Q3l73K74j47M1j60Q9J42j17J4p6K00j35j11J22k02L58J51
8060B10k01j04j02Q4p8J64l0Jk4N6j8k0J9r7J50j30O8MN57n05l60J34J23J2j4
8085a01Q6k6J0k8K39o8m34N78j61j06J18k30J4J69j3R0k55K03q2J44k90J80j40
8108a03P7j01J21K18j52J55k09j59K40O2l67L15j99J03r1J73q1K81m59J63j74
8129a87L43k18J68L9k55Q8j82L91l0P4l49M7J44oJ7o1L9j69J59j67J3k9M85j81
$$ plain form
7966 -234 5 73 77 -79 -189 -82 14 171 126 -27 32 14 40 -148 91 -59 -69 -19 3 -40 298 -154 47 -29
7990 -29 101 -30 27 21 330 -48 -27 -181 97 -116 28 8 11 88 -209 -57 -12 -103 116 -146 -44 -219 -84 -283
8014 -283 -86 -58 -333 34 -183 140 71 -67 153 -3 -158 16 82 126 -123 -78 -36 122 -82 158 -57 -18
8036 -18 -129 -39 45 78 75 57 140 -233 41 -106 -65 -225 -136 6 -111 -97 -173 27 -108 -219 -97 -299 59 210
8060 210 9 -95 -197 -113 -191 -27 -57 -56 -80 -24 -42 -62 -43 -140 10 -120 -52 -48 509 4 -356 -222 -99 -87 -101
8085 -101 -15 -41 -31 -59 180 112 -322 256 95 -11 107 -123 -109 60 47 137 -118 85 3 147 -143 37 -103
8108 -103 -26 -127 -6 212 60 215 6 -153 87 149 -218 97 -102 1 -90 83 2 283 -176 -13 -187
8129 -187 156 -62 106 145 -110 -22 -204 187 157 231 -118 -71 73 67 84 23 62 -107 52 -115 -102 -131 354 173
8153A73q3j38J11j65l3K86k58N9J35q1k05K70k85J30L74l73j2K3J77j77J10k5
8175A3m1J42k35P8j13J05k41L13O5oj96J86P1k84K37j20
$$ plain form
8153 173 90 -48 63 -102 -135 151 -107 -48 87 6 -199 71 -214 -84 290 -83 -95 -72 105 -72 38 13
8175 13 -28 114 -121 -43 -156 -51 -292 21 86 80 -116 70 141 -143 94 -26
8191b6
$$ Imaginary data points
##PAGE= N=2
##DATA TABLE= (X++(I..I)), XYDATA
0@%%%%%%%%%%%%%qJ6j6J6j6K0k8L2m0M8n2O0p2Q5r6J10j27J44j65J89k13K41k70
36a42L02l40L78m19M68n23N82o43P10p84Q64r52J050j157J275j405J547j708J889
55I92k093K325k589K898l265L706m247M934n838P077q891J1809j7269L0870j27286
70a06867k27931K20763J40896p2437L7417K35663J8669k38368j56083L4968Q431
81a04879r239J01058J46373M4598k5807q1485j59529j19335N4800Q8746M992Q0126
93B0419K02109K8952k21773j41113O5548p670j25229N7386K45035P8599j42850
104E9413p6857L6892o1444j27393K9810J60688Q9786q41m185l4130r1510p5692
116i5463k4804N758P0723J26859N3591o3052n3570o832o8523j03622L5528J58906
$$ plain form
0 0 0 0 0 0 0 0 0 0 0 0 0 0 0 -8 8 -8 8 -8 12 -16 16 -24 24 -28 32 -40 45 -51 59 -68 76 -89 100 -113 128 -142
36 -142 160 -180 198 -221 247 -276 306 -337 373 -411 453 -499 551 -606 669 -736 811 -897 992
55 992 -1101 1224 -1365 1533 -1732 1974 -2273 2661 -3177 3900 -4991 6818 -10451 20419 -106867
70 -106867 -334798 -114035 26861 -45576 -8159 227504 246173 7805 -148278 -113310 -104879
81 -104879 -114118 -13060 133313 177911 152104 70619 -88910 -208245 -153445 -64699 -59707 20419
93 20419 222528 251480 29707 -111406 -45858 -53528 -178757 -121371 123664 202263 59413
104 59413 -17444 19448 -41996 -169389 -139579 21109 110895 110054 105869 71739 -19771 -95463
116 -95463 -120267 -114509 -43786 83073 136664 73612 20042 13210 -55313 -158935 -123407 35499
128C5499P7861l2331N58K2359r1805j50052k9233Q5446O4840L6130O9437N2247
140A40956m1924r7476p3647k9375J0695N1772O7543M7498J9411j8179p0625q5618
152g8969k8787L3979M2492M1312O3124M4965l5845q4034n4253j4123m000K1049
164e3090O4509O3812J0242l8730n0812m5824l0311L478M5448O6239N0551J0983
176I6495l0626n8501o1154l8917q06M0616O3846N5753K2687j6164m8068n9676
188c4515m0940k058L1602N1385N3013K6630j7071m8556n3295l8396j0500K6225
200e6476N3331N2896K6638o908l6597m9707l7836r223J8944L8405M5033K6350
212F4850j2801m0825l8585k6328j1934J9112N2657N1312J5400j5774k9962m3252
$$ plain form
128 35499 113360 81029 81587 103946 12141 -137911 -167144 -81698 -16858 19272 88709 140956
140 140956 99032 1556 -72091 -101466 -90771 -38999 28544 76042 95453 77274 6649 -78969
152 -78969 -107756 -73777 -31285 10027 73151 118116 82271 -1763 -56016 -70139 -74139 -53090
164 -53090 11419 75231 85473 46743 -4069 -49893 -80204 -76726 -31278 34961 85512 96495
176 96495 65869 7368 -53786 -92703 -93509 -52893 10953 66706 89393 73229 25161 -34515
188 -34515 -75455 -77513 -45911 5474 58487 85117 68046 19490 -33805 -72201 -82701 -56476
200 -56476 -3145 49751 76389 69481 32884 -16823 -54659 -63882 -44938 -6533 38500 64850
212 64850 52049 11224 -27361 -53689 -65623 -46511 6146 57458 72858 57084 27122 -16130
224a6130m5212j6633K6833M7687M0869K3348L50k9516m6878l8735j2147J8430
236d7734M1714M5353K5929k934k6254m3588m5613k0893J7982L9300L8256K8728
248E0246J2486j7944m3511l9398j2870R885K3984L3483L0234N245k4257l6366
260h783l0192j4372Q237L0694L8210K7392M110k0126l5700l4786j7057O991K6702
273a8680L5190K8239O051j9917l4145l1935j6819N643K7883L8641K9860O826j6947
286C9890l3549l6667k3821L60K4486L4913L0414J3834r006k7581l2709k1736p84
299d1956J8569K9128K6886J2034r497k7140l0279j9716j768J7505K9881K8198
311C1845J2806q357k3630k8208k0619l274J6005K7523K4786J0879q145k3504k8371
$$ plain form
224 -16130 -61342 -77975 -51142 -3455 37414 60762 61112 31596 -15282 -54017 -66164 -47734
236 -47734 -6020 39333 65262 62328 36074 -7514 -53127 -74020 -56038 -16738 21518 50246
248 50246 62732 44788 1277 -38121 -50991 -41106 -17122 16361 46595 51840 27583 -8783
260 -8783 -38975 -53347 -45110 -14416 23794 51186 55296 35170 -530 -35316 -52373 -45382 -18680
273 -18680 16510 44749 50800 30883 -3262 -35197 -52016 -46373 -18490 20151 50011 56837 39890
286 39890 6341 -30326 -54147 -53787 -29301 5612 36026 49860 40854 13273 -19436 -41172 -41956
299 -41956 -23387 5741 32627 44661 35164 8024 -22255 -41971 -43739 -26234 3647 31845
311 31845 44651 36294 12664 -15544 -36163 -39437 -23432 4091 28877 39756 31611 8107 -20264
324b0264k0594j732J8128K9528K7335J4219n779k3703l0897k4529o392J2545K6230
337e905K7955J7108j458j9030k7164k2286p744J0672K3143K5847J6417m44j8021
350A9090k7035k2191q137Q053J9826K5249J9237P59j6677k1825j8110r556M451
363b6866K0293K5152J3596l203j4151k1094k1125j0707R493K3239K3382J5468
375C3477K416j3255k4126k2649j1334M900J8608K4547J6683K214j0509j9667k2745
388b1440j3563N628J9715K1113J5157P369p719k2434k4239j1338L505J2431J8595
401B780J9133Q712q236j8705j7919j0134M39J1901J8998J6067M799q385j7500
414A950j8967j1015J074J2774J9802J7309O201o630j6710j8450j3027m26J1885
$$ plain form
324 -20264 -40858 -42590 -24462 5066 32401 46620 40841 17138 -13759 -38288 -44680 -32135 -5905
337 -5905 22050 39158 37700 18670 -8494 -30780 -38524 -27852 -4709 21138 37555 37111 19090
350 19090 -7945 -30136 -38273 -30220 -10394 14855 34092 34851 18174 -3651 -21761 -31317 -26866
363 -26866 -6573 18579 32175 28972 14821 -6273 -27398 -38105 -28612 -5373 18009 33477
375 33477 35893 22638 -1488 -24137 -35471 -30571 -11963 12584 29267 31481 20972 1305 -21440
388 -21440 -35003 -29375 -9660 11453 26610 33979 26260 3826 -20413 -31751 -28246 -15815 2780
401 2780 21913 30625 22389 3684 -14235 -24369 -23930 -12029 6969 23036 27835 19450 1950
414 1950 -17017 -28032 -26958 -14184 5618 22927 29128 22498 5788 -12662 -25689 -26115 -14230
427a4230J8010J6251P150n387j6405j8793j2788j146J1140J8634J7217Q460l405
440B4708j3876j9340j5544k274R764J3679J4271J2238O14j5339j8597q518m24
453a8638K635J1423J9780J1648p064j4583j1263j0294p547M256J7356J6927P075
466B1711k538r488j3886j2002m423M008J2540J8041J0184o402j2276q006j0944
479a3481j2808L081K2367J8350M84k401P33j1327k2813r565J1852J4502O216P387
493A2577P974m838j6888j4429m273M549J1150J1737O968L237j589j3154j9447
506a6426o357J1495R056J680R683J4336n527k3227j1890O586K016k716J1183J9939
520A9831L178j4816j2590m790n384l049P323J4279J2349L767o890j3512q921k298
$$ plain form
427 -14230 3780 20031 27181 21794 5389 -13404 -26192 -27338 -16198 2436 19653 28113 24708
440 24708 10832 -8508 -24052 -26326 -16562 -2883 11388 23626 24240 8901 -9696 -18214 -18638
453 -18638 -16003 -4580 15200 26848 19784 5201 -6062 -16356 -23903 -19647 -2291 14636 21711
466 21711 19173 9685 -4201 -16203 -20626 -16618 -4078 13963 24147 17745 5469 -2537 -13481
479 -13481 -26289 -23208 -841 17509 17993 15592 16325 4998 -17815 -27380 -15528 -1026 5190 12577
493 12577 20551 15713 -1175 -15604 -19877 -15328 -4178 7559 14527 17764 16175 3021 -16426
506 -16426 -22783 -11288 -2232 -552 9131 23467 17940 -5287 -17177 -10591 -8575 -11291 -108 19831
520 19831 23009 8193 -4397 -9187 -14571 -17620 -10297 3982 16331 20098 13208 -304 -9225 -11523
534a1523k844L28J3823J8971Q17j3978o226k5j0570j1374R493K1559P374n811
548A0014p89L40j1963j5267l36J1357R675N345L458j31o561r085r514k672Q213
563g916J2819N216q62J954j739j4068j3994K904J2225M477K093R218N588j0963
577F952j5952l619L498J592L462J0727Q660k322q763q658o369j662L486O304P814
592E150P800J541q112j0574m634m10n65L942J1248Q509l253q167m353l636n658
607a1172j8Q931R837K997j710k803o170p604m214K619O441P529N178K38m230o010
623a61o617l995J299O746P789L941J56k293o165q085l878K120N926O027N155K478
639A0443k716o999o618l400Q03M151O464N448J632k727n579n891m006M70M276
$$ plain form
534 -11523 -14367 -14039 -216 18755 19572 5594 -632 -657 -11227 -22601 -13108 8451 15825 10014
548 10014 9225 9565 -2398 -17665 -18001 -6644 3031 8376 11834 11703 5142 -3943 -13457 -16129 -7916
563 -7916 4903 10119 9257 11211 9472 -4596 -18590 -15686 -3461 1016 3109 12327 17915 6952
577 6952 -9000 -12619 -9121 -7529 -4067 6660 15320 12998 4235 -4423 -10792 -12454 -8968 -2664 5150
592 5150 12950 14491 6379 -4195 -8829 -9239 -9804 -5862 5386 13895 10642 2475 -1878 -5514 -11172
607 -11172 -11190 -2259 7578 10575 8865 6062 -108 -7712 -11926 -9307 -2866 4663 9841 10079 5849 -161
623 -161 -6778 -10773 -9474 -2728 5061 9002 9158 6865 700 -7385 -11263 -9143 -3217 2810 7965 10443
639 10443 7727 728 -5890 -9290 -8487 -4336 2128 7576 9208 6481 902 -4989 -8995 -8525 -4249
654d249O214N433J714k270n290n705m406j56M284O210M487J896j570m630o213
669d251m162L79L899N382M843K302j206n015o095l965k29L454N116M856L037q27
685G518m693o128l846r3K697M160N260K946o66m849n028l656q74K044M595N462
701D849K854j141l909m393l975j526K095M589M906K668p25l631m323m125j353
716g140K241M370M582K808p36l203m104m427j673K109M092M743K513J27k824m336
732h58m296j434J612L683M199K924L69k493m336l939j517Q36L617M130K940N25
748E962k506l676l751j792R60K851M151L092J76j739m109l412j959R74K832M327
764B381K738M69k070l207l733k248Q97K759M132K497P24j885k954l810k292P64
$$ plain form
654 -4249 1965 7398 9112 6842 1552 -4153 -8559 -8715 -4431 1779 6266 8162 6592 1962 -4251
669 -4251 -8413 -8034 -4135 1247 6090 8392 7186 2171 -3924 -7889 -8118 -4664 452 5308 8345 7518
685 7518 2825 -3303 -7149 -7242 -4545 -385 4875 7821 7155 2306 -2722 -6378 -7252 -5208 -613 4849
701 4849 7703 6562 2653 -1740 -5715 -7241 -5146 -557 4349 7017 6292 2661 -1662 -5787 -7140
716 -7140 -4899 -529 4053 6861 6125 2922 -1182 -5609 -7282 -5173 -1081 3662 6175 6302 3478 -858
732 -858 -5154 -6588 -4976 -1293 2906 5830 6199 3706 -630 -4569 -6086 -5250 -1633 2497 5437 5962
748 5962 3456 -220 -3971 -5763 -4803 -1952 2199 5291 5467 3728 -381 -3793 -5752 -4778 -1946 2381
764 2381 5119 5588 3518 311 -3422 -5670 -4773 -2014 2118 4615 5339 3454 500 -3310 -5602 -4838
780d838K855L526K785J220j553l443l516j834K23K386L190K812J202j233l153
795F29l353j790K20K119K911L124J039j339k997l082j937j38K018L207K970Q91
811D492j244k269k976k093k03J653L516K351R76p79k356k874k268k17J956K742
827D07K675J005p44k182k806k019j11J338K548K470J106n47j856k933j991j02
843c742J609J983K593J296l39k207k295k239k50J232J952K604J277k92j948k430
859a196j856m34J304J783K593J074k26j608k091k050p43Q88K535K090J274k90
875C047j825j879j832r02R61J840K272J492j16j632k181j442p61M78J796K040
891A356J499J08j390j891j826n80L31J590J987J490p9j245j695j560r26K55J646
$$ plain form
780 -4838 -1983 1543 4328 5548 3995 552 -2964 -4798 -4575 -2189 1001 3813 5015 3782 629
795 629 -2724 -4514 -4294 -2175 736 3860 4899 3560 563 -2519 -4456 -4594 -2576 631 3601 4492
811 4492 3248 979 -1997 -4090 -4293 -2640 876 3227 4203 3424 1068 -1806 -4074 -4291 -2335 407
827 407 3082 4087 3343 1161 -1645 -3664 -3775 -2437 111 2581 3687 3140 1284 -1649 -3640 -3742
843 -3742 -2133 -150 2443 3739 3400 1193 -1102 -3341 -3591 -2359 -407 2197 3474 3182 1234 -1196
859 -1196 -3052 -3486 -2182 -399 2194 3268 3042 1434 -657 -2707 -3450 -2562 -27 2063 3337 3047
875 3047 1222 -657 -2489 -3391 -2430 -590 1682 3174 3058 1426 -755 -2197 -2958 -2480 -684 1356
891 1356 2855 2963 1573 -318 -2144 -2724 -2393 -803 1184 2674 2595 1350 -345 -1905 -2831 -2576 -930
908i30K374R78K44j333j457j854q24K93J599K255P89M8n43j310j954j130N74J474
926g07J651R10M98m47j606j825r68M43J415J379R73P69m67j607k034n74O27R62
944f08Q08J394R85o71j630j926k51L07K11J625J424Q88j051j353j547j08m01L67
962a537J561K007L02q04j613o36o39o21M56J915J415K60j152o90o81j216o10Q38
980a445J775J467l74m28k95j126j086p28J119J583Q62L40k08n80j218j564k28
997b134R66J466M53O50J87o63j443j500L19J461N06L64O70N73r87k006m65M56
1015a127M69L16R61J151J39j164j681n92O43j10M58J096J156r3r83j293m60j16
1033a230n7N80J669P52m35q20n31p24n10j68R98J638M93o91l47j038j39j056K46
$$ plain form
908 -930 1444 2422 2666 1333 -124 -1978 -2802 -2509 -910 1345 2134 2182 1639 329 -1625 -2755 -2181 -707
926 -707 944 1854 2352 1905 299 -1526 -2494 -2051 -636 743 1716 2485 2018 411 -1623 -2197 -1570 -608
944 -608 200 1594 2579 1908 278 -1648 -1899 -1592 -1381 244 1668 2556 1505 152 -1395 -1503 -1904 -1537
962 -1537 24 2031 2333 1529 -84 -720 -1359 -1980 -1524 391 1806 2066 914 224 -457 -1673 -2283 -1445
980 -1445 330 1797 1423 995 700 -426 -1512 -2240 -1121 462 1324 1664 1456 876 -342 -1906 -2134
997 -2134 -1168 298 751 1401 1588 925 -518 -2018 -1699 -238 268 632 1302 1875 888 -1118 -1583 -1127
1015 -1127 -658 -342 619 1770 1909 745 -936 -1528 -885 -995 -537 559 1715 1622 639 -654 -1114 -1230
1033 -1230 -1287 -707 962 1714 1279 459 -72 -796 -1306 -1474 -476 1162 1655 964 617 -421 -560 -1616 -1370
1052a370R05J400K46k50q6q70q61q37L62J250J158q8J0K7q19j285l31M19Q24M73
1072B77Q65J86k91j291p30o46R10L11P66P57K37l10j034j109m08Q28M28P79L63
1091H88N17n26j082l50m52p0N34R87L95K63l88p74o06p11L42P38L94O45M55j64
1111A035q60r95m95K23O53O31N51M20l20p09p88m27P8J56J065M53O29k73q81r01
1131g55m35J69L97P59P58J90k73n31j028j11k00L84P45N59M47k31p04o79n58J01
1151i96L57N34Q24J03M9o64n19l33m89N53N99O54L42k32k06q34m35n28N73M78
1171a70R35J21r7l79o80p09j95N63P80L63L02n5m65o22n18j37L04O86M17J81l
1192F22l51p03l59n2K91K77O94N23po55n46l65n26P69J63Q46K74r3n23k96p48
$$ plain form
1052 -1370 -465 935 1181 931 845 -25 -886 -1723 -1361 -111 1047 959 969 996 177 -1108 -1439 -1020 -196 277
1072 277 1142 1328 1037 -254 -984 -1630 -720 -409 357 1114 1351 1041 7 -1102 -1510 -682 -254 525 888
1091 888 1405 879 -203 -553 -1005 -1075 -541 446 841 1104 716 -58 -664 -1375 -1033 -295 99 744 1199 1035
1111 1035 175 -820 -1315 -1092 -439 192 743 1163 843 134 -654 -1081 -1003 -847 218 671 1300 1027 146 -755
1131 -755 -1190 -1021 -624 135 893 1083 810 279 -749 -860 -1060 -676 69 628 1075 844 140 -539 -1097 -996
1151 -996 -639 -105 719 822 871 207 -312 -645 -1134 -581 18 672 1014 782 576 -258 -693 -1221 -648 -170
1171 -170 765 886 789 410 -270 -979 -1174 -611 169 532 834 779 314 -308 -826 -963 -659 27 444 625 622
1192 622 271 -432 -791 -843 -552 -275 419 942 935 280 -266 -631 -1157 -388 -225 621 895 802 279 -17 -765
1213g65j88L52M94O74J54J32k70p87m06j20J97N64M68J52J88j01n74q52p1L72
1233c87K96J33N75K83m25o04n49o2Q2L01O12J49J77Qo59m73j31Q7J26O23M61m4
1255E79J64q71k17m24J2M25M84L64J72j14o32j93m39j05M59L80K99L61m05j71
1275A28j50n77m5R6N50K23L47j2m79n28l06K58K73O4M08N53k10k92m28o35P8L16
1297c68K39M40L20L5m21k95n97N0J58L01L84K82p3k63j68m83k93J71N67K59J80
1318D25r6l03j82m44J86O1N52M6K87j07N2o12j60n38N96K87J15L68K08m39k36
1339F6m11k26M0K40O20p8K88o2n12j40m18j11P54K92K76J68k17l84m94j02k47
1360f58K93M77M59l3l39j26m18m9k22L99O3P88j64j82l34q2m07nL66K63K52J66
$$ plain form
1213 -765 -953 -601 -107 567 721 853 583 -204 -610 -730 -533 31 499 651 839 738 164 -688 -759 -387
1233 -387 -91 42 617 900 475 -129 -678 -740 -658 -357 255 404 581 589 -70 -543 -674 -587 -461 162 623 579
1255 579 743 -128 -345 -769 -757 -332 152 516 688 574 -58 -251 -690 -795 -336 44 343 704 299 128
1275 128 -22 -599 -644 -548 2 225 572 560 81 -447 -753 -495 -222 -158 250 803 593 301 -127 -762 -684 -368
1297 -368 -129 311 631 666 245 -50 -647 -597 -439 -138 246 528 455 192 24 -459 -752 -581 -14 245 425
1318 425 329 26 -156 -600 -414 -353 199 245 532 425 477 -135 -295 -833 -237 50 165 533 741 302 66
1339 66 -345 -571 -531 -291 329 251 539 477 -35 -175 -593 -704 50 342 618 786 569 185 -309 -411 -658
1360 -658 -365 112 571 538 199 73 -345 -394 -616 -217 -154 634 470 288 -46 -128 -535 -540 -174 89 341 507
1382E07m6n68j12l59N3J51L90K77J49j12j79n43n6o0J48N38K50L29m98k48k36
1403b25k28k3J8J91M67M49n51j04l33Q1k60K53J94O06k18P2j1m43m77o1M85J15
1425cJ98K78n8Qk83m84k00K09J40L99J00J97j17k91p52l5M07K0L48K49K98m10
1447B18m39l32Q0o7L98L25K94O7l71j49m25p4J74J23K84L77R8l61k67k50j44J91
1469b50K48Q8N06o4n19j54O6l60k68M72M95K50m88J22q5k47k36k83P55N5L75p8
1491D00j74l41j53k5q0J17L29J91O1l30J92l30n48P0N78J91P9P8L03m68m80K51
1513h9k24J26J01M54J08p6l89j54k62j09J69M96J63J62n6Np66k3l9J03K14K42
1535A56K88l52J55n91k8Q3j04K08N88N3j85j27k89q0j67R3R7M61L61k18j32n42
$$ plain form
1382 507 461 -107 -219 -578 -525 -374 16 293 442 330 151 -392 -448 -508 -360 178 428 757 259 11 -225
1403 -225 -453 -476 -458 -267 200 649 98 -6 -339 -258 -518 -265 -71 535 317 389 378 -65 -542 -603 -118 -3
1425 -3 195 473 415 423 140 -344 -544 -335 -195 204 304 501 384 93 -659 -694 -287 -267 81 330 628 218
1447 218 -221 -553 -473 -540 -142 183 477 544 173 24 -401 -475 -301 -178 106 483 581 220 -47 -297 -441 -250
1469 -250 -2 86 592 528 9 -145 -79 -439 -707 -235 260 510 22 144 59 -188 -424 -707 48 103 478 400
1491 400 226 -115 -268 -293 -373 -256 73 264 325 -5 187 -143 -691 -621 -43 148 227 305 608 140 -340 -89
1513 -89 -313 -187 -86 368 476 400 11 -143 -405 -514 -345 151 314 476 420 425 -341 -364 -403 -300 -86 156
1535 156 444 92 247 -344 -372 -289 -393 -185 403 456 271 144 -145 -225 -392 -299 -202 259 620 402 270 -272
1557b72J16j27k95N14M79k67J10j79k21j53P2r9L12J38M94j85j20j72o89K22o3
1578c85L12J68J15j26J57j59m03j81N80j40K41J74k60K46n13Kpl4R0K38Q9K36
1600D40n3l00k62K5Qp8M20j06J52ll05m22K01K96o1K7L34j43r3k81K50j48L1q3
1624a54L29K1J66n5m31J10p0q7J51J92j13k1j1l3n5m28M43J48k47M03qp4r3l52
1648b69Q4K42k78L46j00L19k64r6q2k10J75j02K67J29L4L6k35n3r2j0K2L72m2
1671A93J20J79k90j74j42M0p7Q7J31K87J44k33l22j3j47Q1K15j06P3J51j64J10
1693A43l70N4K1P4N1J97p9P9j3j45k35K32k25K77K69j96K3j38L7l64j53K60J88
1716a3N5J85j71O3l51R8o1m2L22K51j49jk17m7qk8J76M6J46l6k3k87r8q9J6NJ39
$$ plain form
1557 -272 -156 -283 -578 -64 415 148 258 79 -142 -295 -223 -322 -10 128 622 437 317 145 -544 -322 -385
1578 -385 -73 95 210 84 241 82 -321 -502 78 -62 179 353 93 339 -174 -172 -179 -213 -123 115 204 440
1600 440 387 87 -175 -150 -142 -220 200 94 246 243 -62 -484 -283 13 -48 -21 313 170 77 -204 46 -102 -71 -154
1624 -154 175 196 362 307 -124 -14 -84 -171 -20 172 59 38 27 -6 -61 -489 -46 102 -145 258 250 176 83 -269
1648 -269 -185 57 -221 125 25 344 80 -16 -98 -308 -133 -235 32 161 195 231 -4 -57 -149 -159 -137 235 193
1671 193 313 492 202 28 -114 -74 -151 -64 67 354 498 265 -57 -70 -217 -136 79 -27 46 197 33 143
1693 143 -227 -173 -152 -78 -27 170 91 170 157 12 -223 9 -216 61 330 134 157 19 56 -308 -461 -201 -13
1716 -13 42 227 56 119 -232 -134 -195 -237 85 336 187 186 -31 -78 -86 -114 62 108 254 218 195 -92 -190 -279 -263 -258 -119
1743a19Q0J95k39K09j02l9k4j16J55J92L6j34j14n9o9R2J14k48M54p1R5k92R0
1766H6j89l8J60J25j20Q3k64K70J19m52J17j09K32j70L23J22j85k85J01r4j99
1787c67K93M50k51P2Mk84n7J28k16J70K19L1k09J22j65p1L0Q0j43L37j01L5J4
1810A21j32k28P1L13k38o0K89K71l65J90k66NL4j59K43p2M10m70J34l76L24k39
1832b00K54k0j04K32J26k67j30K17k40J57n6J49k43M00n08j31K47qk8K92J52o9
1854B22j53P2k67j16K9N5L14k28J63M4p7O0l37P7M9J24J3L5Q8j58P1q6j16j37
1878b59J34J31j8M9j45M3Q8m3J36k53K92k23P1J93o5l56K67k70Q5RJ41K01j32
1901G6J40k23k64K75j28J18K67j69rn4j36J6j05R0L23j47j04P7K03k64M9k27K66
$$ plain form
1743 -119 -39 156 -83 126 24 -15 -39 -155 0 192 228 94 -20 -79 -148 -56 58 -190 264 193 288 -4 86
1766 86 -103 -141 19 144 24 107 -157 113 232 -220 -103 -212 20 -150 173 295 110 -175 -74 -168 -367
1787 -367 -74 376 125 197 201 -83 -140 -12 -228 -58 161 192 -17 105 -60 -131 -101 -21 -164 173 72 107 121
1810 121 -11 -239 -168 145 -93 -153 136 407 42 232 -34 -29 5 -154 89 17 427 -43 91 -285 39 -200
1832 -200 54 34 -70 162 288 21 -109 108 -132 25 -31 118 -125 275 -233 -364 -117 -125 -153 139 291 222
1854 222 69 141 -126 -242 -213 -158 156 -72 91 135 58 118 -219 -142 -93 31 44 79 167 9 80 -6 -122 -259
1878 -259 -125 6 -12 37 -108 -65 23 -20 116 -137 155 -68 3 196 131 -225 42 -228 -143 -134 7 208 76
1901 76 216 -7 -271 4 -124 -6 261 92 83 29 -107 -91 -196 -106 217 70 -34 43 246 -18 31 -196 70
1924G0o8LN3J76j75j37q8R8J10N9P5r4Q6k66oJ8K59j20j8J35L48n60K8j25J14
1949b5r1N8K42k39K17M4m7k54m0Q7J6p0J15j83O1J57n2j37K08l42L10L5j29L6
1973b3j3%K09k81q3K27K45m57J07J62M8j35k9J78m4O4j87j68J6j67L07j68K23
1996C1k62K59j39%J04K22n83K77j60J06M02k6j57j13j4j9l0l8j2K58O5j72J50
2019A49Mn3k55K89j98Q1K92o7l49n0LK54l37K83k45L8J51k8j15r1K57J24k19J08
2043B6J87j03O1k23k01J01J2K95q7J29j13j71O0k5Lo6N0l2L80j84O0k40j23L06
2067A02l45K23O6k46M10K9k59K28l95p1L27M2j4J32m27J82L1k64K09O7p9P2j37
2090a17M1L2K6j47O3r3K72K97m27N0k5K3r8N2k1r0K82k24P8q3K91l92M6K76k99
$$ plain form
1924 70 2 5 58 234 59 -78 -166 -68 42 101 176 82 168 -98 -104 -86 173 53 35 170 518 -42 -14 -139 -25
1949 -25 -116 -58 184 -55 162 206 159 -95 -135 -48 -32 -102 13 -170 -109 48 -4 -141 67 -275 35 70 -59 -23
1973 -23 -36 -36 173 -108 -191 36 281 -176 -69 93 141 6 -23 155 111 175 -12 -180 -164 -331 -24 -192 31
1996 31 -231 28 -111 -111 -7 215 -368 -91 -251 -145 257 231 74 -39 -53 -72 -102 -140 -152 106 171 -1 149
2019 149 153 100 -155 134 -64 17 309 242 -107 -157 -154 100 -237 46 -199 -161 -10 -38 -153 -244 13 137 -82 26
2043 26 213 110 171 -52 -253 -152 -140 155 68 197 84 -87 -27 -52 -49 -115 -65 -97 283 99 159 -81 -204 102
2067 102 -243 -20 46 -200 210 239 -20 208 -187 -258 69 111 97 229 -198 -16 15 -249 -40 27 -52 20 -117
2090 -117 -76 -44 -18 -165 -102 -195 77 374 -53 -3 -28 -5 -103 -51 -72 -162 120 -104 -26 -109 182 -210 -164 112 -187
2115a87P4K55j79J37j12K9R1j26l18M54k96K08L1l24K08k98M11l77J69L69N3l46
2137g4M9j95K12L33l25R5j32M7j15o7J15o5L29o4j12K3j11L1j75J52j03K06j56
2160a02K09q8q1J4J05r9k2j35L6L69J86m56J13n7kj55LM32k55jK35m41J33N4J9
2185A4oo1P9k17M53K0k72k19K34J49M2Rj4l90J13J89k73M1k0O2J09j30M4k0O5
2210AM4mj14r4K97j89m2J99M9l1j47J52n0R9m6j20P0k1j64m7J61o7j51O3K55M8
2236A51P5j61l30J16K19J18j76P2k62K61k10K18j28p2K42L6j58J8j1L9j85J46
2258A8K5Oj20L22k51m19K17J36j02P8Q9q2J24K28p2k04j24k37K46J37K53l55N2
2281c5J11l1Q5p3k94O1L14%k63j84K09j24K88j74M6k18L79N2k19J0L1j47j02L60
$$ plain form
2115 -187 -113 142 -37 100 -12 17 108 -18 -336 118 -178 30 61 -263 -55 -353 58 -319 -150 219 272 -74
2137 -74 -25 -220 -8 325 0 95 -37 10 -105 -172 -57 -122 207 143 31 54 -57 -26 -201 -49 -152 54 -102
2160 -102 107 19 -62 -48 57 -42 -64 -199 -163 206 392 -64 49 -8 -10 -165 -162 270 15 14 249 -192 -59 -5 14
2185 14 8 -53 26 -191 262 282 10 -209 25 174 216 225 211 -179 -66 123 -150 -109 -129 -67 42 -88 -44 -64 1
2210 1 45 41 -73 -167 130 -59 -101 98 147 116 -31 121 71 170 124 4 74 53 -111 -158 3 -64 -215 -152 103 151
2236 151 226 65 -265 -149 70 188 12 84 -178 83 -127 91 -37 -109 133 169 11 29 18 57 -128 18
2258 18 43 49 -71 251 0 -419 -202 -66 -168 -90 -1 -83 41 269 197 -7 -131 -368 -122 15 268 -87 -35
2281 -35 76 45 130 57 -237 -176 138 138 -125 -309 -100 -224 64 -110 -64 -282 97 149 -70 -60 -29 -176 -278 82
2305H2J44k72J48R7Rj13l25L24j23K87j21O3j1l14J78j67k7O0K23%o3L8r3j47
2329a23M3j02K84LRO6p5k8k84L6J74j36L37l53J64k56J85p7K09j4jR6j06N4r3
2354A2L0J8R6k31L7J31j75j64M41m19R9L53j67k88K55J64k77J33o0L1N9J6j03
2377iL2Q2j26j01N0K14j39j33OK14J63k13K1l16L20J54l04J66r4J44R1j82O0J68
2401B68l88j69J65l6R0N4n6n9j03P4R7p2J46P5j42J9M1np9m4J33k21M48l44j7
2426a25M6J93k31o2K61m4o5J28j98J56pk2m3K0j61K0P8O7j44K39j09p0k1j06j9
2451b19J24m1J05j59P1J16r9K07Ro8q8Jj9K29l58J32J33l6j65K7J99Rj16J51j19
2476B6J01JM5P3j24j20o2l5K0J89o9R2N1m0k03J7j77L2J53J0k6P9j03J33l42J50
$$ plain form
2305 82 226 -46 102 199 208 95 -230 94 -29 258 137 200 189 -125 53 -114 -141 -81 142 142 79 117 24 -123
2329 -123 -80 -182 102 105 114 180 105 77 -207 -171 3 -133 204 -149 15 -241 -56 -133 76 62 61 157 51 105 12
2354 12 42 60 156 -75 -38 93 -82 -246 195 -224 -125 228 61 -227 28 192 -85 48 -12 19 78 94 -9
2377 -9 23 105 -21 -122 -72 142 3 -130 -124 90 253 40 61 -255 65 219 -85 81 -13 131 222 40 100 268
2401 268 -120 -289 -124 -160 -70 -16 -72 -131 -234 -160 -63 -135 11 86 -56 -37 4 -1 -80 -124 9 -212 236 -108 -125
2426 -125 -79 114 -117 -179 82 38 -27 101 -97 59 52 30 -13 7 -154 -134 -56 11 -133 106 -3 -73 -94 -200 -219
2451 -219 -95 -136 -31 -190 -119 -3 -102 105 114 46 -42 -41 -60 169 -189 -57 76 40 -125 -98 101 110 -6 145 26
2476 26 127 128 173 246 122 2 -60 -95 -75 114 45 137 188 148 -55 -38 -215 -183 -30 -20 -46 33 -70 63 -279 -129
2502a29qJ56J65k43J63k10L07k95j05K28k7j42J45q9K26j17J05L9k13Q3j82J84
2524D1K54l20k11K40J8k63K23P0m5K41l49O3K46j20j24K51Nm1q4j38K36J4k75
2547f8n9k3J29k80L06j60L81j88j10J90j63j6o0K28o5j26J02J51k99K33qk1o3
2570A1Q6J06k89o5J38L7M7j25J03j02N1N6l32K02l7J04jJ88k86J42Lp8J00j27
2594f8jl4M1P6K05l74J49j42N2K20q2k13J69J32K6p7L7l78J83k9Q7K10j85r9K10
2619A15k32j74K18K25q7j77L18l85nL82k08J05r2J43j36J22j96j00J95l24L79
2640H6j69Q9J29O3l4j83l8M3J31j65J63N7k03J07j51k00K39j7J91o4J12k64J01
2663B3J43n7k17o8O9o2J90P4j84K00j81k0n1K80J10l84K35o4k54N02k04o0J03
$$ plain form
2502 -129 -137 19 184 -59 104 -106 201 -94 -199 29 2 -140 5 -84 142 25 130 169 -44 39 -143 41
2524 41 295 -25 -236 4 22 -241 -18 52 7 248 -101 -38 208 88 -36 215 220 179 95 -43 193 207 -68
2547 -68 -127 -150 -21 -301 5 -155 226 38 -72 118 -45 -61 -121 107 42 -84 18 169 -130 103 95 74 11
2570 11 97 203 -86 -151 -13 24 71 -54 49 -53 -2 54 -278 -76 -113 -9 -10 178 -108 34 37 -41 59 -68
2594 -68 -69 -103 -62 14 219 -155 -6 -148 -96 124 42 -171 -2 130 156 79 116 -262 -79 -108 -21 189 4 -95 115
2619 115 -117 -291 -73 152 65 -112 206 -179 -184 198 -10 95 3 146 10 132 -64 -164 31 -293 86
2640 86 -83 6 135 198 164 -19 -57 -14 117 -48 115 172 -31 76 -75 -275 -36 -53 138 74 186 -78 23
2663 23 166 109 -108 -176 -107 -169 21 95 -89 111 -70 -90 -141 139 249 -135 100 36 -218 284 80 20 123
2686A23j00O7m4Q6l03K54K1m11N32j67l7K6k02P1m1J4P6n4j99K09R9M6j39N0k39
2711b62L42l2l8K38l72M42m43L21j89p3n2K41o7J0K3j08J67j36r1K2J01j3j40
2734a09j31N12j87k33r8J52k42K86J13P1j37n0j00j02M36j41n0J17K8j07k08L1
2756a49n9J86OK2J74r0m2k49J56M52l95j39L08l25K22J77k07j49J80j02k3o8K
2779a12J42R6j35O8L8j76j98K99j90L9J60q7O1k94J74J76j07j69J8L08l73J72
2801i0J5jJ52J3j5k95M47k84J64j0l34J13j73J78lM9O8l68J12J88J02J7j99J03
2825e1J0j85R4K41J6o9k94N2K18k09J90k92K5K95n3J10k64K55j65K18m6N9l09
2848a54J52j95N3L01k1l6k13%K94k47j5L3p0K7J81r7N3k10K01p7j56L59l71J75
$$ plain form
2686 123 23 90 46 132 -171 83 104 -307 225 58 21 47 -155 -84 -125 -111 -35 -89 -288 -79 20 66 -73 -23 -262
2711 -262 80 48 10 248 -124 318 -125 196 7 -66 -118 123 56 66 89 -19 148 12 -79 -57 44 31 -109
2734 -109 -240 272 85 -148 -246 -94 -336 -50 63 134 -3 -53 -153 -255 181 40 -10 107 135 28 -180 -149
2756 -149 -208 -22 -16 6 180 90 48 -201 -45 407 12 -127 181 -144 78 255 48 -101 79 -23 -46 -114 -112
2779 -112 30 126 -9 59 97 -79 -277 22 -168 -129 31 -56 5 -289 -115 61 -46 -215 -197 111 -262 -90
2801 -90 -75 -76 76 89 74 -221 226 -58 106 96 -238 -125 -298 -120 -123 -74 -6 -374 -262 -74 28 45 -154 -51
2825 -51 -41 -226 -132 109 125 56 -238 -186 32 -177 13 -279 -254 41 -12 98 -166 89 -76 142 96 155 -154
2848 -154 -2 -197 -144 157 136 100 -113 -113 181 -66 -81 -48 -118 -91 90 -7 46 -164 37 -40 -196 163 -208 -33
2872c3Q9j27j16R2p4K85k19Jl1L49j49p4r0j1N7j15K60j35o7J41j34K73N8j68
2896F2p3o3J09J51l22K23n7J2k69J81M8k0O8l90K57J82k74K79J21J66l03j20m9
2919h1J35r3k4Q8m0P1j76Q2J07j76J75p8J3m3K92k61K08q1l06L20j44l53J93K67
2943I5k2k91r1J05K99j42P1n9J71J28l25o0Q8o8J49J52j77k0j8J3N3o0j6J85l95
2968b35K78J85k51k22L48k87M8J13j14J06o3K11j5q9Q9l38L3K94k36K18j00K46
2990B19l51J00K13m2l70L98Q9m17K64k87J78j06J4q0M48k43j1k76K82j35K33j14
3012FN9p7K7J29r4j1J39k31R8O9l10L07j65J44j00J04l8J0j77J26m6j07J84R8
3036A44l3P8j94l10K58O0l0j71J31P2k2N6L20l39k44Q0J75j3l27L04M8l5Q6L3
$$ plain form
2872 -33 56 -71 -187 -95 -169 116 -103 -102 -133 216 67 -7 -97 -108 -51 -166 94 -41 -108 33 -101 172 230 62
2896 62 -11 -74 35 186 -136 87 30 42 -227 -46 2 -18 50 -340 -83 99 -175 104 225 391 88 -32 -81
2919 -81 54 -39 -63 25 -15 56 -120 -38 69 -107 68 -10 3 -40 252 -9 199 118 -188 132 -12 -365 -172 95
2943 95 73 -218 -309 -204 95 -47 24 -35 136 264 -61 -121 -33 -101 48 200 23 3 -15 -2 51 -9 -25 160 -235
2968 -235 43 228 -23 -245 103 -184 -136 -23 -137 -31 -94 117 102 13 102 -236 -203 91 -145 73 -27 219
2990 219 -132 -32 181 139 -231 167 256 -161 103 -184 -6 -112 -98 -178 270 27 16 -260 22 -113 120 6
3012 6 65 -12 15 144 50 39 178 -53 45 114 -196 111 -54 90 -10 94 56 66 -111 15 -31 -138 46 144
3036 144 111 189 -5 -315 -57 3 -27 -198 -67 5 -17 39 359 20 -224 -144 31 18 -309 -5 43 8 94 127
3060A27j84O7l1k7p0K13j13O7k76J44L6j10J28J27j94J58j31j12LL4q7K29mm4
3084e0J08P3r9k36L24k18L18J4r4n2j26J01j9q3N9K7j48M4R9j22k59K61K04r3
3108C3j7m4N9j50J78J15l50K12p0N6l0N5j4J3m13K49Q3J8k01K75j08J08m2K5J50
3133A90j82J00j32j79N7NQ6L3q1J80Q6j45K11k60J95k97j39L18j51j6J29K7j83
3156a48J03K5jk1J27j43N19m14qj52M10m43L15j05r3Lj52Q7p4J26p7J5J05j4J50
3181A40p6k50J0L69j08r3n3p2J27l1j04K56l78L14j48L5J69k88K69r1K17Q9k02
3204A01kk28L32j91q5K44l28R6J91j9j39Q3N7k39J41J62k07J8K43l04k8J12J0
3227B0J23k00L35k49j69M03l71J68j52K74p1j00J49q4n5J07j92R2j35L74l54j55
$$ plain form
3060 127 -57 10 -21 -48 -118 95 -18 49 -227 -83 -47 -157 -29 98 -96 62 -69 -181 -178 -144 -231 -2 -6 -50
3084 -50 58 131 32 -204 120 -98 220 234 140 88 -38 63 44 -39 20 47 -101 -57 42 -80 -339 -78 126 33
3108 33 16 -28 31 -119 59 174 -176 36 -34 22 -8 47 33 46 -367 -118 -35 -17 -218 57 -51 57 15 40 190
3133 190 8 108 -24 -203 -146 -141 -55 -22 -103 77 163 18 229 -31 164 -133 -272 46 -105 -121 8 35 -148
3156 -148 -45 -20 -21 -42 85 -58 461 47 39 -113 297 -146 169 64 -29 -26 -178 -91 -165 -39 -116 -101 4 -10 140
3181 140 64 -186 -176 193 85 -8 -61 -133 -6 -37 -141 115 -263 51 -97 -62 107 -181 88 -3 214 303 101
3204 101 99 -129 203 12 -73 171 -157 -61 130 111 -28 55 112 -127 14 176 -31 -13 230 -74 -102 10 20
3227 20 143 -57 278 29 -140 263 -108 60 -92 182 111 11 160 76 21 128 -64 28 -107 267 -87 -242
3249b42K00j98Q3k08J36L64j78o5r4K42p5o7J79m9J4P5m3j00N2J10k12QK49J06
3273B87k52k16J56m8p9L56k78K25k94o7J13Q2l8P8K82n09L1K18o7P5JJ9r4J23
3297A04N5k93J62q1N6J3k47O8L74q6q4j43J01J24J13l89L29k40n3J26n7P4j5j4
3321cM7j59K10q1K04m16l7K51J3n2L10l47k5K27O5j51pJ89l83K34k31K20P6j04
3345E0k6O3J6K42l60N3m8Qk0mk3N5j55r4M13j32J89j95N2Q0k54r7J88%k29O1L50
3372A83j50J79k20J62k10JJ9J26k33J85M1m6O5j15J06j46N0j8QL0L1j34j03K31
3396D2K08m72L69mN0j95n7kK32j39k02J40l9J48M2j55j07L57P8m08O2k35K17Q6
3420A6j91J69R8n6k58L80m23L09j39J79k5M1j02j89K88n1J97m14K05L3J5K01l02
$$ plain form
3249 -242 -42 -240 -157 -365 -229 135 -43 -108 -202 40 -35 -102 77 28 42 117 74 -26 26 136 -76 -68 181 287
3273 287 35 -181 -25 -73 -152 204 -74 151 -143 -210 -97 -15 -53 25 307 -202 -171 47 -20 55 56 75 -19 104
3297 104 159 -134 28 -53 3 16 -231 -163 211 125 41 -102 -1 123 236 -153 176 -64 -117 9 -48 26 11 -3
3321 -3 44 -115 95 14 218 -198 -235 16 29 -23 287 -60 -85 142 207 56 49 238 -145 89 -142 78 154 50
3345 50 24 87 103 345 -15 38 -10 -2 -22 -26 -49 6 -149 -243 170 38 227 32 84 164 -90 -187 1 1 -228 -167 183
3372 183 33 212 -8 154 -56 -55 -36 90 -143 42 83 37 102 -13 93 -53 -3 -21 -13 17 48 -86 -189 42
3396 42 250 -222 147 143 193 -2 -59 -61 171 32 -170 -30 -69 79 121 -34 -141 216 294 -114 -52 -287 -70 16
3420 16 -175 -6 92 36 -222 158 -265 44 -95 84 59 100 -2 -191 97 46 243 -171 34 67 82 283 -19
3443a9Q2r5J93j13j50K86l28J47K6n5K5J55j25j38K20q1K9j30o5Ql0L8J4J34k0
3468HnR9K2k06J93J0j53j70K29j47J13J7q2N4J61k59r0L1L34j24m3j99K81L7R5
3493B06r3j37J07k71J74J70L2l08K39j2q4K1j09K47l30J60J44J5p0j34J21j09
3515b1Q8j54p8L34l10L23j57%J19k1j23l2j03K15j91J40o1j21Q5J26K69k95P4
3538A06k17O8J18k29L23k45R6j73P5J17K00j17k34P5J25j74K95k94J2J23N7L4
3560A41j54J74k98L6J12M2J51k02j31L42j98j35J47J83k85R9J38M9p4k61J63j58
3582a19M34k99q6K56m46J50pK33n7j22K55j40K36l80J69j27k0R6O4k84M12n4r0
3605G4k6R3k76K41k79J2K92k43Q0j04K68J6Pj22n2Q8p3j55oN5N99m57l3j58Q9
$$ plain form
3443 -19 63 -32 161 48 -102 184 -144 3 29 -26 -1 154 29 -109 111 30 59 -71 -136 -128 -158 -120 -106 28 8
3468 8 3 102 124 -82 111 121 -32 -202 27 -120 -7 10 -72 -18 143 -116 -206 -175 159 35 -8 -207 74 111 206
3493 206 113 -24 83 -188 -14 156 188 -120 119 107 23 44 -65 182 -148 12 156 171 101 -33 88 -21
3515 -21 67 -87 -165 169 -141 182 25 25 144 123 0 -32 -135 80 -111 29 -32 -153 -68 58 327 32 106
3538 106 -111 -43 75 -154 169 -76 20 -153 -78 39 239 122 -112 -37 88 -86 209 -85 -73 50 107 141
3560 141 -13 161 -137 -101 11 53 204 2 -129 213 15 -120 27 210 -75 24 162 211 137 -124 39 -119
3582 -119 315 16 -70 186 -260 -110 -117 116 59 -63 192 52 288 -92 77 -50 -70 26 90 -194 218 164 74
3605 74 48 141 -135 106 -173 -161 131 -112 -32 -136 132 148 155 33 -19 69 -4 -159 -165 -110 489 32 -1 -159 -70
$$ [...]
8191d5
##END NTUPLES=NMR FID
##END=
