##TITLE=1H_SR103
 D2O
 8 sc, 
 9.02.2022
##JCAMPDX= 6.0         $$ Bruker NMR JCAMP-DX V2.0
##DATA TYPE= NMR FID
##DATA CLASS= NTUPLES
##ORIGIN= UXNMR, Bruker Analytische Messtechnik GmbH
##OWNER= root
$$ XWIN-NMR		Version 3.5
$$ Wed Feb  9 11:55:38 2022 Russian Standard Time (UT+4h)  she@DPX200
##.OBSERVE FREQUENCY= 200.131346
##.OBSERVE NUCLEUS= ^1H
##.DELAY= (6, 6)
##.ACQUISITION MODE= SIMULTANEOUS
##.ACQUISITION SCHEME= undefined
##.AVERAGES= 8
##.DIGITISER RES= 18
##SPECTROMETER/DATA SYSTEM= spect
##.PULSE SEQUENCE= zg30
##.SOLVENT NAME= D2O
##.SHIFT REFERENCE= (INTERNAL, D2O, 0, 15.7039)
##AUDIT TRAIL= $$ (NUMBER, WHEN, WHO, WHERE, WHAT)
$$ ##TITLE= Audit trail, XWIN-NMR		Version 3.5
$$ ##JCAMPDX= 5.01
$$ ##ORIGIN= Bruker BioSpin GmbH
$$ ##OWNER= she
$$ F:/spectra/data/she/nmr/H-F/1/audita.txt
$$ ##AUDIT TRAIL=  $$ (NUMBER, WHEN, WHO, WHERE, WHAT)
(   1,<2022-02-09 11:54:15.25 +0400>,<she>,<DPX200>,
      <created by zg, POWCHK disabled, PULCHK disabled
       configuration hash MD5:
       00 E9 B6 7A A2 85 ED C7 34 08 36 98 17 FE 4E 26
       data hash MD5: 16K
       C9 66 0B 9F 4C A4 3F 53 2A D3 9A 98 5E 61 3E 0A>)
$$ ##END=
$$ 
$$ hash MD5
$$ 98 D8 1F 1E D5 B7 84 FD B1 C5 BC F4 E1 C8 42 1E
##$RELAX= 
##$RELAX= 
##$RELAX= 
##$RELAX= 
##$RELAX= 
##$RELAX= 
$$ Bruker specific parameters
$$ --------------------------
##$DU= <F:/spectra>
##$EXPNO= 1
##$NAME= <H-F>
##$PROCNO= 1
##$TYPE= <nmr>
##$USER= <she>
##$AMP= (0..31)
100 100 100 100 100 100 100 100 100 100 100 100 100 100 100 100 100 100 
100 100 100 100 100 100 100 100 100 100 100 100 100 100 
##$AQSEQ= 0
##$AQ_mod= 1
##$AUNM= <au_zg>
##$AUTOPOS= <>
##$BF1= 200.13
##$BF2= 200.13
##$BF3= 200.13
##$BF4= 200.13
##$BF5= 200.13
##$BF6= 200.13
##$BF7= 200.13
##$BF8= 200.13
##$BYTORDA= 1
##$CFDGTYP= 0
##$CFRGTYP= 5
##$CHEMSTR= <none>
##$CNST= (0..31)
1 1 145 1 1 1 1 1 1 1 1 1 1 1 1 1 1 1 1 1 1 1 1 1 1 1 1 1 1 1 1 1 
##$CPDPRG= <>
##$CPDPRG1= <>
##$CPDPRG2= <>
##$CPDPRG3= <>
##$CPDPRG4= <mlev>
##$CPDPRG5= <mlev>
##$CPDPRG6= <mlev>
##$CPDPRG7= <mlev>
##$CPDPRG8= <mlev>
##$CPDPRGB= <>
##$CPDPRGT= <>
##$D= (0..31)
0 1.2 0 0 0 0 0 0 0 0.06 0 0.03 0 0 0 0 0.0002 0 0 0 0 0 0 0 0 0 0 0 0 
0 0 0 
##$DATE= 1644393254
##$DBL= (0..7)
120 120 120 120 120 120 120 120 
##$DBP= (0..7)
150 150 150 150 150 150 150 150 
##$DBP07= 0
##$DBPNAM0= <>
##$DBPNAM1= <>
##$DBPNAM2= <>
##$DBPNAM3= <>
##$DBPNAM4= <>
##$DBPNAM5= <>
##$DBPNAM6= <>
##$DBPNAM7= <>
##$DBPOAL= (0..7)
0.5 0.5 0.5 0.5 0.5 0.5 0.5 0.5 
##$DBPOFFS= (0..7)
0 0 0 0 0 0 0 0 
##$DE= 6
##$DECBNUC= <off>
##$DECIM= 32
##$DECNUC= <off>
##$DECSTAT= 4
##$DIGMOD= 1
##$DIGTYP= 9
##$DL= (0..7)
0 120 120 120 120 120 120 120 
##$DP= (0..7)
150 150 150 150 150 150 150 150 
##$DP07= 0
##$DPNAME0= <>
##$DPNAME1= <>
##$DPNAME2= <>
##$DPNAME3= <>
##$DPNAME4= <>
##$DPNAME5= <>
##$DPNAME6= <>
##$DPNAME7= <>
##$DPOAL= (0..7)
0.5 0.5 0.5 0.5 0.5 0.5 0.5 0.5 
##$DPOFFS= (0..7)
0 0 0 0 0 0 0 0 
##$DQDMODE= 0
##$DR= 18
##$DS= 0
##$DSLIST= <SSSSSSSSSSSSSSS>
##$DSPFIRM= 0
$$ [...]
##$SUBNAM2= <"">
##$SUBNAM3= <"">
##$SUBNAM4= <"">
##$SUBNAM5= <"">
##$SUBNAM6= <"">
##$SUBNAM7= <"">
##$SUBNAM8= <"">
##$SUBNAM9= <"">
##$SW= 18.0517287032376
##$SWIBOX= (0..15)
0 0 2 0 0 0 0 0 0 0 0 0 0 0 0 0 
##$SW_h= 3612.71676300578
##$TD= 16384
##$TD0= 1
##$TE= 0
##$TE2= 300
##$TE3= 300
##$TEG= 300
##$TL= (0..7)
0 120 120 120 120 120 120 120 
##$TP= (0..7)
150 150 150 150 150 150 150 150 
##$TP07= 0
##$TPNAME0= <>
##$TPNAME1= <>
##$TPNAME2= <>
##$TPNAME3= <>
##$TPNAME4= <>
##$TPNAME5= <>
##$TPNAME6= <>
##$TPNAME7= <>
##$TPOAL= (0..7)
0.5 0.5 0.5 0.5 0.5 0.5 0.5 0.5 
##$TPOFFS= (0..7)
0 0 0 0 0 0 0 0 
##$TUNHIN= 0
##$TUNHOUT= 0
##$TUNXOUT= 0
##$USERA1= <user>
##$USERA2= <user>
##$USERA3= <user>
##$USERA4= <user>
##$USERA5= <user>
##$V9= 5
##$VALIST= <valist>
##$VCLIST= <CCCCCCCCCCCCCCC>
##$VD= 0
##$VDLIST= <DDDDDDDDDDDDDDD>
##$VPLIST= <PPPPPPPPPPPPPPP>
##$VTLIST= <TTTTTTTTTTTTTTT>
##$WBST= 1024
##$WBSW= 4
##$XGAIN= (0..3)
0 0 0 0 
##$XL= 0
##$YL= 0
##$YMAX_a= 763074
##$YMIN_a= -926687
##$ZGOPTNS= <>
##$ZL1= 120
##$ZL2= 120
##$ZL3= 120
##$ZL4= 120
##$ABSF1= 10
##$ABSF2= 0
##$ABSG= 5
##$ABSL= 3
##$ALPHA= 0
##$AQORDER= 0
##$ASSFAC= 0
##$ASSFACI= 0
##$ASSFACX= 0
##$ASSWID= 0
##$AUNMP= <proc_1d>
##$AZFE= 0.1
##$AZFW= 0.1
##$BCFW= 1
##$BC_mod= 2
##$BYTORDP= 1
##$COROFFS= 0
##$CY= 11.3945322036743
##$DATMOD= 1
##$DC= 2
##$DFILT= <>
##$DTYPP= 0
##$F1P= 2.36226072786647
##$F2P= -0.459571619588291
##$FCOR= 0.5
##$FTSIZE= 0
##$FT_mod= 4
##$GAMMA= 1
##$GB= 0.15
##$INTBC= 1
##$INTSCL= 1
##$ISEN= 128
##$LB= 0.24
##$LEV0= 0
##$LPBIN= 0
##$MAXI= 10000
##$MC2= 0
##$MEAN= 0
##$ME_mod= 0
##$MI= 1.114404
##$NCOEF= 0
##$NC_proc= 0
##$NLEV= 6
##$NOISF1= 3.799351
##$NOISF2= 2.8
##$NSP= 1
##$NTH_PI= 0
##$NZP= 0
##$OFFSET= 15.70392
##$PC= 1
##$PHC0= -15874.94
##$PHC1= 10.80078
##$PH_mod= 1
##$PKNL= yes
##$PPARMOD= 0
##$PSCAL= 0
##$PSIGN= 0
##$REVERSE= no
##$SF= 200.130013532006
##$SI= 16384
##$SIGF1= 3
##$SIGF2= 2
##$SINO= 400
##$SIOLD= 16384
##$SREGLST= <1H.CDCl3>
##$SSB= 0
##$STSI= 0
##$STSR= 0
##$SW_p= 3612.71676300578
##$SYMM= 0
##$S_DEV= 0
##$TDeff= 0
##$TDoff= 0
##$TI= <>
##$TILT= no
##$TM1= 0
##$TM2= 0
##$TOPLEV= 0
##$USERP1= <user>
##$USERP2= <user>
##$USERP3= <user>
##$USERP4= <user>
##$USERP5= <user>
##$WDW= 1
##$XDIM= 8192
##$YMAX_p= 0
##$YMIN_p= 0
$$ End of Bruker specific parameters
$$ ---------------------------------
##NTUPLES= NMR FID
##VAR_NAME=  TIME,          FID/REAL,        FID/IMAG
##SYMBOL=    X,             R,               I
##VAR_TYPE=  INDEPENDENT,   DEPENDENT,       DEPENDENT
##VAR_FORM=  AFFN,          ASDF,            ASDF
##VAR_DIM=   8192,          8192,            8192
##UNITS=     SECONDS,       ARBITRARY UNITS, ARBITRARY UNITS
##FACTOR=    0.0002768,     1,               1
##FIRST=     0,             0,               0
##LAST=      2.2672688,     0,               0
##MIN=       0,             -926687,         0
##MAX=       2.2672688,     763074,          0
$$ Real data points
##PAGE= N=1
##DATA TABLE= (X++(R..R)), XYDATA
$$ [...]
2611B193k129k106j458R3J875K089J762J174o64j816k431j478l63J032K179K025
$$ 2193 64 -2042 -3500 -3407 -1532 557 2319 3493 2829 1013 -1418 -2896 -3259 -2227 -48 1977
2627A977J240J84j719k563j884p29Q17J877K490J727Q8j239k179k352j095L30
$$ 1977 3217 3401 1682 -881 -2765 -3494 -2677 -800 1690 3417 3505 2266 87 -2265 -3360 -3030
2643c030J459K541J969O09o95k234k627j275O2J100K529K091J080o22j684k434
$$ -3030 -1571 970 2939 3548 2853 619 -2008 -3283 -3221 -2121 408 2499 3579 2957 1273 -1161
2659a161j847n46R03K489K084J408j7j498k380j972j166N16K061K537J763J9n62
$$ -1161 -3008 -3554 -2651 -162 1922 3330 3313 1815 -565 -2537 -3703 -3187 -1126 1411 3174 3193 2631
2676B631k548k337j195O4J671K289K235P12m68k032k369j879l73J210K455K067
$$ 2631 83 -2254 -3449 -3385 -1714 575 2810 3522 3054 1022 -1347 -3226 -3599 -2389 66 2133
2692B133J244k48j625k322k199p82P70K198K443J586K06j048k258k563r87J10
$$ 2133 3377 3129 1504 -818 -3017 -3799 -3029 -831 1612 3198 3404 2356 98 -2465 -3452 -3342
2708c342J722K887J931N37r08k131k552j913L93J272K435K348Q01j23j925k369
$$ -3342 -1620 1267 3198 3735 2827 696 -1856 -3769 -3376 -2104 331 2679 3480 3357 1432 -937
2724i37k319l11J078K048K614J014Q3j130k675k358o90L77J656K924J918N31j153
$$ -937 -3256 -3567 -2489 -441 2173 3187 3270 2140 -535 -2893 -3583 -3206 -1550 1374 3292 3823 2670
2741B670k516k504j262L27J076K894K287O76p89k148k221j742l20J383K184K190
$$ 2670 154 -2350 -3612 -3285 -2209 685 2972 3648 2859 711 -1510 -3252 -3572 -2189 -5 2185
2757B185J284l04j394k481k094j156R89K256K182J853L17j578k227k311j411M86
$$ 2185 3469 3165 1771 -710 -2804 -3960 -2971 -715 1467 3320 3637 2059 -168 -2479 -3890 -3404
2773c404J973K481K059O51r66k188k273k035R1J506K374K443Q77l79j853k513
$$ -3404 -1431 1050 3109 3760 2794 606 -1667 -3702 -3611 -2105 269 2712 3589 3210 1357 -1156
2789a156k170m91J282K093K585J629k18j516k258k264j280P01J760K576K236K66
$$ -1156 -3326 -3817 -2535 -442 2143 3772 3554 2038 -220 -2484 -3764 -3063 -1303 1273 3509 3775
2805C775r75k406k530j721K95J810K406K305J107j101k081k483j968k51J276K551
$$ 3775 2800 394 -2136 -3857 -3562 -1752 654 2959 4066 2965 884 -1599 -3567 -3818 -2542 9
2821IK204J671o88j650k388k095j012R76K110K566J925P8j201k603k523j162K90
$$ 9 2213 3884 3196 1546 -842 -2937 -3949 -2973 -863 1703 3628 3706 2505 -98 -2621 -3783 -3493
2838c493K102K737J693O48p72k074k979j781M41J375K549K058J291n99k178k595
$$ -3493 -1391 1346 3039 3687 2915 841 -2138 -3919 -3478 -2103 446 2504 3795 3196 1018 -1577
2854a577j851l10J231K091K513J946k85j766k677k218j044M44K296K854J816K59
$$ -1577 -3428 -3738 -2507 -416 2097 4043 3758 1992 -685 -2903 -3947 -3503 -1207 1647 3463 3722
2870C722j022k657k135j623J4J983K276K622P33r58j925k591j898k91J248K379
$$ 3722 2700 43 -2092 -3715 -3701 -1718 558 3180 3913 2955 1030 -1561 -3459 -3750 -2502 -123
2886a23K493J422k37j876k830j976q54P89K480K333J805L78j517k392k470j023
$$ -123 2370 3792 3555 1679 -1151 -3127 -3981 -3192 -712 1621 3426 3804 2287 -105 -2575 -3598
2902c598J02K007K732J732R58q68k418k473j921j16J781K309K723R31o81j588
$$ -3598 -3496 -1489 1243 2975 3933 3065 647 -1826 -3747 -3863 -2082 227 2950 3881 3200 1612
2918A612k903j759q46J132K504K097J949m2j519k572k383j145N58K080K797J994
$$ 1612 -1291 -3050 -3896 -2764 -260 1837 3786 3744 2225 -347 -2730 -3875 -3317 -1237 1560 3554
2934C554L89j418k139k648j445J5J834K392K073J415q00k248k799j738k14J419
$$ 3554 3943 2525 386 -2262 -3707 -3692 -1858 534 2607 4022 3222 974 -1825 -3563 -3777 -2358
2950b358K005K701J427k40j762k839k118q84P61K581K738J570L71j551k504k397
$$ -2358 -353 2348 3775 3535 1773 -1066 -3184 -4068 -3307 -726 2012 3582 3953 2402 -102 -2499
2966b499j406K32J895K901K056P49j249j982k696j628j50J531K521K708J239p55
$$ -2499 -3905 -3673 -1778 1123 3179 3928 2679 697 -1999 -3627 -3777 -2246 275 2983 4222 3467
2982C467k302k663j769p02J179K335K742J566N0j867k633k404j071R48J840K737
$$ 3467 1165 -1498 -3267 -3969 -2790 -455 2287 3853 3903 2036 -597 -3001 -4072 -3124 -1284 1453
2998A453K153M97j293k555k623j303L8J832K606K181R69o97k253k580k094j68
$$ 1453 3606 4103 2810 255 -2368 -3671 -3633 -1801 805 2986 3955 3258 1005 -1575 -3669 -3837
3014c837J311K752K419J378k61j941k651k182j129R28K255K485K225k2j314k516
$$ -3837 -2526 226 2645 4023 3762 1821 -830 -3012 -4141 -3213 -958 1527 3752 3730 2416 -100
3030a00k371j410J79K392K508K058Q25j221k370k600j480K16J137K715K392J184
$$ -100 -2471 -3881 -3702 -1310 1198 3256 4081 2860 490 -2110 -3590 -3374 -2237 478 2870 4054
3046D054l80k403k610k283m15J228K337K381J837k3j611k812k130j104L93K316
$$ 4054 3674 1271 -1339 -3622 -4037 -2809 -472 1909 3746 3723 2112 -700 -2830 -3934 -3541 -1225
3062a225K980J928N8j021k648k519j224j00K110K585J942J198r93k448k215k048
$$ -1225 1755 3683 3741 2720 72 -2447 -3671 -3771 -1661 924 2866 4064 3071 623 -1592 -3640
3078c640j54J267K712K518J431o49j912k573k172r17R53K574K427J923Q5j731
$$ -3640 -3794 -2527 185 2703 4134 3485 1573 -1000 -3172 -4089 -3136 -562 1865 3788 3873 2142
3094B142k589k147j431O80K028K522J886Q65j080k333k552j516j13J443K451K608
$$ 2142 -447 -2594 -4025 -3345 -1317 1205 3091 3956 2876 543 -2009 -3525 -3638 -2195 256 2864
3110B864J011o28k015k442k134n35J223K325K542J676m35j639k437k306j100Q73
$$ 2864 3875 3247 1232 -1210 -3344 -3879 -2656 -331 2211 3887 3452 1813 -624 -2930 -4030 -3157
3126c157K266K690J629M61j349k268k698j333K62J798K534J963J271j083k153
$$ -3157 -891 1799 3428 3889 2540 272 -2426 -3759 -3497 -1699 835 2798 4069 2986 833
3141H33k749j505j24J184K437K289J601m47j918k801j981q12J076K172K651J781
$$ 833 -1916 -3421 -3545 -2361 76 2365 3966 3519 1601 -1200 -3181 -3993 -2917 -745 1906 3687
3157C687p0j365k517k470j065M88J896K408K073Q62j382k064k290j831J7J643
$$ 3687 3617 2252 -265 -2735 -3800 -3312 -1416 992 3065 3927 2545 481 -1809 -3640 -3623 -1980
3173a980K633K221J096o28k314k417k167l57J495K215K780J124j36j419k913k193
$$ -1980 653 2874 3970 3342 1028 -1389 -3556 -3913 -2418 -203 2577 3701 3565 2146 -767 -2960
3189b960p49M50J880K696K077M15j535j880k939j083O7J869K716J882Q91q15k185
$$ -2960 -3709 -3259 -1379 1317 3394 3809 2274 394 -2545 -3628 -3561 -1692 1024 2906 3797 2982 797
3206G97k369k046j01J714K385K264J017l21k019k425k341n45J215K284K537J600
$$ 797 -1572 -3618 -3719 -2005 380 2644 3661 3340 1321 -1104 -3445 -3990 -2775 -491 2046 3646
3222C646R4j369k827k326j057K98K109K790K202K36q50k379k553j440k21J421
$$ 3646 3740 2371 -456 -2782 -3839 -3541 -1432 1358 3560 3796 2946 567 -1986 -3426 -3647 -2226
3238b226K760K252Q89n92k198k258j907n40J402K257K587J325k96j893k364k204
$$ -2226 534 2786 3675 3083 885 -1373 -3280 -3820 -2418 -161 2426 3751 3455 1562 -802 -3006
3254c006p99R40K251K479J583N3j097k419k530j235K06K040K423K113R36j153
$$ -3006 -3805 -2865 -614 1865 3448 3501 2404 -15 -2545 -3780 -3574 -1534 889 3002 3938 2785
3270B785k251k281j851j27J262K669K063J703r90j725k333j838p90R06K247K468
$$ 2785 534 -1747 -3598 -3725 -2463 206 2269 3972 2982 1257 -1076 -2914 -3704 -2798 -551 1917
3286A917J516L15j676k342k278j072M39J982K312J838R07j296k232k331j473M3
$$ 1917 3433 3748 2072 -270 -2548 -3620 -3181 -1199 1113 2951 3858 2562 330 -2001 -3474 -3431
3302c431J482K472K159Q68n57j943k730j385o75J182K267K627J467m11j572k447
$$ -3431 -1949 523 2682 3550 2993 1050 -1680 -3065 -3740 -2558 -291 2336 3803 3392 1820 -627
3318f27k219q69P88K054K532J509L22j143k328k327j408L75J792K510J867Q78
$$ -627 -2846 -3715 -2927 -873 1659 3168 3490 2347 19 -2308 -3716 -3341 -1549 961 2828 3706
3334C706q71k069k542j512k61J265K450K355J037k57k014k087k180n33R14K130
$$ 3706 2835 766 -1776 -3288 -3549 -2284 166 2521 3558 3301 1287 -800 -2980 -3513 -2599 -469
3350d69K483J494j20j427k174k279j179N07K073K400J885M45j202k222k466j592
$$ -469 2014 3508 3388 1961 -213 -2492 -3671 -3164 -1091 1309 3194 3639 2437 215 -2251 -3843
3366c843L73J617K444K088J107p07k007k548j689l57J212K312J873J662m7j927
$$ -3843 -3470 -1853 591 2679 3786 3079 1072 -1476 -3165 -3522 -2310 2 1875 3537 3490 1563
3382A563k315j840o03N73J833K540J544K17j529k339j883j280J54K061K351K038
$$ 1563 -752 -2592 -3195 -2622 -789 1751 3295 3512 1983 -356 -2239 -3519 -3365 -1304 1047 3085
3398C085M89n91k409k524j454k58J659K364K135R27k65k159k095k092n99J171
$$ 3085 3574 2983 574 -1950 -3404 -3662 -2003 361 2496 3423 3158 999 -1096 -3188 -3787 -2616
3414b616K262K450J464k52j329k535k096j075P79J987K447J504L55j040k085k469
$$ -2616 -354 2096 3560 3308 1979 -556 -2652 -3727 -2948 -961 1486 2990 3345 2305 220 -2249
3430b249r45KJ554K411J938N63o06j893k318j617k49J218K154K378J323o63j595
$$ -2249 -3194 -3192 -1638 773 2711 3274 2668 775 -1543 -3160 -3409 -2191 -37 2341 3664 3001 1406
3447A406k326j792p48O82J932K554J401K80j338k246k429p74J82J734K535J896
$$ 1406 -920 -2712 -3460 -2778 -846 1708 3109 3389 2051 -195 -2624 -3398 -3216 -1482 1053 2949
3463B949K77n93k136k363j454K44Q29K455K303Q39l16k124j873j935k57O14K430
$$ 2949 3226 2633 497 -1866 -3320 -3076 -2247 208 2511 3350 3034 910 -963 -2898 -3155 -2541 -111
3480a11J964J369J16j697k090j874j165P63J947K063J831Q1j080k059j876j420
$$ -111 1853 3222 3338 1641 -449 -2323 -3488 -2725 -778 1285 3116 3197 2117 58 -1818 -3238
3496c238P0J759K059J962Q81p75j744k494j537k97J257K162K095J082k00j645
$$ -3238 -3168 -1409 650 2612 3493 2718 974 -1520 -3057 -3354 -2097 65 2160 3242 3042 1397
3512A397k318j868n64Q68J942K068J520j05j212k173j756j202P89J465K067J724
$$ 1397 -921 -2789 -3353 -2485 -543 1525 3045 2940 1728 -445 -2201 -3403 -2614 -1149 918 2642
3528B642M26p06k262j770j290k44J414K079K073Q55o06j415k205j848k34N58K520
$$ 2642 3068 2362 100 -1670 -2960 -3204 -1790 289 2362 3217 2611 1196 -1009 -2857 -3091 -2533 -13
3545a3K297R05l16j386k134j834p89M88J692K527J326M21j220j632k200j573O13
$$ -13 2284 3189 2873 1487 -647 -2481 -3270 -2782 -1090 1437 2763 3184 1964 332 -1868 -3441 -2828
3562b828J426K104J945N40p47j726k183j485l6Q97J954K074J151m05j569j954
$$ -2828 -1402 702 2647 3187 2440 714 -1469 -2954 -2990 -2093 -139 1935 3086 2681 1112 -842
3578h42j722n30N79K025K232J283J26j265k229j632j081L92J592K257J548M12
$$ -842 -2564 -3094 -2515 -490 1742 3025 3151 1886 -343 -1975 -3056 -2664 -1072 1185 2733 3145
3594C145j067j668k153j298LJ288K193K008O83m87j695k030j757J6Q19J606K247
$$ 3145 2078 410 -1743 -3041 -3038 -1750 443 2451 3134 2647 952 -1078 -2835 -2819 -2000 -394 1853
3611A853J215J8j565k198j826l32K41J893J974J101O56j084j899k172o86J26J432
$$ 1853 3068 3086 1521 -677 -2503 -2835 -2594 -701 1273 2374 3030 1946 47 -2125 -2811 -2685 -1253
3628a253K154J464N69n25j880j925j521J2J350J735J730J117m18j500j777j616
$$ -1253 901 2365 2934 2409 529 -1396 -2917 -2905 -1555 180 1910 3027 2609 1109 -668 -2284
3644b284q38R30J845J675J421o3r19k053j934p57L78J506K115J578L25r94k048
$$ -2284 -3122 -2192 -347 1328 2749 2686 1767 -286 -2220 -2977 -2599 -1093 1022 2600 2925 1931 -117
3661a17j522j141O7J459J926J569Q23o90j696j875j479j11P97K043J796J109n73
$$ -117 -1639 -2780 -2713 -1254 672 2241 3064 2374 678 -1197 -2676 -2787 -1990 53 1849 2958 2385
3678B385r84k192j372o39O90J523J940J304R7q19j968j856q54J13J270J962J680
$$ 2385 1401 -791 -2163 -2802 -2112 -589 1351 2655 2752 1933 -35 -1891 -2745 -2632 -1362 600 2280
3695B280L52l84j495j911j475K7J254J712J673O82l72j537j968j221l17O73J899
$$ 2280 2632 2248 753 -1158 -2633 -2606 -1352 360 2033 2715 2343 806 -1162 -2383 -2700 -2027 -128
3712a28J717J034Q7j260j945j376q93M74J535J824J454J59p20j875j850p90OJ189
$$ -128 1589 2623 2710 1450 -495 -1871 -2764 -2290 -755 1069 2523 2682 1962 87 -1763 -2553 -2547 -1358
3730a358K018J492M66l73j465k035j205m07J002J966J374J120J58j599j703j825
$$ -1358 660 2152 2618 2245 780 -1255 -2460 -2867 -1865 101 1475 2595 2753 1154 -549 -2374
3746b374m43O62J580J843J298J1r27j909j364j020K22J527J814J492L04p64j729
$$ -2374 -2817 -2155 -575 1268 2566 2577 1650 -259 -1623 -2643 -2421 -894 920 2412 2716 1952 223
3763B23j589j244K06J099J599J582O93k68j324j908j206n55P72J678J847R80k05
$$ 223 -1366 -2610 -2404 -1305 294 1876 2569 2301 977 -931 -2137 -2692 -1920 -242 1605 2585 2380
3780B380j219j466j591q38L94J421J769J443K90j053j388j872r53L82J106J598
$$ 2380 1161 -305 -1896 -2734 -2340 -919 850 2293 2583 1530 142 -1730 -2683 -2301 -1195 403
3796D03J559Q06j143j156j748r20l12J130J594J593P59k98j309j826j318m80J039
$$ 403 1962 2768 1625 469 -1279 -2199 -2511 -1381 213 1806 2565 2267 958 -868 -2186 -2666 -1627
3813a627J250J683J114R4j182j621j300r84N24R85J937J185M52p40j660j351q40
$$ -1627 -377 1306 2420 2514 1332 -289 -1589 -2573 -2049 -1064 873 2058 2510 1770 110 -1241 -2081
3830b081k37J000J633J677N44m81j403j438j276k12Q08J402J560R30j05j270j717
$$ -2081 -2318 -1318 315 1992 2536 2055 652 -786 -2062 -2274 -1466 -64 1496 2426 2321 1051 -666
3847f66j423k89O64J121J581J305j44n97j509j589o74J48J008J541J539K93o08
$$ -666 -2089 -2378 -1714 -593 988 2293 2149 1552 43 -1546 -2220 -2072 -1064 477 2016 2309 1701
3864A701j390j522r57j09P73J754J436N52qj437j458j368m51O88J576J315Q92
$$ 1701 311 -1211 -2168 -2277 -1504 250 1686 2238 2230 793 -665 -2033 -2484 -1796 -220 1095 1987
3881A987L13p80j928j195j029N49J520J580R55L39p56j420j308j155R5J111J416
$$ 1987 2300 1520 -408 -1603 -2632 -2083 -563 1017 1972 2311 1555 135 -1173 -2328 -2233 -1122 294
3898B94J460Q21p52j379j627n86o15O92J596J375P57n6j137j262j527l45N40J009
$$ 294 1754 2575 1823 444 -1183 -1769 -2384 -1692 -96 1279 2036 1980 843 -419 -1946 -2291 -1751 -742
3916g42J598J128J80q16j275j570p11J07J498J352J094K44m96j286j476j005O8
$$ -742 856 1984 2164 1348 73 -1497 -2208 -2101 -603 749 1843 2087 1591 305 -1171 -2176 -2108
3933b108J021J386J182P38l87j053j537j349J25N69J074J761O56L5j096j101j590
$$ -2108 -1087 299 1481 2219 1832 779 -758 -2107 -1982 -1413 -339 1422 2078 2113 1017 -84 -1674
3950a674p02N91J010J729R86M20r67j337j192j030K79P29J579J152M07j87j504
$$ -1674 -2376 -1785 -775 954 1940 2360 1393 56 -1136 -2166 -1887 -1158 421 1573 1980 1793 289
3967B89j400p23l4P10J069J625M33m86o08j649q39o53P21J249J372Q27Q4j041
$$ 289 -1111 -1834 -1868 -1158 -89 1536 1969 1483 875 -774 -1613 -2266 -1545 -296 1076 1903 1987 946
3985I46r77j467o39L28J229J319R95K96p06j243j079r17o5J090J186J286M48k06
$$ 946 -31 -1498 -2137 -1809 -580 739 1734 2030 1324 81 -998 -1915 -1980 -890 296 1582 2030 1824
4003A824j020j658r28j22O48J115J366O96k27q44j026j361n71N06J263J255P50
$$ 1824 804 -854 -1782 -1904 -1256 -141 1225 1921 1694 850 -176 -1537 -2108 -1602 -339 916 1666
4020A666K27n28j469j275m23j4Q78J465J358K88o62j231j256p74j68Q99J280R79
$$ 1666 1893 1365 -104 -1379 -1802 -1816 -938 527 1885 2173 1511 280 -976 -1750 -1918 -1019 261 1240
4038A240K24J76p76j318j379J2K90J440J030R41j88q02j188r45k61j65R58J329
$$ 1240 1464 1640 864 -454 -1833 -1821 -1531 -91 939 1880 1692 890 -298 -1243 -1504 -1669 -711 618
4056F18J186J03o21j053j455n43K23Q45J043J302J60k79j236r82j025M0M94R03
$$ 618 1804 1907 1286 233 -1222 -1765 -1542 -697 346 1648 1808 1529 293 -689 -1714 -1674 -1180 -277
4074b77J472M08M1q56j231r77k10K06J198J043J149j73p21q70j394o68L19R79
$$ -277 1195 1603 1644 788 -443 -1420 -1630 -1424 -226 817 1966 1793 1072 202 -1192 -1860 -1541 -562
4092e62J044R41J23m10j096r52o16j19P65R93J173N26k97j006j263o21m20P13
$$ -562 482 1423 1546 1136 40 -912 -1528 -1647 -882 111 1284 1810 1513 507 -756 -1377 -1797 -1084
4110a084R29R30P64M9q60r19q89o52L84N92J226R13K06n20j159j014n34L0R60
$$ -1084 -155 775 1539 1588 728 -191 -1080 -1732 -1348 -756 470 1383 1589 1069 -90 -1104 -1638 -1608 -648
4129f48J193P61J66k75p63j234p01m6M52R22J211O41l84q10j083q88l53Q69Q19
$$ -648 545 1306 1472 1197 434 -800 -1501 -1547 -1095 -173 1038 1679 1295 485 -598 -1486 -1839 -970 -151
4148a51J108P30o8p31r42j123o19O12M19J396N63K37o61n63j041p19L8P31R09
$$ -151 957 1687 1619 888 -54 -1177 -1796 -1184 -765 631 1194 1431 770 207 -834 -1553 -1515 -784 125
4167A25J159L35n41o43j095o93k70O92Q10J051N22j7p31j065r67j08K52R67Q22
$$ 125 1284 1619 1078 435 -660 -1353 -1623 -931 -121 930 1452 1435 704 -361 -1328 -1436 -1184 -217 605
4186F05O71J12m72r49q46m81L7Q67R37O91P2l11p78j071l00j08L82Q61J080O38
$$ 605 1276 1388 916 -33 -879 -1360 -1323 -456 481 1172 1244 933 155 -916 -1216 -1324 -942 -81 999 1637
4206A637m30o47j296n64k7J65J143Q79N44N2q19r58p48m34M01P03J081M70L6j56
$$ 1637 1207 560 -736 -1300 -1327 -1162 -19 860 1404 1456 637 -321 -1069 -1503 -1102 -399 682 1152 1188 1032
4226A032q58r61o74K4J100O88O50O01m93q89q78n55LN77P50M42N90J11q57p46
$$ 1032 174 -787 -1461 -1437 -337 351 1001 1602 1109 220 -658 -1213 -1210 -633 117 559 1149 1260 403 -343
4246c43o09m37L74P01R67O83j8o18q17r44m33M56P03P60P31J92l11j052p36m32
$$ -343 -952 -1389 -1015 -314 653 1336 1318 700 -117 -1061 -1494 -1038 -335 425 1156 1348 1037 -15 -751 -1183
4266a183rM85Q93P56L04j40n09j112p12m3L29J039N15P01k22m67p70p87l18QJ051
$$ -1183 -1192 -707 186 942 1246 1106 597 -515 -1227 -1270 -941 98 613 1314 1092 625 -145 -932 -1250 -1242 -191
4287a91O78Q58J5m96p69p67p32K99P12N49P89M38o09m81r36l05l25N62O86N72
$$ -191 487 1345 1360 864 95 -672 -1404 -1105 -393 156 945 1383 774 293 -643 -948 -1273 -711 -25 547
4307E47P07j70o83p18o03k12K63O35J056L20l44j80j033n80O7q0O06Q40L73M80
$$ 547 1254 1084 401 -317 -920 -1132 -869 -234 822 1142 798 618 -415 -995 -928 -1008 -402 438 811 1291
4327A291o18n50p22n47K29L60P92N35N20m70n86p26n66J59J45P57O38N51k52o22
$$ 1291 673 123 -599 -1146 -917 -557 235 770 1290 820 234 -492 -1058 -899 -754 3 641 1192 940 318
4347C18m23q28k33K87M31J122O2N26p66n12o99l61J51P70Q99K37J34l38n03r88
$$ 318 -105 -933 -1166 -879 -448 674 736 1262 496 -16 -715 -1076 -925 -155 744 981 1115 777 274 -714
4367g14j35k02M01P48P07K37l05n34o55l29j58K42O41P11L33l01M4q12p15L0Q2
$$ -714 -849 -1051 -650 98 805 1042 737 203 -452 -781 -939 -697 -56 655 988 687 731 -81 -796 -766 -684
4388f84L40O24O11r2l27n82m98j44P6L63Q30K54J90l01m77p00m45NL68N27O14
$$ -684 -344 280 891 799 472 -110 -608 -752 -676 -313 517 771 961 660 183 -517 -962 -957 -589 -62 552
4409E52N54m19l89o84m63J19Q7Q61M24K99j72m13m85m78l60K10N63P32L27j9q8
$$ 552 1106 687 298 -386 -849 -730 -643 218 642 941 769 356 -129 -607 -967 -757 -194 538 865 846 758
4430G58r30k90l80n9O91M51M62J36l66m37l96q26K02L57N84N12K74R0p20m94m56
$$ 758 -172 -462 -842 -901 -210 241 703 839 473 36 -360 -1186 -984 -627 -43 469 743 833 113 -381 -837
4451h37j95N96P56J55K09n5n9r45j54l04J61K64Q12N03j25n18J41j003k05j55
$$ -837 -1032 -436 320 475 684 629 570 -375 -529 -833 -672 -408 404 907 782 264 405 -598 -803 -958
4471i58N40N59O57K37k81p14l36m16O8J05L70O67J84L6p81o9m79p7K35N30M72
$$ -958 -418 141 798 1035 754 40 -296 -712 -644 -539 -169 498 682 718 -63 -132 -611 -688 -453 77 549
4492E49M27l86j50m67n66l2j55O39K72L84K76l31m03l39m91O1J72M91O05L23l70
$$ 549 976 590 440 -27 -593 -625 -780 -141 131 515 791 460 57 -282 -773 -712 -540 -49 556 879 509
4513E09l63m22m92L3L31K45M06O24k36m80j20o89j02Q5M60K76Q01M2l28n25l70
$$ 509 146 -276 -768 -735 -404 -159 247 871 635 155 35 -654 -756 -671 -211 65 866 908 580 55 -315
4534c15l89m0N46K8O27J43l22j51o48J0j04J97M06K29O06oo25o17j08p4p8Q64
$$ -315 -704 -744 -198 -170 457 600 278 127 -521 -511 -615 -418 -12 217 823 817 192 -425 -533 -607 -685 179
4556A79K6L82j50j89n70j96l57L09K33N31L94Q7l34l40m16k01L07k41O73L08J08
$$ 179 205 587 437 248 -322 -518 -875 -566 -333 198 592 679 345 5 -411 -612 -305 -546 127 435 543
4577E43j03l47l00k45j79J27P96K75QJ32n46m64o25J57K88N41P4N26K6l40n80
$$ 543 440 93 -207 -452 -631 -504 292 567 575 707 161 -303 -928 -771 -483 58 132 658 684 344 -236
4598b36l94j48K74K21M49K40L49l96l91k24k42m6M72L21K43L1j70l03m91r3M5
$$ -236 -630 -778 -504 -283 166 406 755 359 -32 -256 -498 -544 -72 249 492 523 353 50 -441 -534 -489
4619d89J32N77M7M98l81l26q9m80J43n4M88L58L85k02m91m64k08L6J44J84N89
$$ -489 -357 220 267 765 384 58 -31 -511 -368 -422 66 424 809 607 116 -348 -556 -520 -376 -192 397
4640C97J51P3l97k25n57J17M0j53M84N41L9l64p0n15L2MJ14O19JK29n4n83J49
$$ 397 548 621 224 -1 -558 -441 -401 -554 -70 471 510 146 76 -439 -407 -403 -289 330 331 560 506 -77 72
4663G2q18L90J61J65M17M0j08m4n50n1m49L12L51L49L11O2j27p35j37j42m2K58
$$ 72 -746 -356 -195 -30 387 427 319 275 -275 -326 -775 -463 -112 237 548 610 483 -252 -389 -531 -573 -315
4685c15N28L99R4l05k30m74k39R5q0L47N20J92j58j05n77Q2k07o1N49K09L15m4
$$ -315 213 612 706 401 171 -303 -542 -447 -527 -180 340 532 374 269 -308 -226 -433 -494 55 264 579 535
4707E35j55k77o23K6J7K53O20P3P1K8n55l34j47P6K66J21L10J27J86l57o17m13
$$ 535 380 103 -520 -494 -477 -224 396 469 540 568 13 -321 -468 -392 -126 -5 305 432 618 261 -356 -769
4729g69L61J25M08J85J43j91p6m45l56N3M24r8N12j3O8J91n28n00M2lM17L8O24
$$ -769 -408 -283 125 310 453 262 186 -259 -615 -562 -138 -236 276 263 331 522 -6 -506 -464 -467 -50 -12 612
4752F12q5k18k26k46j44N4l6L02M70J60j67m03l13j36o9RM16N21k66K41l36j29
$$ 612 527 309 83 -163 -307 -253 -289 13 483 643 476 73 -240 -376 -445 -436 -20 501 235 476 140 11
4774A1l15k24L73R6K04K81n8k27J39q69K21j40K32M97J66lK76o38m17k43Q0K18
$$ 11 -304 -528 -155 -59 145 426 368 141 280 -589 -368 -508 -276 221 387 384 660 22 -395 -638 -558 -340
4796c40L73J75L07j74m17k06j92l9J20L57M16L03l68N4m77j92o4K23L55n2K36
$$ -340 33 208 515 341 -76 -282 -474 -513 -393 -36 380 683 315 369 -108 -300 -364 -141 214 162 398
4817C98n8l1k03m30j8J17K14L87k8m5l19J0l01j61J83R6K42K17N8Om86r8j0k08
$$ 398 340 309 106 -324 -342 -225 -11 376 348 303 -16 -6 -307 -468 -285 -189 53 270 328 334 -152 -250 -260 -468
4841d68R4K59L41L74k15l14l01k13P8J09K63J86K51M5l18k70k28j10M7M28m1K42
$$ -468 -374 -115 226 600 385 71 -230 -443 -365 -256 7 193 444 489 171 -99 -327 -437 -390 38 -3 239
4863B39L7J36n48k05J08p7K4K93J93J46j56k34k74K1r2J73Q6O04k13N7o0m79j22
$$ 239 276 412 -136 -341 -233 -310 -286 7 200 346 190 -44 -318 -297 -389 -216 -130 474 261 318 258 -221 -343
4886c43j40N48P0J82J51j73k56k62K2l63N2N01q5O38k28K6l2p27j20K99o9N95
$$ -343 -483 65 135 317 468 295 39 -223 -201 -564 -512 -11 -96 542 314 340 308 -419 -539 -240 -309 286
4908B86Q2o3Ql52k20j35Q9N7K83K74j86J98k74k56k33N1J89J35N08j2j51j07l76
$$ 286 368 305 313 -39 -259 -394 -305 -248 35 309 123 321 47 -209 -442 -391 -202 -67 441 429 278 171 -205
4931b05m8o7L5K34K13K89k7r8l03l22j15J54K83L48J28K5n5l35n74N8J7M02q5
$$ -205 -253 -320 -285 -51 162 451 424 326 23 -299 -414 -260 23 371 499 524 469 134 -440 -382 -365 37 -48
4954d8L56K51m73k87j8k09J51O1M42R5J21q1K9k48l00j81R0J33K61J96O9j06l00
$$ -48 308 559 86 -201 -219 -428 -277 -216 226 321 442 361 390 142 -158 -339 -249 -116 145 341 410 304 4
4977Dm39L3K06L4K58M5L70k94j20r6k45j72K25L19J37J33j82j89Nl03j20J09N08
$$ 4 -435 -402 -196 -162 96 141 511 217 97 1 -244 -416 -191 128 265 398 216 27 32 -271 -391 -282 226
5000B26K1K82j12k72o8l76n7K29j4L66J64Q9r1l16m75r0J68K43L63J66K90l50
$$ 226 247 529 417 145 77 -299 -356 -127 -141 225 389 478 387 71 -404 -494 -326 -83 280 446 736 386
5022C86j79m75J38j54K59P7M46r0k29j58m14l9K69J7J95N3M25k18k92j95N2j39
$$ 386 207 -268 -130 -284 -25 52 498 408 179 21 -393 -432 -163 -146 49 102 527 309 17 -178 -126 -265
5044b65p9M83K14nj93p4r5l84j36K20M40J23J48j47J45j77m38J05k09k7N51M0
$$ -265 -344 139 353 348 155 81 -14 -398 -534 -314 126 249 397 250 395 218 -220 -115 -324 -351 200 240
5066B40J67Kl67k49l0j27J84J49M63K08r8m10m00P9j32j32J66L32J97J97k89k86
$$ 240 407 409 42 -207 -237 -364 -180 -31 432 640 542 132 -268 -189 -321 -453 -287 45 242 439 150 -136
5088a36k65N6r9M20Q0M47l0R7l64l87J1l73K57K56O13j66j57n53j54L20n27M30
$$ -136 -401 -345 -444 -24 56 503 473 570 206 -181 -170 -543 -286 -30 583 417 260 -293 -447 -127 -654 -224
5110b24J09K73K2M2Qm64p1k21L9N12J15K61R5k68k47j15m97L7J88P59Q7r1p9l41
$$ -224 -115 158 180 222 230 -234 -305 -526 -487 25 140 401 496 228 -19 -134 -631 -594 -406 353 440 349 270 -71
5134g1j09j04L7R1L3L92K19o7j16l22k03l93K70K11K20K70Q6k17j78n18Q9O5K33
$$ -71 -180 -284 -247 -156 -123 269 488 421 305 -17 -220 -613 -343 -132 88 358 444 227 49 -469 -380 -315 -82
5157h2K04J77J63k41j52k58l79OL70K15M87N1L3n69l56L0k8j09N15R0L87l09p9
$$ -82 122 299 462 221 69 -189 -568 -562 -192 23 510 561 594 25 -331 -301 -329 -438 77 167 554 245 166
5180A66j52m99K8k6L26M12P5J79m27j6k59j98j28N93L67m3R8n00N2k02j79j58
$$ 166 14 -485 -457 -483 -157 255 330 509 82 66 -193 -391 -519 74 441 398 496 -4 48 -154 -333 -491
5202d91O4N59J95%l0k28l62k65K42l63J032j30K56Rn2l63m04o5K5M86O7M43j98
$$ -491 -427 132 327 327 297 69 -293 -558 -316 -679 353 223 479 488 436 73 -331 -396 -371 115 182 625 427
5225D27j59k71j30l86K16K15K99L15p9l34L8k16l28m5K81M14K15r1J8k06n17k14
$$ 427 268 -3 -133 -519 -303 -88 211 526 447 113 151 -65 -393 -438 -157 257 472 381 399 193 -324 -538
5247e38L75J95P2Q8K60K57k60o64p9Rk35N03J58M87o5j26o17l99N3K84LN55J27
$$ -538 -163 32 104 192 452 709 449 -215 -294 -285 -520 -17 141 628 563 437 -180 -579 -526 -242 -239 316 443
5270D43J04q9l62j9p15K75K2J97M71K7m4j43l61m11K24J6K91K49K17j06K4l28
$$ 443 547 458 96 77 -638 -363 -341 -144 327 354 310 167 -194 -605 -381 -365 -74 175 392 286 310 -18
5292a8m55l3J38L37J22M22K2l00m40pm53J22N18Q0M67L6j12k60o06j80Q1m2M47
$$ -18 -473 -506 -368 -31 91 513 535 235 -205 -212 -665 -543 -25 55 522 558 446 186 -420 -600 -519 -561 -114
5315a14O83j60No9m46M6p59N12J47K55M09K55m20m67j49j96K62k0M97j04K66M2
$$ -114 569 409 414 345 -101 -55 -814 -302 -155 100 509 764 344 -123 -272 -468 -206 -226 271 167 433 475
5337D75m47k24l83K76j52N37N0K05J23l98l11k37Q6j4M58R2M48j51n0o96O2l99
$$ 475 28 -196 -579 -303 -455 82 132 337 460 62 -249 -486 -400 -414 44 136 584 433 383 -313 -251 -650
5359f50M3P11R3J72L34n43j41j43m41j10M80M21J46Q7j74j26m64k75K47P7L19
$$ -650 -607 104 197 369 703 160 19 -124 -565 -675 -195 226 372 459 285 159 -305 -580 -333 -256 63
5380F3N06J16l94rk00m06K8j79L71L65J95J12l26m34j91j43L12j57M94K76N1n0
$$ 63 569 685 291 282 82 -324 -296 -475 -104 261 456 568 242 -192 -383 -526 -214 -371 123 399 450 400
5402D00j75n94k7k21L35K48L03K27j33J6l34n90R4K13L36J21J60L99n73j62k79
$$ 400 225 -369 -396 -617 -282 -34 269 496 363 379 45 -545 -451 -238 98 219 379 778 205 43 -236
5423b36j62J33K55J26M70k29Q3p14Qk29K21M8L45K98L62j65q27L3m10K58k20L21
$$ -236 -398 -265 -10 116 586 357 440 -274 -266 -495 -274 -226 119 417 779 614 -213 -180 -590 -332 -552 -231
5445b31M85L13L3n46l01j48N0kK02J54M66j22j34m00l45J26LL33L89J08k6J8l58
$$ -231 254 567 600 54 -247 -395 -345 -347 -145 9 475 353 219 -181 -526 -400 -397 -64 325 433 407 425 67
5468F7m14J17m0k8J73N51L56n05j85l70k85O5K37J30K56L57J0k84j72m74o9o0
$$ 67 -347 -230 -270 -298 -125 426 782 277 92 -278 -563 -498 -261 -131 125 482 492 208 36 -438 -507 -567
5490e67M46M73R3Rk32k24l27k38K4L05L86K63J06O1m71l09k72P5J69K00M14J4
$$ -567 -121 352 445 454 222 -2 -329 -567 -543 -238 148 411 517 578 107 -202 -474 -399 -230 -30 384 398
5512C98K4o7o05k13J68n1J31M37J36J14l26k14k28k15J46L90K78N7J17r2k05m18
$$ 398 422 355 -250 -463 -295 -346 -215 222 358 472 146 -68 -296 -511 -365 25 303 360 477 385 180 -238
5534b38k16J11K07K25N17l6N7n48m92j93M11j53M73L42m9J12k88n07k68l1K08
$$ -238 -454 -343 -136 89 606 570 627 79 -413 -606 -195 -348 125 467 418 530 242 -265 -533 -564 -356
5555c56K00M66L09j48l07k33l38m9M9L04L07K91O6l13k52m17j29K65R0J49P09
$$ -356 -156 310 619 471 164 -69 -407 -456 -407 -103 204 495 561 248 -4 -421 -550 -285 -195 -46 663
5576F63j11l42M1l73k25l4j38M51L60O2P3k94l73k01k17J81Q5N83J38j6k08r2
$$ 663 552 210 251 -122 -347 -381 -519 -68 292 354 427 133 -240 -441 -658 -477 -392 191 329 313 105 13
5598A3m68k42L82J11K25L11J81q0m40j17l22p6M28N3L25L2J3j53k05m40J00k19
$$ 13 -455 -697 -315 -204 21 332 513 433 -7 -124 -446 -522 -94 -41 284 316 329 176 -29 -469 -369 -588
5620e88N97J76J08L06l06q6m32k44N6L70k5K69M53m21l00k63jj09N9M82L3M42
$$ -588 9 185 293 599 293 207 -225 -469 -413 -43 -68 201 654 233 -67 -330 -331 -440 -381 101 134 576
5642E76j25k68k44n58J71O5M27L59L4J08k86l75l89j82K07L21L39L88j74J1k48
$$ 576 451 183 -61 -619 -448 -383 44 403 437 545 259 -116 -505 -687 -480 -159 180 568 394 405 157
5663A57l65k77k18O41K89J68K12k52m62j26j04n21N22K56N39K30n35O8m28j0k98
$$ 157 -208 -485 -703 -62 227 395 607 355 -107 -233 -337 -858 -336 -80 459 689 154 222 -206 -216 -514
5684e14L34J08J73M48l43J37m19k68k24K15P6J79N43k81J10k98j01k58n4R5J89
$$ -514 -180 -72 101 549 206 343 -76 -344 -568 -353 -277 -98 445 164 274 -24 -125 -383 -437 -342 -153
5705a53M37L20k01o9n60l05J55m6L44M76l2J64k44k37l70l74K67L44L92k5J60
$$ -153 284 604 403 334 -226 -531 -376 -422 -78 398 366 530 286 49 -321 -695 -428 -84 308 283 443
5726D43j58m46j84q3O1O5N05O5M31m58m07l3r2k17J49L67K84J54N5m25l38j8l30
$$ 443 285 -161 -345 -428 -367 -302 203 268 699 241 -166 -199 -291 -508 -359 8 292 446 501 76 -262 -280 -610
5749f10L35K40M84J57k71k33j4l45j37p1K86O30J9j4l0m78j24k46QM26J26J52
$$ -610 -275 -35 449 606 335 102 88 -257 -394 -465 -179 451 470 456 426 -52 -176 -422 -414 12 138 290
5771B90K48l32J79p64q7k77K91L30M29P3K23n33k61j00k98J86L07N27rk76K08
$$ 290 538 206 385 -379 -466 -743 -452 -122 307 380 603 70 -191 -291 -589 -403 -96 431 422 146 354
5792C54l55l18j19oL55l6N46j88J29n09j11j29j36J85L32L72J51j82j17l08n19
$$ 354 -1 -319 -438 -444 -89 -125 421 233 362 -147 -258 -387 -523 -338 -6 366 517 335 218 -90 -609
5813f09J64m7M71L05K36k21K37n36j65m54J49K33J90O99k08J4n06n15R2K09J89
$$ -609 -445 -492 -21 284 520 299 536 0 -165 -619 -470 -237 -47 652 444 458 -48 -563 -471 -262 -73
5834g3J08N26j85R3m45j06l89Q6MK56M46K42j11j49n97m1M6l11Q27pO4K10j10
$$ -73 35 561 376 469 24 -82 -471 -385 -381 -125 321 563 452 303 -294 -335 -289 -600 227 220 284 494 384
5857C84j86l18m22L21o6L99J80K65j4n32j9n10Q2K94J21M45K48j73l44m47J38
$$ 384 198 -120 -542 -221 -287 112 292 557 543 11 -8 -518 -436 -142 -21 424 672 499 155 -292 -154
5878a54l32J0K84O55j3K9m39m26k52J46K25J21L37L30l01K23n15rn42J52j58M88
$$ -154 -486 -476 -192 463 450 479 40 -386 -638 -492 -267 -146 191 521 220 443 -72 -81 -623 -471 -629 -141
5900a41L45N23k64m9o59m07L33k18K53Q15l8M2l35k82j06q6N8J3K15L20K61k49
$$ -141 204 727 463 414 -245 -652 -319 -537 -284 531 493 535 200 -82 -188 -274 -216 -203 12 332 593 344
5922C44m63o3j25m8J76K22M34j54J30m17l44j71O8L94jK26J99Q4R3p19q6k60P0
$$ 344 -119 -182 -307 -355 -179 43 477 323 453 36 -308 -479 -411 -17 -18 208 407 491 584 -135 -221 -481 -411
5945d11K62L91J16J21k49l48k38q7o5M50Q1M81q8k0m26k91J28j56K30K65K95M8
$$ -411 -149 242 358 479 230 -118 -356 -443 -508 -58 23 504 416 396 -30 -321 -193 -349 -119 146 441 489
5967D89Om16m13n0j2O7L22J50L72qj64l54m83J59k40L36L55K53R0q6n15l27m9
$$ 489 495 79 -334 -384 -396 -329 -7 143 515 507 343 -11 -494 -335 -575 -239 116 369 459 373 -142 -469 -518
5990e18J94K76L0K83K99Lk35m69k55J00j3L02M56Q6J10n29k74j09k28J09K23O84
$$ -518 -324 -48 -18 265 564 567 332 -137 -392 -292 -305 -3 453 539 649 120 -154 -263 -491 -382 -159 525
6012E25Nl66P3m82Rk57K54J95J36K51J38k96j37l50p0k29L78M27K12Q9j09j49
$$ 525 530 164 237 -245 -236 -493 -239 -44 92 343 481 185 48 -302 -372 -601 -223 204 416 505 396 247
6034B47k38q3l64M19P1K18R1q7j44o3j07m12kM85L74k31M04l63k57j84m49L04
$$ 247 9 -74 -438 -19 52 270 361 274 130 67 -40 -452 -454 31 405 174 578 215 -42 -226 -675 -371
6056c71J97L72L8J98J0l92k50j20j47J98N27j25M85k27j4n43k32K%L04L52J25
$$ -371 -174 198 236 434 444 52 -198 -318 -465 -267 260 135 620 393 379 -164 -396 -394 -394 -90 262 387
6078C87R3k95j15k20k94J69MK91K60L0j24k38j19l06K03J06R8M41O4j88P8n88
$$ 387 480 185 70 -150 -444 -275 -271 20 280 310 186 -52 -171 -477 -274 -168 -70 371 435 247 325 -263
6100b63l33K65K52P2L72k3K5j52k12p15K46J45Q7L88L13l02r0J21n23j19j28M36
$$ -263 -596 -331 -79 -7 365 342 367 215 3 -712 -466 -321 -234 154 467 165 75 196 -327 -446 -574 -138
6122a38L83K42J7N9m63k54l63O2L71j51L17M51r6m87Q2l90P3k3K8M47K22J93l20
$$ -138 245 487 504 563 100 -154 -517 -455 -84 -235 82 533 437 -50 32 -358 -285 -308 -280 167 389 582 262
6145B62l39k46np0L22K10J97j4rj63l56l15J14K04K86K19Q9o9j45j52n45Q5J1
$$ 262 -77 -323 -328 -398 -76 134 331 317 308 145 -211 -526 -412 -208 78 297 386 317 172 20 -525 -440 -429
6168d29K00M41J33J66n42n4n10K37M6L01J23J4K96k31j97k53k60J77K18o1O75
$$ -429 -229 212 345 511 -31 -85 -595 -358 -312 -11 112 126 422 191 -6 -259 -519 -342 -124 -185 490
6189D90k54K0j51l29q9j39J10L37K45K87j05l46o9l08J57j55K20M11K2K15n42
$$ 490 236 256 105 -224 -313 -452 -342 -5 240 527 422 76 7 -301 -144 -299 -79 332 354 569 27
6210B7j73k15R0j44L33O2J76J88R8l77m45k6P2Q2M19J29J04P0m14l61k01mK13
$$ 27 -146 -361 -271 -415 -82 -20 156 344 442 65 -380 -406 -334 -252 167 296 400 470 56 -305 -506 -510 -297
6233b97O41l75K65J21j35l78j83J48pj0L59J1o5K89l90l56J7j21K7M29K95J19
$$ -297 344 -31 234 355 220 -158 -341 -193 -200 -210 149 160 95 384 -6 -362 -345 -466 -439 -10 285 404
6255D04O4n09j41p8p7L21m2L91k24K32j70l87j04L5j50K06K39K31o0j90k55q0
$$ 404 468 -41 -182 -260 -337 -16 -58 333 109 341 171 -216 -320 -285 -435 -229 10 241 181 -9 -264 -344
6277c44L3j55nM03L89J78j90m8n31m7j07L54j30M71K89r8m27o9l80l32K72O21
$$ -344 -311 -466 -471 -68 321 499 309 261 -270 -317 -424 -70 -200 271 560 462 35 -34 -414 -746 -474 147
6299A47J43oK35m29k81k46L8j1J37K33L87J09j45l88j9m32L89N6J76K34L31m04
$$ 147 290 284 519 90 -191 -437 -399 -410 -273 -40 347 456 311 -77 -96 -528 -139 -83 93 327 658 254
6321B54r5l09k67K5K14K31K69J01j88j43k24j74k1O6L47j21L76J96m46J04o36
$$ 254 159 -150 -417 -392 -178 53 322 423 235 92 -132 -306 -327 -261 86 -35 341 537 91 195 -441
6342d41k5J18J69L97qK8J19k97k58j58L9J9M55K43R7l25j78J04l88k36L71J42
$$ -441 -466 -348 -179 218 210 238 357 60 -198 -356 -317 -298 157 400 497 172 -6 98 -290 -526 -155 -13
6364a3K37K71r7l16j43k24k66K29K40K79J76k30K22m22k09j43O8K96J79O7J39
$$ -13 224 495 398 82 -61 -285 -551 -322 -82 197 373 143 365 -57 -266 -409 -341 -45 134 201 340
6385C40N6k68j37n80m2M48K35oM12k65P8m52j75P5k27L21J40M80J3J04l07l20
$$ 340 396 128 -9 -589 -631 -183 52 46 458 193 271 -181 -356 -281 -508 -187 -47 433 446 550 243 -77
6407g7k75k8L15K14J85k0j42j79m12K1J96j9L19K4L93j86j63n42j3N1M4N06N1
$$ -77 -352 -380 -65 149 334 314 172 -7 -419 -398 -202 -221 98 122 515 329 166 -376 -389 -338 -294 212 263
6430B63J40k0j41m0n36J09j09J50M19j85N81m86k42k45j12jK33L46M39j33j02
$$ 263 403 383 242 202 -334 -225 -334 -184 235 50 631 145 -97 -342 -454 -455 -222 124 563 430 328
6451C28j47l32j79j38K89J32M13Rm6l21j12j82l25M30r2M55K35m3n0m66j2k14
$$ 328 181 -151 -330 -468 -179 -47 366 375 329 8 -104 -286 -611 -181 -273 182 417 374 324 -142 -154 -368
6473c68J67J1J77J72J33J10j46o19Jo8J02O78K44k24J61p31J73j03j97p1L46M08
$$ -368 -201 -190 -13 159 292 402 256 -363 -362 -430 -328 350 594 370 531 -200 -27 -130 -327 -398 -52 356
6495C56r2j5n2j68l46j46M3N83J69R6l45o9j14p3k40J80L83r0K29J0j30l27j23
$$ 356 264 249 197 29 -317 -463 -420 163 332 428 83 14 -100 -173 -413 -233 150 60 289 299 169 -158 -281
6518b81j95j56L67K77O0J97k0k66j60j29j82J75L53P9K37J20j48k33m22j75L83
$$ -281 -476 -632 -265 12 72 269 249 -17 -177 -306 -488 -313 40 119 356 476 328 95 -327 -502 -119
6539a19M7K02K05J48j26l18l75J37n12O69l5M72P0j63m85o2j94J5k5L01L34J05
$$ -119 -72 130 335 483 357 39 -336 -199 -711 -42 -77 395 465 302 -183 -245 -439 -424 -449 -148 186 291
6561B91K54m92j27k29J27n4J71J23L87J57k06l75j75k35J67r7M48K1P6O08q51
$$ 291 545 53 -74 -303 -176 -230 -59 64 451 608 402 27 -148 -383 -216 -313 135 156 232 840 -11
6582a1j36K6l69K77L78j51L10q2J61l58k20o6J47K27q3K07k1m1k38o1l67R3jL57
$$ -11 -147 -121 -490 -213 165 14 324 242 403 45 -175 -241 -94 133 50 257 236 195 -43 -104 -471 -378 -379 -22
6606b2K05j02M0k9l43K5K9n9N41l5K45k29k77j46k75J86K48j12L38mL3Q8o65J75
$$ -22 183 81 121 92 -251 -226 -197 -256 285 250 495 266 -11 -157 -432 -246 2 -110 228 224 257 345 -320 -145
6630a45l45L97L35r7J99j70q2k94K01k21j91J28K56K33R0M4l56j25J18l56M44
$$ -145 -490 -93 242 145 344 174 92 -202 -1 -222 -413 -285 -29 204 294 338 -18 -143 -25 -381 63
6651F3m3j77N13K8l7m80j09j85O3M36j1K99J15j78k77j16m05K87K28K00J74p2
$$ 63 20 -157 356 384 347 -133 -242 -427 -364 72 61 360 475 297 20 -96 -501 -214 14 214 388 316
6673C16j35j97J14l24m3NQ6P7M86N4l98k54j06j78l6M67L82k17J02q1k07j86j22
$$ 316 181 -16 98 -226 -269 -264 -178 -101 385 439 41 -213 -319 -497 -533 -66 316 99 201 120 -87 -273 -395
6696c95J28K63J84Q3J60k08n0k11j69m2R4K73M06l17R7j26N0m24k80J51L46M49
$$ -395 -267 -4 180 263 423 215 165 -46 -215 -257 -163 110 516 199 296 170 220 -204 -484 -333 13 462
6718D62l18M1o0k00j12k76K68P9M92j73N6M2l86j27O4l04K42K00L98k36J29m63
$$ 462 144 185 125 -75 -187 -463 -195 -116 376 203 259 301 -85 -212 -148 -452 -210 -10 388 152 281 -182
6740a82j0m7j13J11J58K01J90O6q1o65K19n8J33k3J14L77j5r8k87k35KM2j18M75
$$ -182 -192 -239 -352 -241 -83 118 308 374 293 -372 -153 -211 -78 -101 13 390 375 277 -10 -245 -243 -201 -319 156
6764A56K76n1k09j18m50N0j08M53K11J09P0k11l2k62l77K14L20M5P9K56k5j51
$$ 156 432 381 172 54 -396 -346 -454 -1 210 319 389 178 146 -116 -493 -279 41 86 165 421 396 245
6786B45m71p0K47r3JN50o7J70m10l39J29J2J03j38L39M3J51P1o08K39k84OJ15
$$ 245 -226 -296 -49 -142 -141 409 342 512 102 -237 -108 -96 7 -131 208 251 402 473 -135 104 -180 -174 -59
6809e9J19J5L75j79j47k88j07J62Q3o7M49l8j67j44m7k44j33K20N9L4K88J54k27
$$ -59 60 75 450 271 124 -164 -271 -109 -26 -93 356 318 151 7 -40 -284 -417 -197 -138 -104 184 338 111
6832A11j64P5l73O0L28K56pj36J53j31n3k13k25K06K43J76o1p6l7k16Rq2j74K95
$$ 111 -53 22 -351 -291 37 293 286 150 303 172 119 -94 -319 -113 130 306 245 169 132 -84 -75 -157 -331 -36
6856c6J51J48k31K11n19o8L3Q6K07R8L32m0k11l61o9K49j29O0M04j66j08K73j99
$$ -36 115 263 32 243 -276 -344 -311 -225 -18 80 412 372 161 -200 -269 -20 -149 -89 315 149 41 314 115
6879A15m3l26j80M99J1k3M75k35j74k00l28l7L39L40j49K51k55J92k85l4j3j68
$$ 115 72 -254 -434 65 76 53 528 293 119 -81 -409 -446 -107 233 84 335 80 272 -13 -47 -60 -228
6901b28j6M66k6K48n9l87r3J01K1k17O3M41j20Rl05j66k58K17M50o0j33K67J02
$$ -228 -244 222 196 444 385 -2 -95 6 27 -190 -127 314 194 203 -102 -268 -526 -309 141 81 -52 215 317
6924C17l23k30P3k00JN20j79K64PK12l14l12l02J52J81J07J66Jq1Pj89j16PJ94
$$ 317 -6 -236 -163 -363 -362 158 -21 243 250 462 148 -164 -466 -314 -133 -26 140 141 60 67 -122 -238 -231 -37
6948c7J63j07j14L16j05j89o2j08K07nO7K13L7J05m34l64K09mL46j36K91L9rm42
$$ -37 126 19 -95 221 116 -73 -135 -243 -36 -41 26 239 276 381 -53 -417 -208 -212 134 -2 289 328 319 -123
6972a23p5Mk9K95O4J19j4p3o5j99r2J5m0K71j46K74M05l53m39J40k05M9K05J80
$$ -123 -198 -194 -223 72 136 255 241 168 103 -96 -188 -173 -213 58 -88 186 591 238 -201 -61 -266 -217 -12 168
6996A68Lo4j01j08K86o03J98K25J71J41k71Mk15J68l04J37O9J43m6K89J29m10
$$ 168 171 107 6 -102 184 -419 -221 4 175 316 45 49 -166 2 -302 -165 -96 47 1 290 419 9
7018Ip2n7K1j82Q5K67J91k1J3l87p4J74j12Q7N53l15J13m5k05j61L2m9J07%K31
$$ 9 -63 -120 -99 -281 -196 71 262 241 254 -133 -207 -33 -145 -58 495 180 293 248 43 -118 -86 -135 -28 -28 203
7043B03Q2j71P7k96P5k09j00L63n3L04j14j15j46l9N4n4J72nK80j83Rr5l21r8
$$ 203 285 114 191 -105 -30 -239 -339 24 -29 275 161 46 -100 -139 -85 -139 33 28 308 125 134 39 -282 -380
7067c80O5K27M1J42J96o3k62j65j43o3L84M1RK25j79j05j04J17K6R0q2J08k25
$$ -380 -315 -88 -47 95 291 228 -34 -199 -342 -405 -21 20 29 254 75 -30 -134 -17 9 99 17 125 -100
7090a00R9j3Jj02j59j25L85K17N6M5k47o0k62O9J61q7j7M82k45%j22k3m6j38o
$$ -100 -1 -14 -13 -115 -274 -399 -14 203 259 304 57 -3 -265 -196 -35 -122 -139 343 98 98 -24 -47 -93 -231 -237
7115b37M08p4K0n4j87p8J55l72K08M3N28j88q6K44m07m2j08J91o1K36j34j2K01
$$ -237 171 97 117 63 -124 -202 -47 -419 -211 -168 360 172 86 330 -77 -119 -227 -36 -97 139 5 -7 194
7138A94R2k81j67j02J07L12k4L7k46O8k96K18k67M6L99M6K8%k25O3j74j31K00
$$ 194 286 5 -162 -264 -157 155 131 168 -78 -10 -306 -88 -355 -309 90 136 164 164 -61 2 -172 -303 -103
7161a03J53R7J48n0o2j18l2l67J28R4K47l4P2m1J10m39R8j5l2L62j38K6R5k13
$$ -103 50 147 295 245 183 65 33 -334 -206 -112 135 101 173 132 242 -197 -99 -114 -146 216 78 104 199 -14
7185a4J00j27k60J11J93Q3J0K15k04k31M2m7m7K51K2p0j44L67m91O5J6K10j8r5
$$ -14 86 -41 -301 -190 3 86 96 311 107 -124 -82 -129 -176 75 97 27 -117 250 -241 -176 -160 50 32 -63
7209f3L33j26K12n82J41J7K47k19j48M06P2j00j25J04o23K26L9L06k6M5J28j18
$$ -63 270 144 356 -226 -85 -68 179 -40 -188 218 290 190 65 169 -454 -228 -189 117 91 136 264 146
7231A46k08l5M1q1j49M71j21J27k76K00l26O1o0K43K85j60J91k73l12K78j37r9
$$ 146 -62 -97 -56 -137 -286 185 64 191 -85 115 -211 -150 -210 33 318 158 349 76 -236 42 -95 -194
7253a94J51k01K87r3pQ6j24j20J38j51O6K74L5J6q7j09M6q7j12K87L0j21J38J7
$$ -194 -43 -244 43 -50 -57 29 -95 -215 -77 -228 -162 112 147 163 76 -33 13 -74 -186 101 131 10 148 165
7277A65rk45k59K36j56N3L00M48k35l65j90j04L43r7K09o8J00N7k83j64K3K87
$$ 165 156 -89 -348 -112 -268 -215 85 533 298 -67 -257 -361 -18 -115 94 26 126 183 -100 -264 -241 46
7299D6l04N28l30n3Q1j1M9j33jl25M82K04L0N6nl78k61J77N1L3m8M24j91R7l41
$$ 46 -258 270 -60 -113 -32 -43 6 -127 -128 -453 29 233 263 319 314 -64 -325 -148 -97 -64 -112 312 121 218 -123
7324a23PJ03j76L51j28p2J49J0l9K5l9j33p0J75j49K61k78K93l1k47OK8k35L85
$$ -123 -116 -13 -189 162 34 -38 111 121 82 107 68 -65 -135 40 -109 152 -126 167 136 -111 -105 -77 -312 73
7348G3L29l69K50m4l09j91j4O9J21O3j8L48p8k45j2m2n8J79o1J90m3J06q3l71
$$ 73 402 33 283 239 -70 -261 -275 -206 -85 -22 -40 308 230 -15 -27 -69 -127 52 -9 181 138 244 161 -210
7372b10k49J42K01L82j00J07Jl72J58m39K36J05K03M8Nj71N4j42p4j80K22j88
$$ -210 -459 -317 -116 266 166 273 274 -98 60 -379 -143 -38 165 213 218 47 101 -41 -115 -295 -73 -261
7394b61K80Q4J16j3k18n9j28J4J61L2m5M8L0j51M0k14J00K07o8J00J41Lj19k27
$$ -261 19 103 219 206 -12 -71 -199 -185 -24 8 -37 11 41 -110 -70 -284 -184 23 -45 55 196 199 80 -147
7418a47k07OR8L30J2q9N16m59P6m85L73J76j74j24M31k66p8j2k67O3K58J6L5J56
$$ -147 -354 -348 -250 80 92 3 519 60 136 -349 24 200 26 -98 333 67 -11 -23 -290 -227 31 47 82 238
7442B38Ok60l29K09qN9k47P10l56K54k70J72k16j43P9J96j26J35n7L2k57Q0Lj09
$$ 238 244 -16 -345 -136 -144 -85 -332 378 22 276 6 178 -38 -181 -102 94 -32 103 46 78 -179 -99 -96 -205
7466b05K44J2L3k00K94j5m32N4P6m3J81M4%J64j49oj67q2P6J4K29k7N5q7j11k85
$$ -205 39 51 84 -116 178 163 -269 -215 -139 -182 -1 43 43 207 58 52 -115 -197 -121 -107 122 95 150 63 -48 -333
7492c33J25o9K42j1O0Q5kj33k7j23m7J94J03O5j03J97j68m8j11jj22K58k83N38
$$ -333 -208 -277 -35 -46 14 99 97 -36 -63 -186 -233 -39 64 129 26 223 55 7 -104 -105 -227 31 -252 286
7516B86k50L2q4J04j30J41k46L06k18J91j71J67j91k45K24j31J22M20l20K1J2
$$ 286 36 68 -16 88 -42 99 -147 159 -59 132 -39 128 -63 -308 -84 -215 -93 327 7 28 40
7537D0j16j6o9K10k04J17M5k04L05N1l21j10L71km8n0Q8n6j74J89j87q5L61q8
$$ 40 -76 -92 -161 49 -155 -38 7 -197 108 159 -162 -272 99 97 49 -1 87 31 -143 46 -141 -226 135 47
7561D7j46P8J44k00j41%P5P1K02j10J24l25J46N9k0n9n2j57J90k30L76J28l17
$$ 47 -99 -21 123 -77 -218 -218 -143 -72 130 20 144 -181 -35 24 4 -55 -107 -264 -74 -304 72 200 -117
7584a17N5m0M9r0K42l44L42J37k65K0n9j31J43J87J16N9k38j5k1l2j68K29K28
$$ -117 -62 -102 -53 -143 99 -245 97 234 -31 -11 -70 -201 -58 129 245 304 66 51 30 -2 -170 59 287
7607B87k50j00R0J13k13J02K4j22J03k20K83M5r0l81J81o3L54j29J16L2p4q1M6
$$ 287 37 -63 27 140 -73 29 53 -69 34 -186 97 142 52 -329 -148 -211 143 14 130 162 88 7 53
7630E3J29m43J85q2K7J15k2K11j35J75l33K93j90o3J55j38K05nj63M5On7K14j08
$$ 53 182 -261 -76 -158 -131 -16 -38 173 38 213 -120 173 -17 -80 75 -63 142 137 -26 19 25 -32 182 74
7654G4J22j06j45K3q2j40J72O5o7M02k18j74J70k47P7k2P4P3Q6j22M3j34J87l57
$$ 74 196 90 -55 -32 -114 -254 -82 -17 -84 318 100 -74 96 -151 -74 -96 -22 51 137 15 58 -76 111 -246
7678b46J18j7P8Q3J96mj19m71J06L98l87L2N10O0l83J87k60qK39j84J12l8K60
$$ -246 -128 -145 -67 16 212 208 89 -382 -276 122 -265 -233 277 337 -46 141 -119 -127 112 -72 40 2 262
7701B62mj17m9j55j33N19j97m38L79k5J56j42kj72J78k73M25j58P5j80J74Ql59
$$ 262 258 141 92 -63 -196 323 126 -312 67 42 198 56 54 -118 60 -213 212 54 129 -51 123 131 -228
7724b28J0J5K13j05L93j88j17l0R1k81K31J02j9j58J11j08K50k18J71l47K73j01
$$ -228 -218 -203 10 -95 298 110 -7 -37 54 -227 4 106 87 -71 40 -68 182 -36 135 -212 61 -40
7746d0kN3Q1m9j76j21M6R2L9o4J20J30j01p6K82k76nJ56l4N7L0l7j47r1K45j06
$$ -40 -42 11 92 43 -133 -254 -208 -116 -77 -141 -21 109 8 -68 214 -62 -67 89 55 112 142 105 -42 -133 112 6
7772Fk16M27R1l99L13k76P2O9k93J78l9J76j41J17p7K32j00m50L32j54K08N9k14
$$ 6 -210 217 308 -91 222 -54 18 87 -206 -28 -67 109 -32 85 8 240 140 -310 22 -132 76 135 -79
7795g9J77l36L05M2k37M39j43p8l1j04J37j34o8K36l14K56J21J0j64J14j75k73
$$ -79 98 -238 67 109 -128 311 168 90 59 -45 92 -42 -110 126 -188 68 189 199 35 149 -26 -299
7817b99K37p7l5K75J19j87J90j81N9l61P4P4l4K67k34J78j63L25m53Jl5M63q9
$$ -299 -62 -139 -174 101 220 33 223 42 101 -260 -186 -112 -146 121 -113 65 -98 227 -226 -225 -260 203 114
7840A14r3J49j91j74j12L00q3J96j64L62j67j49k94L02R9k34n7J82J14q0L78m48
$$ 114 21 170 -21 -195 -307 -7 -90 106 -58 304 137 -12 -306 -4 95 -139 -196 -14 100 20 398 -50
7862e0L68m32K54L3q0j8P3j2k3k52K44k97J44L48j34j05J41m56K73j32m1J51K4
$$ -50 318 -114 140 173 93 75 148 136 113 -139 105 -192 -48 300 166 61 202 -254 19 -113 -154 -3 21
7885B1K6j04R5J14j25o3j59M15j28N6o6O0q8j33m1NJ35j53M30k95J32j81l9N5
$$ 21 47 -57 38 152 27 -36 -195 220 92 148 82 142 54 -79 -120 -115 20 -133 297 2 134 -47 -86 -31
7909c1l5L16k80K03r0j52K69k52P0RL0q4n7J68j0p3n4L5l67L52k00L12k7j16Q3
$$ -31 -66 250 -30 173 83 -69 200 -52 18 27 57 -27 -84 84 74 1 -53 -18 -385 -33 -233 79 52 -64 19
7934A9j12j52R2J35O4J26l2o4K1k63J70J06j81n3J08J06j45kP1p1J37j19MJ2J27
$$ 19 -93 -245 -153 -18 46 172 140 76 97 -166 4 110 -71 -124 -16 90 -55 -57 14 -57 80 -39 -35 -23 104
7959A04l23K05j7r9J36k81L42l5j0p6k3K38j39j9j24M7k9K47r1L9K1j83M3k72
$$ 104 -219 -14 -31 -130 6 -275 67 32 22 -54 -77 161 22 3 -121 -74 -103 144 53 92 113 -70 -27 -299
7983b99L29J05k79J02K16J8j35q2j06L7o8J88k2J15J95k43o9j53k0K4L3J21%K56
$$ -299 30 135 -144 -42 174 192 57 -25 -131 -94 -162 26 4 119 314 71 2 -151 -171 -147 -114 7 7 263
8007B63k89L05j69j14p2J5Q5Mj4J48j91J07j73J36l89L16K50k5l00J23Ql15K57
$$ 263 -26 279 110 -4 -76 -61 24 28 14 162 -29 78 -95 41 -348 -32 218 193 -107 16 24 -291 -34
8030c4j1J46l16K41Q0K22k92M0j11o4Q8j3K39k18L4J30j98J10r2k59L49j25Q9
$$ -34 -45 101 -215 26 106 328 36 76 -35 -99 -11 -24 215 -3 31 161 -37 73 -19 -278 71 -54 35
8053C5R6j77K11k68m9K22m2j30J78J21k12J81J54n05j21K06o8J48J12j86j38L14
$$ 35 131 -46 165 -103 -152 70 28 -102 76 197 -15 166 320 -185 -306 -100 -168 -20 92 -94 -232 82
8075H2j94J99j41J63J01j10l1j65J5K5l1J01M6N7l14M91l11j54k8L8P8Q5K52l64
$$ 82 -112 87 -54 109 210 100 69 -96 -81 -56 -87 14 60 117 -197 294 -17 -171 -199 -161 -83 2 254 -110
8099a10J72l5P9J29k76K01j93J46j92J05NP0k84Q7J21q7R3k40J02J52J08m72L32
$$ -110 62 27 106 235 -41 160 -33 113 -79 26 31 101 -183 -96 25 -62 31 -209 -107 45 153 -319 13
8122A3j74N1Q8r0N06n51K35j41K80l0l64K81J9K1r0m6n1J3j89K26J78k15J41j4
$$ 13 -161 -110 -22 -112 394 -157 78 -63 217 187 -177 104 123 144 54 8 -43 -30 -219 7 185 -30 111 97
8146I7k20K54l57K33L6l07J63J4O2j36J76j76L5p1K85j07j7J59O4k54N1r9J39
$$ 97 -123 131 -226 7 43 -264 -101 -87 -25 -161 15 -161 -126 -197 88 -19 -36 123 187 -67 -16 -115 24
8169B4k0o9L33j07j79J92m1k43P0MK69J7j50k18K23j11j63On9L79q4J35
$$ 24 4 -65 268 161 -18 174 133 -110 -40 -36 233 250 100 -118 105 -6 -169 -163 -222 157 73 208
8191B08
$$ Imaginary data points
##PAGE= N=2
##DATA TABLE= (X++(I..I)), XYDATA
0@%%%%%%%%%%Qj6J6k0K8l2M0m8N6p2Q8j04J20j42J70j96K28k65L04l51L99m52
$$ 0 0 0 0 0 0 0 0 0 0 0 8 -8 8 -12 16 -16 24 -24 32 -40 48 -56 64 -78 92 -104 124 -141 163 -188 211 -241
32b41N14n83O61p41Q32r35J044j165J294j438J597j765J952k156K379k625K891
$$ -241 273 -310 351 -390 442 -493 551 -614 680 -758 839 -926 1026 -1130 1249 -1376 1515
49A515l186L510l866M263m705N201n759O393p125P976q982J0193j1677J3556j6019
$$ 1515 -1671 1839 -2027 2236 -2469 2732 -3027 3366 -3759 4217 -4765 5428 -6249 7307 -8712
64h712J9398k4340L2269m7066Q3847l44468o37615M93496L26465n1809K81782
$$ -8712 10686 -13654 18615 -28451 55396 -289072 -926687 -433191 -106726 -158535 123247
75A23247O39827k9442o20515l95798m0605j48266m5280L54648M77002K14840J4859
$$ 123247 763074 733632 113117 -282681 -323286 -471552 -516832 -162184 314818 529658 544517
86E44517k06982m31671l30619k3215L601P2903M74979N43247o1249l93536j06246
$$ 544517 337535 -94136 -424755 -447970 -444369 -371466 103513 646760 585511 191975 85729
97H5729q6095m70348k65855M41826N28498L3577k6327K11433p9294n45524l41304
$$ 85729 -366 -470714 -736569 -294743 233755 267332 241005 452438 373144 -172380 -513684
108e13684J50272J95523Q4527K43357K89745j7149k71278k78716k31511j06902
$$ -513684 -363412 -167889 -83362 159995 449740 432591 161313 -117403 -348914 -455816
118d55816J33994K55644K14670K16911J50505j74392m17395k43559o748l3772
$$ -455816 -321822 -66178 148492 365403 515908 341516 -75879 -319438 -326186 -359958
128c59958K9933L55372M09640J6766k30310j26074j35365k94463j44042K30056
$$ -359958 -330025 25347 434987 451753 221443 95369 -39996 -334459 -478501 -248445
138b48445L24418J55415P4532L9917j40411l01864k34759m6142R7869K00225K44740
$$ -248445 75973 231388 305920 345837 205426 -96438 -331197 -377339 -279470 -79245 165495
149A65495J64643J5841j11387k19061k58026j24297Q3822J71655J71481J85290
$$ 165495 330138 345979 234592 15531 -242495 -366792 -282970 -111315 60166 245456
159B45456J13814r8924k50581k01405q6299r730J01054K33200K31793P1741r1954
$$ 245456 359270 260346 9765 -191640 -277939 -287669 -186615 46585 278378 350119 258165
170B58165j73524k09053j85594n6308J19638K21766K17162J36443M058j39003
$$ 258165 84641 -124412 -310006 -366314 -246676 -24910 192252 328695 332753 193750
180A93750k20267k02793r7798M5779J62234K07614J67326N0406r4636j83432j81462
$$ 193750 -26517 -229310 -327108 -281329 -119095 88519 255845 306251 211615 28183 -153279
191a53279j13686k448J28247K04454J66436N1239o2305j49346j93881j52194j8454
$$ -153279 -266965 -269413 -141166 63288 229724 280963 218658 69312 -124569 -276763 -295217
202b95217J19414J82115J71427J05156j5324j41032j94390j58881n9229P0132
$$ -295217 -175803 6312 177739 282895 267571 126539 -67851 -226732 -285961 -215829
212b15829J67849J79158J17250K1402r8428j94518j81946o8157M8537J21998J75855
$$ -215829 -47980 131178 248428 269830 171402 -23116 -205062 -273219 -224682 -102684 73171
223G3171J74301N8015j03248j77872j59625j17410l5669J03670K01809J71908
$$ 73171 247472 305487 202239 24367 -135258 -252668 -288337 -184667 17142 189050
233A89050O9431k7186j13704j74031j50378m5367P1392J45809J56828R9828l136
$$ 189050 258481 231295 117591 -56440 -206818 -252185 -180793 -34984 121844 221672 218536
244B18536r9793j51130j43783o7711N4198J45281J52536J05962K9699p6687j69956
$$ 218536 118743 -32387 -176170 -243881 -189683 -44402 108134 214096 243795 167108 -2848
255b848j69223p8198K4983J04362J59365J57120O5353o0518j40415j52984j15312
$$ -2848 -172071 -250269 -225286 -120924 38441 195561 260914 200396 59981 -93003 -208315
266b08315l0962P9364J55104J50909Q0671j5915j07123j54799j31427m9654N2256
$$ -208315 -239277 -159913 -4809 146100 226771 210856 103733 -51066 -182493 -232147 -179891
277a79891J31619J53807J06261J2411q2327j41961j43254q0463J9126J07914J43961
$$ -179891 -48272 105535 211796 224207 141880 -81 -143335 -223798 -204672 -96758 47203
288D7203J18917M5820m8609j22322j37757q9719m673Q0486J32173J23922N8341
$$ 47203 166120 211940 163331 41009 -96748 -186467 -191140 -110654 21519 145441 203782
299B03782l4476j10324j37935j05867k6115O7788J32156J37941Q4502m457r3362
$$ 203782 169306 58982 -78953 -184820 -210935 -143147 -10991 126950 211452 206995 113633
310A13633j42989j30167o0837L2803J10233J40403J11182L3241n8311j21172j28965
$$ 113633 -29356 -159523 -220360 -187557 -77324 63079 174261 207502 149191 28019 -100946
321a00946q1583j19Q1533J26549J14083M9853l5681j02219j24828r4095j9405
$$ -100946 -182529 -182648 -101115 25434 139517 189370 153689 51470 -73358 -167453 -186858
332a86858O5221J19577J18127O7232r774q6290j27744j08343l9263M1746J00870
$$ -186858 -121637 -2060 116067 183299 173525 87235 -40509 -148852 -188115 -146369 -45499
343d5499J20772Q9910J3475o9963j15686j08434n8782J6177R0007J23716R8694
$$ -45499 75273 165183 178658 108695 -6991 -115425 -174207 -158030 -68023 55693 154387
354A54387K9795m9243j07570j21628q1358o877P1831J21109J17010N8450k1930
$$ 154387 184182 134939 27369 -94259 -175617 -182494 -110663 10446 127456 185906 163976
365A63976q6311j17703j05027m0692M7565J04034J07058P4112J6029o0127j13100
$$ 163976 77665 -40038 -145065 -185757 -138192 -34158 72900 147012 163041 102914 -10186
376a0186j02478m1639K3944P6214J07032Q9788K0678n6675r9561j01366o5501
$$ -10186 -112664 -154303 -130359 -54145 52887 142675 163353 106678 7117 -94249 -159750
387a59750M024P4684J10681R7363M3290l1488r3098j09761q0968k0898M9898J04522
$$ -159750 -155726 -81042 29639 127002 170292 138804 45706 -64055 -145023 -165921 -116023 -11501
399a1501J07673N8964r165o7792j04325r6931l8719L7607Q8746J01535P8344J6727
$$ -11501 96172 155136 145971 78179 -26146 -123077 -161796 -124189 -35443 66092 144436 161163
411A61163n9192j03047r7079n5612O733P2517J07398Q9434L1588l3665q2637r8650
$$ 161163 101971 -1076 -98155 -153767 -147034 -74517 32881 122315 153903 120238 37601 -61049
423f1049p2925j2262N5228R5409Q8545M2225j5245o4310r5284q4895k0690N4424
$$ -61049 -133974 -146236 -91008 4401 92946 135171 119926 55616 -39668 -124563 -145253 -90829
435i0829Q5017P9805O2317J2832o8272j13406q3287k5590J8423O4528J05228R0131
$$ -90829 -5812 73993 136310 149142 80870 -32536 -115823 -141413 -122990 -58462 46766 136897
447A36897J6743n4591q5321q6011o0600n713N6561R4461R1779L8559l5937p4322
$$ 136897 153640 99049 13728 -72283 -132883 -138596 -82035 12426 104205 142764 106827 32505
459C2505p0854o6535m1392M2461J14864Q6149J6151n443k4466r2574j16116k5924
$$ 32505 -38349 -104884 -146276 -103815 11049 97198 113349 107906 83440 -9134 -125250 -151174
471a51174O6032O6797N0493P1687M4018n5055j09617p2621k4507N960M9281Q5833
$$ -151174 -85142 -18345 32148 103835 147853 92798 -16819 -89440 -113947 -107987 -58706 27127
483B7127P5901K9836l2228q8692r0052l4243Q144K2598P0308J16777N5661o2107
$$ 27127 103028 132864 100636 11944 -78108 -112351 -104207 -81609 -11301 105476 161137 99030
495I9030q2110l5333n6297q0047K3079J34069R0105k035J933M926q1113j21372
$$ 99030 16920 -18413 -74710 -154757 -131678 2391 92496 90461 92394 97320 16207 -105165
507a05165l3651N4929N8284M9406O3369L4550l4970p7747p9451m9647J5842O7049
$$ -105165 -138816 -83887 -25603 23803 87172 121722 86752 9005 -70446 -120093 -104251 -37202
519c7202N8793M4685N5822N377j02897j11054j1748K2163j0745M2277J28725P0265
$$ -37202 21591 66276 122098 127475 24578 -86476 -98224 -76061 -86806 -44529 84196 154461
531A54461o4867p8233k0316m5162p7486J1339J12186Q4513J3278K136j2712p1168
$$ 154461 89594 11361 -8955 -54117 -131603 -120264 -8078 76435 89713 91849 79137 7969
543G969q8208l8576J7475N8588Q1684N5975N066j8200m0219q7644q1041J4727
$$ 7969 -80239 -118815 -101340 -42752 38932 94907 99973 81773 41554 -46090 -127131 -112404
555a12404P7729M3637K7146O4214K6489q7629j07664j7365J7746p654L4769J03539
$$ -112404 -34675 8962 36108 100322 126811 39182 -68482 -85847 -68101 -75755 -40986 62553
567F2553O2976l5507o1077m1311n0005m6045J3232O9721P2729M7316J0704l7172
$$ 62553 125529 90022 28945 -12366 -62371 -108416 -95184 -25463 47266 94582 105286 68114
579F8114o5819n6899l9864j3354M7231R1188N6034j373j3876k7096p5602p6451
$$ 68114 2295 -54604 -94468 -107822 -60591 30597 86631 85258 71382 44286 -31316 -107767
591a07767K613O0501M8932L8429M8771J3517n9677q1962m1789p410J1171M6704
$$ -107767 -105154 -44653 4279 42708 91479 104996 45319 -36643 -78432 -85842 -74671 -27967
603b7967P3759M8782j678l7384n7879o0143l0350J3098M2853N8305N5519J9000
$$ -27967 45792 94574 92896 55512 -2367 -62510 -92860 -79762 -36909 21396 76915 95915
615I5915l2082n7396n1469l6172r526L6768O9442N5989J7496j4636m1997o2679
$$ 95915 63833 6437 -45032 -81204 -90730 -53962 15480 71469 88965 74329 32332 -30347
627c0347n3441j0114L2919N3252N7210L9651q52m1603n8648n1480k5733J2696
$$ -30347 -83788 -93902 -60983 -7731 49479 89130 88278 46675 -11973 -63453 -89186 -76490
639g6490M8831O0391M2235P864k6059n0247n6792l4966O705M2707N4463M4879
$$ -76490 -27659 32732 74967 82831 56772 6525 -50267 -85233 -78528 -35821 18642 63521
651F3521J9831j4624m7894o0286l9521p37L1545M7568N1788L4185p336m5184n6233
$$ 63521 83352 68728 20834 -39452 -78973 -79710 -48165 -597 51191 85376 78040 32856 -23377
664b3377m2079j5167J7210M5748N6431L8869J143l5188n1482m5524k5025N905
$$ -23377 -65456 -80623 -63413 -17665 38766 77635 78778 43590 -7892 -53416 -78441 -72536
676g2536M0065N9039M5403P479k4815m0924m9766m1268m102M0120N3885M0561
$$ -72536 -32471 26568 71971 79450 54635 13711 -36055 -77323 -81425 -41305 12580 53141
688E3141K0570m609l7997n7372m2662o029K5130M1760M5842L3734J4l5017n1384
$$ 53141 73711 69102 31105 -26267 -68929 -74958 -49828 -8068 37774 71508 71522 36505 -14879
701a4879m2677j6481J5112L9023M8375L9246R237k8910m9426m3455k4295J202
$$ -14879 -57556 -74037 -58925 -19902 28473 67719 76956 48046 -1380 -44835 -69130 -67928
713f7928L1458N2579M4991J3160j8603l8473m5582l7616q113K8993M7791M2678
$$ -67928 -36470 16109 61100 74260 55657 17184 -28398 -66014 -74127 -45134 2657 45335
725D5335K2626m566l3811m8111m0092j3198J8897M1074M5394L1394L374k6902
$$ 45335 67961 63395 29584 -18527 -58619 -71817 -52920 -11846 33548 64942 68316 41414
737D1414m5005m3156k1861R096L4532M5251L6736J2091j9523m1555m3658k7709
$$ 41414 -3591 -46747 -68608 -59512 -24980 20271 57007 69098 49575 8020 -35638 -63347
749f3347j58K7649M4028L9552J8311j1122l5416m4226l3782p809K1721M0518M2088
$$ -63347 -63505 -35856 8172 47724 66035 54913 19497 -24729 -58511 -66320 -44599 -4081 38007
762C8007K6267j600l0219m3862l7764j5497J1806L4956M3694L2382N522k2635
$$ 38007 64274 62674 32455 -11407 -49171 -64668 -52862 -17906 25788 58170 63692 41057
774D1057l9293l9302k3981K863L0321M2170L4960J2714j4001l4557m0968k9340
$$ 41057 1764 -37538 -61519 -58656 -28335 13835 48795 61509 47508 12951 -28017 -57357
786e7357l358K3898L9624L7554K0004n791k9654m1263l3676j0565J6785L4557
$$ -57357 -60715 -36817 2807 40361 60365 54574 24920 -16343 -50019 -60584 -43799 -9242
798i242L8830K6657J865k4372l9615l5807j7057P779K9944M0032L1084Q138j7487
$$ -9242 29588 56245 58110 33738 -5877 -41684 -58741 -50962 -21018 19014 50098 58236 40749
811D0749l4788l7804k3957M45K5118L8131L4418J5776r514l0849l7757k8890p243
$$ 40749 5961 -31843 -55800 -55355 -30237 7894 42312 58088 48574 17725 -20032 -48922 -56165
824e6165J8169L4877L5725K1461k071k4760l7354l2471j3105J1285L0074L6582
$$ -56165 -37996 -3119 32606 54067 51996 27236 -10118 -42589 -55694 -44409 -14335 22247
836B2247K7154M371j9841l4113l4063j9152M020K5768L6825L0364J0745j2523
$$ 22247 49401 53772 33931 -182 -34245 -53397 -49377 -23609 13216 43580 54325 41802
848D1802l0390l5752k4485l071K0635L4236L2208J6514n312k6139l5346k8437
$$ 41802 11412 -24340 -48825 -51896 -31261 2975 35183 51697 46385 20246 -15100 -43537
860d3537q922J4064L0181L3739K2844M14k0663l3065l0962j5486P767K7155L3216
$$ -43537 -52459 -38395 -8214 25525 48369 48783 28120 -4945 -35907 -51393 -43626 -16471 16745
873A6745K6130P640j4168l0971l3188j9363J775K0261L1823K9699J3525r247k7317
$$ 16745 42875 50515 36347 5376 -27812 -47175 -45400 -25139 6684 36383 49908 40661 13344
886A3344l2771k3357n045J5432K9292L1678J9116l454k3750l0838k5030j2014
$$ 13344 -19427 -42784 -47829 -32397 -3105 28573 47689 44235 20485 -10353 -35383 -47397
898d7397P710K7752L4592K1417K49j5955k5897l0297j9967M628K6228L0407K1754
$$ -47397 -39687 -11935 22657 44074 44323 28368 2471 -27826 -47793 -43165 -16937 13470 35224
911C5224R184q055k5869l3337k1892J267J9673K6125K5006J6525j878k4873l4424
$$ 35224 44408 36353 10484 -22853 -44745 -43478 -23805 2320 27326 43851 41973 17100 -17324
924a7324k1597j905J0869K0709K9983K5047j069k4842k7495j9631j2370K60K2019
$$ -17324 -38921 -40826 -29957 -9248 20735 45782 44713 19871 -7624 -27255 -39625 -39365 -17346
937a7346L5068K3604n51j6118k0390k3428k2527l043K3397L3098K0456M156m749
$$ -17346 17722 41326 40775 24657 4267 -19161 -41688 -44731 -21334 11764 32220 36376 31627
950C1627j5009l0375k8863j793K3280K4121J6238J6458P104j9222l6444k3742
$$ 31627 16618 -13757 -42620 -44413 -21133 2988 19226 35684 42788 23566 -12878 -36620
962c6620K48J0841J3873K3464K6771N996k1683l0103j8265p511j353J2464K9889
$$ -36620 -36372 -25531 -11658 11806 38577 44573 22890 -7213 -25478 -32989 -34342 -21878 8011
975H011K9506M754j9513k0633j4944j8357j1648J5531L6040K3754K88o205q210
$$ 8011 37517 42271 22758 2125 -12819 -31176 -42824 -27293 8747 32501 32789 26584 18374
988A8374k2925l0987q666K0891K5876J4712J1359Q092j1117l0775k7793n053J2683
$$ 18374 -4551 -35538 -44204 -23313 2563 17275 28634 36726 25609 -5166 -32959 -38012 -25329
1001b5329J6189J6762K0510J2879j2229l1152k3330m430K845N679K1349L0729
$$ -25329 -9140 7622 28132 41011 28782 -2370 -25700 -30130 -27285 -21606 -257 30472
1013C0472J2254j7108k3320j3294j3065j2685P609L0630K6269N052p086j0823
$$ 30472 42726 25618 2298 -10996 -24061 -36746 -29137 1493 27762 32814 25728 14905
1025A4905j7959k3704j2872J0886K5382K0706J0071K474o522k0761k7008j3297
$$ 14905 -3054 -26758 -39630 -28744 -3362 17344 27415 29889 23367 2606 -24402 -37699
1037c7699R761J9509J6028J4682J2645m563k5867k5564q395L371P312J6958K4362
$$ -37699 -27938 -8429 7599 22281 34926 30363 4496 -21068 -29463 -26092 -18780 -1822 22540
1050B2540J3597q156k0544j8459j3357p360O008K0988K3786J2338l162j3837j7790
$$ 22540 36137 27981 7437 -11022 -24379 -31739 -25731 -4743 19043 31381 28219 14382 -3408
1063c408j7142j1174L629J9199K2916J2940J411p509j6526k2076j3621L595J5443
$$ -3408 -20550 -31724 -28095 -8896 14020 26960 28371 20862 4336 -17740 -31361 -27766 -12323
1076a2323J8437J5792Q398m787j8193k1273j3612j639J0306J8026J9063J0643
$$ -12323 6114 21906 30304 25517 7324 -13949 -27561 -29200 -18894 -868 18195 28838
1088B8838k203j3445j9729j6754n806O794J6004J9269J3412J901j0542j8759j7870
$$ 28838 26635 13190 -6539 -23293 -29099 -22305 -6301 12968 26380 28281 17739 -1020 -18890
1101a8890q761L703J3298J7991J5767N573q023j7443j8166j0520m01R285J7836
$$ -18890 -27651 -23948 -10650 7341 23108 28681 20658 3215 -14951 -25471 -25872 -16587 1249
1114A249J8732Q123n678j4450j6078j3679n553P237J7860J8746R064k099r759
$$ 1249 19981 28104 22426 7976 -8102 -21781 -27334 -20097 -2237 16509 25573 23474 13715
1127A3715j5388j7442r096N964J6333J6756J0528L509n385j6656k0106r470M369
$$ 13715 -1673 -19115 -28211 -22247 -5914 10842 21370 24879 19494 2838 -17268 -26738 -22369
1140b2369J1032J3624J5441Q824m620j6553j7022r863j138O835J3891J7429J0258
$$ -22369 -11337 2287 17728 26552 21932 5379 -11643 -21506 -22644 -15809 -1918 15511 25769
1153B5769l411j3451j5158j1913n399L576J4654J9016J0327k156r353j2220j5362
$$ 25769 22358 8907 -6251 -18164 -23563 -19987 -5333 13683 24010 21854 12501 281 -15081
1166a5081j1217L053J5338J5792J0347M190l574j3869j7777j0498J649J0313J3370
$$ -15081 -26298 -23245 -7907 7885 18232 22422 18848 4979 -12798 -23296 -21647 -11334 2036
1179B036J3189P862k085j2899j6243j1845j860O781J1823J4780J0998m12j1662
$$ 2036 15225 23087 21002 8103 -8140 -19985 -21845 -15064 -3241 11539 22537 22125 10463
1192A0463j4710j1297n648J705J1716J6367J1317P56p580j1011j3769r500J186
$$ 10463 -4247 -15544 -21192 -19487 -7771 8596 19913 20669 13089 2078 -11691 -21191 -20005
1205b0005J1315J4337J0923M207l610j2176j4960j0022j004Q420J3079J2965P780
$$ -20005 -8690 5647 16570 20777 17167 4991 -9969 -19991 -20995 -12575 504 13469 21249
1218B1249j434j0999j4521j1849l630M814J1432J3566J0556J333q655j2731j1803
$$ 21249 19815 8816 -5705 -17554 -21184 -16370 -4938 8628 19184 20517 11862 -869 -12672
1231a2672o317J257J0418J3552J0559K546n405j0947j2949q779j11R106J2407
$$ -12672 -18989 -17732 -7314 6238 16797 19343 13938 2991 -9958 -18737 -18848 -9742 2665
1244B665J1151N529k651j0296j3531j0096j747O145J1302J1914P613k25q956j2579
$$ 2665 13816 19345 16694 6398 -7133 -17229 -18976 -12831 -1529 10385 17998 17773 8817 -3762
1258c762j0486m180L557J0291J2579R499J567p107j1712j1887o661J000Q510J2685
$$ -3762 -14248 -18428 -14871 -4580 7999 17498 19065 11958 246 -11641 -18302 -17302 -8792 3893
1272C893J0832L611l935j0021j1663q692k031P007J1087J0190O166j309q045j1552
$$ 3893 14725 18336 14401 4380 -7283 -15975 -18006 -10999 88 10278 16444 15135 7090 -4462
1286d462r236k701M835R463J1027P016L02p356j1016r836n007K266R106J1519
$$ -4462 -13698 -16399 -11564 -2101 8926 15942 16244 8888 -2128 -11964 -16971 -14705 -5599 5920
1300E920Q537K372n148r822j1039o961M22O956J0596R804M739k731q918j0658
$$ 5920 14457 16829 11681 1859 -9180 -16141 -15719 -8763 1833 11637 16376 13645 4727 -5931
1314e931p596k017M971R888J0425N754o49o981j0359r708l623L246Q215R869P875
$$ -5931 -13527 -15544 -10573 -685 9740 15494 14845 7864 -2495 -12203 -15826 -12580 -4365 5504 13379
1329A3379J668n516r627r046m803O13O914R686Q222K523l976p814r364o253k4
$$ 13379 15047 9531 -96 -9142 -13945 -13332 -6418 3268 11490 14013 10037 2223 -7141 -13394 -13418
1344a3418N744R701Q780M310k564p376r722q479k471M363R089R104O006O67m912
$$ -13418 -7674 2027 10807 15117 12553 5177 -4545 -13024 -15495 -11132 -2043 7061 13067 13734 8822
1359H822r319r737l935K280O892Q535P188K921l522r063q877m297Q12M900P631
$$ 8822 -497 -10234 -14169 -11889 -4997 3538 10726 13647 10125 1062 -7815 -12112 -11300 -6400 1231
1374A231Q815M356l709p971p669n078k789K999Q989R497L793k437m411p427p638
$$ 1231 10046 14402 10693 2722 -4947 -10025 -12814 -9815 -826 8671 12464 10027 5616 -1811 -9449
1389i449l880K948Q465Q535M893l17l594p312q800n654K826Q202P109M831L797
$$ -9449 -13329 -10381 -1916 6619 11512 11195 7601 289 -8511 -14165 -11339 -3137 3972 8803 12600
1404A2600j03r059j1481m067K256K387M518R251P479k659q727n581l315l802O09
$$ 12600 12497 3438 -8043 -12110 -9854 -7467 -2949 6302 13781 11122 2395 -3186 -6501 -10303 -9694
1419i694P279Q484M522j252m821o305n113l476K44N796J0327O022k955l243k563
$$ -9694 -2415 6069 10591 9339 4518 -1787 -6900 -10376 -10132 -4336 5991 12013 9058 5815 3252
1434C252p440r398Q60J0167O430J002L766L502p192j2432l870L761J922K918P934
$$ 3252 -4188 -13586 -12726 -2559 3871 4873 8639 12141 4949 -7483 -11353 -7592 -5670 -2752 5182
1449E182P019j446o951o600n075k403K376M928N969P219K387o540p790k545j824
$$ 5182 12201 10755 3804 -2796 -7871 -10274 -7898 -2970 2999 10218 12605 6065 -1725 -4270 -6094
1464f094m354K143J1730O960l930l466R54m890j0035m75R370O021K22L149K063
$$ -6094 -10448 -8305 3425 10385 6455 2989 3943 -947 -10982 -11457 -2087 3934 4156 7305 9368
1479I368n393r046m358N93K633N351O347L735L14k694p504p918j478M116K509
$$ 9368 3975 -5071 -9429 -8836 -6203 -852 5495 9230 9544 6850 -654 -8572 -10050 -5934 -3425
1494c425L068P734M547n941q061j757r70m060J554R512O653j802k195j301n032
$$ -3425 -357 7377 11924 5983 -2078 -3835 -4805 -8865 -7311 2201 8854 7052 4857 3556 -1476
1509a476o849r76M796M656M046L769p9m433m699l857l252J514O148N014J081P04
$$ -1476 -8325 -9301 -4505 151 4197 7966 7887 3454 -1245 -5102 -8354 -6840 -692 4322 5403 6107
1525F107n09n632p079j310L316K892L551N671K756l586o351l885k903j671L180
$$ 6107 5598 -34 -7113 -8423 -5107 -2215 1336 7007 9763 6177 -174 -4059 -6962 -8633 -5453
1540e453O231M762J942R3l157o099m173r43J200L128M621M506n36l269l746k802
$$ -5453 778 5540 7482 7575 4418 -1681 -5854 -6797 -5597 -2469 2152 6658 6122 2853 -893 -3695
1556c695k449K39M342M725K769M36k030m244m112k520j60L232N620L714M18j310
$$ -3695 -6144 -5905 -1563 3162 5931 6367 4337 93 -4019 -6539 -6699 -3467 2153 5867 6285 4975
1572D975k598m512m477k66K807M512L122K145K06k538n399m221k89K144K932L893
$$ 4975 2377 -2135 -6612 -6878 -4071 441 3563 5708 5914 3376 -2023 -6244 -6533 -4389 -1457 2436
1588B436L594J610k508n661l898r05K1Q98M489N175J052k574k650k228k817j328
$$ 2436 6030 7640 5132 -529 -4427 -5332 -5311 -4413 76 5251 6303 3729 1079 -1149 -3966 -5294
1604e294J648M522L269l53n76k180k993l259n18K318M421L744P01o91j298l741
$$ -5294 -3646 876 4145 3792 3216 1036 -1957 -5216 -5734 -3416 1005 4749 5450 4759 3461 -280
1620b80n197j677K834L628K082K641K774j768n421l502m34J14O36L395M712R95
$$ -280 -5477 -7154 -4320 -692 1390 4031 6805 5037 -384 -3886 -4320 -4206 -3570 -175 4537 5532
1636E532k164k458k775k373p93J718L255L391K067j105k454k677j793k141L97
$$ 5532 3368 910 -1865 -4238 -5031 -3313 -58 3333 5400 4295 1841 -836 -2629 -4770 -4373
1651d373L258L797Q85r26k56j884l879j823K322K771J845J798J441k028l678k855
$$ -4373 -1115 2682 3567 2641 2385 501 -3378 -5201 -2879 -108 1737 3535 4976 2948 -730 -3585
1667c585j237L70J691L772L526Q29r41k413l235k975m29Q44K488L004K544k69
$$ -3585 -4822 -4452 -2761 1011 4537 5366 4425 2012 -1223 -4198 -4627 -3783 -1295 1709 4253 3984
1683C984j996k290j814j460O2K621K741J315j13r14k129k949j233J261J830K168
$$ 3984 1988 -302 -2116 -3576 -3514 -893 1848 3163 3050 2136 7 -2942 -4175 -2914 -1084 1084
1699A084K044R04q60k703k373j474k81J783K223K462Q85q98j783k492k000n41
$$ 1084 3128 4032 3172 469 -1904 -3378 -3659 -1876 347 2809 3694 2796 1013 -1479 -3479 -4020
1715d020J707K264K259J558m0j947k842j948r31L31J977K808K144N15r05j677
$$ -4020 -2313 -49 2210 3768 3728 1781 -1061 -3009 -3940 -3609 -1632 1176 3320 3835 2930 1253
1731A253k643j454M7J277J380J951R90q81j613j752p42j60J031J910J940L78r39
$$ 1253 -1390 -2844 -2797 -1520 -140 1811 2801 1920 307 -1445 -2187 -2347 -1316 594 2534 2912 1973
1748A973j379j865k087j30J473K054J882J291L41j336k279k269o67O54J204K055
$$ 1973 594 -1271 -3358 -3488 -2015 39 1921 3212 3553 2217 -62 -2331 -2998 -2344 -1140 915
1764I15J471K98o39j826j993j213K69J317J768J712Q01l90j557j715j490m05O11
$$ 915 2386 2684 2045 219 -1774 -2987 -2718 -1401 367 2079 2880 2490 933 -782 -2272 -2677 -2066
1781b066J663J590P66K83j042j277j300m59R28J015J101N56j8j153j720j101l12
$$ -2066 -403 1187 1953 2236 1194 -83 -1383 -1842 -914 101 1202 1758 1740 587 -1133 -2234 -2546
1798b546R28J397J321J689k24r69j497k048o45k79J595J393J559Q37l0j342j117
$$ -2546 -1618 -221 1100 2789 2565 1596 99 -1949 -2594 -2873 -1278 115 1674 2511 2481 1139 22
1815B2j580k55L95J112J314O24Kj117q35r24o10O01J207J234P61m52q63j116o74
$$ 22 -1558 -1813 -1418 -306 1008 1632 1634 517 -318 -1242 -1852 -1251 -44 1190 1951 1499 636 -480 -1154
1834a154m77k3J049J332P92p3m37r14j142p52N32J084J015O62M69n70j587j235
$$ -1154 -1631 -1654 -605 727 1519 1446 1009 95 -1047 -1799 -1267 -183 832 1494 1963 1393 -194 -1429
1852a429p20mR39J378J018P19N9n13j852j255K43N21k36J095J558j47j173l45
$$ -1429 -2149 -2153 -1214 164 1182 1901 1960 1447 -405 -1660 -1417 -896 -1132 -37 1521 1374 201 -144
1870a44P7n73n53J067J489n8q58j73o23r85m11P30R91P88O39M5q06n12p88r73
$$ -144 -67 -640 -1193 -126 1363 1305 447 274 -349 -1334 -1745 -1015 -24 764 1403 1448 642 130 -658 -1631
1890a631m80J489J488l04K65Q93o54k056j052J313N00m44R60J911l79j980n47
$$ -1631 -2111 -622 866 562 827 1720 1066 -990 -2042 -729 -229 -673 287 2198 1819 -161 -708
1907g08m7m70p55J174J517N33k13m98n47n65J44J8m46J340R00p58j698M29P00
$$ -708 -755 -1225 -1980 -806 711 1244 1031 533 -14 -579 -435 -417 -863 477 1377 619 -1079 -650 50
1926E0j132n18K128J567j016p18Q45m23k571n57J332P97j36J051R56l32j091n58
$$ 50 -1082 -1600 528 2095 1079 361 1206 783 -1788 -2345 -1013 -216 -352 699 1655 1323 232 -326
1944c26m92l26M92P61m5N54M41m46j425l59R59k8n49J373J352j009j432oN89j260
$$ -326 -818 -1144 -652 109 64 618 1059 613 -812 -1171 -212 -240 -789 584 1936 927 -505 -511 78 -1182
1964a182m01J599J018n32l04P16q83j291N39M50K44O44Q98m57r58k14m28o96l98
$$ -1182 -1583 16 1034 502 198 914 31 -1260 -721 -271 -27 617 1515 1058 100 -114 -542 -1238 -1636
1983a636J468Q73J01J96N44r82j613m2J79n9K58R40R67p63o21L44n27k32L87P83
$$ -1636 -168 705 806 1002 1546 564 -1049 -1091 -912 -971 -713 227 1194 431 -190 154 -373 -605 -218 565
2003E65oj32k4j13j191k60M50L84K16R26O28l03r93m87l64m44J98R10L84N47j4
$$ 565 559 427 403 290 -901 -1161 -711 -327 -111 815 1443 1140 147 -340 -704 -1148 -950 -40 344 891 877
2024H77m11o59n93j06J44K36J282N55l05p76n3o10q65j38R31O01M70K28j03j77
$$ 877 466 -193 -786 -892 -748 -512 770 1325 1020 244 191 -419 -1284 -1422 -491 110 580 808 705 528
2044E28q84l28m20O82K96L91J94J25k05j071k17L16N93K41L71O54J26j322p70
$$ 528 -356 -684 -1104 -422 -126 265 459 584 379 -692 -909 -593 0 241 612 1266 1392 70 -700
2063g00k87l33J76P26J000O56R4l66q67p20m42j00L43R22R18R2o70j27j79j189
$$ -700 -987 -1320 -1144 -418 582 1238 1332 966 99 -621 -1063 -1163 -820 102 1020 1112 442 315 136 -1053
2083a053k97Q00J117K26K36j02l62j090r02M13M13M29O79O12qq70p23n37L3n9
$$ -1053 -1350 -550 567 793 1029 927 565 -525 -1427 -1014 -601 -172 507 1119 1111 241 -482 -1019 -986 -1045
2103a045J026P04M65P6o65j165o97J86j20P00J319J009k80p05l59j031q71k80
$$ -1045 -19 685 1150 1226 561 -604 -1301 -1115 -1235 -535 784 1793 1513 808 449 -582 -1453 -1733
2121a733Q92J041N33L74Q4o74j136o96K5O11O31P78M63J49q60j001j099J68M35
$$ -1733 -841 200 733 1107 1191 517 -619 -1315 -1290 -679 -48 730 1193 1342 482 -519 -1618 -1450 -1015
2140a015J165R42P2J74m13j093j041m29M29Q12R69R73j11n74p59j093o35K6R42
$$ -1015 150 1092 1164 1338 925 -168 -1209 -1638 -1209 -397 572 1545 1434 860 101 -992 -1627 -1601 -659
2159f59J200Q33N04l75j312j175o59j08Q92R25J054O28J6j184r19p30m02J89R32
$$ -659 541 1374 1878 1503 191 -984 -1643 -1751 -859 66 1120 1748 1764 580 -339 -1069 -1471 -1282 -350
2178c50J085R40j04p77j020j015l66M60Q97Q77J110L3n94j258j017j010K59J101
$$ -350 735 1675 1571 794 -226 -1241 -1607 -1147 -250 627 1737 1770 1176 -82 -1099 -2109 -1850 -749
2196g49J355Q44M18r7j263j288j058P3O54J036J025J032k00q94j456j065k61L62
$$ -749 606 1450 1868 1771 508 -780 -1838 -1765 -1111 -75 950 1982 1782 888 -568 -1633 -1894 -1532
2214a532J123J145R88r2p12q19j370n52K82P13J480J013K73m80j556p22j081J11
$$ -1532 -409 736 1724 1632 920 101 -1269 -1821 -1539 -826 654 1667 1940 1460 -96 -818 -1899 -1788
2232a788P18J316J223L27l58q80j535p48l03R00J139J447Q62m42r72j404j079
$$ -1788 -1070 246 1469 1796 1438 558 -977 -1725 -2028 -1128 11 1458 2320 1878 906 -498 -1577
2249a577p95O82J283J436R02O0m10j745j182o44J1R98J570J108K97m12j458j158
$$ -1577 -2372 -1690 -407 1029 1931 1991 1581 -164 -1346 -1990 -1979 -981 589 1697 1994 1582 124 -1034
2267a034j044q8R99J196J317J106n07j303j240j156l81O21J121J713P83o1p32
$$ -1034 -2078 -2166 -1167 29 1346 2452 1945 642 -598 -1754 -2135 -1514 -393 1320 2103 2042 1310
2284A310j624j174p49N78J215J517P54O58q52j560j604r23K21R74J543J327Q18
$$ 1310 -314 -1488 -2237 -1659 -444 1073 1827 2485 1633 73 -1531 -2454 -2233 -1259 284 1611 2429
2301B429n73j418j279j118m37J073J158J597R52k25j220j556j114p36Q65Q74J942
$$ 2429 1856 438 -841 -1959 -2396 -1323 -165 1432 2384 2159 939 -617 -1731 -2467 -1602 -728 1214
2318A214J108j31o95j551j549r54M39J438J464J306K98n75j806j368j025J22P51
$$ 1214 2322 2191 1496 -55 -1604 -2558 -2119 -681 783 2089 2387 1812 6 -1362 -2387 -2265 -1514
2335a514J639J711O51j95j672j484j400l33P54J597J637J031j89j197j462j395
$$ -1514 125 1836 2487 2292 620 -864 -2264 -2597 -1843 -246 1391 2422 2233 1036 -426 -1821
2351a821p12K75J464J802J306Rj012r80j667j332J95J429J705J115Q44n25j637
$$ -1821 -2533 -2258 -794 1008 2314 2323 1311 331 -1336 -2668 -2473 -1044 661 1776 2620 2095 458
2368D58j507j448rJ031J417J699J076j49j571j712j454m46O65J181K058J485P3
$$ 458 -1049 -2497 -2506 -1475 -58 1641 2717 2568 997 -715 -2169 -2615 -1950 -769 1289 2774 2847
2385B847j390j663j516q74m0J411K308J426Q1p78j262j847j259P0J262J529J848
$$ 2847 1457 -206 -1722 -2596 -2636 -1225 1083 2509 2590 1812 550 -1297 -2556 -2486 -1224 305 2153
2402B153O64n69j299k049j414k85J098J546J794R37k3j086j747j959l43M17J171
$$ 2153 2817 2248 949 -1100 -2514 -2799 -1701 -155 1639 2576 2553 1467 -280 -2239 -2582 -2165 -994
2419i94K086J616M62j561j728j540j322M53J309J696J971L94p42j530j799j328
$$ -994 1092 2708 3170 1609 -119 -1659 -2981 -2528 -1219 477 2448 2842 2100 570 -1229 -2557
2435b557o64J389J849J961Q41l29j336j757j881n90R79J868J707J151L98j311
$$ -2557 -3221 -1832 17 1978 2819 2490 1154 -603 -2484 -3074 -2095 -227 1480 2631 3029 1718
2451A718k142j761r06O06J443J976J387O00n89k048j680j458Q3J460J561J987
$$ 1718 -424 -2185 -3091 -2485 -1042 934 2321 2921 2332 284 -1396 -2854 -2771 -1311 250 2237
2467B237Q29n01j388k161j605n21Q31J918K086J319j89j625j796j789q46N58J743
$$ 2237 3066 2565 1177 -984 -2589 -3110 -2279 -361 1725 3044 2855 1230 -566 -2355 -3201 -2643 -900
2484i00J944J724K94j113j834j780j246k91J869K226J336Q51n88j694j881j798
$$ -900 1044 2768 3062 1949 115 -1665 -2911 -3202 -1333 893 2229 3080 2492 798 -1083 -2881
2500b881j73J153K017K146O78l36j319k205j576q64Q17K149J823J486K41j417
$$ -2881 -3054 -1901 116 2262 2940 2604 1285 -920 -2496 -3360 -2543 -394 1429 2915 3156 1739
2516A739k068j938q45M70J437K234J702O08j161j587k342j106l10J359K341J683
$$ 1739 -329 -2267 -3112 -2642 -1205 1029 2731 3339 2178 591 -1751 -2857 -3167 -1808 533 2216
2532B216P76l43j625k175j877l33J120K032J900J339M2j454j870k263q86Q08J666
$$ 2216 2992 2649 1024 -1151 -3028 -3361 -2241 -209 1691 3030 3072 1618 -252 -2515 -3401 -2593 -927
2549i27K271J330P95j260j827k538r57K10J197K325J813J154j014j726k342j354
$$ -927 1344 2674 3469 2209 382 -2156 -3113 -2903 -1706 619 2432 3586 2572 846 -1496 -2850
2565b850l18J099K217K103J026l31j747j957j868q02J004J792K322J321K83j354
$$ -2850 -3168 -2069 148 2251 3277 2946 1199 -758 -2626 -3428 -2424 -632 1690 3011 3294 1940
2581A940k227k002j053M15J897K156J726N78j071j884k425j160p5J457J901K115
$$ 1940 -287 -2289 -3342 -2927 -1030 1126 2852 3430 2359 475 -1950 -3110 -3185 -1728 173 2288
2597B288J007m32j630k275j844n06R75K135K256J535m83j170k254j951j096O53
$$ 2288 3295 2863 1233 -1042 -2886 -3392 -2417 -282 1974 3509 3026 1856 -398 -2349 -3445 -2792
2613b792K047K011J803M39j111k017k715j048K5K002K285J525P87k73j981k504
$$ -2792 -745 1266 3069 3508 2397 380 -2335 -3383 -3358 -1356 929 2454 3241 2968 987 -1517
2629a517j544m81J291K139K373J133j45j823k216k207m32Q03J786K729J428J26
$$ -1517 -3061 -3542 -2251 -112 2261 3394 3249 1426 -790 -2997 -3429 -2626 -840 1889 3317 3443
2645C443j270k545j898j478N76J736K340K168L05p70k436k166j575K80J252K398
$$ 3443 2173 -372 -2270 -3748 -3172 -1436 904 3072 3377 2607 171 -1995 -3570 -3290 -2038 360
2661C60K185R19k09k079k189k065m40J096K210K144J601l18j569k201k218r94
$$ 360 2545 3464 3255 1176 -1013 -3078 -3518 -2422 -212 1932 3533 3215 1646 -555 -2773 -3767
2677c767Q94J908K281J953M22j604j855k344j348K53J417K446K342N76n52k312
$$ -3767 -2873 -965 1316 3269 3691 2087 232 -2112 -3460 -3207 -1790 656 2998 3574 3022 710
2693G10k431j464l45J359K155K303J502n50j575k653k070o30Q53K073K830J143
$$ 710 -1721 -3185 -3530 -2171 -16 2287 3789 3239 1664 -989 -3059 -3689 -2836 -763 2067 3210
2709C210L76j620k392k006j157N64J648K377J996M14r32k051k353j560L2J410
$$ 3210 3586 1966 -426 -2432 -3589 -3025 -1377 1000 2996 3410 2478 427 -1926 -3486 -3454 -2044
2725b044K574J952J160l77j986k799j526p10J138K610K087J406nj324k631k469
$$ -2044 530 2482 3642 3265 1279 -1520 -3046 -3756 -2618 -8 2079 3485 3480 2156 -475 -2944
2741b944j064Q24K352K262J878N20j145k367k549j401N09J438K449K070R21p02
$$ -2944 -4008 -3184 -832 1430 3308 3828 2683 316 -2233 -3634 -3125 -1687 762 2832 3753 3051
2757C051k541k233j494k23R63K441K570J047l84j658k588j951r75J204K248K124
$$ 3051 510 -1723 -3217 -3440 -2477 -36 2534 3581 3197 1539 -1049 -3000 -3975 -2771 -523 1601
2773A601J811J00j421k244k352j138M45J706K586J974K96q70j917k778j217j33
$$ 1601 3412 3512 2091 -153 -2505 -3643 -3198 -1492 1094 3068 3364 2494 577 -2201 -3418 -3551
2789c551J472K418K402J094n54k203k443k021l05J020K397K509J596j67k012k152
$$ -3551 -2079 339 2741 3835 3281 1078 -1365 -3386 -3691 -2671 -274 2235 3831 3664 1652 -500
2805e00k369j064Q01K401K191J700L55r78k340k743j261L06J787K683J963Q56
$$ -500 -2869 -3933 -3132 -731 1460 3160 3515 2537 197 -2546 -3807 -3501 -1714 969 2932 3788
2821C788q72k062k753j407p03J752K364K446J416o92j726k453k174p34R23K258
$$ 3788 2916 854 -1899 -3306 -4009 -2257 107 2553 3969 3277 1551 -902 -3076 -3810 -2887 -629
2837f29K466J767J47j594k450k192j501O44K133K267K238N45r29k489k404j497
$$ -629 1837 3604 3751 2157 -293 -2485 -3986 -3342 -1209 1058 3296 3841 2912 423 -1981 -3478
2853c478k7J384K572K146J156m26k105k697j814m82J269K216K479J605m95j443
$$ -3478 -3505 -2121 451 2597 3753 3327 1222 -1475 -3289 -3771 -2502 -286 2193 3798 3303 1860
2869A860k603k057r58M78K174K658J750O05j479k394k310j445L4J890K601K125
$$ 1860 -743 -2800 -3758 -3280 -1106 1552 3302 3907 2428 34 -2276 -3721 -3687 -1797 804 2929
2885B929R49p30k444k392j881k80J303K640K220J251j35j972k456k095q22R38
$$ 2929 3878 3148 704 -1688 -3569 -3849 -2546 94 2314 3565 3430 1458 -998 -3093 -3915 -2977
2901b977K316K507J735K38j747k483k230j368O85J933K398J966R66r86k665k473
$$ -2977 -661 1846 3581 3819 2072 -411 -2641 -4009 -3324 -1391 1007 2973 3939 2953 288 -2185
2917b185j494O4J178K978K364J143q79j970k915j498p82J042K771K116J731q4
$$ -2185 -3679 -3615 -2437 541 2905 4048 3169 1199 -1716 -3214 -3996 -2954 -183 1933 3664 3580
2933C580j541k529k446j080O85K278K539K340Q2j161k593k513j678L88J734K704
$$ 3580 2039 -490 -2936 -4016 -3331 -1053 1486 3826 3908 2747 154 -2359 -4037 -3649 -1915 789
2949G89K205N85l60k199k977j759k4J383K506K346J402m15j815k792j961r82R30
$$ 789 2994 3579 3219 1020 -1957 -3716 -3740 -2357 149 2495 3897 3482 1667 -1125 -3086 -4068 -3138
2966c138K459K559J713J96j612k587k285j232M35K021K594K065O56j070k233k603
$$ -3138 -679 1880 3593 3789 2177 -410 -2695 -3927 -3492 -1471 1123 3188 3844 2774 541 -2062
2982b062j678QJ653K510K426J217q77j775k887k376r9J351K200K579J647j2j831
$$ -2062 -3740 -3732 -2079 431 2857 4074 3197 1422 -1465 -3841 -3940 -2589 -389 2190 3837 3825 1994
2999A994k583k205j203P98J903K689K262J22j346k499k303j444K32J699K811K142
$$ 1994 -589 -2794 -3997 -3199 -1296 1393 3655 3777 2431 -68 -2371 -3815 -3583 -1884 927 3069
3015C069Q92r34k144k464k100m32J589K656K411J403l52j925k139k643p08R41
$$ 3069 3961 3027 883 -1581 -3681 -4113 -2524 132 2543 3946 3594 1669 -470 -3113 -3821 -2880
3031b880K241K428J830J90j618k537k245j171L84K149K317K484M60j125k494k494
$$ -2880 -639 1789 3619 3809 2191 -346 -2591 -3762 -3378 -1229 1088 3572 4032 2907 413 -2081
3047b081j795J11J706K638K319J053l19k469k844j717p28J482K282K682J526k96
$$ -2081 -3876 -3765 -2059 579 2898 3951 3632 1163 -1681 -3398 -4126 -2644 -362 2320 3846 3550
3063C550j882k500k318r39J088J931L003J645K53j284k461k460j562N43J887K193
$$ 3550 1668 -832 -3150 -4089 -3001 -1070 1933 3578 3831 2547 86 -2374 -3936 -3393 -1506 687
3079F87K436J030q09k700k576j785n9J710K050K626J126l50j907k554k137q10
$$ 687 3123 4153 3344 644 -1932 -3717 -3776 -2066 -16 2610 3736 3386 1479 -1075 -3212 -4022
3095d022J115K357K719J463J52j498k579k411j234M77K286K239K385K72j119j980
$$ -4022 -2907 -550 2169 3632 3784 2286 -293 -2704 -3938 -3461 -1175 1064 3449 3721 2602 622
3111F22k953j234m2J653K463K296J137q27j915k735j954n82J450K404K342J680
$$ 622 -2331 -3565 -3607 -1954 509 2805 3942 3115 1200 -1535 -3489 -4071 -2621 -217 2125 3805
3127C805l19j634k531k187j143P14K287K775J941L13j563k475k461j138L34J482
$$ 3805 3486 1852 -679 -2866 -4009 -3295 -1008 1767 3708 4021 2458 -17 -2478 -3616 -3282 -1800
3143a800K868J993Q58j005k282k726j449k66J528K576K220J613n82j826l034k108
$$ -1800 1068 3061 3919 2914 632 -2094 -3543 -3809 -2281 295 2515 4128 3546 1720 -1314 -3422
3159c422l40P99K265K750J791j87j497k624k455j036O41K202K167K277M50j112
$$ -3422 -3762 -2963 -698 2052 3843 3656 2159 -465 -2920 -3956 -3315 -1113 1054 3331 3781 2669
3175B669k339k585j356j19J756K497K413J068p75k169k542k033l64J276K273K508
$$ 2669 330 -2255 -3611 -3730 -1974 523 2936 4004 3229 1060 -1482 -3515 -3879 -2603 -330 2178
3191B178J591l76j717k699j939r12R50J965K638J723jr25k610k321j362K91J882
$$ 2178 3769 3393 1676 -1023 -2962 -3874 -2924 -959 1679 3402 3401 2476 -134 -2455 -3817 -3526 -1644
3208a644K618K069Q80r89k379k294j748k63J630K308K346J093m24j991k354j943
$$ -1644 974 3043 3923 2934 555 -1739 -3487 -3750 -2120 188 2534 3627 3203 1212 -1142 -3085
3224c085o38J201J980K510J620o6j239k756k173j189O40K023K335K149M77j165
$$ -3085 -3723 -2522 -542 1968 3588 3522 2283 -473 -2646 -3835 -3195 -1172 1163 3312 3789 2624
3240B624k342k401j307j17J662K606K245R21p76k213k471j901j74J141K571K315
$$ 2624 282 -2119 -3426 -3543 -1881 725 2970 3891 3115 902 -1569 -3470 -3644 -2503 68 2383
3256B383J467k54j968k388k302r04J086K160K356J849J27j457k101k697r69L02
$$ 2383 3850 3596 1628 -760 -3062 -3966 -2880 -720 1636 3485 3612 2155 54 -2643 -3612 -3310
3272c310J759K390K224R23j152k178k604j644PJ521K227K672Q49p37j820k574
$$ -3310 -1551 839 3063 3986 2834 656 -1948 -3592 -3585 -2064 163 2835 3684 2947 1127 -1447
3288a447j662n43P99K272K581J517oj505k567k190r95N85J811K835J877K41j170
$$ -1447 -3109 -3652 -2853 -581 2000 3517 3511 2006 -561 -2751 -3746 -3161 -1350 1485 3362 3603 2433
3305B433k228k495j226J72J567K266K307R43r29j770k388k037j36R32K447K341
$$ 2433 205 -2290 -3516 -3344 -1777 489 2796 3739 2810 1040 -1348 -3385 -3521 -2589 -142 2199
3321B199J194j2j894k333k087q95J149K089K581J222K63j310k340k266j299O13
$$ 2199 3393 3381 1487 -846 -2933 -3828 -2679 -590 1991 3213 3476 2166 -174 -2440 -3739 -3126
3337c126J664K478J846Q46r61k338k503j322L7J209K164K430J159m41j994k453
$$ -3126 -1462 1016 2862 3708 2747 409 -2094 -3416 -3379 -2170 -6 2424 3583 3142 1148 -1305
3353a305j622n38Q80K162K216J505M2j628k192j990j106N94K181K252J694P38
$$ -1305 -2927 -3465 -2585 -423 1793 3298 3340 1712 -480 -2470 -3576 -2982 -801 1451 3145 3883
3369C883j244k373k140j516O0J578K406K109J045p41k029k586j832j23J438K073
$$ 3883 2639 266 -1874 -3390 -3330 -1752 654 2763 3808 3067 1038 -1548 -3380 -3503 -2065 8
3385HK256R90n2j678k470k252n51Q77K044K344J742M03j345k453k018j326M52
$$ 8 2264 3254 3202 1524 -946 -3198 -3749 -2872 -828 1516 3258 3661 2316 -137 -2155 -3481 -3029
3402c029J719K246K011O71q36k374k384j325N9J214K390K104J019m69j895k606
$$ -3029 -1310 936 2947 3618 2782 408 -1976 -3301 -3242 -2028 362 2466 3485 3016 1121 -1485
3418a485j763k88J062K362K186J391k5j756k233k212o64N63J935K117K005M43
$$ -1485 -3248 -3536 -2474 -112 2074 3465 3440 1684 -549 -2761 -3425 -2862 -927 1190 3195 3638
3434C638j262k342k041j372K58J654K351J832Q91q64k056k069j789k87J337K127
$$ 3638 2376 34 -2007 -3379 -3121 -1467 884 2716 3607 2743 687 -1382 -3171 -3458 -2121 6
3450FK433J047l72j614k578j409j066J016J824K541J390J98j442k296k266p41
$$ 6 2439 3486 3114 1500 -1078 -2487 -3553 -2537 -713 1828 3218 3416 1974 -322 -2588 -3329
3466c329N15J688K355J653M02r40j823k538j364j3J607K024K229Q79o50j607k298
$$ -3329 -2814 -1126 1229 2882 3284 2344 521 -2017 -3381 -3394 -1787 237 2466 3345 2695 1088 -1210
3483a210j665m27R78J953K268J420o9j652k420j550r45O85J550K069K111K67j237
$$ -1210 -2875 -3302 -2324 -371 1897 3317 3248 1596 -824 -2374 -3319 -2634 -1084 985 3096 3363 2126
3500B126j941k386q43l41J815K343J772O15n37j771k296j731J12J201K161J995
$$ 2126 185 -2201 -3044 -3385 -1570 773 2545 3160 2623 852 -1444 -3175 -3063 -1862 299 2294
3516B294J051m53j765k096j865k19P52J965J827J889k83j159k494j774q95K37
$$ 2294 3345 2892 1127 -969 -2834 -3053 -2301 -336 1491 3380 3097 1938 -556 -2330 -3225 -2988
3532b988J812K183J813N37p77k256k029j401n6J532K159J933O58n57j836j989
$$ -2988 -1176 1007 2820 3357 2580 324 -1705 -3106 -3162 -1630 529 2462 3120 2563 727 -1262
3548a262j366n28J129J939K131J284j49j794k104j805q13P87J785K241J399J84
$$ -1262 -2628 -3156 -2027 -88 2043 3327 3178 1384 -720 -2525 -3338 -2551 -766 1475 2874 3058
3564C058j108k037k018r71L24J443K192J847O02q43j993k075j365l1J323J823
$$ 3058 1950 -87 -2105 -3076 -2752 -1309 883 2730 3332 2489 496 -1579 -2944 -2975 -1652 171
3580A71J719J059l28j329k190j794o11J001J905J907J592j40j313j894j815j200
$$ 171 1890 2949 2621 1292 -898 -2692 -3303 -2302 -397 1510 3102 2962 1649 -245 -2060 -3260
3596c260N35J980J919J770J45j053j786j920j315j1J476K281J631O86l54j855
$$ -3260 -2725 -745 1174 2944 3089 2036 250 -1670 -2985 -2996 -1520 761 2392 3078 2724 869
3612H69k154j490j39J098J885J745J175p6j588j939j665p20O61J920J867J087
$$ 869 -1285 -2775 -2914 -1816 69 1814 2989 2913 1325 -614 -2279 -2999 -2338 -418 1449 2536
3628B536M06r92k121j885j041L69J501K031J968J44o43j773k008j241n7J255J597
$$ 2536 2942 1950 -171 -2056 -3097 -2728 -1227 804 2772 2916 2273 500 -1508 -2749 -2806 -1551 46
3645D6K189M78j17j581j799j844l69R39J650K083J249r6j012k328j532r49P01
$$ 46 2235 2713 2596 1015 -784 -2628 -2997 -2058 -408 1675 2924 2828 1816 -512 -2044 -2993 -2292
3662b292J560J930J375K23o95j880j962r59Q6J226J819J685Q18p27j545j964j205
$$ -2292 -732 1198 2573 2796 2101 221 -1741 -2700 -2614 -1388 431 2116 2934 2207 662 -1302 -2507
3679b507j20Q55J968J635J100k31j474j931j322q97O58J821J655J564j7r46j998
$$ -2507 -2627 -1772 196 1831 2931 2700 1226 -705 -2027 -2924 -2266 -445 1210 2774 2757 1811 -187
3696a87j689q53L25J278J816J682N28j056j237j967j486L06J017J764J697P16
$$ -187 -1876 -2729 -2404 -1126 690 2372 2900 1844 607 -1360 -2846 -2540 -1523 241 1938 2654
3712B654k04j567j912j264m13O40J454K141J226k64j121j849j693m70O92R53K374
$$ 2654 2450 883 -1029 -2293 -2706 -2066 -612 1529 2755 2491 1370 -479 -2172 -2642 -1950 -997 1377
3729A377J077K79q52j637j931q95J20J265J842J461O95r79j006j989j804K56J318
$$ 1377 2454 2733 1881 244 -1687 -2582 -2462 -1197 645 2106 2801 1822 816 -1173 -2977 -2721 -1403
3746a403J405J732R43k84j450j853j505k25M76J611K101R55J74j415j562j530
$$ -1403 2 1734 2677 2393 943 -910 -2415 -2640 -2164 -553 1548 2503 2677 1262 -300 -1830
3762a830q21M33J332J672J611J84n59j735j769r54q9J033J685J911N77m95j335
$$ -1830 -2651 -2218 -886 786 2397 2581 2022 287 -1482 -2436 -2525 -1492 193 2104 2681 2186 851
3779H51j855j310mM74J690J823Q62k61r39k226j066p33N77J756J508J333K78j272
$$ 851 -1004 -2314 -2318 -1844 -154 1669 2531 2270 1331 -895 -1961 -2694 -2117 -361 1147 2480 2758 1486
3797A486j387j630j094K90J241J785J133Q40p60j555j496j201j07J079J564J594
$$ 1486 99 -1531 -2625 -2335 -1094 691 1824 2664 1904 349 -1147 -2348 -2455 -1376 188 1782
3813A782P74m44j384j736j283j12O80J480J633J163j19j113j650j555n33K03J384
$$ 1782 2556 2112 728 -1008 -2291 -2403 -1723 -243 1390 2553 2434 1321 -329 -1884 -2417 -2214 -830
3830h30J737J097L12n93j629j585r02N3J051J593J600P49o35j393j731r06m06
$$ -830 907 2004 2316 1723 94 -1491 -2393 -2340 -1289 304 1904 2653 2018 625 -1106 -2012 -2418
3847b418R14J251J765J085l46j058j582j355p43N68J567J273J277L11j036j649
$$ -2418 -1504 -253 1512 2597 2251 1193 -389 -1744 -2487 -1919 -352 921 2198 2509 1473 -176
3863a76j501o87L92J293J326J573P8n92j285j491j086j99J129J485J433Q44o45
$$ -176 -1677 -2364 -1972 -679 647 2220 2298 1706 421 -1070 -2156 -2355 -1226 259 1692 2536 1891
3880A891j032j568j381l16N60J547J577J037j10r49j699j336o78L46J571J263
$$ 1891 859 -709 -2090 -2406 -1846 -299 1278 2315 2205 1256 -443 -1779 -2457 -2111 -540 723
3896G23J059O20q75j363j681p77J81J066J420J288O14o14j152j602r48k82Q55
$$ 723 1782 2402 1527 164 -1517 -2294 -2113 -1047 373 1661 2275 1661 509 -1093 -2041 -2323 -1468
3913a468J510J290J062l13j197j551j046n42N15J369J469R35K84r54j574j428
$$ -1468 42 1332 2394 2081 884 -667 -1713 -2255 -1740 -371 1098 2033 2317 1363 -211 -1639
3929a639o04K59J376J440Q78L72k83j501j555p94O7R55J271J475N18m12j226j451
$$ -1639 -2243 -1984 -608 832 1710 2082 1799 298 -1257 -2051 -1984 -1029 242 1717 2235 1823 597 -854
3947h54r16k31L79J433J576J015l31j118j499r68p56O93J212J333J141k33n92
$$ -854 -1770 -2001 -1622 -189 1387 2402 2071 953 -546 -1514 -2270 -1577 -365 968 2109 1876 1284
3964A284j361j218p54J71Q75J563J145L05k21j050j965q55j5Q18J460J147P71
$$ 1284 -77 -1295 -2049 -1878 -1003 560 1705 2010 1789 739 -1226 -2081 -2096 -1278 182 1329 2100
3981B100j77j241j248j265j80O20J063J318R36j86q98j090j198m96J60J066J429
$$ 2100 1923 682 -566 -1831 -2011 -1391 -328 990 1926 1740 842 -248 -1446 -1942 -1782 -716 713
3998G13R45K03o52j104j418p28J86R52J097J272L11l82p35j500j000k80J025J034
$$ 713 1658 1861 1209 105 -1313 -2041 -1855 -903 194 1466 1777 1395 660 -840 -1840 -2120 -1095 -61
4016f1J237P91k26r03j249j261k92L15J049J515P72J72o89j262j078q95J73J134
$$ -61 1176 1967 1741 838 -411 -1672 -1964 -1649 -600 915 1687 1859 1170 -92 -1170 -2065 -1892 -758
4034g58J370R46K55l19j346j041r40o0Q08J126J155O04J1j035j537p32k07L71
$$ -758 612 1558 1813 1494 148 -893 -1833 -1893 -1085 41 1196 1800 1811 776 -761 -1493 -1700 -1329
4052a329J112J162O74M01j041j180j136m29J63J216J295N88N66o71j387j176p29
$$ -1329 -217 945 1619 2020 979 -201 -1337 -1766 -1603 -387 908 1496 2062 1391 4 -1172 -1901
4069a901M46Q29R97R40L51k43j055j411n38k55P58J265Q43P39j43j016r75j037
$$ -1901 -1455 -626 371 1311 1662 1419 364 -1047 -1585 -1840 -1082 183 1026 1765 1622 606 -369 -1406
4087a406q6K32Q22J051Q96L63q78r04j211n22j1P97J267R98J75k91j046j152p12
$$ -1406 -1492 -1260 -438 613 1509 1872 994 90 -1121 -1643 -1654 -857 410 1408 1583 1292 246 -906 -1618
4106a618%N94J274Q84O84k31j077r61r52j32L80J176R16O98Lq17q76j216l04L42
$$ -1618 -1618 -1024 250 1134 1818 1587 510 -451 -1403 -1535 -1155 21 937 1635 1638 821 -55 -1271 -1575 -1233
4126a233Q76J150N95L1m18j001j047n92L92P74P19J187M70n25j200r90p75K5O00
$$ -1233 -357 793 1388 1419 1001 0 -1047 -1639 -1247 -473 246 1433 1903 1378 178 -812 -1587 -1562 -962
4145i62J072R42N55m28p25o45j250j81L76J144J039L90P0n36r71j269l97M18J080
$$ -962 110 1052 1607 1179 454 -191 -1441 -1622 -1246 -102 937 1327 1397 861 -110 -1379 -1776 -1358 -278
4164b78J051M33J11l04q32j112l92q0O63R97J069K14m5r30j278p79j12N90J203
$$ -278 773 1206 1317 1013 181 -931 -1323 -1403 -740 257 1326 1540 1495 565 -713 -1492 -1604 -1014 189
4183A89Q44L17j21k74j049j167l04M24R01J022M22K67o37p78q09n23q0Q77R27
$$ 189 1033 1350 1229 955 -94 -1261 -1565 -1141 -240 782 1204 1471 834 56 -753 -1276 -1356 -479 448
4202D48Q50K62l48q73j264o18J35Q06Q79Q55oK81j146p94p25k32K81J236P10M48
$$ 448 1298 1560 1212 339 -925 -1543 -1408 -602 277 1132 1126 1407 261 -533 -1258 -1490 -1209 27 737 1185
4222A185J94n64r88r10k98KJ218M97P45K58k97q41j125k61j95Q03J164N49J17
$$ 1185 1379 815 -173 -1083 -1381 -1379 -161 336 1081 1339 1042 201 -924 -1185 -1380 -577 587 1136 1253
4241A253K02j241q62o61R9L91P13P99O24k11m86r90o35l27J49Q47Q89P28K2m43
$$ 1253 1455 214 -648 -1309 -1210 -819 -106 693 1317 1106 620 -370 -1005 -1332 -1183 -336 553 1281 1303 860
4261H60j135p16l71J47O12J235O06j45M9j210o75p00J68O23Q27P23N27o10m96
$$ 860 -275 -991 -1362 -1215 -603 632 1238 1093 1142 -68 -743 -1443 -1275 -652 175 898 1425 815 319
4280C19j029l63k55N95P76P79N36k93k87r95r83j16M88P62P73L95J39m95o96o52
$$ 319 -710 -1073 -1328 -733 43 822 1358 1065 778 -217 -1200 -1316 -828 -66 707 1102 1241 746 50 -602
4300f02o25K63L59R03Q56L54p11o60q40l68q8N42P50O01K45M7p26n89p04l17M95
$$ -602 -1227 -964 -605 298 1154 1508 797 137 -703 -1071 -1159 -617 133 734 979 1026 300 -289 -993 -1310 -815
4321h15Q54N98Q94l45o35q80m75l93L51O36R17M37R2o70p94o87p0P6L77R08N82
$$ -815 39 637 1531 1186 551 -329 -804 -1197 -846 -210 707 1144 1236 566 -228 -915 -985 -909 -532 376 958
4342I58M11p60o22o56k84j47N58O98O96L69l65o50o01o54r2M16N00R40L21N0o86
$$ 958 1369 609 -13 -669 -953 -1100 -542 156 852 1221 856 206 -395 -1049 -1141 -725 -225 715 1036 1086 400
4363D00n63l92m45N8O64O98M57m5N2r42n98j08j30L30O46Q70J02k68o49l31r80
$$ 400 -163 -555 -1000 -942 -278 420 877 832 884 -58 -656 -764 -894 -564 82 952 1054 786 137 -194 -1174
$$ [...]
8191D2
##END NTUPLES=NMR FID
##END=
