##TITLE=1H_SR102_2_2
 CDCl3
 8 sc, 
 8.02.2022
##JCAMPDX= 6.0         $$ Bruker NMR JCAMP-DX V2.0
##DATA TYPE= NMR FID
##DATA CLASS= NTUPLES
##ORIGIN= UXNMR, Bruker Analytische Messtechnik GmbH
##OWNER= root
$$ XWIN-NMR		Version 3.5
$$ Tue Feb  8 11:45:04 2022 Russian Standard Time (UT+4h)  she@DPX200
##.OBSERVE FREQUENCY= 200.131346
##.OBSERVE NUCLEUS= ^1H
##.DELAY= (6, 6)
##.ACQUISITION MODE= SIMULTANEOUS
##.ACQUISITION SCHEME= undefined
##.AVERAGES= 8
##.DIGITISER RES= 18
##SPECTROMETER/DATA SYSTEM= spect
##.PULSE SEQUENCE= zg30
##.SOLVENT NAME= CDCl3
##.SHIFT REFERENCE= (INTERNAL, CDCl3, 0, 15.7039)
##AUDIT TRAIL= $$ (NUMBER, WHEN, WHO, WHERE, WHAT)
$$ ##TITLE= Audit trail, XWIN-NMR		Version 3.5
$$ ##JCAMPDX= 5.01
$$ ##ORIGIN= Bruker BioSpin GmbH
$$ ##OWNER= she
$$ F:/spectra/data/she/nmr/H-F/1/audita.txt
$$ ##AUDIT TRAIL=  $$ (NUMBER, WHEN, WHO, WHERE, WHAT)
(   1,<2022-02-08 11:42:23.39 +0400>,<she>,<DPX200>,
      <created by zg, POWCHK disabled, PULCHK disabled
       configuration hash MD5:
       00 E9 B6 7A A2 85 ED C7 34 08 36 98 17 FE 4E 26
       data hash MD5: 16K
       DF C4 4C 5F 26 C8 32 05 63 59 86 F0 02 B3 88 33>)
$$ ##END=
$$ 
$$ hash MD5
$$ C5 8B 7A 10 6E ED 3A 3F 81 00 0C 44 05 D6 5E 98
##$RELAX= 
##$RELAX= 
##$RELAX= 
##$RELAX= 
##$RELAX= 
##$RELAX= 
$$ Bruker specific parameters
$$ --------------------------
##$DU= <F:/spectra>
##$EXPNO= 1
##$NAME= <H-F>
##$PROCNO= 1
##$TYPE= <nmr>
##$USER= <she>
##$AMP= (0..31)
100 100 100 100 100 100 100 100 100 100 100 100 100 100 100 100 100 100 
100 100 100 100 100 100 100 100 100 100 100 100 100 100 
##$AQSEQ= 0
##$AQ_mod= 1
##$AUNM= <au_zg>
##$AUTOPOS= <>
##$BF1= 200.13
##$BF2= 200.13
##$BF3= 200.13
##$BF4= 200.13
##$BF5= 200.13
##$BF6= 200.13
##$BF7= 200.13
##$BF8= 200.13
##$BYTORDA= 1
##$CFDGTYP= 0
##$CFRGTYP= 5
##$CHEMSTR= <none>
##$CNST= (0..31)
1 1 145 1 1 1 1 1 1 1 1 1 1 1 1 1 1 1 1 1 1 1 1 1 1 1 1 1 1 1 1 1 
##$CPDPRG= <>
##$CPDPRG1= <>
##$CPDPRG2= <>
##$CPDPRG3= <>
##$CPDPRG4= <mlev>
##$CPDPRG5= <mlev>
##$CPDPRG6= <mlev>
##$CPDPRG7= <mlev>
##$CPDPRG8= <mlev>
##$CPDPRGB= <>
##$CPDPRGT= <>
##$D= (0..31)
0 1.2 0 0 0 0 0 0 0 0.06 0 0.03 0 0 0 0 0.0002 0 0 0 0 0 0 0 0 0 0 0 0 
0 0 0 
##$DATE= 1644306142
##$DBL= (0..7)
120 120 120 120 120 120 120 120 
##$DBP= (0..7)
150 150 150 150 150 150 150 150 
##$DBP07= 0
##$DBPNAM0= <>
##$DBPNAM1= <>
##$DBPNAM2= <>
##$DBPNAM3= <>
##$DBPNAM4= <>
##$DBPNAM5= <>
##$DBPNAM6= <>
##$DBPNAM7= <>
##$DBPOAL= (0..7)
0.5 0.5 0.5 0.5 0.5 0.5 0.5 0.5 
##$DBPOFFS= (0..7)
0 0 0 0 0 0 0 0 
##$DE= 6
##$DECBNUC= <off>
##$DECIM= 32
##$DECNUC= <off>
##$DECSTAT= 4
##$DIGMOD= 1
##$DIGTYP= 9
##$DL= (0..7)
0 120 120 120 120 120 120 120 
##$DP= (0..7)
150 150 150 150 150 150 150 150 
##$DP07= 0
##$DPNAME0= <>
##$DPNAME1= <>
##$DPNAME2= <>
##$DPNAME3= <>
##$DPNAME4= <>
##$DPNAME5= <>
##$DPNAME6= <>
##$DPNAME7= <>
##$DPOAL= (0..7)
0.5 0.5 0.5 0.5 0.5 0.5 0.5 0.5 
##$DPOFFS= (0..7)
0 0 0 0 0 0 0 0 
##$DQDMODE= 0
##$DR= 18
##$DS= 0
##$DSLIST= <SSSSSSSSSSSSSSS>
$$ [...]
##$SUBNAM2= <"">
##$SUBNAM3= <"">
##$SUBNAM4= <"">
##$SUBNAM5= <"">
##$SUBNAM6= <"">
##$SUBNAM7= <"">
##$SUBNAM8= <"">
##$SUBNAM9= <"">
##$SW= 18.0517287032376
##$SWIBOX= (0..15)
0 0 2 0 0 0 0 0 0 0 0 0 0 0 0 0 
##$SW_h= 3612.71676300578
##$TD= 16384
##$TD0= 1
##$TE= 0
##$TE2= 300
##$TE3= 300
##$TEG= 300
##$TL= (0..7)
0 120 120 120 120 120 120 120 
##$TP= (0..7)
150 150 150 150 150 150 150 150 
##$TP07= 0
##$TPNAME0= <>
##$TPNAME1= <>
##$TPNAME2= <>
##$TPNAME3= <>
##$TPNAME4= <>
##$TPNAME5= <>
##$TPNAME6= <>
##$TPNAME7= <>
##$TPOAL= (0..7)
0.5 0.5 0.5 0.5 0.5 0.5 0.5 0.5 
##$TPOFFS= (0..7)
0 0 0 0 0 0 0 0 
##$TUNHIN= 0
##$TUNHOUT= 0
##$TUNXOUT= 0
##$USERA1= <user>
##$USERA2= <user>
##$USERA3= <user>
##$USERA4= <user>
##$USERA5= <user>
##$V9= 5
##$VALIST= <valist>
##$VCLIST= <CCCCCCCCCCCCCCC>
##$VD= 0
##$VDLIST= <DDDDDDDDDDDDDDD>
##$VPLIST= <PPPPPPPPPPPPPPP>
##$VTLIST= <TTTTTTTTTTTTTTT>
##$WBST= 1024
##$WBSW= 4
##$XGAIN= (0..3)
0 0 0 0 
##$XL= 0
##$YL= 0
##$YMAX_a= 410501
##$YMIN_a= -480164
##$ZGOPTNS= <>
##$ZL1= 120
##$ZL2= 120
##$ZL3= 120
##$ZL4= 120
##$ABSF1= 10
##$ABSF2= 0
##$ABSG= 5
##$ABSL= 3
##$ALPHA= 0
##$AQORDER= 0
##$ASSFAC= 0
##$ASSFACI= 0
##$ASSFACX= 0
##$ASSWID= 0
##$AUNMP= <proc_1d>
##$AZFE= 0.1
##$AZFW= 0.1
##$BCFW= 1
##$BC_mod= 2
##$BYTORDP= 1
##$COROFFS= 0
##$CY= 11.3945322036743
##$DATMOD= 1
##$DC= 2
##$DFILT= <>
##$DTYPP= 0
##$F1P= 2.36226072786647
##$F2P= -0.459571619588291
##$FCOR= 0.5
##$FTSIZE= 0
##$FT_mod= 4
##$GAMMA= 1
##$GB= 0.15
##$INTBC= 1
##$INTSCL= 1
##$ISEN= 128
##$LB= 0.24
##$LEV0= 0
##$LPBIN= 0
##$MAXI= 10000
##$MC2= 0
##$MEAN= 0
##$ME_mod= 0
##$MI= 1.114404
##$NCOEF= 0
##$NC_proc= 0
##$NLEV= 6
##$NOISF1= 3.799351
##$NOISF2= 2.8
##$NSP= 1
##$NTH_PI= 0
##$NZP= 0
##$OFFSET= 15.70392
##$PC= 1
##$PHC0= -15866.99
##$PHC1= 8.80078
##$PH_mod= 1
##$PKNL= yes
##$PPARMOD= 0
##$PSCAL= 0
##$PSIGN= 0
##$REVERSE= no
##$SF= 200.130013532006
##$SI= 16384
##$SIGF1= 3
##$SIGF2= 2
##$SINO= 400
##$SIOLD= 16384
##$SREGLST= <1H.CDCl3>
##$SSB= 0
##$STSI= 0
##$STSR= 0
##$SW_p= 3612.71676300578
##$SYMM= 0
##$S_DEV= 0
##$TDeff= 0
##$TDoff= 0
##$TI= <>
##$TILT= no
##$TM1= 0
##$TM2= 0
##$TOPLEV= 0
##$USERP1= <user>
##$USERP2= <user>
##$USERP3= <user>
##$USERP4= <user>
##$USERP5= <user>
##$WDW= 1
##$XDIM= 8192
##$YMAX_p= 0
##$YMIN_p= 0
$$ End of Bruker specific parameters
$$ ---------------------------------
##NTUPLES= NMR FID
##VAR_NAME=  TIME,          FID/REAL,        FID/IMAG
##SYMBOL=    X,             R,               I
##VAR_TYPE=  INDEPENDENT,   DEPENDENT,       DEPENDENT
##VAR_FORM=  AFFN,          ASDF,            ASDF
##VAR_DIM=   8192,          8192,            8192
##UNITS=     SECONDS,       ARBITRARY UNITS, ARBITRARY UNITS
##FACTOR=    0.0002768,     1,               1
##FIRST=     0,             0,               0
##LAST=      2.2672688,     0,               0
##MIN=       0,             -480164,         0
##MAX=       2.2672688,     410501,          0
$$ Real data points
##PAGE= N=1
##DATA TABLE= (X++(R..R)), XYDATA
0@%%%%%%%Oj4J6j6J6k4L2m0N4o2P3r7J20j37J62j95K34k78L25l76M34n05N84o65
31c53P59q68R83j110J253j408J579j769J975k200K445k716L013l335L685m068
47b135M488m947N451o005O615p290Q039q876R818j0882J2098j3502J5144j7097
61i081J9464k2401K6163l1182L8243m8984O7480j07927L51231k50252n12918O39023
73A58859J1087l97174J47545L24862k20319r4541J495j17937J23993K99369j80484
84E6755j90845J46832k9670j54880K42094J12626k08512Q9661J25545m17670j43125
95c71189M97428J32209l54170L7304K00486j61115j39321Q8421P6365J55947N4906
106B17271l11823j03391L45068j358k97786J81600K17724l27877j63913K43833
$$ y = [0, 0, 0, 0, 0, 0, 0, 0, 6, -8, 8, -8, 8, -16, 16, -24, 30, -32, 41, -56, 64, -73, 89, -106, 128, -150, 175, -201, 233, -272, 312, -353, 406, -462, 521, -589, 664, -744, 835, -934, 1041, -1159, 1286, -1430, 1583, -1752, 1933, -2135, 2353, -2594, 2857, -3148, 3467, -3823, 4216, -4660, 5158, -5724, 6374, -7128, 8016, -9081, 10383, -12018, 14145, -17037, 21206, -27778, 39702, -68225, 283006, 32754, -480164, 158859, 169946, -227228, -79683, 245179, 24860, -69681, -68186, -186123, -62130, 237239, 56755, -134090, 12742, -16928, -171808, 70286, 182912, -25600, 64061, 189606, -228064, -371189, 126239, 258448, -95722, -58418, 142068, -19047, -158368, -69947, 6418, 162365, 217271, -94552, -197943, 147125, 145767, -152019, 29581, 247305, -80572, -244485, -652]
116f52j6040q4335K48951j852l32054L8201K02971j22609j4421K31037j6170j29787
128C240K5794r1860o2265K51990M8057k92166N1149K32604k12161j73010K91381
139G2753J04542k31693l519Q0282j24074L6836J82629o3175o8017J09550q9141
150F973j76413J20524J17252r1391M1630P5053j67208n3780J73076k9503j06615
161i0402J50538N7715j87638L137J48859m3526l0976R2631o7697j12132P4525
172d966J6661p9919R3278Q3297j40190n7279Q9287n0686m7101J36255L1593j07029
184c6799L5458M8729r5397J2264J12612n1308o5469P4537j6218q6527P7810P0496
196H0188r0333k0491O0772n7509l8266R1361K0390m5707M2359o78r3273J6436
$$ y = [-652, -16692, -101027, 147924, 146072, -185982, -147781, 55190, -67419, -81840, 149197, 133027, 3240, 29034, -62826, -125091, 126899, 174956, -117210, -66061, 166543, -45618, -218628, 72753, 177295, -54398, -57917, 22365, -101709, -64873, 117756, 54581, -13436, 96114, 6973, -169440, -48916, 68336, -23055, 18575, 93628, -73580, -127360, 45716, 16213, -90402, 60136, 117851, -69787, -66650, 82209, 38683, 7707, 100338, 32641, -79491, -4966, 11695, -68224, 25054, 108351, -31839, -89118, 169, -50517, -97618, 38637, 70230, -36799, -1341, 47388, -48009, -35745, 76867, 25559, -39910, 34627, 18409, -68118, 9692, 80188, -10145, -30636, 30136, -27373, -65639, 25722, 46112, 405, 42764, 42086, -51187, -34751]
208c4751O9619m6326j8803P1221k7406p1944M3247K4740n5883K5785N1700n6782
220b5583k2994P3557N883l8598L6838J7371m8215k058J7834k3998K0795M4275
232E5107m3754l9671M1002p478n9062K6221M8723l0106j3814L3654j1197j9019
244a9394K8756K61l1569J7528J8416k4754L036K9245j2896j6209J3048j3232j9222
257b6986K7940J7073k0979J0276K7446k0320k3271J6178N301j4595M877O496r199
270B37J319J140j6973n389R545r401r489J6369J1365n388O893R236q110l408P917
285E863r07n93J1197L597o678j0j466j1333m993K495k779o13P078K233l210M38
301C19j354n541j442K171Q96K612L850M0k159k198m313l438Q71J885K385O337
$$ y = [-34751, 34868, -11458, -30261, 40960, 13554, -58390, -15143, 9597, -46286, -20501, 31199, -25583, -48577, 24980, 30863, -7735, 29103, 46474, -1741, -3799, 14035, -9963, 10832, 55107, 11353, -28318, 12684, 5206, -53856, -27635, 21088, -9018, -22832, 10822, -375, -19394, 9362, 9623, -21946, -4418, 13998, -10756, -7720, 21525, 8629, -7580, 5468, -7764, -26986, 954, 18027, -2952, 7324, 34770, 14450, -8821, 7357, 12658, -1937, 2940, 9436, 237, 1556, 2696, -14277, -19666, -10121, -19522, -29011, -12642, -1277, -6665, 228, 9464, 1354, -2054, 5863, 4956, 4363, 15560, 19157, 12479, 12469, 11003, -330, -5323, -2828, -5607, -6220, 858, 3091, -119, 319, -1035, -6576, -8018, -5847, -4951, -2339, 1511, 1551, -608, -2806, -7119, -10557, -9686, -7801, -5416, 921]
317I21N501R91O34N11j729j373J765J133J342L220r09n207l592l859q017m888
333a3556K280J535j412K670M255j397k803J056R05J602M216L343K029N682K059
348A2464p160l431M876l391q242N406Q679l271l439L148k270m831K73j172j699
363d060O540K520p830q4N008p762o326N599k688n651J0238N292r174O043J3197
378A0862j0308j0228J3519O746o636O914O915p630k34M39j4777L35J6123j0456
392A584j5546J4822M451k1151M605J6582j3769p214J6355p013j1598K3115Q943
405A4166k0860N630J2171k1632l571K6167m650j1664K1160l317k9285J3780K1152
418A9247k1620p4K6983j9414k2906K5982M126k6040J7160J4824l6750o809K9618
$$ y = [921, 6422, 7413, 8047, 8558, 6829, 5456, 7221, 8354, 9696, 12916, 12007, 6800, 3208, -651, -8668, -13556, -11276, -9741, -11153, -8483, -4228, -5625, -8428, -7372, -6467, -4865, -649, 2694, 4723, 10405, 12464, 5304, 1873, 6749, 3358, -4884, 522, 9201, 5930, 2491, 5639, 3369, -1462, -1189, -2361, -4060, 2480, 5000, -2830, -2914, 2094, -5668, -11994, -6395, -9083, -14734, -4496, 796, -8378, -2335, 10862, 554, -9674, 3845, 10591, 3955, 10869, 17784, 10154, 9920, 10359, -4418, -4083, 12040, 1584, -13962, 860, 5311, -15840, -11235, 5347, -8422, -15636, 719, -6294, -17892, 5223, 14166, -6694, -1064, 11107, -10525, -14096, 12071, 7421, -4243, 16917, 13600, -15685, -1905, 19247, -2373, -2447, 24536, 5122, -17784, 8198, 12324, -13716, 3444, 18268, -18482, -25291, 4327]
431D327j2707j1435L4417l844l8235J5547J9600k6631J0198M0751j8199k4819
443a1030K1667n962k0464L3793J3384m0489Q120K7649m1717j6168N7327J452m6787
456a9225J4362J2681l7578J2085L8435k1626q189L1768l0317m0084M3714K6027
468B2053l2213J5628K0883m7711n742M8897k0429k2036O0271P69p8183J2408N8695
481C3290k4630j5648L7995j6409l5593J8727p315k0868N4333K1506p2697r997
493c7306N1116l0051k5448O3707R600n3122J7580J4724n2145K2555P4511l2469
505B3252m9569L7670K637m3891K7444L3549k1945J0517M478o7762J587Q4902j7437
518B5432n8528N1741K1979q3565o402O6077r498j2247L5694l4538m9290M7245
$$ y = [4327, -8380, -19815, 14602, 10758, -27477, -11930, 7670, -18961, -8763, 31988, 13789, -11030, 10637, 4675, -15789, 18004, 31388, -9101, -981, 26668, -15049, -31217, 26110, 27562, -19225, -4863, 7818, -29760, -17675, 20760, -866, -9055, 22713, -7604, -47688, -3974, 22053, -10160, 5468, 26351, -21360, -27102, 21795, 1366, -20670, 39601, 40370, -37813, -25405, 33290, 8660, -6988, 31007, 14598, -20995, -2268, -9583, -30451, 23882, 45388, -27309, -37306, 13810, -16241, -41689, 22018, 31618, -21504, -3924, 10800, -41345, -18790, 55721, 23252, -26317, 11353, 13990, -29901, -2457, 31092, 9147, 19664, 24142, -43620, -42033, 42869, 25432, -33096, 18645, 40624, -42941, -49343, 16734, 7236, -5011, 30683, -3855, -53145, -5900]
530e900K3838m2047K9067M2469n4364k9317M0603r627m552O2491j5126p6906L0898
543h473M3520o1688k934Q5544j4713p0480J3428J0997k5021L5966K7321m6215
555a2748J193L1854n2634k3191P9898J5294n5327J6308J2761n4467J7422O4225
567D0588k9197k3968N0431k2587o9542L9734N5166l1075l128K3648m3170j8938
579c2038M4522j1324k1451N5502P21q1209Q125N6144k8267j1118N3204j8235n2233
592c7657K6791J3846l2550L6686M3253n0791k7487L7529j2706j9918M9621J1316
604C7933m5878R495J3447m5205J0611O1904k1568m2122K9174j897m5044K6808
616a2342M0356k8887o557K2949l4604k1778M9108J0091l2020K3035J2595m8056
$$ y = [-5900, 17938, -24109, 4958, 47427, -6937, -36254, 4349, -5278, -9830, 52661, 37535, -39371, -8473, 35047, -26641, -29575, 55969, 41256, -29224, -15796, -4799, -29820, 6146, 33467, -12748, -11555, 20299, -32335, -55526, 24372, 39666, -15661, 647, 13408, -41059, -23637, 40588, 11391, -12577, 37854, 15267, -54275, -14541, 40625, 9550, 6422, 30070, -13100, -32038, 12484, 1160, -20291, 35211, 35932, -45277, -37152, 18992, -9275, -20393, 32811, 14576, -37657, -10866, 2980, -29570, 7116, 50369, -422, -27909, 9620, -3086, -23004, 26617, 37933, -7945, 1550, 14997, -30208, -19597, 42307, 20739, -21383, 7791, 5894, -39150, -12342, 28014, -873, -7430, 15519, -19085, -40863, 8245, 18336, -13684, 9351, 21946, -26110]
628b6110O10M4004j2736j1054L5565j4602m4483K4589K3658k6913J2019K9835
640C4382l4562k5097K9898k882k0084L2197J0027m1714j032K3051k0396j285L8335
653B0838j0004l0670J7174N156k4951J9183K9959k2737j2057K0330j3530j6425
665a7734L0295J0110k6049P594J1909k7792l262L0138n618j6732J5302m236k4950
678b1025J2665J6847j6074K286J8021j9412j6452K2518N316j4750J3861R498k1759
691h460r71J8033q152m414K0510m133k0556Q922R056j3409M646J4300j2811r654
705g093J1171n536j0568J4719O048j6894L11R983j0412l713J5049j061r276P186
719h6J484j0161O357J1322p758k442R578m884p870R497L901p822L343L941r539
$$ y = [-26110, -25500, 18504, 5768, -5286, 30279, 15677, -28806, -4217, 19441, -7472, 4547, 34382, -180, -25277, 4621, 1739, -18345, 13852, 23879, -17835, -18867, 4184, -16212, -17497, 20838, 10834, -19836, -2662, 2494, -22457, -3274, 26685, 3948, -8109, 12221, -1309, -17734, 12561, 22671, -3378, 4216, 16125, -11667, -14929, 15209, 9591, -7141, 8161, 3925, -21025, -8360, 8487, -7587, -5301, 12720, -6692, -23144, -626, 4690, -10060, 3801, 13299, -8460, -9431, 8602, 450, -3964, 16546, 12413, -8143, 779, 9835, -3574, 1072, 15372, 2561, -7093, 4078, -1458, -12026, 2693, 8741, -8153, -7842, 2141, -8271, -11984, 3065, 2004, -7272, -86, 1398, -8763, -2406, 8916, 1158, -1284, 8294, 3410, -4460, 5037, 8938, 1116, 4459, 8400, -1139]
734a139j914Q293l798n246O267n40r255K394M657n166J02O013l964m120N764R86
750f66m530N115L971m967R5N034j763j669N026P2m085K204J232l898N68L002k978
767A763l104K519j452l563J808J010k771l62J445j574m55K341J81j308J957J557
783hj252J124K020k21M03J352L2m12P93L82j155J25M66j522r97k23m97j371l03
802a264n26q93l09m6o69L6M70M91p52J142Q62J32N52Q65Q62L58R00L08M57K09
822C185M13j65K4j2o87p63k07o33p89r28k69q34n04k84o37k69qj35L93j2P52K91
844b078O30Q11M61Q02O33O05J09J298r2k56N42L27r33m62N4q54p67J07r72r41
864i76%o45j385J76L79r69l68J119k57j90J295P45m95J287J383p59N25J954l25
$$ y = [-1139, -3053, 5240, 1442, -3804, 2463, 1923, -7332, -4938, -281, -5447, -5345, 668, -3296, -7416, -1652, -666, -5196, -81, 3890, -1077, -982, 4052, 2289, 620, 5646, 5718, 1633, 3837, 5069, 1171, 1739, 4741, 1763, -1341, 1178, -274, -3837, -2029, -1019, -3790, -4152, -2707, -4281, -4736, -2395, -2214, -3522, -1565, -8, -1260, -136, 1884, 1663, 2066, 3418, 3450, 3038, 3831, 4213, 3058, 3183, 3649, 2127, 1130, 907, 410, -961, -1264, -1790, -2683, -2992, -3038, -3707, -3671, -3201, -2710, -3462, -2320, -1458, -1326, -774, 91, 953, 1311, 2211, 2519, 2976, 3185, 3598, 3433, 3457, 3445, 2758, 1995, 1788, 1155, 366, -562, -831, -1665, -2169, -2453, -3090, -3359, -3367, -3502, -3109, -3121, -2369, -2078, -1448, -637, -176, 626, 1259, 1864, 1973, 3271, 3179, 2923, 3465, 3792, 2859, 2397, 2451, 1597, 830, 937, -35, -976, -976, -1621, -3006, -2830, -2451, -3420, -3788, -2669, -2926, -3116, -1821, -1076, -1571, -284, 1099, 340, 865, 2819, 2494]
883B494m10J776j61j737R45N83j684j6Q51j758j957J040k42k220P62N55k697j38
901d014J826j152q03K608O5j300J445J575j320J219K789j233j141L211m98k101
917A176K004J385k799K14J495l146j179K887j088l243J447M21l977M87L091k393
933c218m83K901j665k543L690J473k513K250L292l145q45L861k01j979L885K7
949D787m242R77K695l333n61L887k608m090K178mm053K615K367l983j243L666
965i45k805k153N292J479l765J789K578l577Q42N182j320k062L668o55m329K796
981B015L403l388o34L451m026l882M008K53l959K446J977o014r84M072j524j495
997d281M512l67m597K267K545k710J748N268k312l328L946O6l283L929L001m677
$$ y = [2494, 2084, 3860, 3699, 1962, 2907, 3490, 1806, 1790, 2641, 883, -1074, -34, -276, -2496, -1734, -1179, -3876, -4014, -2188, -3340, -4143, -1535, -1470, -2770, -1325, 250, -1070, 149, 2938, 1705, 564, 3775, 3277, 1176, 3180, 4565, 1766, 1980, 3475, 329, -850, 2037, 949, -2294, -847, -426, -4403, -3916, -825, -3218, -3701, -800, -2465, -5008, -1318, 155, -2358, -108, 3184, 39, -806, 3055, 2854, 875, 4760, 4787, 545, 1522, 4217, 884, 323, 4210, 1602, -2488, -310, -314, -4367, -1752, 615, -3368, -4611, -945, -3750, -5903, -611, 868, -2897, -1108, 1470, -2107, -1265, 3917, 2597, 535, 4203, 3548, -781, 2015, 5418, 2030, 1396, 4847, 821, -3061, 947, 1200, -2759, -313, 1664, -4350, -5334, -1262, -2786, -4281, 231, -136, -4733, -2466, 79, -2631, -883, 4385, 2073, -1255, 2691, 2757, -526, 3403, 6404, 1727]
1013A727n71K858l623k736N137O17m812O76Q85m724K55M695j961k293L663j522
1029a729n303L645M518l056J063L742l285k408M480J160k447L837K170n906j226
1044g45M455j834j900M714j058n504P71J165l657J656M744l908m194K732K49l720
1060f034M239L683l540n51K780l288r67O728J263m119K329J320m927L57N873j189
1076C957k256K604k247n478L090L223l745J91L320m821m199M149R27k446L460
1091b71K128o552o29M931j178n54O272p42o119K308K820l308K882N206l522m267
1107e95L101j109l518M811L005n858j371K345m358j742O461J19n097J904P56m867
1123f013J575O098j924j649M097k204n125M987M578l247J162L484n367k530N413
$$ y = [1727, 1156, 4014, 391, -2345, 2792, 3409, -1403, -727, 158, -4566, -4311, 384, -1577, -3870, -207, -1729, -7032, -3387, 1131, -1925, -862, 2880, -405, -2813, 1667, 2827, 380, 4217, 6387, 481, -745, 3710, 1876, -24, 4690, 3632, -1872, -1101, 64, -3593, -1937, 2807, -1101, -5295, -2563, -2314, -6034, -1795, 1888, -1652, -2203, 577, -2711, -3678, 3050, 4313, 194, 2523, 3843, -1084, -727, 5146, 3957, 1701, 4305, 2058, -3420, -330, 2893, -852, -661, 2659, -2162, -6361, -2212, -1285, -3731, -271, 1857, -4695, -5324, -393, -1571, -2125, 4147, 3405, -2714, -406, 2414, -894, 1988, 7194, 3672, -595, 2506, 1397, -2121, 2690, 5695, -163, -1534, 811, -3547, -5289, 1172, 1291, -3806, -1902, -1146, -6013, -4438, 1660, -264, -1913, 2184, -20, -5145, -158, 4420, 1173, 2335, 5819, 452, -2078, 3335]
1138C335nk721L817L05p434L37M460l234q20M971l010n759K652J698l458L644
1154a222M071m996k374M261p00k609N627K588m981O62K793l779L89N992j372l963
1170C87K760l55n449K596M321l376j932K611l528l546M821J382l914K056J713
1185E47n122n72N174n00j685L945l62m335K447L565k735J157L666k628l327K851
1201B086R24l246K556J710m420j233K788k492j637M153p66m006J270J253k876
1216c936R57L786j671j632K606q26k048L254K508k726N38K593k430q95L402k25
1232C255k324J596j5l154O11K095k103q44J782j601k663J741P77k052Q12J467
1248f20j905k36J931M4j103K242O78j919J159J801j031L39J761q16j335J275m3
$$ y = [3335, 3330, 609, 4426, 4731, -2703, -2366, 2094, -1140, -1960, 3011, 1, -5758, -3106, -1408, -4866, -1222, 2849, -2147, -4521, -260, -960, -3569, 2058, 4646, -335, 327, 3120, -659, -270, 5722, 4350, 387, 3147, 2792, -2657, -61, 4260, 884, -1048, 1563, -1965, -5511, -690, 692, -3222, -1166, 547, -4575, -5147, 27, -473, -2158, 1787, 1425, -2910, -463, 3102, 367, 1524, 5190, 2562, -765, 2086, 3010, -236, 2320, 4030, -390, -1623, 1165, -1327, -2964, 1189, 423, -3583, -2313, -1060, -3936, -2979, 807, -864, -2496, 110, -716, -2764, 490, 2998, 272, 810, 3403, 973, 78, 3480, 3255, 931, 2527, 2512, -642, -31, 2064, -39, -883, 899, -702, -3365, -1624, -847, -2899, -2087, -620, -2525, -2761, -830, -786, -1889, 353, 1031, -888, 271, 2072, 1041, 1380, 3141, 2325, 990, 2265, 2222]
1265B222j390O66O51j749q77J073j267j047J056k51j455N32N93j287L31J291o95
1282a603j96J364K54o15J011P23J93O2P71l08j17P06j66q97N21k36o08l18J59
1301G00n56r98P29o63p79k4j4n88J79M23k19J39N25J31P7Q32K76Q3M01O08L10
1322A572o9M65k08J19J24k29o79m0J29o30o48j71k31o56J48r9o27Ko2J8o0L92
1344a440J36J74N83J92l5P92K62J19K83N94J21j58J5K82n77M9J25p48k36K97j039
1365b09o63L07k40o86P3J97o27K20L94o11rJ337o6l06R05M60k60Q41N12o57L72
1386A284J253r46r37J539J03j517K87J12j110k64P92j625n18J634r37k462J468
1403a844J086j292Q2J727j156l80J956o46q33K895N56k577N41K268j096p60K414
$$ y = [2222, 832, 1498, 2149, 400, -477, 596, -671, -1718, -662, -913, -2368, -1836, -1243, -2530, -2199, -908, -1603, -1799, -435, -181, -796, 215, 938, 1131, 1193, 1964, 1656, 1539, 2245, 2079, 1182, 1703, 1467, 859, 541, 700, 144, -854, -125, -788, -1567, -1591, -1605, -2193, -2014, -1591, -1810, -1671, -1146, -1015, -938, -106, 170, 253, 654, 1262, 1572, 1503, 1968, 1760, 1879, 2003, 1774, 1095, 1055, 1184, 554, -94, -265, -496, -1152, -1004, -1103, -1730, -1728, -1790, -1772, -1832, -1440, -1304, -1130, -547, -355, -390, 402, 664, 783, 1066, 1660, 1781, 1623, 1638, 1920, 1343, 1392, 1517, 769, 533, 830, -209, -872, -565, -805, -1491, -1418, -1221, -1848, -1628, -1234, -1845, -1854, -517, -583, -889, 16, 476, 216, 1057, 1569, 912, 1284, 2537, 1591, 654, 2193, 2296, 779, 1066, 1178, 68, -196, 596, -1029, -1547, 87, -850, -3312, -1844, -758, -2050, -1968, -241, -1397, -1777, 179, -467, -1300, 1595, 2151, -426, 115, 2383, 1287, 527, 2941]
1420B941l00j935J274n85k816K332J716l366j430L049j609l207L157J120l028
1435b687J255J373l503L95M819j582k259L561L55m082K081L129k177R59K909m074
1451D72k483N334m08m715L898K311n752j596L857j699j553M466j685n386L099
1466a840K036m820K520N567m199l393M855j250k971O311J948o109J408M383n862
1481a416r31P777o92n793L022J80n940L238N132n457o66N059n866n120P477K395
1497B399o007K914L690p898r65Q146k349k873P535j111q789L631N852m455J217
1512I37O572n971n284O238q55n171P577L421j0604j027O828n488k365R306r35
1527C179q459L578K176p632M455Q742o191m029O791l687n770R138M528p754K136
$$ y = [2941, 2641, 706, 1980, 1395, -1421, 911, 2627, -739, -2169, 880, -729, -3936, -779, 341, -2687, -1432, -59, -3562, -3167, 1652, 70, -2189, 1372, 1727, -2355, -274, 2855, 678, 1637, 4546, 472, -2011, 3323, 2915, -1800, 2098, 4409, -1343, -2939, 918, -781, -2334, 2132, 447, -4939, -1840, 196, -4624, -2104, 3463, -736, -4129, 726, -524, -3495, 2816, 4764, -1345, 63, 4446, -1416, -2347, 5430, 4738, -1055, 1967, 2147, -3793, -555, 4577, -880, -1546, 3513, -2353, -7473, 4, 2399, -3608, -694, 2996, -4902, -5867, 2279, -70, -2943, 4592, 3481, -5308, -1677, 4175, -280, 937, 7509, 1538, -3746, 2492, 1637, -3534, 4043, 7464, -3140, -4167, 2661, -2827, -5192, 4114, 3179, -5280, -1702, 474, -7158, -2703, 6039, -152, -4181, 2610, -1077, -6847, 2291, 6819, -935, 1201]
1542A201M329r305j234J1310j622o248O217q52j0554L882P897n868m55O896p049
1557a455p606Q310K504o412N720M543j0484j968Q868l251k642J0257j177j0455
1571e248M002M909o653L066R601p105o591O690j858o430Q606N001r633p91N029
1586B595p104j939J0987j291p969N012N81r640M818R470n423k835P059n227o711
1601g617Q890M231o822L702M502r747k399J0027j831m672P433j134j0240L247
1615b430N395n728J482P721o784p338O984R17o056O528M968q829j690O475m173
1630b558j620R605m21q242L445L024p114L210Q298n078l976N069l189o227P571
1645A797M144p596Q23M052o811k617Q438o09n131M755L5p889K964O714m177n52
$$ y = [1201, 5530, -3775, -5009, 6301, 4679, -1569, 4648, 3796, -6758, -2876, 5021, -847, -1302, 5594, -1455, -9061, -751, 1753, -4659, 1061, 5604, -4880, -6848, 2020, -1231, -3873, 6384, 5207, -5248, -1246, 3663, -2990, 76, 9677, 2572, -4019, 2671, 813, -5617, 2989, 7990, -1643, -2434, 2595, -4509, -6448, 4539, 3248, -4721, 291, 872, -8768, -3950, 5520, 97, -2738, 4321, -906, -7617, 1273, 5504, -1318, 2384, 6886, -2861, -5260, 4767, 2936, -1736, 5697, 4563, -5677, -2430, 2965, -2763, -1281, 6440, -344, -7682, -698, 219, -5837, 691, 5659, -3170, -4860, 1615, -2558, -4178, 5427, 5006, -3236, 209, 3233, -3881, -671, 7627, 2549, -1427, 3642, 453, -5774, 1797, 5941, -1655, -832, 3220, -3591, -6208, 2230, 1621, -3510, 1245, 1280, -6609, -3645, 3069, -1108, -1660]
1661a660O208m306n501N954K394m709L881L684o931j954O258k286k802O276o36
1676C870o981J535L440m681J014N778l897m266M100o34m555N089L355n038p13
1691b584M051l130j616O036O7m257K958J185m861J687M831k708k035L396j757
1706A263m365L687K045l888J059K286l984j605L798o14k408L192M59m411J239
1721b247L029k161PL634j799k487K982Q66k710J993K470k993q92K485j146j459
1737d28K400j18k898J087N94k465L40K246j408j501J367K38k124J798J430j836
1753a278K3J984j386p82K364O6j161J361P38j745M46J262r20o60J387p43j604
1770f48J077K65j258K8R44j127q82J381q32p35J046M08j203N41P99o34K34J234
$$ y = [-1660, 4548, 242, -5259, 695, 3089, -1620, 2261, 5945, -986, -2940, 3318, 1032, -1770, 4506, 3870, -3111, -1576, 1864, -2817, -1803, 3975, 78, -4188, -88, -722, -5277, -188, 3167, -1871, -2584, 1467, -1663, -3279, 2757, 2824, -1433, 1525, 2710, -2151, -464, 4367, 1659, -376, 3020, 1263, -3102, 585, 2630, -1258, -199, 2087, -1897, -3502, 296, -318, -2726, 466, 925, -3486, -2247, 782, -1379, -1372, 2262, 463, -2024, 958, 1824, -886, 1107, 3577, 584, -308, 2177, 1031, -428, 1972, 1854, -1044, 43, 637, -1828, -1488, 758, -650, -2151, -784, -546, -2670, -872, 558, -1278, -1255, 729, -657, -1439, 925, 991, -170, 1191, 1929, 184, 630, 1892, 972, 312, 1699, 956, -648, 429, 694, -564, -536, 408, -719, -1601, -220, -1052, -1787, -741, -333, -1536, -995, -196, -830, -596, 638]
1788F38l16m22Q87R0l33J83J021r11LO66o28j96J51L8j011R6P6n42l77L23m47
1809a011k73P38l80l88M20M06j46RM74j15R8L91O8N8M62L90j64Q1N2N5n69J01
1831G57j53k14L0j88o10k03K67n79k97K63Rk11J78P5PK06J26J02K05L22M5P7K66
1854D80J80J10o5L36j03J68o4j79m01J88k10n35j74M04n39k16K5q5m46M27m05
1875a104LN99o2l63K61O95j7k51J293l37n91P77J79m82L17P42q57l87P13l29p93
1896FK35k31n47L14N0j008M9R77q25r11J290R5j075Q10R08p58M84P18m07r37J919
1917A156K85j220R33L07j370N73Q49j092K2R42j047j386J231M32j930L49J276
1934C10j333p98J318k73q97J922L1j896R31J485j597L40K377j135j409J603R5
$$ y = [638, 322, -100, 787, 877, 544, 727, 1748, 837, 840, 1506, 878, 682, 833, 871, -140, -44, 32, -510, -887, -564, -1011, -1284, -546, -926, -1314, -894, -488, -634, -625, -151, -266, -168, 223, 291, 349, 811, 1201, 1037, 1118, 1170, 1225, 656, 757, 604, 390, 420, 232, -378, -581, -314, -893, -1190, -927, -918, -1129, -951, -876, -869, -663, -537, -435, -230, 92, 137, 214, 480, 660, 770, 705, 1041, 938, 1106, 1042, 863, 462, 650, 440, -95, -269, 135, -404, -620, -595, -680, -1126, -699, -1104, -1101, -502, -564, -927, -666, 29, 12, -239, 1054, 717, 126, 903, 1082, 600, 917, 1659, 802, 415, 1128, 799, 6, 241, 10, -537, -223, -173, -1181, -1132, -155, -980, -1891, -601, -506, -1581, -771, 137, -621, -137, 581, 174, -763, 1156, 1441, 221, 1154, 1461, 91, 664, 1513, 421, 443, 1385, 338, -1048, 183, 615, -1315, -966, 310, -1023, -1821, -503, -776, -1673, 249, 280, -1616, -685, 800, -797, -457, 1920, 785, -624, 979, 1074]
1951A074j516J556J421k341l51J887j568j411K201L22k162M13P02k242M07K387
1967G79j534j037K439j092k524K543J803k344O10K229k311j236L412m52j837K562
1983B010K33l126M55K524k028J9K352j754k812K373J89k596K071J934l309j094
1999b559K768j555j316L703O6l497J932J803l152J151L627j679k477L205r91k767
2015a738K926K130l253R9K081l273j086L915l26l000K125K26m173J398L324k273
2031h98q17L510k391l100L707J414l115K006K698m042r96L842j150j377L581k02
2047B670m219J554K050k940N77L592k525l413L111m69l067L303K384m483k17K667
2063E75k459r43M643m60l707K353J069l727J790M108k446j529K890j466l080L674
$$ y = [1074, -442, 1114, 2535, 194, -157, 1730, 162, -1249, 952, 1274, -888, -475, 227, -2015, -1608, 779, -755, -1792, 647, -445, -2969, -426, 1377, -967, -357, 1872, -439, -1675, 1737, 1285, -552, 2010, 2243, -883, -428, 2096, 68, 87, 2439, 685, -2127, 246, 435, -2161, -90, 1844, -1465, -2559, 209, -1346, -2662, 1041, 1107, -2390, -458, 1345, -1807, -656, 2971, 1292, -1185, 2020, 1029, -1738, 1188, 3318, 65, 164, 2245, -1028, -2114, 1801, 1475, -1525, 600, 826, -3347, -1949, 1375, -898, -1715, 1795, -596, -3696, 11, 1425, -1690, 316, 3014, -1028, -2024, 1818, 668, -709, 2872, 2670, -1549, 5, 2055, -885, -308, 3284, 759, -2654, 457, -12, -3079, 224, 2608, -1875, -2092, 575, -1884, -2827, 1816, 1356, -2351, 2, 1071, -2656, -866, 3242, 796, -733, 2157, 691, -2389, 1285]
2079A285J614l302J286J397l772r05L896q53k282K774q9m378J617K695k668N07
2095a178L452k899k719L031R31k579K950J795l599l66L166j788j307M252p56l413
2111a027J536P74k637J157L202k938j786K414j089k726L687R05l088J24K179k761
2127b074n71L852n98j952K183P3l413J982K630j740n30K451j760j983K753M77
2143A780k219J305J371l297m94K682j291j188K622o41l211J552J320j872Q53K477
2159A749k237j701K170j83j382K361J223k596J96J815j594k87K973q06k237J566
2175A030kk255J212K270k476o62J493j409j350K147Q85k256R27P41k136J03K710
2192I72j061q18J724j36k285J795R06r22M02J141j483p99J629j76j180J226N97
$$ y = [1285, 2899, -403, 883, 2280, -1492, -2397, 1499, 646, -1636, 1138, 1049, -3329, -1712, 983, -1685, -1178, 2274, -625, -3344, -313, 618, -1961, 989, 2784, -815, -1181, 1985, 197, -1110, 3142, 2386, -1027, 509, 1283, -1354, -197, 3005, 67, -1719, 695, -394, -3120, 567, 1472, -1616, -1492, 687, -2074, -2645, 1207, 609, -1343, 840, 913, -2500, -518, 2112, 372, -158, 2293, 533, -1450, 1303, 1780, -439, 866, 2237, -1060, -1554, 1128, -163, -1351, 1271, 630, -2581, -1029, 291, -1581, -728, 1749, -488, -2189, -19, -202, -1584, 777, 2000, -596, -400, 1415, -179, -466, 2507, 1701, -536, 1030, 1028, -1227, -15, 2255, -221, -883, 610, -799, -2149, -2, 883, -1373, -446, 295, -1841, -1738, 972, -89, -907, 817, 681, -1604, 191, 1097, 175, 577, 1718, 235, -564, 1065, 889, -291, 935, 1532]
2209A532k040k44J327j128l63J293l67j689J003O16j416Q75J299j260l68J051
2225A21k62o55J514M02j089J22Q25r51o2J483l40r97R17k73j188O77M99r54O7
2244a44L12n73o29Q61j37q03M77J58n52K34P04k52J10L84J53o70N18O08o59K64
2264C64Q87r53j03N66j79n48P46k24p49M2L92o38k34N07k72o08K26K76k54N69
2284a87J52l73k12M61N9l61O33K36j34K32O9k48K94K93R1m66mj70k87N0J03o05
2306c74NO0j14j13j2K41o50L35N0N7K41M1k5O3L73l9K0L72K48l03p9L71k06o2
2330E00J31K4k71j17j77j40K19k56j38N5j96L3p7q0r3N9j6J19N4M7L08R0O7J74
2354C19q8p8l4M19l5J04K54n04K10k54J76l41j0k55k10kJ12r8l20L84l18J53m3
$$ y = [1532, -508, -752, 575, -553, -916, 377, 10, -1679, -676, -60, -1476, -601, 698, -562, -930, 121, -141, -796, 718, 1120, 31, 153, 978, 27, -35, 1448, 1108, 111, 1028, 755, -433, 244, 743, -211, -144, 168, -405, -1034, -173, -310, -1113, -636, -478, -1030, -796, -92, -344, -234, 150, 303, -367, 151, 759, 100, 364, 1251, 298, 195, 761, 582, 34, 780, 556, -193, -151, 241, -397, -631, -124, -396, -1004, -778, -502, -756, -187, -35, -408, -620, -159, -100, -461, 172, 408, 274, 506, 575, 327, 621, 914, 1005, 539, 535, 365, 78, 128, 231, -374, -369, -309, -423, -536, -548, -307, -957, -622, -572, -515, -274, -233, -258, -195, 178, 139, 159, 531, 779, 476, 397, 768, 562, 500, 631, 655, 384, 267, 90, -50, 169, -87, -225, -170, -366, -333, -410, -490, -583, -524, -540, -421, -367, -320, -12, 78, 145, 319, 231, 153, 119, 538, 503, 607, 861, 357, 567, 313, 489, 148, 138, -117, -327, -329, -217, -315, -635, -251, -569, -416, -459]
2377d59n8m7Q5L85j85k0L21Km1P75k52j14RJ78j81K07J28n27k42L14R4m64j54
2400b46N81r45L60o7l42k5L24k36o8L07l4q7J66L51l82K53O89j62o96P18K97m41
2422C15K58K13o46K4K50j56l37L45j53p30J61K96n44O2P29k66o67Q13j44p38O90
2443b25M79p91K33O11m19j29R10N6q77Q18j14q23O79N45o32k64P03m89r28R70
2463C13J6p59J71N48j320r8J351q26l43J323l82j070R15K24n05M96J437j224q71
2482f04J381p7j070J320O34j719l5Q88j019l55J791n38j459P65J15j443R85J247
2500H07j390k29O81n63r84K187L70j440N03R09j608J11J995r36m89J307o13j593
2518i75R20J504j401K28R33j661j097J891J07j267J251K78k191J26J482p91j48
$$ y = [-459, -517, -564, -479, -94, -279, -299, 22, 24, -17, 758, 506, 392, 401, 579, 398, 605, 733, 206, -36, 278, 372, -92, -246, 335, -610, -250, -317, -659, -684, -360, -596, -664, -357, -391, -478, -312, 39, -343, -90, 599, 437, -259, 459, 756, 315, 573, 786, 140, 164, 414, 258, -79, 266, 113, -617, -456, -160, -704, -642, 87, -179, -846, -33, -177, -915, -225, 254, -537, -304, 307, -112, -241, 669, 725, -152, 666, 552, -271, 408, 953, 321, 57, 760, 271, -657, 313, 329, -430, -259, 289, -1031, -1129, 222, -604, -947, 376, -6, -1076, -161, 63, -442, 54, 1491, 267, -604, 777, 700, -370, 950, 1584, -135, -170, 718, -301, -656, 1135, 597, -862, -97, 18, -1425, -440, 807, -583, -812, -131, -694, -1678, 509, 879, -561, -58, 851, -757, -646, 1349, 413, -76, 1231, 618, -975, -55, 1449, 48, 276, 1209, -452, -1549, 342, 449, -818, 433, 711, -1480, -1354, 128, -663, -811]
2535h11J808n98k000J294O31j138J248J629j915r28J782q69r68K131L95k122M31
2552@J150k316L57K203o06j532J088o39j624J386J660j904k4J712j812j283K668
2569D84M14j341J081P09k696K73K583j288o18K450j051k132J162J313j781P38
2585C00J537k465q33J712n75p07J926J85k636N44J347j496K68K230q69j761J420
2602A27j28j326J608J682k164j67J439j423q43K593K44j887O92L23j949K93K408
2619A522j422r01J661q01k347J773J389j605N58J353k016j048K361r7j194J996
2635A182rk499P25J744j031k53K159j229j984J470L83j244P79J356j822r01J363
2652A89o68q44K112K43k113M67P60j445K41K174p57j274J431n15j215J503J164
$$ y = [-811, 997, 399, -1601, -307, 324, -814, 434, 2063, 148, -780, 1002, 133, -835, 1296, 1691, -431, 0, 1150, -1166, -809, 1394, 788, -744, 344, -295, -1919, -533, 1127, -777, -801, 911, -901, -2184, 484, 898, -443, 638, 1347, -1349, -1076, 1507, 219, -399, 2051, 1000, -1132, 30, 1343, -438, 300, 1837, -628, -1461, 251, -324, -1031, 895, 1080, -1556, -1012, 335, -1161, -893, 1337, 468, -1293, 127, -1, -1327, 281, 1963, -201, -368, 1071, -352, -1195, 1398, 1642, -245, 447, 770, -1179, -886, 1522, 100, -801, 860, 59, -2288, -515, 874, -731, -173, 1180, -836, -1884, 477, 380, -814, 1182, 1173, -1326, -601, 1143, 112, -141, 2018, 789, -1195, 275, 658, -586, 193, 1549, -273, -1174, 189, -479, -1323, 789, 1032, -1081, -614, 146, -1299, -1058, 1116, 359, -915, 516, 1, -1214, 289, 1453]
2669A453j473j01J641j793p33K091k02j560J348R7j859L58J635j091l20J265j035
2686b79r42P54N18j006Q76J007j743j81J466o33n52J372L15j655O84M89o41J34
2704a7J468o53j407J171j1j265J000N32j295P2O82p11n51J339j8j146O60M38j158
2723h70K45J118q36k2Q61m46o29J050j1m76O92K98p84l81J107l43n67M73J47j125
2743d99M05K49n71m2N61m29o88R13J9p31N89O73j076J98R25n80j44O60R6o49K83
2764A62M80m91o2O96m86l42M07K14q62L49N6k53l47M88l07l06N84k5k66M40N3
2785A82p59K83L16Rj76K32J65l23L51K8k15J97K4J67n66M95q5j88R8q2n11K06
2807a52M15m94J44j35r7k8P9L32l81K61p8j18r9M12k54O8J52J95l26L25J97l30
$$ y = [1453, -20, -121, 1520, -273, -1006, 1085, 883, -677, 671, 768, -1091, -733, 902, -189, -509, 756, -279, -1221, -467, 51, -955, -79, 928, -815, -996, 470, -163, -715, 657, 972, -683, 1, 490, -151, -17, 1451, 798, -609, 562, 551, -714, 286, 818, -477, -405, 277, -434, -985, 354, 336, -810, -150, 288, -870, -625, 493, -343, -365, 496, 50, -579, 471, 460, -16, 676, 974, 190, -191, 916, 573, 6, 479, 626, -499, -94, 155, -416, -458, 103, -326, -1014, -101, -82, -813, -224, 449, -627, -429, 496, -84, -228, 432, 528, -121, 162, 642, 151, 89, 785, 299, -43, 364, 578, -284, 65, 121, -132, -479, 9, -298, -604, -20, -45, -311, 129, 182, -577, -294, 22, 31, -145, 87, 252, -71, 280, 308, 93, 290, 314, 481, -85, 410, 325, 137, 235, 153, -358, -152, 263, -231, -87, -222, -319, -347, -268, 64, -317, -56, -134, -252, -351, 61, -193, -125, 27, 222, -104, 221, 418, 88]
2829H8J5K24j64kK01k83K64m03J62k01p5l4J66m61K41j11K81r5k19K34j38L91
2851H1k51J30o9L4J45J49k44K9K33J82m58K03J55j93q9J48j23R0lj85j68O9j9
2874a54j45j7J04j78P5R4k9K4Q3K12k27q0L22J95k19k0L31k21o6J35k55Q1J95
2897B40j78l52N82j30m39K16J11j35k49L14k38M3K83N7l06K63J17n34L91qJ25
2918A73l30L14J11j70L19J30l86L3K07n3k26O6j61n40O49j29n47rN64l37j17N29
2940I0p4l12L77K21r59L85O03j62l13N81k82n13Q18K04p01K61L40p84J41N39k94
2961A66j56M35j06j002L66P22j097K72R50r08m61P68k86m50R13M30p29K53M89
2980E69q63j79J198j08o21M72J54j090M32Q22o92k60P53n20q89J007K49r20N42
$$ y = [88, 103, 327, 163, 161, 362, 79, 343, -60, 102, -99, -174, -208, -42, -503, -262, -373, -92, -187, -406, -172, -310, 81, -170, -40, -109, -75, 70, 219, -25, 4, 237, 419, -39, 164, 319, 126, 37, 185, 62, 152, 149, -36, -204, -135, -154, -299, -316, -212, -390, -315, -221, -250, -226, -143, 69, -158, -238, 84, 279, 60, 40, 371, 150, 84, 219, -36, 45, 240, 62, -290, 292, 162, -277, -61, 50, -85, -334, -20, -258, -215, 68, 125, -181, 82, 199, -335, 56, 48, 173, -157, 157, 268, 98, 417, 547, 161, 194, 401, 348, 122, 188, 27, -513, 136, 7, -540, -549, 15, -322, -439, 90, 16, -296, 81, 302, -657, -272, 331, 169, -144, 437, 155, -358, 460, 664, -37, 224, 564, -220, -79, 460, 166, 10, 445, 339, -663, -297, 425, -672, -400, 550, -358, -819, -51, -337, -787, 126, 556, -173, 80, 569, -294, -473, 725, 617, -4, 468, 622, -468, -36, 786, 94, -166, 587, 67, -822, 185, 434, -486, 56]
2999E6L59j024m8R64k75n66J040k37j211O71Q59q22K06R76o48q41R64j93p88J116
3019E58R57j901J61Q91q43m61J463l43j324O78L90j015N08J268j191l16R32n58
3037a46j068J576N46j339L31R78j457j63J667K9j515J526l08j674Q32J297j394
3054b82J07J295j246j159J490L63j349J005M81j955P0J686q16n59J793n19j480
3071a075P94Q46r87L96J328j180j120J464j94j063J278O78j401P1R67j622m0J920
3089A060m48j670J228J33j562Q98J343j066k59R54j036j005J651M65j357R21Q77
3106A127j860j4J521l87m66J293n54j880J144J066j202K03J404j437j055J367
3122B70j17r48Q30J095k223L14J262j091k78K050q37j095O96N14j248Q34J375
$$ y = [56, 415, -609, -657, 307, 32, -534, 506, 269, -942, -271, 588, -234, -28, 948, 300, -541, 423, 230, -558, 558, 1515, -386, -225, 666, -177, -638, 825, 482, -842, -164, 226, -789, -281, 987, -204, -520, 412, -146, -1214, 362, 908, -431, -100, 878, -579, -742, 925, 954, -561, 965, 657, -1017, -185, 1112, -282, -175, 1120, -126, -1285, 205, 568, -781, 224, 705, -1250, -1180, 506, -310, -869, 924, 405, -1075, -281, 565, -422, -26, 1302, 122, -998, 466, 272, -791, 487, 1165, -236, -165, 802, -820, -860, 1060, 612, -1058, 170, 303, -1259, -361, 982, -84, -343, 611, -425, -1430, 221, 686, -671, 250, 1127, -733, -747, 774, 387, -79, 1214, 660, -1220, -76, 990, -212, -9, 1395, -42, -1097, 270, 153, -795, 35, 1130, -1093, -779, 483, -608, -886, 1164, 327, -768, -72, 442, -806, 28, 1403]
3139A403j218p04J362r03r46J600P65j435K11P55j632m3J560n16q92J193m94j200
3157a134N04J298j117K56R65j209r19J639O6q02R31L89j590J67J220n44m35J348
3175A033o23j251Q36N35r76L16R31q18p24Q05j80p93J068L08r63J96O61q64p6
3194e79J367k83j070Q25j38o23O14O97p75j77Q24p77o79J344J06r13M17M10j036
3213d46J05P59o14k92N10J22p70L80O09o85J38Q23n76n23K64K29j74L03N67j083
3233c54L28N13m49K2O15l66o84M03K73n52J68O87q79j38N00k95o69Q65K34o68
3253d46J34O59o51j70N80M7m18M40M4m23K64L85k91p0J61j98j52L89k44j90L31
3274A81%n54P9N19l77m59N37J67p43O78k8j34MJ62j08k3K73o5J9P7K32n69K66
$$ y = [1403, 185, -519, 843, -60, -1006, 594, 1359, -76, 135, 890, -742, -785, 775, 259, -633, 560, 66, -1134, -630, 668, -449, -193, 772, -437, -1356, 283, 349, -453, 478, 867, -723, -556, 664, 120, -315, 1033, 410, -841, -5, 530, -446, -130, 801, -17, -741, 64, -116, -909, 159, 467, -496, -300, 361, -503, -579, 788, 505, -565, 260, 122, -501, 113, 810, 35, -142, 682, -95, -774, 570, 676, -237, 180, 590, -446, -341, 418, -196, -488, 22, 144, -626, -246, 363, -322, -184, 639, 63, -460, -196, 33, -141, 162, 729, -354, -26, 487, 38, 60, 675, 309, -375, 28, 301, -251, -83, 604, -275, -413, 87, -208, -877, -12, 222, -446, -312, 347, -304, -474, 106, 153, -265, 175, 219, -204, 60, 445, 154, 84, 245, 47, -105, 284, 40, -150, 181, 181, -373, -294, 225, -152, -611, -74, 93, -650, 28, 0, -134, -130, 32, -76, -99, 174, 109, 128, 205, 437, -132, 134]
3297A34J81j46LJ09o0o5n9K09j51j68J12m60J42K8J3L0J09j15l9J26l7k38N9M49
3321A66p7k78K78M8k68L34j11l6J00P5L7q7k14R2l59J63J68m23J51J79k23k45
3343e30L35K82l56J03M7J12k29J42R0l7K11j44j65M43l22j06K04J04j01L5j66
3364d8L13j96k05J94j48P4J49l08J41j9R8j84L71m48q0R5J05q3M7R3mk1J43K12
3388B91l46K39j3k23j9L05P7j94J50k72o9K53P5k63k11P9p3P6RP7m44N13P3j70
3412h0r0M90l05j13L8K10p0L10k24j63J01L67m69N9J06j8m28L49K13l94J04M38
3434D31p59J65M10n52J24L65K22p64L28J55n54N41K20n08P2L48m3l19K93M31o55
3455d9J17K57n35NN75k97l83K43L73r31M12K96k27j14M46l50k65O94o6n37K61
$$ y = [134, 315, 169, 172, 281, 221, 156, 97, 306, 155, -13, 99, -361, -219, -191, -178, -148, -39, -154, -193, -67, -104, -342, -283, 166, 89, -189, 89, 137, -131, 203, 92, 56, 156, 231, 268, 181, -33, 59, -300, -137, 31, -392, -241, -62, -285, -530, -195, 87, -269, -166, -119, -7, -236, -94, -4, -41, 170, 26, -139, 304, -18, -124, 80, 184, 83, 118, -48, 265, 69, -136, 58, -90, -16, 133, -175, -34, -53, 45, -139, 232, -216, -296, -201, -96, -179, -132, -39, -43, -64, 79, 291, -55, 184, 171, -52, -71, 234, 311, 117, 267, -5, -74, 179, 254, -9, -220, -141, -214, -138, -129, -52, -496, 17, 90, -80, -170, 320, 15, -98, -60, 150, 80, 390, 166, 3, 104, 471, 2, 61, 167, 149, -279, 70, 283, -111, -7, 431, -328, -163, 247, -305, -181, 184, 406, -358, -30, 125, -429, 112, 332, -176, -104, 244, 201, -118, 175, 606, -49, 68, 325, -210, -205, 370, 73, -310, -67, 306, -625, -213, 83, -144, -258, 188, -162, -427, 267, 201, -336, -75]
3476g5N47o59J24L06j54l50O43P6p15K45L78m73r8P24o44l74P55k7n34M96J91
3497C82q67j94R90n60l52J104n07n80N56K57p76M80O25q92M32M29p64j55P71J63
3517E42m82o9L97q32J12R31l08n47M04J97j205O74M06l89j69N28m71n81J014J24
3537B76r07R90k4p67k60J165o69m8J036l25j118O21P15j026L61M48m53o84R53
3556B84j36q02P81K79q28L39N17r22Q4Q53k87n60N53j8q06N00O99o78j76J081
3576G57o88n57Q45K07r08M47M79r02k13R25m96q3M45l1j029M65O73q23K19O62
3596C94n23l95N96J8p28R54K15r75P6P59o15j89J193l75r99O25K26p11L30J141
3616A017j025k15P64o52n44R26J90j059M42M87j011R1P44j43k51O82j40r23N38
$$ y = [-75, 472, -187, -63, 243, 89, -261, 382, 458, -257, -12, 366, -107, -205, 519, -125, -499, 256, 229, -305, 191, 382, -485, -679, 311, -249, -601, 503, -4, -584, -28, 229, -547, -67, 558, -334, 98, 527, -237, -392, 379, 542, 60, -9, 388, -444, -332, 599, 291, -256, 148, 345, -860, -186, 220, -169, -338, 190, -281, -862, 152, 276, -631, 359, 335, -432, -692, 473, -196, -244, 792, 467, -651, -30, 685, -341, 20, 468, 15, -669, 284, 148, -654, 127, 406, -422, -83, 434, -488, -404, 449, 162, -398, 155, 137, -669, -169, 530, -148, -324, 757, 69, -488, 357, 564, -344, 103, 582, -320, -533, 392, -104, -187, 258, 227, -802, -337, 336, -487, -268, 394, -129, -524, 72, 90, -638, 316, 531, -444, -368, 391, -224, -413, 780, 405, -594, 31, 257, -454, -124, 1017, -8, -223, 541, -111, -655, 271, 461, -598, -156, 331, -680, -589, 155, 12, -239, 443, 303, -620, -82]
3635h2N52o24J20P53r85j77P90J67q00R02k48o34k38P40m56k87O25L46j139P48
3655G3M0r10P09Q03q35n08O99j99m11Q03P1p55M26L84p38L8P86k17n67N11K6n80
3677c51N13L25l73m53N59k79n65P73rn11L16M64o22m93R69l64k68N69j95o81Q20
3698A44J44k59n3O87o41l42N76j78j40N5K38m30L34n9k45k42M19J28q29N71J22
3719@k37K23L23n39J8L40r2m40M74K89o41J68N28k50j82M64l47l25Q9N01m63J21
3741B2J42l54J4N32j24q13N44m6k17J36K53k85j15M38l32M1Q2K03m92M04L61m90
3763i6J62L69j82l42L72j50m43N57P8m54K07Q9j80m39P10m14j3J51M0k06K37o9
3785a6p8j66K40L0l0L99l22r2k6J37J5J33Mr9j25Q0M9j3j55O0q1O2J86k45j43
$$ y = [-82, 470, -154, -34, 719, -266, -443, 347, 514, -286, 616, 368, -266, -504, 236, -220, -507, 118, 464, -675, 73, 113, -797, -88, 715, -120, -628, 71, -128, -539, 264, 335, -420, 6, 390, -348, -310, 476, 259, -308, 203, 229, -351, 162, 487, 114, -339, 220, -59, -624, 149, 140, -371, -55, 409, -213, -706, 263, -101, -369, 200, 5, -676, 144, 288, 29, -24, 663, 22, -320, 256, 78, -62, -7, 231, -199, 135, 76, -169, -411, 8, 136, -693, -122, 0, -237, -14, 309, -230, -212, 128, 36, -404, 70, 359, -282, -114, 414, 164, -18, 446, 99, -226, -137, 364, -99, 22, 164, -190, -176, 356, 232, -581, -37, -83, -300, -164, 89, -196, -311, 127, -205, -164, -82, 121, -371, 33, 394, -96, 66, 435, 253, -89, 283, 133, -310, 247, 325, -129, 78, 167, -13, -452, 258, -156, -169, -18, 22, -184, 53, -16, -94, -260, -20, 10, -20, 379, 57, -35, -61, 76, 91, 224, 228, 129, 4, 84, 133, 120, -35, 25, -56, 6, 192, -53, -196]
3810a96M1k50M30O5M2j4k30K14k22K08j18J79P0j92J87k27J08n8n5nK09k14j42
3833a70K56M0k32L9q2r0J16J11r1N0j74K72l18K34O1k02n4K34K00k80J93k94R2
3856h9K90k29L76m69J74L49k24P8l4j97k68M59k32j74J52mo5n9J63o5j27J93j66
3879a68O6j80J68j53K71Q4j69r6J39J49J50j68O2m7R2j68k28R5J02R7l50L21k45
3902a76J74K54k65K1j52J41k01J14N4j53R4J44j56J96L2n1Nj3L8j0k0K29k13k74
3926a88N14l66J33j72K29k50j95J32M4k81L14N1J11r7r1m0O0M9K56j54j71L13
3948B01j48J34Q8k74J60K1K45m11N9K0k03J12L16l66j88K76k67LL28j76n4J57
3970C3j26k24J35J44j71P7o6J42k0K17j06N1J21j36L03m48K55n7l00K10J26l83
$$ y = [-196, -155, -405, 25, 90, 132, 118, -112, 102, -120, 88, -30, 149, 219, 27, 214, -13, 95, 37, -18, -23, 186, -28, -170, 86, 126, -106, -67, -149, -239, -123, -12, -103, -53, -227, 45, -273, -39, 22, -180, -234, 0, 200, -80, 113, -181, -89, 201, -28, 348, -121, 53, 402, 178, 256, 222, 25, -243, 216, -16, -190, -38, -42, -107, -166, -3, -68, -195, -2, -168, -102, -282, -114, -267, 4, 88, -81, -177, -38, 111, 261, 93, 155, 108, 200, 32, -196, -101, 1, 98, -252, 69, -176, -2, 252, -13, 8, -144, -3, -204, -90, -36, -189, -95, 49, -107, 89, 121, 70, 75, 62, 100, 90, 70, 299, 86, -188, 326, -40, 93, -79, 150, -100, -295, -163, -119, -400, -86, -35, 76, -21, -112, -152, -92, -43, 213, 59, -112, 201, 53, 187, 275, 1, 161, 182, 427, 16, 75, 95, -108, 4, 320, -46, -234, 42, -225, -222, 106, -70, -124, 33, -93, -317, -182, -38, -209, -132, -198, -56, -76, 141, 35, 86, 207, 71, 374, -74, 181, 124, -176, 34, 160, -223]
3992b23K9M58m12k11M61j76m80N70o9k64K82o6J08k9L68j50k62J78j10k57L00
4013D5J59m35K74M94n42J55p4L3k67J63m1j04P4j85R9K8K70o2m49K79K54k83J19
4036DJ6j17NK41J32n24L11J46J85k83J83l32j39K22n5k07M82l91J39j15J8J66
4058H7l12K64j6k17N2L60m32K0K89m39K84O9l31k2M05R2j35j00L21j10j91N42
4080D80l68j55J32K6m11L01p3L07m99M38l39j60N66k46j53j0J85k44J2M26j21
4101I4k19K73j55l97L20K15J4l5J90m27k05L21J6j36J80J40m18m5N48n09J45L56
4123B66o5n45K95J77k57j11J06q0M5M82j71k86K88M91o97L3J03k49Q1L79k89L8
4145C4J51J39m38J28K91l86j66L59j88l45N50L7n69L07K65m64n7L05k1j10L53
$$ y = [-223, -194, 264, -148, -359, 102, -74, -554, 16, -53, -317, -35, -101, 7, -22, 346, 196, -66, 112, 2, -255, 45, 204, -231, 43, 537, -5, 150, 76, 109, -158, 5, -36, -140, -66, -251, -152, -124, 146, 84, -365, -86, 168, -115, 4, 20, -97, -92, 149, 281, -243, 68, 214, 399, 116, 299, -33, -172, 50, -5, -212, 270, -121, 18, -97, -79, 87, -225, 39, 23, -194, -142, 218, -214, -194, 95, -344, -60, 9, -322, -344, 61, 153, 18, -82, 239, 129, -62, 480, 112, -43, 89, 115, -296, 5, -68, 239, -260, 178, -161, -321, 245, -1, -154, -164, 21, -223, -211, 215, 94, -125, 148, -7, -404, -84, 131, 145, 110, 300, -127, -332, -11, 5, -131, 49, 189, -229, -274, 274, -235, -90, 266, 201, -344, -49, 128, -129, -240, -134, -214, -169, 313, 142, -144, 144, 635, -62, -29, 74, -175, -94, 285, -4, 34, 185, 324, -114, 14, 305, -81, -247, 112, -76, -421, 129, 166, -403, -96, 169, -295, -352, -47, -68, -178, 175]
4166A75K22n70J04K77l07j18N22l41j63J95O7o02N55J32l51N4L44l00Q4k49K78
4187Hm15L08J51m86M77J06P4m73L12N7n13N03J75l00K22j13j1j07K17Q3k91J01
4209H5Jl07K22p9J00r7q9L36k22k06J05j5j49L21j07j32L44J7n6L21k12j05m6
4232C0J82l13K84J78j20k37n4J30l46J25O19n44m5Q8J00l20K85K54l91mo8O1j73
4255b79R9K28L7njl6j74K61P4m13R1M41p8j22J02k33k96L61j4l4r3M6J37K1k92
4280a72k32J64K63K3q2J77j70j63K29O6J72k14j65J71P8k12Q4J58q0O5k96J70
4302C4J75l42j91J01L74l00Q8P8m26L62J20j61k65K58J19k53K16o5l10L40j8K30
4324A64l66L88j75Q4n7J14j88J14k1j86M2L12l68l9%K95l85J68K05l12J2K74j19
$$ y = [175, 397, -173, -69, 208, -99, -217, 305, -36, -199, -4, 63, -539, 16, 148, -203, -149, 195, -105, -21, -270, 8, -407, -99, 52, -434, 43, 149, 223, -250, 62, 119, -394, 109, 284, -16, 206, 93, 82, -25, 192, 275, -16, 85, 86, -221, 1, -78, 22, -75, -164, 172, -50, -256, -151, -166, -315, 6, -101, -233, 111, 128, 72, 393, 181, 76, 30, 212, -101, 183, 361, 241, 4, -50, 80, -266, -141, 478, -66, -111, -23, 77, -243, 42, 296, -95, -99, -167, -106, -279, -180, 48, 85, 80, 79, 43, -131, 130, 204, -209, -118, 323, 245, 123, 225, -8, -304, 57, 43, 9, -84, -38, 99, 120, -172, -404, -240, 23, 46, -36, 141, -29, -192, 37, 103, 275, 61, -104, 67, 145, -67, 17, 175, 95, 160, -136, 34, 209, -133, -324, -223, 151, -149, -61, 17, -409, -47, 73, -88, -353, -95, 24, -229, -13, -78, -388, -48, -66, 164, -202, 186, 11, 95, 38, 152, -36, 78, 57, -129, -87, 225, -143, -182, -182, 113, -272, -104, 101, -211, -199, 75, -44]
4347d4j00K02rk34N8l6m0K46k11L02O8j24O6k01J60j08K01j05l2K02l36L9j21
4370a57J0J90l8j56K72j19o5j59K12j17K63k21J24m26L75L04m37K48r7J68J2n0
4392A36r1R2Q9n0j62o4LJ04k8Nk59k79L94n6J57j70K88j22j52L42k92J58rJ43
4416A77k74P6P5n2r9J91J99j16Q8j06o9J02j83N8j07j23O4j85rL5K25J03K7j84
4440h7j69J88J62k07K21j70j1J79k6J10j04J10j90l4M9O0k08M68k4o25L36J64
4462A92j54j51l7L1J32r8j53J4N11k29j40Jo5M56n68P6J78J42k53O24o23j69O11
4485C28l41K1K44J40k20p9N0j74q9J70k6p3k3J45k51J79L53n66k4K13k02j74K42
4508a57L60l89J10K12j28j2J31O7j15K68r0m94L03J77k14l9M06m66k50L72j26
$$ y = [-44, -144, 58, 49, -185, -127, -163, -203, 43, -168, 134, 202, 78, 144, -57, 103, -5, 196, 91, 59, 261, -75, -36, -157, -147, 43, 5, -151, 121, 2, -63, -222, -10, -127, 136, -85, 39, -387, -12, 292, -145, 103, 6, 174, 186, 136, 45, 137, 226, 176, 14, -50, -47, 57, 29, 34, -225, -504, -110, -166, -9, -179, 109, -13, -165, 177, -115, 43, 34, 177, -97, -21, 54, 2, -97, 94, 293, 177, 265, 159, 90, 192, 9, 67, -40, -163, -99, -284, -293, -258, -33, 70, 97, -87, -256, -68, 94, -113, 108, -62, -73, 106, 80, 190, 86, 196, 6, -28, 21, 81, -127, 341, 317, -308, 28, 192, 38, -113, -150, -119, 13, -85, -238, -224, 287, 58, -82, -81, -146, 310, -258, -182, -4, 138, -115, 509, -114, -283, 328, -13, 8, 252, 392, 172, 93, 143, -31, -120, 50, 24, -49, -72, 73, -178, 1, 354, -212, -236, -23, -225, -399, -157, 203, -186, -76, 136, 8, -4, 127, 194, 79, 347, 257, -237, 66, 243, 29, -10, 396, -70, -320, 52, -74]
4529g4j21K40K1l75RL91j53k48M26J46j98j61L00l55N1M43m15r9L47j23k32O07
4551D27m1l93O9J29p61M15L74j05n06M23j78o44R42K35n62J41M1l48P4N14j01
4572A45k30N10j07n03K5L94j71j94O82k39o50L88L56o65M12M04p12l71N20J8n70
4593e58P78p9n40K15L46m87o9P60j91m14K20M8k99J34Q91o86j78M45k06n53O41
4614B18J4m88K71L51n09j85O35l41j78K38k4o06Q12J17n57q9P51o74l94O62K34
4635B58m77L23L25n93j9N91l37m00P04q8k67J52J49o12J51O52p82K1K77r3n68
4656f33R18R6o52M6O67m35m62N79k5k50Q6N17p93L09J80k15o5M14l39k93P62j77
4678B35m05J92L31n31j17O49o5o28O25l08l05K87K72n55OM64k65k31L71M27o23
$$ y = [-74, -195, 45, 66, -309, -300, 91, -62, -310, 116, 262, 64, -97, 203, -152, -101, 342, -73, -172, 175, 52, -180, 427, 386, -7, 62, 191, -570, -155, 219, 114, -392, 31, -147, -791, 151, 386, -176, -35, 6, -342, -268, 246, 145, -85, 425, 318, -185, -160, 234, 63, -131, 551, 312, -338, 50, 406, -259, 153, 557, -155, -526, -6, 12, -558, 220, 141, -399, -184, 162, -325, -394, 366, 175, -239, -19, 29, -270, -136, 755, 69, -109, 336, 130, -423, 218, 232, -256, 15, 366, -143, -328, 307, -34, -212, 26, 2, -604, 208, 325, -232, -321, 430, -244, -638, 24, 258, -219, 104, 429, -164, -183, 408, 71, -329, 375, 287, 20, 172, 321, -291, -140, 512, -270, -249, 28, -65, -633, 285, 381, -271, -225, 442, 7, -455, 124, 99, -151, -65, 452, -341, -32, 148, -67, -132, 282, -57, -350, 412, 235, -170, 22, 353, -178, -295, 354, 289, -339, 286, -22, -327, -40, 232, -323, -317, 147, -118, -349, 22, 449, -174]
4699a74L33K83l54j61M36m26k1N07j66n83M43J48n19J81N28n28j43K20j50m10
4719e56N97J36m02J39J27m52k8M52K41m74K95L05n78K77n5N8j05J58J43m14J92
4740E6J54j84J55J16k55k82K91k30j15N07k95k60L29J03l26K06O0m7l67L34M8
4761bk32N20k8k46R3J5k70n4N25m04J56PJ46k02l2L51n64J11K02k07j50J47J12
4784fl84M12Q7o3j28K02j29j31J48P9j68J86k1k72K12L33m2m16K34J21n76L50
4806B8L4k93j62M63k62J11J6J78j38L7K9j11M3M1%J23j01J87l60J97K50j83j39
4829a2J60O5l52K35N3k65P3Q2M6j44K62j82k12N8k83M20j17J7P5l6j04L8j32K06
4853d9K06k97K66l1j02J39p7K28l21P3o2Q7L4q2j24K5m6L45l90K91n9k26Q9K3
$$ y = [-174, 159, 442, 88, -73, 363, -63, -84, 423, 257, -326, 117, 265, -254, -73, 455, -73, -216, 4, -146, -556, 41, 177, -225, -86, 41, -411, -439, 13, 254, -220, 75, 380, -198, 79, 24, 82, -23, 135, 278, -136, 56, 210, 26, 181, 297, 42, -240, 51, -179, -294, 213, -82, -342, -13, 90, -236, -30, 30, -17, -384, -50, -2, -234, 286, 258, 12, 105, 120, -150, -204, 321, -83, 73, 80, 226, 24, -8, 343, -221, -110, 92, -115, -265, -118, -6, -390, 22, 109, 46, -82, 120, -9, -140, 8, 87, -81, 105, 84, -188, 24, 357, 315, -101, 133, 254, -322, 28, 62, -231, -393, 70, -192, -81, -65, 113, -25, 12, 41, -70, -27, 14, 14, 137, 36, 223, -137, 60, 310, 127, -12, 148, 213, -139, 96, 149, -116, -43, 39, 85, -59, 203, 21, -191, -133, -416, 4, -113, -96, -21, -57, -161, -123, -255, -49, 157, -140, 126, 95, -7, 132, 55, 283, -38, 35, -27, 60, 94, 12, -112, -87, -133, 212, -178, 113, 54, -172, -83, -60]
4877f0m3Kk3L82n71K31M50j47l85L6J51J78R3n08P0K53p5L23m78K88k62K57k83
4900a21L61j56m4P1m19K15J16J39o6o4j06P4P9l33K36l4M8m2K10k45M6n0Q2K30
4924B27k48K9Oj72O1K14k45L77k48k87L10p9k42m9L56n2k42J80J34q0N2K5n5n7
4948h5K16k3k52P8K79j66j00J42j45J77l6R1l49K29N2p0q6M28n27o4M15l02k81
4971c79O45j39l53K24J00m19J53L18k80o6L82J55n63L21M6O6l33L95l13j99M53
4992B14n5k81J47J74m05O5L23m05j41K17K81n46L04K67m72N16k04j88j88L68o4
5013g3r7M76K02o16K28J00l09R6M94k19l98J06L87p78N17M0j74n0K28l2p31M70
5035a33J22j66nO34n76J1K80k85P6L37q9p19M05O91o70K30J91k70m61O86j12m22
$$ y = [-60, -103, -101, -124, 258, -313, -82, 368, 221, -164, -128, 23, 201, 294, -214, -144, 109, 34, 357, -121, 167, -95, 162, -121, 240, 84, 40, 111, -308, -93, 23, 162, 96, 32, -74, 0, 79, -254, -18, -52, -4, -46, 164, -81, -35, -85, -3, 227, -21, 8, 14, -158, -97, 117, -128, 249, 1, -286, 24, -55, -297, -346, 10, -42, -284, -104, 30, -50, 2, 27, -28, -85, 131, 108, -144, -66, 213, 47, -53, 89, -56, 121, 85, 176, -173, 56, 108, 38, -48, 380, -147, -211, 204, -98, -379, 266, 127, -226, -2, 98, -321, -168, 150, -130, -196, 186, 341, -222, 99, 145, 211, -122, 273, -40, -239, 214, 159, -122, 25, 199, -206, -141, 182, -223, -364, -147, 134, -412, -108, 159, -313, 203, -1, -189, -377, -9, -73, -170, 306, 508, -108, 120, 220, -89, 7, 501, 282, -116, -10, 377, -401, 116, 156, -18, -68, 160, 128, -603, -133, -11, -177, -182, 452, -124, -113, 167, -118, -42, 295, 206, -513, -108, 583, -87, 143, 334, 64, -397, 289, 177, -245]
5057b45K41L13o41J87L22k44j26O3K81p06M95k1j93L32Q2k98%J84j03l38N96K95
5079D76o68R2M77m47k32P75l21m66N47r6l52J41L09m36J74K75m99k69O04p4l33
5100c23K90K3r8k53Q49l24m19M60J25n11K93J58l63l80R46n29l33N31K69o15K32
5121B8L04o19K98Q9j01m59P26j52n47M37K15q11N92K15k04k09L56m7l66O46j06
5142B85l36l9M81o85K37M86j99l37K41J5n46N28J97n02J75J11p0m26K91L04m24
5163b13K61J23o30J76O67l21l59P89k73o69M00L61m15q3M87j77l64M76j03n04
5183c71L32K45m17O9M38m41l13P12j73m40K61Q3n01M59M10k95j72M26k18k54K03
5204D3J55j50J41j1j80j11N67p01j00N68K33q82N47o9l93L75K2k38m68P20j42
$$ y = [-245, -4, 309, -332, -145, 177, -67, -193, -130, 151, -555, -60, -81, -274, 58, 140, -158, -158, 26, -77, -415, 181, 476, -192, -100, 377, -70, -302, 473, 152, -314, 233, 137, -215, -74, 235, -201, -27, 248, -251, -520, 84, 10, -323, -33, -10, -108, -361, 488, 164, -255, 205, 330, -181, 112, 270, -93, -473, 473, -56, -389, 142, 411, -204, 28, 332, -287, 11, 100, -1, -460, 266, 114, -433, 4, 219, -592, 0, 215, 11, -198, 158, 111, -255, 391, 285, -51, -90, 391, -294, -57, 429, 230, -107, 134, 149, -397, 131, 328, -174, 1, 112, 42, -384, -93, 211, -213, 48, 171, -459, -283, 384, 63, -296, 493, 220, -449, -49, 312, -103, -186, 301, 124, -240, 236, 133, -371, -39, 206, -211, -142, 296, -145, -458, 254, 81, -359, -98, -15, -516, -57, 353, 58, -114, 312, 94, -160, 43, 198, 48, 189, 178, -2, -113, 454, -247, -347, 221, 454, -428, 119, 50, -343, 32, 54, -184, -652, 68, -74]
5225g4l44L75L9J02k57K98l7k96N11M4k22k01K23k19J24O6l21M7L97j41k09J8
5247g7K4j98J48J04k11l75O21j30j45K22K29l88K06P8q4j75L92j55l1L03j06m25
5269a73K00M01l94j47L86k92j48L66j45l68J08N90o22n4M35p8q1j30l2K3N9J50
5291E4p3l04N01k02J13j65J13j78J44K51l38m9J54k6J02Mk90J85j20J07j36q2
5313b35L92j46L7K8j47j12q8L09%R1n7k92m0M17o6L5N3j79P0j54J91q0J41K3k79
5338h8M6k0Qk8j76M37j95j05m3j7N8J50m3j25J78RO6K6k63Q2N5J68lj49k6l3p2
5365a03K08J4Q8k45R7m2j9K9L51p48L42q2J57l6J64Qj99N1J55j93M5m1j45n7J35
5390f6K18j40K95j38j55k2J22K35n16N48j49j74k20M18j66l1M2l22JJ83Ok17M34
$$ y = [-74, -418, -43, -4, 98, -159, 139, 102, -194, 317, 361, 139, -62, 161, -58, 66, 132, -189, -142, 255, 114, -95, -77, -53, -251, -103, 1, -210, -585, 36, -94, -239, -17, 212, -176, 30, 108, 24, -151, 241, 86, 55, 358, 252, -173, 27, 428, 34, -113, 273, -19, -167, 199, 54, -314, -206, 384, -238, -292, 143, 65, -16, -146, -178, -155, -96, 54, -19, -323, 178, -24, 89, -76, 37, -141, 3, 254, -84, -133, 21, -5, 97, 101, -189, -4, -124, -17, -153, -235, 157, 11, 48, 76, -71, -183, -271, 38, 38, 129, 72, -220, -260, 157, 91, 126, 179, 0, 70, -84, 107, 27, 168, 191, -88, -42, -62, -54, -82, -258, 179, -16, -121, -164, -181, -123, 27, -16, -141, 37, 46, 112, 138, -125, -43, 12, 180, 177, 28, 2, -31, -103, 105, 119, 207, -38, 59, 17, -2, 27, 378, -370, -28, -110, 47, 11, 175, 183, -16, 35, 190, -3, 42, 1, -144, -201, -66, 152, 12, 307, 169, 14, -8, 114, 349, -167, 381, 232, 58, -162, 256, 90, 59, 101, -221, -220, -37, -31, -248, 186]
5413A86o7j71J62k52K26Jj55M0m7K31j25N9J30q8rq9J5l13L81j6%j96j1J41J15
5438A48n3J7l20N1L05o1j87O1p4R6K93l02Q6m31O68m50OL97l6k35j36K18J83n8
5462A86j27L9p7K05m56Q8K58J04o72M22J21n7j56O5O0k50K83R0k91O8L37k03N
5485D2L6kMR0r8O7q5L4ol45N47k83j1J93J06m96L35j29J51m82J79J85j85J93j57
5510a17J5K05K03l01o3K54k1n40R25l67j94L2R7j94m2L38k58j08L61J4n27M06
5532A18l7k10j12L10K2l96M50N8o90J91L01j87J33K72k31k05O08m52j67M21k75
5553g8j12J44j67m3J6K81J15m35M32M1m08L6L44l44k72M91j58j27N4K20l80M71
5575A21L9j16k42M78k54k57M70J83n58L66p6j36p2M20l69J8K83m36k22M51k25
$$ y = [186, 119, -52, 110, -142, 84, 85, -70, -30, -77, 154, 29, 88, 218, 130, 121, 32, 47, -266, 115, 99, 99, -97, -108, 33, 148, 95, 112, -208, -157, 148, 87, -100, -39, -113, -17, 276, -26, 60, -371, 297, -153, -147, 250, 214, -21, -157, 61, 244, 186, 59, 98, 21, 226, -230, -142, 116, 220, -452, -30, 91, 34, -122, -57, 3, -247, 36, 126, -165, -97, 240, 37, 42, 78, 76, 80, 170, 72, 139, 54, 88, 82, -263, 284, 1, -10, 183, 289, -207, 128, -1, 150, -332, -153, 32, -153, 40, -117, -102, 103, 306, 5, -58, 196, 175, -365, 560, 193, -1, 31, 128, -66, -108, 230, -28, -136, 225, 239, -288, 118, 81, -129, -241, 69, 91, -305, 145, 203, -487, -296, 5, -182, -49, 223, -8, -213, 395, -57, -224, 197, -78, -190, -46, -213, -256, -240, 41, 156, -279, 153, 194, -214, -178, 166, -178, -450, 41, -117, -244, -190, 30, -350, 121, 160, 44, -198, 280, 26, -231, 239, 422, -136, 230, 154, 18, -54, 366, -3, 15, 298, -138, -360, 91, -134]
5596a34J15j75K65k8j71MN1k39J92J62l28K68K07k01j98N19m27J86k2J48k74m2
5618a22J51j01L4L73l06m96O86j28l43J36L90l48M8M10l58K3l00N31m58pL66k87
5640a06j45M61j68j77L13k03k23J85M50n81R7J42l40K90K47j0m21M28j71n24M81
5661B5P9L4l61M57l91M1K72j22l06N16O6k39k97K97J41m61N44l22oL4M13m79M0
5684b5K58k35k72P48m17o0j9K32m64j62M76j06p3R3k1j61K37J72k59M3K96j58
5706A23k15KL04l62J77K5p7k50O83n31j19L83O3m51N24j57m36K62J83n43K89Q
5728a15j79K18lK32k86j58O20m90J60P6j46j87M44O0l60rJ99j4q7%J42j16j03
5751a02L0k7J29j97Q6m5L02l16k4L2k9q5J81M2J5P0M24n16N2K94l49K34k18O4
$$ y = [-134, -19, -194, 71, 43, -128, -124, -73, -312, -120, 42, -286, -18, 189, -12, -210, 309, -118, 68, 46, 194, -80, -122, 29, -72, -38, 335, 29, -467, 219, 91, -252, -116, 274, -74, -26, 384, 26, 49, -251, 280, -178, -185, 181, -106, -251, 210, 42, -135, 178, -25, -248, -63, 387, -194, -97, 45, -295, -5, 242, 232, -189, 239, 68, -456, 25, 104, 138, -223, 234, -157, -116, 156, 34, -272, 244, 310, 71, -226, 71, 212, -249, 295, -27, -33, 1, 414, -65, -25, 233, -2, -274, 474, 57, -3, -22, 210, -254, -416, 60, -46, -119, -26, -47, -208, 29, 201, -58, -15, 281, 123, -92, -90, 214, -148, 29, 54, -23, -273, 410, -121, -240, 143, 206, -245, 279, 122, -314, -52, 131, -412, -123, -115, -294, -76, -79, 153, -133, -291, 329, -161, -1, 75, -71, -258, 186, 246, -114, -123, 76, 62, -25, -25, 117, 1, -102, -72, -99, 30, -167, -81, -126, 176, -140, -164, -132, -161, -246, -65, -23, -8, 62, 486, -30, 22, 316, -33, 201, -17, 47]
5775D7n8J46M7k77p9J39J6j54J71J69J64n79K40m9o5m3O8J49p2n1k22K14L09n71
5799c41N00q5J95q1l83O77n40j44M78j55j99J48N4k32K23k31j35L21j12j90K43
5820A1q0k51K18K39l42P9L65l63n4j07K76n8J33j96J79J16j4l43K08O7Nj65k40
5843c17L59J2m3Kj09J40Q6l11J6M0P8j35K51q8l18L40JL3J07mq0j69K35k47J57
5868C6J62l52l8K54k6k61J6J73j9L35j89p9J11k60J06J5r7p2J66J45j69r9o1K93
5892I0K2K14l77J50l12L18j04l9J27k2m6L5K56l11J72p6J18l13J05k13o8R3J19
5915f2o6q8O2m2J70k1q6J54n4N6J76j72L5k01L37o6n06K91K30k10j20L12oj74
5939e1k31J89J60J99l85K97k15j8q4M4Q4n9k7J92q8K20Pl22K0Ol3Q8Q4J2R3j19
$$ y = [47, -11, 135, 182, -95, -174, -35, -19, -173, -2, 167, 331, -248, -8, -57, -122, -165, -97, 52, -20, -71, -293, -79, 230, -341, 159, 74, 269, 188, -195, 482, -58, -202, 276, 121, -78, 70, 124, -108, 115, -116, -251, 70, -42, -232, 11, -69, -320, -102, 137, -205, -126, 239, -124, -178, -285, -9, -67, 66, -130, 49, 165, 151, -192, 16, 83, 88, -77, -317, 42, 54, 11, 13, -96, 44, 130, -181, -165, -125, -47, -182, 69, -19, -337, 3, 4, 37, 144, 140, 60, -109, 126, -121, 36, 198, -154, -192, 62, 36, -225, -209, -36, -55, 280, 91, 12, 123, -137, -31, -16, -113, -185, -19, 126, -43, -142, -203, 90, 112, 326, -51, 99, -213, 105, 1, -38, 89, 67, 21, 56, 312, 1, 173, 97, 215, -98, 7, -206, -274, -181, -62, -128, -216, -154, -196, -26, -47, -133, 21, -33, 23, 199, 27, 62, -139, 198, 132, -374, -83, 147, -63, -183, 129, 123, -51, -282, -93, 67, 266, -119, 178, -37, -55, -139, -95, -11, -70, -97, 95, 7, 227, 234, -88, -68, -62, -95, -7, 77, 89, 182, 63]
5965F3k37J99j05P1J81l82K93j12j06j32O6L22k49K2j18K15L9J6p7J10j37KM9
5988go1L18j13j69Q4P3n8l42L60Nj32rP3m0J59J08m76J07J60j21j39K10J91j16
6012F5n5K38l99k0K89j18K33P8m13j8J53L24k84k00K84k99K76k43j22J26J12m0
6034c3J39k16J6r4K58p5M1j06Q1j00P7J75k54K47lk43J24j45r1L73j33p2L57j53
6058A70k25j9K4k4J48r4Jj74M2J57j27L15k66r3L69j16j49J18k05j93K20J63k02
6081a60K55l6N0j79J43j91j94L06j22J84k84L09l60J7K68J04k18R2Q2k74J92r2
6103a08n1j59M56j97L4n4o3J0K98lj51p8P7j06L5j2L61r2l43K97k30M4L69k67
6127F7k63M9L2J83pK54n17K01L5j88j2K27L21l22r0K5j10KJ98k03J12K44j37j91
$$ y = [63, -174, 25, -80, -9, 172, -210, 83, -29, -135, -267, -201, 121, -128, -106, -224, -9, 30, 46, -31, 79, -58, -56, -7, -68, 250, 137, -32, 52, 125, 67, -275, 85, 90, -42, -51, 22, -18, 141, 249, -227, -120, 40, -81, -220, -10, 181, 65, 10, 248, -151, -171, 118, 0, 233, 311, -102, -120, 33, 357, 73, -127, 157, -142, 134, -109, -231, -105, 7, -33, 106, -110, -94, -188, 70, -5, 36, -70, 11, -89, -12, 163, -91, 156, 153, -90, 34, -111, -202, 171, 38, -34, 323, 170, -55, -74, -50, -74, 74, -20, -19, -193, -151, 6, -121, 194, -72, -165, 204, 88, -61, 57, -148, -341, -121, 42, -160, 95, 59, 109, -70, 73, -118, -312, -6, -128, 56, -228, 81, -279, -262, 6, 110, -108, -16, 66, -208, -16, -108, -159, -318, 138, -59, -25, -79, -142, -132, 166, 163, 12, -66, 11, -95, -60, -72, 289, 197, -146, 151, -79, -35, 334, 67, -196, -147, -115, 68, 61, 315, -202, -1, 34, -154, -166, 61, 382, 60, -30, -5, -115, -113, 85, -118, -6, 238, 101, -90]
6151i0J12L13m90K71J23k58mK24l25J50J00P9l61J54P5l44M40l28L40k43j33K28
6173C3j18m1K56l7j81M11m39N8k7K85j46L0m3k31J15L9k2o1J32j64p7J59J33j60
6197i6O2N6q6k7J47p3j50L54o1k09N6P6j37j66L14l1j14n7K38M5k91K09J6n6n
6222A4j34j99K60R0l91K85l1n6Q7R8K12K3j63r0j8j28L57l89N8M26j82j0j74K69
6246B14j50ok04J63k7N6q3J45Lk19Q3J90j74j57m7J63Jj61J93j1M9k68L71k24
6270a00J42J52j99j04K66J3l16J58k9N1K20j34l92M29j35j1K14j27Kj3n8J6m9
6293dml3N2j65M1L42m49J79J12J81m04R8J70l4M5%l53J83K03k55n4L21n8k0k9
6318F5R5p7k09p6K01J71l60K23k66L65j40J77o2K4j53J2J8NJ50j27j22J55k46
$$ y = [-90, 22, 335, -155, 116, 239, -19, -23, 201, -124, 26, 126, 205, -156, -2, 73, -271, 169, -159, 181, -62, -195, 33, -85, -126, 130, 93, -88, 323, -116, -58, -85, 200, 54, 84, 41, -190, -75, -36, -58, -119, 13, -151, -228, -69, 64, -96, -34, 22, -64, -91, 56, -17, -167, 187, 126, -83, -27, 49, -88, -254, 60, 29, -85, -142, 96, 141, -150, 59, 75, 19, 14, -120, -319, -59, 31, -360, -75, -106, -162, -75, 23, 235, 258, 95, 5, -13, -141, 216, -173, -115, 311, 129, 119, -55, 214, 64, 58, -146, 17, -10, 46, -37, 108, 111, -108, -25, 165, -9, -166, -213, -50, -49, -210, -17, -28, 21, -247, 124, -100, 42, 194, -5, -109, 157, 170, -146, 12, -17, 34, 254, 120, -272, 157, 22, 11, 225, 98, 100, 87, 29, 45, -4, -8, -41, 11, -154, -113, 229, -220, -41, 71, 252, -152, -54, 116, 82, 127, 127, -226, -43, 160, -95, -149, 172, 114, 94, 65, 160, 83, -126, -202, -1, 170, -190, 33, -233, 132, -8, 169, 107, 131, -22, -10, 8, 13, 163, 36, -86, 69, -177]
6341a77L07k45L39k13j5Q4k50K30l0N6j32j27j8K49q7j20J91o9N7J6L5N6J99k12
6365A24q0j68o5M88k56pn7J29j78k9o8L28k21P3k03L66k98Q7k0P6j42K84m5k80
6389a62r6O2P3K31j41M07m19N8J18o4k58J53J08P0n9N6l3q3m3K6j12K27k41j6
6413a38q7L57j07j54J52l0J94m46K47l8J88j20l48N15p4l3j72n7L91l89J33J97
6435A81n6k1k48J43k74R6l7J83j44P0m7q7K08k42R0J06k8K40k35n6j4J20J38k13
6459a27R0J06o7oJ66j84J04L8p1k36O0P1K20j95j53J35j00K18j17N9k0L18m65
6482a56r6M71n80O44m38J20O2O8j06L96k45j51j89K66J0l3k13J68P6j58Qj89K13
6505e2m5J88J24j77k71J41k78M41J2J96n44L73M3j24Pn8L70n14K97%pL06l33j15
$$ y = [-177, 130, -115, 224, 11, -4, 80, -170, 60, 30, 86, -46, -173, -191, 58, -29, -149, 42, -27, 30, 46, 81, 137, 336, 124, 44, -124, -189, 299, 43, 36, -21, 108, -70, -99, -167, 161, -60, 13, -190, 176, -122, -35, -55, 21, -121, 163, 118, -162, -258, -196, -123, 108, -33, 374, -45, 13, 131, 67, -191, -38, 70, 140, 81, 137, 104, 21, -22, 4, -108, 119, -122, -138, -225, 132, 25, -129, 23, -7, 187, -259, -12, -50, 138, 18, -330, 185, 111, 78, -94, -151, 240, -149, -16, 181, 125, 104, -144, -1, -275, -179, -216, -33, -177, -107, -154, -241, -33, -275, -185, -79, -107, 133, -102, -158, -172, -52, 86, -127, -37, 69, 2, -4, 162, -22, 82, 120, 49, -187, -127, -56, 164, -31, -184, -49, -149, 69, -48, 11, -9, 309, -156, -252, 219, -361, 283, -155, -35, 27, 95, -11, 385, 140, -11, -200, 66, 76, 43, -170, -2, 74, -84, -76, -265, -52, -97, 91, 215, 38, -233, -92, -370, 71, 83, 279, -265, 108, 151, 27, 34, -24, 346, -168, 129, 129, 122, 428, 95, -20]
6529b0K79j53J02p1J24j24j47l11N36m23K70R3l64j7R6j38J21K96j33j65n4J43
6551f0K05j35rn7q3J30j86L00R7j89l56K01J92kJ38Mj23K18j28n1j60N5L52n30
6575a77l1M41k49l48M91k29o3J24J53l29Q0L63j60l9J62j35j61J77J58k49rP8
6597D8k45q9K28O6o9K73pk99qK66k7l72K52j91P7J95j23j30j20N23l70K15N7j42
6621HJ4p7P1J06j87J82k01O6J23k61K83m9mm19L15M1r3n2J49j4k55J83J84k71
6645a58JL47j61NJ39k68R3R2M0j15P8J64k79j07K18J16m19K55j02lJ61j43N1m01
6669c96L85K30l42K98j40PJ34k41r1K4O8J79j33J29J48k71K90k65k53L93j14j7
6691B2l16L35j05j1K27L4j88J53r8j05l1J85m9l33L92j49J35l8J10q6k03K66l4
$$ y = [-20, 259, 106, 208, 137, 261, 137, -10, -321, 215, -208, 62, 155, -209, -226, -130, -268, -147, 149, 16, -149, -203, -60, 145, 10, 1, -56, -139, -9, -195, 105, 202, 13, -343, -142, 50, 48, 186, 190, 67, 285, 157, 106, -54, 1, 353, -177, -208, 233, -16, -364, 127, -102, -165, -41, 112, -217, -137, 226, 66, 27, 189, 54, -107, 70, 228, -21, -30, 48, -197, -286, -58, 8, -61, 212, 205, -94, -102, 164, 137, -235, 17, -174, -97, 98, -25, -155, -275, 248, -122, 93, 150, 8, 22, -55, 16, 122, -65, 117, -84, -18, 105, -156, 127, 78, 74, -345, -30, 11, -82, -134, 15, 1, -254, -71, 113, -158, -157, 190, 29, 34, 173, -95, -2, 90, 130, 15, 93, 257, -22, -129, 89, 205, -214, 41, -61, -64, 97, -46, 5, -396, -11, 219, -123, 175, 35, 42, 176, -65, -156, -132, -64, 115, -18, 111, 259, -12, 278, 13, -240, 153, 39, 22, -294, 41, -64, -75, 152, 186, -2, 151, 53, -52, -83, 102, 53, -280, 112, -37, 98, 60, 170, 84, -119, 147, 113]
6714A13j64QN1K5K02k63lJ40R6n05L36O5k06q8L95l34K4j63N59n11N1J47J20j47
6738e2M2mK84Mk07j20j27L86k95J43p2J56j41K75k50p0j6k4m1J63P8m4j90R7K0
6763eK23k55K9k87J36J66L0r7k77N07k15K26j35K77m37o1L77l58L49K87o05k8
6785a53j2N5K15J83l67k40L22K05k24N1j85J9J29m7J27m23L01J45O4q5l5m8l4
6808c7Q9N7j10J5m0J40K7j20j04J36J12j53j58L47j01j95R0J10k15L08l54n3J14
6831i5J68J7l24L33k0j59M3o0P3j10L09o0N2j68K9J51r9j94N0j8O5K27l19j71
6855b80L71k40K85l0k37J34m22K40K45j41k78L08n9J80k38K07k15J74K8J20k07
6876e5K42k34O7l7l68K39L06k13j50J82p8q8J97J26j77N5K38l78K45j74J21J15
$$ y = [113, -51, -43, 8, 33, 235, -28, -31, 109, 205, -300, 36, 101, -105, -193, 202, -132, -108, -271, 288, -223, -172, -25, 95, -52, -10, -14, 270, 274, 67, -53, -180, 206, -89, 54, -18, 138, -3, 272, 22, -48, -64, -88, -129, 34, 112, 68, -122, -25, -5, 218, -37, -8, -295, -159, 7, 37, -60, -337, 170, -45, 181, 46, 323, -114, -175, 202, -156, 193, 480, -125, -153, -165, -110, 105, 288, -79, -319, 3, 208, -16, 35, -150, -131, -2, -49, 78, -345, -44, 101, 165, 80, 45, -3, -37, 52, 109, -1, 14, -26, 114, 141, 21, -83, 53, 165, 12, -146, 201, 100, -95, -5, 105, -110, 198, -156, -209, -95, 73, 90, -234, 99, 79, -80, -37, -97, -24, -134, 175, 115, 167, -1, 28, 179, 80, -114, -64, -82, -17, 210, -109, -280, 91, -149, 136, 106, -131, 3, -419, -179, 66, -75, -353, -45, -104, 76, -162, 45, -170, 4, 32, 152, -55, 187, -47, 20, -17, -385, -146, 160, -53, -203, -21, -99, -187, 10, 136, -41, 14, 252, -126, 119, -55, 66, 181]
6898A81k86Pl3R3K9n9O2j88K24j02m0n9j09M62j13PO4l66L92k76L6J57j06K09
6922A86l65J76l24L53k7K9l7j50J06J21R2j42R0q8j05J40k03r8K91J30k42j31
6944a98K99K9k64J78k02J32j24K59k08j23K04K56k60j63L02q5J02j39j1N5j97
6965a58l9l8J83J63j11p1q0K28k15K53k18J37n4Q2J48l48K43K0j61Pl54L32k1
6988g2P8j19L54l78L50r3O6k18J30P0j49o4k3J32j29Q2P7m1j82J75J92l86j94
7011c42M5L10pJ58k03j75K89j97J1J24K21n23M29j67Qj15L93l16J18r8n9K94k37
7034c9J60k90J79J49j90J13l3Q6k85N8p7L25k88L80Jm90P4L60j80l9J40l20o7
7057b73M17j40j51L30j68%J30q2o7K51k12K03l35r6J94o5N2N9j92k7N9J14l6o
$$ y = [181, -105, -98, -131, -38, -9, -68, -6, -194, 30, -72, -112, -171, -280, 182, 69, 76, 140, -226, 166, -110, -74, 83, -23, 186, -179, -3, -327, 26, -1, 28, -9, -159, -53, 68, 160, 18, 108, 20, -85, 55, -148, -246, 45, 175, -67, -198, 101, 130, -134, 44, -158, -26, -150, 109, -99, -222, -18, 238, -22, -185, 117, 32, 134, -5, -16, 39, -158, -197, -235, -52, 111, 0, -71, -151, 77, -138, 115, -103, 34, -20, 62, 210, -138, 105, 125, -36, -29, -383, -51, -72, 6, -113, 241, -137, 213, 120, 186, -32, 98, 168, 19, -45, -68, 64, -65, 17, 94, 53, -129, 46, 238, -148, -342, -297, 13, 6, 164, -39, -214, 75, -122, -111, 13, 234, -289, 140, -27, -19, -134, 259, -57, 61, -37, -96, 198, -39, 121, -169, 10, 159, -31, 82, 49, 135, -150, -92, -169, 156, -132, 248, 249, -241, -167, 193, 13, -26, 114, -206, -273, 144, 4, -147, 183, 15, 15, 145, 63, -4, 247, 35, 238, -97, -193, 1, -64, -12, 47, -145, -172, -113, 1, -35, -41]
7081d1k8m7L8P4O4j13N2O7j80J81N9j89J09m4n8Q6K75j93P6k8m3j41J51P2k59
7106f0m5J18j74K08J30j04J59k08Jj6j30J45L7k58J83m9OK14J42j62r3j94qJ10
7130d8MJ41N4R9k00l18K40j04L25m22M7K9k25L95J7k83K15l7J10j12N7K86m10
7153a40j00M34m51L40j16K18o4k6J38j59J39l04K87k16nL40j43l58K63n3k9J05
7175A00k40M1K36k05n4M5J14m9mm1J38M5j11j10K10K55l47k08M0M39n56J31J35
7198Dk46O9L42j60j58J63j90K06J4l8p5J1J11J54l33K51Kj98K0K1j1K21l63K34
7222E1P3o6j33l9Oj8K50R1l98K0K23q4j07Nj35mK53J17rj30pJ29L8p5J30P6k43
7249A4k43K17R0j80L11l32K99j34m5K5l4J58k60R8j03j38J78QL5Q0o4L2J9J06
$$ y = [-41, -69, -116, -78, -4, 60, -53, -1, 66, -114, 67, 126, -63, 46, 2, -56, 30, 305, 112, 188, 160, 117, -24, 127, 199, -60, -105, 13, -161, 47, 177, 73, 232, 24, 25, 9, -121, 24, 61, -197, -14, -63, -57, 157, 299, 137, 44, -150, -158, -48, -44, 97, 151, 250, 50, -268, -28, -132, 193, -229, -182, -153, -378, 17, 34, -249, -34, -71, 39, -73, -16, 270, -140, -240, 194, -257, 83, -33, 185, 121, 95, 233, 74, 213, -91, 196, -20, -25, 315, 172, -186, 77, 24, -5, 100, -140, -99, 137, -68, -122, -77, 37, -12, -16, -57, 81, 126, 15, -95, 115, 370, 23, -185, -145, 294, -262, -131, 4, -242, -173, 169, 9, -149, 14, -176, 30, 44, 6, -69, -58, 53, 207, -126, 125, 127, -71, -51, -30, -41, 180, -183, 51, 124, 58, -75, -114, -108, -126, 124, 215, -183, -163, 60, -24, -131, -126, -261, -265, -12, 105, 96, -34, -41, 88, 126, 51, 181, 257, 14, -229, -12, 78, -102, 209, -123, 176, 42, -3, 22, -12, 146, -114, -16, -119, -257, -79, -71, -36, 44, -20, 12, 31, 137]
7273A37j14k07J03J77jk9J82j61j25J66j16J00j61L4rK48j26k10j9K11k7o4J15
7296A04l99K43n0K14k12L8J69k11k41N34j07J00Q2p6N4l41K0K46k46J65%j21K61
7319B26j62q3M0o7K72k35k50J58M1K9j57J20M0J5K6j78JK70r6n9J70j50K09j38
7343D2j68J89M01m18J68j14j60N1r5J73q0J35j48N1k92L25J38j21q2o0j43K95
7365H7j11K83n05J58K68k58J3K28j59K15k35m6L12k01j06L6J21j66K88k20o9j55
7387b22K62J3k62Q2J03j97J13l4J61j02R6Nj09J96k38l7K18J44j45JO8jk11n6
7411a52J19K16J7k84J41Q5j06q0R9j82J48r3k6M7j48L64r1q9k39K97j82K80j28
7434A3k03K45p0j75J67L9K29k47O2j22R2J29k7l3j46J81o3j66l00L67K7k5m8j
$$ y = [137, 23, -184, -81, 96, 95, 66, 248, 87, -38, 128, 12, 112, -49, -15, -24, 224, 98, -112, -131, 80, 53, -11, 104, -295, -52, -102, 112, -100, -62, 107, -104, -345, 189, 82, 182, 264, 188, 242, -99, -79, 167, -79, 86, 86, -35, 226, 64, -19, 21, -46, 226, -9, -259, -101, -60, -31, -188, -68, -28, -13, 13, -165, -164, 106, 10, -49, 121, -29, 180, 42, -126, 63, 464, 46, 214, 100, -60, -9, -104, 69, -11, 124, -24, 27, -265, 60, 198, 77, -5, -65, -208, 87, -24, 259, -246, -88, 180, -78, -65, 163, 4, 219, -16, -62, 250, 49, -57, -21, 100, -66, 222, 2, -67, -222, 40, 53, -209, -127, -24, -221, -108, -142, 19, -83, 13, 18, -91, 105, -133, -170, 48, 192, 47, 48, 116, 115, -96, -152, -33, 183, 200, -84, 57, 142, 36, -44, 55, -127, 21, -72, -98, -51, -199, 165, 74, -15, -254, 43, -139, 141, 13, -190, 55, -15, -190, -23, 16, 245, -2, 60, -62, 30, 159, 132, 99, -47, 134, 71, -95, -395, -28, -1, -26, -74, -75]
7458g5q6J53k8k33N08k79K7K21m30L18p0l9q0K55p8j43l3J72J07k34J29J53k61
7481b6J64m37K15k73L71Q3m15M12j79JL4m3J49j89L56l39K1K54k20j31J60jJ56
7504A23j01J53m3l79L96o5k19J18Ok56K23J83k03M0n4O5q7p8J66N1j71K78j9k21
7528i4O8J32k51K19K04k60J27r4J57p4K6k56R7J36p3O5p8QK34l97p8L24j98N5
7552al8m5O3L00k61n6P7J46j53l9K20k89J85pR5l32J81q3N2k64L15p9K8J32J97
7577C44n91L27j68k80K95J15k6q8J00Mr6J99J68k68o3j27K65j09n5R8j10K64j96
7600Bk46L32j27L6k26L29j36J13j0l46L06n3J97k85l0K60l45pJ11J58r6N0L55
7623C42l15l7r2K07K11j94j5j39JL9J27j44J18k90Q9R6r1K95n6l58J12j27J74
$$ y = [-75, -161, -8, -36, -269, 239, -40, -13, 208, -222, 96, 26, -13, -93, 162, 84, -59, -92, 80, 187, -47, 82, 235, -26, 138, -299, -84, -357, 14, 97, -318, 94, -85, -84, -50, -93, 56, -133, 223, -116, -95, 159, -61, -192, -32, -33, 123, 22, 175, 132, -247, 149, 84, -135, -17, -11, -267, -44, 139, -64, -24, -78, -13, -100, -178, -12, 39, -132, 146, 127, -94, -26, 106, -145, 74, 278, 18, 145, 51, 208, 134, 160, -96, 1, 137, 64, 129, 51, 59, 293, -104, -182, 142, -56, -1, -39, -84, -21, 279, 18, -38, 39, 185, 32, -7, 213, -76, 109, 102, 197, -135, 46, -37, 15, -249, 66, -13, 15, 147, 344, -247, 80, -88, -368, -73, 42, 16, -72, 28, 32, -64, 135, 303, 35, -28, -155, 110, 1, -54, 44, -66, 198, 2, -244, 88, -39, -3, -229, 100, -36, 77, 67, -279, 27, -26, 171, -114, -144, 116, -229, -236, -125, 33, -63, -13, 342, 27, -10, -102, 105, 316, 122, 107, -32, -31, 8, 135, -9, 109, -181, -92, 4, -87, 208, 152, -206, -94, -221, -47]
7646d7o0R2r0K12m18J87j5m8J21K51l17k7K90k1q4k21K43k29M40k49k00P1K59
7669A40k83m5K99M1k27m9J7j7J62K5m0k7K8j59J11j98J74J75J12j89l20l7Q8J97
7693b2KR3N4n5m1j64K0J20J7j73J26J00P6k67J6L30j08j86m7J2j99L30R4j00J09
7718A37j69j73K92N9l41K50N7L9k65J52j59L8K33J99m86P3Q7K02j85n0j25J01
7740c4J36r5J12Q7r1j04LJ63j54j54j2L11k35OQ0j51J79K21j76j06R6jj31l0J84
7765A04J0Q6k31N1k15J94j11R3K79j00k6k85Q0J77j13k34M36j28K06k70j49L01
7787A55j18l9K52p1q8k03j21J60N2j72O06l45j00K44Rj82j28q6J46J20K6l40l9
7810b62N6O9J66j5J34J7k23N5L9Q6k89K23J2kj20n4J10r4J67j01J05k50M3Q5j4
$$ y = [-47, -107, -15, -105, 107, -311, -124, -139, -187, -66, 185, -132, -159, 131, 110, 26, -195, 48, -181, 259, 10, -190, -119, 140, -143, -188, 111, 152, -75, -124, -107, -124, 38, 63, 23, -4, 24, -135, -24, -222, -48, 127, 239, 50, -270, -307, -219, -22, -20, 73, 127, 72, 31, -133, -113, 7, 24, -149, -23, 77, 153, -114, -98, 232, 124, -62, -109, -97, -296, 34, 128, 28, 137, -32, -205, 87, 146, -195, 55, 112, 151, -114, 38, -121, -83, 150, 349, -137, -64, 23, 225, 40, -10, -135, -34, 102, 7, 119, 206, 115, 11, 14, 177, 23, -131, -143, 168, -67, -61, 19, -132, 47, 268, 92, -14, 82, 81, -50, -80, 104, 114, 200, -31, 20, -195, -1, -112, -19, 260, 160, 134, -151, -71, 106, -7, -241, 195, 67, 273, 3, -146, 155, 37, -2, 250, 179, 91, -112, -233, -73, -21, -193, 413, 68, -32, 212, 221, 39, -89, -175, -29, 91, 117, -223, -262, -206, -137, 29, 14, 148, 165, -58, -3, 36, 122, -167, 56, 68, 66, -54, -108, 2, -92, 75, -26, 79, -171, -128, -43, -57]
7835e7L3p2K59j24n2j1J60m24K93k0j76R0K04q2J31q7j1j28J00p7P6j02N9j24
7859a42P8J41l26J80l6K45o4j44k1j44L18j22K37l03M38k19k94K96l7l73M07j44
7881b9K8o1l1o4L15j03pll5J89k60R2l08J27J54l65K64K61l25K94j77L3L6j93
7905a68j9K68j25l10M32k29L30N4q5r2O6j10J25j03J39k36K28m29K94j18j6J81
7927G7o0j51J61l35N67j65MJ49k58l1J10L6k72J84l13K32J32k57J89J05j28P7
7949E3j53K35l81K52L10m37K24l22L08l66L74n6J47l62K25p5k0K43j39j77o2L73
7971A94m31K21M9j7j13K49K4l27J50Qj8j91J23m2Q7J49O3j80l44K43P8k85M05
7994I5J9%j21j25K32k72J73K53j86k88L0K59J95j09j2p2j32k9JJ80m21L93j29
$$ y = [-57, -24, -96, 163, 39, -13, -24, 136, -288, 5, -15, -191, -101, 103, 21, 152, 65, 54, -74, 26, -51, 25, -77, -18, -142, -64, 77, -249, -69, -105, 140, 76, -68, -89, -233, 85, -37, 200, -103, 335, 116, -178, 118, 81, -292, 115, -29, -1, -62, -93, -157, 158, 55, 48, 45, 10, 199, -61, 31, -277, -150, 4, -361, -97, 164, -161, 133, -44, -11, 25, -168, -187, 81, -44, -354, 78, -151, 179, 233, 148, 56, 122, 12, 137, 34, 173, -63, 165, -264, 30, -88, -104, 77, 17, -134, 27, -308, 259, 94, 98, 247, -11, -42, 68, 104, -168, 16, -297, -65, 67, -190, -1, 104, -24, 53, -100, 135, -246, 6, 316, -121, 103, -219, 89, -277, 97, 41, 188, -174, 51, -24, -44, 199, 60, -117, -179, 194, -237, -16, 33, 16, -97, 152, 176, -151, -1, 7, -11, -202, -79, -121, -34, 115, 178, -2, -346, -103, -25, -310, 95, 114, 114, -7, -132, 100, -172, 1, 254, 68, -220, -190, 69, 264, 155, 143, 71, -61, -90, -89, 91, -330, 63, -66]
8017f6J08k19K5k80M08K34n01L47k1l33J10L19l6q6L8J20j94k35L53m4n9p7J0
8040g9J52J86m37R1N8l7j39m1p0J41K03j56k2l5n3K26JJ09p4kO7j97J24k77P5
8065a86K96pj5p4R3P4j07p3j19j08nK16j31j26J70j24R5n6L67j29R1j99j30K80
8089I3Jl12N06k48o3L94k61j23j15q2K09L1k11J85o8K28j94p2J19l67N17p3L9
8112A33Pk42L0L2L4l77N69o5k03lK7K62j22J23j87J57K09j71m67M30J81j97k10
8135e0K38k49K91l22j57L17l9J14l28O1k03K92k24K65k1J02m32N2L95r9j65k4
8157a86M9L50k21qJ39M7pj82J57j97K15p1j29R3o6o1o0K26j94j62N6L39k0j82
8181g5J7J59p5k13K72%J45k15J33O9
$$ y = [-66, 42, -177, -152, -432, -24, 210, -291, 56, 35, -298, -188, 131, 95, 9, 47, 167, -27, -262, 91, 47, -12, -89, -79, 73, 259, -178, -87, -29, -66, -205, -246, -316, -175, 28, -128, -150, -185, -238, -12, -11, 98, 24, 22, 89, -108, 16, -261, -186, 110, 103, 88, 14, 107, 181, 74, 1, -118, -226, -231, -15, -146, -272, -102, -226, -131, -187, 180, 51, 142, -57, -187, 93, 94, -218, 288, 40, -23, 371, 110, -13, -128, -210, -1, 30, -181, 4, -64, 164, -30, -102, 17, -350, 167, 94, 133, 140, -102, -72, -40, -6, -383, 186, 121, -82, -85, -58, 204, 82, 205, 18, 175, 384, 213, -254, 176, 357, 160, -50, 188, -61, 230, -92, -249, 68, 29, 143, -185, -124, -327, -35, -259, 6, -15, 87, -345, -293, 102, 3, -162, -186, -137, 213, -8, -16, 123, 170, 163, -19, 138, -59, 156, 85, -44, 49, -17, -78, -138, 88, -106, -268, -212, 127, 107, -75, -58, 101, 26, -187, 85, 85, 230, 15, 148, 217]
8191B17
$$ Imaginary data points
##PAGE= N=2
##DATA TABLE= (X++(I..I)), XYDATA
0@%%%%%%%%%%%qJ6j6J6j6K4l2L9m7N6o9P8q9J04j24J48j72J97k23K54k92L31l73
34a98M21m74N33n97O65p41Q25r16J017j125J241j371J514j669J837k022K230k460
52a290K712k991L307l666M072m539N085n731O512p475Q695j0297J2505j5749K0972
67A2122l0714N4684k15692k95346N75621J06526k98064R4512J42819k06304l3289
78i3125K0237q2725K64251L01863l36222k62561K58535l3516k60640K77774J90010
89B43881l40276R075K61873l46467k06422N49948J45676n27434j1381L60547j33882
100E138j67285K25234J01014n1199r717k28146j38051L50190J41013l15680N8498
111b8991K72442k80135k61926K86378J16879j66956J38789Q0338k93913p739K79917
$$ y = [0, 0, 0, 0, 0, 0, 0, 0, 0, 0, 0, 0, -8, 8, -8, 8, -8, 16, -16, 23, -24, 32, -37, 41, -48, 56, -68, 80, -92, 105, -118, 136, -156, 175, -198, 223, -251, 282, -315, 350, -391, 434, -482, 535, -590, 651, -720, 794, -875, 962, -1060, 1170, -1290, 1422, -1569, 1738, -1928, 2144, -2395, 2690, -3041, 3471, -4004, 4691, -5606, 6899, -8850, 12122, -18592, 36092, -179600, -474946, 100675, 207201, -90863, 3649, 146468, -59836, -93125, -72888, -155613, 108638, 410501, 74279, -188282, 70253, 36737, -223903, 53871, 243881, -96395, -87320, 174553, -171914, -378336, 171612, 317288, -210146, -221527, 139020, 5138, -162147, 63087, 164101, 112902, 103185, -124961, -263012, 87178, 228191, -87489, -28991, 243451, -36684, -298610, -12232, 104647, -62309, 76480, 156818, -137095, -144834, 135083]
122A35083p2596j41634J60129O229j92959J5913N3672j6406J63530M1650k88382
133a35771k9904K45757j06583j63025K79123J58256k52633p2465J23519p1227
143b4953j3150J54278m9261j10284R0068k8315j48883J09573J28693j31273l8372
154f1879Q2698j11861m0792K09186J8029j50348Q9002O2884j99218k0012J98206
165G5895j2021p8431Q5650l1175j31920O4239O4792q7254M5918J02569j14105
176a5843p0362J28197M150q2390Q6523L1898j38293J77R3189n6150j2809J08729
188G7016m4200j14278M8579K1433p8215O4498J02255p4097m3300P6398k5564n8815
200d8290P5976L4270o6468J8562L1715o6718P210P7595m4370o0545M8852p794
$$ y = [135083, 62487, -79147, 80982, 87211, -105748, -89835, -36163, -52569, 110961, 152611, -135771, -165675, 80082, -26501, -189526, 89597, 247853, -4780, -77245, 46274, -24953, -38103, 116175, 66914, -43370, 46698, 18383, -130500, -20927, 107766, -23507, -61879, 20819, -91042, -131834, 77352, 95381, -54967, 34035, 96919, -102299, -122311, 75895, 63874, -14557, 71093, 39918, -92002, -27763, 37029, -50225, -4307, 98262, -15843, -86205, 41992, 46142, -36248, 50275, 82173, -56120, -55943, 37246, -18904, -31713, 77016, 32816, -81462, -32883, -11450, -89665, -25167, 77088, 2991, -40309, 36089, 10525, -48290, 27686, 61956, -4512, 14050, 45765, -20953, -13743, 63852, 19482, -41063, 7789, -5]
212eo9371M7707O0812m5307j767M5989n5329m6217O7560K1237m7199K8445L4248
225D0803m7262j5844K7527j9642l502L8630k4953l5271N2459K5041n0357J1963
237d08M8420l5577l6861L3759Q510j9159K4083P578l8283m335J2186k8952q097
250c7136L1661j146j3943J8522J04j8495J8404J4392k5033L518L2946p933j8167
263b306K3003R665k3957o915L952j1118Q13J2272m780j043J3149q107j8224O812
277f784Q061j0533K762J3956l502n810N061n146j1150J610J313n488N777J0207
291C34j61J050N370k843m259M578L393O29O352N263l472k885k762q723o825j108
307f069k454j095L371R85k709m79q87m018K63N151L815L225N972L743j301k043
$$ y = [-5, -69376, -21669, 39143, -6164, -7931, 38058, -17271, -63488, 4072, 25309, -21890, 6555, 40803, -6459, -22303, 5224, -14418, -17920, 20710, -4243, -39514, 12945, 37986, -12371, -408, 48012, 12435, -24426, 9333, 17843, -1316, 22767, 30345, -7938, -12273, -87, -29039, -37136, -5475, -6621, -20564, -2042, -1938, -20433, -2029, 12363, -12670, -9152, 23794, 15861, -2306, 20697, 30362, 6405, -510, 3442, -7676, -6863, 5409, 629, -414, 12735, 4628, -13596, -6784, 1277, -9256, -6494, 7462, 3960, -1850, 3211, -1935, -13085, -11475, -10162, -15650, -9873, 334, 173, 1223, 6593, 3750, -509, 4069, 7462, 8091, 14443, 19706, 16234, 13349, 10587, 1864, -4961, -6069, -8523, -9618, -6247, -5262, -7971, -8450, -9337, -13355, -13092, -7941, -4126, -901, 5071, 8814, 7513, 5470]
323E470j766k615j505R92J344K999K925r91k505p98j815l576O1L942K704l86O76
340E156n80l583n040m989k630K164J785k637K138O826j443p417K559P753j394
355a332m16Q812M796J09K325j881n427R72p65q893N58Q796m256o806M165l417
371b660j1263M341N805r272L909J6066o838j2389J2081O638j3416O80R430n522
385b410o18R364n727j577J5491o915j9523J2376J3726j5810K135K1886j0342j7162
399e106J1570l231j8018J4310J2486k2245k835J6595j4329j0967K3071m26j9388
412a8513J4242Q387k1401J2311K8750j6593j1750K2350j1198k4300K5288J6453
424B4026k4439P141J7425l1776j4441L2054l884k0458K5472L115l8602R718K8976
$$ y = [5470, 3704, 1089, -416, 576, 1920, 4919, 7844, 6853, 4348, 3550, 1735, -1841, -1780, 2162, 4866, 4480, 5156, 4576, 993, -4047, -9036, -11666, -9502, -7717, -10354, -8216, -1390, -2833, -10250, -7691, 62, -1332, -1748, 7064, 11860, 11969, 14294, 12413, 6986, 7958, 7193, -1700, -1142, 7654, 3398, -3408, 757, -2660, -13923, -9582, -3777, -13049, -9140, 6926, 88, -12301, -220, 6418, -6998, -6318, 3112, -2410, -3028, 6336, 609, -968, 14523, 7608, -11915, 461, 14187, -1623, 512, 22398, 12056, -5106, 6464, 3233, -14785, -475, 12011, -10234, -13069, 3526, -10803, -21770, 1301, 875, -18513, -4271, 4116, -17285, -4974, 23776, 7183, -4567, 17783, 6585, -17715, 7573, 24026, -413, 6728, 24153, -7623, -22064, 9990, 6106, -14352, 11120, 14235, -24367, -14649, 14327]
437A4327k3533n126L3959j6593l4843K4103J2577k0117K3081J8336m1639m723
449b0191L6797k3863j8667N6571J1511n5950M973K9455k9485n41M1619j8241k7671
462a3683K6901j2698m0075L8230L4574m2077r091K6374l2909j2753N4616l557
474A3852l6213M0237R667p2626P254P5370j4419l5601L2874k601m1222J8163J6049
487A0784j9182L2347K1475o8012j8560O3529r747l8876M7917J5146o5537J695
499b7021L5744l4237P367O7417l0751o8055L4501K6199l9764J8999M5329k5933
511I795j3671J3752m1030l25Q3094o485p5313L3254L9546p1588j3513Q0395k339
524C5572m4196J9890j5800m7332M4560M1960m4991J501M1219m7674l9668N2210
$$ y = [14327, -9206, -14332, 19627, 3034, -31809, -7706, 4871, -15246, 7835, 26171, -15468, -20191, 16606, -7257, -25924, 30647, 42158, -13792, -8819, 20636, -8849, -9390, 32229, 13988, -13683, 13218, 520, -39555, -1325, 33249, -8828, -17919, 8455, -24454, -37207, 17409, 13852, -22361, 17876, 27543, -45083, -37829, 37541, 23122, -12479, 20395, 17794, -23428, -5265, 10784, -8398, 23949, 45424, -22588, -41148, 22381, 12634, -26242, 21675, 36821, -28716, -27021, 8723, -25514, -18147, 49270, 18519, -49536, -15035, 11164, -28600, -9601, 35728, 9795, -3876, 9876, -31154, -31479, 51615, 45130, -30183, 3071, 42617, -28971, -42484, 37911, 35572, -8624, 11266, -4534, -51866, -7306, 34654, -10337, -8836, 32383, -15291, -54959, -2749]
536b749J4906k0561L9102n346p5271K2766O4899m4139k0844P7407q188q3136J4568
549b6586M3596j8036J5979K7625m7674j8833L8450k7463k6237P0877K0169p4696
561b2829m122L3024l7843M565O6403k2711m7613L9648n68o1744L6682O9016l5593
574A6315l0311K7233k2265k1589M9871P677l4193L2506Q214p4731L108P3538j6453
587A8920l4785M0294p815n9675K2861L5733k9508J3864L9108m8417l9089M6351
599b158R720k7062L5223J6906n2034k260L2441k5832K326N8517j7136n6677K4330
612c696K0158l7758J8349M5659l0758k7775K4513j7238k4240M5773J7009m3798
624a3802M951K0774l8596n065N0173n497k7918K4924l306m2135K3285L8624k4682
$$ y = [-2749, 12157, -8404, 30698, 25352, -49919, -27153, 37746, -6393, -27237, 50170, 41982, -41154, -26586, 17010, -1026, 14953, 42578, -5096, -23929, 14521, -12942, -39179, 31698, 51867, -22829, -26951, 6073, -31770, -27205, 39198, 16487, -31126, 8522, 7954, -53790, -17108, 51908, 16315, -13996, 13237, -9028, -30617, 19254, 26931, -7262, 25244, 33458, -41273, -38165, 35373, 18920, -15865, 24429, 16614, -43061, -20200, 15533, -13975, -111, 38997, -9420, -48509, -2158, 7562, -19500, 15723, 32629, -19405, -21665, 10776, -15056, -12730, 45787, 28651, -28026, -3696, 16462, -21296, -2947, 42712, 11954, -15821, 8692, -8546, -32786, 12987, 29996, -13802, -8851, 11923, -26673, -31738, 18435, 12938, -14980, 9944, 6638, -35497, -12212, 26412, 1730]
637A730m695K9572k6372k9269L4804J4002k4604J8561J4308m1360p816L3693j0128
650B426j2235L0462o583l8707J2559J8595k1713Q028K9173k2777k3542K2604K7
663a683j7272K5168J5454k9338j393J9781j7639o239L2560m3k4917J0095N496
676A0030k1763R016K2613j5870q871J5987j2865j9434K1711J1644k0136L718J1615
689G395j9958n732K2006k537j0534J5771j87k1336P743J6843r884r50J5134r336
703D438j2095J2627K633j0796J0338Q257j7398m229J2928o429p574J3097n9j3835
717h097L316M638r624L150J1552p608o959R193q46q228Q684P341q344Q05O861
732E834o369k159J0401j82p198M961K013q716J183O790m497l300N096l734o249
$$ y = [1730, -2965, 26607, 235, -29034, 5770, 19772, -4832, 13729, 28037, -13323, -21139, 12554, 2426, -9809, 20653, 14070, -24637, -12078, 6517, -15196, -7168, 22005, -772, -24314, -1710, -1683, -18955, 6213, 21667, -7671, -9064, 10717, -6922, -13161, 19399, 19356, -5561, 4534, 10030, -11733, -2717, 19896, 4026, -4845, 11142, -1723, -21157, 554, 12198, -7938, -4220, 7395, -12563, -18295, 3711, 1174, -9360, 6411, 6224, -15112, -7369, 9474, -410, -1360, 13774, 4438, -7657, 4970, 7603, -3193, 7145, 15402, -1996, -6225, 6703, 274, -7300, 5797, 5738, -8097, -4781, -143, -9767, -6617, 4935, -2673, -9632, -439, -1285, -9513, -829, 6512, -1832, -1027, 5834, -535, -2694, 7707, 7525, 327, 5288, 7301, -1415, -232, 6558, 2061, -1239, 3857, 123, -6126]
747f126M536J898n510J543L837n265k275N617o57k599M245J657l976J842L745
762B512j935L20M357j563k474L115P18l141J406J904k995j379J541j907j943J309
778a55n32k807P85M21k077r5J928p48n16J317O44n79J540J327J8L00J805lm02
797B171J442M62r28M52Nn80o32L8r99j233K16p68j232n77Q3o41r32L33k30n8K60
818c348N83L96N48P05M59P81Q85N05O81N35N00L4O3M10l98k70m11m77o32p23n82
839B44r50l77o36q81k17j85k40k40J19J70L05P98M95Q8Q81Q50K34M96J057M26
859B437n6J174p8m61K78j59o06m70L78r88j239p0q59j251J24P4j405m25R50o45
879c297n63J662J44p85J594R43j043J374K120o15j4J681k52j367J792Q90j824
$$ y = [-6126, -1590, 308, -5202, -3659, 178, -5087, -7362, -1745, -2402, -5001, -756, 901, -3075, -1233, 2512, 577, 897, 5254, 3691, 1217, 4332, 5050, 1909, 3315, 5219, 2224, 845, 2386, 479, -1464, -155, -687, -3494, -2709, -2288, -4365, -4460, -2532, -3280, -3796, -2479, -1835, -2414, -874, 453, 471, 771, 2576, 2573, 2171, 3613, 4075, 3147, 3599, 3604, 3024, 2392, 2430, 1431, 198, 414, -354, -1586, -2163, -2080, -2721, -3653, -3320, -3550, -3608, -3348, -2765, -2369, -1821, -1116, -657, 124, 1009, 1514, 2195, 2730, 3230, 3264, 3327, 3737, 3339, 3069, 2658, 2181, 1549, 826, 244, -706, -1083, -1719, -2600, -2817, -3002, -3242, -3482, -3363, -3193, -2888, -2090, -1595, -1507, -626, 224, 458, 954, 2011, 2437, 2381, 3555, 3477, 3016, 3294, 3135, 2529, 2059, 2437, 1449, 210, 140, -719, -1970, -1846, -1772, -3177, -3602, -2652, -3297, -3860, -2198, -2054, -2839, -1245, -302, -1345, 29, 2149, 1534, 1520, 3201, 2949, 1582, 3374, 4264, 2440]
896B440K15P37k179j063J743j699j900J337l41k790J14J472j644k89K481j247
912b613j947K902J105k079K149K667k098jK645q65r42L662N2l390J611J543l797
929F04M3L169k078k902J820j267l396K247J681l605J74K692k966j785M157P47
945f65k512K790J759l358Q27M226j605o67M214r19m174K692J994l395J207K724
961E138l725l040L236j264l633L294J421n126o53L245k803j317N218n99l929L208
977a329J041l628K815M948k612j386L998j862l203M743K171l918R88K589n037
992C18k266N032r38l462K525l38n505J039L504k894p51M270k289m682L572K310
1008e55k758K755L925m049j165M271j087k304N468J615n014j17K617l204k98M930
$$ y = [2440, 2655, 3392, 1213, 150, 1893, 194, -1706, -369, -710, -3500, -3386, -1914, -3558, -3847, -1366, -2613, -4560, -1658, -553, -2632, -483, 2184, 86, 85, 2730, 1865, 923, 4585, 4637, 1247, 2858, 4401, 604, 647, 3816, 1738, -1164, 656, -611, -4007, -1760, -79, -3684, -3510, -818, -3784, -5569, -1412, -665, -3177, -387, 1372, -1986, -1159, 3067, 1462, 795, 5009, 4090, -84, 2608, 4602, 1207, 2414, 5138, 1413, -1627, 1609, 345, -3288, 6, 1427, -3699, -4352, -1107, -3910, -5227, -9, -608, -4537, -1329, -288, -3916, -1101, 3847, 1235, -151, 3847, 1985, -1218, 3525, 5696, 1778, 2766, 5355, 318, -1948, 3084, 2146, -1316, 1209, 871, -4634, -3595, -91, -2985, -3736, 534, -1755, -6437, -2865, -555, -3313, -558, 3367, -682, -1847, 2424, 1337, -967, 4501, 6116, 1102, 985, 3602, 398, 100, 5030]
1024E030j766m254J871p40m983K644M367l342k601K775k174l527M751K145k902
1039b706J596L019m905j054O340K33k317L773K98n067J028L716k137J50M361l815
1055B513n422K743J782l619J912L323n038l127L065j249k095N452J364n841N28
1070c709L126k869J25O628m79l922K437N65m112L463N247l242j864L361l313m416
1086b974M722K697m287P02J384o243j311N481o73k889L967o09o539J735M704j785
1102a918L81M961k855n067M173K343k666L738L641n287k499M270j730k257N811
1117E039N28o432p2K440m469M95N768k545m638K396m91m909M153N173m253j118
1133b935L619l215k692O390K274l551K491J597n808K40O667j273k610L646j340
$$ y = [5030, 3264, -990, 881, 141, -4842, -2198, 2169, -1173, -3774, -999, -3173, -6700, -1949, 196, -2706, -1110, 1909, -2996, -4050, 2290, 2523, 206, 3979, 4277, -790, 238, 3954, 1817, 1967, 6328, 2513, -2909, -166, 1616, -2003, -91, 3232, -1806, -4933, -1868, -3117, -5212, 240, 1604, -4237, -3709, -583, -3452, -3327, 3301, 2822, -1100, 1337, 1902, -2210, 1253, 6500, 3258, 1394, 4755, 1442, -2974, 1748, 4445, 158, 860, 2244, -3999, -5310, 171, -502, -3391, 576, -33, -6572, -4837, -133, -1918, -1537, 3424, 569, -4498, -325, 2018, -648, 3090, 6731, 1444, -1055, 3215, 1485, -772, 5039, 5567, -865, -937, 1503, -2966, -2471, 3297, 752, -3886, -1490, -1981, -6890, -2737, 2436, -1817, -2935, 684, -2531, -5223, 1167, 3441, -110, 2381, 3978, -1830, -1590, 5077, 3804, 1194, 4840, 3500]
1148C500o557K258M105l603L92L516n066m181M494L47l452L407K614n658q99L992
1164g91j845l36N877p19m883K290K675l719J974N758l357k665K706j329l374M202
1180B464K434m450m82K282m753j438N117q5m336K177L92m833J895M140j956j225
1196b657L823j697l663L901K806k687J778K484l582j108L683o65j910L439Jm717
1212g71N67K174k577n49L570k311l665K125K66k567J945K305l203o91K829j255
1228a808r88L666Q55k537J420J393k009M36L572j358j638J920n10k599J515J806
1244C136k772n10J487k225j537K027k22k040J359M58k312K32J786n31l21J806
1260a79n0r16J278R37j109R72J815j234o07J699p32p76J200o1j652L9O08j160
$$ y = [3500, -3057, -799, 3306, -297, 95, 3611, -1455, -5636, -1142, -795, -4247, -840, 1774, -3884, -4783, -791, -2636, -2972, 2905, 2186, -2697, -407, 2268, -1451, 523, 6281, 2924, 259, 2965, 1636, -1738, 2464, 4898, 448, -34, 2248, -2505, -3943, 1174, 1089, -3247, -1070, -678, -5511, -3616, 524, -1432, -2657, 1166, -531, -4194, -293, 2513, -174, 1604, 4088, 506, -602, 3081, 2416, 506, 3945, 3946, -771, -204, 1970, -607, -1156, 2414, 103, -3562, -1437, -1171, -3738, -1793, 512, -2691, -3382, -553, -1808, -2796, 870, 1725, -812, 608, 2001, -8, 428, 4000, 2642, 1004, 2924, 2414, -185, 1330, 3136, 364, -146, 1341, -884, -2421, -394, -616, -2656, -1297, -839, -3151, -2919, -1133, -1664, -1985, -179, -229, -1145, 133, 1070, -39, 933, 2748, 1514, 907, 2606, 1874, 1098, 2298, 2237, 585, 624, 1232, 72]
1278G2n45P55r69j617J064o7j309M69O29j27m96J298m87j30J336O28m18Q10O55
1297A551l12R7P22L3m64O02j32n47k70Pp59m73L02q80p74L96k81o12m3K58l94
1318a973J57M61j42P7O53R3K35O13N00K5M32O87m3l6J71j97J40l25L7m73k95j45
1340F52o94k43l01k71n88N8Q4p98M57J57j60m3O44L4j5Q48K86j3O21O62k92L81
1362A466N59k78m29M79l6n44j45K27j066j87K80j044n53J024m68j411M37N72j026
1381b143P9J126q33R5J522k52r72J712J168j034J86J565r79k19J734r24p34J184
1399B281o89j780P86J117k124p48J577j581j534J691r0j719J544J367k837j93
1415b932L127n05j178K124N29j889J289J044j803J979K492k961k277L688m76l160
$$ y = [72, -473, 282, -687, -2304, -1240, -1307, -2616, -2147, -1518, -1645, -2141, -843, -1330, -1460, -124, 504, 86, 896, 1551, 1239, 1336, 2058, 2091, 1627, 2229, 2097, 1550, 1280, 1287, 528, 55, 357, -523, -1297, -901, -1182, -1794, -1837, -1579, -1973, -1816, -1355, -1497, -1420, -767, -674, -439, 174, 674, 699, 1131, 1818, 1775, 1739, 1910, 1713, 1853, 1528, 1565, 1092, 797, 652, -42, -285, -586, -857, -1445, -1387, -1303, -2101, -1644, -1487, -1647, -1690, -1046, -1012, -1027, -179, 107, 94, 715, 1377, 1085, 1466, 2025, 1747, 1318, 1797, 1761, 1217, 1072, 1299, 233, 46, 326, -718, -1271, -247, -715, -2126, -1689, -1117, -2143, -2064, -938, -1771, -1676, -154, -406, -1378, 334, 1502, 468, 654, 2219, 1240, 1021, 2755, 1831, 1097, 2281, 1592, -188, 598, 1715, -409, -1157, 420, -1161, -2695, -1004, -1094, -2813, -1269, 98, -2739, -2932, 195, -310, -1488, 636, 1165, -724, 565, 1609, -194, 1785, 4277, 1316, -961, 2727, 2251, -909]
1431i09K209J914l460o36K035k866q41M138j589l763K635J139m039J374L703j723
1447f79r39K679k367k218N493J389m695K344M043m976k377N517N4l017K991p08
1463B534n144K016L389m491L90N033m140n299M603J015l740L974K744o961p2N821
1479A672l546k351P820O68p196K100L411m291K024O233m629l027M834k521n870
1494d669P234L876p559l34M335o254k279Q325q15o150N154L79q948K977Q352l888
1510b64k209O413l961o227P149K874n508M475M641r546k369Q764j765m317P441
1525E591R1r935J783N260n805J430Q266o132p636O464K12o553P212N748r046j395
1541d445O124n596k068J1433K34q979M184K735q590K828J0145m747m317O253m408
$$ y = [-909, 1300, 3214, -246, -882, 1153, -1713, -2554, 1584, -5, -3768, -1133, 6, -4033, -2659, 1044, -679, -1618, 1061, -1306, -3524, 1969, 3358, -1337, 1007, 5050, 74, -2303, 3214, 3268, 251, 3242, 2534, -2610, -594, 2795, -1696, -1306, 3727, -413, -5712, -1109, -94, -3834, 140, 2884, -4077, -4149, 1672, -1874, -4225, 3595, 4263, -2933, -833, 2578, -1713, 311, 6544, 1915, -1112, 3722, 1201, -4669, 2565, 6441, -1118, -1452, 2883, -3371, -5650, 2675, 1860, -4290, 864, 1243, -7705, -4728, 3624, -264, -2473, 3940, -21, -6248, 901, 3775, -1733, 2742, 7383, -2163, -4532, 4232, 2467, -1850, 5591, 5682, -4253, -2470, 2790, -3015, -1585, 6681, 549, -7087, -623, -411, -6964, 248, 5996, -3050, -4445, 1679, -3917, -5985, 5448, 5682, -3297, 887, 3622, -4968, -2140, 8005, 3258, -1059, 5194, 786]
1556G86p726Q053N398p836J525M864r800l490J0581o35o268P255J23j0829K412
1571e587Q691n024l16Q735n238q741P656K845o179O089O144j0059l269P869l332
1586B84l459R985r1j0575K507L847p728J774J0934n960p155O053j764p321Q087
1601e82O443q051k56N851p476l166J1335R66p130M500J907r322K154R428m620
1616A981k352O903m971q458O901M740p023L125N240r145m165P938j021m276P493
1631B910O89r802J986O205n119Q25Q269m052o919N527J169n876O239N920p713
1646B58k138N897m426l269Q017J264p690K162K204p040J351P593l724m091N230
1661A598k337o682N884M927n406O92M551n705k604P358M05m272M341J380p115
$$ y = [786, -6940, 1113, 6511, -1325, 200, 5064, -4736, -8226, 2355, 1720, -4548, 2707, 2830, -7999, -5587, 3104, -1920, -2236, 6499, 1261, -7480, 176, 3021, -3158, 2931, 9075, -984, -4253, 3616, 284, -3175, 6810, 6719, -3856, -1349, 2498, -5230, -3456, 7478, 1518, -5637, 416, -1348, -8669, -582, 5861, -2190, -2446, 3405, -4071, -7237, 4098, 5064, -2066, 2434, 4341, -4981, -2827, 6601, 1981, -371, 6532, 1561, -6897, 4, 4744, -2279, 846, 6086, -3059, -7224, 714, -307, -4583, 2910, 3599, -6203, -4217, 1988, -3131, -2306, 5963, 1911, -5008, 519, 1688, -4188, 2051, 7971, 258, -1880, 4017, -409, -3678, 4339, 5603, -2087, 75, 2279, -4761, -3410, 4183, 459, -3632, 1598, -739, -7421, -1537, 3390, -2016, -1324, 3227, -2478, -5082, 2276, 2681, -1591, 2750, 4130, -2985]
1676b985J241N865l327j032N118k661n751M038J632m566K995L637n860k493M541
1691C92j474k951N382P46n389J154K809l519P13N405k060l492L848P5m116L511
1707A034L328l673o03L112k991k162M436J01l861J879J007m310M69L601j763j792
1723b188K732j056l234K368K139k666J055K551k579j488L242L40k218K849N47
1738B394k621M77K236k075k78K365j000k261J568K28k382R60J567k016j061J566
1754c33q06j026J677O41k101P39J276j473L23J850m62p35J449K06j390R50J205
1771A990j294J02J252j504l81Q46k04r58K74K22j410p7J039r95l60Q57l77o11
1789a589N29M00k53j32J097m43l2R28q1m4N27K64j13k56L76k14k33M57l24o49
$$ y = [-2985, -1744, 4121, 794, -238, 4880, 2219, -3532, 506, 2138, -2428, 567, 4204, -1656, -4149, 392, -1082, -4033, 1349, 2095, -3294, -2140, 669, -2850, -2137, 3268, 1208, -2284, 1564, 1639, -2477, 1034, 4362, 689, 86, 3198, 207, -1955, 2481, 2582, -1279, 600, 1607, -2703, -2234, 1367, -396, -2188, 544, -512, -3746, -1378, 761, -1905, -850, 1701, -878, -2366, 876, 1216, -1002, 1847, 2394, -227, 250, 2486, 411, 133, 2498, 1498, -763, 805, 1033, -1349, -389, 1178, -838, -1899, -333, -1139, -2165, -488, 153, -1948, -1209, 67, -1406, -1083, 767, 305, -430, 1019, 1225, -165, 785, 1990, 696, 798, 2050, 546, 165, 1011, 807, -151, 123, 345, -1065, -1142, -103, -1098, -1458, -601, -978, -1589, -1060, -660, -913, -1045, 52, -391, -423, 505, 424, 380, 907, 1171, 1058, 802, 1178, 964, 731, 1188, 864, 215]
1809B15Q8J31n37k16j51l52j67J07R0l91R2J26k43N99l6J46m6O59J89j73M20K57
1831H07j58M05j20j25L45K6j34k57lj98m90k17L7k90k00Q2n25Q8M9j42k24K16
1853a028J77p4J57L73o8M39N01j2l05O61N05p59M26L64k96m52J70j24k17j07k52
1874G9l08j69L51q91r5M88j24o89O25k29l55P40L13k35K24M44J31n71R66J5k52
1895D58O54J28m79J17L07p88J34N64l95j393P83K8j065L55N82j119j84P13m40
1914a040m58J095K39j172P42J016r61N9J511m73o86J394j92j578J334J280j872
1931B38k04J608j103j357J346J71j728J035N58k324K19J769j098o65J898n89k180
1948b406J387J318j662J134K052k039q74K454l25j798K275J021k525J99J384j705
$$ y = [215, 303, 434, -103, -319, -470, -822, -989, -882, -792, -1183, -1091, -965, -1208, -609, -645, -499, -545, 114, 303, 130, 550, 807, 649, 1054, 934, 809, 1154, 1180, 1046, 789, 786, 588, 98, -119, -82, -372, -572, -490, -1015, -927, -878, -1020, -1244, -1028, -851, -925, -768, -395, -463, -24, 477, 465, 160, 821, 1326, 567, 993, 1357, 1061, 609, 779, 655, 438, 331, 79, -229, -398, -47, -938, -1033, -545, -669, -1358, -733, -962, -1317, -577, -264, -499, -275, 169, 300, -271, 695, 710, 458, 1112, 1240, 761, 878, 1185, 397, 531, 1095, 700, -693, 90, 118, -947, -592, -10, -1129, -1313, -600, -1040, -1498, -403, -164, -1336, -594, 422, -539, -480, 1031, 558, -128, 1266, 1074, -504, 830, 2110, 238, 34, 1642, 539, -818, 528, 699, -1029, 6, 564, -1760, -1541, 228, -870, -1535, 363, -226, -2406, -1019, 299, -1363, -229, 1823, -216, -1090, 1364, 1039, -759, 1516, 2537, 12, 211, 1595, -110]
1964a10K7K212j424k119J918k84k287J035K429k475r08K278j419j757L139M58
1980G13k291J605J221l168N77L346j059j230K417q16k830K315J520k815J181K182
1996B868l218j802L299m04k583K845K48l849M80K647k242j53L781j500l527K628
2012d82J079k801K241K779k940j050K851j740j633M046P80l822J076J845l581
2027a352M02M002k178k401K608r66l408K819K053k972K78K363l335j521M389K39
2043A020k994K836R04m181Q91L564j858k03L330j841l901L292J267l178K091K568
2059C607m009j904L609j451j809L363L44m409R84K354l035M87M217j959l066K784
2075A07j24k933L313K777l450k84K535k184j575M394K25l323J364Q66l672O39
$$ y = [-110, -83, 2129, 705, -1414, 504, 220, -2067, -1032, 1397, -1078, -1986, 292, -1127, -2884, 255, 713, -1578, 27, 1248, -1920, -1343, 2003, 944, -286, 2131, 1315, -1515, 800, 2320, -495, 686, 2868, -350, -2152, 1147, 743, -1840, 1005, 1253, -2596, -2116, 531, -1711, -1864, 1917, 417, -3110, -482, 597, -2204, 37, 2816, -124, -1174, 1677, -63, -1696, 2350, 3130, -692, 384, 2229, -1352, -950, 3052, 874, -1527, 1081, 115, -3293, -474, 1579, -1393, -1115, 1248, -2087, -3608, 781, 1020, -1974, 862, 1766, -2415, -1524, 2040, 182, -21, 3309, 1468, -2433, 859, 2126, -1052, 1039, 3607, -402, -2306, 1303, -148, -1957, 1406, 1750, -2659, -1675, 679, -2356, -1869, 2348, 389, -2677, 107, -17, -2950, 363, 3140, -310, -594, 1941, -243, -1818, 2576, 2801, -522, 842, 1708, -1964, -1325]
2091a325L975k228j534K739j681l194K744J948k969Q96K145l476j363L758k94
2106A41k045L441K25l995J314K645k080J91L637k293k842K579L40k379K603J493
2122B975l600r04K780j911j407L561l18l166J196J062k970J090L305j743j761
2137a811K496p64k546L022J922k596J79K016k480p48L432l86j958J680q0k946
2153a568J004K386j784p68K425k202k177K587N62k061J584J218k827l31K457j100
2169e95o81K684k03k687J287J588j992Q57K368j853j291J522j99j735J760J200
2185B030k243k88J358j693n24K140l84j878J152R3j748Q41K044j446o09J813r60
2202c02j025J832O45j528R26J059j572n18K316p48r50J289m33j661Q04Q30j159
$$ y = [-1325, 2650, 422, -1112, 1627, -54, -3248, -504, 1444, -1525, -629, 1516, -1960, -3323, 435, 141, -1904, 1537, 1762, -2233, -919, 1726, -354, -163, 3474, 1181, -1661, 918, 1258, -1121, 1482, 2975, -625, -1529, 1251, -660, -2067, 1494, 1176, -1990, -794, 268, -2702, -1612, 1693, -50, -1811, 685, -79, -2625, 397, 2319, -277, -98, 1918, -562, -1310, 2122, 1736, -222, 1458, 1378, -1568, -564, 1822, 38, -730, 1695, -507, -2684, -97, 465, -1596, -12, 1206, -1621, -1952, 505, -595, -1276, 1408, 1205, -1482, -195, 1393, -599, 258, 2626, 773, -518, 1004, 805, -930, 830, 2030, -213, -501, 857, -836, -1360, 780, 396, -1482, -330, -237, -1985, -1144, 900, -546, -1155, 658, -302, -1327, 505, 1150, -378, 548, 1607, 35, -483, 1833, 1085, 135, 1424, 991, -670, 134, 964, -195]
2219a95k23J275j313r85J303j46r20Q70N58j495L53Q14n91J02J477l89j021O92
2237A66N69p83O99P67p01n71Q35k60q89R45J9r87N1O52j182o9Q67n62k48L03J9
2258c60q15L56P36m56K1P55o7q54Q89J95m72R41k32j83J27K15l39k9M81m54n83
2279a28L04K30l61j38L69o45m62M30j04k83R8J20m59N29K62j64K20M82k27J79
2299B52J22L31k36J28K33j37j07J44J03m39O1l24k5l7q3j44j32Lj43l59K93k4
2321e20j03K04QMJ90J07J57k70J84K27k05J18J04J78J19o5k8K10k3k39k98J45
2343B04m8j09k28K4O7m04K82l46k91K40J35Lj62J92J41j01L22J09J4M10J63k45
2365C72N0J30k61J32J30j03p2J28k29m05J81j45k45k98M58l20j6K05m01K0L71
$$ y = [-195, -418, 857, -456, -1441, -138, -284, -1204, -334, 224, -1271, -918, -104, -695, -593, 884, 495, -526, 166, 735, -48, 651, 1418, 717, 146, 981, 721, -168, 777, 796, -191, -140, 512, -670, -739, 128, -434, -682, -379, -360, -1175, -819, -83, -539, -518, 237, 170, -684, 205, 400, -72, 869, 637, 454, 581, 796, 457, 428, 909, 455, -128, 176, 406, 45, -93, 276, -369, -831, -401, -505, -788, -690, -570, -1029, -500, -238, -402, -182, 300, 73, 252, 374, 705, 469, 597, 830, 693, 586, 730, 833, 394, 455, 131, 106, 69, -14, -158, -290, -287, -430, -789, -496, -520, -623, -419, -411, -407, -217, -110, 47, -223, -39, 188, -17, 101, 205, 383, 502, 437, 409, 619, 596, 357, 59, 204, 156, 47, -181, -157, -90, -494, -212, -558, -849, -609, -474, -471, -633, -441, -300, -401, -79, 30, 44, 454, 617, 372, 422, 552, 291, 423, 553, 450, 378, 506, 277, -128, 53, -92, -337, -635, -177, -497, -513, -308, -709, -689, -318]
2386c18O3j84K66K16j54J10K07O9k2M18k79j35K51J40m70j0L71m44J54o2n5n37
2408d05L37P5o61LM74l13j99K20k27k95L83R28n65Q2L60l98j02R69l69m6M06j01
2430E56m94J8P58n90k73O19m23l34L73J6o65N00J05j078j0P05k78m65J083j58
2450c5o99M48K41l02K33Q70l79l97N76k05n45R13K85j021O3O45p71l62J102l55
$$ y = [-318, -255, -439, -173, 43, -111, -1, 206, 275, 253, 671, 392, 257, 508, 648, 178, 168, 539, 95, 249, 187, 132, -405, -68, 7, -654, -651, -177, -490, -689, -469, -696, -991, -608, 320, -245, -163, 197, -201, -303, 666, 297, 251, 657, 556, 62, 80, 838, 248, -25, 594, 171, -163, 210, 226, -439, 61, 166, -912, -922, -217, -495, -960, 123, -35, -734, -286, -45, -347, -114, 756, 377, -20, 556, 351, -194, 719, 1004, -17, 46, 691, -80, -442, 660, 305]
$$ [...]
8191I9
##END NTUPLES=NMR FID
##END=
