##TITLE=1H_SR102_1_2
 CDCl3
 8 sc, 
 8.02.2022
##JCAMPDX= 6.0         $$ Bruker NMR JCAMP-DX V2.0
##DATA TYPE= NMR FID
##DATA CLASS= NTUPLES
##ORIGIN= UXNMR, Bruker Analytische Messtechnik GmbH
##OWNER= root
$$ XWIN-NMR		Version 3.5
$$ Tue Feb  8 11:58:18 2022 Russian Standard Time (UT+4h)  she@DPX200
##.OBSERVE FREQUENCY= 200.131346
##.OBSERVE NUCLEUS= ^1H
##.DELAY= (6, 6)
##.ACQUISITION MODE= SIMULTANEOUS
##.ACQUISITION SCHEME= undefined
##.AVERAGES= 8
##.DIGITISER RES= 18
##SPECTROMETER/DATA SYSTEM= spect
##.PULSE SEQUENCE= zg30
##.SOLVENT NAME= CDCl3
##.SHIFT REFERENCE= (INTERNAL, CDCl3, 0, 15.7039)
##AUDIT TRAIL= $$ (NUMBER, WHEN, WHO, WHERE, WHAT)
$$ ##TITLE= Audit trail, XWIN-NMR		Version 3.5
$$ ##JCAMPDX= 5.01
$$ ##ORIGIN= Bruker BioSpin GmbH
$$ ##OWNER= she
$$ F:/spectra/data/she/nmr/H-F/1/audita.txt
$$ ##AUDIT TRAIL=  $$ (NUMBER, WHEN, WHO, WHERE, WHAT)
(   1,<2022-02-08 11:56:33.34 +0400>,<she>,<DPX200>,
      <created by zg, POWCHK disabled, PULCHK disabled
       configuration hash MD5:
       00 E9 B6 7A A2 85 ED C7 34 08 36 98 17 FE 4E 26
       data hash MD5: 16K
       3C DB 23 83 06 34 C0 A4 6A 2C 82 57 5B 04 14 8A>)
$$ ##END=
$$ 
$$ hash MD5
$$ 96 49 82 F3 10 08 3D 90 79 BC 15 A6 8A ED 3E 65
##$RELAX= 
##$RELAX= 
##$RELAX= 
##$RELAX= 
##$RELAX= 
##$RELAX= 
$$ Bruker specific parameters
$$ --------------------------
##$DU= <F:/spectra>
##$EXPNO= 1
##$NAME= <H-F>
##$PROCNO= 1
##$TYPE= <nmr>
##$USER= <she>
##$AMP= (0..31)
100 100 100 100 100 100 100 100 100 100 100 100 100 100 100 100 100 100 
100 100 100 100 100 100 100 100 100 100 100 100 100 100 
##$AQSEQ= 0
##$AQ_mod= 1
##$AUNM= <au_zg>
##$AUTOPOS= <>
##$BF1= 200.13
##$BF2= 200.13
##$BF3= 200.13
##$BF4= 200.13
##$BF5= 200.13
##$BF6= 200.13
##$BF7= 200.13
##$BF8= 200.13
##$BYTORDA= 1
##$CFDGTYP= 0
##$CFRGTYP= 5
##$CHEMSTR= <none>
##$CNST= (0..31)
1 1 145 1 1 1 1 1 1 1 1 1 1 1 1 1 1 1 1 1 1 1 1 1 1 1 1 1 1 1 1 1 
##$CPDPRG= <>
##$CPDPRG1= <>
##$CPDPRG2= <>
##$CPDPRG3= <>
##$CPDPRG4= <mlev>
##$CPDPRG5= <mlev>
##$CPDPRG6= <mlev>
##$CPDPRG7= <mlev>
##$CPDPRG8= <mlev>
##$CPDPRGB= <>
##$CPDPRGT= <>
##$D= (0..31)
0 1.2 0 0 0 0 0 0 0 0.06 0 0.03 0 0 0 0 0.0002 0 0 0 0 0 0 0 0 0 0 0 0 
0 0 0 
##$DATE= 1644306992
##$DBL= (0..7)
120 120 120 120 120 120 120 120 
##$DBP= (0..7)
150 150 150 150 150 150 150 150 
##$DBP07= 0
##$DBPNAM0= <>
##$DBPNAM1= <>
##$DBPNAM2= <>
##$DBPNAM3= <>
##$DBPNAM4= <>
##$DBPNAM5= <>
##$DBPNAM6= <>
##$DBPNAM7= <>
##$DBPOAL= (0..7)
0.5 0.5 0.5 0.5 0.5 0.5 0.5 0.5 
##$DBPOFFS= (0..7)
0 0 0 0 0 0 0 0 
##$DE= 6
##$DECBNUC= <off>
##$DECIM= 32
##$DECNUC= <off>
##$DECSTAT= 4
##$DIGMOD= 1
##$DIGTYP= 9
##$DL= (0..7)
0 120 120 120 120 120 120 120 
##$DP= (0..7)
150 150 150 150 150 150 150 150 
##$DP07= 0
##$DPNAME0= <>
##$DPNAME1= <>
##$DPNAME2= <>
##$DPNAME3= <>
##$DPNAME4= <>
##$DPNAME5= <>
##$DPNAME6= <>
##$DPNAME7= <>
##$DPOAL= (0..7)
0.5 0.5 0.5 0.5 0.5 0.5 0.5 0.5 
##$DPOFFS= (0..7)
0 0 0 0 0 0 0 0 
##$DQDMODE= 0
##$DR= 18
##$DS= 0
##$DSLIST= <SSSSSSSSSSSSSSS>
$$ [...]
##$SUBNAM2= <"">
##$SUBNAM3= <"">
##$SUBNAM4= <"">
##$SUBNAM5= <"">
##$SUBNAM6= <"">
##$SUBNAM7= <"">
##$SUBNAM8= <"">
##$SUBNAM9= <"">
##$SW= 18.0517287032376
##$SWIBOX= (0..15)
0 0 2 0 0 0 0 0 0 0 0 0 0 0 0 0 
##$SW_h= 3612.71676300578
##$TD= 16384
##$TD0= 1
##$TE= 0
##$TE2= 300
##$TE3= 300
##$TEG= 300
##$TL= (0..7)
0 120 120 120 120 120 120 120 
##$TP= (0..7)
150 150 150 150 150 150 150 150 
##$TP07= 0
##$TPNAME0= <>
##$TPNAME1= <>
##$TPNAME2= <>
##$TPNAME3= <>
##$TPNAME4= <>
##$TPNAME5= <>
##$TPNAME6= <>
##$TPNAME7= <>
##$TPOAL= (0..7)
0.5 0.5 0.5 0.5 0.5 0.5 0.5 0.5 
##$TPOFFS= (0..7)
0 0 0 0 0 0 0 0 
##$TUNHIN= 0
##$TUNHOUT= 0
##$TUNXOUT= 0
##$USERA1= <user>
##$USERA2= <user>
##$USERA3= <user>
##$USERA4= <user>
##$USERA5= <user>
##$V9= 5
##$VALIST= <valist>
##$VCLIST= <CCCCCCCCCCCCCCC>
##$VD= 0
##$VDLIST= <DDDDDDDDDDDDDDD>
##$VPLIST= <PPPPPPPPPPPPPPP>
##$VTLIST= <TTTTTTTTTTTTTTT>
##$WBST= 1024
##$WBSW= 4
##$XGAIN= (0..3)
0 0 0 0 
##$XL= 0
##$YL= 0
##$YMAX_a= 680787
##$YMIN_a= -960578
##$ZGOPTNS= <>
##$ZL1= 120
##$ZL2= 120
##$ZL3= 120
##$ZL4= 120
##$ABSF1= 10
##$ABSF2= 0
##$ABSG= 5
##$ABSL= 3
##$ALPHA= 0
##$AQORDER= 0
##$ASSFAC= 0
##$ASSFACI= 0
##$ASSFACX= 0
##$ASSWID= 0
##$AUNMP= <proc_1d>
##$AZFE= 0.1
##$AZFW= 0.1
##$BCFW= 1
##$BC_mod= 2
##$BYTORDP= 1
##$COROFFS= 0
##$CY= 11.3945322036743
##$DATMOD= 1
##$DC= 2
##$DFILT= <>
##$DTYPP= 0
##$F1P= 2.36226072786647
##$F2P= -0.459571619588291
##$FCOR= 0.5
##$FTSIZE= 0
##$FT_mod= 4
##$GAMMA= 1
##$GB= 0.15
##$INTBC= 1
##$INTSCL= 1
##$ISEN= 128
##$LB= 0.24
##$LEV0= 0
##$LPBIN= 0
##$MAXI= 10000
##$MC2= 0
##$MEAN= 0
##$ME_mod= 0
##$MI= 1.114404
##$NCOEF= 0
##$NC_proc= 0
##$NLEV= 6
##$NOISF1= 3.799351
##$NOISF2= 2.8
##$NSP= 1
##$NTH_PI= 0
##$NZP= 0
##$OFFSET= 15.70392
##$PC= 1
##$PHC0= -15868.35
##$PHC1= 9.80078
##$PH_mod= 1
##$PKNL= yes
##$PPARMOD= 0
##$PSCAL= 0
##$PSIGN= 0
##$REVERSE= no
##$SF= 200.130013532006
##$SI= 16384
##$SIGF1= 3
##$SIGF2= 2
##$SINO= 400
##$SIOLD= 16384
##$SREGLST= <1H.CDCl3>
##$SSB= 0
##$STSI= 0
##$STSR= 0
##$SW_p= 3612.71676300578
##$SYMM= 0
##$S_DEV= 0
##$TDeff= 0
##$TDoff= 0
##$TI= <>
##$TILT= no
##$TM1= 0
##$TM2= 0
##$TOPLEV= 0
##$USERP1= <user>
##$USERP2= <user>
##$USERP3= <user>
##$USERP4= <user>
##$USERP5= <user>
##$WDW= 1
##$XDIM= 8192
##$YMAX_p= 0
##$YMIN_p= 0
$$ End of Bruker specific parameters
$$ ---------------------------------
##NTUPLES= NMR FID
##VAR_NAME=  TIME,          FID/REAL,        FID/IMAG
##SYMBOL=    X,             R,               I
##VAR_TYPE=  INDEPENDENT,   DEPENDENT,       DEPENDENT
##VAR_FORM=  AFFN,          ASDF,            ASDF
##VAR_DIM=   8192,          8192,            8192
##UNITS=     SECONDS,       ARBITRARY UNITS, ARBITRARY UNITS
##FACTOR=    0.0002768,     1,               1
##FIRST=     0,             0,               0
##LAST=      2.2672688,     0,               0
##MIN=       0,             -960578,         0
##MAX=       2.2672688,     680787,          0
$$ Real data points
##PAGE= N=1
##DATA TABLE= (X++(R..R)), XYDATA
0 0 0 0 0 0 0 0 -8 8 -8 8 -16 22 -24 32 -40 56 -64 80 -104 120 -144 175 -208 245 -288 333 -388 448 -518
29 -518 596 -677 774 -883 998 -1126 1268 -1425 1598 -1786 1992 -2217 2464 -2732 3028 -3349
45 -3349 3700 -4082 4501 -4963 5466 -6018 6631 -7310 8065 -8911 9861 -10944 12187
58 12187 -13629 15326 -17359 19845 -22972 27027 -32533 40460 -52913 75372 -128401 505040
70 505040 -25731 -959944 382831 215859 -520794 17980 420941 -134108 7178 -112971
80 -112971 -558520 83023 680787 -102077 -250261 246012 -193980 -402803 399050 320753
90 320753 -165954 315626 310149 -706538 -568714 445334 334901 -296291 -58979 238292
100 238292 -86516 -309025 -83315 194251 355432 152640 -340386 -269670 316266 207826
110 207826 -227391 173664 415000 -333961 -526286 80342 10051 -139308 398539 225009
120 225009 -470932 -116499 282428 -190202 -97719 423990 107762 -176245 33979 -145918
130 -145918 -95412 434131 87346 -476777 33381 205007 -446685 -188490 507366 174027
140 174027 -195921 47989 -56384 -224666 126086 206903 -31871 100441 134601 -206002
150 -206002 -178099 113984 39022 -67544 41016 -73059 -235136 5083 195102 5405
160 5405 3349 206799 -10156 -287070 -13968 210187 19290 43608 168808 -94541 -195481
171 -195481 33831 -50709 -135343 152051 84551 -230352 -14034 162327 -91387 18147
181 18147 247892 -61411 -177802 105381 -3605 -123606 186111 147821 -169020 -43283
191 -43283 28473 -210884 -70824 182456 -2370 -74922 112045 19465 -95985 74640 96811
202 96811 -36409 17038 34464 -83693 -24768 95756 18131 -53226 -3721 -41692 -128290
213 -128290 -58171 51997 29356 20955 90408 29055 -79759 12688 84903 -36346 -32071 87029
225 87029 1882 -78115 27302 18532 -53685 17624 -20051 -129101 3089 82953 -50733
236 -50733 18163 158382 6119 -77751 49365 1768 -72009 47478 41903 -62055 11430
247 11430 34215 -75510 -40694 20990 -48390 -36536 30071 -5252 11932 87047 41329 -11919
259 -11919 27414 14104 -39927 -23080 10533 13619 6168 -12665 -15701 -11409 -37439 -39998 -9459
272 -9459 -6822 6843 37290 24004 24684 49651 7534 -26430 7084 -10342 -42510 7008 17646
285 17646 -23895 3028 10499 -45361 -27219 6634 -27923 -3295 53589 24484 17491 56585
297 56585 16324 -20532 7155 -14408 -40313 633 599 -23993 8100 4711 -35588 -15142 -5732
310 -5732 -31672 226 31334 12016 30704 51167 12001 -143 9665 -22465 -27318 -2414 -15384
323 -15384 -11308 17346 -3565 -19748 3045 -11227 -27199 3264 12604 10138 35506 30329 11423
336 11423 22101 839 -34977 -14959 -8143 -33734 -10952 11791 -7100 -1073 4459 -22418 -7704
349 -7704 14279 -13649 2780 53218 28370 1677 30403 13823 -25731 -12555 -13856 -33016
361 -33016 -5643 5956 -17466 -338 17289 -10121 -15575 1069 -7228 -1026 26036 24121 12267
374 12267 22769 19531 -14235 -35549 -15321 2564 -19049 -26342 11843 17606 -12857 -2613 13848
387 13848 -2273 5461 9094 -17225 14289 54583 4605 -12930 36094 -8111 -67449 -11624
399 -11624 4105 -40861 10734 40849 -34667 -21658 42265 -11558 -30670 45709 21860 -32686
411 -32686 22970 30826 -22662 23495 45593 -44864 -48884 14093 -28341 -45035 45708 45530 -26760
424 -26760 -1395 18977 -38828 -13826 57230 14996 -21003 32602 6698 -56389 12163 53096
436 53096 -38501 -41382 26836 -36974 -70402 46788 64624 -14708 18403 22258 -65857 -14029
448 -14029 65713 -11912 -996 98325 -15692 -119630 23244 56740 -65014 550 65870
459 65870 -68858 -67430 59865 2181 -26803 98726 40234 -106927 -26991 41434 -25788
470 -25788 33371 87525 -38137 -49716 37170 -68888 -99687 113946 109403 -110471 -58759
481 -58759 85043 -19390 -58847 83348 66959 -32136 -5723 -37877 -84659 60389 116585
492 116585 -43354 -43615 47863 -75008 -113433 69042 65111 -34134 68689 37902 -163459
503 -163459 -38851 174678 13668 -91100 82930 44158 -132257 -43068 62393 29142
513 29142 72990 19572 -160737 -59009 115344 -35694 -70695 169353 93282 -166542 -64173
524 -64173 68591 -35260 25738 136390 -47399 -127848 46460 10987 -101716 62138 132818
535 132818 -50462 -85277 -21574 -55719 44681 158702 -14096 -91432 89462 5028 -202481
546 -202481 14207 228241 8055 -115011 17876 -31127 -91990 61515 67455 -39131 47718
557 47718 27687 -162326 -51836 158975 46787 -30873 63891 -50613 -144792 50980 75109
568 75109 -71916 70621 144576 -145321 -180717 97482 79716 -50563 60969 56167 -92141
579 -92141 -29674 25508 -50760 67530 158049 -76730 -157796 46753 22742 -84394 81537
590 81537 121036 -85376 -72301 27324 -78402 -31402 170398 62043 -116384 -3846 33384
601 33384 -88223 10057 125610 -2651 -41036 22531 -87863 -88509 126060 91107 -85375
612 -85375 7824 52844 -122969 -66418 126594 46526 -28955 60320 -28186 -135434 26840
623 26840 89689 -41449 14944 80844 -86390 -103658 65123 30839 -28571 82910 29317
634 29317 -125664 -23943 74399 -26998 10675 115735 -21615 -112903 13366 16164 -51121
645 -51121 61377 83307 -72552 -57878 36785 -36132 -30474 98690 35342 -78541 -184
656 -184 18414 -64854 20805 104172 -14855 -54478 24119 -33165 -65651 62668 63279 -43032
668 -43032 5740 30369 -78093 -34601 88821 20777 -38420 35965 350 -73995 13859 55165
680 55165 -22672 5423 40188 -60756 -61106 50810 22795 -30094 39456 23956 -65903 -16436
692 -16436 39642 -15791 4021 62482 -13842 -60755 19771 22417 -31879 18316 40568 -33177
704 -33177 -29228 18176 -14865 -9480 51565 9699 -47710 4519 18327 -35105 1180 50838
716 50838 -4544 -28177 12177 -10776 -29875 25530 23242 -27990 -200 21311 -26817 -14216
728 -14216 37702 8623 -17695 14384 653 -27893 12384 25499 -14386 -1067 21280 -20303
740 -20303 -26921 17431 7921 -15704 9834 9336 -20028 -2634 14853 -8145 -2617 19126 -5373
753 -5373 -19316 10001 10537 -10468 3648 12801 -9854 -10027 6250 -2581 -3509 13762 3697 -10858
767 -10858 4236 8461 -9276 -3175 12184 -902 -8751 2841 734 -6384 2637 1649 -9017 -1618
781 -1618 4811 -6519 -4298 9097 3691 -4084 2766 2390 -2896 2134 3515 -2799 1385 5908 -2019
796 -2019 -4590 2705 1814 -3499 -2045 349 292 1017 -50 -1187 1497 1560 -2692 -3053 541 987 -1531
813 -1531 -2119 1059 1709 -1517 -2294 646 767 -699 158 1931 2169 1875 1656 1155 1519 821 -1428 -277
831 -277 1226 -803 -1181 222 -754 -1719 -802 -1717 -2149 482 -257 -1493 833 1175 40 489 -139 -1488
849 -1488 1178 2194 -1730 -589 4507 1349 -3586 350 3586 -251 -940 895 147 914 2556 -1757
865 -1757 -1605 4100 379 -7132 -1378 4133 -3412 -3094 4425 -237 -5639 1317 1368 -4879 3054 6165
881 6165 -4511 -1526 6391 -2586 -2896 9751 1714 -8998 4237 5262 -10546 387 13110 -3632
895 -3632 -7985 6628 -3390 -10623 9145 7632 -10480 1200 7636 -12640 -6145 13455 -1230
908 -1230 -6624 10995 -4051 -19184 10372 16143 -13796 -1171 20675 -9054 -19579 11417 9577
921 9577 -4978 11450 3083 -21384 2370 15805 -15969 -4832 29090 -3575 -30418 4849
933 4849 9822 -12409 12423 16433 -23797 -8614 20997 -15075 -18874 35400 19190 -30355 -7667
946 -7667 10337 -12847 7617 25237 -14166 -8233 24772 -19521 -37560 34901 38454 -27693 -12757
959 -12757 16339 -19710 -11550 28240 -1435 -11315 28519 -10851 -55784 13567 48092 -14818
971 -14818 -12846 23597 -17008 -27463 20881 3742 -11256 41784 12779 -64663 -11378 51276
983 51276 -6580 -19048 36771 2139 -40419 2667 3089 -18598 41012 39246 -55155 -35320 40213
996 40213 -5840 -31323 41589 28984 -35854 -9882 -1604 -33774 26678 62587 -29388 -43262
1008 -43262 34313 -3860 -51051 30729 53778 -18294 -9677 4096 -46847 -4229 67399 -302
1020 -302 -39329 33764 6338 -69907 -634 57158 -1174 -2560 18918 -47105 -37795 51027 14416
1033 14416 -35048 40555 32019 -73117 -33304 49954 7289 -1210 42101 -20852 -58247 22087
1045 22087 19163 -34646 36070 60622 -49888 -53388 28124 -552 -12264 54960 12480 -57348
1057 -57348 1670 15548 -49162 12225 81063 -13350 -57525 14051 -5239 -37069 42022 45719
1069 45719 -32786 -4518 18027 -54773 -19548 76428 18473 -40495 18832 -1112 -60986 14340
1081 14340 58174 -15348 -5186 33757 -45811 -56154 49047 35120 -27496 23113 19479 -64459
1093 -64459 -21509 47353 -4537 -4531 50936 -17601 -69242 16321 31516 -25552 24709 47902 -45089
1106 -45089 -43099 31560 -3180 -17267 55976 21251 -58890 -9097 21488 -31834 8447 62772
1118 62772 -13904 -46413 16625 -6950 -38741 38939 46563 -34496 -15695 18431 -35782 -15343
1130 -15343 59077 12087 -35355 17032 1200 -52735 12124 54660 -11599 -13589 25170 -28723
1142 -28723 -39479 37564 25571 -23447 18809 18089 -50581 -17279 41424 -1154 -10668 32182
1154 32182 -11798 -48831 13831 23596 -22006 15789 36277 -34518 -35411 26275 4813 -14484
1166 -14484 32889 15445 -37316 -4147 16926 -21194 4897 42286 -11144 -33647 14034 1555
1178 1555 -24532 22164 28003 -24940 -10942 15515 -21132 -12430 37298 9551 -26148 6553
1190 6553 4775 -28374 4465 29176 -8351 -7863 16137 -15327 -22653 23765 15376 -17608 8305
1203 8305 13879 -25286 -8507 25772 314 -9165 16330 -3840 -26618 6370 13835 -12155 4319
1216 4319 17602 -15939 -16073 14099 769 -10629 15300 7913 -18744 -330 12124 -9288 -665
1229 -665 18713 -5320 -16357 7375 3281 -11088 8581 12756 -10045 -4591 7822 -7863 -5203
1242 -5203 15162 2452 -11692 4631 4822 -11935 -262 10237 -5069 -6245 5416 -4171 -7186
1255 -7186 9086 4910 -7679 3369 6659 -8255 -2956 9893 1275 -3181 6031 143 -7399 2572
1269 2572 3184 -6168 -444 5904 -4083 -4881 5055 1242 -3590 2709 974 -4850 606 3810 -3027
1284 -3027 -460 5384 -1281 -5384 913 986 -3370 402 2695 -658 477 3219 -366 -477 3200 420
1300 420 -2494 1751 2512 -1247 -321 1646 -1607 -2653 -1042 -1710 -2155 380 276 -879 1181 2085 -537
1317 -537 -772 1550 -41 -592 989 999 -26 1123 502 -1508 -1110 317 -815 -1271 678 1400 1002
1334 1002 726 671 179 449 -28 -1847 -327 1565 -367 -1775 5 88 -2250 -2159 -518 -886 163 1711
1352 1711 513 795 2705 1556 -1082 660 1334 -427 516 1120 -1260 183 2191 -2000 -3932 440
1368 440 642 -3071 -115 2797 429 1140 2114 -2156 -2230 3762 130 -5031 1128 4055 -2555 -2294 2151
1385 2151 -782 -615 2121 -2916 -3083 6150 3926 -4183 2756 7107 -2841 -4722 2474 -1188 -2158 5240
1401 5240 -787 -8436 2040 5521 -8213 -4962 7929 1469 -5893 949 972 366 7912 1146 -9525
1416 -9525 3513 8002 -10961 -7403 13881 4962 -9515 823 1974 -7628 2501 7570 -6747
1429 -6747 -811 12021 -4733 -11985 8494 8096 -6120 -197 -987 -11360 3094 9943 -10932 -3623
1443 -3623 19756 -3362 -24834 4969 17461 -5239 -1895 11292 -3677 -5464 7004 -5352
1455 -5352 -5235 17496 2713 -21914 -881 11909 -8292 -396 14904 -7813 -11358 11070 -5118
1468 -5118 -17118 20208 22963 -19720 -12618 14557 -4922 -12178 11841 5099 -6796 6232 -6458
1481 -6458 -20562 15061 24184 -16093 -9139 19393 -8384 -20366 18085 15365 -11128 7869 6412
1494 6412 -28730 -8043 25847 -2361 -13871 16033 714 -23907 2709 10953 -6520 12803
1506 12803 14833 -26290 -13170 26517 -747 -17488 24181 14439 -31804 -10461 14871 -8762
1518 -8762 2858 26644 -8497 -22981 11718 1075 -18904 18549 24434 -18910 -10117 11019
1530 11019 -15824 -6149 32150 1180 -27437 8759 4686 -30736 6022 36375 -6103 -14232
1542 -14232 12587 -12386 -20753 23579 17146 -14943 10092 10821 -32145 -9499 30048 -1722 -12460
1555 -12460 19078 -7177 -33764 10718 22389 -12754 7247 22833 -24481 -25357 20882 5924
1567 5924 -10765 24024 9326 -34154 -6304 16696 -13386 1302 30820 -8908 -28207 11490
1579 11490 4796 -16205 22011 25031 -25098 -13540 15372 -14174 -9641 33392 7543 -26537
1591 -26537 3158 1752 -27831 7682 32982 -10106 -13776 15680 -11684 -22269 23554 19078
1603 19078 -15457 5257 8136 -29259 -5323 31976 -1052 -13425 18284 -5349 -34339 7719
1615 7719 23166 -8688 5199 19164 -21128 -20508 20149 4537 -12720 19454 8750 -30039
1627 -30039 -5732 16712 -9775 410 24536 -11384 -26429 11831 6242 -15855 17680 25004
1639 25004 -18777 -14229 12451 -8417 -7184 24907 5226 -20390 4417 3953 -21845 5112 25796
1652 25796 -9729 -13840 11717 -7156 -16119 20063 15558 -15094 2157 8622 -21506 -7896 23259
1665 23259 2195 -10680 11305 -2149 -21751 5915 14866 -9254 2903 15696 -13778 -14019
1677 -14019 17360 6201 -10518 10616 6250 -20227 -4984 12203 -5984 -1696 15897 -6117
1689 -6117 -18234 6168 4143 -10444 9171 14547 -11282 -6582 10961 -4371 -6423 15056 3130
1702 3130 -14697 1431 5363 -10300 1860 14604 -5060 -8658 6311 -3694 -9412 10814 8860
1715 8860 -8137 1629 6733 -10843 -5251 11479 -451 -8351 5157 514 -10580 2957 8369
1728 8369 -4981 -620 6542 -5809 -5734 9383 3776 -4173 6321 3949 -9341 -2258 5982 -3957
1742 -3957 -2778 6525 -1668 -7369 2913 2591 -5220 1844 4886 -4559 -2498 5160 -840 -2128 6001
1757 6001 766 -6740 410 1957 -5286 -122 5655 -1342 -2924 3666 -13 -3246 2926 3092 -2291
1772 -2291 1261 3622 -1855 -560 3481 -1117 -4022 692 -1136 -4279 389 2733 -1462 -559 2187
1787 2187 -1083 -2092 2344 1170 -646 2063 2220 -807 227 1407 -1652 -1663 574 -1159 -2164 1279
1803 1279 1300 -721 513 1630 -789 -1019 845 188 -313 1122 822 -968 -130 -250 -1905 -1661 -503
1820 -503 -861 -587 1066 1162 439 1004 931 -344 476 1377 328 210 1533 881 -412 -249 -610 -1670 -1460
1839 -1460 -799 -855 -188 617 735 -18 372 -203 -85 457 -353 -271 1383 1701 -1078 -1233 933 -244 -2278
1858 -2278 -1087 754 441 207 917 1239 1232 966 -896 -767 967 73 -953 818 698 -1519 -245 171
1876 171 -3075 -2059 1706 255 -3033 1174 3694 -322 -1199 1361 1274 -229 -217 -1618 876 3416
1892 3416 -448 -3316 1581 1870 -4298 -2594 3184 363 -1406 2701 962 -2887 1495 3202 -2919
1907 -2919 -1882 2959 -594 -3184 633 694 -210 1751 -2609 -5276 3045 3693 -4511 -525 9031 609
1923 609 -6390 1804 3740 -2823 633 3136 -3016 -1277 3121 -3254 -2970 5045 268 -5828 635
1938 635 1126 -3994 3730 6225 -4718 -2214 6895 -3682 -9359 6268 7641 -5981 -2514 4402
1952 4402 -3283 -2677 4495 -1071 -1390 5977 -2109 -8395 5635 8125 -5237 -86 6380 -6757 -7321
1967 -7321 6475 843 -5785 7115 4048 -12380 -3503 8328 -2377 -2734 8205 -560 -7214 3929
1981 3929 1455 -5111 8094 7871 -11923 -5326 8612 -4081 -5970 12332 4231 -11155 376
1994 376 2847 -9376 2347 13705 -3821 -7180 6505 -2970 -9955 8609 7584 -8651 43
2007 43 4141 -12177 -3008 15284 225 -8271 7876 89 -14722 4017 13452 -3654 481 9242
2021 9242 -9477 -11398 9987 3890 -7591 7477 4677 -15811 -3586 11135 -3887 -1673 13116
2034 13116 -4007 -15498 5613 6043 -7787 7934 12805 -12124 -9867 7405 -4512 -5942 15653
2047 15653 5001 -14967 493 5402 -10659 2986 17412 -4327 -9988 6511 -3969 -11171
2059 -11171 12895 11603 -11242 -2397 5110 -13764 -5579 16946 2525 -8863 7219 -888 -17073
2072 -17073 4786 15540 -4966 -1511 10120 -9314 -12807 11290 6503 -6734 7737 4136 -18124
2085 -18124 -4326 13248 -2725 -2048 14230 -3440 -17485 4144 6782 -6977 7331 12480 -12390
2098 -12390 -10481 8471 -2794 -5855 14403 4661 -15315 -823 5441 -9202 4134 17388 -4587
2111 -4587 -11252 6269 -2395 -10540 11926 12456 -9570 -2770 5270 -11434 -5152 15183 2004 -8928
2125 -8928 5571 -528 -14427 4072 14215 -4626 -2423 7825 -8607 -11155 10792 6753 -6429
2138 -6429 5970 4440 -14601 -4107 11106 -1794 -2283 11088 -2570 -13885 4308 6709 -6023
2151 -6023 4725 9531 -9879 -8367 7037 -1513 -4715 10818 3299 -12809 -1528 4976 -6772
2164 -6772 1769 12618 -2916 -8471 5055 -1226 -7793 8611 9137 -7733 -2742 5381 -6639 -3723
2178 -3723 10915 1792 -7305 3216 167 -9810 3123 10141 -3639 -2577 5645 -5123 -8002 6815
2192 6815 4185 -5148 3166 3434 -9118 -2555 8031 -1158 -3201 6402 -713 -8147 2759 5270
2206 5270 -3156 2571 6096 -5876 -5027 5226 -330 -3714 5628 2611 -7693 -1070 3486 -3798
2220 -3798 -345 6239 -2230 -5049 3277 753 -4323 3923 4737 -4438 -1824 2912 -2623 -1742 5334
2235 5334 711 -4162 1880 1014 -4531 846 4861 -1349 -1532 2963 -1422 -3450 3003 1708 -3197
2250 -3197 787 1721 -4044 -1429 3796 -247 -2214 2320 -262 -3401 1162 2233 -1508 769 2786
2265 2786 -1843 -1697 2420 274 -1664 1730 842 -2400 97 1835 -1330 -474 2166 -551 -2190 1040
2281 1040 512 -1271 947 1444 -1474 -778 877 -1225 -1118 1433 2 -1555 446 1139 -1081 -50
2297 -50 1243 -515 -764 855 185 -431 909 606 -755 -195 48 -721 -497 661 -439 -400 766 22
2315 22 -1122 143 573 -571 -168 731 209 -288 260 241 -96 302 -29 -508 79 514 -94 -144 398 217
2335 217 -271 138 402 -100 102 343 -278 -153 390 -156 -841 -139 -300 -708 -225 -194 -127 297 460 -551
2355 -551 -583 991 301 -974 -67 1027 286 72 456 137 86 -22 -799 -420 862 347 -728 -18 528
2374 528 -525 -163 262 -352 -415 699 -452 -1290 764 987 -967 -840 785 -149 -527 156 10 469
2392 469 1717 74 -1218 912 1560 -1227 -348 1727 62 -1134 672 -321 -1159 1087 755 -1711
2408 -1711 -525 1367 -1108 -971 1662 568 -1044 400 -236 -1708 1709 1772 -1670 -354 2665 -1037
2424 -1037 -2803 1926 1774 -1183 386 843 -2104 -7 2323 -1010 -1034 2765 -506 -3506 1058 1775
2440 1775 -1999 879 1874 -2786 -1619 2461 -994 -1926 3635 1217 -3593 -113 2194 -1484 254
2455 254 3403 -1305 -2329 2320 -536 -2975 3282 3108 -3525 -1144 2441 -2520 -1509 4350 370
2470 370 -3431 1791 98 -5088 1354 4932 -2023 -1776 2934 -2389 -3299 4220 2657 -2914 2205 1899
2486 1899 -5356 -1003 5566 -344 -1402 4255 -1035 -6036 2202 3127 -3069 1894 4375 -5437 -4507
2501 -4507 4203 4 -2305 5316 1625 -7020 -503 2935 -3213 1069 6874 -2466 -5763 2683 -94
2516 -94 -3980 4984 5148 -5368 -1914 2983 -4141 -1833 8109 1580 -5528 1767 716 -6051 2346
2531 2346 7556 -2405 -2512 3419 -4140 -6075 6091 4126 -4233 1693 1777 -7800 -1723 7587 -121
2546 -121 -2062 5417 -1982 -8713 2767 5538 -2953 2134 5157 -6449 -5781 5316 562 -2573 6482
2561 6482 1763 -9307 -1376 4514 -3152 1075 8353 -2918 -7390 2790 193 -4634 5759 6197
2575 6197 -6459 -3505 3407 -3799 -1706 9038 2046 -6411 1453 685 -6747 2699 9223 -2643
2589 -2643 -3765 3558 -4289 -5823 6890 4929 -4467 1075 2147 -7919 -2088 7794 275 -2735
2603 -2735 4806 -2130 -8553 2853 5875 -2761 1538 4920 -6532 -5839 5637 1535 -2412 5621
2617 5621 1750 -8513 -1060 4758 -2769 802 7613 -2914 -7500 2207 1238 -3702 4803 5316 -5951
2632 -5951 -3410 3174 -3312 -1600 7792 1473 -6079 747 1009 -5624 2246 6988 -2241 -3075 3148
2647 3148 -3119 -4815 5859 4324 -4047 290 2131 -5865 -1677 6592 203 -2769 3161 -1646 -6823
2662 -6823 2163 5030 -2412 254 3742 -4496 -4264 4294 1484 -2071 3966 1366 -6307 -563 4340
2677 4340 -1829 404 5120 -2163 -5322 1870 1223 -2649 3438 3701 -4572 -2442 2649 -2022 -1511 4856
2693 4856 752 -4516 561 1125 -3420 1380 4478 -1756 -2497 2315 -1273 -2875 3835 2742 -2487
2708 -2487 71 1491 -3256 -854 4397 257 -2073 2200 -603 -3940 1650 2846 -1534 6 2289
2723 2289 -2617 -2479 2584 762 -1820 1745 935 -3689 -483 2345 -1096 -122 2735 -861 -2817 1388
2739 1388 1135 -1511 1525 1883 -2317 -1128 1591 -740 -1257 1997 422 -2515 341 1092 -1429 399
2755 399 1902 -957 -1184 1283 -216 -1360 1395 1028 -1287 -189 1172 -1026 -497 1528 -25 -1054
2771 -1054 780 358 -1317 454 1147 -909 -408 985 -626 -917 936 265 -843 383 376 -1090 -436
2788 -436 1061 -563 -335 764 -78 -920 295 288 -668 303 526 -595 -100 625 -21 -292 545 144 -592
2807 -592 261 545 -586 -111 315 -371 -401 506 -196 -511 93 274 -488 -209 295 -217 -447 84 29 -18 154
2828 154 162 -308 275 584 -99 -209 488 279 -102 232 -55 55 200 -104 -340 -157 381 -161 -371 422 270
2849 270 -349 -269 -33 -250 -413 18 -162 102 415 -134 -525 305 565 -145 115 -33 60 214 95 -65 -182
2870 -182 403 196 -657 -112 101 -91 -492 14 -248 -194 -42 -574 -271 504 162 -765 -26 566 -148 -122 162
2891 162 104 -177 435 -121 -598 353 497 -567 -276 783 -266 -324 415 102 -463 309 -116 -947 -6 730
2911 730 -703 -356 516 -166 -890 311 -8 -697 564 503 -868 -539 795 -217 -282 1256 372 -961
2929 -961 232 435 -1079 299 1420 -1044 -995 1020 -318 -1179 1256 777 -1292 -218 467 -1183 -425
2946 -425 1776 -136 -1035 844 -277 -1789 719 1394 -795 88 1188 -1479 -1310 1673 356 -1101
2962 -1101 1240 388 -2247 -253 1639 -644 -82 1814 -908 -2195 1069 476 -1282 1397 1477 -1919
2978 -1919 -1044 1614 -849 -585 2584 258 -2454 739 1140 -1854 584 2766 -1198 -1391 1604 -888
2994 -888 -1601 2467 1703 -2185 136 1170 -2235 -184 3065 -69 -1916 1490 -763 -3025 1408 2497
3010 2497 -1512 -121 1706 -2686 -2373 2802 745 -1376 2052 430 -3471 -247 2439 -1111 208
3025 208 3063 -1826 -3310 1758 1039 -1640 2210 2029 -3586 -1697 2109 -965 -826 3563 -35 -3775
3041 -3775 -99 888 -2344 1341 3514 -1690 -2728 1748 -1009 -2372 3202 2566 -3087 -197 1476
3056 1476 -2986 -184 4054 7 -2263 1609 -670 -3734 1872 3560 -1696 -556 1766 -2979 -2671
3071 -2671 3576 1169 -1898 2041 490 -4347 2 3377 -925 -48 3142 -2040 -3962 2290 1699
3086 1699 -1653 2030 2377 -4012 -2159 2585 -620 -525 3767 464 -4255 261 1136 -2172 1337 3784
3102 3784 -2220 -2920 1744 -916 -1994 3772 2531 -3129 -620 1163 -2611 -423 4550 203 -2581
3117 -2581 1218 -161 -3056 1832 3539 -1659 -681 1750 -2857 -2165 3515 1198 -1768 1319 488 -3711
3133 -3711 -395 3193 -631 -905 2532 -1503 -3555 1576 1751 -1465 1297 1803 -3172 -1506 2311 -267
3149 -267 -817 3047 260 -3495 256 1538 -1636 886 3033 -1998 -2427 1352 -423 -1549 2756 1713
3165 1713 -2482 -494 1080 -1924 -179 3103 162 -2465 1093 -119 -2293 1412 2683 -987 -749
3180 -749 1423 -1637 -1395 2557 1211 -1478 823 533 -2607 -79 2623 -796 -515 1505 -1276 -2327
3196 -2327 1221 1017 -1002 664 1378 -2107 -1000 1587 175 -507 1782 -64 -2193 300 1027 -673
3212 -673 627 1879 -1142 -1298 1080 -124 -973 1452 941 -1872 -198 797 -856 -329 1648 -82
3228 -82 -1444 498 -53 -1270 909 1363 -738 -430 749 -884 -832 1339 780 -948 474 593 -1298
3245 -1298 250 1158 -183 -466 904 -219 -1330 699 738 -832 82 598 -770 -787 742 51 -426
3262 -426 690 130 -851 174 685 -450 -26 510 -419 -697 512 365 -424 603 542 -760 -173 571
3280 571 -292 -137 467 110 -763 151 178 -723 -81 480 -419 -183 395 -408 -201 585 187 -380 92 201
3300 201 -180 3 508 -6 -113 331 83 -448 257 408 -188 -13 13 -312 -153 156 -211 -294 47 -119 -554
3321 -554 145 247 -9 -176 15 -19 -17 119 307 -121 -81 240 -297 12 40 416 -2 -48 -138 -270 174 181 -112
3344 -112 -35 438 -100 -279 -182 -25 -23 -357 -21 37 -319 -128 183 6 341 -146 13 326 172 -20 173 137
3366 137 -237 138 180 -17 114 121 -6 -93 53 231 41 -35 -4 23 233 68 41 -191 112 -139 -330 42 15
3389 15 -306 -138 374 -287 -204 223 224 17 175 186 -349 85 215 -213 143 297 36 -164 -54 -108 -190 103
3411 103 215 -474 -182 346 -354 -289 8 -264 -312 149 48 -600 9 524 -136 -85 569 -271 -314 409 695
3432 695 -404 330 126 -463 -143 394 -42 -284 678 -68 -1043 -114 232 -408 65 494 -400 -480 488 -110
3452 -110 -387 595 412 -740 87 372 -440 27 1069 -28 -536 509 -111 -693 608 709 -793 -103
3470 -103 373 -637 -356 920 -50 -605 312 -58 -1116 236 961 -458 -205 560 -476 -754 907 685
3488 685 -727 382 283 -991 -236 998 -54 -351 948 -64 -1277 361 724 -482 272 1149 -1006
3505 -1006 -952 647 79 -312 1094 419 -1494 -221 787 -949 29 1401 -548 -1087 454 119 -609
3522 -609 889 1463 -938 -524 642 -986 -381 1598 597 -714 500 123 -1290 292 1499 -647
3538 -647 -310 764 -871 -1318 1047 826 -705 477 796 -1583 -445 1535 -334 -501 1313 -285
3554 -285 -1655 387 1063 -733 353 1082 -1097 -1215 1231 146 -797 1518 497 -2089 33 890
3570 890 -776 113 1758 -546 -1457 590 218 -1040 1036 1162 -1244 -762 604 -667 -407 1967 361
3587 361 -1222 560 28 -1707 448 1805 -383 -721 862 -948 -1545 1276 1056 -1000 269 584
3603 584 -1746 -357 1772 100 -675 1104 -691 -1738 688 1259 -597 364 1222 -1324 -1089 942
3619 942 279 -667 1014 601 -1725 -112 854 -739 75 1887 -131 -1443 679 262 -910 1086 1024
3636 1024 -1248 -954 950 -786 -519 1772 278 -1169 162 375 -1223 481 1262 -756 -697 651
3652 651 -550 -1085 1120 600 -754 344 536 -1467 -379 1244 207 -169 616 -295 -1598 484 691
3669 691 -660 118 775 -1051 -697 912 418 -561 998 199 -1137 34 683 -596 38 1243 -459
3686 -459 -1112 273 2 -576 726 617 -742 -405 467 -321 -59 1037 169 -991 181 490 -735 218
3704 218 976 -334 -422 375 -578 -716 582 385 -630 140 362 -1069 -107 964 -36 -417 383 -195
3722 -195 -655 289 562 -463 -155 435 -481 -393 740 -86 -572 620 159 -581 -95 486 -526 -50 484
3741 484 -117 -465 422 181 -490 443 421 -365 -90 183 -61 -109 608 140 -577 -18 87 -174 58 475 -100
3762 -100 -369 206 -282 -232 204 128 -547 198 355 -325 -115 553 235 -71 231 -181 -457 190 375 -342 -165
3783 -165 210 -14 35 159 -35 -37 131 202 -271 50 83 -117 135 152 -53 -107 197 -8 -356 47 51 -288 52
3806 52 391 132 -77 325 131 -214 -118 242 55 220 -55 41 34 -60 89 -168 6 67 -5 197 117 19 -53 126
3830 126 -91 -54 99 231 -18 -192 156 -57 -43 225 81 -3 62 247 112 55 -99 44 71 -179 -86 -209
3852 -209 -57 60 4 32 -30 -196 5 -52 268 137 219 83 77 40 103 -205 99 19 -85 -56 167 -86 -144 -24
3876 -24 144 53 -80 -36 -205 -35 186 -302 73 110 -66 -48 -104 -88 -116 -199 6 142 -24 387 -61 -62 87 -192
3900 -192 -1 268 188 -42 -163 92 108 78 308 -28 154 29 46 -194 -107 -25 -204 -88 220 -272 -76 150
3922 150 223 -201 -40 13 -147 -2 27 82 -34 200 -9 -231 297 249 -269 172 286 -141 7 239 -75 -47
3944 -47 415 228 -303 -63 77 -620 -155 171 -98 -253 287 -17 -260 266 154 76 318 273 -318 -142 525
3965 525 42 -497 422 -81 21 111 301 -275 112 250 -354 -458 261 18 -247 357 312 -658 -48 174 -400
3986 -400 218 434 -256 -391 379 294 -414 447 490 -650 -118 621 -194 -151 556 206 -352 40 40 -784 284
4007 284 458 -245 -243 286 -163 -489 447 206 -612 130 165 -641 -224 597 -125 -36 255 22 -716 557 697
4028 697 -263 93 486 -524 -327 531 -245 -333 474 235 -818 -100 606 -279 -103 779 -263 -1020 168
4047 168 370 -686 545 480 -594 -94 560 -130 -279 860 220 -679 242 18 -777 565 647 -362 -342
4066 -342 279 -180 -587 373 594 -807 217 416 -739 12 924 149 -402 454 -40 -868 425 440 -374
4085 -374 48 497 -852 -582 765 87 -410 418 243 -882 -16 416 -184 116 716 -371 -838 241
4103 241 241 -621 563 378 -891 -343 573 -216 -239 734 182 -470 411 -53 -505 264 589 -466 -690 265
4123 265 -234 -461 691 414 -417 167 489 -419 -38 400 -84 -574 508 -113 -860 368 405 -258 129
4142 129 553 -601 -377 809 -8 -166 614 49 -837 -107 490 -353 71 978 -186 -910 525 305 -448
4161 -448 485 524 -509 -327 255 -281 -312 517 -46 -938 293 289 -687 264 580 -284 -446 447 -176 -551 343
4182 343 216 -393 146 342 -519 192 569 -111 -140 412 29 -822 583 292 -120 -288 42 -500 -461 389
4202 389 86 -829 362 38 -481 133 572 44 -8 415 -16 -419 358 -78 -459 600 49 -445 -192 530
4222 530 -67 -280 520 -44 -197 90 70 -419 59 401 -364 -401 264 73 -148 179 338 -265 248 119 -271
4243 -271 41 532 -29 -320 62 -196 -339 210 291 -98 104 117 -317 -206 319 -146 -259 -90 275 -537 -143
4264 -143 335 -132 167 65 -257 -299 184 161 -204 286 351 -408 -71 276 -47 10 229 89 -114 2 182
4285 182 -196 -103 163 -294 -201 -27 77 -69 97 -101 -110 -75 166 -258 10 -134 -137 -407 -58 -178 -317 -23
4307 -23 173 64 -123 144 -4 109 115 200 -127 -31 -86 -109 14 -4 -94 -104 119 -46 -276 220 156 -56 -30 108
4331 108 -8 -132 -122 -80 15 139 -35 -170 8 98 -319 -100 -134 15 16 95 -17 -123 -117 -189 137 18 216 -125
4355 -125 -139 69 178 -154 10 160 3 -157 219 -130 -270 -61 -47 -215 64 -61 -270 109 149 138 -92
4376 -92 102 28 146 314 319 -97 121 32 -43 -188 3 83 -27 -137 -143 25 140 -248 -75 -161 16 -202 29
4399 29 117 71 23 187 -22 26 -191 -35 -301 -201 104 -304 65 63 83 34 198 246 -117 -111 29 -113 -69 -114 -267
4424 -267 50 -9 -167 42 266 -30 -69 199 44 -229 -91 120 5 -38 429 -141 -217 121 228 -24 -171
4445 -171 162 187 82 234 -5 -420 233 -43 -114 -84 -108 27 -320 338 -87 -17 352 97 -150 228 338 -81
4467 -81 -121 53 -88 -151 390 59 -263 -241 316 -212 164 129 -225 -268 49 37 -167 293 -59 -128 153 150 -392
4490 -392 -168 159 -32 -213 159 312 -193 306 294 -145 12 397 -89 -263 129 -102 -163 258 -84 -312 -128
4511 -128 80 -352 -198 437 -126 -306 301 221 -147 133 343 -308 -115 307 79 -333 380 90 -370 70
4531 70 126 -301 -4 452 -230 -216 30 -21 -291 312 312 -408 163 412 -323 -94 581 -130 -237 69 30 -458
4553 -458 223 388 -257 -140 482 -157 -216 486 234 -447 767 91 -590 76 502 -139 55 615 -391 -484
4573 -484 283 301 -449 124 406 -564 -340 576 -240 -381 240 171 -235 168 442 -291 124 797 -98 -339 312
4594 312 29 -459 516 334 -566 -52 255 -733 -287 465 -91 -294 568 -35 -544 360 462 -242 -15 556
4614 556 -6 -272 523 100 -469 330 68 -457 -113 293 -271 -33 464 -248 -558 494 134 -507 229 254
4634 254 -601 -307 362 -91 -328 374 139 -663 231 241 -366 218 646 -227 -210 398 194 -430 409 307 -369
4655 -369 182 232 -189 -254 338 -169 -144 284 -55 -410 472 415 -648 -167 304 -372 -346 438 -145 -385 83
4676 83 162 -383 -108 420 -179 -193 352 -269 -381 384 91 -454 102 269 -277 -349 392 -102 -262 177 119 -160
4698 -160 121 383 -251 -193 534 -256 -301 199 -121 -250 156 471 -294 -284 191 -319 -322 394 41 -127 -199 -25
4720 -25 -218 39 333 -378 -400 347 -32 -96 423 160 -415 -73 -170 -91 185 295 -19 -229 -37 93 -278 322
4742 322 24 -334 52 238 72 -51 67 -97 -88 108 53 -162 -14 228 -55 125 208 -130 -7 150 -175
4763 -175 -572 153 87 -137 -39 -41 61 -53 96 -112 -134 28 88 -68 153 128 -62 -240 232 -252 -297 131 90
4786 90 -268 68 69 -95 47 244 -50 -75 375 -145 -83 216 -34 -201 -167 179 10 -293 181 115 43 158 -92
4809 -92 122 121 126 -90 -137 249 141 -111 -219 -83 -21 155 29 56 228 125 -16 -83 178 61 -343 -21 44
4832 44 -54 112 169 -112 -271 222 -38 -209 -19 220 -119 -10 183 -51 -24 277 12 177 -14 -85 54 34
4854 34 16 6 52 195 -48 27 186 -155 -195 -169 146 92 26 300 -127 -15 172 -256 -110 29 15 13 102 135 41
4879 41 240 228 -188 -10 -111 -42 -313 115 -207 -146 56 144 -162 27 -29 102 -51 -48 -172 77 124 -82 140
4902 140 -170 -135 -15 -190 81 124 35 -32 -78 75 47 -129 -77 32 -37 43 -3 -60 -53 -43 157 328 47 -255 -14
4927 -14 26 31 143 482 -181 -253 47 -131 -7 235 -150 -291 157 85 25 -43 -183 8 -55 -62 -58 169 161 29 -46
4952 -46 58 88 164 74 50 -322 -35 235 -148 -10 -52 3 -36 118 -75 -75 -155 152 -171 116 203 16 -40 44 61
4977 61 -153 17 14 42 -62 128 -262 -160 163 43 -236 50 -40 -370 26 258 -287 -227 164 -33 -277 110
4999 110 147 -304 140 222 -237 160 568 -33 -395 153 280 -358 188 67 -311 -144 263 -102 -405 202 65
5020 65 -131 175 -143 -302 -68 173 -206 -173 214 -67 -122 88 38 -108 -109 107 -379 -129 541 25 97 185 -152
5043 -152 -203 434 -95 -195 166 273 -52 -104 259 -140 -384 207 46 -354 -106 455 -401 -344 269 -200 -285
5064 -285 171 46 -63 280 444 -243 16 126 -282 -323 360 -143 -333 343 108 -235 246 471 -30 -141
5084 -141 313 14 -354 274 171 7 252 170 -72 -32 158 -7 -103 420 19 -185 -94 230 -227 124 315
5105 315 -323 -210 241 -116 -237 60 150 -724 20 211 -178 -58 184 23 -103 166 21 -295 42 150
5125 150 -430 -122 188 -79 -96 125 -82 -117 341 68 -413 21 148 17 -232 164 -273 -509 110 -96 -125
5146 -125 144 299 -273 14 431 -41 -61 230 -161 -276 64 151 -124 131 428 -246 -62 278 -15 -258 240
5167 240 363 -266 211 302 -202 112 359 35 -436 249 178 -154 80 329 -129 -131 209 -162 -53 91 -120
5188 -120 -304 237 50 -363 124 447 -66 -182 478 -280 -367 50 36 -203 183 190 -187 -108 216 40 -150 355
5210 355 49 -278 62 16 -59 122 39 -23 6 298 304 -281 -12 61 -158 -109 55 -162 -42 139 -118 -112 114 -89
5234 -89 -81 271 193 -67 -197 127 -73 -183 94 -53 -141 47 88 -419 -4 198 -338 -181 104 -52 -128 19
5256 19 265 -146 -36 43 -121 -231 125 184 -92 65 -70 14 273 35 -71 44 56 -96 -188 -120 -164 -139 -43
5279 -43 103 -284 -119 -9 34 -119 -73 -222 -482 -204 -64 68 156 251 -27 -114 196 -100 -82 -151 -81 63 -15
5302 -15 -106 -65 -17 -86 -19 24 162 -142 -158 -124 -22 71 18 -64 -101 -73 23 22 186 -36 93 50 112 132 -169 -200 276
5329 276 40 -15 -20 19 -11 76 171 63 -352 -187 -91 229 41 120 85 104 -91 -199 -35 127 170 -113 53 40
5353 40 169 -47 303 91 -151 -167 183 -246 118 112 249 395 188 89 -7 -125 17 16 56 -65 -158 -91 67 -285
5377 -285 219 -34 81 -60 194 6 -115 -101 -6 -338 -57 102 -80 92 -324 -104 13 -36 152 -72 -62
5398 -62 -113 -217 -44 95 -152 -287 16 -58 207 -123 -10 -51 46 77 47 121 -196 39 219 -75 93 261 86
5421 86 -10 -19 38 85 127 26 345 254 130 -157 9 -68 -97 55 117 133 -167 45 -387 244 -200 17 370 -12
5445 -12 91 -1 63 288 -282 127 -74 -6 327 -71 5 50 22 -81 -62 85 -79 -230 315 -50 -107 65 -169
5468 -169 -112 -57 88 72 166 151 -16 -56 -98 -185 -101 116 141 -234 47 90 -126 -37 -39 10 -57 -17 94 -136 3 -9
5494 -9 -342 -35 229 173 -161 114 179 -163 120 144 -129 -45 -15 37 -87 160 -32 -30 133 262 -80 -167 -128 -102
5518 -102 -111 110 101 167 185 2 -129 141 -130 -277 -202 252 74 -110 157 72 -43 268 96 -244 63 167 -158
5541 -158 -48 277 -42 17 115 108 -153 -10 37 -78 -190 208 107 58 37 111 -273 63 3 -265 -186 20 -529
5564 -529 -22 193 396 -102 -148 -195 157 -18 75 -48 -95 78 107 373 -30 -71 -127 -114 -134 -166 -73 245 -146 -375
5588 -375 271 -298 -99 172 269 -109 -123 155 -261 -133 136 105 -181 -170 257 -143 -37 187 -285 103 180 119
5610 119 -84 318 -243 -137 37 97 -86 -200 -23 -66 2 154 137 -1 90 113 -243 -80 44 -118 -21 60 74
5633 74 -139 -52 -29 88 100 101 10 199 176 -108 56 201 99 -248 163 120 -146 215 92 -302 -37 239 -56
5656 -56 -10 137 179 -22 50 -58 -201 -101 143 99 -61 147 -128 -240 199 -8 -215 -105 165 44 -109 190
5678 190 -155 -112 25 34 -198 -79 26 11 121 -94 -186 -207 92 -17 42 197 -10 152 0 -21 254 -86 159
5701 159 -123 -164 227 -66 57 -37 74 38 -41 -8 -249 -10 305 5 -79 -76 29 64 202 153 17 -162 -289
5724 -289 59 125 235 1 -67 48 203 -27 -34 101 -86 -163 -7 15 -76 22 56 9 47 -135 -227 23 121 103 46
5749 46 -25 -190 -5 162 150 -389 162 19 0 -351 18 76 194 -275 -169 -113 -175 129 -105 -211 87 -5 -240
5772 -240 -117 -43 21 -150 208 24 -166 23 23 -85 -67 -23 -72 118 265 -106 125 44 16 -141 214 17 -115
5795 -115 34 -96 -47 35 235 9 -3 -266 80 -58 18 18 -58 -51 37 -24 119 17 26 136 -86 -283 -175 115
5819 115 -53 123 -4 -32 -81 -238 -58 64 -111 196 79 -56 86 299 -25 -46 188 222 -19 -115 103 -356
5841 -356 53 117 27 -95 38 -10 11 131 -80 -4 228 251 112 -150 -19 158 56 127 66 22 -90 -37 121
5864 121 -7 171 -39 244 48 -136 -85 49 20 216 -88 -5 272 13 -206 299 -83 172 96 -122 -4
5885 -4 -97 28 19 -104 122 154 -36 83 102 111 201 -91 -7 122 194 72 43 -214 -178 -93 41 -29 -68 -186 -234 -14
5911 -14 -67 -35 -81 105 -49 94 128 -34 81 -280 101 161 135 75 -100 -120 -73 -21 -137 -173 59 -129 25 23 -69
5936 -69 -74 -64 162 67 50 -105 63 74 6 -83 60 51 -99 26 -217 -37 -204 157 54 -189 76 -100 -10 -98
5960 -98 -70 -79 -95 -103 -9 -233 -150 -96 57 103 52 -130 -241 390 40 -180 77 58 68 299 70 163 45 125 -110
5985 -110 -124 -79 42 -72 -80 -20 43 -37 -20 61 -70 -11 144 -198 45 87 97 7 99 -94 -117 12 -66 -48 13 -30
6011 -30 -102 125 75 -85 53 116 -78 -97 -21 -86 198 138 30 50 49 9 113 96 290 -43 -123 -157 -73 48 45 28
6037 28 15 187 -91 44 -173 -3 -50 -79 227 264 -170 19 68 38 -158 -55 113 33 51 92 -90 -31 -104 -168
6061 -168 35 133 -139 -136 36 71 51 -86 189 -124 32 -42 5 -152 168 11 -110 -7 -13 -113 81 179 135 79
6085 79 153 178 274 -88 64 -287 -35 -133 -183 65 105 -148 77 104 123 121 86 42 -15 -241 -210 -51 -228 14 -22
6110 -22 190 -104 -26 -268 191 -22 -344 -22 230 71 -96 364 148 -97 -9 191 -167 186 -134 -238 -130
6131 -130 52 -45 -114 210 -157 -139 -85 -107 144 44 251 76 -46 169 91 -226 118 20 -117 -6 -76 80 -234
6154 -234 96 33 -90 -91 1 -103 224 152 -207 -134 -42 -95 -137 67 -96 -78 252 172 -225 -171 -215 -82 -346 53
6178 53 -22 -255 121 -69 102 -12 196 -263 23 -31 -94 -159 18 -94 -170 52 172 -181 22 167 -26 -212
6200 -212 190 -131 -147 70 -92 -90 91 101 -8 -181 431 -66 -324 147 -52 -106 167 221 59 36 33 119 91 -91
6224 -91 13 -14 -66 -21 -253 -162 277 -55 14 150 125 105 54 146 3 196 155 100 39 75 70 99 177 154 -3 -111
6250 -111 29 -163 22 156 -223 30 64 -130 -39 330 -128 -173 -186 161 -41 -48 -16 102 -62 129 -81 -85 -107
6273 -107 -88 -89 -125 101 90 -34 -83 -107 -51 126 42 81 100 1 -181 -315 63 253 10 253 -48 135 -178 83
6297 83 -124 196 219 -241 -230 50 -15 147 93 -38 21 -155 -5 46 -16 75 106 -176 -176 83 8 46 1 -72 -24 226
6323 226 230 40 -80 244 56 -34 101 -41 -94 120 126 185 49 347 -79 -5 -29 -118 243 -194 -88 -210 97
6346 97 1 258 85 14 -130 -58 -13 -13 140 -67 93 61 -344 31 -8 -87 224 245 -222 42 248 139 53 48 -72
6371 -72 -116 68 -90 -94 -264 4 85 -148 46 -82 29 -161 199 75 40 47 -11 -300 48 -55 361 41 73
6394 73 78 -154 103 -52 2 -31 -65 -13 179 -88 182 84 -86 -134 -73 -186 -239 104 -25 -228 -58 106 -267 -68
6418 -68 -5 -281 -36 100 104 -151 -21 128 77 173 121 156 36 27 111 9 21 71 -110 -15 107 -116 -164 84 -32
6443 -32 -207 108 110 96 1 115 -224 30 42 -157 -95 56 77 125 -110 -26 -55 27 110 113 165 -17 132 20 49 16
6469 16 162 -7 -95 -357 13 253 -25 -110 -268 -86 272 -29 13 -106 27 -72 -502 -74 -144 -24 -277 -44
6491 -44 36 -190 40 -162 -117 54 84 -138 -81 -19 -268 -327 147 -85 -111 249 133 141 4 21 -172 252 11 69
6515 69 -148 174 -3 -101 -62 -65 -145 -29 58 -161 -295 -121 320 142 -87 -150 -122 57 160 -65 -20 60 116 -210
6539 -210 -35 -8 175 -90 145 139 -271 43 130 -18 122 172 -286 -192 349 -38 26 69 216 -181 -43 46 -114
6562 -114 41 210 -52 -100 193 -20 134 155 65 -188 114 81 -221 159 -51 -257 99 -51 291 -108 226
6583 226 67 -279 135 62 -26 -173 112 -9 -129 127 97 44 -63 50 -37 39 177 -312 -275 189 -94 -72 233
6606 233 -111 -36 -30 -68 -270 -148 151 151 -90 195 2 -125 151 63 -10 -76 68 162 -350 73 -57 -136 316 44
6630 44 -78 -190 132 -113 -238 185 28 -45 246 -34 -1 174 149 -79 43 121 -195 -62 311 -29 -114 -62
6652 -62 -32 -166 -88 -24 14 131 176 -69 -230 143 -31 -385 -112 -45 -378 -158 291 27 -250 246 55 -118
6674 -118 159 57 -211 -381 107 86 -223 170 313 -190 37 -64 -214 32 112 -266 104 179 -184 -117 129
6695 129 137 -207 226 -248 64 73 -268 68 -310 7 124 -144 205 191 41 -138 -1 170 53 -73 149 1
6717 1 244 118 -199 -110 -84 -32 -161 156 121 -197 90 236 -183 102 108 -50 -137 176 -71 -269 120 176 -153
6740 -153 286 38 -150 -180 168 24 -49 237 54 -88 20 53 -181 -66 41 -198 85 80 32 -134 107 -54
6762 -54 -71 168 63 13 -197 172 22 23 -9 -121 56 -16 -114 -52 -32 -145 -47 -189 -8 152 -18 274 244 -151
6786 -151 -91 53 -67 -86 -20 120 -86 273 10 -228 47 84 -54 97 -60 -79 -62 -198 -46 81 97 53 -4
6809 -4 -52 104 -234 -349 164 161 -238 -108 -41 -82 -30 -69 -38 -93 114 -1 184 164 135 -133 76 81 -46 70 32
6834 32 51 -175 -92 267 -13 107 -45 55 -10 -76 351 19 -23 -102 -97 144 20 -46 -145 29 157 -19 -174 -98
6858 -98 19 108 -22 6 -140 84 -27 -33 142 56 73 17 102 -130 -131 127 26 -32 275 -139 33 100 194 119 51
6883 51 -17 71 -9 -68 -97 27 -245 177 -114 -98 126 -11 -2 285 -176 92 72 91 -99 125 41 -17 199 49
6907 49 -62 -283 177 -20 -130 45 103 -25 -139 119 8 -69 172 -28 -221 342 -172 96 -108 -17 -247
6928 -247 -204 -2 57 210 -196 -77 -2 111 -98 -194 89 -257 -14 172 -208 -56 143 -55 -9 63 -39 -196
6950 -196 95 116 171 -268 -54 195 -97 -49 203 -44 113 51 76 170 -176 17 -167 -97 182 -6 -94 -17 312
6973 312 -86 -121 86 53 -70 -227 192 -35 182 236 -276 191 5 24 21 -46 -276 -122 82 -98 -181 90 176
6996 176 -162 0 416 -177 -126 -8 -46 -201 37 98 45 -162 -23 -308 -176 97 -85 -26 145 73 -91 113
7018 113 -164 106 -13 209 59 -123 217 -89 117 99 192 -259 89 129 -190 55 114 -66 -153 178 -289 -155
7040 -155 245 47 -333 77 228 -66 -224 103 77 100 253 151 -161 59 28 89 -117 140 -64 -276 63
7061 63 -82 22 19 -1 -40 -24 189 -212 -31 373 61 -124 258 219 36 92 11 -81 -31 365 -151 -53 188 -151
7085 -151 -148 -11 75 -289 -15 35 -152 -4 -46 -49 -81 313 145 228 124 23 -213 33 80 -26 -21 287 60 -75
7109 -75 56 -39 -154 -12 121 -144 -178 374 -4 -128 190 198 -195 -56 145 208 -60 289 -228 -17 114 75
7131 75 -37 152 223 -115 -252 268 84 -70 164 -181 -129 -194 258 -121 200 306 4 11 234 81 -278 20
7153 20 67 -234 190 59 132 175 95 -315 231 103 55 -29 103 276 -171 -96 70 -33 -169 147 -91 58 110
7176 110 199 -67 -126 140 -203 -27 248 259 -174 209 98 -170 -8 259 68 -137 108 -255 -100 -100 111 -352
7198 -352 -77 154 -96 -124 -47 -92 -116 369 -275 -108 218 -80 -6 -116 286 -136 -154 241 -38 -116 423 181
7220 181 -552 -11 274 -165 -34 282 -54 -385 91 61 -201 173 267 135 68 -44 -226 -146 -43 9 -45 325
7242 325 95 -146 -71 17 -72 171 29 -306 -160 -57 -261 -208 -54 -91 16 -375 472 25 -108 49 -150 -73
7264 -73 354 32 -228 -134 316 -255 -54 179 -97 -276 -70 -136 -154 96 427 148 -47 85 -56 -55 244 218
7286 218 -402 -20 125 -72 275 162 -97 -245 73 253 24 116 -229 -182 -20 -97 -324 39 -81 11 -36 195
7308 195 103 -244 -57 -60 98 -61 104 131 -94 -62 210 -24 -86 166 -144 -48 24 -24 38 132 -17 8 -64 98
7332 98 -214 20 155 60 -79 -110 91 -248 102 -54 -256 71 -20 57 49 88 -145 -300 -117 -184 39 -11 219
7355 219 -135 19 42 -146 -92 -80 80 -228 23 -39 -79 144 145 30 -207 41 -7 173 -85 -36 -76 -101 238 0
7379 0 -306 -148 -197 -39 143 3 -219 -32 -199 129 -361 115 109 -209 303 9 24 16 -9 -87 -24 40 -38 47 212
7404 212 -189 172 90 56 26 -61 111 183 -23 79 -101 32 51 -1 -225 141 -63 156 -45 43 39 106 180 70
7428 70 221 135 49 -115 164 128 -32 -17 2 72 -78 35 233 222 182 -207 -352 44 77 -84 -240 149 98 -144
7452 -144 182 -381 -129 -215 -59 -43 18 173 -263 -193 140 315 126 24 -2 -133 -215 -27 275 -10 22 229
7474 229 27 -75 -35 36 -22 473 -105 220 108 -34 -75 75 58 -196 133 -73 -158 162 113 -71 151 43
7496 43 -257 -207 30 -3 -124 5 26 35 13 -176 -106 52 114 238 -98 -109 58 -202 0 61 -114 179 114 -167
7520 -167 -10 24 -74 -182 82 227 113 143 -126 89 -245 10 -30 93 107 28 -186 158 6 -90 -113 239 -19
7543 -19 -164 18 -31 -94 28 77 33 -90 283 97 -86 36 142 -180 -9 121 -50 67 180 -205 -48 64
7565 64 75 -374 26 72 -68 135 308 35 -84 170 50 -265 -21 490 54 34 73 28 -13 171 -215 -166 -13
7588 -13 -86 -212 66 110 -192 96 202 -61 6 17 52 -385 -1 305 -175 -2 90 -129 30 -80 -82 -170 296
7611 296 -240 -64 -130 99 -25 -116 -87 -142 91 247 -204 -157 217 113 -195 -34 -72 -86 -156 63 -98 43 208
7634 208 15 -71 -127 265 96 -285 265 11 -184 109 87 -208 -19 -38 -246 -120 173 -165 -135 350 33 -336
7656 -336 116 -49 -188 159 364 -351 -143 106 -141 -103 278 53 -15 124 -86 -488 -42 181 -82 18 169
7677 169 -159 -143 0 307 -21 -173 280 -44 -39 308 204 -258 64 -6 -467 -16 353 -9 32 -7 -115 -160
7699 -160 175 -78 -103 96 401 -71 -58 344 -262 -140 66 -35 -340 75 167 -350 88 304 -239 25 414
7720 414 5 -237 -120 210 124 -5 141 65 -141 73 166 32 201 136 -367 -36 -28 -45 -47 134 115 23 -48 73
7744 73 -44 148 349 182 55 -128 -122 -162 188 -33 -32 81 -5 -140 58 180 -116 -82 301 -195 -249 -70 13
7767 13 -98 -39 42 -142 -33 -119 92 -20 -129 -182 -133 83 142 -91 269 -74 190 19 280 -116 -70 -9 123
7790 123 -243 124 60 131 -117 79 39 -141 301 82 -69 152 -67 -169 -20 121 -108 -174 70 -158 151
7811 151 196 -281 18 177 150 -103 -86 -74 145 56 -24 -56 -157 -105 102 -149 -74 -80 98 -101 -174 229 33 59
7835 59 -114 115 145 -148 -11 138 -233 -27 -146 -111 -46 280 70 140 -93 110 172 188 -45 176 -92 -4 -74
7858 -74 61 -15 -97 -75 -188 -81 34 230 -84 39 215 183 -111 220 -50 -21 -90 153 -516 44 3 -60 -72
7881 -72 22 95 130 -47 109 49 -257 -77 -119 -33 28 26 164 -185 -326 -50 188 101 -119 143 147 125 161 95 318
7906 318 3 9 40 -98 58 133 -7 38 74 193 24 98 -136 -83 31 -34 -201 71 199 -103 -194 19 31 -18
7930 -18 57 -60 54 35 -92 -85 297 202 2 126 -244 -126 -113 -62 48 -166 82 57 -6 -21 40 -52 -43 193 -87
7955 -87 -229 2 -205 -186 72 166 -341 -22 40 -223 -276 86 109 -26 -269 17 185 -133 -91 -31 104 105 -81
7978 -81 -167 125 -6 -138 -86 28 67 -61 296 -54 -329 -17 100 -130 -10 15 -191 -114 -18 97 -130 197
8000 197 135 4 54 -98 -296 247 266 -207 -116 -3 -47 37 122 179 -83 212 -12 -341 32 379 -62 -21 -47
8023 -47 31 -202 111 -2 -45 -51 113 -104 -118 -75 -59 -194 -44 200 -36 -38 66 -73 -195 303 -199 -241 -80 56
8047 56 -265 290 172 -177 -174 85 -184 134 -150 -73 -3 -9 66 -212 -215 -121 -44 -93 208 -287 -113 104 153 -6 296
8072 296 93 43 -305 183 371 -300 176 -47 -411 -44 171 -199 -101 278 -78 -73 229 44 -274 11 145
8093 145 -241 222 97 -118 -104 168 -140 89 231 -84 -329 14 172 78 -186 107 0 -149 -37 149 -148
8114 -148 63 51 -10 109 23 -172 -397 197 -157 -309 73 -129 -139 63 258 -76 -236 153 -27 -254 347
8135 347 269 63 -116 -50 -68 99 249 64 -104 245 -95 -100 -71 128 -70 5 54 -119 -61 -48 104 -234 10
8158 10 1 114 -17 215 -308 -45 176 0 204 -49 -35 -39 144 48 4 177 165 35 -180 43 -77 -14 67 -64
8182 -64 -309 -133 68 -131 -157 141 -91 -261 124
8191A24
$$ Imaginary data points
##PAGE= N=2
##DATA TABLE= (X++(I..I)), XYDATA
0 0 0 0 0 0 0 0 8 0 0 -8 8 -8 8 -16 16 -24 25 -36 40 -48 60 -72 84 -97 113 -132 156 -180 204 -231 266 -306
32 -306 344 -387 435 -489 550 -614 686 -763 848 -940 1044 -1153 1273 -1405 1551 -1710 1883
49 1883 -2071 2283 -2517 2776 -3067 3391 -3760 4185 -4676 5251 -5939 6774 -7817 9158
63 9158 -10948 13470 -17280 23670 -36310 70572 -351944 -960578 167011 464234 -146834
74 -146834 -113391 300129 7201 -335637 -276177 -112442 226310 594253 195194 -309882
84 -309882 -32889 86356 -284589 48989 409324 -141050 -202864 259092 -341928 -604086
94 -604086 561723 630705 -575666 -352678 398064 -128315 -319757 332164 336750 160124
104 160124 155043 -435043 -486898 403035 259933 -420762 139762 430152 -428178 -422618 283465
115 283465 82561 -99695 298388 28300 -428840 14836 353205 29400 10040 217565
125 217565 -23468 -277347 -197498 -99470 86163 310800 53784 -325740 -76795 181921
135 181921 -183583 -213388 375937 312410 -272047 -129783 202318 -31110 -3950 261727
145 261727 -51842 -254645 35659 -93532 -256456 210152 280785 -159476 -53789 59032
155 59032 -273160 -53135 349870 8877 -108823 272239 12995 -338506 76107 227486
165 227486 -134565 -59294 68438 -193719 -117689 159439 21273 -25202 166339 -14680
175 -14680 -229379 983 135509 7580 84070 172418 -35723 -144365 -9976 -10691 -88289
186 -88289 24258 68091 -98983 -97750 63093 11386 -41085 119770 72612 -144848 -33474
197 -33474 114272 -28753 11395 189414 12718 -135830 5669 -55150 -153470 69304 95954
208 95954 -110059 7347 107528 -97076 -42380 151235 -7246 -75973 100574 7168 -106211
219 -106211 95937 114007 -84171 -36890 23150 -110394 -92248 23212 -1301 20676 79586
230 79586 -12992 -51193 49519 35904 -41797 16420 75162 12952 -27875 16910 32491 -17185
242 -17185 -39040 -23663 -51783 -64832 3058 25989 -5962 40712 63459 -20688 -26566 27986
254 27986 -9893 -6921 58736 6623 -27510 48637 285 -89925 -9972 16146 -78815 -33312
266 -33312 46539 -1403 13141 68991 9150 -9359 39191 -12016 -37045 38605 26836 -20591
278 -20591 21017 12628 -47450 -28855 -21216 -54038 -20240 11615 -4366 23099 45980 14535
290 14535 13905 20649 -10747 -7398 11162 -3745 8023 23156 -8184 -14459 -4809 -38482 -41489
303 -41489 -6812 -12760 -4582 37479 29090 14391 35615 12360 -17944 3618 -2112 -20517 10537
316 10537 12524 -17143 984 -975 -43372 -28598 -6261 -26051 -3219 33258 19047 26789 43630
329 43630 7215 -4112 16610 -12719 -25004 13947 7278 -15434 6065 -71 -28532 -18573 -19606
342 -19606 -29680 3375 18632 3207 26659 43149 11299 -1771 4152 -7646 -11412 -10731 -12881
355 -12881 7971 11819 -15630 -10862 -1046 -25299 -20787 3695 -1618 15982 44359 18642 6658
368 6658 29522 1640 -23814 3174 -10749 -31033 12701 7737 -39519 2902 30625 -38188
380 -38188 -41504 17636 666 -13002 33207 33598 14814 32251 2532 -38031 2761 18884 -31749
393 -31749 -18918 27490 -4356 -32060 6747 11396 -20335 -3395 12131 -19307 -8446 45429
405 45429 33336 -2859 21869 17048 -45025 -35848 9192 -14733 -10570 36619 -8998 -51588 15941
418 15941 17832 -44519 16282 59658 -29745 -24128 58211 8259 -16387 64911 14346 -77339
430 -77339 -8050 9430 -65813 11892 82961 -29494 -50201 39112 -23151 -68911 52587 65350
442 65350 -29642 4750 30036 -42468 -582 66953 -18808 -41078 39435 -32561 -106702 33273
454 33273 96067 -23551 -17741 49730 -45628 -74616 53487 48654 -17832 58949 47114 -94946
466 -94946 -49617 65256 -874 -25220 43059 -35473 -84129 34749 13609 -61762 91564
477 91564 115703 -128692 -111571 104323 30411 -64143 86555 85140 -72538 -43746 -10940
488 -10940 -67060 46401 115127 -60870 -83114 59072 -20526 -81590 91785 90000 -64486
499 -64486 -321 25312 -126195 -19171 192605 34794 -128499 21226 35851 -128895 -50281
510 -50281 99683 52971 19232 -5003 -118452 -41834 136518 22218 -84708 100061 83773
521 83773 -169448 -83535 133426 34281 -22826 79734 -51299 -167363 29997 81397 -65657
532 -65657 40559 140361 -64615 -132092 13370 11749 28872 128044 -17967 -139226 51651
543 51651 53964 -154564 12215 229496 -19652 -192570 -578 33385 -48104 79056 100192
554 100192 -50936 -12862 17534 -125109 -36101 177977 61084 -86863 6049 -25848 -117522
565 -117522 47218 110683 -60176 -6942 98053 -115977 -164020 133635 153745 -61736 -12667
576 -12667 45607 -93604 -56963 71141 10439 31329 114592 -75273 -184023 47822 95278
587 95278 -66924 34487 116709 -91313 -109148 65879 3668 -27551 138708 45585 -168738
598 -168738 -43809 76091 -43379 4028 127353 -14015 -101447 1260 -39118 -59427 126639
609 126639 105937 -102544 -37858 66771 -72635 -54399 135974 59805 -79948 783 -9575
620 -9575 -101261 34659 123568 -29330 -44479 46167 -66129 -102759 80522 85236 -34386
631 -34386 29718 28378 -115725 -38529 104664 5670 -31716 75897 -16446 -126828 16667
642 16667 75220 -30827 24001 70753 -79534 -83354 62102 20434 -25544 84065 37106
653 37106 -104346 -27110 44636 -39191 6967 96133 -21829 -86899 17229 3079 -48774
664 -48774 54771 66328 -57830 -29877 35900 -41544 -22611 95669 32318 -65229 1410
675 1410 10546 -59277 10194 72839 -11053 -23858 27508 -39268 -57415 54453 46984 -38442
687 -38442 7689 28818 -54619 -22562 58273 4348 -22097 36173 -13620 -72264 15654 49618
699 49618 -23034 873 41184 -31841 -43213 27736 8995 -12059 43400 14997 -52476 -940
711 -940 35455 -23624 -8045 44993 -8311 -44283 8783 6926 -20598 23283 26288 -31605 -14982
724 -14982 20247 -16191 -14458 37182 14386 -25388 2633 6603 -22943 4731 26519 -12037
736 -12037 -12517 17914 -7341 -22704 19767 20425 -16390 -1600 12446 -15140 -6727 21351 947
749 947 -9894 13161 -3097 -25691 3811 14687 -12685 -4285 14201 -7362 -12723 10070 3435
762 3435 -6746 10051 4557 -13251 3444 13731 -5792 -2964 12814 -1395 -11980 1505 2736
775 2736 -4734 3210 3933 -5191 -483 5153 -4743 -4943 5812 2580 -5151 -584 2939 -1773 -958 1319
791 1319 -3366 -2890 2365 -1147 -4146 3217 6349 -854 -1947 3455 2267 -404 783 857 1201 3170
807 3170 -8 -3301 653 1858 -3806 -4160 816 264 -2237 -727 998 496 -389 -1285 -434 1259 329
824 329 -651 1369 1961 111 43 414 316 -380 -536 266 1106 1448 678 1108 570 156 -74 -566 -960 118
844 118 5 -1087 -1220 -723 -734 -329 -2493 -2796 1072 1421 -3359 -682 5331 1239 -2268 1563 1334 -615
862 -615 2022 603 -1326 4158 2763 -5933 -1133 6349 -1928 -4918 4291 708 -6418 1728 3618
877 3618 -4347 726 4776 -5844 -5293 5162 -1152 -4403 7092 1965 -9786 1494 6662 -6978
891 -6978 -1301 13090 -1067 -9313 6252 3101 -7628 7019 10166 -9848 -4093 8492 -7521
904 -7521 -7314 13757 3326 -11920 3854 -6 -17184 6114 19066 -11947 -9568 17638 -4616
917 -4616 -21899 11739 16767 -8667 1447 5000 -17652 -83 22029 -7342 -9922 24293 -125
930 -125 -32418 5130 22354 -8161 2974 15345 -20949 -15298 22049 -3766 -20381 26680 18143
943 18143 -36531 -15602 20135 -2784 -13 20841 -11829 -19238 18851 -5087 -30050 30944
955 30944 41903 -31946 -27763 21612 -4167 -13076 28191 7765 -21523 13259 -1260 -44851
967 -44851 13099 56173 -14109 -33484 17843 -4776 -28762 21605 19182 -16765 18261 10253
979 10253 -58961 -13849 63115 5491 -34467 23695 8523 -43556 984 26289 -8089 22203
991 22203 30987 -52401 -41382 49706 17237 -33899 26977 29214 -45388 -23748 17625 -10889
1003 -10889 17171 52058 -30409 -59818 28612 19170 -42137 22076 57119 -26591 -36459 9693
1015 9693 -19327 -2338 64196 5497 -56799 14478 21428 -53616 217 71562 1561 -32990
1027 -32990 7606 -26755 -31600 54691 32675 -43792 11227 30643 -64508 -35876 66887 23747
1039 23747 -25787 17588 -14346 -57498 22286 44678 -25221 11187 48786 -49062 -62238 41965
1051 41965 31390 -15995 32659 12073 -63658 -9858 38376 -23962 2142 70301 -15390 -76865
1063 -76865 10496 26327 -24858 28769 45236 -42083 -31506 22993 -26795 -17002 72960 21905
1075 21905 -63581 -4633 17095 -42063 11959 68848 -12192 -34499 22739 -23909 -47479 53457
1087 53457 53068 -38091 -7340 21368 -49919 -21685 62143 12032 -27036 26512 -11890 -67822
1099 -67822 17274 56243 -18363 -1480 37026 -41348 -51563 40450 24004 -21408 34000 19609
1111 19609 -63666 -18209 42763 -9255 -3079 51310 -13314 -60347 14137 21370 -25745 27842
1123 27842 46146 -41043 -37168 24422 -11224 -15600 53244 15887 -51812 -1861 15734 -37588
1135 -37588 7483 59424 -11514 -37088 17503 -9569 -33236 38708 37843 -31180 -4718 19292
1147 19292 -38081 -17276 52157 11820 -26246 16124 -4176 -46058 12736 39542 -16666 -2994
1159 -2994 29798 -29063 -39867 32026 22016 -20244 15007 13962 -39723 -11484 29443 -6557
1171 -6557 -4182 34123 -9717 -42289 11987 19127 -17171 14556 29769 -24810 -21889 20173 -5370
1184 -5370 -13891 32003 11756 -34719 -3021 14768 -19010 210 31097 -7876 -22103 10479
1196 10479 -5085 -19626 23378 22306 -20853 -4189 14910 -19370 -11765 28324 6405 -16850
1208 -16850 9330 2493 -23001 5515 21557 -9369 -4707 15261 -11210 -17596 17207 10289 -12071
1221 -12071 7208 7681 -20317 -6323 15814 -4414 -6156 15024 -3136 -19682 5516 9593 -9849
1234 -9849 3533 13852 -8711 -7705 10813 -378 -5616 12614 3502 -15193 525 8620 -8408
1247 -8408 -1707 12732 -2722 -9974 3852 -714 -7598 6972 6628 -8127 -430 7968 -6364 -5250
1261 -5250 8675 928 -8233 2145 1984 -6415 2553 6868 -3762 -1691 5890 -2423 -5195 5646
1275 5646 4746 -2857 2490 3171 -4376 -1238 3091 -3712 -3877 3324 -713 -5533 1465 3303 -2839 -1392
1291 -1392 2294 -1503 -1185 2726 723 -286 3338 1437 -3070 -416 1774 -2411 -1746 2316 472
1306 472 -970 1231 1097 -839 523 564 -1378 193 1970 -407 -428 1306 -155 -2315 -1320 -1151 -2339
1323 -2339 -820 401 -532 186 1989 730 -560 603 1493 708 518 1372 1427 1452 723 -1488 -951 305
1341 305 -1734 -2660 42 1372 -667 -448 921 190 -633 264 -992 -969 1634 1333 -995 -40 1113
1358 1113 -1644 -1860 -548 -1738 -477 2615 855 -1619 2522 3411 -1354 -745 2798 86 -1046 1740
1374 1740 -772 -1374 3135 227 -6029 -1685 2610 -3510 -3569 3223 2108 -217 2257 -1143 -3361 3969
1390 3969 3305 -5031 -314 6926 -1383 -5058 3175 1759 -3600 2096 127 -7607 2030 8627 -3544
1405 -3544 -3692 8991 2842 -8551 -1353 2738 -891 4018 1267 -8873 607 8037 -8729 -9677
1419 -9677 11520 5674 -12304 -1011 7770 -2600 2441 9490 -4771 -5258 9112 -2472 -11967
1432 -11967 8348 12164 -6838 -4746 1610 -7851 91 9978 -7418 -7027 16478 731 -22224
1445 -22224 5264 22512 -5988 -11356 7360 -2579 -9162 6888 1999 -5181 11783 3259 -22402
1458 -22402 -3492 17369 -2803 -4205 14914 -2074 -13332 9902 3106 -15296 12297 20071
1470 20071 -21760 -19589 17707 4293 -13417 8905 7520 -12829 -1737 -351 -13335 12934
1482 12934 26436 -13971 -17194 17181 -896 -21314 14208 19433 -14624 -3802 9259 -18898
1494 -18898 -6956 29477 2540 -21691 8112 6033 -21122 3394 21864 -2773 1065 9670
1506 9670 -23652 -17841 26309 7307 -22036 13758 16081 -30834 -14212 24168 1166 -5913 19269
1519 19269 -5936 -26125 12261 15544 -12956 11040 22405 -22414 -21699 14202 -2832 -7362 27292
1532 27292 4962 -32753 1013 14626 -21527 1260 36473 -5645 -26850 10052 1122 -16697
1544 -16697 20156 20103 -22272 -6936 11078 -22562 -9129 35874 6944 -21546 9592 414 -29724
1557 -29724 10044 32547 -9394 -5763 19124 -17656 -26793 23536 16154 -17307 7645 8355 -32769
1570 -32769 -8861 28199 -1539 -7186 22988 -7823 -33900 10378 19142 -11462 12522 23483
1582 23483 -25224 -22139 19328 -969 -12740 25737 9042 -32328 -2666 15638 -14717 4781
1594 4781 32853 -10430 -26664 11744 1009 -18321 21648 23604 -21241 -10052 8707 -21107
1606 -21107 -8370 33550 4108 -23045 10335 3646 -27621 7531 31711 -7825 -9459 14420
1618 14420 -14153 -19886 24174 15412 -16457 6428 8026 -29566 -9599 24902 -289 -6478 19163
1631 19163 -6983 -28759 10702 17016 -14207 6688 21738 -19594 -20633 16918 3578 -9613
1643 -9613 17138 5210 -26386 -2020 13403 -11450 4147 27671 -7051 -21898 9793 2161
1655 2161 -14728 15939 18558 -17384 -7461 11282 -13711 -9776 22875 3843 -19701 3852 4116
1668 4116 -16338 6465 21540 -7287 -6854 11620 -10508 -15908 17621 12715 -12594 3288 8518
1681 8518 -17876 -7124 16490 -934 -7048 11817 -1997 -17093 7561 12984 -8238 2201
1693 2201 11920 -12711 -12340 11621 2038 -7567 10791 4448 -17284 -2947 9041 -6849 -947
1706 -947 14750 -2091 -10599 7278 3265 -8019 8153 9494 -10551 -4209 7853 -5881 -4968
1719 -4968 12046 2032 -12091 1182 2690 -9255 1484 11272 -2382 -3149 6488 -3312 -7466
1732 -7466 7213 4273 -7593 1295 4871 -7783 -2733 8650 -877 -5152 4457 -109 -6931 3755
1746 3755 7399 -2201 1022 5727 -3838 -5097 3682 -390 -4065 3763 1515 -6604 -369 3508 -3953
1761 -3953 -2091 4623 -1143 -4474 3894 3121 -1676 2993 3565 -3369 -1835 2120 -2077 -1916 3640 703
1777 703 -3419 1140 1121 -3571 -63 3180 -1415 -1006 3178 536 -1012 2110 935 -2889 -1203 173
1793 173 -2592 -1034 1620 -84 -1116 1258 -88 -1644 510 1572 -265 969 2978 776 -179
1808 -179 1265 -334 -1744 -762 -322 -1622 -406 594 -156 -582 557 -474 -1164 383 321 120 1389
1825 1389 1381 415 357 448 -1002 -1558 -396 -254 -585 154 1392 405 114 386 -64 -136 601 771 215 1100
1845 1100 928 147 45 -864 -2055 -1180 -441 -1803 -1428 1227 1176 -1351 -257 1216 321 -908 623
1862 623 1330 1241 1023 185 -126 997 -260 -2167 -726 31 -907 -94 1629 -383 -735 2372 814 -3448
1880 -3448 -285 3039 -455 -1784 1574 1576 -852 -1456 -2046 -710 1296 -837 -3169 1757 3906 -2118
1896 -2118 -1661 4326 1339 -2675 1298 1599 -2289 1349 4045 -1859 -2474 2143 -1131 -4316 -248 1304
1912 1304 -64 1210 -563 -3490 2402 4249 -4693 -2807 6711 661 -7631 1256 6017 -1859 -1898
1927 -1898 2403 -3089 -3308 2957 -32 -1930 5654 3071 -5363 -217 3146 -2788 723 5408 -4041
1942 -4041 -4463 5842 -1020 -8840 4277 7678 -7769 -6364 4851 -414 -2512 5907 2065 -3284
1956 -3284 3183 -573 -8323 4039 9234 -4467 -3852 6399 -3623 -7599 6636 4137 -7044 2734
1970 2734 5059 -9753 -3396 12117 1537 -5777 4638 -429 -9319 1998 4978 -4159 4234 7018
1984 7018 -11029 -7799 9539 434 -7257 9040 6062 -11542 -1333 8425 -4197 521 12302
1997 12302 -4194 -12110 4983 2359 -7688 7064 9681 -9430 -5493 4943 -7431 -3870 14947
2010 14947 2651 -11625 3946 4150 -12250 2396 14884 -4247 -7239 6419 -5322 -10311 11429
2023 11429 8776 -9012 1236 5237 -13095 -4430 15284 1719 -5022 9427 -1859 -16279 4361
2036 4361 11495 -6934 1050 10256 -11256 -12460 10345 2986 -6978 10401 4942 -17246 -3130
2049 -3130 11434 -4305 386 16063 -3654 -15526 4501 2848 -8791 9624 12887 -12383 -7755
2062 -7755 8246 -6273 -5695 16495 4554 -14320 1522 3770 -12273 4016 18141 -4938 -10180
2075 -10180 6136 -5814 -12634 11507 11192 -8542 498 5075 -14617 -4604 17024 1919 -7031
2088 -7031 9372 -538 -16636 4646 13912 -5171 100 9471 -12077 -13128 10927 4879 -6399
2101 -6399 9598 4874 -17043 -4414 10459 -3843 262 14772 -4134 -15182 5440 4320 -8476
2114 -8476 7982 11854 -11793 -8545 7522 -4445 -4149 15314 4135 -13369 789 3796 -10483
2127 -10483 3497 16384 -3833 -8564 5558 -4748 -10728 10477 9798 -9157 -849 4836 -11428
2140 -11428 -4410 14744 2300 -6843 6305 -895 -13755 4149 12204 -4242 -563 8192 -8710
2153 -8710 -10690 8684 4211 -5823 7176 4343 -13099 -2676 9215 -2731 -1517 10535 -2894
2166 -2894 -11880 3925 4053 -6305 5570 8768 -9387 -7245 6083 -2145 -3960 10364 3708 -9595
2180 -9595 503 3684 -6811 2042 11094 -3265 -6534 4674 -1415 -7268 6703 6760 -6575 -1510
2194 -1510 3581 -7293 -3114 9694 1333 -5746 3802 438 -8174 1796 7344 -2428 -899 5170
2208 5170 -4818 -5700 5982 2779 -4463 3102 3541 -7106 -1754 6470 -825 -1188 5436 -1508 -6514
2223 -6514 2211 2875 -3836 1995 4861 -4627 -3997 3076 -923 -2835 4355 1391 -4917 672 2972
2238 2972 -3154 32 5321 -1161 -3535 2023 0 -3063 2957 3093 -3098 -363 2284 -3058 -1983
2253 -1983 3828 786 -2659 1565 1051 -2827 501 2676 -1738 -1280 1931 -1520 -2362 2343 1060 -2173
2269 -2173 842 1192 -2560 -783 2439 -24 -471 2387 504 -1822 852 1311 -1518 -227 1491 -1145
2285 -1145 -802 1095 -553 -1087 1149 208 -2223 17 1100 -889 -276 1620 -156 -1055 510 188
2301 188 -951 409 778 -586 -84 1027 -325 -455 648 -299 -430 547 543 -323 324 1042 -462 -676
2319 -676 535 -217 -711 -277 -28 -501 -7 35 -808 96 385 -229 -496 776 608 -425 327 744 132
2338 132 79 397 -176 -231 516 205 -774 7 423 -339 -186 -49 -334 356 480 -599 -42 852 437 -1459
2358 -1459 -290 725 -295 -609 -161 134 250 276 -44 -110 758 564 -325 38 1128 188 -110 683 -233
2377 -233 -351 582 -389 -1300 405 962 -825 -1010 723 -3 -1037 -65 -54 -166 604 -1 -1456 822
2395 822 1781 -901 -825 1303 61 -1458 512 872 -560 861 1063 -1415 -577 1610 -325 -1311 1350
2412 1350 860 -1520 -150 413 -1517 361 1815 -1944 -1403 1941 -338 -2453 1468 2327 -1450 -666
2428 -666 1020 -1246 -317 2839 -143 -1332 2017 213 -3367 659 2628 -1325 -463 1681 -2086 -1974
2444 -1974 2728 508 -2349 2299 1654 -3993 -1133 3217 -712 -1149 2703 -935 -3666 1875 1237 -2648
2460 -2648 2431 3790 -3497 -2140 3174 -317 -1551 4347 1254 -4190 752 1851 -3404 905 5197
2475 5197 -1966 -4027 2223 -789 -3761 3522 3518 -3698 -451 2200 -4388 -1573 6349 788 -3779 2305
2491 2305 29 -5574 1940 5356 -2376 -631 3492 -4063 -4761 5196 2747 -3117 2720 1973 -6751
2506 -6751 -1401 5205 -1421 -1068 5435 -2117 -7186 2152 2621 -3344 3086 5110 -5914 -4218 4270
2521 4270 -832 -2182 7064 1888 -7375 -500 3090 -4196 1488 7828 -2381 -5506 2808 -1314 -4847
2536 -4847 5846 5599 -5458 -1651 2863 -5339 -1992 8457 1424 -5341 2150 -228 -7534 2618
2550 2618 7979 -2412 -1780 4117 -4797 -5677 6686 3974 -3490 3291 2448 -8239 -1764 7309 -639
2565 -639 -1533 6004 -2695 -8808 2899 4364 -3446 3016 5693 -7138 -5751 4841 -265 -2084 7415
2580 7415 1988 -8868 -728 3877 -4033 1658 8756 -2628 -6724 2827 -291 -4911 6305 6216 -5773
2595 -5773 -2391 2973 -5093 -2086 8892 1412 -5776 1623 -17 -7353 2416 8032 -2801 -2181 3530
2610 3530 -4838 -5980 6418 4326 -3804 2237 1892 -7645 -1407 7230 -336 -1311 5272 -2142 -8314
2625 -8314 2358 4572 -2640 2317 4745 -5817 -5015 4627 52 -2426 6057 1668 -8109 -1036 3645
2640 3645 -3177 1032 6622 -2424 -5853 2576 12 -3709 5146 5231 -5213 -2549 2935 -3084 -1303
2655 -1303 6836 1432 -4588 1201 235 -5469 2277 6291 -2370 -2438 2777 -3093 -4219 4487 3192 -3191
2671 -3191 882 1309 -5638 -1181 5805 -217 -1948 3620 -1197 -5636 2096 3347 -2237 1463 3186
2686 3186 -4248 -3386 3901 501 -2029 3630 1125 -5063 -651 2818 -1888 334 4492 -2105 -4191
2701 -4191 1972 372 -2618 2533 3042 -3338 -1600 2303 -1818 -1112 4198 607 -3289 1147 716 -2849
2717 -2849 1317 3906 -1406 -1589 2076 -1296 -2597 2682 2029 -2309 471 1196 -2930 -751 2994 -196
2733 -196 -1497 1783 -583 -3034 1042 2122 -1531 419 1975 -1945 -1729 2364 301 -1217 1646
2748 1646 701 -2424 -248 1851 -944 -345 1760 -753 -2166 871 513 -1279 983 1461 -1783 -828
2764 -828 1295 -611 -913 1378 182 -1455 559 674 -1298 319 1503 -442 -832 902 -420 -660
2780 -660 826 868 -891 236 561 -908 -246 1082 -267 -807 577 50 -969 295 617 -687 -209
2797 -209 618 -478 -502 632 10 -448 375 462 -774 -129 696 -140 -240 384 -39 -339 197 6 -384 191
2817 191 247 -89 -444 436 55 -169 62 97 -466 129 161 -306 4 386 -313 -307 158 322 -203 -160 105 -92
2839 -92 348 372 -137 343 579 150 -395 248 440 -239 5 3 5 -162 -61 -187 -431 119 -71 -742 22 78
2861 78 -166 -324 200 -45 -108 38 -28 -95 203 87 -659 45 469 62 -91 266 310 11 225 -72 -267 447
2883 447 463 -306 -159 568 -208 -488 395 -166 -325 84 -312 -700 280 440 -456 -521 586 198 -432 472
2903 472 263 -349 44 20 -516 80 1013 -339 -515 588 106 -930 -40 601 -695 -47 245 -966 -547
2922 -547 673 2 -895 677 359 -1214 -174 564 -516 95 1307 -711 -821 1012 279 -1219 992
2939 992 1225 -1051 -375 639 -731 -665 1706 50 -1508 512 241 -1468 537 1554 -950 -738 1048
2956 1048 -953 -1383 1761 614 -1404 648 701 -1978 -163 2503 -170 -984 1472 -457 -2215 1198
2972 1198 1280 -965 369 1450 -2040 -1606 1928 222 -1160 1834 281 -2881 -136 1812 -1347 -223
2988 -223 2534 -1095 -2491 1484 376 -1480 1777 2002 -2402 -876 1547 -1173 -539 3260 522 -2453
3004 -2453 833 453 -2328 1477 3267 -1545 -1724 1494 -1374 -2161 2959 1789 -2341 76 1068 -3153
3020 -3153 -233 3557 -311 -1625 1739 -951 -3349 1771 2679 -1336 464 1936 -3338 -2100 3337
3035 3337 522 -1495 2561 363 -4165 -330 2607 -1220 123 2916 -1922 -3620 1553 846 -1809
3050 -1809 2433 2497 -3529 -1555 2081 -1457 -594 4071 282 -3681 445 836 -2647 1444 4166 -1902
3066 -1902 -2064 1749 -1825 -2076 3737 2488 -2705 -10 737 -3577 -357 4190 -204 -1734 1981 -1149
3082 -1149 -3946 2025 3236 -1627 104 2017 -3432 -2497 3689 1255 -1601 2379 215 -4435 71
3097 71 2844 -1117 183 3180 -1878 -4078 1903 1104 -1599 2501 2369 -3687 -1866 2323 -1146 -718
3113 -718 3976 287 -3973 176 1173 -2486 1410 3453 -1822 -2039 1342 -1106 -1888 3447 2166 -2769
3129 -2769 -342 1029 -2711 -189 3978 132 -2169 1408 -1138 -3397 1711 3021 -1521 -371 1425
3144 1425 -2632 -1996 2932 1065 -1412 1810 308 -3425 130 2585 -770 -92 2652 -1250 -2767
3159 -2767 1561 1166 -1419 1614 1661 -2516 -1495 1740 -608 -527 3012 110 -3033 174 1022 -1564
3175 -1564 843 2553 -1543 -1864 1424 -637 -1044 2619 1473 -1865 -721 844 -1647 -23 2898
3190 2898 -124 -1448 1131 -109 -2073 1160 1914 -1103 -313 1204 -1709 -1658 2146 515 -939 842
3206 842 337 -2335 -152 1648 -566 -221 1648 -1000 -1978 1288 1101 -799 929 993 -1600 -639 1339
3223 1339 -138 -644 1449 86 -1927 57 509 -883 415 1347 -887 -1335 643 -58 -997 1354
3239 1354 814 -1314 -135 625 -714 -190 1420 -103 -1111 703 -18 -834 504 918 -616 -389 977
3256 977 -628 -372 876 243 -893 200 383 -1151 -54 927 -245 -356 336 -340 -784 212 415 -304
3274 -304 268 452 -601 -316 910 -170 -136 508 244 -469 221 483 -161 0 551 -238 -436 74 131 -538
3294 -538 196 14 -406 3 572 -117 -72 422 31 -644 53 88 -559 212 384 -92 -306 150 18 15 423
3315 423 291 -308 76 66 -344 -205 208 -258 -363 323 -102 -369 -161 70 -200 -50 175 -125 -9 -54 324
3336 324 -125 47 233 -195 105 323 -266 213 111 -341 -328 296 -34 -204 18 128 192 -39 -23 -12 -128
3357 -128 -27 -160 -451 27 36 -180 7 45 -35 -72 60 -156 134 435 116 -167 304 515 10 -49 228 -24
3379 -24 -43 108 142 -50 198 9 -180 -310 286 -457 -266 57 -369 -404 354 142 -91 268 33 -258 -236 274
3401 274 -137 -84 19 185 -343 87 99 19 40 363 -260 -253 414 170 -360 195 69 -386 64 -39 -449 138
3423 138 290 -81 -168 -25 -81 -294 15 295 -279 -107 240 -274 -166 384 -244 -367 502 1 -790 -116 652
3444 652 -572 -136 559 -420 -881 494 65 -574 411 634 -767 -191 548 -172 -61 651 68 -908 394
3463 394 357 -563 534 711 -595 -272 681 103 -379 947 184 -974 -96 661 -835 142 1001 -437
3481 -437 -1044 524 36 -977 493 1020 -547 -242 597 -838 -269 1182 -51 -922 642 -127 -1398
3498 -1398 315 1271 -341 -176 771 -497 -1152 773 256 -823 477 613 -1392 -60 1205 -220
3514 -220 -412 1033 -299 -1507 355 691 -591 423 968 -1260 -655 1083 -113 -496 1231 609 -1304
3531 -1304 16 485 -1055 111 1635 -482 -1016 812 67 -1085 1248 1078 -1247 -305 643 -1128
3547 -1128 -431 1442 222 -1021 579 86 -1667 35 1348 -614 -407 983 -772 -995 1386 804
3563 804 -697 700 354 -2024 -319 1487 -351 -380 1441 -365 -1893 434 657 -1065 641 1524
3579 1524 -1548 -845 914 -398 -479 1623 513 -1704 51 782 -1003 49 1660 -633 -1280 729
3595 729 -145 -1072 1351 1404 -1281 -446 663 -1083 -747 1838 88 -1208 359 59 -1791 495 1407
3612 1407 -730 -649 546 -832 -1560 1122 631 -761 631 516 -1544 -357 1567 -131 -407 1309
3628 1309 -327 -1724 583 1185 -771 642 997 -1350 -1063 866 -51 -685 1473 429 -1581 -159
3644 -159 526 -740 276 1455 -383 -1231 662 -307 -1015 1224 1016 -1017 -190 546 -847 -225 1568
3661 1568 189 -1034 323 176 -1316 453 1365 -649 -395 641 -797 -1099 967 551 -737 240
3677 240 457 -1318 -339 1053 -179 -210 637 -130 -1107 353 725 -522 166 875 -725 -624 790 174
3695 174 -577 940 344 -1142 -36 534 -536 175 887 -462 -467 475 212 -676 641 353 -654 -278
3713 -278 407 -418 56 870 6 -534 280 109 -599 466 809 -322 -147 484 -526 -246 1113 238 -563
3732 -563 79 240 -806 136 591 11 -429 363 -133 -782 355 361 -468 45 456 -356 -264 570 -351 -184
3752 -184 392 -107 -434 -21 546 -432 73 523 -60 -555 -6 211 -424 64 443 -509 -338 222 -176 -247
3772 -247 335 -264 -665 82 132 -512 264 351 -290 -272 390 -91 -303 277 165 -350 -16 221 -162 58 105
3793 105 -217 -204 188 -233 -336 193 282 -390 -52 140 -229 -168 343 -48 -178 63 -4 -280 -5 172 -362
3814 -362 -268 182 -7 11 46 -44 -163 184 316 -388 -17 256 43 -64 133 -57 -140 -63 60 -235 277 208
3836 208 19 -1 -70 182 32 41 -47 -172 275 154 -65 -92 214 -44 16 -197 59 82 -73 114 -62 -78 -15
3859 -15 126 -49 27 -81 28 28 69 -27 7 192 -4 23 -13 162 8 -223 -26 129 0 130 -62 252 -34
3882 -34 3 -129 123 -11 111 143 -16 17 -94 62 -144 107 -52 -163 -302 -14 -15 -168 53 162 -237 149
3904 149 134 -188 28 86 459 -21 26 478 -213 125 210 170 -201 131 -32 107 186 -59 -269 122 206 -472
3926 -472 -82 148 -226 -286 73 184 -281 112 239 -122 151 -8 73 -270 185 -41 -62 360 199 -84 -41
3947 -41 130 -194 119 306 42 -252 96 154 -308 -33 319 -334 73 170 -170 -176 139 6 -274 211 105 -248
3969 -248 65 759 -472 -88 182 -235 -511 156 219 -274 379 220 -460 -172 596 -223 -44 477 34 -325
3989 -325 139 260 -412 410 408 -363 -152 314 71 -127 509 170 -594 156 368 -126 310 711 -247 -353 394
4010 394 -139 -611 612 353 -466 -115 615 -349 -284 676 249 -617 69 -74 -735 290 476 -217 -286 517
4030 517 -418 -768 551 268 -423 143 168 -745 -195 680 -281 -244 515 -86 -625 423 525 -304 463 566
4050 566 -515 -380 716 30 -391 654 -101 -821 192 294 -411 41 762 -480 -613 339 93 -427
4068 -427 622 446 -753 -125 408 -352 -174 900 12 -398 448 276 -600 356 578 -222 -386 454 -609
4087 -609 -477 659 365 -609 152 398 -871 -10 887 -274 -392 366 -239 -674 376 410 -292 250 613
4106 613 -644 -311 534 86 -336 268 205 -1123 70 425 -445 -7 533 -254 -863 205 199 -336 458 399
4126 399 -686 -195 517 -641 -591 572 90 -616 397 79 -713 303 798 -593 -130 698 -530 -527 481
4145 481 361 -643 319 136 -916 17 805 -257 -433 438 -167 -336 517 439 -375 148 440 -611 -396
4164 -396 748 -45 -462 771 -100 -731 165 448 -390 27 666 -497 -388 310 3 -482 398 407 -576 -289
4184 -289 351 -274 -33 720 -126 -559 59 234 -693 400 627 -458 -168 426 -279 -444 384 244 -321
4203 -321 91 534 -387 110 707 -193 -243 311 -84 -696 485 379 -432 -98 356 -153 -346 415 -4 -264
4223 -264 292 186 -517 144 204 -251 102 545 0 -393 351 36 -295 238 105 -260 148 261 -90 -51 385
4244 385 94 -205 395 -126 -264 240 149 -240 -182 395 -130 -136 566 262 -437 20 227 -373 127 238 -127
4265 -127 -356 285 -177 -251 301 24 -233 -68 160 -39 -63 398 19 -365 271 20 -126 -84 243 -163 -8
4286 -8 64 -98 -252 135 -125 177 3 -16 75 97 137 8 -85 231 -128 -10 308 65 -320 -138 118 -178 78
4309 78 132 -33 -150 -13 461 -167 132 190 57 -129 114 42 -290 88 -125 -164 -123 359 -179 35 -138 -90
4331 -90 -58 78 181 2 198 73 -45 19 159 100 -144 155 37 33 251 -6 14 -127 321 10 342 6
4353 6 88 -221 45 56 -105 -41 120 -181 52 -104 78 23 -28 80 -24 -72 -40 14 -126 -335 5 174 180 -131
4377 -131 -112 -196 36 -26 248 -176 239 -93 75 39 353 -280 132 26 41 5 -52 147 -229 136 -110 161
4399 161 11 4 122 25 -62 142 -16 142 59 231 56 -65 138 115 -323 199 123 -34 -39 83 149 -82 240
4422 240 -12 -344 -15 80 23 153 32 -3 -186 41 -145 31 95 -333 -35 -210 6 -175 17 -60 -155 -87
4444 -87 170 36 -37 299 167 -217 -18 208 70 108 100 -58 -278 228 141 -200 138 140 -295 -228 87 -470 -219
4467 -219 284 -73 -189 194 19 -432 69 199 94 113 312 -84 -160 173 51 -348 241 330 -95 -350 35
4488 35 -38 -120 218 288 -287 105 -76 -32 -12 141 178 13 268 -212 -335 201 149 -433 -33 202 -225 -148 404
4511 404 -173 -107 599 31 -521 204 174 -343 237 246 -457 -226 204 114 -197 304 304 -673 52 357 -142 12
4533 12 427 -254 -320 288 -54 -504 298 335 -187 -76 115 8 -155 646 104 -240 345 322 -310 -17 253
4554 253 -294 -509 289 -58 -416 377 236 -405 96 439 -551 -79 527 61 -274 186 -149 -639 -62 524
4574 524 -257 30 266 -306 -465 188 97 -275 344 222 -655 -139 387 -267 195 117 -351 -480 114 176 -199
4595 -199 64 429 -517 -93 421 -54 6 615 174 -517 245 252 -438 106 492 -179 -190 401 -39 -378 343
4616 343 343 -536 -128 223 -630 -479 442 -282 -405 348 -23 -349 297 556 -249 188 566 -312 -305 515 42
4637 42 -254 433 217 -539 -122 474 -148 -217 388 -223 -563 410 44 -357 358 325 -482 -463 428 -162 -12
4658 -12 404 -198 -532 126 82 -413 159 493 -298 -202 420 -166 -525 345 -24 -62 101 209 -657 43 442
4679 442 -1 -424 183 171 -432 165 350 -229 -51 35 -280 -469 467 13 -305 285 -21 -128 -45 175 4
4700 4 -150 260 -70 -196 301 -79 -185 196 116 -451 -74 305 -227 -260 173 322 -319 -45 192 -249 -123
4721 -123 344 -182 -217 202 -58 -107 390 16 -220 -113 146 -410 -169 373 -44 -232 234 -119 -294 227 150
4742 150 -3 -121 224 -193 -237 477 217 -15 -90 155 -317 -82 76 -222 -182 271 -28 -253 179 229 -101
4763 -101 79 61 -336 -53 176 -60 -124 196 -16 -357 -43 273 -362 -233 174 -170 -113 361 193 -59 80
4784 80 170 -283 -105 -106 -110 64 83 -131 -81 172 -30 -146 127 238 -137 -71 310 -63 218 -3 -87 -59 246 62
4808 62 -39 -110 23 -289 -229 97 -94 -225 213 -203 -282 -119 26 -99 -205 275 -164 206 -7 239 -7
4829 -7 123 177 14 71 -72 -211 -183 89 170 143 -148 220 -29 156 -135 8 -46 322 51 -92 112 -77 9
4852 9 145 125 -51 76 -151 4 -116 52 95 92 -134 195 154 33 219 -69 31 5 161 1 -55 -126 -51 46
4876 46 -141 -89 -38 -69 -327 9 271 103 -11 -90 -19 4 54 89 226 -93 -28 -32 -120 -17 123 -99 -183 265 -70
4901 -70 -61 61 -111 65 237 -100 -103 99 25 -60 157 -4 44 -247 -126 166 -287 257 -19 -136 -53 265 -231
4924 -231 -161 -90 6 -181 156 184 -39 -22 153 57 171 -117 -162 -207 172 31 -163 34 144 36 -89 -123 -152
4947 -152 -152 69 -72 -52 -34 62 -208 -65 127 -233 -180 -131 196 -227 234 73 -231 -201 210 -102 -72 118 38
4970 38 -338 43 8 -188 31 148 -130 -161 141 -369 -240 27 29 -149 184 119 -414 -11 332 -21 -163 3
4992 3 -234 -87 107 -42 -319 172 236 -260 -282 9 -115 -135 94 -72 -260 -36 376 -304 -68 96 -69 9
5014 9 -55 -142 -102 229 98 -350 66 349 -462 58 272 -97 -321 -13 -61 -354 -11 148 -227 -27 0 -377
5036 -377 -164 417 -177 -190 44 193 -372 106 253 -22 15 343 -227 -188 153 109 -3 319 -44 -360 273
5057 273 114 114 -116 165 -181 -257 157 361 -264 154 386 -238 -204 80 -35 -156 296 208 -193 -66 63 -343
5079 -343 170 350 25 -289 121 195 -535 35 106 -200 311 388 -415 -99 422 61 -67 190 -22 -274 34
5100 34 494 -418 -121 209 -358 -344 180 120 -202 357 355 -432 -25 272 -209 -131 72 -228 -370 -31 -199 -529
5122 -529 61 402 -87 -77 203 -117 -303 220 63 -363 195 104 -182 -211 280 -154 -381 9 69 -174 108
5143 108 119 -89 94 270 -211 -335 154 -123 -227 52 -65 -542 -185 272 -152 -26 280 -274 -399 52
5163 52 251 -267 29 103 -401 -209 336 -104 -229 289 102 -63 141 462 -117 -93 204 -35 -317 101 -214
5184 -214 -284 176 205 -348 9 1 -151 -144 394 -17 63 328 -116 -294 383 265 -105 -72 176 -27 -297 355 -40
5207 -40 -102 -3 142 -327 31 262 -195 -186 198 -149 -255 171 -35 -274 90 67 -343 -120 328 -61 -180 68
5229 68 109 -162 -28 -89 -210 -13 156 7 69 197 29 -40 58 141 -165 135 14 -67 286 58 -49 -412 -59
5252 -59 160 86 5 55 -280 -59 23 38 -60 234 226 -68 235 -62 -151 215 -122 145 164 -21 68 -180 219 0
5276 0 -105 63 87 -240 -74 259 -356 -6 -141 -303 -30 268 64 -16 -16 -52 164 -234 198 2 -105 -111 191
5299 191 -60 232 -6 -38 -54 63 -91 86 29 -178 168 3 -308 -58 -105 238 -31 -343 224 -188 -16
5320 -16 7 184 -142 -75 -136 89 -164 97 -110 -82 320 118 -56 -77 138 84 122 -30 -142 -279 345 64 -202
5343 -202 160 -282 -55 -169 142 141 -276 31 191 96 25 172 290 -35 42 89 41 270 -10 -140 89 -204
5365 -204 -188 93 -121 72 -242 234 34 -169 23 -124 29 313 -76 206 42 94 12 -147 -288 -100 1
5386 1 -178 -3 -99 53 272 -112 -14 128 -78 77 110 101 -165 -161 112 -56 -85 424 -220 -4 133 -121 53
5409 53 64 179 20 65 -22 -232 -305 36 -41 -127 144 -32 -283 48 -37 -46 119 52 -128 15 -42 73 -97 -93 188
5434 188 -69 62 26 -172 351 -192 -243 18 72 235 -54 -141 61 99 -30 -48 50 44 181 -140 -171 21 -81
5457 -81 -179 215 326 -20 -42 304 -99 -87 44 -1 -30 67 100 -30 233 113 183 46 159 56 -155 -59 -59 -131
5481 -131 -64 -35 117 -36 -38 -31 -108 1 -97 -28 131 411 -78 -236 -7 283 -391 239 -107 -81 -110 164 -203 -111
5505 -111 84 51 50 117 33 -129 145 49 193 -78 250 260 135 -35 32 277 326 116 -114 106 -29 -317 -155
5528 -155 270 39 -107 112 411 7 97 182 -179 207 138 -87 88 -32 19 150 81 230 -326 104 86 -39
5550 -39 -22 422 131 -38 198 -114 -128 -45 318 -70 94 98 -20 -288 -228 199 -232 -144 231 -37 1 308 -234
5573 -234 -117 190 -438 -325 234 295 -89 249 52 -33 -9 169 -13 71 -56 -28 39 78 -93 -93 207 -56 -116
5596 -116 -122 24 137 150 91 132 -89 -73 199 215 -272 194 -198 -1 176 97 -182 -12 213 -64 -55 114 -49
5619 -49 -98 226 175 38 -73 -170 -437 122 178 145 128 101 22 -378 -101 -95 -161 77 -90 -234 78 170 -16 4 330
5644 330 -140 -109 119 336 -232 133 93 -113 1 77 37 -128 93 202 23 36 -73 -47 -139 168 107 17 173
5667 173 -95 -20 73 86 18 1 95 -268 205 222 -170 -131 -77 270 -59 34 84 242 -78 76 6 -77 -295 -51
5691 -51 -188 254 93 -289 88 188 118 -257 -72 126 18 -29 192 -244 50 158 -52 -63 172 186 -148 -60
5713 -60 85 12 60 209 78 -83 4 -129 -160 135 -36 -57 -74 133 114 52 -82 -45 -253 -52 -89 -65 -14 302
5737 302 -95 -39 119 -166 -62 -72 55 -20 177 -46 126 -25 250 -67 -90 -157 93 -89 -6 -142 -112 -9
5759 -9 -5 124 -171 220 -83 123 208 88 183 3 126 -118 289 94 -55 80 133 -140 -207 -127 176 -156 -99
5782 -99 41 -164 44 142 -126 -98 -304 9 -61 268 139 -28 -48 39 -75 187 33 -148 -10 250 92 -180
5804 -180 -202 66 -22 23 27 -17 -145 131 -196 64 -72 7 -31 -17 130 164 365 -136 -268 44 -203 -129 -295 -29
5828 -29 51 145 231 -6 19 -26 36 231 80 13 -191 -258 -21 106 -52 61 40 100 -9 132 -127 -48 -140 103
5852 103 117 -40 192 48 41 210 77 21 128 10 -239 61 -128 -92 -95 -193 26 -53 25 -19 -119 -263 49 21
5876 21 -165 219 -86 253 8 -171 -24 -8 31 -21 -6 145 27 -85 124 -94 23 32 222 -66 147 81 360
5899 360 -36 -42 121 78 -6 102 -11 -90 117 32 255 114 -144 -105 -54 -295 -85 -62 215 -57 129 -112 125
5922 125 203 -176 106 174 1 -63 -52 -166 107 -46 84 35 -209 -9 -86 -43 -41 124 112 -158 64 -30 -65 82
5946 82 -224 85 68 -224 -116 -67 -61 98 -149 119 88 -14 -98 182 142 -65 455 -21 -5 -52 -85 -82 85 118 -100
5971 -100 -56 72 -17 173 -113 26 -19 -168 -64 212 10 141 13 -38 84 80 -27 -141 335 -71 164 39
5993 39 -99 25 -240 -22 -136 161 -18 7 -217 249 78 29 34 204 116 259 -97 -327 112 -104 -84 -125 83
6016 83 -56 58 207 -8 -60 -29 286 28 -220 66 30 13 110 117 -198 153 -43 286 -90 -159 -58 -158 472
6039 472 -153 -149 237 -280 -199 21 -81 143 -127 98 2 -26 65 96 109 -71 86 -92 202 145 -251 112 175
6062 175 -125 46 -158 187 -91 121 -71 -141 122 123 75 31 -104 -38 37 397 58 -238 117 -145 125 -161
6084 -161 13 127 -141 -116 185 20 71 77 -100 48 -33 15 -146 12 105 59 17 -62 -144 26 -14 -168 -111 60
6108 60 160 -270 -24 -35 98 -68 -8 -281 -249 48 -5 43 211 4 -177 -169 -7 -124 78 77 -30 -129 67 252
6132 252 -230 39 -159 -85 -9 105 -20 -44 191 -33 1 111 -64 -211 102 71 -27 -46 76 -27 70 113 -61
6155 -61 -2 -90 215 -33 -13 135 -98 -189 -47 -43 -314 -79 238 36 130 71 -107 -12 -81 -201 18 -21 60 -147
6179 -147 -90 176 32 -205 -10 -19 178 171 31 44 105 290 -75 138 -5 0 -300 -140 -41 -151 180 90 50 295
6203 295 187 -69 -250 -268 -18 8 91 131 -36 -18 109 -88 -58 38 218 -15 85 -103 1 128 177 -102 -29
6226 -29 162 40 -115 31 33 -10 189 26 -231 -169 -11 146 -109 21 66 -228 150 101 -121 -93 7 -101 46
6249 46 185 31 -24 104 -247 -133 55 138 -12 -49 147 152 105 -92 7 -89 12 -175 198 66 245 -71 -81
6272 -81 -19 -246 207 16 45 -167 68 154 96 193 167 18 -128 112 -166 109 314 -146 -96 -259 17 289 -114
6295 -114 -79 139 132 165 -7 200 -16 -25 136 -237 -14 65 63 -75 161 -127 50 98 66 -29 168 87 -259 151
6319 151 -112 18 -4 128 -82 -131 -103 46 95 -95 127 167 55 54 -60 119 -125 137 -71 92 161 130 -95
6342 -95 -178 -137 -52 -127 -74 54 97 -69 -102 160 -96 -281 -61 -5 41 28 -189 -192 -19 198 123 13 -2 130 58
6367 58 34 -191 -108 2 -100 -73 -34 100 159 5 116 -79 -79 -26 -22 -85 44 -97 265 218 181 98 5 32 -139 -120
6393 -120 30 99 141 100 154 14 -444 190 -64 -26 -91 356 45 -200 -16 -79 -95 -11 293 -127 -37 -131 32 -14
6417 -14 -62 -107 137 -118 9 27 46 -86 39 254 111 109 126 -12 -61 -14 80 -202 5 77 -160 3 -78 173
6441 173 -166 -250 165 -11 83 51 -5 -131 99 18 70 -71 -26 -212 -115 36 -115 -114 226 53 111 175 92 -144
6465 -144 304 -87 97 -35 -25 55 8 -51 90 -222 -25 335 10 -59 202 -168 -84 43 -304 5 -366 147
6487 147 100 -8 27 -62 20 -191 154 -124 -99 201 22 51 -48 171 -64 207 40 -215 -19 212 -238 -47
6509 -47 -39 7 -107 -115 -119 -95 94 -25 -115 39 -33 -199 11 77 -52 58 48 108 36 181 118 -117 41 319 -225
6534 -225 -251 165 81 -174 -114 134 -224 -100 82 82 -70 45 106 -14 -77 223 -20 -111 33 -69 -132 256 112
6557 112 250 113 146 -418 79 265 162 -12 196 48 -383 204 -76 -78 90 -83 -135 -32 18 -57 -104 -34 309
6580 309 16 -15 5 -75 29 156 -116 245 329 -43 -209 459 118 -169 106 177 -225 -26 128 -33 -128 146
6602 146 90 47 162 44 93 143 148 -370 -104 171 -101 90 258 82 -92 294 320 -23 -138 76 269 -37
6624 -37 -123 81 -281 51 54 -224 -99 173 -355 202 230 -178 -70 99 249 -382 32 58 -254 -210 108 45 86
6647 86 53 26 69 93 143 -255 -31 194 12 -197 -6 75 -134 208 127 -189 268 278 -164 -287 154 -34 -268
6670 -268 177 -63 -291 213 367 -181 -138 266 251 -306 -12 282 -7 142 177 -202 8 303 -46 -305 219
6691 219 67 -300 -29 -5 53 218 187 -57 -26 235 -42 -99 -32 -53 -190 -239 -120 -277 65 98 -191 -9 162
6714 162 -87 -20 151 196 -43 54 145 -231 -128 187 107 -94 -6 103 -178 9 48 -75 87 105 73 -353 60
6737 60 -267 -216 -102 113 21 -87 147 -227 -218 137 106 -62 157 77 -276 -157 82 66 -184 72 141 53 -37 22
6761 22 -17 -26 -165 -312 69 -237 -19 38 51 111 -19 282 166 -140 29 -110 -32 -77 149 -7 -335 62 97
6784 97 -19 47 141 -123 -8 27 -27 -277 53 -24 -10 61 225 -324 66 182 90 -37 217 84 -230 -65 -84
6807 -84 -108 -51 -23 58 -8 173 -21 -88 22 -98 -190 343 29 102 -32 80 -39 -55 198 -32 187 -81 78
6830 78 167 -184 99 -9 -113 -103 -176 -370 19 145 -101 110 131 71 -173 -31 -5 -31 282 205 -64 -219 -196
6853 -196 -224 -160 128 146 42 -40 -26 232 -123 26 49 132 -126 -91 290 165 -55 27 2 208 -226 -155 -88 45
6877 45 116 127 -53 -80 121 -74 -11 -187 130 -50 -89 7 206 12 142 74 -151 42 -53 69 -186 -22 140
6900 140 -106 283 29 -92 -37 -13 -6 -176 -84 -52 -139 -30 267 -3 96 145 0 147 146 -19 -111 -135 -104 131 83
6925 83 -112 -59 109 39 -74 -197 28 -65 -3 17 -109 -26 96 60 -342 102 45 -68 -189 1 -293 -63 -1
6948 -1 111 -143 -19 108 -137 35 73 -100 -175 185 204 -49 17 0 -182 74 61 -238 -66 -63 -124 -92 -26 -272
6972 -272 -53 -243 138 -9 20 126 -148 -59 173 66 -184 76 -267 -48 -64 -1 -136 -139 136 95 -89 -37 -136
6995 -136 28 20 104 -106 -14 157 129 -121 260 202 174 -140 199 -80 -186 199 -301 -91 55 123 -194 113 10
7018 10 4 -175 275 36 -73 122 69 92 -226 -262 22 21 65 -37 8 347 -145 -11 188 -161 -10 231 203 -338
7042 -338 -14 159 -173 -241 -202 -33 -26 306 81 -361 27 -37 -315 -112 157 42 -79 158 79 -224 336 312
7064 312 -198 -310 58 -95 74 127 -44 -474 112 143 -442 351 111 -17 -99 140 -53 -135 84 118 -58 64
7086 64 67 44 58 186 -10 -357 -105 183 -310 196 83 -62 16 -29 1 -35 6 -246 92 78 76 -327 40 364
7110 364 -367 79 199 -44 -518 80 56 -243 33 -20 -6 13 187 -333 -122 -58 270 -234 112 178 -127 282
7132 282 282 55 -190 319 -226 -92 227 131 -349 -71 98 -149 136 105 -101 -187 163 58 -199 65 225 -125
7154 -125 229 7 20 -212 11 253 -270 166 -51 -90 62 242 -151 -113 218 36 60 237 -27 90 104 -8
7176 -8 -282 -278 211 -58 86 32 191 -57 134 -2 -108 -164 319 70 -17 213 -139 -90 74 72 -162 -101 73 28
7200 28 18 43 -145 -256 190 -235 -430 204 -53 -16 198 126 -319 86 204 -75 -67 -20 153 -32 -6 232 -154
7223 -154 81 191 80 -395 309 211 44 328 285 -276 -122 186 67 -33 -152 10 -125 222 50 -306 207
7244 207 -139 -473 55 -71 -25 -90 230 183 -21 106 30 -295 -100 140 -237 -459 141 -71 -190 -121 -17 -9
7266 -9 -269 352 -200 -66 313 47 -209 -109 19 225 235 209 162 -43 125 164 114 24 125 -262 -13 -86 -11
7289 -11 66 141 -98 -170 -1 -154 -130 217 34 -229 -99 -35 -252 -232 -77 -75 -26 118 -50 -138 40 201 124 80
7313 80 36 -42 105 125 161 164 -98 -52 -78 21 75 125 54 114 17 10 48 225 -95 -120 -40 -39 24 121 -173 24 304 28
7341 28 -340 -16 284 -211 -273 -59 65 -139 -6 224 146 -147 145 113 92 72 -53 -191 286 -240 89 -53
7363 -53 -258 -113 -100 -110 -134 -59 165 -47 16 -114 184 -79 -64 12 -47 -9 78 34 -166 120 87 270 185 100 11
7388 11 -158 28 -214 26 -66 -145 -223 -79 -296 -34 -18 -4 -108 37 -76 -31 -201 -19 169 -145 -6 64 190
7411 190 20 -19 -27 -200 194 130 71 -65 36 -339 -7 43 -162 -14 -52 21 -49 -46 83 -231 8 142 143 86 -11
7436 -11 44 -245 52 90 90 299 -104 -58 -60 -5 -128 39 -228 -302 -22 -41 63 -103 -20 -17 28 -226 -52 26 -88
7461 -88 16 -209 38 -216 163 -246 -107 191 117 -254 142 -42 -214 23 -64 -83 45 -19 160 30 109 302
7483 302 40 -83 -39 -231 -24 27 -189 -3 19 -160 -23 -85 -69 0 10 -183 -307 73 -20 107 -14 -70 -34
7506 -34 30 219 -24 167 40 199 -28 -335 132 -51 -120 -50 -131 -192 -16 202 -49 -107 182 -11 -276 1
7528 1 45 -523 121 40 -124 212 254 -16 -128 -58 23 -113 23 146 -128 129 83 291 -204 167 -20 57 210
7551 210 -14 39 82 138 -85 157 -214 -60 -71 395 -32 29 -2 257 -63 184 -92 136 38 123 85 -39 66
7574 66 -125 -183 105 247 -78 31 -4 -42 -304 236 -82 -117 7 17 -198 151 107 111 187 122 -51 -202 126 98
7598 98 -371 20 392 55 86 -81 28 178 10 -258 -183 107 230 -277 215 210 -147 -193 104 109 -46 169 -174
7621 -174 -99 -122 60 -44 -113 180 144 -129 379 145 -146 33 150 -253 -76 239 -198 -16 25 -13 -309 27
7643 27 440 50 -8 43 74 92 189 -73 -139 92 99 -147 171 133 49 -13 141 -38 -416 173 -29 47 59 246 65
7668 65 155 136 172 -150 -18 173 -446 83 111 -191 -152 74 140 -279 339 -32 129 345 -92 -29 23 225 -74
7691 -74 76 512 98 -9 347 -133 -237 -78 175 -242 45 81 -117 -241 129 125 -238 148 45 -153 -75 159
7713 159 -260 99 186 48 -328 -80 74 32 271 235 -358 44 148 93 54 83 277 -226 65 213 -73 -6
7735 -6 241 -105 -227 -12 -48 -196 113 -109 -223 245 153 -160 14 179 25 -181 75 -241 -295 -134 261 -63
7757 -63 -55 38 -85 177 -167 -47 -236 43 237 -144 39 237 -248 -121 165 44 18 189 -99 -21 217 -167
7779 -167 165 87 -7 33 -229 74 -99 -33 -253 -142 -343 -142 219 7 -244 32 -86 -111 253 140 -135 84
7801 84 -7 -37 -176 272 -6 -18 214 339 112 142 72 -144 14 95 128 88 166 -7 -111 12 227 33 261
7824 261 39 -204 -86 100 37 -98 -228 185 -131 161 -24 -163 -100 71 80 327 136 -99 -142 133 9 -60
7846 -60 -244 -165 32 43 -18 -64 111 132 -80 -111 -122 54 100 -200 -9 -88 -113 172 163 -206 185 -143 -93 -156 163
7871 163 46 -422 -149 -63 22 -291 73 13 65 175 146 -26 133 100 -77 60 210 45 -49 161 141 73 -30
7894 -30 -30 -20 50 68 -90 139 -29 -91 91 148 138 -6 82 163 -13 90 -64 -85 -8 295 -8 -137 45 84 -168
7919 -168 -66 -196 -124 -15 183 -79 -150 191 -22 -142 -172 -128 -2 -59 40 -119 -41 81 -73 -33 218 48 -39
7942 -39 37 309 357 -178 -180 -53 210 53 44 -216 34 27 -142 -239 112 57 -114 -22 -9 -23 349 83 -87 160 -95
7967 -95 79 -31 157 -98 118 336 87 -78 -22 61 -178 -118 342 76 -312 114 109 -262 81 44 -227 38
7989 38 75 -53 92 217 211 -166 -27 -179 82 -208 58 -253 -88 115 -321 0 294 -85 112 156 -35 229
8011 229 127 391 -284 -213 187 74 -188 145 131 -137 89 350 -157 -85 281 132 104 141 -26 28 281 130
8033 130 42 -162 -22 -160 -88 232 304 -74 -137 7 -143 -79 -145 39 -146 40 7 32 280 214 -196 -102 161
8056 161 27 80 381 -33 -6 61 -341 -65 193 135 -237 37 173 -119 -44 66 34 -73 112 144 -243 142
8078 142 46 -73 -80 44 -133 -176 310 120 86 160 -14 -289 -146 223 1 -92 61 297 -185 398 -106 187
8100 187 163 72 -158 -169 391 -4 35 103 -109 -266 153 191 -89 -318 59 -4 -3 375 -34 139 106 -120 -238
8123 -238 72 199 -157 -216 214 -93 -256 -26 7 251 -36 -106 -271 72 273 -325 -68 288 300 38 175
8144 175 15 -75 -26 23 -77 -303 -128 -206 -91 217 -86 -264 162 241 -240 -4 195 13 -99 -45 -121 -197 127
8167 127 -82 -315 -5 167 45 -13 -1 -114 -257 216 21 13 271 -230 -77 -14 193 -90 -343 -42 31 -491
8189 -491 276 -124
8191a24
##END NTUPLES=NMR FID
##END=
