##TITLE=1H_SR10P-2
 CDCl3
 8 sc, 
 10.02.2022
##JCAMPDX= 6.0         $$ Bruker NMR JCAMP-DX V2.0
##DATA TYPE= NMR FID
##DATA CLASS= NTUPLES
##ORIGIN= UXNMR, Bruker Analytische Messtechnik GmbH
##OWNER= root
$$ XWIN-NMR		Version 3.5
$$ Thu Feb 10 11:46:15 2022 Russian Standard Time (UT+4h)  she@DPX200
##.OBSERVE FREQUENCY= 200.131346
##.OBSERVE NUCLEUS= ^1H
##.DELAY= (6, 6)
##.ACQUISITION MODE= SIMULTANEOUS
##.ACQUISITION SCHEME= undefined
##.AVERAGES= 8
##.DIGITISER RES= 18
##SPECTROMETER/DATA SYSTEM= spect
##.PULSE SEQUENCE= zg30
##.SOLVENT NAME= CDCl3
##.SHIFT REFERENCE= (INTERNAL, CDCl3, 0, 15.7039)
##AUDIT TRAIL= $$ (NUMBER, WHEN, WHO, WHERE, WHAT)
$$ ##TITLE= Audit trail, XWIN-NMR		Version 3.5
$$ ##JCAMPDX= 5.01
$$ ##ORIGIN= Bruker BioSpin GmbH
$$ ##OWNER= she
$$ F:/spectra/data/she/nmr/H-F/1/audita.txt
$$ ##AUDIT TRAIL=  $$ (NUMBER, WHEN, WHO, WHERE, WHAT)
(   1,<2022-02-10 11:42:52.35 +0400>,<she>,<DPX200>,
      <created by zg, POWCHK disabled, PULCHK disabled
       configuration hash MD5:
       00 E9 B6 7A A2 85 ED C7 34 08 36 98 17 FE 4E 26
       data hash MD5: 16K
       A8 86 F4 3E 34 EB 10 22 AB C4 B6 DD 7F 49 88 5E>)
$$ ##END=
$$ 
$$ hash MD5
$$ 81 AA 66 0D 44 12 5E 66 84 48 64 09 72 6E 4D 37
##$RELAX= 
##$RELAX= 
##$RELAX= 
##$RELAX= 
##$RELAX= 
##$RELAX= 
$$ Bruker specific parameters
$$ --------------------------
##$DU= <F:/spectra>
##$EXPNO= 1
##$NAME= <H-F>
##$PROCNO= 1
##$TYPE= <nmr>
##$USER= <she>
##$AMP= (0..31)
100 100 100 100 100 100 100 100 100 100 100 100 100 100 100 100 100 100 
100 100 100 100 100 100 100 100 100 100 100 100 100 100 
##$AQSEQ= 0
##$AQ_mod= 1
##$AUNM= <au_zg>
##$AUTOPOS= <>
##$BF1= 200.13
##$BF2= 200.13
##$BF3= 200.13
##$BF4= 200.13
##$BF5= 200.13
##$BF6= 200.13
##$BF7= 200.13
##$BF8= 200.13
##$BYTORDA= 1
##$CFDGTYP= 0
##$CFRGTYP= 5
##$CHEMSTR= <none>
##$CNST= (0..31)
1 1 145 1 1 1 1 1 1 1 1 1 1 1 1 1 1 1 1 1 1 1 1 1 1 1 1 1 1 1 1 1 
##$CPDPRG= <>
##$CPDPRG1= <>
##$CPDPRG2= <>
##$CPDPRG3= <>
##$CPDPRG4= <mlev>
##$CPDPRG5= <mlev>
##$CPDPRG6= <mlev>
##$CPDPRG7= <mlev>
##$CPDPRG8= <mlev>
##$CPDPRGB= <>
##$CPDPRGT= <>
##$D= (0..31)
0 1.2 0 0 0 0 0 0 0 0.06 0 0.03 0 0 0 0 0.0002 0 0 0 0 0 0 0 0 0 0 0 0 
0 0 0 
##$DATE= 1644478971
##$DBL= (0..7)
120 120 120 120 120 120 120 120 
##$DBP= (0..7)
150 150 150 150 150 150 150 150 
##$DBP07= 0
##$DBPNAM0= <>
##$DBPNAM1= <>
##$DBPNAM2= <>
##$DBPNAM3= <>
##$DBPNAM4= <>
##$DBPNAM5= <>
##$DBPNAM6= <>
##$DBPNAM7= <>
##$DBPOAL= (0..7)
0.5 0.5 0.5 0.5 0.5 0.5 0.5 0.5 
##$DBPOFFS= (0..7)
0 0 0 0 0 0 0 0 
##$DE= 6
##$DECBNUC= <off>
##$DECIM= 32
##$DECNUC= <off>
##$DECSTAT= 4
##$DIGMOD= 1
##$DIGTYP= 9
##$DL= (0..7)
0 120 120 120 120 120 120 120 
##$DP= (0..7)
150 150 150 150 150 150 150 150 
##$DP07= 0
##$DPNAME0= <>
##$DPNAME1= <>
##$DPNAME2= <>
##$DPNAME3= <>
##$DPNAME4= <>
##$DPNAME5= <>
##$DPNAME6= <>
##$DPNAME7= <>
##$DPOAL= (0..7)
0.5 0.5 0.5 0.5 0.5 0.5 0.5 0.5 
##$DPOFFS= (0..7)
0 0 0 0 0 0 0 0 
##$DQDMODE= 0
##$DR= 18
##$DS= 0
##$DSLIST= <SSSSSSSSSSSSSSS>
$$ [...]
##$SUBNAM2= <"">
##$SUBNAM3= <"">
##$SUBNAM4= <"">
##$SUBNAM5= <"">
##$SUBNAM6= <"">
##$SUBNAM7= <"">
##$SUBNAM8= <"">
##$SUBNAM9= <"">
##$SW= 18.0517287032376
##$SWIBOX= (0..15)
0 0 2 0 0 0 0 0 0 0 0 0 0 0 0 0 
##$SW_h= 3612.71676300578
##$TD= 16384
##$TD0= 1
##$TE= 0
##$TE2= 300
##$TE3= 300
##$TEG= 300
##$TL= (0..7)
0 120 120 120 120 120 120 120 
##$TP= (0..7)
150 150 150 150 150 150 150 150 
##$TP07= 0
##$TPNAME0= <>
##$TPNAME1= <>
##$TPNAME2= <>
##$TPNAME3= <>
##$TPNAME4= <>
##$TPNAME5= <>
##$TPNAME6= <>
##$TPNAME7= <>
##$TPOAL= (0..7)
0.5 0.5 0.5 0.5 0.5 0.5 0.5 0.5 
##$TPOFFS= (0..7)
0 0 0 0 0 0 0 0 
##$TUNHIN= 0
##$TUNHOUT= 0
##$TUNXOUT= 0
##$USERA1= <user>
##$USERA2= <user>
##$USERA3= <user>
##$USERA4= <user>
##$USERA5= <user>
##$V9= 5
##$VALIST= <valist>
##$VCLIST= <CCCCCCCCCCCCCCC>
##$VD= 0
##$VDLIST= <DDDDDDDDDDDDDDD>
##$VPLIST= <PPPPPPPPPPPPPPP>
##$VTLIST= <TTTTTTTTTTTTTTT>
##$WBST= 1024
##$WBSW= 4
##$XGAIN= (0..3)
0 0 0 0 
##$XL= 0
##$YL= 0
##$YMAX_a= 839052
##$YMIN_a= -883535
##$ZGOPTNS= <>
##$ZL1= 120
##$ZL2= 120
##$ZL3= 120
##$ZL4= 120
##$ABSF1= 10
##$ABSF2= 0
##$ABSG= 5
##$ABSL= 3
##$ALPHA= 0
##$AQORDER= 0
##$ASSFAC= 0
##$ASSFACI= 0
##$ASSFACX= 0
##$ASSWID= 0
##$AUNMP= <proc_1d>
##$AZFE= 0.1
##$AZFW= 0.1
##$BCFW= 1
##$BC_mod= 2
##$BYTORDP= 1
##$COROFFS= 0
##$CY= 11.3945322036743
##$DATMOD= 1
##$DC= 2
##$DFILT= <>
##$DTYPP= 0
##$F1P= 2.36226072786647
##$F2P= -0.459571619588291
##$FCOR= 0.5
##$FTSIZE= 0
##$FT_mod= 4
##$GAMMA= 1
##$GB= 0.15
##$INTBC= 1
##$INTSCL= 1
##$ISEN= 128
##$LB= 0.24
##$LEV0= 0
##$LPBIN= 0
##$MAXI= 10000
##$MC2= 0
##$MEAN= 0
##$ME_mod= 0
##$MI= 1.114404
##$NCOEF= 0
##$NC_proc= 0
##$NLEV= 6
##$NOISF1= 3.799351
##$NOISF2= 2.8
##$NSP= 1
##$NTH_PI= 0
##$NZP= 0
##$OFFSET= 15.70392
##$PC= 1
##$PHC0= -16389.8
##$PHC1= 11.80078
##$PH_mod= 1
##$PKNL= yes
##$PPARMOD= 0
##$PSCAL= 0
##$PSIGN= 0
##$REVERSE= no
##$SF= 200.130013532006
##$SI= 16384
##$SIGF1= 3
##$SIGF2= 2
##$SINO= 400
##$SIOLD= 16384
##$SREGLST= <1H.CDCl3>
##$SSB= 0
##$STSI= 0
##$STSR= 0
##$SW_p= 3612.71676300578
##$SYMM= 0
##$S_DEV= 0
##$TDeff= 0
##$TDoff= 0
##$TI= <>
##$TILT= no
##$TM1= 0
##$TM2= 0
##$TOPLEV= 0
##$USERP1= <user>
##$USERP2= <user>
##$USERP3= <user>
##$USERP4= <user>
##$USERP5= <user>
##$WDW= 1
##$XDIM= 8192
##$YMAX_p= 0
##$YMIN_p= 0
$$ End of Bruker specific parameters
$$ ---------------------------------
##NTUPLES= NMR FID
##VAR_NAME=  TIME,          FID/REAL,        FID/IMAG
##SYMBOL=    X,             R,               I
##VAR_TYPE=  INDEPENDENT,   DEPENDENT,       DEPENDENT
##VAR_FORM=  AFFN,          ASDF,            ASDF
##VAR_DIM=   8192,          8192,            8192
##UNITS=     SECONDS,       ARBITRARY UNITS, ARBITRARY UNITS
##FACTOR=    0.0002768,     1,               1
##FIRST=     0,             0,               0
##LAST=      2.2672688,     0,               0
##MIN=       0,             -883535,         0
##MAX=       2.2672688,     839052,          0
$$ Real data points
##PAGE= N=1
##DATA TABLE= (X++(R..R)), XYDATA
$$ [...]
$$ plain form
1845 260 1138 -588 -445 889 -459 -1025 903 720 -875 14 647 -850 -479 1080 141 -884 342
1862 342 213 -824 128 974 -218 -510 402 -138 -516 541 587 -394 -235 181 -217 -53 439 176 -230
1881 -230 -245 -92 30 129 -4 104 29 -412 -122 454 -54 -387 353 82 -734 315 767 -700 -399 973
1901 973 -249 -858 1099 546 -1537 128 1347 -951 -452 1777 -572 -2072 1211 1050 -1762 669
1917 669 2034 -2029 -1703 2393 13 -1960 2186 1374 -3534 -374 2915 -1536 -1114 3713 -425 -4168
1933 -4168 1653 2366 -2934 783 4180 -2900 -3564 3483 612 -3487 3280 3313 -5087 -1645 4320 -1978
1949 -1978 -2672 5510 1038 -6210 1204 3712 -4392 -261 6857 -2144 -5691 3972 1323 -5818 3118
1964 3118 6332 -5316 -3293 5562 -2315 -5310 6795 3905 -7242 401 5114 -6173 -2634 9182
$$ packed form
1845B60Q78j726J43J334j348n66J928j83j595Q89O33j497L71J559r39j025J226
1862C42j29j037R52Q46j192k92R12n40l78J057M6r81J59M16l98J64M92k63m06
1881b30j5J53J22R9j33J08p5m41K90N76n08l33P40k71q16J049M52j467L01J372
1901I73j222o09J957n53k083J665J219k298M99K229k349j500L283j61k812K431
1917F69J365m063L26M096k380j973M146q12m908L160L289m451M22M827m138l743
1933d168N821P13n300L717L397p080o64P047k871m099O767L3q400L442N965o298
1949a978o94Q182m472p248P414K508q104M131P118r001l547R663k649p141Q936
1964C118L214j1648K023Q855p877k995J2105k890j1147P643M713j1287L539J1816
$$ plain form
1978 9182 -101 -7069 4268 2164 -8841 1755 9324 -4323 -4337 6861 -2547 -8858 6649 6797
1992 6797 -7112 202 6849 -7543 -6042 10199 2361 -7485 4945 3853 -11282 -1126 11137
2005 11137 -2578 -4926 8448 -1403 -12439 4468 9161 -6393 -32 9358 -7443 -10321 9053
2018 9053 4462 -7754 5719 7078 -12391 -5279 11228 -1343 -5872 10552 1799 -14669 1324
2031 1324 10010 -6463 -949 12672 -5079 -13358 7165 5389 -8969 5620 11073 -11375 -8535
2044 -8535 10325 -1157 -7804 11699 6166 -14746 -1777 9584 -7262 -3123 15168 -679 -14252
2057 -14252 4649 5425 -10840 3516 14872 -7306 -10279 8687 -962 -10823 10177 10849 -11910
2070 -11910 -3971 9110 -7633 -7019 14936 4422 -12874 2732 5656 -12471 -484 16308 -2728
$$ packed form
1978I182r283o968J1337k104j1005J0596P569j3647j4J1198r408o311J5507J48
1992F797j3909P314O647j4392J501J6241p838r846J2430j092j5135J0156J2263
2005A1137j3715k348J3374r851j1036J6907M693j5554O361R390j6801k878J9374
2018I053m591j2216J3473J359j9469P112J6507j2571m529J6424q753j6468J5993
2031A324Q686j6473N514J3621j7751q279K0523j776j4358J4589N453k2448K840
2044h535J8860j1482o647J9503n533k0912J2969J1361j6846M139J8291j5847j3573
2057a4252J8901P76j6265J4356J1356k2178k973J8966r649r861K1000O72k2759
2070a1910P939J3081j6743O14K1955j0514j7296J5606K924j8127J1987J6792j9036
$$ plain form
2083 -2728 -9914 7854 -641 -13738 7015 13426 -8305 -3882 9470 -7690 -10768 12840 7218
2096 7218 -10505 3013 6852 -13300 -4516 15223 99 -8620 8385 1012 -15496 2787 13481
2109 13481 -5716 -3491 10608 -5997 -13686 8896 8594 -8532 2945 9281 -11759 -8653 12209
2122 12209 2095 -7861 8650 4610 -14770 -1851 11882 -4012 -4034 11686 -1793 -14228 4541
2135 4541 8187 -7754 1733 11311 -7961 -10440 8701 2362 -8055 7559 7807 -11912 -4494 9330
2149 9330 -3529 -5048 11476 2252 -12408 1514 6565 -7607 80 12154 -3546 -9831 5722
2162 5722 1771 -8629 5383 9662 -7697 -5117 7042 -3338 -6583 9298 5083 -9182 -23
2175 -23 5485 -7005 -2420 10717 35 -7924 3866 1954 -8447 2403 9519 -4029 -4564 5705
$$ packed form
2083b728p186J7768q495j3097K0753O411k1731M423J3352j7160l078K3608n622
2096G218j7723J3518L839k0152Q784J9739j5124q719J7005p373j6508J8283J0694
2109A3481j9197K225J4099j6605p689K2582l02j7126J1477O336k1040L106K0862
2122A2209j0114r956J6511m040j9380J2919J3733j5894k2J5720j3479j2435J8769
2135D541L646j5941R487R578j9272k479J9141o339j0417J5614K48j9719P418J3824
2149I330j2859j519J6524r224j4660J3922N051j4172P687J2074j5700o285J5553
2162E722l951j0400J4012M279j7359K580J2159j0380l245J5881m215j4265R159
2175b3N508j2490M585J3137j0682p959J1790j912j0401J0850P116j3548n35J0269
$$ plain form
2189 5705 -2345 -7401 6228 6146 -6182 -422 5023 -5981 -4277 8131 1839 -5918 3113 2447 -7597
2204 -7597 -210 7739 -1907 -3663 4980 -939 -7134 3353 5508 -4122 -551 4839 -3994 -4855 5348
2219 5348 2309 -4378 2273 3167 -5573 -1837 5477 -720 -3093 3919 706 -5566 922 4150 -2660
2234 -2660 -1010 4178 -1648 -4213 2779 2046 -3251 1076 3288 -3072 -2184 3302 -105 -2497 2625
2249 2625 1577 -3497 -204 2661 -1632 -1112 3062 -149 -2889 1225 1279 -2236 396 2572 -1345 -1753
2265 -1753 1701 -106 -1792 1459 1516 -1795 -447 1420 -1009 -948 1858 381 -1511 371 723 -1307
2281 -1307 -13 1587 -289 -1025 632 46 -1000 591 1049 -679 -473 515 -307 -505 713 436 -613
2298 -613 -126 216 -341 -55 543 68 -413 1 61 -56 139 263 6 -241 -121 76 145 61 80 43 -192 -188
$$ packed form
2189E705q050n056J3629q2j2328N760N445j1004J704J2408o292p757R031o66j0044
2204g597P387P949r646j756Q643n919o195J0487K155r630L571N390q833q61J0203
2219E348l039o687O651Q94q740L736P314o197k373P012l213o272O488L228o810
2234b660J650N188n826k565O992p33n297M327K212o360Q88N486l407k392N122
2249B625j048n074L293K865m293N20M174l211k740M114N4l515K632K176l917m08
2265a753L454j807j686L251N7l311J348J867k429O1K806j477j892J882L52k030
2281a307J294J600j876p36J657n86j046J591M58j728K06R88q22j98J218k77j049
2298f13M87L42n57K86N98m75m81M14O0j17J95J24k57k47J20J97O9q4J9l7k35M
$$ plain form
2320 -188 262 135 -100 73 96 -342 -123 447 39 -336 189 54 -380 82 588 -250 -346 399 -73 -420 465
2341 465 438 -524 -113 458 -281 -266 721 65 -624 140 267 -497 88 666 -283 -519 383 113 -480 265 447
2362 447 -591 -215 509 -129 -230 451 137 -548 108 399 -215 -26 418 -197 -428 180 245 -245 156 191
2382 191 -311 -176 265 62 -87 52 -45 -151 -10 151 2 -65 -41 -35 106 -11 25 185 -109 -270 120 273
2404 273 -118 41 257 -339 -323 453 212 -364 299 238 -702 -49 781 -145 -437 634 -97 -997 429 824
2424 824 -658 -151 895 -705 -1019 1071 527 -1015 487 809 -1410 -493 1631 -209 -931 1283 262
2441 262 -1889 436 1580 -1144 -456 1827 -779 -1907 1418 984 -1810 608 1911 -1889 -1293 2183
2457 2183 -135 -1827 1901 1144 -2737 -143 2272 -1529 -1104 3036 -36 -2951 1339 1540 -2676 441
$$ packed form
2320a88M50j27k35J73K3m38K19N70m08l75N25j35m34M62N06q38r6P45m72l47Q85
2341D65k7r62M11N71p39J5R87o56o89P64J27p64N85N78r49k36R02k70n93P45J82
2362D47j038L76P24o38j01O81l14o85O56K91o14J89M44o15k31O08O5m90M01L5
2382A91n02J35M41k03j49J39r7j06J41J61j49o7K4OJ41j17L6J60k94j61L90J53
2404B73l91J59K16n96J6P76k41n76O63o1r40O53Q30r26k92J071p31r00J426L95
2424H24j482N07J046j600l14K090n44j542J502L22k219R17K124j840p22K214j021
2441B62k151K325J144k724O88K283k606j128L325m34k794K418J303l800N96L476
2457B183k318j692L728p57l881K594K415l801M25M140l072k915M290K01m216L117
$$ plain form
2473 441 3305 -1723 -2293 2482 -125 -3024 2256 2677 -3103 -802 2910 -2037 -2160 3921 972 -3684
2489 -3684 1051 1973 -3669 -280 4661 -1029 -3067 2769 103 -4320 2103 4144 -2873 -1366 3436
2504 3436 -2252 -3627 4192 2423 -3891 935 2736 -4435 -1744 5350 -65 -3573 3014 877 -5493
2519 -5493 971 5194 -2487 -1883 4227 -1732 -5208 3555 3526 -3856 791 4007 -4452 -3464 5325 840
2535 840 -3881 3506 2255 -6304 -685 5470 -2078 -2215 5401 -703 -6569 2380 3828 -4145 584
2550 584 5672 -3790 -5013 4598 1131 -4537 3746 4171 -6060 -2185 5255 -1936 -3039 6110 1369
2565 1369 -6901 951 4058 -4360 -362 7026 -1854 -5976 3495 1479 -5408 2901 6110 -4726 -3498
2580 -3498 4656 -1795 -4484 5865 3581 -6169 -247 4052 -4618 -1910 7363 180 -5857 2657 1700
$$ packed form
2473D41K864n028n70M775k607k899N280M21n780K301L712m947j23O081k949m656
2489c684M735R22n642L389M941n690k038N836k666m423O423K041p017J507M802
2504C436n688j375P819j769o314M826J801p171K691P094n415l508O587k137o370
2519e493O464M223p681O04O110n959l476Q763k9p382M647L216q459R88Q789m485
2535H40m721P387j251q559N619O155p548j37P616o104n866Q949J448p973M729
2550E84N088r462j223R611l467n668Q283M25j0231L875P440p191j103R149m741
2565A369q270P852L107q418L998P388q880m122R471k016o887Q309L209j0836J228
2580c498Q154o451k689J0349k284r750N922M299q670K708R273p183o037Q514r57
$$ plain form
2595 1700 -6101 1562 7068 -3027 -3731 4329 -1546 -5740 4785 4841 -4960 -510 4177 -4670 -3549
2610 -3549 6668 1535 -5052 2561 2334 -6432 -326 6811 -1688 -3424 4512 -584 -6491 2888 5251
2625 5251 -3913 -676 4852 -3645 -4974 5200 2451 -4503 2337 3570 -5879 -2235 5875 -680 -3355
2640 -3355 4662 930 -6605 797 4754 -3083 -923 5473 -2087 -5645 3332 2444 -4116 1902 4619
2655 4619 -4462 -3297 4530 -385 -3393 4241 2354 -5596 -458 3991 -2624 -1421 5364 -405 -5208
2670 -5208 1907 2221 -3867 1105 4915 -2769 -3522 3197 -145 -3573 3264 3336 -4104 -1205 3208 -2231
2686 -2231 -2068 4556 1059 -4166 902 2082 -3420 -25 4573 -1212 -3155 2398 193 -3504 1985
2701 1985 3476 -2686 -1358 2705 -1623 -2557 3323 1679 -3129 568 2013 -2881 -861 3599 -305
$$ packed form
2595A700p801P663N506j0095p04Q060n875m194J0525N6r801M450M687q847J121
2610c549J0217n133o587P613k27q766O106P137q499j736P936n096n907R379K363
2625E251r164L237N528q497j329J0174k749o954O840J233r449L644Q110o555k675
2640c355Q017l732p535P402L957p837K160O396p560l558Q977q88o560O018K717
2655D619r081J165P827m915l008P634j887p950N138M449o615J203O785n769m803
2670e208P115L14o088M972L810p684p53O719l342l428O837P2p440K899M413n439
2686b231J63O624l497n225N068J180n502L395M598n785j943N553k205l697N489
2701A985J491o162J328M063m328r34N880j644m808L697J445m894K020M460l904
$$ plain form
2716 -305 -2402 2001 619 -3157 840 2947 -1680 -1145 2424 -902 -2524 2022 1575 -2226 298 1914
2732 1914 -2007 -1389 2432 181 -1828 1401 964 -2378 -103 2145 -892 -1000 1860 -155 -2135 886
2748 886 1324 -1387 36 1767 -1015 -1390 1342 332 -1319 889 1082 -1537 -496 1321 -419 -762
2764 -762 1235 205 -1509 191 887 -806 -92 1195 -489 -1004 621 250 -819 439 806 -788
2780 -788 -421 636 -195 -450 726 314 -802 -9 456 -415 -98 664 -136 -592 223 170 -368 149 393
2799 393 -329 -280 302 -12 -205 291 89 -315 -85 183 -74 18 156 -84 -153 47 80 52 69 48 -33 -33 3 74
2823 74 35 12 -119 43 -16 -50 101 60 -155 -99 141 -13 -86 163 30 -216 35 187 -123 -33 213 -105 -221
2846 -221 256 165 -195 57 201 -246 -122 372 -20 -247 142 6 -347 102 251 -129 -161 275 -98 -297 216
$$ packed form
2716c05k097M403j382l776L997K107m627N35L569l326j622M546m47l801K524J616
2732A914l921O18L821k251k009L229m37l342K275K248l037j08K860k015j980L021
2748H86M38k711J423J731k782l75K732j010j651K208J93k619J041J817j740l43
2764g62J997j030j714J700O96j693P14J287j684n15J625l71j069J258L67j594
2780g88L67J057q31k55J176m12j116P93M65q71L17P62q00m56Q15n3n38N17K44
2799C93p22M9N82l14j93M96k02m04K30K68k57R2J38k40o9K00L3k8J7k1q1%L6P1
2823G4l9k3j31J62n9l4J51m1k15N6K40j54p3K49j33k46K51J52l10R0K46l18j16
2846b21M77r1l60K52J44m47J24M94l92k27L89j36l53M49J49l80l2M36l73j99N13
$$ plain form
2867 216 203 -235 -20 200 -133 -135 265 55 -241 104 99 -224 25 288 -33 -215 177 31 -199 128 190 -198
2889 -198 -139 89 -68 -120 87 42 -167 -56 27 45 -13 11 42 -76 -73 104 132 -15 32 -6 -67 -41 136 131 -101 -15
2915 -15 66 -149 -50 244 140 -252 7 122 -353 -18 438 -77 -307 259 48 -440 241 454 -334 -249 389
2936 389 -172 -452 515 305 -576 49 455 -573 -263 779 -31 -615 544 294 -846 113 765 -484
2954 -484 -439 825 -171 -934 561 537 -858 76 993 -635 -773 963 57 -959 749 811 -1186 -291
2972 -291 1151 -495 -697 1311 246 -1467 318 970 -1127 -103 1639 -546 -1357 966 304 -1455
2988 -1455 824 1537 -1346 -793 1392 -518 -1212 1684 766 -1818 159 1302 -1405 -479 2137 -240
3004 -240 -1787 1077 632 -1902 549 2089 -1224 -1179 1570 -479 -1828 1680 1433 -1893 -98 1675
$$ packed form
2867B16j3m38K15K20l33kM00k10k96L45nl23K49K63l21j82L92j46k30L27O2l88
2889a98N9K28j57n2K07m5k09J11Q3J8n8K4L1j18LJ77K8j47M7l8o1K6J77nk32Q6
2915a5Q1k15R9K94j04l92K59J15m75L35M56n15k30N66k11m88O81K13p88Q5O38
2936C89n61k80R67k10q81O25M06j028L10J042q10n84J159k50j140R59O52j249
2954d84M5J264r96p63J495k4j395R34R17j628j38J736r06j016J708O2j997Q95
2972b91J442j646k02K008j065j713J785O52k097J024J742k185q11K323o62j759
2988a455K279P13k883N53K185j910o94K896r18k584J977J143k707R26K616k377
3004b40j547K864m45k534K451J540l313M5K749k049j349L508k47l326J795J773
$$ plain form
3020 1675 -1578 -1192 2401 392 -2059 1042 1033 -2327 -50 2560 -871 -1471 1939 -112 -2528 1249
3036 1249 1983 -1826 -315 2220 -1425 -1945 2307 868 -2134 1080 1602 -2607 -818 2692 -561 -1682
3052 -1682 2221 418 -3024 677 2227 -1739 -375 2747 -1159 -2703 1962 1099 -2277 1100 2352
3067 2352 -2414 -1513 2575 -378 -1921 2404 1240 -3196 -105 2352 -1658 -932 3195 -349 -3115
3082 -3115 1280 1397 -2423 614 3127 -1848 -2202 2213 -24 -2376 2171 2137 -2826 -721 2304 -1506
3098 -1506 -1472 3127 608 -3038 872 1565 -2600 6 3283 -1082 -2294 1967 152 -2742 1660 2521
3114 2521 -2293 -923 2252 -1379 -2093 2744 1204 -2628 638 1643 -2602 -742 3178 -289 -2084
3129 -2084 1862 508 -2982 768 2729 -1593 -993 2388 -870 -2694 1994 1638 -2198 453 2119
$$ packed form
3020A675l253L86L593k009k451L101rl360K277K610l431o00L410k051k416L777
3036A249P34l809J511K535l645n20M252j439l002L214N22m209J789L510l253j121
3052a682L903j803l442L701J550l966J364L122l906j544M665q63l376L377J252
3067B352m766R01M088k953j543M325j164m436L091K457m010P26M127l544k766
3082c115M395J17l820L037K513m975l54M415k237k352M547l4m963K105L025l810
3098a506L4M599k519l646L910O93m165K606L277m365j212M261j815k894M402Q61
3114B521m814J370L175l631p14M837j540l832L266J005m245J860L920l467j795
3129b084L946j354l490L750J961m322O00L381l258j824M688l56l836K651J666
$$ plain form
3144 2119 -2239 -1563 2716 192 -2009 1710 1072 -2943 -142 2545 -1139 -1055 2449 -275 -2844 1191
3160 1191 1740 -1829 295 2355 -1585 -2009 1990 415 -1830 1493 1572 -2466 -720 2104 -775 -1168
3176 -1168 2209 274 -2563 506 1601 -1603 -114 2374 -893 -1994 1420 556 -1754 1041 1782
3191 1782 -1801 -986 1630 -497 -1334 1785 837 -2043 98 1401 -1297 -521 2035 -199 -1713 946
3207 946 640 -1578 463 1745 -1066 -983 1396 -306 -1415 1240 953 -1441 -19 1226 -1035 -733
3223 -733 1592 108 -1353 707 671 -1363 90 1379 -580 -719 1108 -139 -1314 684 938 -1010
3239 -1010 -89 1103 -690 -840 1051 337 -971 504 647 -1099 -256 1066 -256 -587 830 127 -1032
3256 -1032 223 780 -574 -187 806 -397 -778 621 290 -677 209 533 -685 -372 657 -29 -444 493
$$ packed form
3144B119m358O76M279k524k201L719o38m015K801K687l684Q4L504k724k569M035
3160A191N49l569K124K060l940m24L999j575k245L323P9m038J746K824k879l93
3176a168L377j935k837L069J095l204J489K488l267j101L414q64k310K795P41
3191A782l583Q15K616k127q37L119r48k880K141J303k698P76K556k234j514K659
3207I46l06k218K041J282k811Q3K379j702j109K655k87k394J422J245k261L02
3223g33K325j484j461K060l6k034J453J289j959j39J827j247j175J998K54j948
3239a010R21J192j793j50J891p14j308J475J43j746Q43J322j322l31J417p03j159
3256a032J255N57j354L87R93j203l81J399l31r67Q86L24j218L13J029o86m15R37
$$ plain form
3274 493 168 -677 26 553 -283 -128 599 -119 -541 321 284 -362 126 393 -315 -210 426 -22 -252 263
3294 263 144 -360 9 313 -125 -120 246 -54 -299 145 185 -149 -15 180 -124 -78 175 31 -129 66 64 -121
3316 -121 36 108 -39 -8 84 -7 -51 92 57 -84 27 33 -33 63 89 -78 5 25 -74 -13 3 -48 -20 27 -12 -96 87
3343 87 50 -73 -8 94 -48 29 173 -9 -59 69 21 -128 70 67 -111 -40 106 -63 -68 81 26 -177 -29 101
3367 101 -53 -21 183 -85 -125 94 89 -161 59 117 -89 -56 120 41 -55 42 64 -174 15 119 -37 -49 12 9 -100
3392 -100 45 97 -40 -37 107 -94 -60 11 102 -75 -13 56 -54 -17 65 97 -36 -79 92 32 51 80 124 -79 -69 74
3418 74 32 -40 86 9 -138 -22 69 -22 2 108 24 -169 44 166 -124 -70 253 -29 -188 160 168 -227 33 250
3442 250 -204 -190 196 19 -274 247 179 -301 28 334 -245 -184 339 -6 -320 241 214 -456 -53 422 -174
$$ packed form
3274D93l25q45P03N27q36J55P27p18m22Q62l7o46M88K67p08J05O36m48k30N15
3294B63j19n04L69L04m38NL66l00k45M44M0l34J34J95l04M6K53j44j60J95kj85
3316a21J57P2j47L1R2r1m4J43l5j41J11Oo6R6K6j67Q3K0r9O1J6n1K8M7l9q4J83
3343H7l7j23O5J02j42P7J44j82n0J28m8j49J98lj78P1J46j69nJ49n5k03J48J30
3367A01j54L2K04k68m0K19nk50K20N8k06L3J76p9r6R7K2k38J89J04j56j2O1lj09
3392a00J45N2j37LJ44k01L4P1R1j77O2O9j10L7Q2L2j33m3J71o0J9K9M4k03J0J43
3418G4m2p2J26p7j47J16R1r1K4J06q4j93K13J22k90N4L23k82j59L48Ql95K60K17
3442B50m54J4L86j77k93N21o8m80L29L06n79O1N23l45l14N61k7o70M03M75n96
$$ plain form
3463 -174 -270 402 19 -541 183 387 -354 -95 526 -262 -504 405 214 -468 245 452 -514 -308 631 -102
3483 -102 -479 563 234 -777 43 611 -481 -236 773 -138 -805 443 419 -706 208 821 -551 -525
3501 -525 750 -2 -666 671 537 -937 -118 822 -509 -517 965 55 -1067 421 552 -885 -40 1065
3519 1065 -422 -775 814 136 -974 568 853 -878 -271 1015 -499 -817 992 404 -1105 305
3535 305 813 -1008 -391 1232 -210 -939 875 282 -1264 321 1124 -772 -446 1153 -352 -1160 887
3552 887 690 -1108 226 979 -1049 -694 1325 59 -1049 885 543 -1417 -42 1319 -622 -549 1315
3569 1315 -233 -1465 734 877 -1114 128 1285 -945 -995 1154 151 -1111 854 889 -1465 -375
3585 -375 1330 -469 -760 1384 233 -1637 444 1064 -1042 -140 1512 -606 -1305 1018 434 -1293
$$ packed form
3463a74r6O72l83n60P24K04p41K59O21p88k42R09j91o82P13K07r66K06R39p33
3483a02l77J042l29j011Q20N68j092K45J009r11o67J248k4j125R14O13j372K6
3501e25J275p52o64J337j34j474Q19R40j331qJ482r10j122J488J31j437Q45J105
3519A065j487l53J589o78j110J542K85j731O07J286j514l18J809n88j509J410
3535C05N08j821O17J623j442p29J814n93j546J585Q03j896L26J599j505q08K047
3552H87j97j798J334P53k028L55K019j266j108J934l42j960J375J361j941P3J864
3569A315j548j232K199J43j991J242J157k230n0K149j003j262J965L5k354J090
3585c75J705j799k91K144j151j870K081O20k106R02J652k118o99K323n84j727
$$ plain form
3601 -1293 650 1229 -1250 -641 1289 -385 -1047 1293 578 -1516 156 1101 -1058 -424 1619 -146
3617 -146 -1381 836 471 -1323 337 1403 -908 -760 1212 -291 -1247 1023 862 -1269 32 1090
3633 1090 -976 -725 1517 170 -1256 697 586 -1415 0 1453 -475 -842 1132 -82 -1463 672
3649 672 1069 -979 -141 1165 -840 -1049 1185 446 -1161 522 791 -1242 -403 1368 -242 -807 1024
3666 1024 182 -1387 373 1096 -822 -205 1122 -489 -1162 906 502 -939 451 924 -990 -575 1186
3683 1186 -117 -785 878 384 -1221 12 955 -660 -374 1105 -223 -1090 625 561 -851 124 984
3700 984 -655 -667 862 -3 -794 675 569 -991 -154 792 -515 -488 914 113 -935 404 467 -730
3718 -730 2 973 -311 -616 649 35 -763 409 582 -632 -139 652 -389 -525 716 253 -647 201
$$ packed form
3601a293J943N79k479O09J930j674o62K340p15k094J672R45k159O34K043j765
3617a46j235K217l65j794J660J066k311J48J972j503r56K270j61k131J301J058
3633A090k066K51K242j347j426J953j11k001J415J453j928l67J974j214j381K135
3649F72L97k048Q38J306k005k09K234p39j607J683K69k033Q39J771j610n65J831
3666A024q42j569J760P23j918O17J327j611o73K068m04j441J390M73j914M15J761
3683A186j303o68J663m94j605J233R43j615K86J479j328q67J715o4j412R75Q60
3700I84j639j2J529q65p91J469j06j560Q37R46j307K7J402q01j048J339O3j197
3718g30P32R71j284l05J265o14p98J172J73j214M93P91j041j36J241m63r00Q48
$$ plain form
3736 201 486 -617 -155 723 -168 -537 469 91 -625 252 590 -402 -202 534 -177 -502 474 306 -463
3755 -463 110 393 -449 -235 554 73 -407 325 191 -460 35 490 -207 -172 360 -100 -403 269 293 -325 -16
3776 -16 327 -274 -243 336 27 -297 196 156 -318 -10 328 -177 -156 223 11 -305 146 176 -175 -29 161 -131
3798 -131 -153 153 21 -159 64 167 -137 -52 101 -73 -62 160 22 -117 43 52 -102 -22 96 -33 -6 83 19
3821 19 -90 53 75 -33 -32 39 -31 -81 55 33 6 -4 -15 -37 12 72 -35 52 32 -26 19 35 57 7 -2 16 -15 -11 76
3850 76 2 20 -17 -49 -48 97 37 -29 44 -10 -93 11 101 -36 -17 27 -41 -14 49 39 -21 15 46 -43 11 142 1 0 15
3879 15 -15 -67 46 88 -21 11 28 -16 -36 42 -37 -73 -53 -14 -23 -21 50 -6 -45 -37 51 15 37 58 -51 -17 -22 19 8 -11 76
3910 76 -55 -84 79 -9 3 44 51 -23 -75 45 22 25 6 19 -52 -26 70 40 -47 32 35 -98 -60 53 -54 -82 67 18
$$ packed form
3736B01K85j103M62Q78q91l69J006l78p16Q77L38r92K00P36p11l25R76j68p69
3755d63N73K83q42K14P89m81m80P32j34o51M95M55o97L5N32m60l03O72K4o18L09
3776a6L43o01L1N79l09l24M93m0m74L08L38n05K1L79k12l16M51L0l51J46J90k92
3798a31k2L06j32j80K23J03l04Q5J53j74J1K22j38j39J60Rj54Q0J18j29K7Q9o4
3821A9j09J43K2j08JP1p0n0J36k2k7j0j1k2M9O0j07Q7k0n8M5J6K2n0rJ8l1MQ7
3850G6p4J8l7l2JJ45o0o6P3n4q3J04R0j37J9M4o8K7O3j0o0L6L1q9N4J31j41jJ5
3879A5l0n2J13M2j09L2J7m4k0P8p9l6K0L9rKP1n6l9QQ8l6K2K1j09L4nM1j1j9Q7
3910G6j31k9J63q8J2M1Pp4n2J20k3Lj9J3p1K6R6l0q7P9Lj33L8J13j07k8J49m9
$$ plain form
3938 18 -85 26 94 -69 -64 178 -22 -108 81 44 -150 -43 201 -22 -99 150 -16 -168 57 119 -125 -45 178
3961 178 -134 -142 188 107 -213 90 70 -219 -102 286 -50 -168 173 80 -287 29 271 -173 -94 231 -77 -330
3983 -330 199 177 -232 12 227 -238 -207 305 22 -229 225 153 -376 -14 392 -176 -135 377 -31 -414 188
4004 188 272 -337 5 398 -222 -298 372 39 -419 225 260 -430 -163 435 -189 -274 461 154 -520 112 328
4025 328 -408 -125 509 -135 -410 370 122 -537 204 519 -407 -263 545 -164 -527 465 311 -544 46 488
4045 488 -427 -261 648 -22 -567 345 209 -602 66 613 -331 -373 544 -54 -585 388 461 -558 -39 541
4065 541 -403 -439 591 110 -592 287 366 -656 -89 736 -210 -445 551 32 -756 257 566 -493 -123
4084 -123 649 -338 -518 639 239 -591 247 531 -611 -314 683 -190 -502 527 221 -827 93 632 -500
$$ packed form
3938A8j03J11O8j63NK42k00q6J89l7j94J07K44k23p7K49j66j52K25O2k44Q0K23
3961A78l12qL30q1l20L03k0k89J17L88l36j18L41r3l67L16K42m44P9L25l08k53
3983c30N29k2m09K44K15m65L1N12k83k51M54p2n29L62M06n68M1N12m08l83O02
4004A88Q4o09L42L93o20p6O70l33m58O44L5o90K67N98o24q5P35l07o74O32K16
4025C28p36K83O34o44k75P80k48o59P41L15r26J44Q08p09l63R92j54q55N90M42
4045D88r15J66R09o70n45R12j36q11O68N47r44m2R17n98n31R73P3j019N19N80
4065E41r44l6J030m81p02Q79P9j022N67Q25r46k35R96n19p88J013L09j059L70
4084a23P72r87j80J157m00q30Q38K84j142K97R97q73l12J029l06j048R20N39j132
$$ plain form
4103 -500 -212 686 -215 -650 461 270 -686 112 635 -516 -455 644 -102 -598 505 388 -770 -51 570
4122 570 -454 -335 763 21 -743 271 436 -639 45 763 -407 -513 589 -26 -678 448 531 -613
4140 -613 -183 582 -394 -463 668 183 -674 225 440 -635 -131 704 -188 -521 465 87 -648 211 628 -468
4160 -468 -241 635 -310 -514 577 306 -543 125 466 -525 -276 684 -31 -517 423 211 -675 121 597 -301
4180 -301 -246 576 -195 -552 411 343 -545 60 480 -425 -349 549 6 -495 405 298 -550 -64 501 -301 -290
4201 -290 453 -10 -580 235 313 -431 -36 493 -249 -398 380 67 -434 223 392 -458 -135 477 -137 -299
4221 -299 418 135 -481 120 310 -312 -95 446 -46 -420 256 73 -337 231 357 -292 -199 297 -103 -291
4241 -291 260 173 -357 27 252 -276 -107 386 -32 -315 162 127 -327 73 343 -163 -193 276 -14 -256 236
$$ packed form
4103e00K88Q98r01m35J111j91r56P98N23j151O1J099p46m96J103j17j158P19O21
4122E70j024J19J098p42p64J014J65j075O84P18j170j06J102o15o52J126Q3j144
4140f13M30P65r76o9J131m85q57Q99K15j075N04Q35q92l33R86l78p35Q59M17j096
4160d68K27Q76r45k04J091k71q49O68L41r91K49R60p15m86R40k12q86P96M76q98
4180c01N5Q22p71l57R63o8q88O05M20r05P6Q98n43n01R00j07q48M86N65q02J1
4201b90P43m63n70Q15P8p44L95N29p42j49P78l13n01O57J69q50L23O12o14j62
4221b99P17k83o16O01J90o22K17N41m92l74O76j83m10N68J26o49R3M96m00j88
4241b91N51q7n30L84K25n28J69M93m18k83M77l5m54M00K70n06l0M69k90k42M92
$$ plain form
4262 236 193 -256 -19 221 -121 -171 248 87 -246 100 90 -275 -42 259 -107 -171 211 28 -217 118 181 -202
4284 -202 -30 176 -111 -180 178 76 -159 70 97 -207 -51 160 -51 -121 121 78 -147 58 128 -162 6 148
4306 148 -89 -73 86 10 -90 18 53 -49 -13 57 -12 -28 50 38 -30 0 2 -57 -20 69 -34 -63 44 59 -63 20
4332 20 35 5 -15 18 -34 -19 24 15 -17 -3 71 -23 -11 67 -37 -30 -12 22 58 4 16 -40 -6 5 16 -33 -19 -43 21 -12 41
4363 41 -12 19 36 9 -53 19 19 40 -27 -12 33 24 24 -19 -2 15 -5 -20 16 -1 92 20 14 -66 30 5 -7 1 -18 3 -33 -6 -9
4396 -9 -10 -12 22 -28 24 -40 15 -6 6 58 17 -29 -5 38 5 -26 -16 -2 -13 25 -38 -7 21 -2 11 16 14 34 17 30 -37 -43 36
4429 36 25 -34 -41 62 3 -45 -14 12 -40 -15 3 -58 13 80 -61 -109 29 25 -41 43 50 -37 -72 29 4 -54 -4 54 -67
4458 -67 -63 120 -54 -74 54 1 -88 61 58 -84 -34 56 -14 -34 133 77 -111 3 13 -79 -28 139 55 -125 44 14
$$ packed form
4262B36m3m49K37K40l42n0M19j61l33L46j0l65K33L01l66o4L82j83k45L35O3l83
4284b02J72K06k87o9L58j02k35K29K7l04J56K11k11p0K42m3k25K05P0k90J68J42
4306A48k37J6J59p6j00J08L5j02L6P0o9j6P8j2o8L0Kn9L7Q9j03k9J07J5j22Q3
4332B0J5l0k0L3n2J5M3rl2J4P4r4J2P8j04PJ8L4L6n4J2n6L4J1J1m9J4k4O4l3N3
4363D1n3L1J7k7o2P2%K1o7J5M5r%m3J7J7k0j5L6j7R3p2oq0R6k5j2Qj9K1l6K7l
4396ijkL4n0N2o4N5k1J2N2m1m6K4M3l3l1J0J4j1L8o3L1K8k3J3NkK0j7J3o7oP9
4429C6j1n9pJ03n9m8L1K6n2K5J8o1P1O7j41m8J38mo6Q4Pq7l5J01k5n8N0N8j21
4458f7MJ83j74k0J28n3q9J49lj42N0R0p0k0J67n6j88J14J0r2N1J67q4j80J69l0
$$ plain form
4484 14 -161 17 139 -72 -82 120 -19 -155 92 138 -128 -50 133 -65 -83 166 40 -149 44 134 -160 -47
4506 -47 215 -101 -136 165 33 -126 97 173 -114 -59 240 -103 -173 162 64 -216 45 134 -166 -64 175 -62
4528 -62 -186 114 100 -193 25 143 -181 -78 254 -19 -254 179 105 -263 14 262 -130 -201 206 -33 -240
4549 -240 192 197 -287 -69 258 -179 -157 283 67 -312 76 137 -263 0 283 -123 -263 211 44 -292 154
4570 154 249 -323 -40 250 -132 -217 267 109 -305 162 230 -308 -32 347 -74 -237 270 99 -305 111 307
4591 307 -235 -122 297 -83 -228 279 102 -269 77 227 -303 -123 359 6 -219 251 115 -337 79 359
4611 359 -196 -133 330 -36 -320 152 210 -286 -11 386 -139 -165 254 -26 -254 217 159 -309 -33 328 -180
4632 -180 -148 339 53 -304 92 224 -248 -49 364 -146 -326 225 25 -261 206 293 -303 -96 314 -161 -229
$$ packed form
4484A4j75J78J22k11j0K02j39j36K47M6k66P8J83j98j8K49j26j89J93R0k94J13
4506d7K62l16l5L01j32j59K23P6k87N5K99l43p0L35r8k80K61Q9l00J02K39k37
4528f2j24L00j4k93K18J18l24J03L32k73k35M33p4l68K77K48l92p1M07k39k07
4549b40M32Nm84K18L27m37K2M40k16l79L88O1m00K63K83m06j40M74j67l36M46
4570A54R5n72K83K90l82q5M84j58m14M67O8n38K76L79m21j63N07j71m04M16J96
4591C07n42J13M19l80j45N07j77l71L46J50n30J80M82l53k25M70j36m52M16K80
4611C59n55O3M63l66k84M72N8m96K75L97n25k6M19k80k28M71n8m68K76L61n08
4632a80L2M87k86l57L96J32m72J99M13n10j80N51k00k86M67Q7n96K07M10m75o8
$$ plain form
4653 -229 288 114 -344 43 227 -267 -68 342 -116 -294 128 72 -255 71 299 -227 -153 264 -55 -259 242
4674 242 169 -322 -23 244 -199 -100 336 -37 -239 179 170 -314 56 308 -169 -123 225 0 -203 135 199 -228
4696 -228 18 288 -145 -181 225 78 -215 183 123 -256 -93 268 -158 -166 205 30 -274 89 224 -217 -48
4717 -48 213 -50 -241 173 75 -172 57 155 -229 -80 226 -43 -136 158 63 -240 82 176 -76 -37 149 -56
4739 -56 -125 128 63 -172 44 115 -124 -92 142 -42 -146 95 61 -193 -16 111 -89 -41 154 -7 -90 126 90
4762 90 -125 23 130 -49 -69 107 -17 -83 70 59 -164 -89 158 -99 -84 95 41 -100 -19 105 -89 8 127
4785 127 -45 -53 116 -11 -147 66 75 -28 19 78 -33 -133 34 27 -113 37 64 -46 -10 86 -2 -37 68 48 -97
4810 -97 -8 60 -20 10 60 -23 -22 100 68 -85 -28 4 -14 -44 18 35 -48 -7 -18 -33 -27 40 -52 -32 74 18 -31 57 19 -24
$$ packed form
4653b29N17j74m58L87J84m94J99M10m58j78M22n6l27L26K28n26P4M17l19k04N01
4674B42p3m91K99K67m43R9M36l73k02M18rm84L70K52m77M6L48k25k03L38O4m27
4696b28K46K70m33l6M06j47k93L98o0l79J63L61m26qL71j75l04L63J35m41J69
4717d8K61k63j91M14r8k47K29R8l84J49L06k69r3K94r5l03L22R4k52L9J86k05
4739e6o9K53o5k35K16P1k39L2K34j84j04K41l4k54J77J27k00M8J95j61q3K16l6
4762I0k15J48J07j79k0J76j24o6J53j1k23P5K47k57J5J79n4j41Q1J24j94R7J19
4785A27j72qJ69j27j36K13Rj03M7N9j11j00J67pj40J50K7j10L6R6q8l5J05k0j45
4810i7Q9O8q0L0N0q3JJ22l2j53N7L2j8l0O2J7q3M1j1j5OO7r2K0J06n6m9Q8l8m3
$$ plain form
4840 -24 -16 14 -37 -42 88 -16 -4 26 14 -86 20 19 -11 22 -7 13 -26 43 40 -41 -2 -24 -31 -12 1 -7 -49 8 -6 -66 -7
4871 -7 41 -33 -10 64 -57 3 9 17 -15 41 9 -15 -18 -2 -37 -49 21 16 8 26 46 -59 -11 -11 -12 -10 27 -37 -38 56 52 62 9 37 -12
4906 -12 -6 -27 14 -33 13 -34 -42 16 -3 -24 19 15 1 -6 4 47 -17 -15 39 2 28 6 7 -17 -19 -43 22 32 45 7 -22 57 17 -38
4940 -38 -44 40 43 -25 18 -14 -39 47 26 -27 6 67 -1 9 4 -27 -71 9 53 19 5 12 5 -18 35 45 -83 -30 19 -22 -44 12
4972 12 31 -75 51 15 -39 -36 34 13 -34 -3 1 -33 -22 31 -48 -30 100 -5 -99 33 31 -72 -57 31 -44 -109 84 -21
5000 -21 -47 67 2 -44 -5 35 -59 -53 23 64 -69 11 113 -59 -12 43 -71 -94 31 12 -75 68 46 -92 -9 100
5026 100 -96 -46 55 50 -82 59 72 -94 -34 106 -24 -120 140 50 -119 -40 45 -102 -97 98 -34 -132 75 84 -131
5051 -131 7 118 -69 -73 89 18 -112 123 90 -136 15 146 -43 -115 117 -21 -131 121 42 -150 19 137
$$ packed form
4840b4QL0n1nJ30j04J2L0j2j00J06jl0L3k9K0l9O9lq1L9k2pJ9J3qm2N7j4o0N9
4871gM8p4K3P4j21O0OQl2N6l2k4lJ6l5j2P0nqJ8K0j05M8%jKL7o4jR4mJ0n3K8m9
4906a2Ok1M1m7M6m7qN8j9k1M3mj4pJ0M3o4KN4l7K6k2Jk4kk4O5J0J3l8k9P9m0n5
4940c8oQ4Lo8M3l2k5Q6k1n3L3O1o8J0nl1m4Q0M4l4j4Ppk3N3J0j28N3M9m1k2N6
4972A2J9j06J26l6n4LP0k1m7L1Ml4J1N3p9J8J30j05r4J32kj03J5Q8p5o5J93j05
5000b1k6J14o5m6L9M0r4OP6M1j33Q0J02j72M7N5j14k3J25j9q7J43k2j38Q3J09
5026A00j96N0J01nj32J41J3j66O0J40j30r6K60r0j69P9Q5j47NJ95j32r8K07Rk15
5051a31J38J11j87mJ62p1j30K35l3k26J51J31j89p2K32j38j10K52p9j92J69J18
$$ plain form
5073 137 -121 -101 130 -8 -98 105 82 -192 -23 136 -11 -17 98 11 -173 66 89 -134 -21 144 -35 -119 79
5096 79 65 -158 72 99 -68 -53 129 -48 -145 149 36 -141 27 142 -79 -94 149 -45 -139 114 18 -174 18
5119 18 77 -75 -88 127 -37 -163 128 61 -111 -31 178 -88 -71 205 3 -119 68 120 -164 -34 168 -39
5141 -39 -107 191 15 -121 99 100 -104 26 160 -59 -145 180 13 -138 92 106 -144 -37 127 -88 -35 109
5163 109 20 -130 95 124 -105 -4 129 -64 -130 138 10 -190 59 55 -162 33 122 -52 -116 126 82 -102 5
5186 5 118 -104 -62 178 43 -75 135 32 -106 57 87 -77 -73 123 -29 -129 141 31 -109 46 83 -98
5208 -98 -73 166 -17 -97 64 30 -139 6 103 -46 -96 131 -48 -143 83 66 -93 -32 134 -73 -97 147 80 -46
5232 -46 87 48 -166 -1 106 -55 -35 132 26 -111 67 52 -87 1 57 -65 -97 106 -32 -113 63 61 -76
$$ packed form
5073A37k58K0K31j38r0K03k3k74J69J59j47oJ15q7j84K39K3k23J13J65j79q4J98
5096G9j4k23K30K7j67J5J82j77r7K94j13j77J68J15k21j5K43j94r4K53r6j92J92
5119A8N9j52j3K15j64j26K91o7j72Q0K09k66J7K76k02j22J87N2k84J30K02k07
5141c9o8K98j76j36K20Jk04J30J34k19q6L25j67j51K30J4k50J07J64k15N3J44
5163A09q9j50K25K9k29J01J33j93o6K68j28k00K49mk17J95Q9j74o4K42m4j84J07
5186EJ13k22M2K40j35j18K10j03j38J63L0j64MJ96j52j00K70j10j40J55L7j81
5208i8K5K39j83q0J61l4j69J45R7j49n0K27j79r5K26j7j59O1J66k07k4K44o7j26
5232d6J33l9k14J65J07j61K0J67j06j37J78j5j39Q8N6j22l2K03j38q1J76kj37
$$ plain form
5255 -76 -73 95 -42 -89 71 41 -70 47 115 -68 -22 70 -38 -31 17 66 -55 4 59 -41 -5 17 -23 -41 88 52
5281 52 -107 7 86 -84 -59 102 13 -111 3 77 -57 15 75 9 -5 44 -20 -58 28 51 -22 29 72 -44 -43 61
5307 61 67 -84 -17 -15 -2 23 20 -39 -15 -1 8 -69 34 5 -5 11 42 -16 -66 27 9 -30 39 8 -63 6 -15 28 -92 49
5337 49 37 -38 11 47 2 -30 -6 -72 -5 29 -23 -31 4 -36 11 -20 41 -26 -7 38 -7 -29 -33 3 11 -25 -1 31 -16 -32 27 38
5369 38 -26 21 17 24 30 29 -17 26 15 -22 -8 -2 10 5 24 -3 -24 10 16 -63 15 -10 19 3 55 7 3 25 4 50 -3 -12 -59 -46 25
5404 25 8 10 8 43 -39 49 33 -39 4 -19 80 -28 -5 7 -83 -40 50 -4 -26 -7 -3 -26 -11 31 -23 8 9 -24 -21 3 54 -27
5436 -27 11 2 -60 -31 62 31 -10 27 36 -40 -40 47 -49 -7 41 -31 -4 26 79 -6 -19 53 -3 -58 60 23 -9 26 23 -27 -11 0
5468 0 1 -18 44 55 -49 6 32 -41 -30 27 -60 -26 68 -19 -45 17 68 -57 -28 113 -37 -51 57 -28 -75 33 22 -48
$$ packed form
5255g6LJ68j37m7J60l0j11J17O8j83M6R2j08PM8M9j21N9N5j00L6K2m0j8J29l6
5281E2j59J14P9j70K5J61q9j24J14P4j34P2O0o6j4M9o4l8Q6K3p3N1M3j16JJ04
5307F1Oj51O7KJ3K5ln9K4J4Rp7J03k9j0J6L1n8n0R3j8l9O9l1p1O9k1M3j20J41
5337D9j2p5M9L6m5l2K4o6O7L4n2qL5m0M7l1O1o7J9M5m5k2mL6Ql6K4L2m7j6N9J1
5369C8o4M7mPOjm6M3j1l7J4OJ2nJ9k7k1L4Op9P8k5K9j6N2m8mK2k1M6n3rm7J3P1
5404B5j7KkL5q2Q8j6p2M3k3R9j08K3J2r0M3R0n4k2J9Mk3J5M2n4L1Jl3LK4N1q1
5436b7L8ro2K9R3l1m1L7Rp6%Q7r6M2M8p2K7L0N3q5j3P2n6n5J18l7l2L5ln0J6J1
5468@Jj9O2J1j04N5K6p3J1N7q7L4R4q7k6O2N1j25K9J41j50j4J08q5m7J08j1p0
$$ plain form
5496 -48 -69 57 -38 -24 43 14 -53 39 52 -74 -32 6 -18 -60 37 54 -82 15 44 3 -31 61 24 -55 54 2 -60 -51 102
5525 102 -44 -53 83 -23 -60 32 107 -25 -5 72 -71 -116 82 77 -103 54 99 -49 -4 66 -26 -42 33 -5 -109 43
5551 43 56 -41 -12 47 -1 -81 124 20 -60 14 73 -30 -4 84 -56 -112 56 73 -118 -11 137 -33 -71 130 12
5576 12 -93 75 26 -121 41 165 -69 -65 77 -23 -93 61 19 -106 44 108 -82 -33 167 -18 -167 16 131
5599 131 -94 -35 170 -64 -63 103 34 -124 94 78 -124 7 98 -45 -89 162 -2 -99 5 121 -111 -70 81
5622 81 -15 -69 95 -28 -191 -34 90 -112 -28 104 -38 -147 111 33 -141 21 96 -72 -28 104 -99 -128 89
5645 89 86 -80 8 92 -75 -71 155 32 -115 100 100 -88 41 95 -73 -88 143 49 -112 50 107 -94 8 122
5669 122 -36 -89 133 -12 -142 87 47 -154 19 113 -45 -109 125 30 -98 37 78 -69 -49 133 -14 -134
$$ packed form
5496d8k1J26r5J4O7k9o7R2J3j26M2L8k4m2R7J7j36R7K9m1l4R2l7p9J09n2o2RJ53
5525A02j46rJ36j06l7R2P5j32K0P7j43m5J98nj80J57M5j48M5P0r2j6P5l8j04J52
5551D3J3r7K9N9m8q0K05j04q0P4N9j03K6Q8j40n6J68J7j91J07J48j70l8K01j18
5576A2j05J68m9j47J62J24k34MJ42j00p0J54m2j25J50O4j90M9K00j85j49J83J15
5599A31k25N9K05k34JJ66o9j58K18j6k02J31R1j43m4K51j64r7J04J16k32M1J51
5622H1r6n4J64j23j63J57J24k02Q4J32j42j09K58p8j74J62P5j68M4J32k03k9K17
5645H9lj66Q8Q4j67MK26j23j47K15%j88J29N4j68j5K31r4j61J62N7k01J02J14
5669A22j58n3K22j45j30K29m0k01J73R4j58o4K34r5j28J35M1j47K0J82j47j20
$$ plain form
5691 -134 99 65 -104 3 32 -99 -80 111 -12 -90 80 -2 -96 44 67 -114 -53 164 -44 -122 88 80 -101 -31
5715 -31 112 -18 -40 100 11 -114 41 47 -60 -66 99 -36 -28 114 -2 -123 52 56 -82 12 57 -59 -61 30 -24 -92
5741 -92 81 27 -81 -47 108 -42 -48 59 46 -46 10 88 -83 -51 45 -24 -111 68 4 -97 -2 84 -105 -40 65 -21
5767 -21 -38 48 20 -99 11 91 -93 -18 42 34 -111 35 -4 -111 45 89 -60 -14 37 -41 -49 99 91 -61 18 98 -66
5794 -66 -109 58 5 -64 97 71 -59 39 33 -31 -63 35 5 -57 6 19 -42 -13 28 -57 -59 40 47 -79 -44 19 -43 -59 19 9
5824 9 -35 39 22 -46 40 28 23 -24 73 -11 -76 21 9 -46 2 -19 -25 16 67 -44 29 37 9 1 27 19 -28 34 44 -53 -48 -28 67
5857 67 9 -55 -6 -62 -24 8 13 -38 8 45 -50 -4 35 -7 9 29 9 41 6 67 8 -13 -8 0 -29 26 44 -41 -5 29 11 -29
5889 -29 2 50 26 -13 23 -27 29 10 38 34 9 -3 -38 39 11 8 -1 6 13 -45 28 -2 -34 -24 10 27 12 51 -63 -7 42 16
$$ packed form
5691a34K33l4j69J07K9j31J9J91j23p8J70q2r4J40K3j81O1K17k08p8K10qj81P0
5715c1J43j30k2J40q9j25J55Oj07oJ65j35QJ42j16j21J75Mj38R4M5j16kR1n4o8
5741i2J73n4j08L4J55j50oJ07j3r2N6P8j71L2R6o9q7J79o4j01R5Q6j89O5J05q6
5767b1j7Q6k8j19J10Q0j84P5O0qj45J46l9j07J56M4j49M6N1p8qJ48qj52P9Q0j64
5794f6m3J67n3o9J61k6j30R8oo4l2R8l0o2O3J3o1K9M1q5kR9Pj26L5O3o2j6P8j0
5824Im4P4j7o8Q6j2nm7R7q4o5R7j2n5M8k1oM1N1j11P3Qk8qK6qm7O2J0r7NK0R5
5857F7n8o4M9n6L8L2Nn1M6L7r5M6L9m2J6K0k0L2l5O1n9k1NQk9N5J8q5L6L4j8m0
5889b9L1M8k4l9L6n0N6j9K8mk5j2l5P7k8lrPPn8P3l0l2J0L4J7j5L9j14N6M9k6
$$ plain form
5921 16 -48 2 0 39 -45 45 -17 -26 18 23 -25 -16 20 27 6 53 23 -44 34 -16 -27 69 77 -23 -27 65 15 -28 37 7 -25 -16 -19 -26 -3
5956 -3 39 -14 -72 2 -15 -4 17 15 -39 -43 -16 18 11 5 15 -43 -5 9 -34 -34 -38 16 -42 2 38 -37 9 85 -21 -43 51 -10 -60
5989 -60 21 0 -2 -9 43 -57 -30 -4 -23 -63 13 12 -43 -22 51 15 -52 40 -33 -66 -12 -3 -29 -48 29 -52 -37 28 -10 -82 47
6020 47 52 1 -13 54 -62 -53 9 45 -118 5 53 -24 18 65 -49 -74 66 -18 -41 51 45 -75 -40 72 -25 -65 56 13
6048 13 -22 11 27 -17 -58 41 10 -76 28 5 -57 -20 74 -53 -50 81 18 -88 -15 48 -140 -31 59 -20 -66 76 7
6075 7 -60 65 61 -67 -9 51 5 -26 64 8 -92 13 37 -104 -2 91 -36 -57 69 -36 -143 23 53 -86 -84 107
6101 107 -63 -89 73 25 -126 21 96 -91 -37 74 -44 -89 125 69 -83 13 120 -62 -33 122 -1 -87 69
6124 69 103 -95 78 93 -107 -47 64 -37 -82 79 11 -87 -38 83 -32 -65 109 19 -125 82 81 -126 -29 132
$$ packed form
5921A6o4N0kL9q4R0o2rM4Nm8RL6Pk1M7l0o7P8n0j1R6Qj00mR2n0m3O5l0l2RlpK3
5956cM2n3n8P4j7J1K1kn4mK7L4poJ0n8L8J4m3%mN4n8M4L6p5M6P6j06k2R4o1n0
5989f0Q1k1kpN2j00K7K6j9m0P6jn5K1P3l6o7R2p3l3N4Rk6j9P7q1J5O5l8p2J29
6020D7Nn1j4O7j16RO2L6j63J23M8p7M2M7j14k5J40q4k3R2oj20L5J12r7m0J21m3
6048A3l5L3J6m4m1R9l1q6J04k3o2L7R4j27LJ31o3j06P3O3j88J09R0p9m6J42o9
6075Go7J25mj28N8O0m6l1R0n6j00J05K4j41J02R3j27k1J26j05j07J66L0j39KJ91
6101A07j70k6J62m8j51J47P5j87N4J11j18m5K14n6j52R6J07j82K9J55j23q6J56
6124F9L4j98J73J5k00O0J11j01m5J61o8r8M9J21j15l3J74r0j44K07jk07R7J61
$$ plain form
6148 132 -55 -60 51 36 -104 55 131 -104 -9 146 -32 -88 72 30 -126 63 89 -98 -12 80 -1 -59 67 16
6172 16 -90 -5 83 -131 -29 132 -77 -81 63 28 -160 -12 102 -87 -64 98 -8 -86 107 58 -133 19 75
6195 75 -85 -77 82 9 -112 110 84 -93 15 78 -112 -19 57 41 -82 71 71 -113 13 90 -47 -106 91 12 -123
6220 -123 60 66 -124 -9 80 -78 -55 96 -22 -99 6 82 -125 -15 94 -45 -51 76 76 -130 59 91 -49 -44
6244 -44 61 -20 -74 76 46 -66 39 119 -72 -72 37 17 -65 14 21 -55 -15 58 -6 -33 18 -39 -89 25 14 -58 -12 138
6272 138 -40 -27 67 -61 -89 75 13 -64 5 75 -60 -75 99 -38 -82 27 49 -56 -3 82 -85 -41 27 14 -38
6297 -38 -21 44 19 -49 17 51 -50 52 0 -94 -4 54 -10 -11 19 -56 -107 -28 19 -92 -17 77 -11 -46 38 -3 -87 21 -7
6326 -7 -65 44 63 -7 -64 54 -80 3 -4 54 -48 -31 85 14 -41 31 -13 -58 48 25 -12 -45 8 -37 -5 11 -7 -42
$$ packed form
6148A32j87nJ11j5j40J59P6k35R5J55j78n6J60m2j56J89K6j87Q6R2q1n8J26n1
6172A6j06Q5Q8k14J02J61k09mJ44l5j88J48J14j89K3J62j06p8J93m9j91J52N6
6195G5j60QJ59p3j21K22k6j77J08O3j90R3P6j6j23J53%j84J26P7j37n9J97p9j35
6220a23J83Oj90J15Q9j58K3J51j18p7J05P6k07J10J09j39oJ27%k06J89L2j40N
6244d4J05q1n4J50l0j12J05Q0j91%J09k0q2P9Pp6M0P3o4k7N1n7n0J14j1p2M6J50
6272A38j78J3R4j28k8J64o2p7O9P0j35j5J74j37m4J09K2j05N3Q5j67M4O8j3n2
6297c8J7O5k5o8O6L4j01J02n2r4R0N8o4jL0p5n1P9M7j11P5R4q8l5Q4m1q4J08k8
6326gn8J09J9p0n7J18j34Q3pN8j02J7J16p1n5P2m4m5J06k3l7l3N3m5L2J6j8l5
$$ plain form
6354 -42 2 2 -79 -43 40 36 9 -4 -1 2 45 11 -38 -6 80 -8 -45 12 -36 -34 4 -12 10 -28 33 19 30 -2 2 50 -48 21 21 -46
6388 -46 -44 4 -6 -30 24 0 -99 -5 9 -5 9 27 7 -1 -10 -2 16 -5 24 -17 7 30 -22 31 23 -33 -35 14 -24 -37 -33 -12 -3 -28
6422 -28 28 25 5 21 -23 -39 -23 19 -12 16 49 20 -26 -18 12 -1 -81 -8 3 9 21 -17 -63 -9 15 -64 20 -6 -65 13 -5 -14
6454 -14 -1 54 36 -70 -20 11 -31 14 32 3 5 -33 -3 -3 12 15 -19 -13 23 16 -3 7 -29 -33 -44 45 -64 -7 -17 6 -7 35
6486 35 -47 -31 5 100 -26 32 15 41 19 -1 20 -2 -24 25 17 13 -13 29 -79 49 -2 -94 -10 12 -12 7 -12 -3 -10 35 -13
6517 -13 -92 -45 17 -22 10 34 -58 -41 -16 18 -51 7 59 -34 -59 97 -49 -34 26 68 -48 -20 50 2 -36 65 -10 -49
6545 -49 2 45 -76 -32 21 -14 -62 9 -1 -51 22 94 -87 -39 111 -12 -55 63 -5 -138 11 64 -64 -1 108 14
6571 14 -64 60 30 -87 -4 90 -76 -8 75 -24 -142 42 7 -79 14 78 -54 -103 56 -70 -75 48 43 -85 27 119
$$ packed form
6354d2M4%q1L6Q3mk7j3LLM3l4m9L2Q6q8l7N7m8KL8j6K2l8O1j4J1l2MM8r8O9%o7
6388d6KM8j0k4N4k4r9R4J4j4J4J8k0qrQJ8k1K9m1K4K3n2N3qn6kM9l8j3MK1Rk5
6422b8N6lk0J6m4j6J6M2l1K8L3k9m6QL0j3q0P3J1OJ2l8m6N4K4p9Q4k6n9P8j8r
6454a4J3N5j8j06N0L1m2M5J8k9Kl8L0%J5Ll4OL6pj9J0l6mj1Q9j09N7j0K3j3M2
6486C5q2J6L6R5j26N8j7K6k2k0K1k2k2M9qmk6M2j08J28n1r2Q4K2k4J9j9RpM5m8
6517a3p9M7O2l9L2K4r2J7K5L4o9N8N2r3k5J56j46J5O0M2j16K8P0m8l8J01p5l9
6545d9N1M3j21M4N3l5m8P1j0n0P3P2j81M8J50j23m3J18o8j33J49N3j28O3J09r4
6571A4p8J24l0j17Q3R4j66O8Q3r9j18J84l5q6R3O4j32m9J59j26nJ23nj28J12R2
$$ plain form
6597 119 -18 -70 92 -16 -78 28 50 -60 32 114 -50 -90 117 -1 -149 29 70 -93 5 70 -22 -93 123 88
6621 88 -119 7 93 -80 -76 55 -17 -35 59 32 -87 28 29 -45 3 82 -83 -79 53 10 -120 9 65 -27 -66 101
6647 101 -34 -109 58 32 -97 4 75 -41 -71 71 -17 -116 103 11 -73 11 117 -73 -67 152 26 -95 37 93
6671 93 -115 -45 135 -44 -101 48 -16 -105 31 40 -191 -45 93 -41 -98 103 -8 -91 80 76 -106 -14 43 -45 -82
6696 -82 99 25 -126 18 33 -85 -60 128 -61 -51 79 30 -88 6 87 -81 -33 100 -40 -96 78 37 -112 -44
6720 -44 173 -71 -29 113 -25 -98 70 19 -103 12 108 -88 -83 67 9 -148 52 51 -127 0 80 -46 -80 94
6744 94 -8 -126 69 55 -49 -29 79 -44 -79 66 -10 -167 9 68 -80 -28 84 -9 -18 50 -66 -84 32 76
6768 76 -61 -37 79 -15 -74 -4 36 -55 -11 117 -45 -35 81 18 -3 81 31 -13 14 36 -30 14 46 22 -74 54 13
$$ packed form
6597A19j37n2J62j08o2J06K2j10R2Q2j64m0K07j18j48J78M1j63R8O5r2p1K16l5
6621H8k07J26Q6j73MJ31p2j8R4k7j19J15Jp4M8P9j65MJ32m3j30J29N6r2l9J67
6647A01j35p5J67k6j29J01P1j16l0J42q8r9K19r2q4Q4J06j90OK19j26j21J32N6
6671I3k08P0J80j79n7J49o4q9J36Rk31J46J38j34n7K01j11q3J71mj82R2N7q8l7
6696h2J81p4j51J44J5j18K5J88j89J0J30m9j18R4Q1j68M8J33j40n6J74m1j49O8
6720d4K17k44M2J42j38p3J68n1j22J15R6j96NJ50n8j57K00jj78J27Q0j26l4J74
6744I4j02j18J95j4j04K0J08j23l5J45p6j57J76N9j48N2J12r3rO8j16j8J16M4
6768G6j37K4J16r4n9P0M0r1M4J28j62J0J16o3k1Q4n0m4K7K2o6M4L2k4r6J28m1
$$ plain form
6795 13 -70 -17 50 8 -61 28 3 -62 29 53 10 -21 35 15 -40 32 9 -73 43 11 -33 -17 12 -2 -52 46 -18 -14 -16 13 -30
6826 -30 -37 19 19 -16 56 24 -41 -6 28 11 -57 -7 -20 -51 14 36 -6 25 51 -63 -31 62 -38 -57 31 14 6 -48 16 -58 3
6857 3 19 23 -7 36 39 -33 -15 -6 10 -44 28 -11 17 20 63 -20 -11 67 21 -5 62 30 -63 -24 29 17 -12 68 -59 -10 35 18 -33
6890 -33 -70 31 -24 4 19 14 -17 55 51 7 5 29 44 -60 -12 53 5 13 39 -37 12 24 -23 -21 -5 25 0 9 -15 14 35 16
6922 16 16 -8 61 33 -14 -4 31 8 1 9 32 -7 -4 -44 22 2 4 -43 -25 70 -47 -93 -47 14 -49 -34 19 -3 38 47 -1 7 -15
6955 -15 57 -18 1 35 30 10 31 6 6 7 52 -76 6 51 -44 -3 33 27 -60 -10 46 -27 -4 -19 -37 -55 19 -28 -5 8 -26 -73
6987 -73 -14 27 -19 -19 3 10 -62 -5 43 15 -6 -6 11 -4 26 20 -50 -34 27 -13 -9 24 4 -39 17 22 -68 -38 99 -86 -15 27
7019 27 -39 -8 7 1 3 0 67 -10 -23 69 -8 -55 27 25 -79 -45 26 -40 -20 74 -47 -62 9 66 -74 -28 32 -22 -59 90
$$ packed form
6795A3q3N3O7m2o9Q9k5o5R1K4m3l1N6k0n5P2k3q2J16l2m4J6K9j4n0R8o4MkK9m3
6826c0pN6%l5P2l2o5L5L4j7o8N0j3l1O5K2m2L1K6j14L2R3j00j9Q8j7qn4O4p4O1
6857CJ6Ml0M3Lp2J8RJ6n4P2l9K8LM3q3RP8m6k6O7l2r3L9N3j2k9Q0j27M9M5j7n1
6890c3l7J01n5K8J5nl1P2mm4kK4J5j04M8O5m8QK6p6M9J2m7KJ6L0k5Rk4K9K1j9
6922A6%k4O9k8m7J0L5k3pQK3l9Lm0O6k0Km7J8R5j17m6M6O1o3J5N3k2M1Rm8Qk2
6955a5P2p5J9L4nk0K1k5%JM5j28Q2M5r5M1L6oq7N0N6p3K3j5j8j8P4m7K3J3l4m7
6987g3N9M1m6%K2Pp2N7M8k8k1%J7j5L0op0J6O1m0ML3k0m3N6Nr0L0J37j85P1M2
7019B7o6L1J5oKlO7p7j3R2p7m7Q2kj04L4P1o6K0R4j21j5P1N7j40M6O0n4l7J49
$$ plain form
7049 90 43 -57 20 11 -124 5 59 0 -26 33 -17 -73 50 5 -87 -19 22 20 -31 -28 21 -63 46 2 -65 -37 41 -37 -6
7078 -6 20 23 -66 22 28 -32 8 66 -58 -87 54 44 -73 36 92 -84 -24 27 -39 -79 49 124 -125 6 84 -101 -15
7105 -15 70 33 -50 19 26 -48 -8 99 -86 -60 80 -4 -78 54 40 -5 24 82 -19 -76 55 45 -95 60 77 -76
7131 -76 -2 49 -48 -108 48 15 -92 44 -15 -99 -32 59 -20 -103 -12 -12 -127 36 44 -66 -6 89 -20 -45 62 17 -98
7158 -98 35 33 -46 -60 144 1 -67 60 30 -51 -39 94 -66 -34 112 -8 -69 70 6 -83 6 63 -37 -25 70 16
7184 16 -43 53 27 -123 2 65 -48 -72 71 1 -93 44 34 -48 -37 92 -36 -90 70 -19 -83 68 94 -65 9
7209 9 75 42 -15 101 34 -111 23 70 -67 -36 107 -40 -37 47 82 5 52 40 -36 -79 70 -32 -44 52 11 -105 -19
7236 -19 86 4 -41 100 3 -120 16 18 -58 -22 69 -109 -83 70 6 -45 51 49 -12 -42 74 -25 -23 7 28 -50 40 59
$$ packed form
7049I0m7j00P7rj35J29N4n9k6N9n0n6J23m5r2O8M1kn1LM9q4J09m4o7K8P8p8L1
7078fK6Lq9Q8Oo0M0N8j24k9J41j0j17J09N6j76O0N1o6m0J28P5k49J31P8j85Q6
7105a5Q5l7q3O9Pp4M0J07j85K6J40q4p4J32j4m5K9N8j01n7J31j0j40J55J7j53
7131g6P4N1r7o0J56l3j07J36n9q4O7R1p9q3R1%j15J63Qj10O0R5j09k5J07m5j15
7158i8J33kp9j4K04j43o8J27l0q1J2J33j60L2J46j20o1J39o4q9Q9N7j00J2R5n4
7184A6n9R6k6j50J25O3j13k4J43p0r4J37j0q2J1J29j28n4J60q9o4J51K6j59P4
7209IO6l3n7J16o7j45J34M7j37L1J43j47LQ4L5p7M7j2p6m3J49j02j2R6m1j16Q6
7236a9J05q2m5J41r7j23J36Kp6L6R1j78K6J53o4n1R6ko1l0J16r9KL0K1p8R0J9
$$ plain form
7264 59 -67 -56 70 -46 -24 67 21 -144 41 37 -67 1 37 -16 -51 31 5 -88 18 75 -57 -16 126 23 -52 36
7290 36 -9 -34 19 18 -58 12 35 3 -88 0 -48 -36 -3 57 -76 32 44 -14 -39 41 8 -43 35 71 -57 -33 50 56 -54
7319 -54 -27 25 -27 46 95 9 -71 13 37 33 51 28 -28 -33 69 33 -28 45 29 -45 -13 23 -6 40 62 15 -26 47 32 -29 -23
7350 -23 26 -10 -3 71 48 -7 1 -5 -43 -9 31 -25 -31 16 32 -2 51 53 -65 -30 18 13 -13 9 14 -22 48 92 -65 -15 103 12
7382 12 -27 -1 9 -38 16 8 -63 -30 -15 -40 10 4 18 -61 27 21 -49 -47 20 -48 -46 -32 49 -25 -52 -32 -9 -36 17 0 45 62 34
7415 34 -26 17 9 6 20 21 -9 -45 6 43 -20 -22 2 -31 21 -1 -2 29 -54 14 -4 -12 19 -3 -69 -4 30 -74 -3 2 -16 -66 6
7448 6 -14 -49 8 34 -5 8 12 10 -21 60 13 -18 43 4 -12 -59 50 -13 -5 -23 8 -39 -18 24 -18 -34 22 -19 1 -7 13 -8
7480 -8 9 10 -29 -23 -4 -3 -39 41 16 -51 14 -22 -20 -58 40 -11 -58 70 15 -55 -18 17 -60 10 -1 7 -32 -9 -2 -40 22 8 10 -51
$$ packed form
7264E9j26J1J26j16K2R1m6j65J85mj04O8L6n3l5Q2k6r3J06N7j32M1J42j03p5Q8
7290C6m5k5N3jp6P0K3l2r1Q8m8J2L3O0j33J08J2n8k5Q0l3n1P8L6j28K4Q3Oj10
7319e4K7N2n2P3M9q6q0Q4K4mJ8k3n6nJ02l6o1P3j6p4L2L6k9M6K2m7m1P3j5o1O
7350b3M9l6PP4k3n5Qol8L4M0n6oM7J6l4N3Kj18L5M8nk6K2Nl6P0M4j57N0J18r1
7382A2l9K6J0m7N4qp1L3J5k5N0oJ4p9Q8op0KO7o8KJ4Q1p4k7K0K3k7N3j7M5J7k8
7415C4o0M3qlJ4Jl0l6N1L7o3kK4l3N2k2jL1q3O8j8qL1k2o6O5L4j04P1Nj8n0P2
7448Fk0l5N7K6l9J3Mkl1Q1m7l1O1l9j6m7J09o3Qj8L1m7K1M2m2j6N6m1K0qK0k1
7480hJ7Jl9OJ9Jl6Q0k5o7O5l6Kl8R8n1m7J28n5p0L7L5p7P0j1Ql9K3Pl8O2j4Ko1
$$ plain form
7514 -51 44 33 -53 27 5 -46 -21 2 5 -24 -18 7 -92 -24 11 -29 6 19 -12 13 -13 -30 -45 34 10 -48 57 36 16 -97
7544 -97 29 -2 -48 44 4 -75 -24 -23 9 -24 4 -31 -62 23 16 -64 -22 6 -15 -23 4 4 -86 84 -9 -56 1 71 -63 -38 51
7575 51 22 -43 40 3 -53 -30 94 -67 -23 20 3 -37 20 24 -38 -71 40 -31 -10 74 -1 -73 -19 52 -6 -1 29 -15 -101 39
7605 39 1 -42 -5 59 -79 -39 -11 7 -91 86 -7 -85 33 57 -39 -31 76 -22 -67 -5 47 -89 -36 92 -55 -54 67
7632 67 -24 -69 17 59 -48 37 58 -49 -28 92 -54 -9 30 22 -63 -1 67 -17 -33 31 -28 -62 29 31 -88 -46 97 -8
7660 -8 -85 69 50 -94 -26 84 -82 -40 94 -48 -64 39 52 -56 58 65 -61 7 38 -37 -59 84 16 -92 -4
7685 -4 98 -76 -19 90 -3 -96 34 49 -102 13 44 -46 -66 50 5 -91 12 50 -84 -1 31 -53 -68 68 11 -49
7711 -49 87 46 -80 2 65 -23 -52 77 16 -12 -21 74 -71 -9 89 6 -122 79 18 -95 -6 43 -55 14 5 -57 -83 65
$$ packed form
7514e1R5j1q6Q0k2n1K5K3Lk9OK5r9O8L5m0L5J3l1K5k6j7j5P9k4n8J05k1k0j13
7544i7J26l1m6R2m0p9N1JL2l3K8l5l1Q5pq0M2K8k1qK7%r0J70r3m7N7P0j34K5Q9
7575E1k9o5Q3l7n6K3J24j61M4M3j7m0N7Mo2l3J11p1K1Q4p5p2N4P1n8NL0m4q6J40
7605C9l8m3L7O4j38M0K8J8r8J77r3p8J18K4r6QJ07r8m5O2N2j36N3J28j47JJ21
7632F7r1m5Q6M2j07Q5K1j07K1J20j46M5L9qq5O2O8q4j6O4n9l4R1Kj19M2J43j05
7660hp7J54j9j44O8J10j66M2J34j42j6J03J3j08J14Pj26O8L1p5k2J43o8j08Q8
7685dJ02j74N7J09r3r3J30J5j51J15L1r0k0J16m5r6J03L8j34Q3L2q4j5J36n7o0
7711d9J36m1j26Q2O3q8k9J29o1k8rR5j45O2R8q3j28K01o1j13Q9M9r8O9ro2k6J48
$$ plain form
7739 65 -11 -87 41 71 -25 -13 25 5 -14 79 11 -108 -23 70 -20 -96 66 -7 -93 56 80 -64 -11 37 -49 -83 59
7766 59 16 -35 53 13 -53 -73 51 -75 -70 66 -16 -28 18 -45 -48 -8 10 16 -54 11 -32 -106 -21 59 -44 14 51 -34 4 52
7796 52 2 -62 11 46 -41 -9 7 0 -83 24 51 -17 45 26 -21 -6 4 -20 -28 89 14 -14 11 48 -49 -36 69 14 -78 9
7826 9 51 -48 -14 6 0 42 31 -36 27 -5 71 -43 -20 -17 -46 -7 11 9 -89 32 22 -41 -9 43 39 3 -10 8 -24 -3 -64 -39
7858 -39 12 -9 42 31 0 24 -43 -2 29 -53 -33 -10 -22 -32 -81 10 -7 -11 48 28 -21 -4 -12 -32 55 45 -1 -8 1 19 28 8 -8
7891 -8 -42 10 -8 -23 -16 -59 -8 -16 -10 22 -38 -17 39 -3 -17 -6 -60 5 -32 -14 -53 -39 -7 24 -19 -23 -45 -45 12 -7 -43 -45 -10 -28
7925 -28 -20 -9 13 -13 13 -28 -79 9 -51 -18 -33 -26 11 -56 12 47 -9 -1 16 -4 -45 62 39 -24 -25 -38 -10 -66 9 25 19 16 20
7958 20 35 -19 25 -42 22 25 9 -37 -32 48 5 29 2 -71 7 46 50 23 -17 -29 -19 12 3 -31 -18 0 18 -1 46 -28 39 4
$$ packed form
7739F5p6p6J28L0r6J2L8k0j9R3o8j19Q5R3r0p6J62p3q6J49K4j44N3M8q6l4J42
7766E9m3n1Q8m0o6k0J24j26NJ36q2j2M6o3lM0J8Op0O5m3p4Q5Q0j03N8L7q5L8M8
7796E2n0o4P3L5q7L2J6pq3J07K7o8O2j9m7J5J0k4qJ17p5k8K5L7r7J3J05n5r2Q7
7826IM2r9L4K0oM2j1o7O3l2P6j14K3Lk9L9J8kr8J21j0o3L2N2ml6j3J8l2K1o1K5
7858c9N1k1N1j1l1K4o7M1L1q2K0K3j2j0m9R1j7mN9k0m9J7qk0Q7j0m6pRJ8Rk0j6
7891hl4N2j8j5Pm3N1qOL2o0K1N6m2j4J1n4O5l7J8l9J4L2L1m3mk2%N7j9l6kL5j8
7925b8QJ1K2k6K6m1n1Q8o0L3j5PL7o7O8L5n6QJ7k0m1J07k3o3jj3K8n6P5J6olM
7958B0J5n4M4o7O4Lj6m6NQ0m3K4k7p3P8L9Mk7m0j2J0L1rl4J3J8J8j9M7p4O7l5
$$ plain form
7990 4 40 -38 -43 -29 9 -46 19 22 -4 -19 -19 -43 -18 -10 10 -26 -12 44 -62 -3 49 17 15 21 -76 -25 -45 73 -30 -24 28 -30 -36
8023 -36 -10 23 -39 -18 -6 -67 39 9 -3 -78 12 40 -37 -40 -12 -22 3 -18 -20 -71 8 72 -18 -11 34 -3 -5 20 -61 -22 35 16
8055 16 -51 15 -38 -9 -29 45 7 -82 40 63 -69 -27 55 8 -19 27 36 -4 -3 -5 -22 35 21 -46 -29 52 47 -49 74 -3 -86
8086 -86 -4 48 -17 -1 -11 -17 -29 -8 -3 -44 33 38 -8 -43 -10 56 -95 23 50 -40 -12 55 -15 -13 67 9 -20 -19 29 -26 9 100
8118 100 -16 12 31 0 -19 -19 10 -51 6 4 -92 -35 43 52 -47 -1 60 -90 -28 58 4 -40 97 8 -73 30 65 -39 -21
8147 -21 97 -18 -49 54 -9 -79 -13 49 -45 -68 18 -46 -60 21 39 -39 -9 30 -24 -90 19 67 -20 -23 11 -32 -15 50 -70
8176 -70 -55 109 -21 -66 27 78 -71 -26 16 -49 -59 55 47 -65 12
$$ packed form
7990DL6p8nJ4L8n5O5Lk6j5%k4K5QK0l6J4N6j06N9N2l2kOr7N1k0J18j03ON2n8o
8023c6K6L3o2K1J2o1J06l0j2p5R0K8p7lK8j0K5k1kn1P9O4r0PM5l7kK5q1L9N7j9
8055A6o7O6n3K9k0P4l8q9J22K3j32M2Q2m7k7M6Rm0Jkj7N7j4o7J7Q1nr6J23p7q3
8086h6Q2N2o5J6j0oj2K1Nm1P7Nm6l5L3O6j51J18K7r0K8O7p0KQ0n8k9JM8n5L5R1
8118A00j16K8J9l1j9%K9o1N7kr6N7P8Rr9M6O1j50O2Q6n4m4J37q9q1J03L5j04J8
8147b1J18j15l1J03o3p0O6O2r4k3Q6o4j4Q1J8p8L0L9n4o6J09M8q7lL4m3J7O5j20
8176g0J5J64j30m5R3N1j49M5M2o5j0J14qj12P7
8191A2
$$ Imaginary data points
##PAGE= N=2
##DATA TABLE= (X++(I..I)), XYDATA
$$ plain form
0 0 0 0 0 0 0 0 0 0 0 0 0 0 0 0 0 0 -4 4 0 0 -6 4 -5 4 -4 6 -6 4 -4 5 -6 9 -6 5 -6 7 -7 5 -2 3 -1 0 2 -5 7 -7 9 -13
48 -13 16 -18 17 -19 21 -20 17 -9 -3 17 -41 83 -144 239 -388 632 -1060 1852 -3475 7455 -20811 143055
70 143055 839052 102311 -222241 355848 -311148 -838605 278141 680607 -143459 50806
80 50806 342205 -586284 -625429 499280 402409 -186721 283012 185713 -740708 -344358 556087
91 556087 151884 -98273 435876 -39532 -772573 -65819 474208 -69105 81087 498335
101 498335 -298153 -685702 176481 283110 -181619 312094 418062 -514736 -463715 301340
111 301340 39036 -131094 502077 206089 -603150 -194657 265605 -158149 33390 564602
121 564602 -36135 -546508 17162 127889 -242838 219396 503549 -225710 -400602 131779
$$ packed form
0@%%%%%%%%%%%%%%%%mQm%oJ0rRqJ0j2J0qRj1J5j5J1j1J3j4J2pNmJKpJ2j4J6k2
48a3K9l4L5l6M0m1L7k6OK0n8J24k27L83o27J020j692K912n327J0930k8266J63866
70A43055O95997p36741l24552N78089o66996n27457J116746M02466q24066J94265
80E0806K91399r28489l9145J124709r6871n89130M69733r7299r26421L96350R00445
91E56087m04203k50157N34149m75408p33041P06754N40027n43313J50192M17248
101D98335p96488l87549Q62183J06629m64729M93713J05968r32798N1021P65055
111C01340k62304j70130O33171k95988q09239M08493M60262m23754J91539N31212
121E64602o00737n10373N63670J10727l70727M62234K84153p29259j74892N32381
$$ plain form
131 131779 -38516 -221859 372873 360005 -339022 -215333 151613 -196505 -120985 468060
141 468060 173581 -355179 -28454 78349 -300693 40376 469243 -16851 -271856 100562
151 100562 -60674 -306389 204427 367021 -150319 -128419 130753 -199268 -217805 308311
161 308311 214639 -188075 9701 75571 -280502 -85292 328809 69457 -149573 101943
171 101943 -18350 -294567 41114 280656 -40799 -68484 143428 -114668 -250555 138816
181 138816 186645 -102818 28166 127463 -192577 -158582 188574 71690 -101456 111477
191 111477 57605 -226406 -46935 174673 -24502 -43296 149831 -30763 -201440 40717
201 40717 111311 -70848 30819 133290 -97439 -138435 81424 37383 -69372 86270 86050
$$ packed form
131A31779j70295j83343N94732j2868o99027J23689L66946l48118P5520N89045
141D68060k94479n28760L26725J06803l79042L41069M28867m86094k55005L72418
151A00562j61236k45715N10816J62594n17340K1900K59172l30021j8537N26116
161C08311r3672m02714J97776O5870l56073J95210M14101k59352k19030K51516
171A01943j20293k76217L35681K39542l21455k7685K11912k58096j35887L89371
181A38816M7829k89463J30984R9297l20040L3995L47156j16884j73146K12933
191A11477n3872k84011J79471K21608j99175j8794J93127j80594j70677K42157
201D0717P0594j82159J01667J02471k30729m0996K19859m4041j06755J55642k20
$$ plain form
212 86050 -126946 -68460 84509 -20363 -40725 114473 31099 -126213 -7995 62450 -57325
223 -57325 861 115795 -22629 -100120 35535 22115 -68218 45276 88937 -61352 -54505
234 -54505 50958 -20387 -48655 73188 44001 -70238 -10189 36539 -44449 -14079 73189
245 73189 4313 -53103 15862 11945 -44693 13435 54532 -18195 -29912 23408 -6205 -32593
257 -32593 27060 31665 -27059 -11311 20297 -16861 -17272 30645 10919 -25462 3961 12091 -20557
270 -20557 -2083 25117 -5282 -16145 11900 2192 -15514 8067 13060 -11602 -4988 10215 -3376
283 -3376 -5682 9077 1907 -8869 954 4774 -2671 163 4065 -2392 -4549 861 2507 563 -135
298 -135 -573 -1696 -2240 24 3675 2464 -1776 -1800 -431 -1684 317 4260 1623 -2867 -1011 740
$$ packed form
212H6050k12996N8486J52969j04872k0362J55198q3374j57312J18218P0445j19775
223e7325N8186J14934j38424p7491J35655j3420r0333J13494M3661j50289O847
234e4505J05463p1345k8268J21843k9187j14239O0049M6728q0988L0370Q7268
245G3189o8876n7416O8965l917n6638N8128M1097p2727j1717N3320k9613k6388
257c2593N9653M605n8724J5748L1608l7158m11M7917j9726l6381K9423Q130l2648
270b0557J8474K7200l0399j0863K8045r708j7706K3581M993k4662O614J5203j3591
283c376k306J4759p170j0776R823L820p445K834L902o457k157N410J646j944o98
298a35m38j123n44K264L651j211m240k4J369j253K001L943k637m490J856J751
$$ plain form
314 740 -1462 775 4138 -412 -4215 333 1847 -1521 1028 3532 -2324 -4167 1694 1565 -1610 1428
330 1428 1601 -3325 -1817 2497 685 -717 884 -489 -1842 265 2063 1445 -678 -1999 13 1017
346 1017 -885 1700 3588 -3369 -4564 3962 2120 -3885 3378 3403 -8829 -2759 9498 -843 -5268
361 -5268 7652 -693 -14396 3956 13114 -6979 -3162 11931 -8456 -15817 14346 11612 -13361
374 -13361 3642 12093 -19799 -10747 24759 3060 -16321 14650 5391 -31069 1688 30159 -10519
387 -10519 -11521 25507 -9302 -36360 19311 25948 -23900 3363 29976 -30166 -30641 36894 10512
400 10512 -29723 25711 22564 -51135 -12770 46460 -12063 -21543 47702 1259 -63208 12612
412 12612 40181 -34152 2237 59740 -29897 -59392 37477 17423 -45604 36379 54620 -60899
$$ packed form
314G40k202K237L363m550l803M548J514l368K549K504n856j843N861j29l175L038
330A428J73m926J508M314j812j402J601j373j353K107J798o18k123j321K012J004
346A017j902K585J888o957j195Q526j842o005P263K5j2232O070J2257j0341m425
361e268J2920q345j3703J8352R158k0093L817J5093k0387p361L0163k734k4973
374a3361J7003Q451l1892R052L5506k1699j9381L0971r259l6460L2757K8471m0678
387a0519j002L7028l4809k7058N5671O637m9848K7263K6613o0142m75O7535k6382
400A0512m0235N5434l147p3699L8365N9230n8523r480O9245m6443o4467P5820
412A2612K7569p4333L6389N7503q9637k9495R6869k0054o3027Q1983J8241j15519
$$ plain form
424 -60899 -38289 51398 -15578 -37595 70799 30150 -80769 -5418 45784 -48493 -8122 94039
436 94039 -8651 -81652 28461 18754 -68977 37255 96433 -50832 -60682 49768 -24852
447 -24852 -66283 86745 73440 -81917 -21586 47621 -72741 -36096 124660 29108 -89476
458 -89476 23709 18394 -107519 16704 136611 -23295 -67836 57402 -33339 -114271 78064
469 78064 115862 -65527 -21873 63689 -93416 -87241 128462 68502 -80597 33298 35906
480 35906 -142782 -32883 150769 9894 -60848 79001 -20716 -163845 34818 136898
490 136898 -41170 -10834 97620 -90893 -147027 96358 90721 -66484 54294 78936 -154656
501 -154656 -95673 131954 26475 -54346 114183 23978 -192272 -24236 128395 -35035
$$ packed form
424f0899K2610Q9687o6976k2017J08394m0649j10919P5351N1202r4277M0371J02161
436I4039j02690p3001J10113r707q7731J06232N9178j47265r850J10450p4620
447b4852m1431J53028j3305j55357O0331O9207j20362L6645J60756r5552j18584
458h9476J13185n315j25913J24223J19907j59906m4541J25238r0741q0932J92335
469G8064L7798j81389M3654Q5562j57105O175K15703n9960j49099J13895K608
480C5906j78688J09899J83652j40875p0742J39849r9717j43129J98663J02080
490A36898j78068L0336J08454j88513n6134K43385n637j57205J20778K4642k33592
501a54656N8983K27627j05479q0821J68529r0205k16250J68036J52631j63430
$$ plain form
511 -35035 -4891 148714 -52599 -190459 45237 85448 -71685 68333 143621 -127376 -147372
522 -147372 89520 17008 -67882 141144 96378 -177278 -76598 94409 -51978 -22023 188656
533 188656 19719 -187930 -3165 58776 -96383 52161 195322 -62235 -157748 48808
543 48808 -5007 -101327 131847 159822 -124797 -96831 64263 -76828 -65853 193565 92506
554 92506 -150559 -23251 39956 -133787 1041 217591 11039 -132555 39894 -17649
564 -17649 -155645 81901 195968 -61051 -78111 70206 -90626 -133308 152289 136364 -100398
575 -100398 -6984 56579 -154037 -73197 190308 59397 -95540 56677 4633 -187349 5521
586 5521 185760 -11458 -51788 92819 -66493 -179659 78682 141725 -56101 12959 90399
$$ packed form
511c5035L0144J53605k01313j37860K35696M0211j57133J40018P5288k70997j9996
522a47372K36892p2512q4890K09026m4766k73656J00680J71007j46387K9955K10679
533A88656j68937k07649J84765O1941j55159J48544J43161k57557r5513K06556
543D8808n3815r6320K33174K7975k84619K7966J61094j41091J0975K59418j01059
554I2506k43065J27308O3207j73743J34828K16550k06552j43594J72449n7543
564a7649j37996K37546J14067k57019j7060J48317j60832m2682K85597j5925k36762
575a00398R3414O3563k10616Q0840K63505j30911j54937J52217n2044j91982J92870
586E521J80239j97218m0330J44607j59312j13166K58341O3043j97826O9060P7440
$$ plain form
597 90399 -132687 -133108 125725 73947 -63758 76019 50494 -174759 -62878 135651 5117
608 5117 -34479 117769 -12635 -181512 8761 108584 -43567 20157 126270 -79214 -152177
619 -152177 61767 55194 -59614 81424 99620 -129762 -96157 83620 -6133 -40910 127968
630 127968 45640 -149769 -30858 70766 -54384 4653 143800 -18700 -134776 23379
640 23379 31220 -74164 59993 125595 -72493 -92759 51243 -18675 -62130 105110 81930
651 81930 -99600 -39326 48238 -61004 -26643 126226 28279 -96192 8806 21330 -83833
662 -83833 18439 119524 -20575 -68741 39257 -17095 -81904 59748 89596 -52676 -28372
673 -28372 45592 -54251 -56933 86332 46516 -60997 11952 28664 -78306 -18286 91063
$$ packed form
597I0399k23086m21K58833n1778j37705J39777k5525k25253J11881J98529j30534
608E117l9596J52248j30404j68877J90273R9823j52151O3724J06113k05484p2963
619a52177K13944o573j14808J41038J8196k29382L3605J79777q9753l4777J68878
630A27968q2328j95409J18911J01624j25150N9037J39147j62500j16076J58155
640B3379P841j05384J34157O5602j98088k0266J44002o9918m3455J67240k3180
651H1930j81530O0274Q7564j09242L4361J52869r7947j24471J04998J2524j05163
662h3833J02272J01085j40099m8166J07998n6352o4809J41652K9848j42272K4304
673b8372P3964r9843k682J43265l9816j07513P2949J6712j06970O0020J09349
$$ plain form
684 91063 3918 -46169 39623 -2542 -81695 20038 73591 -25753 -16640 47280 -34696 -65136
696 -65136 45793 42454 -36508 14241 36323 -56281 -36692 53986 10001 -29614 35909 14086
708 14086 -62033 -6650 46202 -13679 -11191 43548 -10478 -53324 16426 28247 -24390 10088
720 10088 37656 -29819 -35379 27616 7392 -22291 26550 22376 -38495 -14397 26565 -9543
732 -9543 -11268 33404 3828 -35966 3453 17276 -18203 2579 30210 -11327 -25387 13683
744 13683 5229 -17756 13436 20105 -18950 -11874 15355 -4902 -11238 18158 8007 -18917 -372
757 -372 11165 -10246 -3335 16664 -1647 -13682 6137 4821 -10530 2701 11093 -6585 -6455
770 -6455 7680 -579 -7379 5449 4744 -6954 -538 6060 -3120 -3443 4957 423 -4545 2279 3224
$$ packed form
684I1063q7145n0087Q5792m2165p9153J01733N3553r9344R113O3920q1976l0440
696f5136J10929l339p8962N0749K2082r2604J9589R0678m3985l9615O5523k1823
708A4086p6119N5383N2852n9881K488N4739n4026m2846O9750J1821n2637L4478
720A0088K7568o7475n560O2995k0224k9683M8841m174o0871K4098M0962l6108
732i543j725M4672k9576l9794L9419J3823l5479K0782K7631m1537j4060L9070
744A3683q454k2985L1192O669l9055P076K7229k0257o336K9396j0151k6924J8545
757c72J1537k1411O911J9999j8311j2035J9819j316j5351J3231Q392j7678J30
770f455J4135q259o800J2828p05j1698O416O598r180l23Q400m534m968O824R45
$$ plain form
785 3224 -3027 -965 2572 -1173 -1651 2421 1070 -1863 -365 398 -706 68 1278 425 -867 -1181
801 -1181 -193 720 51 251 1077 -706 -2106 724 1763 -889 -6 1730 -1476 -2027 2296 1396 -1925
818 -1925 717 1597 -2726 -819 3464 -289 -2509 1789 569 -3215 979 3200 -1968 -1899 2112 -637
834 -637 -2258 2518 1817 -2862 -544 1821 -1420 -642 2888 67 -2615 489 1100 -1058 579 1857
850 1857 -915 -1734 404 582 155 600 193 -823 -1129 -279 1102 1045 -580 -445 104 -1575 -557 2900
868 2900 832 -2390 456 805 -3126 452 5003 -1060 -3441 2651 -48 -4825 3215 5682 -4293
883 -4293 -2365 4859 -3246 -5348 7290 3799 -7643 1300 5578 -8170 -3097 11250 -761 -8565
897 -8565 6953 2722 -12720 2460 12478 -7117 -5026 12356 -4069 -14599 10076 9283 -12745
$$ packed form
785C224o251K062L537l745m78M072j351k933J498P63j104P74J210q53j292l14
801a181R88R13o69K00Q26j783j400K830J039k652Q83J736l206n51M323r00l321
818a925K642Q80m323J907M283l753k220M298j220l784M194K221n168O9M011k749
834f37j621M776p01m679K318K365l241P78L530k821k682L104O11k158J637J278
850A857k772q19K138J78m27M45m07j016l06Q50J381n7j625J35N49j679J018L457
868B900k068l222K846L49l931L578M551o063k381O092k699m777Q040K467r975
883d293J928P224q105k102J2638l491j1442Q943M278j3748N073J4347j2011p804
897h565J5518m231j5442J5180J0018j9595K091J7382j6425j0530K4675p93k2028
$$ plain form
910 -12745 2847 14220 -13405 -11667 16676 1475 -14101 13241 10050 -22239 -3565 18980
922 18980 -8798 -8919 22626 -396 -26778 7479 15216 -17289 2931 26854 -14380 -24280 17533
935 17533 4837 -20196 18477 23082 -27714 -14414 22346 -9404 -15027 32944 11015 -35807
947 -35807 177 18980 -23052 -1467 41297 -6996 -34819 15088 6565 -30631 18329 39808
959 39808 -25524 -23761 24208 -12386 -27754 39042 27420 -38054 -5071 22580 -32225 -13237
971 -13237 53232 6769 -39017 14734 8690 -45648 9800 55208 -15781 -27264 28449 -14106
983 -14106 -46909 34561 43783 -32278 -6195 30072 -38858 -34386 53578 22340 -36486 18025
995 18025 17544 -58555 -10774 60829 -2872 -26186 37543 -6732 -66537 17088 53013 -23836
$$ packed form
910a2745J5592J1373k7625J738K8343j5201j5576K7342l191l2289J8674K2545
922A8980k7778j21L1545k3022k6382L4257P737l2505K0220K3923m1234r900M1813
935A7533j2696k5033L8673M605n0796J3300L6760l1750n623M7971k1929m6822
947c5807L5984J8803m2032K1585M2764m8293k7823M9907q523l7196M8960K1479
959C9808o5332J763M7969l6594j5368O6796j1622o5474L2983K7651n4805J8988
971a3237O6469m6463m5786N3751o044n4338N5448M5408p0989j1483N5713m2555
983a4106l2803Q1470R222p6061K6083L6267o8930M472Q7964l1238n8826N4511
995A8025m81p6099M7781P1603o3701k3314O3729m4275n9805Q3625L5925p6849
$$ plain form
1007 -23836 -3409 45264 -36421 -58955 41398 31761 -33211 25357 36564 -63203 -36709 54611
1019 54611 3644 -26349 50965 12345 -77958 -5873 51640 -21601 -3819 64065 -20864 -75578
1031 -75578 22955 32691 -34923 27565 59684 -52217 -56391 40402 3883 -31782 57383 38785
1043 38785 -72013 -26615 41070 -24834 -12598 75919 6988 -74591 4609 25466 -43715 17571
1055 17571 77581 -26595 -59991 27294 -1399 -46289 50086 61711 -52216 -32768 34081
1066 34081 -31850 -31032 75276 32241 -62142 -1055 22545 -56012 -2051 84469 -2396 -53001
1078 -53001 25104 -3389 -64985 31763 74288 -31032 -28128 36677 -34830 -54922 60002 48264
1090 48264 -45055 3212 29702 -61276 -29262 74069 15718 -40734 30022 6983 -74366 3075
$$ packed form
1007b3836K0427M8673q1685k2534J00353r637o4972N8568J1207r9767K6494R1320
1019E4611n0967k9993P7314l8620r0303P2085N7513p3241J7782O7884q4929n4714
1031g5578R8533R736o7614O2488L2119j11901m174R6793l6519l5665Q9165j8598
1043C8785j10798M5398O7685o5904J2236Q8517o8931q1579P9200K0857o9181O1286
1055A7571O0010j04176l3396Q7285k8693m4890R6375J1625j13927J9448O6849
1066C4081o5931Q18J06308m3035r4383O1087K3600p8557N3961Q6520q6865n0605
1078e3001P8105k8493o1596R6748M2525j05320K904O4805p1507k0092J14924j1738
1090D8264r3319M8267K6490r0978L2014J03331n8351n6452P0756k3039q1349P7441
$$ plain form
1102 3075 70209 -12802 -20838 43892 -23290 -70563 32363 50971 -29548 7228 41626 -51524
1114 -51524 -51113 51073 22868 -30877 33969 23903 -69055 -21655 54433 -5258 -16955 50775
1126 50775 -3648 -71031 8553 42107 -24648 6940 52820 -32214 -57537 30144 19056 -29879
1138 -29879 32380 39796 -52428 -33112 37410 -6695 -20432 50696 16575 -58505 -5884 30051
1150 30051 -26190 -1005 55995 -8962 -50183 15531 12723 -33650 20940 47662 -29120 -31855
1162 -31855 25673 -7954 -28389 38510 29668 -39157 -10156 23416 -25448 -13564 47172 8063
1174 8063 -37280 8912 11283 -34904 5241 44667 -10970 -25121 20515 -5726 -33893 22408
1186 22408 32490 -22632 -7838 21854 -21518 -23532 32586 15214 -24428 8387 13699 -31022
$$ packed form
1102C075O7134q3011q036O4730o7182m7273J02926J8608q0519L6776L4398r3150
1114e1524M11J02186k8205n3745O4846j0066r2958M7400P6088n9691j1697O7730
1126E0775n4423o7383P9584L3554o6755L1588M5880q5034k5323Q7681j1088m8935
1138b9879O2259P416r2224J9316P0522m4105j3737P1128l4121p5080N2621L5935
1150C0051n6241K5185N7000o4957m1221O5714k808m6373N4590K6722p6782k735
1162c1855N7528l3627k0435O6899q842o8825K9001L3572m8864J1884O0736l9109
1174H063m5343M6192K371m6187M0145L9426n5637j4151M5636k6241k8167N6301
1186B2408J0082n5122J4794K9692m3372k014N6118j7372l9642L2815N312m4721
$$ plain form
1198 -31022 -7893 33553 -1204 -17402 18378 268 -31776 7236 26367 -11877 -5549 20115
1210 20115 -12651 -24823 17284 14745 -14988 6137 14873 -21016 -13427 20570 2823 -11756
1222 -11756 13948 5577 -23073 -1542 17546 -6093 -4773 16200 -4013 -19401 7223 10562
1234 10562 -10062 2947 13336 -11072 -11918 11287 2454 -9126 8885 7375 -13717 -3638 10570
1247 10570 -3906 -4929 11136 758 -12041 2741 6705 -6898 -27 9606 -4060 -7630 5894
1260 5894 1870 -6730 3607 5977 -6054 -2890 5776 -1794 -4486 4987 2262 -5470 626 3784
1274 3784 -3445 -1735 4476 -278 -3355 2221 1434 -3321 217 2971 -1261 -1198 2134 -224 -2264 883
1290 883 1456 -877 11 1065 -851 -1175 621 633 -215 28 59 -583 -504 199 688 280 -519 -181 199 -519
$$ packed form
1198c1022K3129M1446l4757j6198L5780j8110l2044L9012J9131l8244O328K5664
1210B0115l2766j2172M2107k539k9733K1125Q736l5889P589L3997j7747j4579
1222a1756K5704q371k8650K1531J9088k3639J320K0973k0213j5388K6624L339
1234A0562k0624J3009J0389k4408q46K3205q833j1580J8011j510k1092J0079J4208
1247A0570j4476j023J6065j0378j2799J4782L964j3603O871R633j3666l570J3524
1260E894m024q600J0337K370j2031L164Q666p570k692R473k725p732O096L158
1274C784p229J710O211m754l077N576p87m755L538K754m232O3L332k358k040L147
1290H83N73k333Q88J054j916l24J796J2q48K43L1o42P9P03M89m08p99L38L80p18
$$ plain form
1310 -519 28 1249 -60 -1223 369 583 -867 421 1469 -921 -1318 1169 263 -1238 1067 1115 -1994
1327 -1994 -654 1673 -492 -950 1707 142 -2354 457 1597 -1150 -228 1766 -1048 -1833 1470 967
1343 967 -1309 599 1191 -1763 -786 1914 157 -1118 1013 231 -1742 165 1541 -381 -514 715
1359 715 -596 -1083 797 879 -472 -150 -15 -643 -286 680 487 -68 -386 -494 130 188 96 777 370 -1126
1379 -1126 -383 888 -247 -355 1528 -9 -2036 492 1308 -1552 -21 2401 -1229 -2161 2126 530
1395 530 -2850 1413 2606 -2910 -996 3608 -1511 -3340 3566 1641 -4226 1545 3737 -4529 -2046
1410 -2046 5633 -842 -4161 4698 1738 -7302 931 6251 -4061 -2037 7225 -2407 -8252 4955
1424 4955 4525 -6543 2260 7620 -7587 -6438 8472 518 -6965 7510 5103 -11983 -1944 9855
$$ packed form
1310e19N47J221j309j163J592K14j450J288J048k390l97K487r06j501K305M8l109
1327a994J340K327k165m58K657j565k496K811J140k747R22J994k814p85L303n03
1343I67k276J908N92k954R77K700j757j275K131p82j973J907J376j922j33J229
1359G15j311m87J880Q2j351L22J35o28L57R66j93n55l18j08O24N8r2O81m07j496
1379a126P43J271j135j08J883j537k027K528Q16k860J531K422l630r32M287j596
1395E30l380M263J193n516J914M604n119j829O906j925n867N771K192q266K483
1410b046P679o475l319Q859k960r040Q233N320j0312K024R262r632n845J3207
1424D955m30j1068Q803N360j5207J149J4910p954p483J4475k407j7086J0039J1799
$$ plain form
1438 9855 -4367 -4166 11883 -396 -13848 3936 7907 -8686 1612 13499 -7652 -12257 9317
1451 9317 2625 -10372 9041 11203 -14317 -6804 12003 -4772 -7957 16078 4753 -17977 1252
1464 1252 10206 -11903 -1076 20032 -4370 -16746 9249 3773 -15831 8677 18722 -13308
1476 -13308 -10344 13631 -6118 -14312 18436 12040 -18806 -659 12329 -16178 -7160 24832 1883
1489 1883 -18502 9226 5059 -22738 3926 25440 -8562 -11993 15731 -6311 -23171 15803
1501 15803 19698 -16132 -1300 16147 -18645 -16903 25081 8992 -17899 10471 9562 -28203 -5033
1514 -5033 28400 -3343 -12617 19581 -2859 -31726 8989 24270 -13435 -1133 22775 -17665
1526 -17665 -27320 20896 13537 -17475 12999 17909 -30068 -15743 26587 -519 -13589 24927
$$ packed form
1438I855j4222K01J6049j2279j3452J7784L971j6593J0298J1887k1151m605K1574
1451I317o692j2997J9413K162k5520P513J8807j6775l185K4035j1325k2730J9229
1464A252Q954k2109J0827K1108k4402j2376K5995n476j9604K4508J0045l2030
1476a3308K964K3975j9749q194L2748o396l0846J8147J2988k8507R018L1992k2949
1489A883k0385K7728m167k7797K6664K1514l4002l431K7724k2042j6860L8974
1501A5803L895l5830J4832J7447l4792J742M1984j6089k6891K8370r09l7765K3170
1514e033L3433l1743r274L2198k2440k8867M0715J5281l7705J2302K3908m0440
1526a7665r655M8216p359l1012L0474M910m7977J4325M2330k7106j3070L8516
$$ plain form
1538 24927 5862 -35982 -460 24084 -12815 -2683 30249 -9975 -33621 13315 14237 -18986
1550 -18986 12020 27243 -24508 -23415 21342 310 -16936 25876 16614 -33147 -8622 20998
1562 20998 -13380 -7193 34313 1484 -33427 6235 12584 -22423 7228 34502 -13990 -25115
1574 -25115 16422 -1287 -23418 22385 26202 -25140 -11146 18636 -16317 -15738 33615 11932
1586 11932 -28271 3984 11892 -27303 -1499 36941 -3771 -22477 15352 -1301 -30525 14408
1598 14408 31395 -16146 -10206 19328 -16224 -24889 26890 19008 -21467 4000 14880 -27846
1610 -27846 -12543 32499 4119 -18710 15590 3857 -33015 2508 30147 -8587 -9232 21376
1622 21376 -10094 -30442 15911 20882 -15740 3853 19706 -22681 -21079 23721 7571 -15659
$$ packed form
1538B4927j9065m1844L5522K4544l6899J0132L2932m0224k3646M6936R22l3223
1550a8986L1006J5223n1751J093M4757k1032j7246M2812r262m9761K4525K9620
1562B0998l4378O187M1506l2829l4911L9662O349l5007K9651K7274m8492j1125
1574b5115M1537j7709k2131M5803L817n1342J3994K9782l4953N79M9353k1683
1586A1932m0203L2255P908l9195K5804L8440m0712j8706L7829j6653k9224M4933
1598A4408J6987m7541N940K9534l5552q665N1779p882m0475K5467J0880m2726
1610b7846J5303M5042k8380k2829L4300j1733l6872L5523K7639l8734o45L0608
1622B1376l1470k0348M6353M971l6622J9593J5853m2387J602M4800j6150k3230
$$ plain form
1634 -15659 16070 11154 -30093 -7336 24107 -5445 -8788 23322 -1451 -30084 6109 17518
1646 17518 -13884 2357 23475 -14040 -22937 15333 6557 -15403 13900 17003 -22518 -11535
1658 -11535 17759 -4871 -10368 21683 6432 -24436 218 13428 -13191 -1275 23617 -4622
1670 -4622 -20203 8914 4827 -16120 8668 19705 -13005 -11697 12521 -4788 -13307 16482 11673
1683 11673 -16711 -1954 10786 -12403 -6055 20043 2063 -15185 6011 4618 -15899 2826
1695 2826 18509 -6022 -9624 10052 -3227 -14490 10332 12712 -10553 -2178 9469 -9867 -9151
1708 -9151 14202 5089 -10634 4327 5452 -13158 -2117 13970 -1768 -7251 7954 -231 -12574
1721 -12574 4133 10470 -5890 -2177 8279 -5359 -9139 7853 5252 -6945 2461 5872 -8329
$$ packed form
1634a5659L1729m916m1247K2757L1443k9552l343L2110k4773k8633L6193J1409
1646A7518l1402J6241K1118l7515q897L8270q776k1960K9303L103l9521J0983
1658a1535K9294k2630n497L2051j5251l0868K4654J3210k6619J1916K4892k8239
1670d622j5581K9117m087k0947K4788J1037l2710J308K4218j7309q519K9789m809
1683A1673k8384J4757J2740k3189O348K6098j7980j7248K1196j393k0517J8725
1695B826J5683k4531l602J9676j3279j1263K4822K380k3265Q375J1647j9336P16
1708i151K3353r113j5723J4961J125j8610J1041J6087j5738n483J5205q185j2343
1721a2574J6707O337j6360L713J0456j3638l780J6992k601j2197R406L411j4201
$$ plain form
1734 -8329 -4369 8643 185 -5402 5508 2096 -8715 311 6842 -3351 -2254 6411 -1653 -6850
1748 -6850 3681 3636 -4755 1114 5147 -4127 -3718 4791 264 -3985 3386 2713 -4825 -637 3932 -2136
1764 -2136 -1994 4121 275 -4009 1324 2046 -2999 87 3515 -1282 -2345 2061 204 -2526 1376
1779 1376 2201 -1800 -805 1663 -895 -1377 1825 948 -1522 124 790 -1080 -337 1524 112 -1021
1795 -1021 220 106 -734 215 876 -177 -520 -34 -116 -168 297 441 -74 -424 -255 228 168 17 350 97
1815 97 -659 -252 713 92 -225 367 39 -922 162 923 -352 -376 701 -362 -979 736 740 -842 -44
1834 -44 756 -836 -573 1257 265 -1031 387 448 -1081 92 1349 -357 -825 788 -72 -998 675
1851 675 986 -870 -368 839 -447 -641 1033 393 -1108 125 493 -696 -36 996 -223 -778 349
$$ packed form
1734h329L960J3012q458n587J0910l412j0811R026O531j0193J097Q665q064n197
1748f850J0531m5q391N869M033r274M09Q509m527m249P371o73p538M188M569o068
1764b136J42O115l846m284N333P22n045L086L428m797j063M406j857k730L902
1779A376Q25m001R95K468k558m82L202q77k470J646O66j870P43J861j412j133
1795a021J241j14q40R49O61j053l43M86q2n2M65J44n15l50J69M83o0j51L33k53
1815I7p56M07R65o21l17N92l28r61J084P61j275k4J077j063o17J715Mj582P98
1834d4Q00j592K63J830r92j296J418O1j529J173J257j706m68J613q60r26J673
1851F75L11j856N02J207j286j94J674o40j501J233L68j189O60J032j219n55J127
$$ plain form
1868 349 165 -383 430 579 -494 -431 291 21 -49 347 143 -359 -199 -9 131 164 30 -69 10 -308 -147
1889 -147 497 87 -460 222 203 -684 131 721 -550 -669 890 53 -975 668 731 -1385 -168 1569
1907 1569 -536 -913 1426 -11 -2002 880 1720 -1453 -211 1935 -1499 -2044 2342 986 -2202 1107
1923 1107 1660 -3125 -1022 3478 -560 -2112 2668 298 -4193 1044 3508 -2248 -819 3746 -1974
1938 -1974 -4220 3330 2401 -3493 1468 3569 -4443 -2728 4986 9 -3518 4003 1840 -6327 -41
1953 -41 5216 -2724 -1941 5911 -1059 -6846 3034 3763 -4922 1151 6391 -4582 -5312 5514 663 -5506
1969 -5506 4962 4961 -7498 -2074 6303 -3335 -3829 8243 1419 -8727 2020 4715 -6790 51
1983 51 9783 -3141 -7413 5524 778 -8207 5103 8473 -7219 -3749 6964 -4185 -6666 9608
$$ packed form
1868C49j84n48Q13J49j073O3P22k70p0L96k04n02J60J90J40L3j34r9P9l18J61
1889a47O44m10n47O82j9q87Q15N90j271j19J559q37j028J643O3k116J217J737
1907A569k105l77K339j437j991K882Q40l173J242K146l434n45M386j356l188L309
1923A107N53m785K103M500m038j552M780k370m491N237K464n756J429M565n720
1938a974k246P550r29n894M961K101q012J715P714m977l527P521k163q167O286
1953d1N257p940P83P852o970n787R880P29q685O073N240j0973p30J0826m851o169
1969e506J0468jj2459N424Q377r638m94J2072o824j0146J0747K695j1505O841
1983E1R732j2924m272J2937m746q985J3310L370j5692L470J0713j1149k481J6274
$$ plain form
1997 9608 4739 -9298 979 5610 -8628 -2408 12189 -415 -8483 5376 1451 -11083 3356
2010 3356 11787 -5310 -4892 7827 -4314 -10461 8935 8319 -8559 510 7260 -10016 -6659 12700
2024 12700 2628 -8676 6052 3517 -13639 -370 13313 -3472 -5415 9903 -2690 -14106
2036 -14106 6463 10226 -7908 435 10287 -9441 -10761 11376 4352 -8888 6979 6965 -14477
2049 -14477 -4570 12851 -2327 -6129 11912 984 -16031 2401 10388 -7580 -501 13567 -5942
2062 -5942 -13696 8032 4999 -9665 6385 11487 -11902 -8394 10639 -1695 -7868 12420 6102
2075 6102 -14975 -1450 9366 -7747 -2580 15552 -1099 -14180 4915 4545 -11115 4553 14759
2088 14759 -8006 -9596 8676 -2272 -10315 11410 10013 -12297 -2754 8508 -8791 -5614 15593
$$ packed form
1997I608m869j4037J0277M631j4238O220J4597j2604q068J3859l925j2534J4439
2010C356Q431j7097M18J2719j2141o147J9396o16j6878R069O750j7276L357J9359
2024A2700j0072j1304J4728k535j7156J3269J3683j6785j943J5318j2593j1416
2036a4106K0569L763j8134Q343R852j9728j320K2137p024j3240J5867j4k1442
2049a4477R907J7421j5178l802J8041j0928j7015J8432P987j7968P079J4068j9509
2062e942p754K1728l033j4664J6050N102k3389L508J9033j2334o173K0288o318
2075F102k1077J3525J0816j7113N167J8132j6651j3081J9095l70j5660J5668J0206
2088A4759k2765j590J8272j0948q043K1725j397k2310R543J1262j7299L177K1207
$$ plain form
2101 15593 2893 -12561 3829 4487 -12754 1335 15860 -4093 -9045 8018 -1844 -12895 8224
2114 8224 12279 -8764 -3144 8728 -8325 -9455 12996 6199 -10167 3266 5975 -12728 -3395
2127 -3395 14387 -607 -7993 7986 641 -13982 3323 12129 -5968 -3182 9709 -5584 -11805
2140 -11805 8758 7124 -8329 2845 7982 -10706 -6816 11210 879 -7120 8033 3464 -13019
2153 -13019 -625 10074 -4404 -2958 10489 -2152 -11910 4632 6116 -7120 2340 9689 -7115
2166 -7115 -8077 7529 1065 -6762 6982 6091 -10009 -3050 7504 -3596 -3768 9638 1217 -10083
2180 -10083 1644 4968 -6354 570 9675 -3384 -7686 4757 1048 -6675 4869 7337 -6563
2193 -6563 -3701 5593 -3025 -4688 7736 3411 -7399 419 4123 -5683 -1209 8347 -746 -6109
$$ packed form
2101A5593j2700j5454J6390O58j7241J4089J4525j9953m952J7063r862j1051K1119
2114H224M055k1043N620J1872j7053j130K2451o797j6366J3433K709j8703R333
2127c395J7782j4994p386J5979p345j4623J7305Q806j8097K786J2891j5293o221
2140a1805K0563j634j5453J1174N137j8688L890J8026j0331p999J5153m569j6483
2153a3019J2394J0699j4478J446J3447j2641r758J6542J484j3236R460P349j6804
2166g115r62J5606o464p827J3744q91j6100O959J0554j1100j72J3406q421j1300
2180a0083J1727L324j1322O924R105j3059m302J2443l709p723J1544K468j3900
2193f563K862R294q618j663J2424m325j0810P818L704r806M474R556r093n363
$$ plain form
2207 -6109 3399 1141 -6396 2489 6818 -3850 -3302 4474 -2051 -5087 5097 3992 -4994 -127 3761
2222 3761 -4297 -2615 6022 790 -4441 2365 1815 -5098 175 5219 -1756 -2644 3541 -463 -4511
2237 -4511 2276 3399 -3063 -458 3310 -2335 -2882 3393 1208 -2970 1448 2026 -3326 -985 3304
2252 3304 -696 -1904 2511 472 -3184 691 2236 -1712 -384 2550 -1045 -2380 1568 806 -1789
2267 -1789 883 1754 -1820 -1073 1623 -292 -1163 1534 680 -1839 -61 1179 -809 -352 1537 -215
2283 -215 -1371 547 602 -799 327 1055 -655 -772 599 71 -469 596 465 -755 -332 424 -103 -164
2301 -164 465 44 -566 -74 228 -59 -30 170 -129 -313 -61 186 165 -6 -46 -62 -180 -142 255 218 -200 -170
2323 -170 125 -230 -149 449 61 -431 70 168 -376 15 539 -151 -471 278 59 -412 257 470 -496 -320 486
$$ packed form
2207f109R508k258p537Q885M329j0668N48P776o525l036J0184j105q986M867L888
2222C761q058J682Q637n232n231O806n50o913N273N044o975q88O185m004m048
2237d511O787J123o462K605L768n645n47O275k185m178M418N78n352K341M289
2252C304m000j208M415k039l656L875J545l948J328K934l595j335L948p62k595
2267a789K672Q71l574P47K696j915q71K697q54k519J778J240j988M57J889j752
2283b15j156J918N5j401J126P28j710j17J371n28n40J065j31j220M23P56n27o1
2301a64O29m21o10M92L02k87K9K00k99j84K52K47k1j71m0j6j18L8L97l7m18L0
2323a70K95l55Q1N98l88m92N01R8n44L91N24o90l20P49k19m71O69K13r66J76Q06
$$ plain form
2344 486 -73 -376 505 198 -699 54 550 -342 -154 602 -161 -621 407 382 -438 2 446 -480 -370 518
2364 518 103 -422 302 188 -618 -31 524 -173 -234 310 -68 -442 270 351 -242 -33 219 -177 -226 304 162
2385 162 -171 24 52 -125 -2 128 -17 -136 -100 -9 53 -8 -35 98 -83 -211 85 284 -160 -106 208 -240
2407 -240 -280 477 244 -396 10 321 -484 -197 848 5 -640 342 114 -823 335 1004 -519 -587 758
2426 758 -357 -998 952 810 -1149 -116 875 -1092 -688 1649 142 -1351 778 607 -1674 116
2442 116 1930 -757 -1036 1506 -237 -1998 1158 1581 -1624 -204 1841 -1441 -1695 2194 689 -2021
2458 -2021 1138 1571 -2537 -758 2603 -712 -1708 2369 470 -3191 673 2372 -2041 -541 3139
2473 3139 -1114 -3035 2179 1186 -2796 1338 2973 -2863 -1909 3050 -588 -2505 3194 1648 -4126
$$ packed form
2344D86n59l03Q81l07q97P53M96q92J88P56p63m60J028k5q20M40M44r26J10Q88
2364E18m15n25P24j14q06N87N55o97o1N44l78l74P12Q1n93K09K52l96m9N30j42
2385A62l33J95K8j77J23J30j45j19L6R1O2o1k7J33j81j28K96J99m44N4L14m48
2407b40m0P57k33o40M06L11q05K87J045q43o45R82k28r37J158O69j523o8J345
2426G58j115o41J950j42j959J033R91j967M04K337j507j493K129j71k281J790
2442A16J814k687k79K542j743j761L156M23l205J420K045l282k54L889j505k710
2458b021L159M33m108J779L361l315r96M077j899l661L864J699m413J500L680
2473C139m253j921N214r93l982M134J635n836R54M959l638j917N699j546n774
$$ plain form
2488 -4126 -92 2855 -2445 -1058 4417 -394 -4165 1886 1539 -3614 1206 4521 -2628 -2992 3167
2503 3167 -560 -3621 3569 3317 -4255 -879 3359 -2818 -2205 5264 951 -4781 1412 2189 -4505 189
2519 189 5758 -1735 -3783 3290 -150 -4980 2941 4761 -3730 -1562 3938 -2899 -3992 5298 2492
2534 2492 -4739 1331 3070 -5226 -1514 6314 -454 -3947 3802 623 -6370 1619 5596 -3226 -1705
2549 -1705 5004 -2491 -5714 4399 3401 -4594 1404 4374 -5410 -3501 5962 295 -4205 4242 2206
2564 2206 -7063 -347 5786 -2578 -2089 6071 -933 -7025 2646 3967 -4453 1046 6010 -4197 -5278
2579 -5278 4757 950 -4617 4177 4224 -6483 -2233 5278 -2219 -2917 6470 1077 -7140 1028 3875
2594 3875 -4501 168 7092 -2419 -5869 3595 1056 -5064 3570 5659 -5111 -3067 4527 -2228 -3868
$$ packed form
2488d126M034K947n300J387N475m811l771O051l47n153M820L315p149l64O159
2503C167l727l061P190k52p572L376M238o177O13P469m313n732O193P77o694M694
2519A89N569p493k048P073l440m830P921J820q491K168N500o837j093R290k806
2534B492p231O070J739q296L712P828o768l493P749l179o993P989L977q822J521
2549a705O709p495l223J0113r98p995N998K970r784J909R463n667m500Q447k036
2564B206r269O716O133q364M89Q160p004o092R671J321q420N499M964j0207j081
2579e278J0035l807n567Q794M7j0707M250P511p497o98R387n393q217Q168K847
2594C875q376M669O924r511l450R464k539o120Q634K089j0770K044P594o755j640
$$ plain form
2609 -3868 6155 2763 -6226 315 3643 -4848 -1268 7143 -607 -5475 3017 1302 -5855 1963 6345
2624 6345 -3483 -3196 4409 -1695 -5146 4839 4120 -4962 -159 3999 -4488 -2982 6344 1055 -4764
2639 -4764 2679 2043 -6082 -112 6176 -1866 -3032 4389 -798 -5978 2831 4356 -3783 -242 4476
2654 4476 -3584 -4255 4719 1767 -4003 2519 2922 -5359 -1600 5078 -959 -2642 4257 428 -5651
2669 -5651 1133 3913 -2827 -422 4582 -2123 -4620 3029 1798 -3455 1899 3604 -4005 -2575 3704
2684 3704 -477 -2620 3705 1619 -4771 -221 3257 -2187 -969 4292 -657 -4151 1744 1769 -2988
2699 -2988 1109 3761 -2495 -2635 2663 -151 -2630 2697 2222 -3431 -687 2532 -1845 -1412 3520 354
2715 354 -3239 1067 1503 -2646 203 3295 -1281 -2155 2089 89 -2549 1637 2266 -2222 -692 2092
$$ packed form
2609c868J0023l392q989O541L328q491L580Q411p750m868Q492j715p157P818M382
2624F345r828K87P605o104l451R985p19r082M803M158q487J506R326n289n819
2639d764P443o36q125N970O288q042j166P421n187n180Q809J525q139L541M718
2654D476q060o71Q974k952n770O522M03q281L759O678o037j683O899l829o079
2669e651O784K780o740K405N004o705k497P649j231n253N354J705p609J430O279
2684C704m181k143O325k086o390M550L478n444J218N261m949l494N895K5m757
2699b988M097K652o256j40N298k814k479N327m75n653K744L219m377M33M932l166
2715C54l593M306M36m149K849L092m576q74M244k000k638M186O29m488J530K784
$$ plain form
2731 2092 -1270 -1738 2344 861 -2264 553 1390 -2097 -619 2441 -372 -1617 1419 379 -2151
2746 -2151 516 1840 -1166 -612 1602 -609 -1688 1243 953 -1320 311 1284 -1262 -796 1496 50
2762 50 -1062 873 521 -1471 -26 1217 -523 -444 1060 -283 -1197 549 666 -718 136 803 -736
2779 -736 -697 759 220 -581 470 343 -881 -181 667 -183 -238 622 -29 -639 276 401 -260 47 336 -244
2799 -244 -393 280 124 -267 108 132 -304 -109 286 12 -88 126 -28 -208 4 120 -30 20 29 -83 -14 47
2821 47 59 -7 -87 -114 35 100 -59 -13 94 -154 -149 157 41 -85 86 77 -190 2 245 -103 -97 168 -60 -268
2845 -268 201 185 -189 -75 223 -192 -203 313 44 -241 74 127 -254 32 293 -169 -225 176 23 -280 174
2866 174 281 -257 -143 226 -107 -199 315 134 -299 25 190 -188 -64 273 -82 -209 110 121 -134 49 204
$$ packed form
2731B092l362m68M082j483l125K817Q37l487J478L060k813j245L036j040k530
2746b151K667J324l006N54K214k211j079K931k90k273J631R73k546M66K292j446
2762E0j112J935l52j992J445J243j740P9J504j343r14J746J17j384Q54O67j539
2779g36L9J456n39q01J051j27j224P00Q48q50n5Q60o51o10R15J25o61L07K89n80
2799b44j49O73j56l91L75K4m36J95L95k74j00K14j54j80K12J16j50N0Rj12O9O1
2821D7J2o6q0k7J49O5j59M6J07k48NL06j16j26J71rk67J92K43l48OK65k28k08
2845b68M69j6l74J14K98m15j1N16k69k85L15N3l81K86K61m62n6M01j53l03M54
2866A74J07n38J14L69l33r2N14j81m33L24J65l78J24L37l55j27L19J1k55J83J55
$$ plain form
2887 204 -117 -157 161 98 -118 108 46 -147 -73 102 -17 -66 -9 -90 -127 -27 62 39 -57 -108 -5 -61 -57 166 136
2912 136 -128 -97 129 -115 -41 223 149 -311 -21 210 -134 -26 435 -80 -441 138 194 -322 58 495 -331
2933 -331 -359 325 18 -420 353 356 -553 -132 536 -348 -362 698 76 -734 242 489 -706 -141 826 -279
2953 -279 -609 696 87 -886 303 775 -741 -293 946 -387 -937 855 498 -995 359 963 -1018
2970 -1018 -618 1245 -117 -911 1019 550 -1496 24 1300 -726 -525 1435 -267 -1608 781 912
2986 912 -1239 300 1467 -1169 -1231 1417 167 -1302 1211 1024 -1851 -439 1603 -832 -820 1935
3002 1935 137 -2173 630 1221 -1472 69 2122 -955 -1822 1459 355 -1742 1186 1815 -1919 -900
3018 -900 1818 -760 -1444 2138 815 -2360 299 1551 -1786 -496 2601 -418 -2142 1390 632 -2299
$$ packed form
2887B04l21m0L18o3k16K26o2j93P4J75j19m9N7q1l7J00Q9k3r6n1J03n6MK23l0
2912A36k64L1K26k44P4K64p4m60K90K31l44J08M61n15l61N79N6n16L80M37q26
2933c31k8O84l07m38P73Lr09M21O68q84j4J060o22q10R76K47j195N65R67j105
2953b79l30J305o09r73J189M72j516M48J239j333n50J792l57j493J354O04j981
2970a018M00J863j362p94J930m69k046J520J276k026K01J960j702j341K389J31
2986I12k151J539J167k636o2K648j250j469K513j87k875J412K042k435J2K755
3002A935j798k310K803N91k693J541K053l077q67L281j104k097K928O29l734J019
3018i00K718k578o84L582j323l175K659J252l337J290L097l019j724L532p58k931
$$ plain form
3034 -2299 722 2512 -1615 -1279 2054 -596 -2147 2049 1557 -2344 43 1928 -2000 -1229 2789 194
3050 194 -2284 1433 1006 -2824 133 2807 -1188 -1358 2333 -440 -2908 1606 2024 -2097 5 2361
3066 2361 -1950 -2115 2685 741 -2263 1492 1582 -3068 -710 2899 -703 -1620 2546 225 -3374 824
3082 824 2412 -1871 -361 2922 -1381 -2850 2082 1216 -2346 1192 2375 -2721 -1549 2689 -395
3097 -395 -1908 2548 1051 -3337 27 2350 -1736 -738 3117 -576 -3028 1529 1260 -2414 833 2835
3113 2835 -2048 -1904 2277 -293 -2175 2211 1748 -2826 -404 2222 -1708 -1250 3085 309 -2858 1099
3129 1099 1280 -2596 251 3083 -1234 -2002 2045 -50 -2622 1632 2396 -2160 -644 2156 -1490 -1883
3145 -1883 2620 997 -2476 758 1536 -2524 -617 2918 -435 -1890 1764 299 -2797 808 2458
$$ packed form
3034b299L021J790m127L36L333k650j551M196m92l901K387J885l928P71M018k595
3050A94k478L717m27l830K957K674l995j70L691k773k468M514M18m121K102K356
3066B361m311j65M800j944l004L755R0m650K358L609l602r17M166k321l599M198
3082H24J588m283J510L283m303j469M932q66l562L538J183n096J172M238l084
3097c95j513M456j497m388L364K323m086R98L855l693k452M557k69l674L247K002
3113B835m883J44M181k570j882M386m63m574K422K626l930M58M335k776l167L957
3129A099J81l876K847K832m317p68M047k095k572M254P64m556J516K800l646l93
3145a883M503j623l473L234P78m060J907L535l353j455L654j465l096L605J650
$$ plain form
3160 2458 -1511 -688 2151 -1077 -2338 1951 1363 -1943 575 1748 -2148 -1254 2408 86 -1686 1605
3176 1605 721 -2622 51 2162 -1006 -787 2043 -535 -2329 1202 1339 -1553 293 1860 -1563 -1546
3192 -1546 1829 308 -1510 1265 1121 -2044 -468 1801 -697 -958 1759 124 -2051 591 1219 -1349
3208 -1349 -2 1800 -816 -1444 1277 368 -1383 844 1274 -1411 -584 1337 -557 -964 1439 437
3224 437 -1572 254 963 -1062 -266 1504 -318 -1172 883 303 -1214 441 1207 -863 -543 992 -342
3241 -342 -959 949 627 -1044 74 799 -816 -513 1150 15 -833 531 382 -970 81 993 -335
3258 -335 -487 713 -104 -816 534 663 -627 -65 591 -444 -503 734 216 -608 292 309 -661 -109 631
3277 631 -188 -386 400 -69 -543 274 413 -333 -59 328 -248 -310 419 141 -309 165 198 -343 -83 345 -31
$$ packed form
3160B458l969Q23K839l228j261M289n88l306K518J173l896Q94L662k322j772L291
3176A605q84l343K673K111l168K19K830k578j794L531J37k892J846J567l423J7
3192a546L375j521j818K775j44l165J576K269k498k61K717j635k175K642O28k568
3208a349J347J802k616o28K721r09j751K227M30k685Q27J921j894m07K403j002
3224D37k009J826P09k025P96J770j822q54K055n80j517J655P66k070L20J535j334
3241c42o17J908l22j671J118P25j615L03J663j135q48J364j49j352J051R12j328
3258c35j52J200q17p12J350J29j290N62O56j035n9J237n18q24R00J7r70N52P40
3277F31q19j98P86m69m74Q17J39p46K74L87n76o2P29k78m50M74L3n41K60M28l76
$$ plain form
3298 -31 -210 212 32 -293 90 238 -226 -99 219 -72 -130 121 51 -155 20 116 -100 -55 139 -38 -112 89
3320 89 48 -72 41 13 -110 28 48 -71 31 9 6 -17 23 18 -70 25 -25 -103 55 88 -17 2 60 -112 -79 55
3346 55 -10 -7 106 -20 -89 53 89 -80 21 78 -64 -83 139 -6 -98 71 -4 -129 10 102 -67 -81 66 -5
3370 -5 -171 115 91 -99 -54 105 -76 -91 109 17 -81 15 46 -54 -43 152 0 -101 50 9 -41 9 140 -58
3394 -58 -79 32 15 -72 92 59 -72 -17 -15 -29 -52 45 28 -79 -119 28 6 13 54 4 -47 -75 54 38 -64 71 45
3421 45 -123 -12 158 65 -101 138 39 -163 27 167 -74 -35 161 8 -214 104 157 -208 -52 245 -132 -215
3443 -215 198 76 -299 117 208 -276 -85 343 -120 -296 300 120 -399 101 332 -300 -148 426 -5 -330
3463 -330 276 224 -496 42 497 -257 -188 521 -122 -642 350 414 -434 37 563 -454 -385 583 113 -555 324
$$ packed form
3298c1j79M22j80l25L83J48m64J27L18k91n8K51p0k06J75R6k16M5J94j77p4K01
3320H9m1j20J13k8j23J38K0j19J02k2lk3M0nq8R5n0p8J58L3j05J9N8j72L3J34
3346E5o5LJ13j26o9J42L6j69J01N7j42j9K22j45r2J69p5j25J39R2j69j4J47p1
3370ej66K86k4j90M5J59j81j5K00r2r8R6L1j00J1J95j52j01J51m1n0N0J31j98
3394e8k1J11j7q7J64l3j31N5Kj4k3R7j7j07m0J47k2PM1n0n1k8J29j6j02J35k6
3421D5j68J11J70r3j66K39r9k02J90J40k41L9J96j53k22L18N3l65J56K97l77q3
3443b15M13j22l75M16R1m84J91M28m63j76N96j80n19N00K31o32J52N74m31l25
3463c30O06n2p20N38M55p54O9P09o43n20R92O4q48M71N26j017O9R68m70o68Q79
$$ plain form
3484 324 340 -708 -185 744 -228 -442 647 17 -853 270 631 -563 -183 734 -427 -743 688 282
3502 282 -669 363 578 -877 -376 866 -164 -653 816 288 -1030 145 798 -675 -305 1051 -269
3519 -269 -968 653 421 -890 282 1019 -789 -672 955 -101 -911 828 616 -1140 -115 913 -675
3536 -675 -611 1202 98 -1133 466 616 -1140 43 1334 -572 -879 982 -17 -1195 704 980 -1030
3553 -1030 -246 1040 -689 -942 1274 465 -1232 400 705 -1226 -292 1477 -302 -952 940 138 -1398
3570 -1398 482 1273 -875 -371 1194 -607 -1248 1119 718 -1126 318 1044 -1256 -665 1543 0
3586 0 -1095 979 496 -1594 119 1394 -788 -610 1390 -290 -1500 832 964 -1161 200 1277
3602 1277 -1023 -1086 1316 165 -1207 879 865 -1478 -298 1340 -632 -756 1431 118 -1580 485
$$ packed form
3484C24J6j048N23R29r72k14J089o30q70J123L61j194L80R17j161l16J431m06
3502B82r51J032K15j455N01J242j030m89J469n28j318J175O53j473L70J356j320
3519b69o99J621k32j311J172P37j808J17J627j056q10J739k12j756J025J028j588
3536f75O4J813j104j231J599J50j756J183J291j906l07J861r99j178J899K76k010
3553a030P84J286j729k53K216q09j697J632L05j931R34J769j779o50J892q02j536
3570a398J880P91k148N04J565j801o41K367m01j844J444P26k300N91K208j543
3586@j095K074m83k090J713J275k182J78K000j680j210K332J32k125J361J077
3602A277k300o3K402j151j372K086j4k343J180J638j972j24K187j313j698K065
$$ plain form
3618 485 924 -1172 -28 1473 -679 -1133 1065 270 -1212 690 1137 -1220 -480 1188 -502 -944 1296
3635 1296 431 -1404 286 944 -1106 -326 1565 -305 -1295 828 322 -1299 443 1369 -922 -665 1098
3652 1098 -422 -1192 1075 785 -1196 52 998 -999 -639 1424 56 -1093 651 458 -1303 130
3668 130 1308 -599 -741 1004 -154 -1178 794 901 -943 -44 949 -787 -809 1159 207 -991 541
3685 541 629 -1155 -181 1110 -319 -718 908 97 -1170 459 899 -715 -189 994 -441 -866 797
3702 797 312 -847 356 717 -922 -435 924 -165 -676 776 218 -1012 139 752 -556 -248 863
3719 863 -147 -796 527 367 -721 214 702 -532 -413 651 -125 -561 623 426 -708 -28 538 -422
3737 -422 -254 757 -55 -651 231 314 -564 73 612 -353 -406 459 -93 -489 372 359 -501 -132 454 -291 -332
$$ packed form
3618D85M39k096J144J501k152m54K198p95j482J902M47k357P40J668j690m42K240
3635A296q65j835J690O58k050P80J891j870r90K123n06j621J742R26k291K57J763
3652A098j520p70K267k90j981J248R46j997L60K063j368j149J744j93j761J433
3668A30J178j907j42J745j158j024J972J07j844Q99R93j736k2J968r52j198J532
3685E41Q8j784R74J291j429l99J626q11j267J629M40j614N26J183j435m25J663
3702G97m85j159J203L61j639M87J359j089n11J452n58j230J151O13j308L08J111
3719H63j010o49J323j60j088R35M88j234J19J064p76m36J184j97j134O80N66r60
3737d22J68J011q12n96Q82Q3q78O37N39r65n3Q65n52l96Q61j3q60L69N86p45m1
$$ plain form
3758 -332 565 145 -461 176 290 -408 -54 551 -120 -301 342 48 -423 172 409 -291 -122 322 -142 -279
3778 -279 340 130 -345 52 197 -267 -149 345 -80 -243 181 73 -263 90 261 -153 -85 185 -70 -190
3798 -190 195 51 -236 24 185 -109 -42 199 -39 -121 86 58 -126 6 52 -82 -13 152 34 -145 104 71
3820 71 -76 4 52 -90 -62 33 -26 -56 26 25 -55 -6 56 -48 -19 61 16 -30 22 50 -8 -5 -24 -54 -29 -7 -7 70 1 -14
3850 -14 58 68 -37 -50 115 21 9 -9 8 -66 16 0 -16 15 43 -20 -34 45 11 -18 -40 -4 -2 -1 80 47 -87 1 16 -36
3880 -36 38 59 -30 -6 77 9 -37 73 14 -17 3 56 39 -30 51 8 -18 19 11 12 33 39 -9 -66 -47 34 30 26 9 -49 -49 1 107
3913 107 -53 5 -2 -15 -55 43 45 2 -22 35 -7 -50 42 35 25 14 65 -75 -39 63 37 -98 80 65 -30 -46 139 -7
3941 -7 -65 46 23 -127 73 110 -94 -72 166 -45 -101 104 72 -199 41 184 -73 -68 174 -61 -154 169 143 -170
$$ packed form
3758c32Q97m20o06O37J14o98L54O05o71j81O43k94m71N95K37p00J69M44m64j37
3778b79O19k10m75L97J45m64J18M94m25j63M24j08l36L53J71m14O8K70k55j20
3798a90L85j44k87K60J61k94O7K41k38q2K07k8j84J32M6j34O9J65j18j79K49l3
3820G1j47Q0M8j42K8R5n9l0Q2jq0M9O2j04K9Q0m5m6N2K8n8Lj9l0K5K2%P7o9j5
3850a4P2J0j05j3J65r4j2j8J7p4Q2j6j6L1K8o3j4P9l4k9k2L6KJQ1l3j34Q8J5n2
3880c6P4K1q9K4Q3o8m6J10n9l1K0N3j7o9Q1m3k6L7qJK1Om8n7J9Q1mmj7n8%N0J06
3913A07j60N8pj3m0R8Km3k4N7m2m3R2pj0j1N1j40L6J02k6j35J78j5r5j6J85j46
3941gn8J11k3j50K00L7k04K2K38k11n6K05l2k71K40J43k57NK42k35r3L23k6l13
$$ plain form
3965 -170 -6 154 -169 -131 255 -1 -198 150 135 -229 15 293 -111 -209 185 40 -283 210 222 -272 -89
3986 -89 268 -93 -248 265 108 -319 46 230 -351 -99 427 -98 -303 255 153 -352 94 318 -300 -142
4006 -142 429 -115 -382 298 250 -418 106 432 -325 -180 502 -17 -321 308 246 -523 22 452 -250 -220 488
4027 488 -15 -499 314 307 -432 4 505 -331 -398 399 104 -527 309 408 -544 -155 479 -229 -367 556 117
4048 117 -592 150 357 -468 -141 696 -161 -577 422 177 -636 267 593 -501 -279 527 -202 -513 539
4067 539 303 -621 5 443 -520 -268 735 -68 -569 414 236 -703 136 671 -423 -385 610 -50 -614 480
4087 480 473 -614 -22 581 -415 -409 693 79 -584 362 422 -749 -62 776 -300 -444 620 18 -785 324
4107 324 527 -556 -107 685 -335 -584 642 201 -642 247 534 -685 -203 735 -169 -455 609 155
$$ packed form
3965a70J64J60l23L8L86k56j97L48j5l64K44K78m04r8L94j45l23M93J2m94J83
3986h9L57l61j55N13j57m27L65J84n81K52N26n25k05N58j02n05M46K24o18J58
4006a42N71n44k67O80m8o68N24L26p57J45O82n19l04O29o2p69N45M30p02L0P08
4027D88n03m84Q13pp39M36N01q36o7P97k95o31Q36R9r52L89O34p08j38R23m39
4048A17p09P42K07q25L27Q37q57m16R99k45q13R03L26j094K22Q06p29l11J052
4067E39k36r24O26M38r63K52J003q03n01R83j78r39Q39N35j094L8R95o60n64J094
4087D80pj087N92O03r96OJ102o14o63R46O0j171O87Q38j076j44J064o02q03J109
4107C24K03j083M49P92j020k49J226m41q43Q89K87j219M82R38r04k86J064m54
$$ plain form
4125 155 -816 116 602 -462 -145 756 -225 -703 458 267 -569 256 630 -504 -315 626 -123 -546 567
4144 567 341 -723 -44 564 -442 -283 698 -13 -686 381 317 -624 99 654 -399 -445 539 -5 -628
4163 -628 447 492 -622 -93 521 -406 -326 641 89 -654 249 333 -569 -19 694 -213 -441 511 70 -564
4183 -564 312 532 -481 -196 515 -266 -521 573 193 -562 186 434 -472 -168 565 -72 -360 403 160
4202 160 -510 132 477 -405 -209 469 -129 -484 347 232 -389 86 372 -339 -341 430 -13 -406 333 244 -483
4223 -483 -12 420 -245 -140 463 -38 -419 247 263 -315 44 375 -266 -369 313 15 -335 223 205 -304 -101
4244 -101 314 -227 -208 351 21 -354 120 247 -243 -8 302 -158 -271 216 54 -246 102 252 -242 -64
4264 -64 301 -74 -188 204 91 -243 62 235 -189 -65 234 -49 -152 119 97 -199 91 188 -131 -156 167
$$ packed form
4125A55r71R32M86j064L17R01r81m78J161j91q36Q25L74j134J89R41p49m23J113
4144E67k26j064O79O08j006J59R81p11o73J067o4r41P23N55j053m6R84n44o23
4163f28J075M5j114N29O14r27Q0R67n52p43R03Q4r02N50P13r07k28R52m41o34
4183e64Q76K20j013K85P11p81k55J094l80p55P48K48r06L04P33o37k88P63k43
4202A60o70O42L45q82J96O78n98l55Q31j15o21M75K86p11kP71m43l93P39q9p27
4223d83M71M32o65J05O03n01l81O66J6n78L59L31o41j03O82k98l50N58j8n09K03
4244a01M15n41J9N59l30l75M74J27m90K35L10m60j13M87j62l00L48J50m94J78
4264f4L65l75j14L92j13l34L05J73m24J24K99k83j03K71k2k96K90R7l19k5L23
$$ plain form
4285 167 -42 -177 158 73 -163 25 119 -101 -65 178 -61 -158 136 40 -141 -5 120 -16 -80 81 37 -153
4307 -153 110 51 -80 -9 146 -59 -74 62 24 -129 26 51 -110 21 36 -61 5 44 -1 -71 13 29 -41 -1 22
4332 22 -4 -33 30 -10 -61 41 -35 -42 -17 31 -49 39 43 26 -15 4 3 0 23 -14 -30 -7 66 6 22 7 1 13 24 41 -30 -59
4364 -59 -1 -34 25 31 -1 -69 16 -9 43 52 6 -17 10 -31 -62 -15 67 -20 -6 14 -15 -20 11 28 41 -39 87 -46 -14 15 63
4395 63 -44 -24 -45 -16 5 -8 6 -48 53 16 31 -8 19 -7 -58 -16 11 -27 -18 6 -13 -52 -43 -19 -1 -10 22 -40 -10 -30 -44
4426 -44 -69 4 60 5 20 74 1 -25 -4 18 17 7 80 -7 -25 41 12 -86 0 65 -27 20 55 -34 -39 44 19 -29 -7 51 -106
4457 -106 -58 77 1 -82 23 43 -100 59 90 -39 -46 97 -40 -67 24 60 -96 -27 131 -48 -85 111 15 -104
4481 -104 25 99 -100 -41 177 -48 -85 77 49 -202 13 115 -116 -78 144 -98 -119 89 91 -154 11 192 -119
$$ packed form
4285A67k09j35L35q5k36J88R4k20L6K43k39r7K94r6j81J36J25j36o4J61m4j90
4307a53K63n9j31P1J55k05j5J36l8j53J55K5j61J31J5r7O6L9m5p0Q4J6p0M0K3
4332B2k6k9O3m0n1J02p6pK5M8q0Q8Mj7m1J9jlK3l7j6K3P3o0J6j5oJ2J1J7p1k9
4364e9N8l3N9Ol2o8Q5k5N2Rm6k3K7m1l1M7Q2q7J4K0k9nL1J7J3q0J26j33L2K9M8
4395F3j07K0k1K9K1j3J4n4J01l7J5l9K7k6n1M2K7l8RK4j9l9RK4J8rL2o2L0k0j4
4426d4k5P3N6n5J5N4p3k6K1K2jj0P3q7j8O6k9r8Q6O5r2M7L5q9nQ3k5m8K2N8j57
4457a06M8J35p6q3J05K0j43J59L1j29pJ43j37k7R1L6j56O9J58j79l7J96r6j19
4481a04J29P4j99N9K18k25l7J62k8k51K15J02k31L8K22k42k1K08Kk45J65J81l11
$$ plain form
4504 -119 -116 196 -12 -179 98 101 -199 9 217 -147 -83 182 -10 -171 101 126 -161 -14 189 -133 -178 169
4526 169 19 -226 136 162 -231 -40 212 -102 -138 207 28 -277 46 177 -211 -31 262 -159 -221 201 59
4547 59 -192 133 211 -241 -111 233 -18 -221 312 108 -326 89 223 -175 -55 367 -62 -231 221 128 -301
4568 -301 79 268 -228 -176 242 11 -218 236 187 -301 -45 283 -206 -114 332 -27 -330 155 191 -357 39
4589 39 288 -191 -182 259 -34 -348 204 265 -265 12 283 -211 -196 307 105 -276 180 202 -345 -56 350 -94
4611 -94 -196 280 33 -387 83 253 -234 -72 277 -168 -369 252 159 -303 97 282 -340 -141 356 -50 -276
4632 -276 265 116 -379 49 262 -201 -130 282 -96 -319 177 208 -214 95 282 -236 -263 255 -21 -207 210
4653 210 179 -315 -14 284 -208 -130 247 17 -310 48 245 -241 -52 318 -151 -212 259 25 -319 162 261
$$ packed form
4504a19LL12k08j67K77Ll00K08K08l64O4K65j92j61K72K5k87J47K03l22m5L47
4526A69j50k45L62K6l93J91K52l14l6L45j79l05L23J31l88J80K93m21o2M22j42
4547E9k51L25P8m52J30L44k51k03N33k04m34M15J34l98J20M22m29j69M52r3m29
4568c01L80J89m96N2M18k31k29M54m9m88K56L28m89R2M46l59l03M85L6n48L96
4589C9K49m79RM41k93l14N52O1n30K77K71m94J5N03k02l81M56K2n47K89M06m44
4611i4j02M76k47m20M70J70m87J62L49m45k01O21r3m62M00J85o22J99M97m06k26
4632b76N41j49m95M28K13m63P1M12l78k23M96L1m22L09J87n18k7N18k76j86M17
4653B10l1m94L01K98m92P8L77k30l27L58J97m86J89L70m69o1M71k34l44M81R9
$$ plain form
4674 261 -295 -54 256 -125 -190 253 86 -300 72 227 -224 -17 290 -58 -207 234 101 -310 70 198
4694 198 -157 -73 229 -81 -203 225 94 -268 27 197 -181 -81 215 43 -200 164 91 -230 38 231 -133
$$ packed form
4674B61n56K41L10l81o5M43j67l86L72J55m51K07L07l48j49M41j33m11L80J28
4694A98l55Q4L02l10j22M28j31l62K95J70l78J00K96j72k43L64p3l21K68J93l64
$$ [...]
8191A3
##END NTUPLES=NMR FID
##END=
