##TITLE=1H_SR-75_TFAA7-V4
 CDCl3
 8 sc, 
 1.9.2023
##JCAMPDX= 6.0         $$ Bruker NMR JCAMP-DX V2.0
##DATA TYPE= NMR FID
##DATA CLASS= NTUPLES
##ORIGIN= UXNMR, Bruker Analytische Messtechnik GmbH
##OWNER= root
$$ XWIN-NMR		Version 3.5
$$ Fri Sep  1 16:18:35 2023 Russian Standard Time (UT+4h)  she@DPX200
##.OBSERVE FREQUENCY= 200.13135
##.OBSERVE NUCLEUS= ^1H
##.DELAY= (6, 6)
##.ACQUISITION MODE= SIMULTANEOUS
##.ACQUISITION SCHEME= undefined
##.AVERAGES= 8
##.DIGITISER RES= 18
##SPECTROMETER/DATA SYSTEM= spect
##.PULSE SEQUENCE= zg30
##.SOLVENT NAME= CDCl3
##.SHIFT REFERENCE= (INTERNAL, CDCl3, 0, 15.7039)
##AUDIT TRAIL= $$ (NUMBER, WHEN, WHO, WHERE, WHAT)
$$ ##TITLE= Audit trail, XWIN-NMR		Version 3.5
$$ ##JCAMPDX= 5.01
$$ ##ORIGIN= Bruker BioSpin GmbH
$$ ##OWNER= she
$$ F:/spectra/data/she/nmr/H-F/1/audita.txt
$$ ##AUDIT TRAIL=  $$ (NUMBER, WHEN, WHO, WHERE, WHAT)
(   1,<2023-09-01 16:17:30.40 +0400>,<she>,<DPX200>,
      <created by zg, POWCHK disabled, PULCHK disabled
       configuration hash MD5:
       00 E9 B6 7A A2 85 ED C7 34 08 36 98 17 FE 4E 26
       data hash MD5: 16K
       CC FB F7 D8 28 82 AE 79 90 14 71 E6 2F F4 CB C1>)
$$ ##END=
$$ 
$$ hash MD5
$$ 28 D5 85 AE 17 BB BC 99 30 83 46 AF 75 72 D0 B2
##$RELAX= 
##$RELAX= 
##$RELAX= 
##$RELAX= 
##$RELAX= 
##$RELAX= 
$$ Bruker specific parameters
$$ --------------------------
##$DU= <F:/spectra>
##$EXPNO= 1
##$NAME= <H-F>
##$PROCNO= 1
##$TYPE= <nmr>
##$USER= <she>
##$AMP= (0..31)
100 100 100 100 100 100 100 100 100 100 100 100 100 100 100 100 100 100 
100 100 100 100 100 100 100 100 100 100 100 100 100 100 
##$AQSEQ= 0
##$AQ_mod= 1
##$AUNM= <au_zg>
##$AUTOPOS= <>
##$BF1= 200.13
##$BF2= 200.13
##$BF3= 200.13
##$BF4= 200.13
##$BF5= 200.13
##$BF6= 200.13
##$BF7= 200.13
##$BF8= 200.13
##$BYTORDA= 1
##$CFDGTYP= 0
##$CFRGTYP= 5
##$CHEMSTR= <none>
##$CNST= (0..31)
1 1 145 1 1 1 1 1 1 1 1 1 1 1 1 1 1 1 1 1 1 1 1 1 1 1 1 1 1 1 1 1 
##$CPDPRG= <>
##$CPDPRG1= <>
##$CPDPRG2= <>
##$CPDPRG3= <>
##$CPDPRG4= <mlev>
##$CPDPRG5= <mlev>
##$CPDPRG6= <mlev>
##$CPDPRG7= <mlev>
##$CPDPRG8= <mlev>
##$CPDPRGB= <>
##$CPDPRGT= <>
##$D= (0..31)
0 1.2 0 0 0 0 0 0 0 0.06 0 0.03 0 0 0 0 0.0002 0 0 0 0 0 0 0 0 0 0 0 0 
0 0 0 
##$DATE= 1693570649
##$DBL= (0..7)
120 120 120 120 120 120 120 120 
##$DBP= (0..7)
150 150 150 150 150 150 150 150 
##$DBP07= 0
##$DBPNAM0= <>
##$DBPNAM1= <>
##$DBPNAM2= <>
##$DBPNAM3= <>
##$DBPNAM4= <>
##$DBPNAM5= <>
##$DBPNAM6= <>
##$DBPNAM7= <>
##$DBPOAL= (0..7)
0.5 0.5 0.5 0.5 0.5 0.5 0.5 0.5 
##$DBPOFFS= (0..7)
0 0 0 0 0 0 0 0 
##$DE= 6
##$DECBNUC= <off>
##$DECIM= 32
##$DECNUC= <off>
##$DECSTAT= 4
##$DIGMOD= 1
##$DIGTYP= 9
##$DL= (0..7)
0 120 120 120 120 120 120 120 
##$DP= (0..7)
150 150 150 150 150 150 150 150 
##$DP07= 0
##$DPNAME0= <>
##$DPNAME1= <>
##$DPNAME2= <>
##$DPNAME3= <>
##$DPNAME4= <>
##$DPNAME5= <>
##$DPNAME6= <>
##$DPNAME7= <>
##$DPOAL= (0..7)
0.5 0.5 0.5 0.5 0.5 0.5 0.5 0.5 
##$DPOFFS= (0..7)
0 0 0 0 0 0 0 0 
##$DQDMODE= 0
##$DR= 18
##$DS= 0
##$DSLIST= <SSSSSSSSSSSSSSS>
$$ [...]
##$SUBNAM2= <"">
##$SUBNAM3= <"">
##$SUBNAM4= <"">
##$SUBNAM5= <"">
##$SUBNAM6= <"">
##$SUBNAM7= <"">
##$SUBNAM8= <"">
##$SUBNAM9= <"">
##$SW= 18.05172834244
##$SWIBOX= (0..15)
0 0 2 0 0 0 0 0 0 0 0 0 0 0 0 0 
##$SW_h= 3612.71676300578
##$TD= 16384
##$TD0= 1
##$TE= 0
##$TE2= 300
##$TE3= 300
##$TEG= 300
##$TL= (0..7)
0 120 120 120 120 120 120 120 
##$TP= (0..7)
150 150 150 150 150 150 150 150 
##$TP07= 0
##$TPNAME0= <>
##$TPNAME1= <>
##$TPNAME2= <>
##$TPNAME3= <>
##$TPNAME4= <>
##$TPNAME5= <>
##$TPNAME6= <>
##$TPNAME7= <>
##$TPOAL= (0..7)
0.5 0.5 0.5 0.5 0.5 0.5 0.5 0.5 
##$TPOFFS= (0..7)
0 0 0 0 0 0 0 0 
##$TUNHIN= 0
##$TUNHOUT= 0
##$TUNXOUT= 0
##$USERA1= <user>
##$USERA2= <user>
##$USERA3= <user>
##$USERA4= <user>
##$USERA5= <user>
##$V9= 5
##$VALIST= <valist>
##$VCLIST= <CCCCCCCCCCCCCCC>
##$VD= 0
##$VDLIST= <DDDDDDDDDDDDDDD>
##$VPLIST= <PPPPPPPPPPPPPPP>
##$VTLIST= <TTTTTTTTTTTTTTT>
##$WBST= 1024
##$WBSW= 4
##$XGAIN= (0..3)
0 0 0 0 
##$XL= 0
##$YL= 0
##$YMAX_a= 241777
##$YMIN_a= -296637
##$ZGOPTNS= <>
##$ZL1= 120
##$ZL2= 120
##$ZL3= 120
##$ZL4= 120
##$ABSF1= 10
##$ABSF2= 0
##$ABSG= 5
##$ABSL= 3
##$ALPHA= 0
##$AQORDER= 0
##$ASSFAC= 0
##$ASSFACI= 0
##$ASSFACX= 0
##$ASSWID= 0
##$AUNMP= <proc_1d>
##$AZFE= 0.1
##$AZFW= 0.1
##$BCFW= 1
##$BC_mod= 2
##$BYTORDP= 1
##$COROFFS= 0
##$CY= 11.3945322036743
##$DATMOD= 1
##$DC= 2
##$DFILT= <>
##$DTYPP= 0
##$F1P= 15.7292609196834
##$F2P= 12.9074282941183
##$FCOR= 0.5
##$FTSIZE= 0
##$FT_mod= 4
##$GAMMA= 1
##$GB= 0.15
##$INTBC= 1
##$INTSCL= 1
##$ISEN= 128
##$LB= 0.24
##$LEV0= 0
##$LPBIN= 0
##$MAXI= 10000
##$MC2= 0
##$MEAN= 0
##$ME_mod= 0
##$MI= 1.114404
##$NCOEF= 0
##$NC_proc= 0
##$NLEV= 6
##$NOISF1= 3.799351
##$NOISF2= 2.8
##$NSP= 1
##$NTH_PI= 0
##$NZP= 0
##$OFFSET= 15.70392
##$PC= 1
##$PHC0= -21047.77
##$PHC1= 11.05272
##$PH_mod= 1
##$PKNL= yes
##$PPARMOD= 0
##$PSCAL= 0
##$PSIGN= 0
##$REVERSE= no
##$SF= 200.130013532006
##$SI= 16384
##$SIGF1= 3
##$SIGF2= 2
##$SINO= 400
##$SIOLD= 16384
##$SREGLST= <1H.CDCl3>
##$SSB= 0
##$STSI= 0
##$STSR= 0
##$SW_p= 3612.71676300578
##$SYMM= 0
##$S_DEV= 0
##$TDeff= 0
##$TDoff= 0
##$TI= <>
##$TILT= no
##$TM1= 0
##$TM2= 0
##$TOPLEV= 0
##$USERP1= <user>
##$USERP2= <user>
##$USERP3= <user>
##$USERP4= <user>
##$USERP5= <user>
##$WDW= 1
##$XDIM= 8192
##$YMAX_p= 0
##$YMIN_p= 0
$$ End of Bruker specific parameters
$$ ---------------------------------
##NTUPLES= NMR FID
##VAR_NAME=  TIME,          FID/REAL,        FID/IMAG
##SYMBOL=    X,             R,               I
##VAR_TYPE=  INDEPENDENT,   DEPENDENT,       DEPENDENT
##VAR_FORM=  AFFN,          ASDF,            ASDF
##VAR_DIM=   8192,          8192,            8192
##UNITS=     SECONDS,       ARBITRARY UNITS, ARBITRARY UNITS
##FACTOR=    0.0002768,     1,               1
##FIRST=     0,             0,               0
##LAST=      2.2672688,     0,               0
##MIN=       0,             -296637,         0
##MAX=       2.2672688,     241777,          0
$$ Real data points
##PAGE= N=1
##DATA TABLE= (X++(R..R)), XYDATA
$$ plain form
0 0 0 0 0 0 0 0 0 0 0 0 8 -8 8 -8 16 -16 24 -24 32 -40 48 -56 64 -80 89 -105 126 -144 168 -192 217 -248
32 -248 281 -320 361 -406 457 -511 570 -636 709 -787 872 -966 1069 -1181 1303 -1436 1582
49 1582 -1745 1921 -2118 2334 -2576 2847 -3151 3498 -3899 4361 -4908 5567 -6376 7395 -8729
64 -8729 10556 -13222 17505 -25500 45667 -209712 -296637 33721 -50685 -45273 22648 42228
76 42228 46992 177741 123024 4490 102948 241777 66473 -81712 42661 142617 41361
87 41361 31514 80597 -18564 -127311 -61538 -47640 -150368 -153261 -82134 -137733 -172030 -51342
99 -51342 21692 -33479 3488 108747 84635 19127 71592 112755 67756 71837 111456 56816
111 56816 7802 69135 84154 -19959 -61313 -11515 -37716 -113395 -97765 -62094 -93696 -93801
$$ packed form
0@%%%%%%%%%%Qj6J6j6K4l2M0m8N6p2Q8j04J20j44J69j94K31k70L12l60M09m65
32b48N29o01O81p67Q63r68J081j206J345j496J659j838K035k250K484k739L018
49A582l327L666m039M452m910N423n998O649p397Q260r269J0475j1943J3771j6124
64h729J9285k3778L0727m3005P1167k55379q6925L30358q4406N412O7921J9580
76D2228M764J30749n4717j18534R8458J38829j75304j48185J24373R9956j01256
87D1361r847M9083r9161j08747O5773J3898j02728k893P1127n5599l4297J20688
99e1342P3034n5171L6967J05259k4112o5508N2465M1163m4999M081L9619n4640
111E6816m9014O1333J5019j04113m1354M9798k6201p5679J5630L5671l1602j05
$$ plain form
123 -93801 -40590 -47198 -74868 -20813 28531 -271 8721 78010 81427 47576 84265 113875 59829
136 59829 31772 64028 39827 -23273 -18050 1770 -37858 -56114 -24525 -34563 -71814 -54032
148 -54032 -32216 -62823 -70161 -31013 -25224 -36753 3560 45155 36573 44968 87002 84871 48848
161 48848 50044 58286 23490 -5599 2712 -1709 -24092 -19279 -6685 -23760 -37422 -26718 -32558
174 -32558 -55263 -50423 -33671 -40108 -38735 -6874 13384 11380 29570 57618 51914 35890 44533
187 44533 46850 22820 12654 20015 9213 -8525 -4781 -4121 -20501 -22838 -14228 -27721 -41699
200 -41699 -29977 -23709 -35403 -26713 -2684 -2326 -7533 9643 23330 17031 21670 36072 31876 21851
214 21851 26324 26016 12379 7599 8518 -4653 -18506 -17188 -18785 -26822 -21745 -10039 -12206 -16839
$$ packed form
123i3801N3211o608k7670N4055M9344k8802Q992O9289L417l3851L6689K9610n4046
136E9829k8057L2256k4201o3100N223J9820l9628j8256L1589j0038l7251J7782
148e4032K1816l0607p338L9148N789j1529M0313M1595q582Q395M2034k131l6023
161D8848J196Q242l4796k9089Q311m421k2383M813J2594j7075j3662J0704n840
174c2558k2705M840J6752o437J373L1861K0258k004J8190K8048n704j6024Q643
187D4533K317k4030j0166P361j0802j7738L744O60j6380k337Q610j3493j3978
200d1699J1722O268j1694Q690K4029L58n207J7176J3687o299M639J4402m196j0025
214B1851M473l08j3637m780R19j3171j3853J318j597q037N077J1706k167m633
$$ plain form
228 -16839 -8088 -1503 -7851 -8669 -712 1412 -2008 3604 13775 18073 22417 27606 24959 16281 11291
243 11291 5679 -5953 -14268 -13392 -16026 -21415 -15758 -5228 -3976 -2627 5749 6618 -3052 -5402 -848
258 -848 -4312 -8424 -1871 5351 6464 11312 17738 16611 14257 13289 3471 -10087 -12472 -11366 -17364
273 -17364 -18308 -7694 -2347 -3641 1049 7430 6311 3644 4460 2855 -757 670 4001 4763 6221
288 6221 7730 5505 3098 3897 2172 -2792 -5333 -5837 -9609 -14683 -13707 -8656 -6496 -6930 -4143 1034
304 1034 4114 4548 7759 11445 11863 10392 9938 9216 8920 8493 4491 -989 -3777 -5385 -9320 -10003 -5325
321 -5325 -5003 -8997 -8936 -7125 -9803 -12171 -8893 -5769 -4224 -573 6114 11879 17575 21100 19507 15893
337 15893 13920 8550 1011 -1982 -2053 -6693 -10619 -8693 -6463 -7897 -8418 -7394 -8092 -11084 -12819 -12957
$$ packed form
228a6839Q751O585o348q18P957K124l420N612J0171M298M344N189k647q678m990
243A1291n612j1632q315Q76k634n389N657J0530J252J349Q376Q69r670k350M554
258h48l464m112O553P222J113M848O426j127k354r68r818j3558k385J106n998
273a7364r44J0614N347j294M690O381j119k667Q16j605l612J427L331P62J458
288F221J509k225k407P99j725m964k541n04l772n074R76N051K160m34K787N177
304A034L080M34L211L686M18j471m54p22k96m27m002n480k788j608l935o83M678
321e325L22l994O1J811k678k368L278L124J545L651O687N765N696L525j593l614
337A5893j973n370p539k993p1m640l926J926K230j434n21J024o98k992j735j38
$$ plain form
353 -12957 -10130 -5656 -2071 2377 9190 15287 18569 20380 21240 18895 13392 7505 2726 -909 -4858
368 -4858 -7695 -8081 -7496 -9449 -11696 -11229 -10431 -12603 -14753 -13038 -9535 -7222 -3499 1564 6894 12178
384 12178 14942 15564 17637 19919 17243 12895 11199 8185 2061 -2890 -4406 -7716 -12543 -14575 -15441
399 -15441 -16120 -16020 -15215 -13620 -10544 -6689 -4538 -1559 3468 7463 8808 11961 16000 17045 16967 17991
415 17991 18377 15370 10154 5651 1082 -3346 -9802 -15666 -17406 -16881 -17596 -18726 -15813 -11520 -9306 -7864
431 -7864 -4603 -1027 2012 4708 7021 10869 14685 16587 17869 20443 19973 16046 11954 8416 2978
446 2978 -4173 -9084 -12294 -15632 -17558 -17425 -16235 -14319 -12636 -11476 -8682 -4996 -2984 -1541 2870
461 2870 8167 10101 11263 15217 18497 18884 16699 14633 11948 8485 3226 -2731 -5574 -7964 -11752
$$ packed form
353a2957K827M474L585M448O813O097L282J811Q60k345n503n887m779l635l949
368d858k837l86N85j953k247M67P98k172k150J715L503K313L723N063N330N284
384A2178K764O22K073K282k676m348j696l014o124m951j516l310m827k032q66
399a5441o79J00Q05J595L076L855K151K979N027L995J345L153M039J045p8J024
415A7991L86l007n216m503m569m428o456n864j740N25p15j130K913M293K214J442
431g864L261L576L039K696K313L848L816J902J282K574m70l927m092l538n438
446B978p151m911l210l338j926J33J190J916J683J160K794L686K012J443M411
461B870N297J934J162L954L280L87k185k066k685l463n259n957k843k390l788
$$ plain form
476 -11752 -15189 -15314 -14014 -14572 -13715 -11193 -8643 -6740 -3757 -299 3674 6749 8946 10599 12597 14444
492 14444 13617 13128 13071 10824 6492 3447 987 -2982 -7133 -9803 -11598 -12943 -14317 -14632 -12313 -8445
508 -8445 -7205 -6312 -2497 2096 4166 5072 7961 10611 10734 10272 10450 10566 10531 8851 6085 4080 1832
525 1832 -2556 -6382 -7999 -10020 -13229 -13958 -12195 -10499 -8953 -6202 -2656 -255 1231 2662 4853
540 4853 7552 8384 8200 9214 10942 10180 7990 7012 6844 3555 -477 -3294 -5024 -7244 -9266 -11450
556 -11450 -11145 -9887 -9384 -8885 -5604 -1864 -616 412 3092 4918 5343 6689 8494 9023 9503 8376
572 8376 7349 6968 5252 1798 -989 -1834 -4325 -7159 -8039 -7223 -7815 -8865 -8102 -6639 -5294 -3795 -2247
589 -2247 -15 2860 4077 4306 6187 8049 7880 6429 6375 6421 4538 2045 1196 236 -1310 -3247 -4979
$$ packed form
476a1752l437j25J300n58Q57K522K550J903K983L458L973L075K197J653J998J847
492A4444q27m89n7k247m332l045k460l969m151k670j795j345j374l15K319L868
508h445J240Q93L815M593K070R06K889K650J23m62J78J16l5j680k766k005k248
525A832m388l826j617k021l209p29J763J696J546K751L546K401J486J431K191
540D853K699Q32j84J014J728p62k190r78j68l289m032k817j730k220k022k184
556a1450L05J258N03M99L281L740J248J028K680J826M25J346J805N29M80j127
572H376j027l81j716l454k787q45k491k834q80Q16n92j050P63J463J345J499J548
589b247K232K875J217K29J881J862j69j451n4M6j883k493q49r60j546j937j732
$$ plain form
606 -4979 -5277 -5628 -6615 -6991 -5778 -4260 -4484 -3514 -557 1341 1827 3190 4939 5778 5504 4893 4767 4811
624 4811 3817 1707 722 1059 -278 -2686 -3658 -2712 -3891 -5555 -5505 -4431 -3529 -3245 -2277 -475 1472 2192
642 2192 1898 3622 4893 4243 3582 3596 3982 2439 1117 1204 383 -800 -2120 -3098 -3091 -3805 -4880 -5263 -3736
661 -3736 -2923 -2755 -1935 769 1742 1655 2373 4074 4305 3790 3365 3704 3822 2720 1423 958 864 -302 -2625
680 -2625 -3117 -3122 -4250 -5185 -4752 -3922 -3744 -2944 -2032 -285 1369 1547 2033 3752 4686 3974 3455 4341 4045
699 4045 2975 1821 1781 989 -731 -1847 -2598 -2662 -3101 -4432 -4690 -3586 -3584 -4064 -3210 -1023 71 202 1348
718 1348 3511 4124 4040 4395 4409 4375 3079 1686 1423 1076 -379 -1809 -2144 -1963 -3086 -3595 -3291 -2880 -3488
737 -3488 -3625 -2988 -1691 -876 -449 378 2420 3845 3306 3784 5125 4825 3313 2274 2061 892 -915
$$ packed form
606d979k98l51r87l76J213J518k24R70K957J898M86J363J749Q39k74o11j26M4
624D811r94k110r85L37j337k408r72R46j179j664N0J074R02K84R68J802J947P20
642B192k94J724J271o50o61J4L86j543j322Q7q21j183j320r78Pp14j075l83J527
661c736Q13J68Q20K704R73q7P18J701K31n15m25L39J18j102j297m65r4j166k323
680b625m92nj128r35M33Q30J78Q00R12J747J654J78M86J719R34p12n19Q86k96
699D045j070j154m0p92j720j116p51o4m39j331k58J104Km80Q54K187J094J31J146
718A348K163O13q4L55J4l4j296j393k63l47j455j430l35J81j123n09L04M11o08
737c488j37O37J297Q15M27Q27K042J425n39M78J341l00j512j039k13j169j807
$$ plain form
754 -915 -1882 -2107 -2145 -2584 -3346 -3637 -2668 -2604 -3465 -2514 -1226 -1451 -1229 328 1934 2671 3264 3994 5105 4931
774 4931 4211 3273 2818 1807 -569 -1722 -1595 -2308 -3567 -4289 -3489 -3473 -3901 -3774 -2824 -2025 -1247 -1036 -99
793 -99 975 2227 2429 3213 4819 5054 4154 4149 4256 3476 1853 357 -657 -1757 -3106 -4032 -4223 -3864 -4177
812 -4177 -4463 -3666 -2276 -2236 -2149 -710 821 684 1190 2441 3213 4002 3934 3931 4812 4805 3202 2031 1574 377
832 377 -1885 -3426 -3582 -4009 -4617 -4421 -3683 -3007 -2638 -2096 -964 -86 144 45 815 2237 2615 2393 3243
851 3243 4229 4065 3580 3323 2850 1714 -13 -1562 -2405 -2758 -4236 -4492 -3577 -2864 -2846 -2523 -1183 -278 -197
870 -197 -9 786 1229 1440 1468 2006 3012 3404 2761 2755 3081 2331 772 -407 -955 -1643 -3064 -3827 -3431 -3476
890 -3476 -3278 -2808 -1776 -555 -135 -15 790 2006 1582 1387 2049 2515 2151 1585 2359 2726 1872 938 618
$$ packed form
754i15r67k25l8m39p62k91R69O4q61R51J288k25K22J557J606P37N93P30J111j74
774D931p20r38m55j011k376j153J27p13j259p22Q00J6m28J27R50P99P78K11R37
793i9J074J252K02P84J606K35r00nJ07p80j623j496j014j100j349r26j91L59l13
812d177k86P97J390M0Q7J439J531j37N06J251P72P89o8lQ81pj603j171m57j197
832C77k262j541j56m27o08J96P38O76L69N42J132Q78K30r9P70J422L78k22Q50
851C243R86j64m85k57m73j136j727j549q43l53j478k56R15P13J8L23J340R05Q1
870a97J88P95M43K11K8N38J006L92o43oL26p50j559j179n48o88j421p63L96m5
890c476J98M70J032J221M20J20Q05J216m24j95O62M66l64n66P74L67q54r34l20
$$ plain form
909 618 175 -493 -1764 -2754 -2908 -2860 -3892 -3673 -2658 -1748 -957 -539 1335 1870 1771 1898 2585 2383 2178 1555
929 1555 1520 1932 1589 1109 1103 1174 318 -802 -1294 -1758 -2655 -3551 -4043 -3219 -2598 -2456 -1523 115 1164 1633
949 1633 1614 2433 3062 2036 1494 1609 1771 1169 907 930 1163 872 48 -207 -341 -929 -2464 -2951 -2830 -2938
969 -2938 -2848 -2690 -1086 -113 136 839 1831 2483 2044 1836 1614 1806 1022 476 606 775 438 -81 181 320
989 320 61 -920 -1290 -1455 -1642 -2261 -2200 -1560 -729 -548 -323 854 1588 1718 1677 2113 1968 1076 405 289 5
1010 5 -389 -908 -388 66 -22 -647 -346 -255 -823 -1410 -1348 -1164 -1270 -1230 -712 587 971 1230 1403 2011 2511 1773
1032 1773 932 1093 347 -511 -999 -1208 -813 -885 -1154 -772 -238 -392 -748 -706 -681 -730 -1084 -941 -56 127 457
1053 457 1047 1968 2397 1948 2062 1925 1085 368 -583 -686 -930 -1488 -1702 -1360 -447 -602 -1190 -698 -109 -589
$$ packed form
909F18m43o68j271r90j54M8j032K19J015R10P91M18J874N35r9J27O87k02k05o23
929A555l5M12l43m80oP1q56j120m92m64q97q96m92Q24O21J42R33J638J049M69
949A633j9Q19O29j026n42J15J62o02k62K3K33k91q24k55j34n88j535m87J21j08
969b938R0J58J604R73K49P03R92O52m39k08k22J92p84n46J30J69l37n19K62J39
989C20k59r81l70j65j87o19O1O40Q31J81K25J177P34J30m1M36j45q92o71j16k84
1010El94n19N20M54q8o25L01R1n68n87O2J84j06M0N18J299L84K59J73O08N00p38
1032A773q41J61p46q58m88k09L95p2k69L82N34j54l56M2K5m9l54J43Q85J83L30
1053D57N90R21M29m49J14j37q40p17r51j03k44n58k14L42R13j55n88M92N89m80
$$ plain form
1073 -589 -1230 -892 -468 -151 -254 212 984 1694 1473 1525 2089 1593 1254 159 142 -276 -1050 -1594 -1207 -1002
1093 -1002 -1110 -1162 -763 -135 -63 -179 -202 130 30 -686 -554 375 409 456 808 1608 1734 1194 1039 930 626
1114 626 -217 -1106 -1067 -682 -1163 -1647 -1087 -99 -260 -197 393 1017 345 -89 261 330 199 -380 -245 592 1056
1135 1056 711 672 828 970 55 -445 -593 -991 -1575 -1625 -1194 -787 -602 -543 295 873 943 379 745 996 434
1156 434 -8 82 557 383 260 518 923 682 140 -149 -299 -262 -1182 -1679 -1344 -933 -1389 -1279 -248 409
1176 409 518 623 960 1053 1000 738 305 691 503 -63 206 797 573 144 218 551 327 -547 -905 -899 -1217 -1390
1198 -1390 -1517 -1030 -457 -245 147 493 1039 891 486 833 931 384 -227 308 165 155 221 303 601 487 142
1219 142 61 -45 -169 -1158 -1144 -903 -862 -1111 -439 -20 266 733 565 663 1126 456 -60 -5 268 -60 -351 -154
$$ packed form
1073e89o41L38M24L17j03M66P72P10k21N2N64m96l39j095j7m18p74n44L87K05
1093a002j08n2L99O28P2j16k3L32j00p16J32R29L4M7L52Q00J26n40j55j09l04
1114F26q43q89L9L85m81m84N60R88j61O3N90O24o72m34L50O9j31n79J35Q37M64
1135A056l45l9J56J42r15n00j48l98n84n0M31M07J85N9Q38N78P0n64L66K51n62
1156D34m42R0M75j74j23K58M05k41n42k89j50L7r20m97L35M11m56J10J031O57
1176D09J09J05L37R3n3k62m33L86j88n66K69N91k24m29P4L33k24q74l58Ol18j73
1198a390j27M87N73K12L92L46N46j48m05L47R8n47o11N35j43j0O6Q2K98j14l45
1219A42q1j06j24r89J4K41M1k49O72M19K86M67j68R8M63o70n16N5K73l28k91J97
$$ plain form
1241 -154 268 373 1 197 355 320 -93 -355 -465 -440 -792 -886 -198 30 294 255 849 888 919 488 312 -31
1263 -31 -336 -649 -514 -230 -473 -461 -299 377 250 134 -102 174 -12 -572 -489 -350 177 -321 43 371 730
1284 730 756 383 747 700 263 -1 -390 -481 -854 -784 -582 -303 -254 -311 175 180 237 -195 -335 -73 -98 -361 -415 18
1308 18 540 262 180 782 1100 727 273 339 188 -244 -680 -544 -382 -373 -604 -284 350 154 7 -191 30 -275
1330 -275 -240 -441 -197 -4 -145 -118 586 578 591 193 384 742 66 -125 -229 -137 -292 -548 -383 178 128 73 121
1353 121 589 198 142 -249 21 70 -514 -460 27 -142 24 119 257 272 93 -123 -16 -229 -386 -419 -463 44
1375 44 151 -79 395 616 524 434 556 632 57 -207 -308 59 -78 -265 -152 141 266 -296 -67 -11 -233 -454
1397 -454 -550 -386 -164 -232 -406 77 504 574 520 494 857 621 267 -20 227 87 -208 -497 -57 -175 -219 -272
$$ packed form
1241a54M22J05l72J96J58l5m13k62j10K5l52r4O88K28K64l9N94L9L1m31j76l43
1263c1l05l13J35K84k43J2J62O76j27j16k36K76j86n60Q3J39N27m98L64L28L59
1284G30K6l73L64m7m37k64l89r1l73P0K02K79M9n7M86NN7m32j40K62k5k63n4M33
1308A8N22k78q2O02L18l73m54O6j51m32m36J36J62Rk31L20O34j96j47j98K21l05
1330b75L5k01K44J93j41K7P04qJ3l98J91L58o76j91j04R2j55k56J65N61n0n5M8
1353A21M68l91n6l91K70M9n84N4M87j69J66R5J38J5j79k16J07k13j57l3m4N07
1375D4J07k30M74K21r2r0J22P6n75k64j01L67j37j87J13K93J25n62K29N6k22k21
1397d54r6J64K22o8j74M83M27P0n4k6L63k36l54k87K47j40k95k89M40j18m4n3
$$ plain form
1419 -272 38 165 -336 -587 -123 -375 -587 -531 -285 216 -143 43 521 711 546 415 391 403 248 53 -394
1440 -394 -209 -177 -241 -249 149 169 -30 66 26 76 -371 -574 -324 -111 -87 -263 217 278 212 310 427 470 130 192 -140
1465 -140 -133 -92 -738 -457 -123 -108 39 -34 76 141 223 68 -17 109 40 -206 270 349 403 328 594 614 245 -32
1489 -32 103 -56 -200 -570 -896 -368 -349 -558 -380 40 118 24 -97 99 309 106 -146 178 262 130 49 302
1511 302 637 576 285 94 248 -150 -631 -447 -787 -661 -675 -738 -424 -124 -366 -231 284 72 111 -200 150
1532 150 294 209 51 230 382 590 551 566 559 405 16 -368 -199 -197 -573 -715 -532 -383 -646 -383 219 319
1554 319 -34 211 425 290 136 -343 355 456 -8 104 220 410 254 108 -3 105 -236 -376 -588 -166
1574 -166 -421 -437 -762 65 149 -70 419 626 212 267 161 317 177 7 -168 97 202 -183 -190 -91 312 197
$$ packed form
1419b72L10J27n01k51M64k52k12N6K46N01l59J86M78J90j65j31k4J2j55j95m47
1440c94J85L2o4qL98K0j99R6m0N0m47k03K50K13K4j76M80O1o6R8J17M3l40O2l32
1465a40PM1o46K81L34J5J47p3J10O5Q2j55q5J26o9k46M76P9N4p5K66K0l69k77
1489c2J35j59j44l70l26N28J9k09J78M20P8r4j21J96K10k03k52L24Q4j32q1K53
1511C02L35o1k91j91J54l98m81J84l40J26j4o3L14L00k42J35N15k12L9l11L50
1532A50J44q5j58J79J52K08l9J5pj54l89l84J69Kl76j42J83J49k63K63O02J00
1554C19l53K45K14j35j54m79O98J01m64J12J16J90j56j46j11J08l41j40k12M22
1574a66k55j6l25Q27Q4k19M89K07m14N5j06J56j40j70j75K65J05l85pR9M03j15
$$ plain form
1596 197 -449 -217 -417 -603 -793 -493 -81 -239 98 325 713 793 408 466 537 392 79 88 171 252 -139 -123 -24
1619 -24 -155 -229 -490 -536 -401 -750 -839 -519 -434 -395 -283 7 355 585 359 395 774 408 522 385 419 236 -215
1642 -215 -118 -155 74 -146 -465 -202 -138 -522 -607 -438 -270 -546 -266 -1 80 318 236 318 817 464 638 596 768
1665 768 403 124 -171 267 -174 -164 -284 -132 -226 -183 -537 -346 -396 -424 -556 -327 -130 -92 -75 110 615 339
1687 339 544 558 509 525 280 -172 151 -28 -139 -463 65 -126 -336 -418 -135 -15 -354 -454 -140 -53 -123 -116 302
1710 302 190 39 352 438 530 614 509 140 295 175 -236 -164 -228 -423 -468 -600 -103 40 -359 -329 -10 70 -227
1733 -227 -107 215 163 108 341 202 804 388 391 446 497 389 90 -168 -405 -340 -394 -978 -510 -568 -576 -313 -146 232
1757 232 48 33 74 155 242 247 451 748 732 510 683 828 462 150 7 161 -225 -235 -640 -499 -789 -557 -494
$$ packed form
1596A97o46K32k00j86j90L00M12j58L37K27L88Q0l85N8P1j45l13RQ3Q1l91J6R9
1619b4j31p4k61m6J35l49q9L20Q5L9J12K90L48K30k26L6L79l66J14j37L4j83m51
1642b15R7l7K29k20l19K63O4l84q5J69J68k76K80K65Q1K38q2Q2M99l53J74m2J72
1665G68l65k79k95M38m41J0j20J52r4M3l54J91n0k8j32K29J97L8J7J85N05k76
1687C39K05J4m9J6k45m52L23j79j11l24N28j91k10q2K83J20l39j00L14Q7p0PM18
1710C02j12j51L13Q6R2Q4j05l69J55j20m11P2o4j95m5j32M97J43l99L0L19Q0k97
1733b27J20L22n2n5K33j39O02m16LN5N1j08k99k58k37O5n4n84M68n8qK63J67L78
1757B32j84j5M1Q1Q7NK04K97j6k22J73J45l66l12j43J54l86j0m05J41k90K32O3
$$ plain form
1780 -494 -390 -475 -291 -201 5 354 84 144 259 524 401 633 597 751 464 498 395 356 -117 -352 -255 -691
1802 -691 -698 -791 -415 -272 -297 -543 -315 -139 36 -40 2 188 295 385 244 380 658 332 338 369 120 -111 69
1825 69 -16 -284 -359 -572 -794 -602 -277 -432 -669 -109 378 20 124 323 358 274 468 300 319 422 137 138 323
1848 323 155 -173 -119 -210 -320 -493 -822 -292 -591 -619 -309 105 120 6 242 312 496 326 477 561 518 416
1870 416 180 152 315 -60 -235 207 -24 -406 -741 -604 -565 -776 -539 -713 -255 -330 -217 207 316 501 394
1891 394 683 600 389 424 190 718 215 233 -189 30 -88 -275 -440 -543 -509 -511 -611 -516 -557 -343 -322 -209 143
1914 143 51 336 404 609 767 245 386 297 361 99 -6 153 100 -206 -136 12 -245 -174 -450 -441 -670 -411 -556
1937 -556 -197 -139 -185 289 145 570 878 388 383 216 494 284 186 41 -103 -19 -333 -141 -165 -196 -113 -274 -71
$$ packed form
1780d94J04q5J84R0K06L49k70O0J15K65j23K32l6J54k87L4j03l9m73k35R7m36
1802f91pr3L76J43k5k46K28J76J75p6M2J86J07R0j41J36K78l26OL1k49k31J80
1825F9q5k68p5k13k22J92L25j55k37N60M87l58J04J99L5q4J94j68J9J03k85JJ85
1848C23j68l28N4r1j10j73l29N30k99k8L10M14J5j14K36P0J84j70J51Q4m3j02
1870D16k36k8J63l75j75M42k31l82l35J37L9k11K37j74M58p5J13M24J09J85j07
1891C94K89q3k11L5k34N28n03J8m22K19j18j87j65j03L4kj00R5m1K14K1J13L52
1914A43r2K85O8K05J58n22J41q9O4k62j05J59n3l06P0J48k57P1k76Rk29K59j45
1937e56L59N8m6M74j44M25L08m90nj67K78k10r8j45j44Q4l14J92k4l1Q3j61K03
$$ plain form
1960 -71 -209 -161 -271 -257 113 0 122 300 367 800 539 499 644 94 481 0 -35 -99 19 -224 -454 -625
1982 -625 -280 -223 -276 -296 -381 -224 -330 -110 -94 73 423 437 603 244 530 531 449 431 111 66 -154 -422 -74 -219
2006 -219 -216 -279 -552 -347 -290 -287 -417 -506 -341 -75 -75 94 317 493 420 371 394 312 383 404 421 -77 -46 50 -203 -261
2032 -261 -628 -291 -425 -361 -550 -194 -349 72 -265 -199 196 -3 270 437 287 121 431 538 514 400 55
2053 55 31 283 -40 -305 -274 -195 -369 -534 -359 -306 -480 -114 -123 -151 -43 159 -72 -47 416 -17 264 474 425
2076 425 401 246 -47 321 -140 -132 -139 -225 -296 -520 -449 -361 -150 -261 -20 -302 143 83 -47 224 486 473 275 366
2100 366 434 722 135 28 127 -32 -175 -322 -409 -213 -813 -388 -359 -209 -336 -430 -9 44 -123 63 347 378
2122 378 121 254 489 281 336 106 86 326 216 -164 -160 42 -344 -202 -524 -432 -227 -445 -468 -17 -54 -189
$$ packed form
1960g1j38M8j10J4L70j13J22J78O7M33k61m0J45n50L87m81l5o4J18k43k30j71
1982f25L45N7n3k0q5J57j06K20J6J67L50J4J66l59K86Jq2j8l20m5k20k68L48j45
2006b19Lo3k73K05N7Lj30q9J65K66%J69K23J76p3m9K3q2P1K1J7m98L1R6k53n8
2032b61l67L37j34O4j89L56j55M21l37O6L95j99K73J67j50j66L10J07k4j14l45
2053E5k4K52l23k65L1P9j74j65J75N3j74L66rk8J08K02k31K5M63m33K81K10m9
2076D25k4j55k93L68m61Qpq6p1k24P1Q8K11j11K41k82M45o0j30K71K62j3j98R1
2100C66O8K88n87j07R9j59j43j47q7J96o00M25K9J50j27r4M21N3j67J86K84L1
2122C78k57J33K35k08N5k30k0K40j10l80MK02l86J42l22R2K05k18k3M51l7j35
$$ plain form
2144 -189 266 88 85 64 224 480 379 156 294 54 237 351 233 -69 18 -144 -235 -383 -182 -449 -430 -407
2166 -407 -308 -123 -167 -88 35 177 189 107 382 145 103 118 302 94 270 167 399 -161 85 -17 -292 -109
2188 -109 -353 -477 -239 -471 -369 -409 -55 -78 125 44 232 313 256 162 46 364 73 363 64 74 107 -37 11
2211 11 -159 1 -503 -597 -426 -298 -259 -442 -416 -109 153 216 627 307 281 234 198 364 607 107 198 -15 125
2234 125 10 -145 -160 -26 -179 -263 -142 -375 -200 -411 -186 -179 -68 82 58 234 113 187 146 506 215 322
2256 322 335 293 34 -53 134 -112 -258 -31 -277 -433 -480 -449 -503 -459 -195 -249 -126 185 147 295 244 215 257 346
2280 346 447 133 228 124 -55 112 -252 -154 -25 -449 -551 -152 -234 -398 -156 -417 -156 -413 106 69 224
2301 224 75 -166 66 381 402 193 475 293 259 219 69 94 -311 -83 -178 -26 -379 -327 -173 -244 -47 -93 -163
$$ packed form
2144a89M55j78lk1J60K56j01k23J38k40J83J14j18l02Q7j62r1j48K01k67J9K3
2166d07R9J85m4P9J23J42J2q2K75k37m2J5J84k08J76j03K32n60K46j02k75J83
2188a09k44j24K38k32J02m0L54k3K03q1J88Q1n7r4j16L18k91K90k99J0L3j44M8
2211A1j70J60n04r4J71J28L9j83K6L07K62O3M11l20k6m7l6J66K43n00R1k13J40
2234A25j15j55j5J34j53q4J21k33J75k11K25PJ11J50k4J76j21P4m1L60k91J07
2256C22J3m2k59q7J87k46j46K27k46j56m7L1n4M4K64n4J23L11l8J48n1k9M2Q9
2280C46J01l14R5j04j79J67l64R8J29m24j02L99q2j64K42k61K61k57N19l7J55
2301B24j49k41K32L15K1k09K82j82l4m0j50K5m05K28r5J52l53N2J54p1J97m6p0
$$ plain form
2324 -163 -101 -141 -107 94 157 154 253 274 389 263 185 139 261 167 -113 -13 -317 -250 -533 -283 -83 -207 -299 -346 -165
2349 -165 -188 75 -104 279 142 384 315 400 351 139 140 265 218 196 -361 -248 -11 -349 -178 -216 -217 -321 -457 -244
2373 -244 -129 -48 -193 -28 94 361 202 382 214 146 199 250 300 101 70 -317 -63 17 -272 -402 -351 -128 -26
2396 -26 -478 -263 -186 -99 -249 102 -56 105 5 -85 101 156 358 695 157 -4 96 43 103 80 78 -113 -224
2419 -224 -212 -409 -348 -134 -190 5 33 -249 16 -61 -72 41 -283 143 2 201 398 100 189 177 -69 100 74
2442 74 -299 -351 -156 10 -287 -279 -355 -190 -233 -207 -42 -66 100 354 80 300 133 106 108 296 318 -49 245 277
2466 277 146 -17 -313 -210 -73 -33 -326 -37 -295 -289 129 -89 48 202 15 127 3 169 227 31 342
2487 342 204 159 151 52 -40 54 -281 39 -116 -110 -277 -99 -158 -99 -287 -182 -127 43 -17 63 135 218 104 154 292
$$ packed form
2324a63O2m0L4K01O3lR9K1J15j26p8m6J22r4k80J00l04O7k83K50K00j24r2m7J81
2349a65k3K63j79L83j37K42o9Q5m9k12JJ25m7k2n57J13K37l38J71l8jj04j36K13
2373b44J15Q1j45J65J22K67j59J80j68o8N3N1N0j99l1l87K54Q0k89j30N1K23J02
2396b6m52K15P7Q7j50L51j58J61j00r0J86N5K02L37n38j61J00n3O0k3kj91j11
2419b24J2j97O1K14n6J95K8k82K65p7j1J13l24M26j41J99J97k98Q9j2k46J69k6
2442G4l73n2J95J66k97Qp6J65m3K6J65k4J66K54k74K20j67k7KJ88K2l67K94L2
2466B77j31j63k96J03J37M0k93K89k58OM18k18J37J54j87J12j24J66N8j96L11
2487C42j38m5qr9r2R4l35L20j55Oj67J78n9N9j88J05N5J70o0Q0P2Q3j14N0J38
$$ plain form
2512 292 140 99 148 116 -79 115 -63 176 -238 -124 -438 -226 -100 -321 -64 -486 -76 -263 -69 297 136
2533 136 208 213 147 352 568 -132 279 406 -3 -178 45 -59 91 -58 -130 -252 -362 -103 -262 -167 -181 -338
2555 -338 -47 -32 84 224 -14 363 208 258 100 220 11 434 -105 81 158 -122 -38 10 -101 -324 -8 -255
2577 -255 -362 -46 -85 -38 -161 263 70 56 37 187 112 351 438 346 169 -41 270 118 -261 -51 153 -284
2599 -284 -51 -215 -150 -243 -31 -105 57 164 136 240 7 289 347 406 306 136 279 376 31 218 18 215
2621 215 -119 -185 -119 -164 -68 -324 -294 -43 -42 -300 -43 -217 -228 -70 96 76 307 397 92 294 87 -10 40 97
2645 97 15 26 191 64 -152 -157 6 -37 187 -35 -127 -56 -233 -100 -37 119 8 52 96 -7 62 344 220 214 74
2670 74 -28 -16 241 -171 -48 -76 -253 -6 -120 -129 -402 57 -455 -34 -53 171 253 -5 -26 198 117 167 161 50
$$ packed form
2512B92j52m1M9l2j95J94j78K39m14J14l14K12J26k21K57m22M10j87J94L66j61
2533A36P2No6K05K16p00M11J27m09j75K23j04J50j49p2j22j10K59j59R5j4j57
2555c38K91J5J16J40k38L77j55N0j58J20k09M23n39J86P7k80Q4M8j11k23L16k47
2577b55j07L16l9M7j23M24j93j4j9J50p5K39Q7r2j77k10L11j52l79K10K04m37
2599b84K33j64O5r3K12p4J62J07k8J04k33K82N8N9j00j70J43R7l45J87k00J97
2621B15l34o6O6m5R6k56L0K51Jk58K57j74j1J58J66k0K31R0l05K02k07r7N0N7
2645I7q2J1J65j27k16nJ63m3K24k22r2P1j77J33O3J56j11M4M4j03O9K82j24oj40
2670G4j02J2K57m12J23k8j77K47j14rk73M59n12M21j9K24Q2k58k1K24q1N0oj11
$$ plain form
2694 50 228 216 -223 -84 75 -30 -25 -137 -15 -333 -93 -85 -47 -106 -152 178 -45 79 -197 -50 15 -71 165 163
2718 163 -128 204 97 -8 145 76 -62 -154 -39 85 -106 -173 -109 -103 -16 4 -104 -247 -353 127 84 83 -167 95
2742 95 123 23 283 44 248 -40 -19 -12 -286 -196 -189 -312 -284 -1 -234 -277 203 -215 33 -17 -255 69 284 53
2766 53 258 135 134 62 210 -26 340 208 164 -29 121 217 -42 -86 -250 -143 -79 -329 -83 -72 118 99 -62
2789 -62 -16 147 202 -215 305 207 288 100 143 214 118 138 17 -25 121 -2 -183 -108 -192 -138 -260 -166 -137 -126 -167 95
2815 95 2 11 -30 149 10 177 310 354 -66 -14 167 42 -58 -158 49 -115 -174 28 -25 -53 38 -159 -35 80
2839 80 420 -43 253 275 205 65 8 90 136 284 42 271 34 -66 79 -94 57 39 8 -205 28 -191 3
2862 3 -4 87 241 -162 39 304 81 237 158 302 116 17 54 333 58 -82 114 459 34 -12 -89 -257 -27
$$ packed form
2694E0J78j2m39J39J59j05Nj12J22l18K40QL8n9m6L30k23J24k76J47O5q6K36k
2718A63k91L32j07j05J53o9j38r2J15J24j91o7O4OQ7K0j08j43j06M80m3jk50K62
2742I5K8j00K60k39K04k88K1Pk74R0Pj23K8K83k33m3M80m18K48n0k38L24K15k31
2766E3K05j23jp2J48k36L66j32m4j93J50R6k59m4j64J07O4k50K46J1J90j9j61
2789f2M6J63N5m17N20r8Q1j88M3P1r6K0j21m2J46j23j81P5q4N4j22R4K9J1m1K62
2815I5r3Rm1J79j39J67J33M4m20N2J81j25j00j00K07j64n9K02n3k8R1j97J24J15
2839H0L40m63K96K2p0j40n7Q2M6J48k42K29k37j00J45j73J51j8l1k13K33k19J94
2862CpR1J54m03K01K65k23J56p9J44j86r9L7K79k75j40J96L45m25m6p7j68K30
$$ plain form
2885 -27 -70 178 -99 -227 -99 13 -211 183 -116 9 -89 146 80 68 194 264 128 266 181 138 -30 28 -219
2908 -219 26 -367 -62 -66 -90 75 -259 -103 144 -102 80 133 17 -81 130 312 -76 -62 204 59 -93 8
2930 8 -83 -129 -14 4 -281 30 -36 63 -59 -359 -355 -42 -328 3 -140 171 198 188 -29 96 169 202 -57 -45 -178
2955 -178 49 71 -41 -254 -126 43 -51 -308 -7 -101 122 -95 -34 117 -91 23 25 320 202 -52 233 205
2977 205 130 231 -74 -171 -175 38 -15 -125 -70 47 -341 217 -133 24 -5 -207 212 -94 7 211 5 -94 -109
3000 -109 99 164 255 36 27 -71 -34 0 -33 214 -41 -216 -117 -83 -129 -124 -260 -243 -249 -80 -109 -5 -13 -26 133 174 376
3027 376 -89 165 19 60 -14 117 244 -37 -210 78 41 59 24 -52 -188 -49 -9 -343 -12 -24 106 -147 -101
3050 -101 120 -24 40 -5 77 -34 -46 -207 13 11 -50 -63 65 -107 167 -194 80 -92 -219 -93 17 -114 48
$$ packed form
2885b7m3K48k77j28J28J12k24L94k99J25r8K35o6j2J26P0j36J38q5m3j68N8k47
2908b19K45l93L05mk4J65l34J56K47k46J82N3j16r8K11J82l88J4K66j45j52J01
2930Hr1m6J15J8k85L11o6R9j22l00ML13k86L31j43L11K7j0k17J25P3L3k59J2j33
2955a78K27K2j12k13J28J69r4k57L01r4K23k17O1J51k08J14KK95j18k54K85k8
2977B05p5J01l05r7mK13n3j10N5J17l88N58l50J57k9k02M19l06J01K04k06r9j5
3000a09K08O5R1k19rr8L7L4l3K47k55j75R9L4m6Nj36J7oJ69k9J04qj3J59M1K02
3027C76m65K54j46M1p4J31J27k81j73K88l7J8l5p6j36J39M0l34L31j2J30k53M6
3050a01K21j44O4m5Q2j11j2j61K20ko1j3J28j72K74l61K74j72j27J26J10j31J62
$$ plain form
3073 48 173 -85 218 -75 2 28 332 -111 -7 6 45 282 -16 -160 30 33 -381 -119 171 5 115 -104
3095 -104 -130 102 0 2 -52 95 -214 158 -37 -206 138 16 182 65 150 -27 -29 70 -120 -68 152 -71 -74 -144
3119 -144 95 -120 -164 -27 -63 277 166 -124 115 85 95 14 22 -80 51 128 -99 213 -93 -200 -43 -29 -21 -92
3143 -92 -398 65 -6 -222 58 93 146 -172 -99 90 15 51 -86 50 26 -5 -57 135 -222 -114 -86 -61 117 31
3167 31 -266 110 -216 -24 -116 -193 -93 -141 223 -176 -90 250 109 26 -164 176 217 111 -202 64 104 288 -20
3190 -20 -37 35 -74 -171 23 -233 70 -93 -29 -18 -52 43 114 -73 39 -3 -83 82 159 239 45 23 -44 374 127
3215 127 -255 -144 117 -215 -85 -187 -6 -205 -158 -23 -246 162 -91 37 183 -93 204 77 -76 116
3235 116 -25 251 75 -70 -22 -51 -125 -68 -199 104 41 34 58 -85 -12 145 -108 35 -8 -47 1 -181 -137 186
$$ packed form
3073D8J25k58L03k93P7K6L04m43J04J3L9K37k98j44J90Lm14K62K90j66J10k19
3095a04k6K32j02Kn4J47l09L72j95j69L44j22J66j17Q5j77kR9j90N2K20k23lp0
3119a44K39k15m4J37l6L40j11k90K39l0J0q1Qj02J31P7k27L12l06j07J57J4Qp1
3143i2l06M63p1k16K80L5N3l18P3J89p5L6j37J36k4l1n2J92l57J08K8K5J78q6
3167C1k97L76l26J92r2p7J00m8L64l99Q6L40j41q3j90L40M1j06l13K66M0J84l08
3190b0j7P2j09r7J94k56L03j63O4J1l4R5P1j87J12m2q0J65P7Q0j94k2o7M18k47
3215A27l82J11K61l32J30j02J81j99M7J35k23M08k53J28J46k76K97j27j53J92
3235A16j41K76j76j45M8k9p4N7j31L03o3pK4j43P3J57k53J43m3l9M8j82M4L23
$$ plain form
3259 186 74 102 8 161 -88 46 2 35 7 119 30 69 13 -104 -74 9 -188 -191 200 40 15 -69 -46 81 -30
3284 -30 83 118 134 55 21 -3 -59 180 -76 -86 -59 80 -7 -95 -209 -40 -1 -249 -42 108 128 56 50 -119 239
3309 239 27 138 6 -44 -102 -77 17 152 154 50 -13 -158 136 126 -182 -102 402 114 -48 -18 -195 -65 131
3332 131 -102 106 -41 -38 -148 190 57 -82 97 -102 1 93 -63 -185 185 -81 -61 253 -116 221 -37
3353 -37 39 -82 -129 -97 1 120 -164 194 61 64 -61 -48 -96 143 67 30 180 114 -183 142 -165 -96 -124 -16 -13
3378 -13 -29 -224 62 25 -81 29 106 -118 90 54 -103 18 44 -98 -199 26 -122 -240 53 -60 91 -240
3400 -240 -195 -24 -10 65 -201 130 -161 -78 -183 -44 55 143 96 72 64 126 160 -122 215 189 -196 -6 135 -79
3424 -79 -45 28 -129 110 -180 95 138 -103 96 -4 18 -106 216 -10 189 -28 201 -55 139 128 -133 133
$$ packed form
3259A86j12K8r4J53k49J34m4L3k8J12q9L9n6j17L0Q3j97lL91j60k5q4K3J27j11
3284c0J13L5J6p9l4k4n6K39k56j0K7J39q7q8j14J69L9k48K07J50K0p2oj69L58
3309B39k12J11j32n0n8K5R4J35Kj04o3j45K94j0l08Q0N04k88j62L0j77J30J96
3332A31k33K08j47Lj10L38j33j39J79j99J03R2j56j22L70k66K0L14l69L37k58
3353c7P6j21m7L2R8J19k84L58j33Lj25J3m8K39p6l7J50o6k97L25l07O9k8J08L
3378a3j6j95K86l7j06J10P7k24K08l6j57J21K6j42j01K25j48j18K93j13J51l31
3400b40M5J71J4P5k66L31k91Q3j05J39R9Q8m7k4qO2L4k82L37k6l85J90J41k14
3424g9L4P3j57K39k90K75M3k41J99j00K2j24L22k26J99k17K29k56J94j1k61K66
$$ plain form
3446 133 -130 -55 -170 22 -2 -167 -81 245 -175 119 261 4 113 339 -41 44 168 124 209 -187 -142 45
3468 45 119 59 41 67 43 215 -183 -63 -182 -330 135 -1 84 -139 -5 -134 74 70 164 117 -202 34 -65 142
3492 142 127 -44 21 295 -205 -130 10 -2 -91 -94 -108 -287 -146 -31 230 4 -70 134 -54 88 -70 149 100
3515 100 5 -162 -37 -25 18 -79 108 10 159 -13 44 -147 27 -26 -71 31 31 91 53 136 52 -96 -177 -90 127
3540 127 -85 114 15 37 162 -165 -81 153 -2 -110 27 -319 -185 -108 -11 -38 -463 120 -186 -66 18 -178
3562 -178 -51 -261 64 161 313 74 14 101 190 -205 -6 -44 -26 26 9 -127 -37 161 -168 -171 79 79 -221 234
3586 234 -224 -72 108 28 60 -145 125 152 -73 35 -42 -39 69 17 89 56 -48 -6 51 311 -150 52 51 -28 -315
3611 -315 -138 -120 267 311 -183 141 -58 47 -69 183 258 -15 -153 230 129 14 -80 34 129 -146 283 35
$$ packed form
3446A33k63P5j15J92k4j65Q6L26m20K94J42k57J09K26l80Q5J24m4Q5l96M5J87
3468D5P4o0j8K6k4J72l98J20j19j48M65j36Q5k23J34j29K08mR4m7l19K36r9K07
3492A42j5j71O5K74n00P5J40j2q9lj4j79J41J15K61k26p4K04j88J42j58K19m9
3515A00r5j67J25J2M3r7J87r8J49j72N7j91J74n3m5J02%O0l8Q3q4j48q1Q7K17
3540A27k12J99r9K2J25l27Q4K34j55j08J37l46J34P7R7k7m25N83l06J20Q4j96
3562a78J27k10L25R7J52k39o0Q7Q9l95J99l8J8N2j7j36R0J98l29lK50%l00M55
3586B34m58J52J80q0L2k05K70K7k25J08p7LJ08n2P2l3j04M2N7K60m61K02jp9k87
3611c15J77J8L87M4m94L24j99J05j16K52P5k73j38L83j01j15r4J14R5k75M29k48
$$ plain form
3633 35 -221 -3 -112 109 -108 0 -121 88 1 -158 -105 71 -25 -57 12 -94 -237 -184 178 87 8 -13 -126
3656 -126 -110 16 -150 14 51 39 -97 -11 -56 -232 138 -293 97 11 48 138 -116 35 -76 103 15 -64 209
3679 209 -27 -31 -49 -61 102 54 -27 130 -15 18 -112 -246 -227 -100 26 -73 -98 97 53 -53 -5 -57 157 -38
3703 -38 -51 77 110 146 -202 272 139 252 -205 -213 -49 12 -85 -219 89 -61 -36 -57 69 52 -197 -13 206 170
3727 170 -73 249 278 -13 75 -43 126 159 -51 -311 -194 -15 -83 61 128 -189 -72 -185 -68 -101 19 101
3749 101 21 -110 -127 2 6 -113 181 72 88 230 -151 -79 -126 14 21 -72 90 314 4 -228 -69 -126 21 -74
3773 -74 -101 190 81 171 -20 -171 -179 -292 23 -29 -15 -88 -54 55 16 -27 -259 -1 -102 -105 3 -19 -134 -122 56
3798 56 -225 75 -37 -18 -61 314 155 47 -6 -100 74 206 -79 -202 -138 122 -338 -82 3 20 5 7 -132 -106
$$ packed form
3633C5k56K18j09K21k17J08j21K09q7j59N3J76r6l2O9j06j43N3L62r1p9k1j13
3656a26J6J26j66J64L7j2j36Q6m5j76L70m31L90q6L7R0k54J51j11J79q8p9K73
3679B09k36mj8j2J63m8q1J57j45L3j30j34J9J27J26r9k5J95m4j06M8n2K14j95
3703c8j3J28L3L6l48M74j33J13m57qJ64O1r7j34L08j50K5k1J26j7k49J84K19l6
3727A70k43L22K9k91Q8j18J69L3k10k60J17J79o8J44O7l17J17j13J17l3J20Q2
3749A01q0j31j7J29Mj19K94j09J6J42l81P2m7J40Pr3J62K24l10k32J59n7J47r5
3773g4k7K91j09R0j91j51qj13L15n2J4p3L4J09l9m3k32K58j01lJ08k2j15J2J78
3798E6k81L00j12J9m3L75j59j08n3r4J74J32k85j23O4K60m60K56Q5J7j5Kj39K6
$$ plain form
3822 -106 197 -120 8 -245 47 73 -15 -73 301 -35 -77 -135 -75 -85 44 -12 32 149 47 -55 -63 -42 52 -77
3846 -77 -138 119 -61 81 -133 59 -64 119 157 128 26 22 5 -108 184 122 -67 114 -50 -100 1 -79 3 -242
3870 -242 -235 -127 -256 -57 13 -190 -179 27 62 -186 -93 -201 25 -145 -140 -48 -86 93 -118 46 -79 -47 135 20
3894 20 -76 -52 57 -17 93 -48 174 -86 -92 -45 -8 -315 -66 85 -24 -183 -184 33 57 257 218 -73 -279 -14
3918 -14 -54 88 153 -152 -35 -259 -305 -82 18 223 85 13 20 23 -195 -2 186 -130 -11 189 65 -130 -97
3941 -97 132 -331 -70 81 150 -71 63 57 -280 -92 62 74 9 -158 -271 -80 -129 13 -58 22 242 -37 111
3964 111 -102 51 -101 117 9 -68 190 -23 157 -166 -123 -226 13 19 56 -229 63 -189 -207 197 234 -34
3986 -34 45 83 59 12 -132 -100 239 -25 -4 123 -206 -45 -113 -159 62 -20 174 -45 0 -147 -16 -192 -78 -38
$$ packed form
3822a06L03l17J28k53K92K6q8n8L74l36m2n8O0j0J29n6M4J17j02j02qK1R4j29
3846g7o1K57j80J42k14J92j23J83L8k9j02mj7j13K92o2j89J81j64n0J01q0Q2k45
3870b42PJ08j29J99P0k03J1K06L5k48R3j08K26j70NR2l8J79k11J64j25L2J82j15
3894B0r6K4J09p4J10j41K22k60oM7L7l07K49J51j09j59jK17K4K00l9k91k06K65
3918a4m0J42O5l05J17k24m6K23J00K05j38p2PLk18J93J88l16J19K00j24j95L3
3941i7K29m63K61J51O9k21J34ol37J88J54J2o5j67j13J91m9J42p1Q0K20k79J48
3964A11k13J53j52K18j08p7K58k13J80l23M3j03K39OL7k85K92k52j8M04L7k68
3986c4P9L8k4m7j44L2L39k64K1J27l29J61o8m6K21q2J94k19M5j47J31j76J14M0
$$ plain form
4010 -38 243 189 -27 46 -85 -283 -2 149 9 74 64 -191 -174 -17 220 -31 -132 -178 70 122 -141 -130 70
4033 70 -149 -89 66 27 86 -53 117 -278 -164 174 -8 10 7 222 232 261 57 12 -54 116 -32 62 -122 -10
4057 -10 -122 26 -39 -130 33 -130 -12 53 4 -72 6 48 95 291 -86 113 117 -48 74 87 12 -60 -99 -4 -51 -38
4083 -38 -178 55 -173 121 193 48 -188 -16 105 -75 8 -72 -92 43 27 185 -92 156 -42 8 -60 -196 3
4106 3 77 95 -82 -40 -84 122 17 -233 -151 231 -165 225 -8 -26 109 -21 -126 -124 -225 229 219 -196 69 18
4130 18 107 -139 -156 131 -127 87 -180 -73 -139 -14 264 -69 -24 -160 44 32 15 -72 -72 190 36 -24 136 60
4154 60 63 -165 67 -154 -125 -32 182 53 -124 32 -165 -199 70 50 28 -215 241 -61 -109 -24 83 164 94 21
4178 21 187 -299 38 -19 -32 -91 -196 -48 -66 -141 70 -12 -247 262 78 -95 -89 -28 2 52 77 -290 198 93
$$ packed form
4010c8K81n4k16P3j31j98K81J51j40O5j0k55J7J57K37k51j01m6K48N2k63J1K00
4033G0k19O0J55l9N9j39J70l95J14L38j82J8lK15J0K9k04m5o6J70j48R4j84J12
4057a0j12J48o5r1J63j63J18O5m9p6P8M2M7J96l77J99Mj65J22J3p5p2l9R5m7J3
4083c8j40K33k28K94P2j45k36J72J21j80Q3q0k0J35j6J58k77K48j98N0o8j36J99
4106CP4J8j77M2m4K06j05k50Q2L82l96L90k33j8J35j30j05Kj01M54j0m15K65n1
4130A8Q9k46j7K87k58K14k67J07o6J25K78l33M5j36K04j2j7q7%K62j54o0J60p6
4154F0Lk28K32k21K9R3K14j29j77J56j97l4K69k0k2k43M56l02m8Q5J07Q1p0p3
4178B1J66m86L37n7j3n9j05J48j8p5K11q2k35N09j84j73OO1L0N0K5l67M88j05
$$ plain form
4202 93 8 -71 -249 169 24 268 109 -87 -65 -31 -53 -128 -25 85 19 -43 -88 -63 -194 -96 -32 65 29 68 -25 -36
4228 -36 81 -357 -2 9 -124 1 5 50 115 -15 17 4 221 126 -165 -144 -49 210 -100 2 11 64 203 -221 8
4253 8 81 -20 51 45 46 29 72 -216 -307 -6 -79 -153 -191 -32 289 209 -158 -113 -213 -111 5 3 -73 -82 -25 -19 -62 -41 -22
4282 -22 -52 -41 -96 -96 -191 -9 -158 30 -120 99 -292 -126 11 -143 112 14 -91 -83 189 -169 120 178 -125 -7
4306 -7 -1 -144 161 -35 0 -80 233 -36 142 -33 53 67 28 12 -48 237 42 14 -270 -47 -4 -14 -122 200 -118
4331 -118 -56 -81 90 -111 -67 -71 233 36 202 149 -225 -31 101 94 -52 -14 142 187 54 77 -44 256 97 118
4355 118 46 -86 225 -62 -166 73 -49 -62 -140 -169 81 -22 -25 -76 84 149 -105 62 88 71 -17 205 -13 -44
4379 -44 -303 -273 40 20 100 -215 104 -187 77 -174 -6 133 7 0 -103 -153 98 -19 -30 -86 58 -32 -314
$$ packed form
4202I3q5p9j78M18j45K44j59j96K2L4k2p5J03J10o6o2m5K5j31R8O4R7l6L9r3j1
4228c6J17m38L55J1j33J25MM5O5j30L2j3K17r5k91K1R5K59l10J02RN3J39m24K29
4253HP3j01P1oJj7M3k88r1L01p3p4l8J59L21q0l67M5j00J02J16kp6rN7Om3K1J9
4282b2l0J1n5%r5J82j49J88j50K19l91J66J37j54K55r8j05QK72l58K89N8l03J18
4306gOj43L05j96L5q0L13k69J78j75Q6J4l9j6o0K85j95k8k84K23M3j0j08L22l18
4331a18O2k5J71k01M4mL04j97J66n3l74J94J32pj46L8J56M5j33K3j21L00j59K1
4355A18p2j32L11k87j04K39j22j3p8k9K50j03ln1J60O5k54J67K6j7q8K22k18l1
4379d4k59L0L13k0Q0l15L19k91K64k51J68J39j26pj03n0K51j17j1n6J44r0k82
$$ plain form
4402 -314 3 -159 -46 108 76 -107 -2 93 -104 -88 -30 274 -16 -258 256 -39 -190 -126 -92 41 95 37 65
4425 65 -57 5 -139 -60 -230 114 -239 -221 6 9 -128 -134 169 -61 -92 -31 -150 -28 -123 -226 8 -59 -95 -195
4449 -195 164 -3 121 116 149 132 -150 56 85 -52 -160 -85 38 -46 -21 -109 -25 -137 133 -12 -155 46 32 -186
4473 -186 133 -37 49 -159 39 -17 -38 51 -348 -128 -349 131 -320 -105 -214 -119 -111 62 -2 85 215 -14 -79
4496 -79 17 58 148 -98 -162 40 110 55 102 321 -11 -4 -174 126 69 -47 -289 -98 -17 -19 -145 -104 116 -239 -11
4521 -11 -127 288 329 134 53 225 10 123 -81 -32 12 59 278 -84 -177 51 17 222 164 95 73 -161 -69 71
4545 71 -116 -26 -154 16 -202 -52 205 -17 -20 -15 91 -261 157 377 -38 -19 -75 -57 82 -203 -326 282 249
4568 249 172 273 -197 -99 -18 172 -104 -77 74 -117 -22 270 94 -151 165 200 -82 -128 26 -183 80 -188
$$ packed form
4402c14L17j62J13J54l2j83J05R5j97J6N8L04k90k42N14k95j51O4L4J33N4n8K8
4425F5j22O2j44P9j70L44l53J8K27Lj37oL03k30l1O1j19J22r5j03K34o7l6j00
4449a95L59j67J24nL3j7k82K06K9j37j08P5J23q4K5q8Q4j12K70j45j43K01j4k18
4473a86L19j70Q6k08J98n6k1Q9l99K20k21M80m51K15j09R5QJ73o4Q7J30k29o5
4496g9R6M1R0k46o4K02P0n5M7K19l32Pj70L00n7j16k42J91Q1kj26M1K20l55K28
4521a1j16M15M1j95q1J72k15J13k04M9M4M7K19l62r3K28l4K05n8o9k2k34R2J40
4545G1j87R0j28J70k18J50K57k22lNJ06l52M18K20m15J9n6J8J39k85j23O08l3
4568B49p7J01m70R8Q1J90k76K7J51j91R5K92j76k45L16L5k82m6J54k09K63k68
$$ plain form
4590 -188 -246 166 -51 59 -8 7 -20 141 22 -237 169 112 135 197 51 -102 -74 107 98 11 342 172 243 150
4614 150 16 -101 -35 67 194 -74 -80 238 173 -67 -104 381 -34 -51 102 -5 81 -160 -243 -200 -22 141 -103
4637 -103 -59 109 109 -31 -73 118 85 173 -119 -94 22 79 170 -41 23 -71 235 -192 152 80 -114 -25 5 86 -408
4662 -408 -40 5 -1 19 145 22 137 -56 138 -226 -19 -104 320 -5 -41 42 -223 -28 194 50 214 150 -192
4685 -192 102 163 28 -65 -18 230 72 9 -43 -45 -61 2 -5 28 -22 37 109 125 25 123 -109 80 221 -65 64 -33
4711 -33 -196 -142 -68 53 -128 -52 83 83 54 54 -217 -288 213 -46 -24 115 67 0 175 202 147 -162 76 -109 179
4736 179 -53 -122 56 256 -102 12 -11 102 37 -196 -85 62 -65 -87 35 85 85 -20 -158 38 185 -43
4758 -43 -17 -101 -59 22 61 -6 132 40 160 -116 -54 -67 210 -47 -143 -26 -27 -147 113 1 -71 -210 -62 63 53
$$ packed form
4590a88n8M12k17J10o7J5k7J61j19k59M06n7K3O2j46j53K8J81rq7L31j70P1r3
4614A50j34j17O6J02J27k68oL18o5k40l7M85m15j7J53j07Q6k41q3M3J78J63k44
4637a03M4J68%j40m2J91l3Q8k92K5J16N7R1k11O4r4L06m27L44p2j94Q9L0Q1m94
4662d08L68M5oK0J26j23J15j93J94l64K07q5M24l25l6Q3k65J95K22j44J64o4l42
4685a92K94O1j35r3M7K48j58o3n2kj6O3pL3n0N9P2J6j00R8k32J89J41k86J29r7
4711c3j63N4P4J21j81P6J35%k9%k71p1N01k59K2J39m8o7J75K7n5l09K38j85K88
4736A79k32o9J78K00l58J14k3J13o5k33J11J47j27k2J22N0%j05j38J96J47k28
4758d3K6q4M2Q1L9o7J38r2J20k76O2j3K77k57r6J17jj20K60j12p2j39J48J25j0
$$ plain form
4783 53 -17 -7 -187 132 -19 -85 -162 177 -104 198 -174 -55 -51 -126 91 38 76 -151 92 132 67 -88 -273 -3
4807 -3 361 7 106 0 -68 -64 187 50 -145 -105 61 -111 19 123 -141 108 -59 45 212 189 238 -224 -2
4830 -2 5 -174 100 243 -99 209 2 14 -43 -54 -108 -16 -73 142 -8 -41 -28 9 69 126 -111 18 -103 121 -42
4855 -42 8 -125 -60 -169 -56 274 -77 -34 -208 99 96 171 -115 -161 107 16 45 62 7 11 -84 139 -85 214 -81
4880 -81 108 -2 -131 38 112 45 -39 65 163 -85 17 289 -157 5 -148 109 32 -105 5 86 311 256 16
4903 16 109 200 16 253 97 -178 -72 18 -83 71 123 -278 31 144 74 -18 14 195 234 175 214 -25 84 -64
4927 -64 -141 165 238 -13 -39 -174 127 113 -12 -31 -108 162 19 201 12 -123 35 -106 -239 0 -36 -95 33
4950 33 0 124 -135 261 56 277 -1 -93 78 14 76 -106 13 -242 85 109 108 65 -106 -48 109 -223 183
$$ packed form
4783E3p0J0j80L19j51o6p7L39k81L02l72J19Mp5K17n3L8k27K43M0o5j55j85K70
4807cL64l54R9j06o8MK51j37j95M0J66j72J30J04k64K49j67J04J67k3M9m62K22
4830bPj79K74J43l42L08k07J2n7j1n4R2n7K15j50l3J3L7O0N7k37J29j21K24j63
4855d2N0j33O5j09J13L30l51M3j74L07lP5k86m6K68r1K9J7n5Mr5K23k24K99k95
4880h1J89j10j29J69P4o7q4J04R8k48J02K72m46J62j53K57p7j37J10Q1K25n5k40
4903A6R3R1j84K37j56k75J06R0j01J54N2m01L09J13p0r2L2J81L9n9L9k39J09j48
4927f4p7L06P3k51k6j35L01j4j25j9p7K70j43J82j89j35J58j41j33K39l6n9J28
4950C3l3J24k59L96k05K21k78r2J71o4O2j82J19k55L27K4jm3j71N8J57l32M06
$$ plain form
4973 183 -147 45 -96 -152 39 -130 73 130 14 81 -96 -135 141 -31 102 -72 89 116 -54 -277 52 -252
4995 -252 -166 195 195 12 -133 106 -51 158 -142 -4 206 147 214 27 -185 88 11 72 -158 -142 -146 -132 44 -54
5019 -54 108 41 252 14 -108 221 -88 135 11 -207 190 310 -74 -88 -11 33 14 145 12 172 -12 33
5041 33 -51 -28 -101 35 308 -109 -161 -208 -153 -129 -24 -134 97 151 -87 -65 -59 -181 155 171 65 -126 -53 -91 41
5066 41 -67 67 -77 57 -161 -15 217 -92 -26 185 58 -29 -109 89 -16 112 85 -164 224 -101 209 -68
5088 -68 -76 -45 135 125 58 43 -129 -61 140 -17 221 48 -239 13 13 202 -16 -62 -15 -141 169 6 7 33 283
5113 283 -18 148 -82 -103 -91 66 15 88 -9 0 -42 -141 -71 191 173 102 5 174 -22 -72 111 -364 -180 58 -27
5138 -27 -90 228 95 -50 -219 -102 15 -43 6 -253 223 -35 48 421 -3 -223 177 143 -61 103 -119 -94
$$ packed form
4973A83l30J92j41n6J91j69K03N7j16O7j77l9K76j72J33j74J61K7j70k23L29l04
4995b52Q6L61%j83j45K39j57K09l00J38K10n9O7j87k12K73p7O1k30J6mJ4J76r8
5019e4J62o7K11k38j22L29l09K23j24k18L97J20l84j4P7M4j9J31j33J60j84M5
5041C3q4K3p3J36K73m17n2m7N5K4J05j10K31N4k38K2Oj22L36J6j06j91P3l8J32
5066D1j08J34j44J34k18J46K32l09O6K11j27q7q0J98j05J28k7k49L88l25L10k77
5088f8qL1J80j0o7j5j72O8K01j57K38j73k87K52%J89k18m6M7j26L10j63JK6K50
5113B83l01J66k30k1J2J57n1P3r7Rm2r9P0K62j8p1r7J69j96n0J83m75J84K38q5
5138b7o3L18j33j45j69J17J17n8M9k59M76k58Q3L73m24k20M00l4k04J64k22K5
$$ plain form
5160 -94 -50 34 -51 15 -93 216 31 -152 181 20 153 145 -144 -68 36 -96 176 -220 12 -150 -2 135 -297
5183 -297 -226 30 -85 -100 123 68 -164 52 41 103 -115 200 41 193 19 -58 327 87 92 -36 -59 52 -131
5206 -131 -28 198 65 -68 15 -73 25 -258 124 233 232 -18 -45 141 -46 116 54 108 69 -149 88 3 -91 11
5230 11 -276 -35 -158 120 8 -90 -45 -127 9 44 41 199 52 -110 -64 103 -28 -41 130 -51 132 145 212 -93
5254 -93 26 133 -280 -347 -20 144 -74 -108 50 127 157 190 93 -169 -252 -89 103 -57 115 -36 103 24 -33
5277 -33 25 -80 -2 -92 -140 89 -239 -44 179 -37 119 127 -103 -95 -207 -86 62 -49 -43 111 -115 -126 172 -243
5301 -243 -100 -175 93 -148 -64 -96 -65 -86 -177 94 344 35 146 11 30 -259 44 62 180 -124 45 31 -31
5324 -31 -68 38 170 -245 30 -107 65 -47 224 221 43 79 216 -14 -60 0 240 -167 -23 -97 -90 42 -63
$$ packed form
5160i4M4Q4q5O6j08L09j85j83L33j61J33qk89P6J04j32K72l96K32j62J48J37m32
5183b97P1K56j15j5K23n5k32K16j1O2k18L15j59J52j74p7L85k40Nj28k3J11j83
5206a31J03K26j33j33Q3q8R8k83L82J09jk50k7J86j87J62o2N4l9k18K37q5r4J02
5230A1k87K41j23K78j12r8M5q2J36L5lJ58j47j62M6J67j31j3J71j81J83J3O7l05
5254i3J19J07m13o7L27J64k18l4J58P7L0L3r7k62q3J63J92j60J72j51J39p9n7
5277c3N8j05P8r0m8K29l28J95K23k16J56Qk30Qj12J21J48j11OJ54k26j1K98m15
5301b43J43p5K68k41Q4l2L1k1r1K71K50l09J11j35J9k89L03J8J18l04J69j4o2
5324c1l7J06J32m15K75j37J72j12K71lj78L6J37k30m6O0K40m07J44p4PJ32j05
$$ plain form
5347 -63 -109 13 74 -40 -255 -1 18 68 31 50 193 -14 -32 244 -67 -150 -75 43 -251 -132 163 -213 -81
5370 -81 61 2 17 109 71 -34 -189 126 29 224 93 220 -80 -105 -90 -177 -89 36 -102 -144 217 -64 -5 164
5394 164 -89 53 60 -286 150 17 14 248 -27 -240 -111 256 4 -20 155 72 42 236 17 30 66 -2 -35 -25
5418 -25 -65 -37 77 107 151 3 24 245 43 152 -51 -127 25 -31 -46 213 -8 -199 -379 -179 -183 -64 266 -234
5442 -234 128 -25 44 23 -177 68 60 -193 -198 -155 -241 77 -102 116 -114 -18 -213 -165 108 -94 -128 80 -185 -213
5466 -213 88 243 269 -184 -15 111 216 -10 32 -107 189 113 67 176 91 35 128 -31 -79 141 -19 108 -36
5489 -36 65 382 240 -142 -66 -161 -31 46 167 148 60 -111 378 -132 -5 167 35 68 -328 -35 77 -108
5511 -108 -306 20 73 -51 2 -116 372 65 242 -50 -36 127 62 4 507 271 -15 125 -320 -6 -199 136
$$ packed form
5347f3m6J22O1j14k15K54J9N0l7J9J43k07j8K76l11q3P5J18k94J19K95l76J32
5370h1J42n9J5R2l8j05j55L15r7J95j31J27l00k5J5q7Q8J25j38m2L61k81N9J69
5394A64k53J42Pl46M36j33lK34k75k13J29L67k52k4J75q3l0J94k19J3L6o8l3J0
5418b5m0K8J14L0M4j48K1K21k02J09k03p6J52n6j5K59k21j91j80K00mJ19L30n00
5442b34L62j53O9k1k00K45qk53nM3q6L18j79K18k30R6j95M8K73k02l4K08k65k8
5466b13L01J55K6m53J69J26J05k26M2j39K96p6m6J09q5n6R3j59m8K20j60J27j44
5489c6J01L17j42l82P6r5J30P7J21j9q8j71M89n10J27J72j32L3l96K93J12j85
5511a08j98L26N3j24N3j18M88l07J77k92J4J63o5n8N03k36k86J40m45L14j93L35
$$ plain form
5533 136 -140 36 80 -61 -98 -164 -107 60 -95 159 183 186 58 -82 63 69 -19 2 126 -92 12 -99 73 -10
5557 -10 -8 -44 -85 -39 136 -173 -144 -7 -152 57 -7 -15 139 -16 235 -145 246 185 28 -9 29 -145 -67 163 50
5582 50 -4 86 -30 77 -79 74 -84 -76 -32 -85 -68 27 201 87 -17 -84 128 114 -217 6 246 36 107 158
5606 158 -91 131 -61 -247 -390 43 169 -24 270 256 144 -145 -166 -20 -191 97 71 142 232 58 77 56
5628 56 -190 -27 -55 -80 56 -102 178 305 15 27 -89 -32 68 177 109 149 -106 82 87 79 -63 8 31 165
5652 165 -10 -19 -308 118 -46 221 -223 -200 175 -13 12 -56 95 -119 111 -161 11 -108 -182 43 150 -121
5674 -121 -57 -32 -216 -65 20 -32 186 77 -222 127 213 -25 63 -40 173 110 -162 -120 44 -18 -185 318 -6
5697 -6 -46 -147 -133 66 184 69 9 89 -99 -62 -6 -103 -65 243 67 39 -143 -139 -114 -174 269 88 15 -186 -264 -126
$$ packed form
5533A36k76J76M4j41l7o6N7J67j55K54K4Lj28j40J45Oq8K1J24k18J04j11J72q3
5557a0Kl6m1M6J75l09K9J37j45K09o4qJ54j55K51l80L91o1j57l7L8j74P8K30j13
5582E0n4R0j16J07j56J53j58QM4n3J7R5J74j14j04o7K12j4l31K23K40k10P1N1
5606A58k49K22j92j86j43M33J26j93K94j4j12k89k1J46j71K88k6P1R0j74J9k1
5628E6k46J63k8k5J36j58K80J27k90J2j16N7J00J09o8M0k55J88Nqj42P1K3J34
5652A65j75rk89M26j64K67m44K3L75j88K5o8J51k14K30k72J72j19p4K25J07k71
5674a21O4K5j84J51Q5n2K18j09k99L49Q6k38Q8j03K13o3k72M2J64o2j67N03l24
5697fm0j01J4J99J18j15o0Q0j88L7N6r7L8L08j76k8j82MK5o0M43j81p3k01p8J38
$$ plain form
5723 -126 -155 -229 -2 79 -19 -24 62 137 82 -69 160 -142 -12 0 -144 -51 127 260 56 251 89 16 82 -184
5747 -184 -86 -105 -180 -15 204 48 18 -6 -74 48 -343 -284 68 40 195 -298 -54 -65 291 117 55 137 -78 12
5771 12 -125 34 -192 -5 -339 25 -75 11 116 -150 118 -24 168 225 157 199 29 -105 115 204 -147 320
5793 320 -96 -248 -22 -13 -109 87 -21 26 50 8 -149 -94 -391 28 310 54 24 217 71 -35 90 -90 -193
5816 -193 167 231 100 -81 -14 126 -100 -136 -38 44 -73 -79 -6 85 -98 36 -174 -95 109 144 -214 251 48 -54
5840 -54 60 58 -65 -505 139 88 218 -166 98 47 -203 -196 65 -163 -11 41 -58 -57 -105 -201 -215 -97 -64 240 209
5865 209 124 132 17 -202 -4 -24 119 -163 -172 145 241 -156 -72 78 -284 3 -247 -145 164 -171 95 -218 23
5888 23 -50 -191 28 -181 19 -6 -86 -78 80 6 -92 34 -130 22 17 230 -139 112 147 -158 -130 172 -30 -195
$$ packed form
5723a26k9p4K27Q1r8nQ6P5n5j51K29l02J30J2j44R3J78J33k04J95j62p3O6k66
5747a84R8j9p5J65K19j56l0k4o8J22l91N9L52k8J55m93K44j1L56j74o2Q2k15R0
5771A2j37J59k26J87l34L64j00Q6J05k66K68j42J92N7o8M2j70j34K20Q9l51M67
5793C20m16j52K26Rr6J96j08M7K4m2j57N5k97M19K82k56l0J93j46j06J25j80j03
5816a93L60O4j31j81O7J40k26l6R8Q2j17oP3R1j83J34k10P9K04L5l58M65k03j02
5840e4J14kj23m40O44n1J30l84K64n1k50PK61k28J52N2r9Jm8r6j4J18L3L04l1
5865B09q5Qj15k19J98k0J43k82rL17R6l97Q4J50l62K87k50J02L09l35K66l13K41
5888B3p3j41K19k09K00k5q0QJ58p4r8J26j64J52nK13l69K51L5l05K8L02k02j65
$$ plain form
5912 -195 -153 72 -279 -17 0 -163 59 5 72 -25 -122 -272 231 202 74 -92 -25 159 -64 -163 68 -123 151
5935 151 -27 9 -210 94 41 -29 167 -152 -152 26 -16 175 -54 -150 -84 -171 190 -24 -228 31 77 170 -86 -84
5959 -84 -214 -34 -25 -81 284 -354 -205 -157 -38 24 188 268 302 248 67 -146 -2 -18 -164 -119 78 14 6 -134 74
5984 74 136 0 -191 15 87 49 61 23 6 48 18 59 -48 -106 -3 185 -80 180 -157 184 -264 -264 -52 237
6008 237 75 117 66 59 159 37 -114 122 -3 -41 54 193 -23 25 -134 95 -227 -274 -8 -96 198 8 -114
6031 -114 -110 -84 -60 -170 -120 41 2 -34 -60 164 -151 -166 54 -283 78 9 -267 -246 37 106 -163 -77 85 -59
6055 -59 80 94 -202 142 -186 252 -65 -102 240 173 -29 214 -37 -193 -15 140 119 -45 -2 -7 -34 -195 54
6078 54 -58 175 -39 -108 -29 -20 -204 -166 55 -56 -75 160 -74 -381 -58 446 -62 214 -144 2 53 -93 -252
$$ packed form
5912a95M2K25l51K62J7j63K22n4O7r7r7j50N03k9j28j66O7J84k23r9K31j91K74
5935A51j78L6k19L04n3p0J96l19%J78m2J91k29r6O6q7L61k14k04K59M6R3k56K
5959h4j30J80Rn6L65o38J49M8J19O2J64Q0L4n4j81k13J44j6j46M5J97o4qj40K08
5984G4O2j36j91K06P2l8J2l8j7M2l0M1j07n8J03J88k65K60l37L41m48%K12K89
6008B37j62M2n1pJ00j22j51K36j25l8R5J39k16M8j59K29l22m7K66q8K94j90j22
6031a14MK6K4j10N0J61l9l6k6K24l15j5K20l37L61o9k76K1K83O9k69Q6J62j44
6055e9J39J4k96L44l28M38l17l7L42o7k02K43k51j56J78J55k1j64M3nk7j61K49
6078E4j12K33k14o9P9Rj84L8K21j11j9K35k34l07L23N04n08K76l58J46N1j46j59
$$ plain form
6101 -252 160 -94 38 -153 300 113 -131 81 53 -95 83 151 140 59 -145 -41 164 -7 -39 33 177 46
6123 46 -163 229 -162 103 -138 -118 -37 -107 -126 -276 -267 -80 -192 -92 69 -73 21 57 145 117 -58 62 -135 -105
6147 -105 95 -109 111 19 -17 167 -32 -47 -152 -60 95 -155 178 9 196 -145 -16 100 181 152 -171 -99
6169 -99 -20 13 -338 129 54 42 110 -101 269 -171 -12 120 -21 -5 280 -116 139 100 -63 -20 -13 -24 193 171
6193 171 -145 181 -228 -217 29 -77 94 3 91 -251 -231 -156 33 97 -151 94 35 -57 45 141 179 -205 6
6216 6 64 -87 100 86 -109 47 -53 -25 -44 -175 84 18 21 32 -15 117 48 -124 147 16 340 -219 -74 -73 228
6241 228 -183 -188 148 -215 26 -99 54 139 24 -3 -226 -283 66 3 -157 50 44 -160 36 82 149 -38 71
6264 71 -53 177 -100 -3 -54 131 59 6 -32 -31 74 194 128 325 -116 -103 -104 -133 115 111 -122 -3 -40 -169 17
$$ packed form
6101b52M12k54J32j91M53j87k44K12k8j48J78O8j1q1k04J04K05j71l2P2J44j31
6123D6k09L92l91K65k41K0Q1p0j9j50RJ87j12J00J61j42R4L6Q8k8j75J20j97L0
6147a05K00k04K20r2l6J84j99j5j05R2J55k50L33j69J87l41J29J16Q1k9l23P2
6169i9P9L3l51M67p5j2O8k11L70m40J59J32j41J6K85l96K55l9j63M3Pj1K17k2
6193A71l16L26m09J1K46j06J71r1Q8l42K0P5J89O4k48K45n9r2J02R6L8l84K11
6216FN8j51J87j4j95J56j00K8j9j31K59o6LJ1m7J32o9j72K71j31L24n59J45JL01
6241B28m11nL36l63K41j25J53Q5j15k7k23n7L49o3j60K07ok04J96M6O7j87J09
6264G1j24K30k77R7n1J85p2n3l8JJ05J20o6J97m41J3jk9K48mk33J19l7j29J86
$$ plain form
6289 17 200 138 -102 108 -2 15 -21 171 45 -2 -173 -195 101 -121 -116 -144 -33 162 -27 209 91 24 -357
6312 -357 -17 -33 -299 -221 31 96 46 105 339 275 427 104 -62 239 63 157 -122 175 -176 -142 164 183 153
6335 153 -332 134 -77 47 72 -212 128 18 107 209 221 242 -37 -249 -169 1 -87 270 -106 -269 -297 -257 -241
6358 -241 122 57 79 85 -162 -160 129 -138 -44 179 -98 199 -54 32 285 118 34 -129 -189 83 42 272 -59 213
6382 213 -189 -85 215 -10 -249 215 144 91 -43 -61 -32 -63 225 -12 75 -195 60 101 72 2 12 -6 103 182
6406 182 70 112 -185 -152 29 -133 22 22 -114 -220 -19 26 -126 -151 17 -128 66 151 14 39 55 62 -32 48
6430 48 95 131 102 -204 -20 -156 58 103 -99 57 -12 -167 164 179 39 260 -221 25 -145 -301 -98 -46 -25
6453 -25 78 -81 22 7 162 -247 -54 26 62 301 102 80 -182 -122 48 174 -103 257 73 120 38 29 -155
$$ packed form
6289A7J83o2k40K10j10J7l6J92j26m7j71k2K96k22Nk8J11J95j89K36j18o7l81
6312c57L40j6k66P8K52O5n0N9K34o4J52l23j66L01j76R4k79K97l51L4L06J9l0
6335A53m85M66k11J24K5k84L40j10Q9J02J2K1k79k12Q0J70q8L57l76j63k8M0J6
6358b41L63o5K2Ok47KK89k67R4K23k77K97k53Q6K53j67q4j63o0K72m1K30l31K72
6382B13m02J04L00k25k39M64p1n3j34j8K9l1K88k37Q7k70K55M1k9p0J0j8J09P9
6406A82j12M2k97L3J81j62J55%j36j06K01M5j52k5J68j45J94Q5j37K5J6Pr4Q0
6430D8M7L6k9l06J84j36K14M5k02J56o9j55L31J5j40K21m81K46j70j56K03N2K1
6453b5J03j59J03j5J55m09J93Q0L6K39j99k2k62O0J70J26k77L60j84M7q2rj84
$$ plain form
6476 -155 -63 109 -74 -138 241 -2 69 -161 -130 2 -131 -71 6 46 10 84 -143 31 219 -112 29 24 84 59
6500 59 -160 -180 166 -33 -17 -53 -273 27 -156 11 37 17 -47 185 -4 34 190 105 -57 -116 27 244 2
6523 2 -127 -5 115 63 181 126 -120 261 137 59 -172 -252 -218 -9 -75 186 155 411 -19 17 145 34 -248
6546 -248 22 -40 58 -197 -39 -14 186 -104 -103 143 61 122 28 -142 32 28 -25 179 -98 -109 167 79 16 -46 13
6571 13 -76 -103 30 -155 102 54 109 91 -167 407 -59 -180 76 -79 8 27 -75 121 -15 -60 -59 -212 9 -85
6595 -85 -53 137 84 -153 106 -39 -48 -45 81 -65 -78 37 69 -44 -61 81 50 -17 -38 200 4 -115 -18 -31 137
6620 137 -255 -48 -38 118 88 -31 -87 133 -199 -119 -229 71 188 -228 -41 45 42 -74 -32 91 39 -103 65
6643 65 -133 -102 -59 91 45 -199 -2 177 -96 -109 68 15 119 -6 114 -25 101 101 110 41 180 121 -191 -46
$$ packed form
6476a55R2J72j83o4L79k43P1k30L1J32j33O0P7M0l6P4k27J74J88l31J41nO0k5
6500E9k19k0L46j99J6l6k20L00j83J67K6k0o4K32j89L8J56q5j62n9J43K17k42
6523Bj29J22J20n2J18n5k46L81j24p8k31q0L4K09o6K61l1K56m30L6J28j11k82
6546b48K70o2R8k55J58K5K00k90JK46q2O1r4j70J74mn3K04k77j1K76q8o3o2N9
6571A3q9k7J33j85K57m8N5j8k58N74m66j21K56j55Q7J9j02J96j36m5Jj53K21r4
6595h5L2J90n3k37K59j45rLJ26j46j3J15L2j13j7J42l1o7k1K38j96j19R7j3J68
6620A37l92K07J0J56l0j19n6K20l32Q0j10L00J17m16J87Q6lj16M2J23n2j42J68
6643F5j98L1M3J50m6k44J97J79k73j3J77n3J04j25J20j39J26%Ro9J39n9l12J45
$$ plain form
6667 -46 167 153 -96 9 -11 0 -3 46 73 180 205 115 -70 205 -33 54 42 142 254 -113 169 -104 113 376
6691 376 -164 -258 38 -54 64 -59 -105 154 43 24 91 264 71 75 245 -168 -7 -61 -165 -49 183 69 -307
6714 -307 -141 34 -27 24 97 -79 -55 44 103 7 -96 22 -418 -74 -373 -397 34 -216 -120 -11 42 -126 79
6737 79 -24 227 49 -7 65 -268 110 89 44 41 -91 -344 -356 -261 327 -19 42 -10 27 -145 73 -94 118 -151
6761 -151 120 3 -77 4 -106 141 18 -126 127 -3 -159 -112 -137 156 163 -287 -167 31 -135 212 182 129 16
6784 16 -104 10 -317 -100 146 -222 34 156 89 -7 78 -56 -253 -290 -101 -61 234 -122 66 -156 -160 -2 49
6807 49 -166 -111 -15 48 -150 251 172 6 -13 71 84 -118 39 95 -246 209 162 122 19 173 -40 -72 -16 89
6831 89 -168 10 -202 -31 -87 76 98 28 29 -68 311 140 123 -25 -26 242 37 27 -60 -161 -52 -89 243 67
$$ packed form
6667d6K13j4k49J05k0J1lM9K7J07K5r0j85K75k38Q7j2J00J12l67K82k73K17K63
6691C76n40r4K96r2J18j23m6K59j11j9O7J73j93MJ70m13J61n4j04J16K32j14l76
6714c07J66J75o1N1P3j76K4R9N9r6j03J18m40L44k99k4M31k50R6J09N3j68K05
6737G9j03K51j78n6P2l33L78k1m5lj32k53j2R5N88l46O1n2L7j72K18j67K12k69
6761a51K71j17q0Q1j10K47j23j44K53j30j56M7k5K93Pm50J20J98j66L47l0n3j13
6784A6j20J14l27K17K46l68K56J22o7r6Q5j34j97l7J89M0K95l56J88k22mJ58N1
6807D9k15N5R6O3j98M01p9j66j9Q4J3k02J57N6l41M55m7m0j03J54k13l2N6J05
6831H9k57J78k12J71n6J63K2p0Jr7L79j71j7j48jK68k05j0q7j01J09l7L32j76
$$ plain form
6855 67 93 -85 -208 25 130 50 316 -153 -101 -39 -14 -129 -34 -2 182 216 32 -36 143 -97 71 137 -131 -72
6879 -72 27 218 157 -17 -104 18 -82 203 -28 -63 132 367 -212 235 73 162 -243 -78 -110 103 -224 27
6901 27 113 105 -157 -12 159 57 -187 -214 -57 -109 -74 -32 22 134 146 336 -153 -117 -25 4 -2 -102 70 -125 173
6926 173 -105 53 52 179 -26 -35 13 19 -124 65 58 296 66 -11 -86 -202 26 164 71 180 -15 247 202 114 -34
6951 -34 -75 67 33 114 142 126 154 -13 -90 -179 -297 125 58 142 42 104 -68 -73 128 152 78 -64 38 -73 43
6976 43 -35 -184 -335 -36 -109 -35 48 -48 11 -86 -65 19 99 9 -118 54 -24 -45 13 295 80 -156 29 -151 32
7001 32 -1 -158 10 170 3 -112 98 49 -126 43 -239 -217 20 -92 93 83 -80 68 94 117 168 330 78
7024 78 84 290 41 114 3 -3 -342 184 -111 -16 177 76 52 162 -29 -57 81 -169 -23 -179 -3 -93 47
$$ packed form
6855F7K6j78j23K33J05q0K66m69N2O2K5j15R5L2J84L4j84o8J79k40J68O6k68N9
6879g2R9J91o1j74q7J22j00K85k31l5J95K35n79M47j62Q9m05J65l2K13l27K51
6901B7Q6qk62J45J71j02k44k7J57n2L5M2N4J12J2J90m89L6R2K9oj00J72j95K98
6926A73k78J58jJ27k05rM8Oj43J89pK38k30p7p5j16K28J38r3J09j95K62m5q8j48
6951c4m1J42l4Q1K8j6K8j67p7q9j18M22o7Q4j00O2j72nK01K4p4j42J02j11J16
6976D3p8j49j51K99p3P4Q3r6N9r7K1Q4Q0r0j27J72p8k1N8K82k15k36J85j80J83
7001C2l3j57J68J60j67j15K10m9j75J69k82K2K37j12J85j0j63J48K6K3N1J62k52
7024G8OK06k49P3j11ol39N26k95R5J93j01k4J10j91k8J38k50J46j56J76r0J40
$$ plain form
7047 47 -171 180 132 44 117 -28 -241 144 -228 -83 215 -13 168 169 -57 -164 94 3 130 118 -96 7 136
7070 136 56 -111 179 136 -49 -171 217 51 23 107 42 -278 6 65 -17 10 -69 -21 -77 27 -106 -80 -69 -150 -473
7095 -473 -344 -99 32 -57 -34 -60 217 -153 -57 -83 46 74 15 60 -79 140 211 166 -89 16 186 135 -122 14
7119 14 179 -2 106 -145 -335 -255 -145 138 212 310 -50 133 -72 43 -153 -32 -95 28 66 217 -20 236
7141 236 -117 -32 156 142 -92 -268 68 -31 27 -78 234 -155 195 273 -159 -141 -233 82 -183 107 -178 29
7163 29 186 43 -128 -97 -61 -418 201 -201 -78 118 -128 52 123 194 86 -127 -172 -52 -309 96 -66 20
7185 20 323 89 149 -59 64 64 317 -31 236 -162 68 -18 -130 246 46 -13 125 -114 -192 29 -7 -158 -23
7208 -23 -96 -7 147 -119 -193 189 28 56 132 -130 2 373 33 -95 88 166 109 108 134 -113 113 -234 -125 -173
$$ packed form
7047D7k18L51m8q8P3j45k13L85l72J45K98k28J81Jk26j07K58r1J27j2k14J03J29
7070A36q0j67K90m3j85j22L88j66k8Q4o5l20K84N9q2K7p9M8n6J04j33K6J1q1l23
7095d73J29K45J31q9K3k6K77l70R6k6J29K8n9M5j39K19P1m5k55J05J70n1k57J36
7119A4J65j81J08k51j90Q0J10K83P4R8l60J83k05J15j96J21o3J23L8J51k37K56
7141B36l53Q5J88j4k34j76L36r9N8j05L12l89L50P8m32J8r2L15k65K90k85K07
7163B9J57j43j71L1L6l57O19m02J23J96k46J80P1P1j08k13m5J20k57M05j62Q6
7185B0L03k34O0k08J23%K53l48K67l98K30q6j12L76k00n9J38k39p8K21l6j51J35
7208b3p3Q9J54k66p4L82j61K8P6k62J32L71l40j28J83P8n7jK6k47K26l47J09m8
$$ plain form
7232 -173 -23 195 257 42 133 61 -83 -64 -103 6 46 -61 -27 54 192 55 -23 -74 -14 57 -52 38 10 -203 68
7257 68 10 -65 -28 43 -106 40 127 -33 -36 265 -150 -52 -134 78 59 105 34 -53 31 96 66 -120 90 28 -172 -226
7283 -226 28 -217 122 43 -60 125 48 -47 -25 177 -52 125 -190 -71 39 153 -29 103 78 -220 130 -80
7305 -80 127 142 236 -151 -72 -34 130 -104 -126 -91 159 160 237 -69 47 14 -132 33 -54 -163 3 296 -190 -6
7329 -6 69 69 -115 -65 -74 294 139 165 -24 -69 26 -288 -193 87 442 -383 178 -8 -311 -150 -102 -2 -74 375 -142
7354 -142 12 8 -171 24 106 23 138 -179 -6 49 11 14 -178 -207 101 256 -245 130 96 44 154 20 55 -42
7378 -42 131 -45 356 -105 40 248 49 -38 83 -128 108 -116 -78 -9 130 198 -167 15 64 250 -90 10
7400 10 119 -45 64 38 -52 89 124 72 -9 18 -326 146 -76 -215 -276 -213 77 106 -27 91 109 305 -256 166
$$ packed form
7232a73J50K18O2k15R1p2j44J9l9J09M0j07L4Q1J38j37p8n1O0P1j09R0k8k13K71
7257F8n8p5L7P1j49J46Q7j60lL01m15R8q2K12j9M6p1q7Q4O5l0j86K10o2k00n4
7283b26K54k45L39p9j03J85p7r5K2K02k29J77l15J19J10J14j82J32k5k98L50k10
7305h0K07J5R4l87P9L8J64k34k2L5K50JP7l06J16l3j46J65q7j09J66K93m86J84
7329fP5%j84N0rL68j55K6j89m5R5l14R5K80L55q25N61j86l03J61M8J00p2M49n17
7354a42J54mj79J95Q2q3J15l17J73N5l8Lj92k9L08J55n01L75l4n2J10j34L5r7
7378d2J73j76M01m61J45K08j99q7J21k11K36k24L8O9J39O8l65J82M9J86l40J00
7400A0J09j64J09k6r0J41L5n2q1K7l44M72k22j39o1O3K90K9j33J18J8J96n61M22
$$ plain form
7424 166 -21 6 135 54 -8 -202 -61 17 18 24 -54 80 35 26 -115 167 -65 -60 105 -88 33 -30 258 133 65
7449 65 94 -116 -117 -61 184 139 -47 -67 320 -12 61 62 40 307 12 -97 -98 156 -243 24 106 84 -20 -98 -78 48
7475 48 47 100 -48 -107 76 -154 -48 -146 47 119 -227 77 -123 -122 -70 -135 -85 -5 -128 -210 -255 14 -107 -20 -95 65
7501 65 28 -103 70 -214 61 -52 -175 87 90 -115 -41 -39 -24 -2 -85 13 -133 -24 -131 158 -134 -272 80 62
7525 62 167 110 186 27 -135 -192 -82 -20 12 -6 97 -226 48 53 -118 -112 -102 -262 53 245 -2 -189 30 43
7549 43 -38 20 166 196 2 25 -54 187 78 113 -134 -272 60 97 28 -26 0 26 -5 -132 319 32 34 -12 112
7574 112 -121 1 -134 -121 -18 -42 244 -39 -123 -44 54 -74 27 -114 -209 -91 96 67 -11 68 150 -87 30
7597 30 61 -68 24 42 97 17 48 -4 -145 -165 103 -112 -99 164 -33 247 -158 -198 -84 220 -253 -203 -53 -102
$$ packed form
7424A66j87K7J29q1o2j94J41P8JOp8J34m5rj41K82k32NJ65j93J21o3K88j25o8
7449F5K9k10jN6K45m5j86k0L87l32P3Jk2K67k95j09jK54l99K67Q2k2j04p8K0J26
7475D8jN3j48n9J83k30J06r8J93P2l46L04k00JN2o5N0Q0j23q2m5K69j21Q7p5J60
7501F5l7j31J73k84K75j13j23K62Lk05P4KJ5K2q3R8j46J09j07K89k92j38L52j8
7525F2J05n7P6j59j62n7J10O2L2j8J03l23K74Nj71OJ0j60L15J92k47j87K19J3
7549D3q1N8J46L0j94K3p9K41j09L5k47j38L32L7o9n4K6K6l1j27M51k87Km6J24
7574A12k33J22j35J3J03k4K86k83q4P9R8j28J01j41r5J18J87k9p8P9Q2k37J17
7597C0L1j29R2J8N5q0L1n2j41k0K68k15J3K63j97K80m05m0J14L04m73N0J50m9
$$ plain form
7621 -102 -192 -226 243 -108 12 124 37 20 99 -148 217 73 34 111 -135 98 91 46 201 -205 -61 40 124 94
7645 94 34 -9 -129 53 28 -167 -92 107 -118 -132 288 77 -199 78 81 -229 47 136 -339 -138 113 6 -293
7668 -293 80 -99 10 -228 -191 -7 -127 89 320 -100 -18 20 -272 93 104 136 -151 111 153 -334 -53 56
7690 56 -194 9 -86 -64 78 -107 -124 -25 145 -40 33 8 -16 174 71 -59 162 52 109 84 -102 105 170 -54
7714 -54 -121 6 -156 -63 -75 -150 25 46 -47 65 -88 134 -278 -121 -130 -89 49 87 -113 281 125 89 -58 21
7738 21 115 10 58 -14 38 32 -117 -97 92 -128 -66 -22 49 -200 -4 -20 -57 -98 -206 268 -132 -174 -12 37 -142
7763 -142 23 276 -73 238 237 95 127 -3 -79 -89 -6 -34 -44 -107 -86 -94 -138 -121 59 -7 33 70 159 -2 90 220
7789 220 -23 131 164 -180 68 -141 -40 -96 -78 -99 -21 35 131 212 15 -58 103 -71 -21 8 -68 -249 107 -61
$$ packed form
7621a02r0l4M69l51J20J12q7j7P9k47L65j44l9P7k46K33pm5J55m06J44J01Q4l0
7645I4o0m3j20J82k5j95P5J99k25j4M20k11k76K77Ll10K76Q9m75K01K51j07k99
7668b93L73j79J09k38L7J84j20K16K31m20Q2L8k92L65J1L2k87K62M2m87K81J09
7690E6k50K03r5K2J42j85j7R9J70j85P3k5k4J90j03j30K21j10N7k5j86K07O5k24
7714e4o7J27j62R3j2p5J75K1r3J12j53K22m12J57rM1J38L8k00L94j56l6j47P9
7738B1R4j05M8p2N2oj49K0J89k20O2M4P1k49J96j6l7m1j08M74m00m2J62M9j79
7763a42J65K53l49L11jj42L2j30p6j0Q3k8j0o3K1qm4J7J80o6M0L7Q9j61R2J30
7789B20k43J54L3l44K48k09J01n6J8k1P8N6R6Q1j97p3J61j74N0K9p6j81L56j68
$$ plain form
7813 -61 -41 -186 -111 -45 178 146 -62 -47 256 2 -69 -29 262 84 61 233 -78 323 134 197 -35 -195 -72
7836 -72 163 96 124 -104 -111 -70 -268 63 -21 145 184 253 83 -122 28 -38 -30 -52 239 -200 73 165 -157 -57 25
7861 25 179 85 -150 -175 64 -28 107 -77 98 -232 -136 -107 126 -151 -81 137 -69 166 -63 -33 232 -89 0
7884 0 -32 -1 -71 -18 -147 -159 168 132 -75 -36 32 125 149 -61 91 -214 -191 -54 68 -4 -118 21 27 40 -19 -60
7910 -60 -79 -53 288 54 88 262 22 123 265 237 -156 155 292 40 -54 -298 104 16 16 99 -64 85 -231
7933 -231 -213 -98 117 32 -65 190 99 61 8 125 -61 -144 -149 -222 152 -61 152 31 7 -83 -13 -28 -105 -5 -47
7958 -47 -90 40 -213 96 61 47 -105 -58 46 47 88 -56 -99 -118 -6 -156 80 -81 -217 103 131 -180 -17 105
7982 105 8 -220 187 -161 62 107 18 155 -247 -27 -122 -8 9 -136 -133 37 137 80 183 -134 -232 -5 -156
$$ packed form
7813f1K0j45P5O6K23l2k08J5L03k54p1M0K91j78k3J72l11M01j89O3k32j60J23
7836g2K35o7K8k28pM1j98L31q4J66L9O9j70k05J50o6Qk2K91m39K73R2l22J00Q2
7861B5J54r4k35k5K39r2J35j84J75l30R6K9K33k77P0K18k06K35k29L0K65l21Q9
7884@l2L1p0N3j29j2L27l6k07L9O8R3K4k10J52l05K3J37J22p2j14J39OJ3n9m1
7910f0j9K6L41k34L4J74k40J01J42k8l93L11J37k52r4k44M02q8%Q3j63J49l16
7933b31J8J15K15q5r7K55r1l8n3J17j86q3np3L74k13K13j21k4r0P0j5p7J00m2
7958d7m3J30k53L09l5j4j52M7J04JM1j44m3j9J12j50K36j61j36L20K8l11J63J22
7982A05r7k28M07l48K23M5q9J37m02K20r5J14J7j45LJ70J00n7J03l17r8K27j51
$$ plain form
8005 -156 -17 -3 98 156 97 -56 119 1 -9 -75 58 111 -175 10 -56 -148 -36 29 125 -69 -5 -59 89 -150
8029 -150 317 3 -47 -265 53 -227 -215 66 -133 76 66 101 63 34 -77 150 -202 26 -16 -56 120 -109 -51
8052 -51 -59 -228 -374 -97 30 146 -251 -92 86 -39 -1 -125 94 -21 -27 169 79 138 47 77 48 -61 81 -21
8076 -21 23 68 -2 -2 34 80 -146 194 156 -122 -190 211 -79 -35 -113 -67 45 96 -108 -182 -157 3 -93 111 8 24
8102 24 235 -6 160 123 -123 14 48 115 -89 -122 245 -52 28 -81 -109 -2 83 54 -143 -432 195 100 25 113
8126 113 -116 261 42 -41 -67 130 -97 -24 -20 -20 -155 -189 -47 -138 -18 8 -177 141 -101 0 207 28 186
8149 186 -29 114 -141 65 -55 6 -112 -34 117 -178 -19 33 6 -67 -116 -202 -130 -139 24 -71 126 68 64 15 -46
8174 -46 236 -72 -106 79 331 -14 -1 112 -5 -23 -205 -16 42 -129 59 -58 45
$$ packed form
8005a56J39J4J01N8n9j53J75j18j0o6J33N3k86J85o6r2J12O5R6j94O4n4J48k39
8029a50M67l14n0k18L18k80J2K81j99K09j0L5l8k9j11K27l52K28m2m0J76k29N8
8052e1qj69j46K77J27J16l97J59J78j25L8j24K19j15oJ96r0N9r1L0k9j09J42j02
8076b1M4M5p0%L6M6k26L40l8k78o8M01k90M4p8M6J12N1k04p4K5J60r6K04j03J6
8102B4K11k41J66l7k46J37L4O7k04l3L67k97Q0j09k8J07Q5k9j97k89O27r5p5Q8
8126A13k29L77k19q3k6J97k27P3M%j35l4J42r1J20K6j85L18k42J01K07j79J58
8149A86k15J43k55K06j20O1j18P8J51k95J59N2k7p3m9q6P2rJ63r5J97n8mm9o1
8174d6K82l08l4J85K52l45J3J13j17j8j82J89N8j71J88j17J03
8191D5
$$ Imaginary data points
##PAGE= N=2
##DATA TABLE= (X++(I..I)), XYDATA
$$ plain form
0 0 0 0 0 0 0 0 0 0 0 0 0 0 0 0 8 -8 8 -8 12 -16 16 -24 24 -31 32 -40 47 -54 61 -71 81 -92 106 -116 132 -149
36 -149 170 -189 212 -236 262 -292 324 -359 395 -439 483 -533 587 -647 712 -785 864 -954
54 -954 1054 -1168 1298 -1445 1618 -1821 2065 -2367 2747 -3243 3923 -4918 6508 -9456 16744
69 16744 -73364 -39190 148465 -40625 -258092 -132332 53420 -101037 -225400 -74067 33075
80 33075 -59262 -59617 24741 32822 80934 217899 183627 35447 58211 143835 57956 -6902
92 -6902 72992 57374 -79326 -71669 12971 -41148 -103846 -40659 -39264 -131947 -116357 -46313 -91144
105 -91144 -107156 11504 55057 -23308 1827 108277 99675 52541 90833 97157 40053 57411
117 57411 96795 33462 -14220 38402 33468 -60003 -75608 -31201 -65445 -107961 -65104 -39700
$$ packed form
0@%%%%%%%%%%%%%%Qj6J6j6K0k8L2m0M8n5O3p2Q7j01J15j32J52j73J98k22K48k81
36a49L19l59M01m48M98n54O16o83P54q34R22j016J120j234J359j497J649j818
54i54K008k222K466k743L063l439L886m432N114n990P166q841J1426j5964K6200
69A6744r0108L4174J87655j89090k17467J25760J85752j54457j24363J51333J07142
80C3075r2337l55Q4358Q081M8112J36965l4272j48180K2764Q5624q5879o4858
92f902P9894j5618j36700P657Q4640n4119o2698O3187J395r2683J5590P0044m4831
105i1144j6012J18660M3553p8365K5135J06450q602m7134L8292O324n7104J7358
117E7411L9384o3333m7682N2622m934r3471j5605M4407l4244m2516M2857K5404
$$ plain form
129 -39700 -75031 -58785 -1731 -8819 -29661 10829 36166 11339 24213 68344 60339 42888
141 42888 79320 93135 47189 29793 47639 16832 -33836 -30381 -25010 -63696 -74212 -38999
153 -38999 -36536 -57944 -35716 -8419 -25112 -31932 -5208 -3067 -16226 10321 38127 27307 35974
166 35974 75065 73994 43649 48182 53642 14382 -12888 -3173 -15100 -45560 -39215 -22434 -36508
179 -36508 -41842 -20157 -18100 -33968 -24571 -12264 -22534 -18566 8217 14279 9407 29541 48294
192 48294 37018 31314 45443 40634 17402 10948 11794 -3138 -16489 -13570 -14418 -26160 -27881 -23823
206 -23823 -29664 -31871 -19258 -12562 -16715 -9750 4408 4252 2562 16295 24610 15133 14328 24205 20670
221 20670 11991 19127 24652 12219 2462 2483 -7004 -19619 -20028 -20547 -28688 -25966 -14282 -12948 -11590
$$ packed form
129c9700l5331J6246N7054p088k0842M0490K5337k4827J2874M4131q005j7451
141D2888L6432J3815m5946j7396J7846l0807n0668L455N371l8686j0516L5213
153c8999K463k1408K2228K7297j6693o820K6724K141j3159K6547K7806j0820Q667
166C5974L9091j071l0345M533N460l9260k7270R715j1927l0460O345J6781j4074
179c6508n334K1685K057j5868R397J2307j0270L968K6783O062m872K0134J8753
192D8294j1276n704J4129m809k3232o454Q46j4932j3351K919q48j1742j721M058
206b3823n841k207J2613O696m153O965J4158j56j690J3733Q315r477q05R877l535
221B0670q679P136N525j2433r757K1r487j2615m09n19q141K722J1684J334J358
$$ plain form
236 -11590 4262 12697 4214 2393 9682 5005 -3015 3293 9524 6067 7646 15905 15745 11883 13265
251 13265 9671 -2073 -9794 -14004 -20631 -23101 -16259 -11449 -10032 -1557 9109 10344 7597 10582
265 10582 11219 3099 -4527 -4426 -1428 -964 1752 6837 8764 7745 6016 2386 -3449 -6063 -8760 -14217
281 -14217 -16080 -10463 -5296 -4120 1751 9022 8062 5588 9858 12456 7434 5162 7137 4280 -1638
296 -1638 -1386 -388 -2265 -2574 -3250 -7815 -9087 -6254 -7864 -10784 -7169 -3651 -5752 -5785 1299 5658 5201
313 5201 6520 9432 9467 10051 12637 13936 12987 10769 4876 -1424 -5852 -8824 -13393 -15388 -13822 -12043
329 -12043 -11524 -8613 -3554 -407 -1921 -3190 -2586 -865 -754 1685 7926 12520 13985 15585 18435 17792
345 17792 14248 9544 3838 -2715 -8447 -13929 -17808 -16469 -13274 -14102 -12901 -6906 -4012 -4559 -3477
$$ packed form
236a1590J5852Q435q483j821P289m677q020O308O231l457J579Q259j60l862J382
251A3265l594j1744p721m210o627k470O842M810J417Q475J0666J235k747K985
265A0582O37q120p626J01K998M64K716N085J927j019j729l630n835k614k697n457
281a4217j863N617N167J176N871P271r60k474M270K598n022k272J975k857n918
296a638K52R98j877l09o76m565j272K833j610k920L615L518k101l3P084M359m57
313E201J319K912L5N84K586J299r49k218n893o300m428k972m569j995J566J779
329a2043N19K911N059L147j514j269O04J721J11K439O241M594J465J600K850o43
345A7792l544m704n706o553n732n482l879J339L195q28J201N995K894n47J082
$$ plain form
360 -3477 -232 -889 -1787 1554 5778 9192 13803 17340 18803 19129 17017 11861 6836 3545 -2898 -10857
376 -10857 -13642 -13302 -15416 -17248 -15143 -12178 -11318 -10569 -8290 -4789 -1079 1646 3549 7229 11430 13190
392 13190 14309 17008 17887 15856 13055 11000 8065 3590 -1774 -6197 -9279 -12893 -17007 -19221 -18333
407 -18333 -17571 -17368 -13846 -8746 -5061 -1556 3605 8675 10657 12168 13496 15189 16218 15350 13245 13065
423 13065 13787 10157 4159 1271 -1425 -7443 -14004 -16977 -19091 -20791 -20817 -18982 -15284 -10135 -5369 -1576
439 -1576 3762 8016 9105 10050 13160 14745 14223 14225 15650 14846 12971 10906 7890 3546 -1889 -7739 -11596
456 -11596 -14994 -17974 -20551 -19152 -16007 -14700 -12757 -7254 -1490 1831 3531 6166 9574 12163 12975
471 12975 12960 14617 16268 14126 11079 9325 7754 3321 -1840 -5121 -8616 -12217 -14697 -15252 -15437 -14465
$$ packed form
360c477L245o57q98L341M224L414M611L537J463L26k112n156n025l291o443p959
376a0857k785L40k114j832K105K965Q60P49K279L501L710K725J903L680M201J760
392A3190J119K699Q79k031k801k055k935m475n364m423l082l614m114k214Q88
407a8333P62K03L522N100L685L505N161N070J982J511J328J693J029q68k105j80
423A3065P22l630n998k888k696o018o561k973k114j700k6J835L698N149M766L793
439a576N338M254J089R45L110J585n22KJ425q04j875k065l016m344n435n850l857
456a1596l398k980k577J399L145J307J943N503N764L321J700K635L408K589Q12
471A2975j5J657J651k142l047j754j571m433n161l281l495l601k480n55j85R72
$$ plain form
487 -14465 -13662 -12130 -8543 -3876 -988 2362 6791 9286 9545 11298 13631 13385 11939 11270 10116 7537
503 7537 4292 1297 -569 -2263 -5895 -10590 -11913 -11328 -12685 -14300 -12242 -9139 -7526 -5588 -1626
518 -1626 2875 6204 8512 9764 11378 12032 11183 9530 8958 7747 4772 2703 1791 118 -2880 -5423
534 -5423 -7165 -9449 -11832 -13064 -12375 -10037 -8450 -7184 -3830 515 3240 4501 7210 9988 10302 9114
550 9114 8893 9667 8528 6589 4289 2902 1623 -654 -3815 -5106 -5523 -8639 -10944 -10802 -9713 -9611
566 -9611 -7894 -4857 -2288 -344 1814 4037 6116 7758 7543 7676 8974 8956 6723 5777 5689 3394 460
583 460 -1629 -2916 -4724 -6103 -7617 -7944 -7275 -7552 -7496 -6061 -3344 -2226 -1696 619 3293 4634 4981
600 4981 6579 7542 7618 6429 5391 4686 3931 1662 -453 -1314 -1950 -4305 -5427 -4959 -5022 -5976 -5582 -4265
$$ packed form
487a4465Q03J532L587M667K888L350M429K495K59J753K333k46j446o69j154k579
503G537l245k995j866j694l632m695j323N85j357j615K058L103J613J938L962
518a626M501L329K308J252J614O54q49j653n72j211k975k069r12j673k998k543
534e423j742k284k383j232O89K338J587J266L354M345K725J261K709K778L14j188
550I114k21P74j139j939k300j387j279k277l161j291m17l116k305J42J089J02
566i611J717L037K569J944K158K223K079J642k15J33J298j8k233r46q8k295k934
583D60k089j287j808j379j514l27O69k77N6J435K717J118N30K315K674J341L47
600D981J598R63P6j189j038p05p55k269k115q61o36k355j122M68o3r54L94J317
$$ plain form
618 -4265 -3516 -2779 -2049 -231 1650 2832 2899 3968 5860 6304 4189 4327 4600 2715 402 -181 -283 -1771
636 -1771 -2985 -3922 -3788 -3776 -4287 -5069 -3831 -2205 -2109 -2174 133 2107 2400 2915 4371 5026 4599 3858 3363
655 3363 3050 1718 129 -508 -639 -1400 -3107 -3727 -3244 -3342 -4590 -4507 -3155 -2545 -2342 -1054 446 2264
673 2264 3129 3132 3798 4990 4954 3505 3604 3591 2253 313 -233 -469 -1718 -2943 -3468 -3646 -3695 -4263 -4674 -3486
693 -3486 -2310 -2542 -2282 147 1513 1944 2606 4159 5057 4507 4005 4086 4150 3108 1437 146 165 -984
711 -984 -2954 -3513 -2835 -3290 -4609 -4125 -2761 -2794 -2781 -1617 -674 713 879 1212 2549 3916 3920 3601 4199
730 4199 4795 3472 1828 1432 773 -1380 -2789 -3085 -3354 -3858 -4108 -3913 -2513 -1936 -2448 -1745 -186 544
748 544 114 646 2177 3047 2997 3445 4081 4412 3654 2558 1589 1225 -483 -2480 -3301 -3390 -4155 -4815 -4020 -3118
$$ packed form
618d265P49P37P30J818J881J182O7J069J892M44k115J38K73j885k313n83j02j488
636a771j214r37J34J2n11p82J238J626R6o5K307J974K93N15J456O55m27p41m95
655C363l13j332j589o37j31p61j707o20M83r8j248Q3J352O10K03J288J500J818
673B264Q65LO66J192l6j449R9j3j338j940n46k36j249j225n25j78m9n68m11J188
693c486J176k32K60K429J366M31O62J553Q98n50n02Q1O4j042j671j291J9j149
711i84j970n59O78m55j319M84J364l3J3J164R43J387J66L33J337J367Ml19N98
730D199N96j323j644l96o59k153j409k96k69n04k50J95J400N77n12P03J559P30
748E44m30N32J531Q70n0M48O36L31p58j096r69l64j708j997q21q9p65o60P95R02
$$ plain form
768 -3118 -2761 -2543 -1521 -389 319 721 1335 2391 3112 2936 2787 4261 4643 3840 2936 3104 2142 141
786 141 -1324 -2003 -2885 -4108 -4951 -4982 -4323 -3924 -3624 -2834 -1130 -304 119 889 2393 3212 2635 3201 3917
805 3917 3966 3756 3332 3295 3291 1823 455 -288 -1205 -2839 -4303 -4423 -4457 -5145 -5494 -4052 -2751 -1740 -1054
824 -1054 256 1495 2600 2467 2695 3573 4135 3228 2800 3361 3692 2414 1627 1328 838 -656 -2271 -3001
842 -3001 -3705 -4541 -5420 -5037 -3847 -3209 -2221 -886 994 1491 1644 2436 3192 2959 2285 2690 2972 2565 2176
861 2176 1714 1925 1951 350 -892 -1222 -1704 -3460 -4321 -3974 -3658 -3485 -3321 -1838 -149 627 1190 1976 2698
880 2698 2946 2191 1892 2773 2269 1574 1127 1502 1246 272 -309 -238 -1007 -1792 -3149 -3135 -2947 -3416 -3549 -2295
900 -2295 -997 -432 144 1466 2772 3073 2522 3023 3123 2500 1594 1121 1024 980 -61 -1077 -353 -515 -1209
$$ packed form
768c118L57K18J022J132P08M02O14J056P21j76j49J474L82q03r04J68r62k001
786A41j465o79q82j223q43l1O59L99L00P90J704Q26M23P70J504Q19n77N66P16
805C917M9k10m24l7mj468j368p43r17j634j464j20l4o88l49J442J301J011O86
824a054J310J239J105j33K28Q78N62r07m28N61L31j278p87k99m90j494j615p30
842c001p04q36q79L83J190O38R88J335J880M97J53P92P56k33o74M05K82m07l89
861B176m62K11K6j601j242l30m82j756q61L47L16J73J64J483J689P76N63P86P22
880B698K48p55k99Q81n04o95m47L75k56r74n81P1p69p85j357J4J88m69j33J254
900b295J298N65N76J322J306L01n51N01J00o23r06m73r7m4j041j016P24j62o94
$$ plain form
919 -1209 -2128 -1734 -1781 -3278 -3246 -2893 -2384 -1682 -1062 203 1613 2464 2377 3191 3657 3317 2381 1786 1688 713
939 713 -294 -559 -516 -665 -1063 -1484 -1210 -1208 -2095 -2821 -2665 -2026 -2412 -2479 -1158 243 1128 1436 2465 3152
959 3152 3515 2819 2481 2329 1447 116 -424 -125 -324 -1040 -824 -334 -479 -1498 -1623 -1210 -1319 -2020 -2181
978 -2181 -1443 -857 -722 -147 951 2118 2100 2053 2428 2851 1783 578 234 286 -510 -1294 -1415 -1137 -600 -1030
998 -1030 -891 -435 -524 -874 -1392 -572 -517 -1091 -715 -229 760 1060 1534 1718 2415 2007 1330 622 411 -278 -1295
1019 -1295 -1705 -1382 -1586 -1933 -1261 -544 -242 -129 -351 176 465 129 -160 -141 584 324 497 1378 2048 1858
1039 1858 1434 1514 1227 133 -656 -1095 -1240 -1959 -2159 -2492 -1338 -967 -746 -496 262 725 316 282 835 705
1059 705 148 100 920 1603 1448 1509 1689 2015 1348 243 20 -253 -1368 -1885 -1988 -1856 -1523 -1614 -1086 -187
$$ packed form
919a209r19L94m7j497L2L53N09P02O20J265J410Q51q7Q14M66l40r36n95r8r75
939G13j007k65M3j49l98m21K74Kq87p26J56O39l86o7J321J401Q85L08J029O87
959C152L63o96l38j52q82j331n40K99j99p16K16M90j45j019j25M13j09p01j61
978b181P38N86J35N75J098J167j8m7L75M23j068j205l44N2p96p84j21K78N37m30
998a030J39M56q9l50n18Q20N5n74L76M86R89L00M74J84O97m08o77p08k11o89j017
1019a295m10L23k04l47O72P17L02J13k22N27K89l36k89J9P25k60J73Q81O70j90
1039A858m24Q0k87j094p89m39j45p19k00l33J154L71K21K50P58M63m09l4N53j30
1059G05n57m8Q20O83j55O1J80L26o67j105k23k73j115n17j03J32L33r1N28Q99
$$ plain form
1079 -187 -104 303 208 629 776 -62 117 554 881 689 735 1101 1377 1171 697 689 650 -236 -1028 -1318 -1282 -1307 -2224
1102 -2224 -1379 -673 -94 -413 287 975 761 486 333 614 605 179 -49 289 820 613 372 669 1007 513
1122 513 -176 -186 -626 -1211 -1589 -1460 -1079 -685 -603 258 609 1214 787 587 1103 834 81 -197 -22 56 -25
1143 -25 -452 146 455 250 5 91 -187 -617 -1390 -1123 -847 -1082 -1209 -711 486 914 740 1217 1333 1344 1182
1164 1182 692 670 353 -39 -635 -337 -52 -175 -412 306 433 -491 -723 -631 -711 -1197 -1296 -1058 -339 77 18
1185 18 484 1128 1417 1206 1006 1250 1106 381 -115 -70 -64 -341 -674 -141 61 -182 -306 -382 -258 -570 -1146 -963
1207 -963 -956 -1000 -631 -160 259 732 724 1198 1332 1130 684 442 364 200 -485 -448 -291 -141 -253 -26 193 148 140
1230 140 -686 -551 -476 -907 -891 -559 -169 -6 -71 475 938 1009 413 444 319 283 -556 -671 -646 -515 -586 -555 -87
$$ packed form
1079a87Q3M07r5M21J47q38J79M37L27j92M6L66K76k06m74ql9q86p92k90L6k5r17
1102b224Q45P06N79l19P00O88k14k75j53K81rm26k28L38N31k07k41K97L38m94
1122E13o89j0m40n85l78J29L81L94Q2Q61L51O05m27k00N16k69p53k78J75P8q1
1143b5m27N98L09k05k45Q6k78m30p73K67K76k35j27M98J197M28j74M77J16J1j62
1164A182m90k2l17l92n96K98K85j23k37P18J27r24k32R2q0m86r9K38P19M16n9
1185A8M66O44K89k11k00K44j44p25m96M5Ok77l33N33K02k43j24p6J24l12n76J83
1207i63Pm4L69M71M19M73qM74J34k02m46k42p8j64o85L7J57J50j12K27K19m5q
1230A40q26J35P5m31J6L32L90J63o5N46M63P1n96L1j25l6q39j15K5J31p1L1M68
$$ plain form
1253 -87 240 166 36 351 317 -176 -486 -318 -75 -292 -437 233 400 471 408 545 758 644 -192 -258 -346 -626
1275 -626 -1058 -628 -59 -41 -51 -320 301 731 337 25 401 261 110 -302 -79 310 496 277 596 907 808
1296 808 209 14 139 -182 -836 -885 -278 -520 -834 -475 214 361 51 284 314 518 153 109 23 116 -19 141
1318 141 141 648 674 407 457 604 257 -497 -369 -106 -453 -805 -681 -311 -64 -354 -96 588 593 309 76 -68
1340 -68 309 -251 -827 -176 161 -50 133 215 460 416 -19 28 106 90 -521 -811 -407 56 67 83 202 775 363
1363 363 296 404 268 -49 -521 -350 -199 -422 -341 -166 121 -16 -148 223 365 207 -257 -118 -277 -63 -101
1384 -101 -116 310 770 479 937 812 795 288 80 219 -174 -570 -863 -450 -124 -220 -552 -500 68 -48 -428
1405 -428 -54 190 44 -365 -538 14 337 117 489 960 759 787 473 506 340 9 -178 -293 -404 -548 -735
$$ packed form
1253h7L27p4j30L15l4m93l10J68K43k17j45O70J67P1o3J37K13j14q36o6q8k80
1275f26m32M30N69J8j0k69O21M30l94l12L76j40j51m12K23L89J86k19L19L11r9
1296H08n99j95J25l21o54m9O07k42l14L59O89J47l10K33L0K04l65m4q6R3j35J60
1318A41%N07K6k67N0J47l47p54J28K63l47l52J24L70K47k90K58O84Nk84k33j44
1340f8L77n60n76O51L37k11J83Q2K45m4m35M7P8j6o11k90M04M63J1J6J19N73m12
1363C63o7J08j36l17m72J71J51k23Q1J75K87j37j32L71J42j58m64J39j59K14l8
1384a01j5M26M60k91M58j25j7n07k08J39l93l96k93M13L26r6l32N2N68j16l80
1405d28L74K44j46m09j73N52L23k20L72M71k01K8l14L3j66l31j87j15j11j44j87
$$ plain form
1426 -735 -408 -75 -168 -180 41 140 -226 -319 -423 47 -43 -592 19 402 535 409 158 427 627 171 99 -112
1448 -112 19 -511 -543 -377 -55 -145 -238 41 367 137 -88 124 95 -82 -64 -20 213 95 74 48 675 213 -81
1471 -81 102 104 -13 -598 -770 -365 -344 -560 -525 3 410 193 287 42 616 295 276 -55 537 234 -202 171
1493 171 290 125 -91 91 15 -163 -321 -629 -479 -581 -698 -502 75 -44 -153 36 528 426 298 412
1513 412 445 421 311 281 88 180 370 98 -78 284 342 -304 -286 -310 -411 -679 -752 -752 -232 -425 -213 72 305
1536 305 396 430 512 765 523 -27 345 644 272 -9 -21 332 174 -122 1 41 -126 -337 -854 -595 -382 -423
1558 -423 -501 -136 -59 274 143 331 826 338 355 275 194 -200 162 -97 -10 -34 -86 -24 271 -25 -206 -148 -331
1581 -331 -107 -520 -600 -201 -260 -61 -169 300 568 542 332 417 555 436 -28 -323 28 -178 -472 -382 -116 -140
$$ packed form
1426g35L27L33r3j2K21R9l66r3j04M70r0n49O11L83J33j26k51K69K00m56p2k11
1448a12J31n30l2J66L22r0r3K79L26k30k25K12k9j77J8M4K33j18k1k6O27m62k94
1471h1J83Kj17n85j72M05K1k16L5N28M07k17R4k45N74l21j9l31N92l03m36L73
1493A71J19j65k16J82p6j78j58l08J50j02j17J96N77j19j09J89M92j02j28J14
1513D12L3k4j10l0j93R2J90k72j76L62N8o46J8k4j01k68p3%N20j93K12K85K33
1536C05R1L4Q2K53k42n50L72K99l72k81j2L53j58k96J23M0j67k11n17K59K13m1
1558d23p8L65P7L33j31J88M95m88J7q0q1l94L62k59Q7k4n2O2K95k96j81N8j83
1581c31K24m13q0L99n9J99j08M69K68k6k10Q5J38j19m64k95L51k06k94R0K66k4
$$ plain form
1603 -140 -285 -246 -71 -349 -217 -514 -175 -16 -29 12 362 369 524 593 524 689 316 11 259 11 -422 -585
1625 -585 -458 -302 -386 -397 -381 -172 -81 -552 -398 -140 -70 -368 -227 111 260 259 434 655 679 507 425 534 377
1648 377 -55 -28 -292 -213 -517 -438 -146 -335 -661 -637 -394 -383 -264 -158 -275 6 48 14 366 472 610 237
1670 237 390 499 404 488 -56 -297 -40 -265 -743 -471 -375 -437 -546 -141 -76 -401 -307 -38 -79 -27 -88 111 372
1693 372 702 130 275 372 666 240 91 353 -61 -233 -477 -480 -731 -419 -800 -411 -56 -166 -296 -304 14 179
1715 179 48 235 332 318 266 304 467 549 253 376 174 389 -327 -273 -375 -189 -556 -807 -445 -542 -634 -197 -31
1738 -31 5 103 151 403 261 203 546 229 469 605 466 98 560 86 75 -107 -360 -397 -612 -535 -680 -706 -613
1761 -613 -462 -217 -105 50 235 408 743 162 347 595 323 500 288 364 536 429 129 204 85 -271 -423
$$ packed form
1603a40j45L9J75k78J32k97L39J59j3M1L50PJ55O9o9J65l73l05K48k48m33j63
1625e85J27J56q4j1J6K09R1m71J54K58P0k98J41L38J49jJ75K21K4j72q2J09j57
1648C77m32K7k64P9l04P9K92j89l26K4K43J1J19J06j17K81M2l4L52J06J38l73
1670B37J53J09r5Q4n44k41K57k25m78K72R6o2j09M05O5l25R4K69m1N2o1J99K61
1693C72L30n72J45R7K94m26j49K62m14j72k44lk51L12l81L89L55j10j30qL18J65
1715A79j31J87R7j4n2L8J63Q2k96J23k02K15p16N4j02J86l67k51L62r7r2M37J66
1738c1L6R8M8K52j42n8L43l17K40J36j39l68M62m74j1j82k53l7k15P7j45k6R3
1761f13J51K45J12J55J85J73L35n81J85K48k72J77k12P6J72j07l00P5j19l56j52
$$ plain form
1782 -423 -610 -704 -714 -668 -641 -260 -456 -300 -93 -81 328 308 302 277 656 456 286 407 332 481 237 167 3 58
1806 58 -225 -578 -344 -454 -661 -633 -503 -545 -366 -47 75 532 195 185 367 680 487 300 284 512 287 204
1828 204 99 98 169 -328 -46 -72 -361 -648 -470 -625 -533 -386 -358 -48 269 262 170 611 667 606 243 305 427 267
1852 267 88 131 128 143 -173 -283 -152 -214 -429 -431 -222 -434 -348 -771 -311 -100 74 318 310 709 707 402 764 612
1876 612 281 126 256 275 -89 -183 -216 -288 -184 -491 -307 -171 -518 -343 -663 -246 -388 -236 -88 227 369
1897 369 188 414 727 734 790 492 226 352 228 -220 -196 -419 -386 -291 -193 -192 -426 -611 -521 -263 -408 -123 -114 236
1921 236 -34 185 77 592 544 673 485 353 471 143 13 126 -15 -312 -217 -249 -288 -159 -369 -115 -267
1942 -267 -462 -52 -470 -37 146 -93 178 369 364 467 499 399 541 355 50 187 -113 -217 -311 -383 -47 -484
$$ packed form
1782d23j87r4j0M6K7L81j96J56K07J2M09k0ok5L79k00j70J21p5J49k44p0j64N5
1806E8k83l53K34j10k07K8J30m2J79L19J22M57l37j0J82L13j93j87j6K28k25q3
1828B04j05jP1m97K82k6k89k87J78j55R2J47K8L10L17pr2M41N6o1l63O2J22j60
1852B67j79M3lJ5l16j10J31o2k15kK09k12Q6m23M60K11J74K44qL99kl05L62j52
1876F12l31j55J30J9l64r4l3p2J04l07J84J36l47J75l20M17j42J52J48L15J42
1897C69j81K26L13PN6k98k66J26j24m48K4k23L3R5R8Jk34j85R0K58j45K85RL50
1921B36k70K19j08N15m8J29j88j32J18l28j30J13j41k97R5l2l9J29k10K54j52
1942b67j95M10m18M33J83k39K71J91nJ03L2j00J42j86l05J37l00j04r4p2L36m37
$$ plain form
1964 -484 -490 -65 -308 -32 -187 -216 -16 144 -115 274 418 286 448 660 671 98 327 297 21 87 -241 -605
1986 -605 -106 -144 -465 -610 -434 -236 -314 -305 -206 -51 145 279 186 106 569 355 178 534 506 202 326 64 262
2009 262 121 -62 -196 -278 -586 -537 -714 -551 -272 -373 -298 -23 -87 -46 221 325 141 241 321 367 454 293 246
2032 246 235 472 7 173 -183 -326 -183 -708 -538 -488 -252 -604 -312 -6 -14 -9 -38 207 150 66 354 304 384 153
2056 153 372 484 313 169 -8 145 -317 -328 -81 -94 -504 -255 -406 -404 -473 -322 -15 147 142 45 18 259 391
2079 391 192 338 283 379 245 212 325 329 -167 -92 -230 -219 -139 -359 -462 -348 -206 -288 -156 24 169 128 250
2102 250 534 439 227 440 104 258 580 531 0 -11 -198 -460 -275 -266 -78 -649 -424 -306 -245 -316 -289 -228 -87
2125 -87 -42 78 210 556 508 375 267 646 310 50 -83 6 -67 28 -397 -129 -187 -425 -449 -497 -414 -328 -331 -533
$$ packed form
1964d84oM25k43K76j55k9K00J60k59L89J44j32J62K12J1n73K29l0k76O6l28l64
1986f05M99l8l21j45J76J98p8RR9J55J96J34r3q0M63k14j77L56k8l04J24k62J98
2009B62j41j83j34q2l08M9j77J63K79j01P5K75o4M1K67J04j84J00Q0M6Q7j61m7
2032B46j1K37m65J66l56j43J43n25J70N0K36l52K92L06qNk9K45n7q4K88n0Q0k31
2056A53K19J12j71j44j77J53m62j1K47j3m10K49j51Ko9J51L07J62nr7k7K41J32
2079C91j99J46n5R6j34l3J13Mm96P5j38J1Q0k20j03J14J42q2J32J80J45m1J22
2102B50K84r5k12K13l36J54L22m9n31j1j87k62J85RJ88n71K25J18O1p1K7O1J41
2125h7M5J20J32L46m8j33j08L79l36k60j33Q9p3R5m25K68n8k38k4m8Q3Q6lk02
$$ plain form
2149 -533 -312 -83 113 116 366 373 114 334 440 642 -13 420 92 96 -9 -151 82 -350 -159 -190 -340 -130
2171 -130 -339 -526 -215 -21 21 -171 -204 328 237 460 275 231 182 363 452 388 244 5 154 -197 -54 -124 -231
2194 -231 -212 -229 -267 -385 -269 -93 -88 -89 -46 -155 -41 113 160 239 219 262 445 450 188 39 32 41 -104 -350 -270 -196 -275
2221 -275 -105 -247 -191 -134 -201 -100 -71 11 206 22 196 288 403 75 317 108 424 203 -157 50 -90 -98 -364
2244 -364 -259 -331 -429 -546 -262 -6 -318 -49 -87 -22 48 202 273 243 293 489 641 437 272 382 170 64 164
2267 164 -180 -164 -261 -203 -487 -392 -299 -71 -286 -354 -80 11 -247 -128 257 272 254 409 294 497 352 578 488
2290 488 398 83 -166 -60 -37 -305 -123 -105 51 -513 -432 -73 -149 49 137 -66 105 508 234 279 225 236 145
2313 145 337 308 392 227 94 -238 328 -140 -434 -317 -165 -212 -518 -219 -254 -89 -393 -15 -47 -126 225 39
$$ packed form
2149e33K21K29J96LK50Pk59K20J06K02o55M33l28Mj05j42K33m32J91l1j50K10
2171a30k09j87L11J94M2j92l3N32r1K23j85m4m9J81Q9o4j44k39J49l51J43p0j07
2194b31J9j7l8j18J16J76NjM3j09J14J54M7P9k0M3J83Nk62j49pRj45k46Q0P4p9
2221b75J70j42N6N7o7J01K9Q2J95j84J74R2J15l28K42k09L16k21l60K07j40qk66
2244c64J05p2r8j17K84K56l12K69l8O5P0J54P1l0N0J96J52k04j65J10k12j06J00
2267A64l44J6r7N8k84R5R3K28k15o8K74R1k58J19L85J5j8J55j15K03j45K26r0
2290D88r0l15k49J06K3k68J82J8J56n64Q1L59p6J98Q8k03J71M03k74M5n4J1r1
2313A45J92k9Q4j65j33l32N66m68k94J17J52m7l06K99l5J65l04L78l2p9L51j86
$$ plain form
2335 39 216 362 306 304 325 104 212 170 94 -139 -148 -400 -395 -210 -221 -29 -258 -138 -317 -251 -36 165 173 56 46
2360 46 215 92 166 216 358 146 -94 114 21 170 -296 -219 -149 62 -100 -356 -140 -118 -279 -402 -180 -26
2382 -26 -26 -158 177 161 222 289 342 119 218 232 222 361 -40 -149 -138 -16 -230 -421 -130 -85 -229 -271 -197 -99 172
2407 172 -319 12 -84 -36 -9 -140 352 117 277 227 416 254 207 -71 -135 23 65 -182 -330 -240 -207 -189 -199 -47
2431 -47 -93 -311 -88 158 308 141 272 443 438 245 -254 476 59 383 102 175 -409 327 -45 -216 -270 -170
2453 -170 -371 -262 -116 -77 51 -332 -70 36 112 78 125 250 285 -147 238 238 111 -133 74 -62 108 -214
2475 -214 -190 -57 -218 -297 -282 -58 -317 -187 -69 -243 99 28 -47 116 44 91 258 233 100 103 143 171 105 -9
2499 -9 -110 -61 -246 -76 -39 -217 -124 -95 -175 -198 -297 22 -89 106 123 -91 299 155 447 276 164 95 29 228
$$ packed form
2335C9J77J46n6kK1k21J08m2p6k33rk52NJ85j1J92k29J20j79O6K15K01Qj17j0
2360D6J69j23P4N0J42k12k40K08r3J49m66P7P0K11j62k56K16K2j61j23K22J54
2382b6%j32L35j6O1O7N3k23R9J4j0J39m01j09J1J22k14j91K91M5j44m2P4R8K71
2407A72m91L31r6M8K7j31M92k35J60n0J89j62m7k78o4J58M2k47j48R0L3J8j0J52
2431d7m6k18K23K46J50j67J31J71nj93m99P30m17L24k81P3n84P36l72j71n4J00
2453a70k01J09J46L9J28l83K62J06P6l4M7J25L5m32L85%j27k44K07j36J70l22
2475b14K4J33j61p9J5K24k59J30J18j74L42p1p5J63p2M7J67k5j33LM0K8o6j14
2499ij01M9j85J70L7j78R3K9q0k3r9L19j11J95J7k14L90j44K92j71j12o9o6J99
$$ plain form
2523 228 55 55 -118 -70 -66 -240 -68 -380 -19 -215 -134 113 -90 -119 44 64 -20 61 53 187 251 136 254 300 24
2548 24 131 -122 -53 -172 -109 -4 -215 -383 -387 -282 -192 -124 -55 1 -270 61 131 173 83 224 176 462 307 404 220
2573 220 184 87 -77 357 -116 -18 -4 -22 -353 -7 -164 -20 -201 -37 32 17 60 34 16 60 402 78 93 330
2597 330 93 134 35 86 93 -124 -215 -222 -209 -355 16 -91 -59 -92 -248 -195 66 -8 118 72 7 110 29 198 61
2622 61 134 -21 175 7 158 -81 64 -24 -183 -492 -131 -370 -26 -99 -15 106 -135 -192 -84 12 257 59
2644 59 52 560 167 172 175 -33 109 199 -48 78 -18 134 -125 -151 -98 -280 -339 -118 -250 -220 -139 -213 -88 -72 -53 -148
2670 -148 5 -53 353 53 76 166 174 48 -58 101 -24 -378 -190 220 -158 -2 -377 -226 -63 66 -91 56
2692 56 28 -10 -71 148 186 188 28 67 13 262 -56 -32 -156 -59 -177 -69 -358 -90 -312 -213 86 28 -43 -273 15
$$ packed form
2523B28j73%j73M8Mj74J72l12L61j96Q1K47k03k9J63K0q4Q1qJ34O4j15J18M6k76
2548B4J07k53O9j19O3J05k11j68mJ05R0O8O9N6k71L31P0M2r0J41m8K86j55R7j84
2573B20l6r7j64M34m73R8J4j8l31L46j57J44j81J64O9j5M3k6j8M4L42l24J5K37
2597C30k37M1r9N1Pk17r1pJ3j46L71j07L2l3j56N3K61p4J26m6o5J03q1J69j37
2622F1P3j55J96j68J51k39J45q8j59l09L61k39L44p3Q4J21k41n7J08R6K45j98
2644E9pN08l93NLk08J42R0k47J26r6J52k59k6N3j82n9K21j32L0Q1p4J25J6J9r5
2670a48J53n8M06l00K3R0Qj26j06J59j25l54J88M10l78J56l75J51J63J29j57J47
2692E6k8l8o1K19L8Kj60L9n4K49l18K4j24R7j18J08k89K68k22R9K99n8p1k30K88
$$ plain form
2717 15 -89 10 16 84 334 209 -85 75 252 61 -136 -128 166 -40 -168 1 -57 33 -158 -95 -21 -10 -21 -94 -42
2742 -42 70 -115 32 5 227 -204 229 37 77 -61 413 86 291 14 -40 -144 -60 168 133 -175 -85 -180 -53
2765 -53 -58 -42 186 214 -97 83 114 -128 271 -31 125 19 360 267 25 144 -122 66 256 -258 -69 -147 -50
2788 -50 -247 -215 -183 127 -252 35 -92 17 58 10 271 -140 320 142 189 179 147 88 110 -184 -188 18 64 -297
2812 -297 -18 35 -88 -352 -46 81 89 89 257 97 -125 29 122 21 236 85 22 140 398 -4 -55 -143 38
2835 38 28 -254 -43 266 -29 -117 -9 -195 -71 87 121 172 300 278 -69 56 123 -39 197 105 135 165 -67
2858 -67 -89 172 -38 139 75 20 -138 -190 54 -138 -8 -149 -140 -122 -4 51 14 40 58 58 -189 239 190 198 -38 -46
2884 -46 130 202 -86 143 -78 5 -206 -143 -27 -28 -253 58 -55 343 58 123 45 187 189 131 122 63 75 -12 38 231
$$ packed form
2717A5j04R9OO8K50j25k94J60J77j91j97QK94k06j28J69n8R0j91O3P4J1j1p3N2
2742d2J12j85J47k7K22m31M33j92M0j38M74l27K05k77n4j04Q4K28l5l08R0r5J27
2765e3nJ6K28K8l11J80L1k42L99l02J56j06L41r3k42J19k66J88J90n14J89p8R7
2788e0j97L2L2L10l79K87j27J09M1m8K61m11M60j78M7j0l2n9K2k94mK06M6l61
2812b97K79N3j23k64L06J27Q%J68j60k22J54R3j01K15j51o3J18K58m02n1q8J81
2835C8j0k82K11L09k95q8J08j86J24J58L4N1J28k2l47J25O7j62K36r2L0L0k32
2858f7k2K61k10J77o4n5j58n2K44j92J30j41RJ8J18N5l7K6J8%k47M28m9Qk36q
2884d6J76P2k88K29k21Q3k11O3J16jk25L11j13L98k85O5p8J42Kn8rn9J2q7N0J93
$$ plain form
2910 231 173 -215 12 39 -97 -63 6 -80 -205 -271 154 82 -38 -18 -45 175 -125 204 57 -52 -155 -25 106
2933 106 -238 127 258 -151 171 -272 -73 185 -242 13 -109 103 111 30 197 -178 45 26 -12 79 -28 70
2955 70 -126 -109 25 149 104 35 32 14 35 91 -301 -99 -7 -199 83 196 -238 -177 210 -234 -205 95 134 67 227
2980 227 -54 -80 -164 321 51 74 -32 44 60 -48 122 -145 -101 92 -10 -57 -23 116 -320 335 -111 -93 28
3003 28 9 15 104 217 -20 127 213 -191 -51 -15 -45 -58 166 -171 159 -85 -51 61 -143 -71 -84 12 96 82 -190
3028 -190 -82 46 163 -25 214 179 -48 98 174 160 195 88 18 211 -157 -75 103 -128 -135 108 76 -64 -9
3051 -9 -36 -256 169 -9 192 -125 94 110 141 316 4 134 73 151 -124 73 -18 -82 -309 -69 -52 -172 -181 58
3075 58 -316 -246 13 -109 111 22 37 -25 48 101 207 25 160 20 -80 109 60 -54 -114 34 136 -40 -70
$$ packed form
2910B31n8l88K27K7j36L4O9q6j25o6M25p2j20K0k7K20l00L29j47j09j03J30J31
2933A06l44L65J31m09L22m43J99K58m27K55j22K12Qq1J67l75K23j9l8R1j07R8
2955G0j96J7J34J24m5o9lj8K1N6l92K02R2j92K82J13m34O1L87m44K9L00L9o7J60
2980B27k81k6q4M85k70K3j06P6J6j08J70k67M4J93j02m7L4J39m36O55m46J8J21
3003B8j9OQ9J13k37J47Q6m04J40L6l0j3K24l37L30k44L4J12k04P2j3R6Q4j4k72
3028a90J08J28J17j88K39l5k27J46P6j4L5j07p0J93l68Q2J78k31pK43l2j40N5
3051ik7k20M25j78K01l17K19J6L1J75l12J30o1P8k75J97r1o4k27K40J7j20rK39
3075E8l74P0K59j22K20q9J5o2P3N3J06j82J35j40j00J89m9j14o0J48J02j76l0
$$ plain form
3098 -70 -209 -147 10 -168 146 56 38 311 -152 -24 -161 109 65 122 -45 -68 155 221 -63 -148 -33 -133 69
3121 69 -390 -169 -359 20 -178 -36 141 3 266 132 181 -125 92 103 72 172 38 88 68 119 -22 27 -138
3144 -138 -320 -288 -52 -100 -15 42 -265 -110 27 -70 3 -40 70 74 -100 -47 144 185 -93 138 152 76 139 74 -70
3169 -70 -162 41 29 -166 189 -177 21 84 161 81 -183 15 128 -47 -160 -23 -41 465 29 -42 -179 -52 -216
3192 -216 204 -46 -168 25 -156 -106 -194 -58 -61 102 124 -106 124 -226 37 17 -80 39 123 52 97 46 87 112
3216 112 95 179 24 -79 192 112 51 -119 167 -94 -52 197 92 65 155 -196 -47 -2 139 133 -29 287 47
3239 47 190 45 159 -74 -195 -156 129 -198 -112 -171 -146 -322 -324 126 -14 77 -31 33 -210 -140 137 -62 48
3262 48 282 112 -82 68 -37 -109 -154 208 99 -64 -31 -93 85 -228 -24 -213 36 -323 44 -59 -354 46
$$ packed form
3098g0j39O2J57j78L14r0j8K73m63J28j37K70m4N7j67k3K23O6k84q5J15j00K02
3121F9m59K21j90L79j98J42J77j38K63j34M9l06K17J1l1J00j34N0k0N1j41M9j65
3144a38j82L2K36m8Q5N7l07J55J37r7P3m3J10Mj74N3J91M1k78K31J4p6O3o5j44
3169g0r2K03j2j95L55l66J98O3P7q0k64J98J13j75j13J37j8N06m36p1j37J27j64
3192b16M20k50j22J93j81N0q8J36lJ63K2k30K30l50K63k0r7J19Q4p1M5n1M1K5
3216A12j7Q4j55j03K71q0o1j70K86k61M2K49j05k7R0l51J49M5J41oj62L16k40
3239D7J43j45J14k33j21L9K85l27Q6n9K5j76kM50j40R1j08O4k43P0K77j99J10
3262D8K34j70j94J50j05p2m5L62j09j63L3o2J78l13K04j89K49l59L67j03k95M00
$$ plain form
3284 46 -170 53 137 -45 13 186 -43 5 156 399 -61 68 204 -259 163 27 221 -33 101 -22 5 79
3306 79 -96 188 -98 -292 -47 -10 -47 175 -24 93 -180 201 25 -133 117 -46 83 -227 -38 -363 26
3327 26 -91 -168 -101 -72 -184 186 -126 -97 68 208 229 197 -186 111 -105 82 67 -93 84 90 352 -229 113
3350 113 114 -245 -32 6 -146 -157 -28 88 -139 37 -63 -258 -39 43 -114 216 -315 -83 206 -22 20 -230
3372 -230 -6 151 172 -286 -64 -14 -234 -49 -81 -103 -24 48 -32 -84 -177 -45 213 73 35 -75 61 -92 44
3395 44 -118 50 75 144 59 -66 78 176 92 7 24 -45 125 -17 85 60 -251 116 124 -212 92 87 33 101 317
3420 317 88 206 262 -79 7 163 -53 -118 -104 97 -104 -65 1 158 49 13 -15 -152 -208 -187 99 261 87
3443 87 -57 42 13 82 261 58 141 -117 -108 198 249 -12 12 33 -197 -78 27 39 218 -39 -107 -207 126 234
$$ packed form
3284D6k16K23Q4j82N8J73k29M8J51K43m60J29J36m63M22j36J94k54J34j23K7P4
3306G9j75K84k86j94K45L7l7K22j99J17k73L81j76j58K50j63J29l10J89l25L89
3327B6j17p7O7K9j12L70l12K9J65J40K1l2l83K97k16J87j5j60J77OK62n81L42
3350A13Jl59K13L8j52j1J29J16k27J76j00j95K19Q2j57L30n31K32K89k28M2k50
3372b30K24J57K1m58K22N0k20J85l2k2P9P2q0n2r3J32K58j40l8j10J36j53J36
3395D4j62J68K5O9q5j25J44R8q4q5J7o9J70j42J02k5l11L67Ql36L04nn4O8K16
3420C17k29J18N6l41Q6J56k16o5J4K01k01L9O6J57j09l6k8j37n6K1K86J62j74
3443H7j44R9k9O9J79k03Q3k58RL06N1k61K4K1k30J19J05J2J79k57o8j00L33J08
$$ plain form
3467 234 43 97 47 57 -22 -170 72 -3 -121 147 -172 -54 35 -44 -324 -307 91 49 124 133 -75 74 -8 -38 145
3492 145 -192 -199 106 -73 28 -59 17 26 -58 -54 12 -16 98 165 -103 119 -33 -76 237 55 66 -66 -203 -97 -13
3517 -13 -19 -101 218 -90 -64 72 223 1 -97 -17 -309 201 -311 -166 145 -58 3 51 36 51 -91 57 46 -35
3541 -35 165 -158 -27 152 -121 -214 171 1 -158 121 17 86 -63 85 127 -168 322 -227 46 -134 -290
3562 -290 153 76 -143 83 95 104 195 -62 -23 191 204 -30 450 28 37 59 -144 128 -32 -165 111 -75 44
3585 44 26 22 -127 3 2 63 -29 -74 -144 -127 56 -136 62 -173 84 264 152 -58 -146 -56 61 -31 196 232 100
3610 100 -71 13 -18 -59 41 243 82 -44 -34 -37 -6 -21 30 -191 -77 183 68 206 -101 -4 17 -91 -128 -51
3634 -51 33 -9 -171 -70 -121 -161 -98 -224 -1 20 -223 -87 86 -33 37 -58 -76 75 84 189 -224 -105 129 -97
$$ packed form
3467B34j91N4n0J0p9j48K42p5j18K68l19J18Q9p9k80J7L98m2P5Rk08J49q2l0J83
3492A45l37pL05j79J01q7P6Rq4MO6k8J14O7k68K22j52m3L13j82J1j32j37J06Q4
3517a3oq2L19l08K6J36J51k22r8Q0k92N10n12J45L11k03O1M8j5J5j42J48j1q1
3541c5K00l23J31J79k73r3L85j70j59K79j04O9j49J48M2k95M90n49K73j80j56
3562b90M43p7k19K26J2RR1k57L9K14J3k34M80m22RK2k03K72j60j33K76j86J19
3585D4j8mj49J30jO1r2m5p0J7J83j92J98k35K57J80j12k10q8R0J17r2K27L6j32
3610A00j71Q4l1m1J00K02j61j26J0lL1j5N1k21J14K60j15J38l07R7K1j08l7P7
3634e1Q4m2j62J01n1m0O3j26K23K1k43J36J73j19P0r5j8J51RJ05m13J19K34k26
$$ plain form
3658 -97 163 145 -5 162 218 22 -19 30 -86 27 116 -198 35 50 26 125 14 270 -368 131 111 -156 23
3681 23 22 -36 259 -70 -92 -163 -46 42 -215 -75 126 4 -47 119 185 79 -244 -108 -238 -68 22 126 -117
3704 -117 202 289 -54 323 117 189 29 -29 -63 234 -98 50 -57 276 -163 -35 151 -52 147 72 18 -129
3726 -129 -47 210 -137 -11 -92 37 3 58 140 145 252 -18 -134 -143 162 213 314 40 65 246 -221 12 -70 81
3750 81 -172 63 118 16 88 81 174 30 0 -146 4 -49 -127 -44 -78 151 -82 136 117 -31 4 -265 -110 43
3774 43 -18 -5 -148 188 46 -36 -127 38 322 -95 33 -191 43 -29 -20 -37 -81 -55 -104 121 -39 -58 -110 -141 92
$$ packed form
3658i7K60j8j50J67N6j96m1M9j16J13Q9l14K33J5k4R9j11K56o38M99k0k67J79
3681B3jn8K95l29k2p1J17Q8k57J40K01j22n1J66O6j06l23J36j30J70R0J04k43
3704a17L19Q7l43L77k06P2j60n8l4K97l32J48j07L33m39J28J86k03J99p5n4j47
3726a29Q2K57l47J26q1J29l4N5Q2NJ07k70j16rL05N1J01k74K5J81m67K33q2J51
3750H1k53K35N5j02P2pR3j44l0j46J50n3p8Q3l4K29k33K18j9j48L5k69J55J53
3774D3o1J3j43L36j42q2r1J65K84m17J28k24K34p2Rj7m4K6m9K25j60j9n2l1K33
$$ [...]
8191C3
##END NTUPLES=NMR FID
##END=
