##TITLE=1H_SR-75_TFAA3-V3
 CDCl3
 8 sc, 
 1.9.2023
##JCAMPDX= 6.0         $$ Bruker NMR JCAMP-DX V2.0
##DATA TYPE= NMR FID
##DATA CLASS= NTUPLES
##ORIGIN= UXNMR, Bruker Analytische Messtechnik GmbH
##OWNER= root
$$ XWIN-NMR		Version 3.5
$$ Fri Sep  1 16:04:09 2023 Russian Standard Time (UT+4h)  she@DPX200
##.OBSERVE FREQUENCY= 200.13135
##.OBSERVE NUCLEUS= ^1H
##.DELAY= (6, 6)
##.ACQUISITION MODE= SIMULTANEOUS
##.ACQUISITION SCHEME= undefined
##.AVERAGES= 8
##.DIGITISER RES= 18
##SPECTROMETER/DATA SYSTEM= spect
##.PULSE SEQUENCE= zg30
##.SOLVENT NAME= CDCl3
##.SHIFT REFERENCE= (INTERNAL, CDCl3, 0, 15.7039)
##AUDIT TRAIL= $$ (NUMBER, WHEN, WHO, WHERE, WHAT)
$$ ##TITLE= Audit trail, XWIN-NMR		Version 3.5
$$ ##JCAMPDX= 5.01
$$ ##ORIGIN= Bruker BioSpin GmbH
$$ ##OWNER= she
$$ F:/spectra/data/she/nmr/H-F/1/audita.txt
$$ ##AUDIT TRAIL=  $$ (NUMBER, WHEN, WHO, WHERE, WHAT)
(   1,<2023-09-01 16:02:17.12 +0400>,<she>,<DPX200>,
      <created by zg, POWCHK disabled, PULCHK disabled
       configuration hash MD5:
       00 E9 B6 7A A2 85 ED C7 34 08 36 98 17 FE 4E 26
       data hash MD5: 16K
       1F C0 68 52 7D D0 96 BA 8B FD A3 BF 86 09 92 56>)
$$ ##END=
$$ 
$$ hash MD5
$$ CC A0 0C 53 08 04 3A 37 CD 28 B0 CA 8F 4E 4F 43
##$RELAX= 
##$RELAX= 
##$RELAX= 
##$RELAX= 
##$RELAX= 
##$RELAX= 
$$ Bruker specific parameters
$$ --------------------------
##$DU= <F:/spectra>
##$EXPNO= 1
##$NAME= <H-F>
##$PROCNO= 1
##$TYPE= <nmr>
##$USER= <she>
##$AMP= (0..31)
100 100 100 100 100 100 100 100 100 100 100 100 100 100 100 100 100 100 
100 100 100 100 100 100 100 100 100 100 100 100 100 100 
##$AQSEQ= 0
##$AQ_mod= 1
##$AUNM= <au_zg>
##$AUTOPOS= <>
##$BF1= 200.13
##$BF2= 200.13
##$BF3= 200.13
##$BF4= 200.13
##$BF5= 200.13
##$BF6= 200.13
##$BF7= 200.13
##$BF8= 200.13
##$BYTORDA= 1
##$CFDGTYP= 0
##$CFRGTYP= 5
##$CHEMSTR= <none>
##$CNST= (0..31)
1 1 145 1 1 1 1 1 1 1 1 1 1 1 1 1 1 1 1 1 1 1 1 1 1 1 1 1 1 1 1 1 
##$CPDPRG= <>
##$CPDPRG1= <>
##$CPDPRG2= <>
##$CPDPRG3= <>
##$CPDPRG4= <mlev>
##$CPDPRG5= <mlev>
##$CPDPRG6= <mlev>
##$CPDPRG7= <mlev>
##$CPDPRG8= <mlev>
##$CPDPRGB= <>
##$CPDPRGT= <>
##$D= (0..31)
0 1.2 0 0 0 0 0 0 0 0.06 0 0.03 0 0 0 0 0.0002 0 0 0 0 0 0 0 0 0 0 0 0 
0 0 0 
##$DATE= 1693569736
##$DBL= (0..7)
120 120 120 120 120 120 120 120 
##$DBP= (0..7)
150 150 150 150 150 150 150 150 
##$DBP07= 0
##$DBPNAM0= <>
##$DBPNAM1= <>
##$DBPNAM2= <>
##$DBPNAM3= <>
##$DBPNAM4= <>
##$DBPNAM5= <>
##$DBPNAM6= <>
##$DBPNAM7= <>
##$DBPOAL= (0..7)
0.5 0.5 0.5 0.5 0.5 0.5 0.5 0.5 
##$DBPOFFS= (0..7)
0 0 0 0 0 0 0 0 
##$DE= 6
##$DECBNUC= <off>
##$DECIM= 32
##$DECNUC= <off>
##$DECSTAT= 4
##$DIGMOD= 1
##$DIGTYP= 9
##$DL= (0..7)
0 120 120 120 120 120 120 120 
##$DP= (0..7)
150 150 150 150 150 150 150 150 
##$DP07= 0
##$DPNAME0= <>
##$DPNAME1= <>
##$DPNAME2= <>
##$DPNAME3= <>
##$DPNAME4= <>
##$DPNAME5= <>
##$DPNAME6= <>
##$DPNAME7= <>
##$DPOAL= (0..7)
0.5 0.5 0.5 0.5 0.5 0.5 0.5 0.5 
##$DPOFFS= (0..7)
0 0 0 0 0 0 0 0 
##$DQDMODE= 0
##$DR= 18
##$DS= 0
##$DSLIST= <SSSSSSSSSSSSSSS>
$$ [...]
##$SUBNAM2= <"">
##$SUBNAM3= <"">
##$SUBNAM4= <"">
##$SUBNAM5= <"">
##$SUBNAM6= <"">
##$SUBNAM7= <"">
##$SUBNAM8= <"">
##$SUBNAM9= <"">
##$SW= 18.05172834244
##$SWIBOX= (0..15)
0 0 2 0 0 0 0 0 0 0 0 0 0 0 0 0 
##$SW_h= 3612.71676300578
##$TD= 16384
##$TD0= 1
##$TE= 0
##$TE2= 300
##$TE3= 300
##$TEG= 300
##$TL= (0..7)
0 120 120 120 120 120 120 120 
##$TP= (0..7)
150 150 150 150 150 150 150 150 
##$TP07= 0
##$TPNAME0= <>
##$TPNAME1= <>
##$TPNAME2= <>
##$TPNAME3= <>
##$TPNAME4= <>
##$TPNAME5= <>
##$TPNAME6= <>
##$TPNAME7= <>
##$TPOAL= (0..7)
0.5 0.5 0.5 0.5 0.5 0.5 0.5 0.5 
##$TPOFFS= (0..7)
0 0 0 0 0 0 0 0 
##$TUNHIN= 0
##$TUNHOUT= 0
##$TUNXOUT= 0
##$USERA1= <user>
##$USERA2= <user>
##$USERA3= <user>
##$USERA4= <user>
##$USERA5= <user>
##$V9= 5
##$VALIST= <valist>
##$VCLIST= <CCCCCCCCCCCCCCC>
##$VD= 0
##$VDLIST= <DDDDDDDDDDDDDDD>
##$VPLIST= <PPPPPPPPPPPPPPP>
##$VTLIST= <TTTTTTTTTTTTTTT>
##$WBST= 1024
##$WBSW= 4
##$XGAIN= (0..3)
0 0 0 0 
##$XL= 0
##$YL= 0
##$YMAX_a= 277221
##$YMIN_a= -346481
##$ZGOPTNS= <>
##$ZL1= 120
##$ZL2= 120
##$ZL3= 120
##$ZL4= 120
##$ABSF1= 10
##$ABSF2= 0
##$ABSG= 5
##$ABSL= 3
##$ALPHA= 0
##$AQORDER= 0
##$ASSFAC= 0
##$ASSFACI= 0
##$ASSFACX= 0
##$ASSWID= 0
##$AUNMP= <proc_1d>
##$AZFE= 0.1
##$AZFW= 0.1
##$BCFW= 1
##$BC_mod= 2
##$BYTORDP= 1
##$COROFFS= 0
##$CY= 11.3945322036743
##$DATMOD= 1
##$DC= 2
##$DFILT= <>
##$DTYPP= 0
##$F1P= 15.7292609196834
##$F2P= 12.9074282941183
##$FCOR= 0.5
##$FTSIZE= 0
##$FT_mod= 4
##$GAMMA= 1
##$GB= 0.15
##$INTBC= 1
##$INTSCL= 1
##$ISEN= 128
##$LB= 0.24
##$LEV0= 0
##$LPBIN= 0
##$MAXI= 10000
##$MC2= 0
##$MEAN= 0
##$ME_mod= 0
##$MI= 1.114404
##$NCOEF= 0
##$NC_proc= 0
##$NLEV= 6
##$NOISF1= 3.799351
##$NOISF2= 2.8
##$NSP= 1
##$NTH_PI= 0
##$NZP= 0
##$OFFSET= 15.70392
##$PC= 1
##$PHC0= -21047.27
##$PHC1= 11.05272
##$PH_mod= 1
##$PKNL= yes
##$PPARMOD= 0
##$PSCAL= 0
##$PSIGN= 0
##$REVERSE= no
##$SF= 200.130013532006
##$SI= 16384
##$SIGF1= 3
##$SIGF2= 2
##$SINO= 400
##$SIOLD= 16384
##$SREGLST= <1H.CDCl3>
##$SSB= 0
##$STSI= 0
##$STSR= 0
##$SW_p= 3612.71676300578
##$SYMM= 0
##$S_DEV= 0
##$TDeff= 0
##$TDoff= 0
##$TI= <>
##$TILT= no
##$TM1= 0
##$TM2= 0
##$TOPLEV= 0
##$USERP1= <user>
##$USERP2= <user>
##$USERP3= <user>
##$USERP4= <user>
##$USERP5= <user>
##$WDW= 1
##$XDIM= 8192
##$YMAX_p= 0
##$YMIN_p= 0
$$ End of Bruker specific parameters
$$ ---------------------------------
##NTUPLES= NMR FID
##VAR_NAME=  TIME,          FID/REAL,        FID/IMAG
##SYMBOL=    X,             R,               I
##VAR_TYPE=  INDEPENDENT,   DEPENDENT,       DEPENDENT
##VAR_FORM=  AFFN,          ASDF,            ASDF
##VAR_DIM=   8192,          8192,            8192
##UNITS=     SECONDS,       ARBITRARY UNITS, ARBITRARY UNITS
##FACTOR=    0.0002768,     1,               1
##FIRST=     0,             0,               0
##LAST=      2.2672688,     0,               0
##MIN=       0,             -346481,         0
##MAX=       2.2672688,     277221,          0
$$ Real data points
##PAGE= N=1
##DATA TABLE= (X++(R..R)), XYDATA
0@%%%%%%%%%kJ0j6J6k4L2l7M5n6P2q8J04j20J44j68J92k28K68l12L60m13M75n42
32b88O16o98P89q91J002j124J255j400J561j737J927k136K365k614K886l180L506
49A839l866M257m689N170n701O296o966P722q589R593j0767J2166j3870J5994
63H589j8726K2393k7606L5662m9894Q2514k94502j04911L75807q9195K3815N8253
75B2199O187M1782J56527j08606j18575J57820J14759k35012j06749J54020M9820
86A34172r0005M3684q073j53825m5006Q0206o7294q4209O1388J3759r5396N3383
98a57216J35804m506j8291J06767L6694o2134K2650N4813m0158o48O9667l3901
110A09541q7075M0655N4086p3341p0169J1540k4615n5215K946K201l7048J8354
$$ y = [0, 0, 0, 0, 0, 0, 0, 0, 0, 0, -2, 8, -8, 8, -16, 16, -21, 24, -32, 40, -48, 56, -64, 80, -88, 104, -124, 144, -168, 192, -221, 254, -288, 328, -370, 419, -472, 530, -594, 661, -739, 822, -915, 1012, -1124, 1241, -1373, 1513, -1667, 1839, -2027, 2230, -2459, 2711, -2990, 3306, -3660, 4062, -4527, 5066, -5701, 6465, -7405, 8589, -10137, 12256, -15350, 20312, -29582, 52932, -241570, -346481, 29326, -59869, -36054, 22199, 28386, 70168, 226695, 118089, -486, 157334, 272093, 37081, -69668, 84352, 134172, 44167, 87851, 79778, -74047, -119053, -38847, -106141, -190350, -128962, -115203, -210599, -157216, -21412, -25918, -44209, 62558, 99252, 37118, 59768, 114581, 74423, 73775, 143442, 109541, 22466, 63121, 117207, 43866, -26303, -14763, -39378, -94593, -91647, -89446, -126494, -108140]
122a08140N3281j8087k4667N3887M0346k1399K0101O0537N519r366M2816K2600
134A17428l2935j0206J1514l2370l8127j066j7090l7468L836J4506k9646j9140
146g0764K1871k202k9354R155K2583j2136L899M4727K5116L295L1879L3617l576
159G8110l850Q217j8971k7316j714j1567l4243l889J7683j4419k0496J0297r26
172b3084k6301o974Q706r723m326K1234J4575O397K5556K5495M503R636J4696
185F0390p715j4704M733j345k1009r135N416j0665j6696j337j734j1603o392j953
199c3749p402p47R186L619K972J4063J1278k53M765J5090P891L52M605N879j843
214C5706n418l113n114r068j1437j1051j0757n963o74J177K236O769M918p37J253
$$ y = [-108140, -54859, -72946, -97613, -43726, -3380, -24779, -4678, 55859, 61378, 52012, 94828, 117428, 84493, 74287, 85801, 53431, 15304, 14238, -2852, -40320, -36484, -21978, -51624, -70764, -48893, -51095, -80449, -71294, -48711, -60847, -56948, -12221, 12895, 16190, 48069, 81686, 78110, 74260, 82477, 63506, 36190, 34476, 22909, -11334, -15223, 2460, -11959, -32455, -22158, -23084, -49385, -56359, -47653, -57376, -61702, -40468, -25893, -19496, 6060, 31555, 36058, 45694, 60390, 52675, 37971, 42704, 41359, 20350, 11215, 16631, 5966, -10730, -12067, -13801, -25404, -31796, -33749, -41151, -41898, -32712, -29093, -26121, -12058, -780, -1033, 3732, 18822, 26713, 27065, 31670, 37549, 35706, 30288, 27175, 22061, 12993, 1556, -9495, -20252, -26215, -26889, -25712, -23476, -16707, -11789, -12526, -11273]
229a1273N815Q41n189P85P212L081M001J1888J1936L796n28l218q783r207r012
244B145j2548r575p65k05k600N970J2299M457o20L892M46p014l543K061l1J086
260d545O537N761N515Q041K938m013k634n170j3898j2157j786q16l841K170O811
275a1087N122K689L909K292P77L83k908j884L513M567R9J403L921r60m982j441
291E413N34k977n101l778k894k044k026k014R45K861m92m26N764P533M796K754
307H848L654L044M31j377r76p13k353o603o215j120Q2k009J12K567j064m780k861
324a1333j713j972k312j401K948P283Q321O491Q654R638J885m982l140k762o163
339I442o800l443k372j450k23l02J450J101k937n761k888q09l666j744M524O400
$$ y = [-11273, -5458, -4617, -9806, -9021, -1809, 1272, 5273, 17161, 29097, 32893, 32365, 29147, 20364, 11157, 2145, -10403, -19978, -20743, -20948, -23548, -17578, -5279, -822, -1442, 2450, 2896, -4118, -7661, -5600, -5631, -4545, 1992, 7753, 13268, 21309, 24247, 20234, 17600, 12430, -1468, -13625, -15411, -16227, -20068, -17898, -11087, -5965, -3276, 633, 2925, 3702, 4085, 1177, -707, 2806, 7373, 7472, 8875, 12796, 11836, 6854, 5413, 5947, 2970, -2131, -5909, -8803, -10847, -12873, -14887, -13942, -11081, -11573, -11999, -6235, 1298, 6094, 8848, 12502, 15546, 15977, 14600, 13624, 12911, 10558, 3955, -2260, -3380, -3298, -5307, -5195, -2628, -3692, -8472, -11333, -13046, -15018, -17330, -18731, -15783, -8500, -179, 6312, 14966, 24604, 26489, 21507, 18367, 15605, 9442, 2642, -801, -3173, -4623, -4846, -5148, -3698, -2597, -5534, -11295, -14183, -14992, -18658, -20402, -15878, -9478]
355i478L896O630Q992P662N011J329j614k899l452o343n693k394j710m841k557
370g461J098j199l469j465n26j998j674j98K663M997L937K671N445P758M075R79
386A5633L657L515o42l975k812l390m934o049o563m290k946l371k875J883K939
401a4220l68r5L650L011L28J233L763M579M137M008M095N930M495R8j693j048
417B1903n236q945p096n472o884o126j796J084J219O21J307K529L464P14j483
432a0197K491N168K497K606O345P503M189K239K439nl189n684p053o529n867p254
448a0301n838o83J054j966n84L044K058L65J313K723K608K683L366L775N121N022
464A3760K698K913L105j171l820k355k425o041p688n158l463l357l504j980R05
$$ y = [-9478, -5582, 1048, 10040, 17702, 22713, 24042, 22428, 19529, 16077, 9734, 4041, 1647, -63, -4904, -7461, -6363, -7562, -11031, -12496, -13022, -15020, -16694, -16892, -14229, -9232, -5295, -2624, 2821, 10579, 14654, 15633, 19290, 22805, 22163, 18188, 15376, 11986, 7052, 1003, -5560, -9850, -12796, -16167, -19042, -17159, -14220, -14588, -14683, -11033, -8022, -7694, -6461, -2698, 1881, 6018, 10026, 14121, 20051, 24546, 24644, 22951, 21903, 16667, 7722, 626, -4846, -11730, -17856, -19652, -18568, -17349, -16728, -15421, -12892, -9428, -8714, -10197, -7706, -2538, -41, 2565, 8910, 16413, 20602, 22841, 25280, 25275, 22086, 16402, 9349, 2820, -3047, -10301, -16139, -16822, -15768, -17734, -18318, -15274, -13216, -12851, -11538, -8815, -6207, -3524, -158, 3617, 8738, 13760, 16458, 19371, 22476, 21305, 17485, 15130, 12705, 6664, -1024, -6182, -9645, -13002, -16506, -18486, -17581]
479a7581K003R84K84M096N095K577R74L891L598J301J556K812L177K138m38j183
495A5284n32j626n251o667m072m764o204l945J50K64Q66K431M097L853K693K503
511i20L135L131M20o95J842L868J066m94J889K121j812m000l386l187m952n949
527g923n638k831l06k78P4M341N245K267J842M348K986R05M30J716J325J283O83
544A0469P45J506J6l174k714j536l518n774l663j976l344k978l48K024K202K492
560i571K656M225M047K912R50K285K755j54j498O37J352r19j661j077j342j756
576C841k882l464k411j670l548l226l96R48m5J136M826M152K876L300L553K441
592I431P60j98j100k84j062k473r40J143p04k924j200j9k722l696k797j159j041
$$ y = [-17581, -15578, -14594, -14310, -10214, -5119, -2542, -1568, 2323, 5921, 7222, 8778, 11590, 14767, 16905, 16467, 15284, 14752, 13126, 7875, 1208, -2864, -7628, -13832, -17777, -17627, -17363, -16497, -14066, -9969, -6116, -3423, -920, 2215, 5346, 5766, 5071, 6913, 10781, 11847, 11353, 13242, 15363, 13551, 9551, 6165, 2978, -1974, -7923, -13561, -16392, -16698, -16976, -16902, -12561, -7316, -5049, -3207, 1141, 4127, 5032, 5462, 7178, 8503, 9786, 10469, 11214, 12720, 12736, 9562, 6848, 5312, 1794, -3980, -7643, -9619, -12963, -15941, -16289, -14265, -12063, -9571, -6915, -2690, 1357, 4269, 5219, 7504, 10259, 10105, 8607, 9244, 10596, 9677, 8016, 6939, 5597, 3841, 959, -2505, -4916, -6586, -10134, -13360, -13756, -12808, -12853, -11717, -6891, -2739, 137, 3437, 6990, 9431, 10191, 9993, 8893, 8609, 7547, 5074, 4134, 5277, 4573, 1649, 449, 430, -2292, -5988, -8785, -9944, -10985]
609a0985j358J28K409M643L106K210L844M355Q47n07L17N5k017k276r04o68j232
626A967j099j069l76n85k421k552m07q00j981j029K683J776J275K800L955K928
642E065K348J071M77J339j041k932j871l52j890l454j091K4j108j366m04k93k00
659e678p22j145O61J812R47J50L253L309J752J354K955J970l71j372j011j660
675F204k557l131k750j119q84k065q30J311P84r18o18J341Q23l89M73J903K598
692A76J865J429K439L071J489q84o2k57k861l654k458j824k178k261j091K12M54
709f395L0o7J222J390m63k82K163K024N83J002K931K592P63L75J128J61j137k461
727E559k860j430k336l362k100N61p82j209L43K036J404j94R97J670J456J028
$$ y = [-10985, -12343, -12215, -9806, -5163, -2057, 153, 3997, 8352, 9199, 8692, 9009, 9064, 7047, 4771, 3867, 3199, 1967, 868, -201, -577, -1162, -3583, -6135, -6542, -7342, -9323, -10352, -7669, -5893, -4618, -1818, 2137, 5065, 7413, 8484, 8961, 10300, 9259, 6327, 4456, 4104, 2214, -1240, -2331, -2307, -3415, -4781, -5185, -5478, -5678, -6400, -7545, -6884, -5072, -4125, -3975, -722, 2587, 4339, 5693, 8648, 10618, 10247, 8875, 7864, 6204, 3647, 516, -2234, -3353, -4237, -6302, -7132, -5821, -5037, -5955, -6573, -5232, -4409, -4798, -4325, -2422, 176, 2041, 3470, 5909, 8980, 10469, 9585, 9523, 9266, 6405, 2751, 293, -1531, -3709, -5970, -7061, -6849, -6395, -6365, -6432, -5210, -3820, -4283, -4565, -2402, -378, 205, 1207, 4138, 6730, 7493, 7868, 8996, 9157, 8020, 5559, 2699, 1269, -1067, -4429, -6529, -5968, -6750, -7959, -7616, -5580, -4176, -4370, -3373, -1703, -247, 781]
743G81N04J593K042O85K13P71J198o52j503r59j088k893k591k503j111j005j629
760h147l10J119J909O13R38K691K008L06J51K021J299k6M00P23Q12J34r78r33
778D730mj519l631k309j242j819k284j158Q66Q23M51J840K538K248J434J031J418
795C413J531j47m80J121J416o89r77Q07j31j860k060k163j703k228k406j849o0
812h465P26n81K32K897K252J061J440K870J696K26N46Q69O82k50m46l26L45r90
830D784j848j573m93k264k747j356n66j112j034O7J457J625J062J189K819K494
846B504Q18O60J361J572q28p50j93L01r99j584q89m83j352j843j541l85j033k083
864f747q69R34P38M7J472L042J758J503J317J682J081M54j133k36j63r13k098
$$ y = [781, 1285, 2878, 4920, 5605, 5818, 6589, 7787, 7135, 5632, 4673, 3585, 692, -1899, -4402, -5513, -6518, -8147, -8457, -7338, -5429, -4816, -3878, -1187, 821, 1127, 1278, 3299, 4598, 4572, 4972, 5695, 6507, 6641, 5663, 4730, 4726, 3207, -424, -2733, -3975, -5794, -8078, -9236, -8370, -7547, -7096, -5256, -2718, -470, 964, 1995, 3413, 4944, 4797, 4317, 5438, 6854, 6165, 5188, 5995, 5864, 4004, 1944, -219, -1922, -4150, -6556, -8405, -8465, -7739, -8320, -8088, -5191, -2939, -1878, -438, 2432, 4128, 4354, 4900, 5769, 6451, 6201, 5755, 5429, 5774, 4784, 2936, 1363, 870, -1394, -4141, -5497, -6063, -7175, -8209, -8142, -6685, -5060, -3998, -2809, 10, 2504, 3322, 3982, 5343, 6915, 6087, 5337, 5144, 5445, 4446, 2862, 1973, 1490, 138, -1705, -3246, -3631, -4664, -6747, -7616, -6682, -5944, -5897, -4425, -1383, 375, 1878, 3195, 4877, 5958, 6412, 5279, 5043, 4880, 3967, 1869]
881A869m59K72j458j682q39K2j239j494r94J07J96oL85K512K265J488J196K367
899D508J846k01p58K45N9j527j488n67r70r60j364j062j94m73j800q93N03J15
917d981p32M45J613J562J243J468K248J561R25KN80R64q66k154n92p06j733k060
935a213q09k16j064j245l53L86k16m18j16J300J248K03J081K056K038R04Q11J576
953E953Q73p63q56o77n63j821j813j393n51r20j589k63N65k18o51k7J093M58N2
972c111R63J505J326J007R05J567J790j14r31p1L56j738k263j033o63j753j092
989c350l01j00q7l41J06Q73P39m8R1J510J374m6R52J640J058L23J63J45q8q28
1009C785j604j504l92j404j771r11M17l96q24N13R43Q06k81O74J339J157J60L98
$$ y = [1869, 1410, 1682, 224, -1458, -2297, -2275, -3514, -5008, -6002, -5895, -5699, -5705, -5320, -2808, -543, 945, 2141, 4508, 6354, 6153, 5395, 5640, 5699, 4172, 2684, 2117, 1147, 187, -1177, -2239, -2433, -2906, -4706, -5599, -5096, -4981, -5713, -5268, -3655, -2093, -850, 618, 2866, 4427, 5352, 5354, 5934, 6898, 6032, 3878, 3286, 2580, 847, -1213, -2022, -2238, -3302, -4547, -4900, -4514, -4730, -5148, -5264, -3964, -2716, -2513, -1432, 624, 2662, 3566, 4377, 5953, 6826, 6063, 5207, 4530, 3967, 2146, 333, -1060, -1611, -2531, -4120, -4383, -3818, -4036, -4687, -4714, -3621, -3163, -3111, -2148, -643, 683, 1690, 2595, 4162, 5952, 5838, 4907, 4836, 5192, 3454, 1191, 158, -505, -2258, -3350, -3651, -3751, -3838, -4179, -4073, -3200, -2461, -2509, -2418, -908, 466, 420, 1372, 3012, 4070, 4393, 4556, 4701, 4613, 3785, 2181, 677, 285, -1119, -2890, -3801, -3384, -3780, -4604, -4091, -3148, -2342, -2623, -1949, -610, 547, 707, 1105]
1027A105J201J553R6j20N92O45r44j628m61o07j557k175p73m67o88o19j43J208
1045c782N48j8Q40J531J107J67J003Q45Q98m1L41Q40N36l60r83o80J04j584j949
1064f37j117p23r25j849J22M90K81N83L20J823J146M60M83J131J162k18J19R87
1082C638O84n87k99K00k25j207j125j122j043j185j741m30K88l9J3K73J596J033
1100a278N86N25J465O32L23m5N76N97j99l43L1K31n46j122p80k68j450j479o15
1119c159N0q74k85J85J142Q93M00Q57J489J326J76o8R25M80p26n47J29K39j080
1138A552n67m01k40q13j609m33j71k38r76K56K85P96K47J174J307J121M74M43
1156B207J172K93m08m12j07L6r64j118j5J24j264j119l29k57r88l30n34N31K39
$$ y = [1105, 2306, 3859, 3955, 3835, 4427, 5072, 4128, 2500, 2039, 1432, -125, -2300, -3073, -3540, -4228, -4847, -4990, -3782, -3234, -3252, -2412, -881, 226, 393, 1396, 2241, 3139, 3098, 3439, 4279, 4815, 4455, 3472, 2792, 2896, 1312, -637, -1754, -2477, -3402, -5251, -5129, -4639, -4358, -3775, -3455, -1632, -486, -26, 457, 1588, 2750, 2532, 2651, 3638, 4322, 3735, 3436, 3636, 3411, 2204, 1079, -43, -1086, -2271, -4012, -4442, -4154, -4193, -4180, -3907, -2311, -1278, -692, -167, 1298, 1930, 2253, 2208, 2784, 3381, 3182, 2839, 2870, 3101, 2555, 1433, 653, 385, -1065, -2544, -3159, -3109, -3983, -4268, -4083, -2941, -2048, -1648, -791, 698, 2024, 2200, 2132, 3057, 3537, 2811, 2264, 2393, 2632, 1552, 985, 584, 344, -469, -2078, -2511, -2682, -2920, -3896, -3640, -3355, -2559, -2312, -1138, 169, 1290, 1764, 2207, 3379, 3672, 3264, 2852, 2745, 2781, 1817, 699, 684, 808, -456, -1575, -1904, -2161, -3149, -3479, -4013, -3482, -3243]
1175c243k6Q07J729J192N81Q81R32J222o10k2l1m3r05r34l04k61r41j003o94J70
1195a503n65j026n62N01k19j05M85J303P51P39Q29J451R38J07L22J03L89r06j184
1214A848K41o33r01j130m94J11r19m71l83K90j7p15K33J092L21N1P62J591O43
1233A520M78O53O08J34n08l67k34o24n89j144n44j83n89p51j16K41M2o65K24L39
1253b075L30L67O25P02J015M46K67J156P22o23l25Rn34p67j338m51j14j052n45
1272b185l75L32K97m80K93O90M89l62L65J098N86J48M09J157N21Q9j28j18j02
1291B724q31j356m41m51j237j017J89p2N4m17K26R55J80j12N29R35L69J96M84
1310I07J133P25k31kO11pn41o72m86q69j115j203l29J9n73m70J31R40N2J30M36
$$ y = [-3243, -3269, -2462, -733, 459, 1040, 1921, 2853, 4075, 3465, 3443, 3412, 3369, 2464, 1530, 1226, 965, 24, -979, -1673, -1503, -2068, -3094, -3656, -3155, -3374, -3479, -2994, -1691, -940, -201, 628, 2079, 3017, 3124, 3446, 3549, 3938, 3032, 1848, 2089, 1456, 555, -575, -1069, -958, -1877, -2348, -2731, -2441, -2458, -3173, -2940, -1848, -1527, -1476, -714, 877, 1520, 1998, 2651, 3259, 3393, 2885, 2518, 2284, 1660, 1071, -73, -617, -800, -1389, -2140, -2256, -2015, -1973, -2638, -2414, -2075, -1745, -1378, -753, -51, 964, 1410, 1677, 2833, 3555, 2932, 2607, 2616, 2082, 1315, -23, -474, -588, -1640, -2185, -2560, -2228, -1931, -2411, -2118, -1428, -939, -1301, -936, 162, 748, 896, 1305, 2462, 2983, 3072, 2944, 2826, 2724, 1893, 537, 96, -355, -1592, -2609, -2420, -2492, -2438, -2855, -2629, -1674, -1494, -1606, -1077, -142, 227, 423, 907, 2040, 2765, 2534, 2532, 3143, 3136, 2595, 1923, 1437, 568, -547, -1750, -2079, -2060, -2633, -3103, -2972, -2032, -1980, -1850, -1414]
1331a414R96K60j56O97P38N39J66J10P08J09j2o68k79k51r54j059o37k87j029
1350b423n47K51L61L61J04J20P63R94j46K20Q18K28N5LO62L40O8m29K62l00n73
1371A192r27o30j50p46j056j22N72k11m86J061P20N12pO21O14M09j60J5M29K27
1391A877k92k95N05O3q47o49r4m73p65j026j4J16m94k84M39R55L42M49P09Q97
1411A119L94j48k4N25O2l14k46L97n2p40k70l42k19o60r05l61k46k11o73M19N48
1432a947M88K07O68J153M06K69M04K68K38j96m79K45j05l40n18q1k79n45o86k82
1452a112n4q10m25K9M15L6o2O13J026P09Q6P11P42K92l72j27J39K37r73l69j46
1473E85j9m78n29j01K70q40q25K68J58k68m52L87R66M59M31M15O00O60q0j97O98
$$ y = [-1414, -418, -158, -314, 383, 1121, 1660, 1826, 1936, 2644, 2753, 2741, 2073, 1794, 1543, 589, -470, -1107, -1394, -2423, -2970, -2719, -2358, -1997, -1893, -1773, -1010, -16, -162, 58, 876, 1104, 1159, 1162, 1824, 2164, 2232, 1803, 2065, 1765, 1192, 265, -365, -515, -1261, -2317, -2439, -1867, -2078, -2564, -1503, -783, -271, -278, 343, 957, 1366, 1206, 1221, 1650, 1877, 1585, 1290, 1795, 1858, 1011, 362, 268, -205, -970, -1996, -2010, -1894, -2388, -2672, -2233, -1278, -936, -487, 222, 1119, 1513, 1365, 1341, 1866, 1928, 1614, 1368, 1765, 1713, 973, 703, 361, 142, -518, -1423, -1784, -2030, -2241, -2914, -2495, -1947, -1459, -1252, -584, 569, 975, 1244, 1648, 1916, 2154, 1958, 1479, 1724, 1619, 1279, 761, 680, 401, -144, -830, -1112, -1166, -1976, -2401, -2372, -1957, -1921, -1983, -1370, -344, 365, 451, 1162, 1904, 2196, 1824, 1697, 1836, 2073, 1100, 731, 585, 566, 88, -441, -542, -272, -1112, -1937, -1669, -1511, -1779, -2231, -1844, -878, -419, 12, 427, 1027, 1687, 1607, 1410, 2108]
1494B108l25o19o07P4j04n92j49j61J18n18l51j46K96j71m96J81P22JJ17Q69P61
1515A008K98q6N12K62o1l54p67K2l43n92m84j57K0j12m79J43L08k78l16L33M95
1536f28o3J23L41P33L88J95K85N16K45n24k51m2l93q45m44k51J74n95n14R7M93
1557i60k11m84M15N59l01L6M74N89K71K16N36O48K89j52J67k29j76o88o02m78
1577h1k69r34m7j39L18k37l28L63N28j40ML58M71nJ66L22O45K82oK14K31J83o33
1600A266m00k40m55l36p11l15L29n78j41M44J55J68J24J80N20J15k71K83M22L12
1620H71J49l31P49K0k81q5k61lp87o29j56l61k81j11K04J26L40M9K43P05L7p5
1642A32J00M76P4k72K44K03J00k09N1J72m10j83q74L2m10n24l87L41K3j14K85
$$ y = [2108, 1783, 1164, 557, 631, 527, -65, -214, -375, -257, -775, -1126, -1272, -976, -1147, -1643, -1462, -740, -739, -622, 247, 1008, 1306, 1220, 1732, 1994, 1933, 1579, 812, 834, 491, -101, -585, -742, -722, -834, -1313, -1170, -862, -1140, -1456, -1123, -628, -691, -568, -227, 506, 894, 1089, 1374, 1890, 2135, 1611, 1360, 1318, 925, 80, -364, -615, -441, -1036, -1550, -1453, -960, -1171, -1655, -1240, -681, -982, -946, -472, 117, 388, 604, 1140, 1788, 2077, 1925, 2092, 1863, 1687, 999, 397, -81, -350, -1284, -1331, -1470, -1152, -1389, -1717, -1354, -826, -966, -962, -604, -133, -138, 28, 350, 995, 1277, 1271, 1485, 1716, 1899, 1266, 866, 626, 171, -165, -876, -1191, -862, -1440, -1581, -1137, -982, -814, -690, -510, 10, 125, -146, 137, 559, 871, 1020, 689, 1438, 1458, 1177, 1092, 831, 828, 41, -588, -744, -1105, -1386, -1497, -1293, -1167, -827, -778, -535, 170, 207, 132, 232, 708, 782, 510, 754, 957, 1057, 848, 899, 1071, 661, 478, -396, -364, -774, -1298, -1685, -1344, -1321, -1435, -1150]
1663a150O28N30O3J65K08M30j03K30j84L03Q0n22O6K16J28p84k31j64j45n16n70
1684a322n10N23k92l7L82M50L85P8O15N76K19k63L75K99n0o19j32M45l18j67k61
1705C76K36o77l53m30j04r1n03l44M41L66J9J61M40P78J45M77L7K96L2j82l27
1726G93L42n48j45k95Q2K02n93k94L4J9n69k95O6J28J67l49Q56L43L14k49R09
1747I18L05m4l52l9o7K4m05j82P5j98j85r9LK46m06o74L66j56j71Q8J83N65L56
1770A51q8K24J030j8l43J08j12P6o61j80j10q1o29J67J01k18n40J95j47K79J10
1791f86k10L15K12O2l5O10O74J16J28M0K08k89j23k15o42K82q89k56L14r1m24
1812h99j60L12q4m4j87L56M05r6p9M04M23K32K90J28M47J07n06l1q6m73j16n23
$$ y = [-1150, -522, 8, 71, 236, 444, 874, 771, 1001, 817, 1120, 1200, 678, 744, 960, 1088, 304, 73, -91, -236, -752, -1322, -1832, -1309, -1601, -1638, -1256, -806, -421, -343, 272, 848, 1067, 804, 1179, 1478, 1428, 809, 677, 1122, 804, 637, 376, 612, -65, -418, -848, -952, -1043, -1546, -1890, -1449, -1083, -1064, -903, -463, 315, 460, 937, 974, 1270, 1302, 1120, 793, 1135, 587, 442, 147, 229, 431, -162, -456, -422, -403, -972, -1267, -1201, -1073, -906, -1255, -399, -56, 258, 9, 918, 1223, 1179, 827, 788, 721, 745, 340, 158, 233, 35, -150, -249, -246, 0, -406, -1080, -714, -870, -1041, -953, -770, -205, 151, 63, 287, 1317, 1299, 956, 1064, 952, 1028, 367, 187, 77, -4, -633, -466, -365, -583, -1123, -928, -1075, -796, -686, -896, -581, -369, -307, -342, 268, 942, 1058, 1186, 1226, 1434, 1145, 1022, 807, 165, 447, -442, -698, -384, -475, -899, -1059, -747, -831, -875, -1062, -706, -301, -397, -476, -72, 351, 583, 873, 1001, 1448, 1555, 1049, 1018, 932, 459, 343, -180]
1834a80j79m25J9j38j3K76q6m29M43L37j91o1K72M57k41L51r3Q80K67m16J22J12
1856A084M5m23o98J81j54n88n41L34K7k35k5O8O69k7K9m0M57kj78L51L17o9J24
1879G06l7K3K56l07k42k95k24m51k09j02J89k04J01M32l8M5K40J47J70j30j65
1900i5M37L38j67lK35r0M3n37J78J22l25m47l09j00J26m42k90M31L14k06J06O15
1922f6K96O1J2J38K59p1l18j2M96j62j27k59L34l22j78k03k13n2n86l75M26L64
1944e58n42K19O21j83N76j28L29L55O9j57p1J45k5l6k72L54n4o57K32j55l11j99
1966d48l41m9LJ5j74J34M97R3k1M17M03N6n3J93j4R7n14L52J1l56N7l65K1K18
1990B32m10n11M73Pn09o9J45Q4j04K28J95L46L79l5J10Q1j08j36k68L31k79l32
$$ y = [-180, -359, -784, -765, -903, -916, -640, -726, -1155, -712, -375, -566, -627, -355, 102, -139, 212, 119, 999, 1266, 850, 972, 1084, 1129, 706, 8, 189, 35, -553, -1094, -760, -733, -968, -993, -925, -256, -283, -254, -294, 163, 161, -17, 334, 651, 582, 706, 669, 692, 948, 641, 399, 104, -120, -571, -780, -882, -693, -897, -796, -364, -402, -357, -117, 30, 200, 70, -95, 342, 680, 513, 510, 745, 655, 698, 161, 339, 461, 136, -311, -620, -720, -594, -1036, -1326, -895, -581, -787, -681, -66, 230, 291, 303, 441, 700, 629, 311, 299, 795, 633, 506, 247, 581, 259, 81, -122, -335, -387, -973, -1348, -922, -558, -1100, -881, -260, -443, 133, 5, 334, 689, 758, 601, 530, 675, 650, 614, 342, 696, 642, -15, 217, 62, -249, -448, -789, -838, -835, -820, -994, -860, -363, -270, -291, 126, 529, 585, 532, 725, 711, 808, 294, 646, 657, 301, 358, -7, 14, 232, -178, -689, -216, -209, -718, -787, -642, -558, -662, -434, -239, 107, 486, 451, 561, 642, 534, 398, 130, 461, 182, -150]
2012a50j79M97j35j44p5%l9m16m6JK27L1J62Q3L46J57J69J69M5J01l06J00J74
2035G72m14n33K41j25j45k50j71M07M7l97k02J82j56J57J4K66M19j83J2N72K11
2056G24K08k97J50k15l78J35j7j64l73k28K7J2J03j32l55L08J53k32k03M64J81
2077a29j3J27M31K20k45L48j56QL31m83J4j65k09j35l46J26j52K8r2L06p0m51
2099g07J55J42K31j94J66r6O10j0j24J21L33K48o06J93N0j60n62N5j46K24j47
2120b24m72L89r5K24j36o2J19Q0r7K21L46l0j64L63J53j21p0J06l22K49j43n63
2142b49m6J39q9m30M97k4q8Q6N2J76j13n6Q2L02MJ22k24M32q2O5k81K96J3k74
2166C10k11j97k34j62j57J45J99l68l1K98L42r9k48K77M87l10j09K48O59k76m1
$$ y = [-150, -329, 168, 33, -111, -186, -186, -225, -641, -687, -686, -459, -428, -266, -183, 163, 320, 489, 658, 703, 804, 498, 598, 772, 358, -175, 66, -59, -204, -454, -625, -218, -171, -568, -770, -588, -744, -587, -573, -307, 112, -71, -59, 513, 724, 932, 635, 785, 570, 192, 327, 310, 146, -227, -455, -428, -416, -313, -445, -800, -492, -339, -571, -774, -310, -129, -142, -15, 416, 636, 391, 739, 583, 591, 922, 439, 453, 288, 79, -56, -402, -276, -428, -400, -492, -186, -256, -707, -552, -410, -179, -373, -207, -303, 307, 297, 173, 294, 627, 875, 269, 462, 512, 352, -210, -155, -301, -77, -224, -696, -307, -402, -178, -314, -376, -257, -177, -274, -53, 293, 263, 99, 462, 615, 494, 424, 530, 208, 457, 314, -249, -295, -156, -245, -675, -178, -202, -290, -204, -152, 24, -89, -145, -63, 239, 243, 365, 141, 573, 491, 556, 275, 571, 584, 310, 99, -98, -332, -494, -651, -506, -307, -675, -706, -408, -66, -165, -413, -136, 351, 41, -68, 180, 839, 563, 522]
2187E22k10J67j82m8k17L32k62k57n39RR8k90L22J5P2Q1J03K1L55J73l13M20L38
2210G10l77j53J91P7R7k55n2p1K79l74k43l3J84l63k91K43k32N1J57K77k3J50
2232e1r2J86J66r4J81R6j24J50j32K1l8J34m71J18q0J89n06n7J18q3J48l57J84
2255c94K92n2L4K47J4J75J5o3j04k0L00j38p4m04K1K26O2j05l9k77M0j2k27J04
2279c79l5K12O8L8K89J95Q9j70n9L13k42o2J6J3k96J19k93K88J7k78k08j05L73
2302i7k71k09K52O3n2J7K76K22j72J57M36Lj29k2j2M2j24l08o1J09j69j45j03
2325b97l0j38K8r1QJ36j24L29R0R0J08j64M2L81Q5j12J24R3k13l21Q9P3M2m68
2349b40l05P59l38j39j7J64J1O5q1k51J54R6q0J72L16J92l99K18J85j34j46j9
$$ y = [522, 312, 479, 297, 249, 32, 364, 102, -155, -694, -685, -587, -877, -555, -540, -468, -387, -284, -263, 92, 265, -48, 372, 710, 333, 180, 371, 448, 545, 290, 238, 167, 446, 72, -171, -204, -20, -383, -674, -431, -663, -612, -455, -178, -201, -51, -143, 43, 209, 115, 296, 392, 268, 418, 286, 307, 269, 403, -68, 50, -30, 159, -347, -404, -286, -369, -221, -578, -394, -102, -154, -120, 127, 141, 316, 331, 268, 164, 144, 444, 306, 232, -172, -151, 75, 137, 32, -7, -284, -244, -256, -483, -379, -414, -202, -134, -96, 193, 388, 477, 307, 248, 561, 319, 257, 273, 286, -10, 109, -184, 104, 121, -157, -365, -470, -97, -368, -577, -325, -262, -314, -297, -21, 201, 29, 186, 622, 625, 496, 474, 462, 504, 380, 72, 11, 120, -49, -194, -297, -327, -465, -437, -528, -520, -384, -508, -179, -89, 1, 109, -55, -13, 368, 453, 341, 465, 558, 345, 24, 113, 186, 228, -240, -545, 214, -124, -263, -280, -116, -105, -40, -121, -372, -218, -122, -202, -30, 286, 478, 79, 297, 482, 348, 202, 183]
2371A83j69Pj14n5K06l40J82j75K61j71O1k81N02k45K15k71K06R7PJ67m3J21L7
2394C88k39j0k28K18j71l10L35m62M04l36L09j5l33L80N5RQ6j21J27L01l71K94
2416C10M9K53j88k31j19L81l68N8k62n7k47P0mK20J0n57L21J26J82j37L03J9J29
2439B61K3k04J5L57k07j71M00L4j12l67r7K43j95k56r6P5j3j2q4K82K60l68j31
2462c63K41N42j79k60J55K45n7j39N7J58l61k2J28K4k22J44k85Lo5m4j98j61N46
2485a13k58J14RJ39J95l32N28Lj70L28k58L42l32P3n6J32j57j66P9q1J07o08K65
2508b17L0R9n7j1K40Q2k83K3L86k38p8J49J14k83J03j30Q3j35J99j89J26q6nl02
2532c80K98j63K82k77K30j22R8J78j49M00j78N3J8m6J61j79m03J38n2R9k11O9
$$ y = [183, 14, 21, -93, -148, 58, -282, -100, -275, -14, -185, -124, -405, 97, -148, 67, -204, 2, 99, 106, 273, 230, 351, 388, 149, 139, -89, 129, -42, -352, -17, -479, -75, -411, -102, -117, -450, -70, -15, -6, 80, -41, 86, 387, 16, 310, 359, 612, 424, 193, 74, 455, 87, 145, -117, -174, -421, -351, -355, -135, -125, -682, -361, -235, -53, -190, 113, 132, 261, 284, 80, 95, 452, 245, 74, 474, 508, 396, 29, -68, 175, -20, -276, -372, -297, -310, -322, -406, -124, 136, -232, -363, -122, 420, 241, -19, 136, 381, 324, 185, 242, 400, 39, 17, 145, 169, -53, 91, -194, -191, -256, -300, -498, -659, -113, -371, -257, -248, -109, 86, -246, 282, 285, 115, 443, 185, 527, 195, 268, 212, 344, 187, 21, 100, 19, 126, -482, -217, -187, -88, -145, -156, 84, 166, -117, -94, 292, 54, -24, 125, 239, -44, 59, -71, 12, -123, 76, -113, 13, -73, -78, -380, -82, -245, 37, -240, -10, -132, -34, 144, -5, 395, 217, 270, 288, 242, 403, 224, -179, -41, -93, 6, -205, -136]
2554a36K09L5o75K02K04j40J6j15K41Q3nJ57O2M43m80J95N7p2l3K2L6j15j91r0
2578i0j56L48k55k15J01K31n1j97k25M64m1j90O0P8M43l50n9J52K40q2p9K73l33
2601F7m7l0l6J36l26N0j6J64l23L22q7O4j8J04N0J6m6pj55M33l50J83j2K71j27
2626B80j62r7k03K24J71k94j82K86m8L0j88L07j6j25j43K47k10LJ98K04r5P9l13
2649d7R6R3r0k91L15l1l90K81P2r8Q3k15J92L6J0k15L22k70L51k55K53k11O7K07
2673B65J0r9q0O7r8p6K96k28J8j96Mj53Q0m6K79o2k98K97o1p2J82O8K18J03k34
2698A84JNJ41j22J07j14J00l66j1L4N9k08P2o8K13r3j61J8L2r4L44j83R0N16m46
2723E0j07j03O14l68r9P6J91p7m36K96K08k76R6k15J61o7r2j67K34j9j63Q4J80
$$ y = [-136, 73, 108, -567, -365, -161, -301, -285, -400, -159, -76, -81, 76, 138, 581, 101, 296, 353, 281, 248, 270, 306, 191, 0, -90, -246, 102, -153, -368, -267, -36, -87, -284, -509, -45, -86, -276, -216, -138, 305, -45, -104, 48, 288, 206, 127, 400, 67, 20, -10, -46, 90, -236, -186, -202, -38, -361, -39, -126, -62, -80, 24, 74, 90, 44, 37, -118, 315, -35, 148, 136, 407, 280, 118, 21, -182, 42, 213, -81, -263, 23, -25, 5, -183, 124, 108, -17, -160, 87, -123, -120, 78, 282, 187, 266, -47, 49, 142, 52, -239, 76, 45, -345, -64, 8, -90, -7, -222, -30, 6, 16, -199, 123, -147, 204, -51, 202, -9, 58, 265, 275, 176, 96, 163, 65, -11, 285, 57, 75, -121, -117, -270, -190, -236, 43, -19, -317, -20, -81, -153, 29, 97, 315, 418, 184, 185, 190, 331, 209, 316, 202, 302, -64, -75, -41, 18, -190, -118, -186, 27, -66, -227, -209, -177, -271, 73, -110, -20, 496, 50, -57, -160, 454, 86, -13, 63, 254, 177, -259, 37, 245, -31, 65, -150, 11, -56, -148, -315, -81, -100, -263, -179, 1]
2746AM8O0j52L20k36o8k7J27j73J99J33k99N06m40J39j57n0j69L73l22K98m44
2768c33J68PO4Q3qK04j52K18l86k7mJ10N5j67J25J67k51J53j78J20N6p6o4K02
2792H6q8j15J60J88j36M5k77K67J15j87m5j8K48r9o0j24j0j09J02j04K78q8l60
2815c31K88l40K03J61k26l9K50k53K05L94l29J11K28j34j49J70k02R0M3j53P4
2836F1q5j00J92R3k77K1Mj94J62J50j02j8J46Kn4k4J39K30l29K62m24Q7k0M16
2860C38m17OL66l04Q8k21J08N1P1k64k3q6J57kJ78N2m91M71m7J69k16j28J98J9
2884G3n2o0j12L60k84j42K8L18j66j19jJ33K09l17K52J76k98LOj01L41l40Q9p8
2908h2R4J3o3p5L37k29l09J67K55n8j87J40Q5j18P7j05pJ86J10j38J29j00J2J4
$$ y = [1, 49, 109, -43, 277, 41, -27, -54, 73, -100, 99, 232, -67, 439, -1, 138, -19, -69, -238, 135, -187, 111, -333, -165, -158, -94, -11, -19, 185, 33, 251, -135, -162, -166, -56, -1, -168, -43, 124, -127, 26, -152, -32, 24, -52, -116, 86, -2, -117, 43, 231, 95, 140, -137, 130, 245, 58, 13, -5, 243, 144, 84, -40, -50, -159, -57, -161, 117, 29, -331, -43, -383, -180, -19, -245, -284, -34, -287, -82, 312, -17, 94, 322, 188, 39, 209, 7, 97, 140, -13, 61, -24, -124, 68, 161, -116, -95, -91, -285, -123, 27, -75, -93, 53, 55, 1, -23, 116, 346, 17, 279, -145, -58, -78, 338, -79, -73, 293, -11, 77, -144, -36, 15, 86, -178, -201, -287, -130, -132, 46, 98, -393, 78, 31, 200, -16, -144, 54, 73, 21, -39, -151, 209, -75, -217, -189, 129, -37, -156, -157, -24, 185, -132, 120, 296, -2, 1, 7, -94, 247, -93, -4, -82, 12, 25, -38, -113, 224, -5, -314, -147, 108, 50, -137, 3, 88, -30, 47, -58, -65, 121, 231, 93, 222, 122, 134, 148]
2932A48j42J07J05l04J54j46J05j38r2N4Q7m8k09K41k19L14k22K44l0J19m3k60
2954a75M14k35J16j2K72l46ml3k1l2k97M15m38K94J28o0K3P1k01J07j40J15K29
2977A90n61N12Or3J32M3l19M6J19j23n1kJ99j94K73r0j55j73K92j08m8j43K17
3000c1j14j34J42OK27J67k38J48K5j10kM0j38J7j87K06l2J23o2j7m6p8j9P1p5
3025a11K28j83K03k10n9RRK20pk48J13K63pk07j10L3J10o4k18K07k33J54J75k4
3049D3K8K3j71J36%p3r1LK1J87k44R4L56j73j65j05J43K74j4l43L2M4p1k95L01
3074f0N4j46j13k3M42L2mM6j81J23R1j78J62p5j84L04m1l52R5J7j75J89K02l09
3098h4j97J00k1J22j39R5K03j57L66o2p0k28R0n0j21K21j12K9j14M21m98K30J61
$$ y = [148, 6, 113, 218, -86, 68, -78, 27, -111, -203, -149, -62, -110, -319, -78, -297, 17, -205, 39, 9, 128, 85, -175, 239, 4, 120, 108, 380, 34, 30, -3, -24, -56, -353, 62, -376, -82, 46, -14, 9, 80, -121, -14, -154, -39, 190, -371, 141, 147, 54, 186, 229, -90, -44, 75, -48, -99, -101, 98, -96, 177, 87, -68, -241, 51, -57, -105, -248, -31, -145, -279, -137, -131, 96, 263, 25, 173, 198, 88, 86, 126, -12, 5, -182, 24, -8, 115, 53, 36, -10, -88, -107, -36, -111, 117, -66, 137, -73, -132, -123, -114, 106, 99, -149, -36, 227, 220, 13, -97, -64, 46, -18, -236, -29, -262, -108, 67, 43, 71, 94, -77, 59, 59, -14, -105, -102, -81, 106, -138, -44, 312, 139, -26, -131, 12, 286, 272, -71, -39, 5, -66, -361, -60, -6, -152, -265, -288, 154, 186, 182, 228, 47, 170, 261, 83, 245, 170, -14, 290, 249, -103, -8, 9, -166, 23, 225, -84, -281, -181, -202, -80, -219, -124, 79, -78, 288, 226, 156, -72, 18, -32, -153, 68, -44, -15, -129, 292, -206, 24, 185]
3121A85q2PJ6m6m2M1j69J27k98K43l11L20m9K6P8J77R6k78k33L7L52k18K03l00
3145a18J48m6k08J25K56r6j75K01p5r7K7m9j44J79K2o0K84j62o7LJ02Q4n3j00
3169a9p3R1j41J39l7R5J10o2k10L49n0j17j8J22K5k07Q3j86J52j6J7J23M5j62
3193E3j88J18K73k55k83K05n9j49L80k30M4K48k8k69J90j4j3k05J12RQ1J3o5K00
3217A68j26l7r4J63r4l5O9R5k60l8r4L09J07p0j68J35r0j74l3L53r9J48k85M37
3241B87L5l69M7J13n6m8L1n6K60l34J43J0Jk07K84k10J19k87K80j77J36K5l17
3264b90K05j4L14l19k0J47O1k53L23o2J97m85O2J44K13k18R8k02K46j54j5j32
3286a54J99L41l43p8nK86l77K27N3k67n8J91l6j12N2l9N0Q6k03J39N7J2N7L1O0
$$ y = [185, 103, 110, 126, 80, 38, 79, -90, 37, -261, -18, -329, -9, -58, -32, 46, 223, 319, 41, -192, -155, 197, -21, 182, -118, 30, -16, -224, -99, 157, 61, -114, 87, 12, -85, -58, -107, -251, -72, -50, -110, 174, 12, -55, -52, 50, 134, 81, -19, -92, -1, -142, -3, -40, 55, 165, 103, -107, 242, 192, 75, 57, 179, 204, -3, 80, -106, 46, 30, 47, 170, 215, 53, -135, -17, 256, 1, -282, -77, -136, -285, 95, -135, -91, 157, 129, -140, 50, 36, 23, -182, -70, -61, 20, 33, -32, 168, 42, 5, -89, 74, -20, -55, 14, 109, -151, -189, -283, 26, 133, 63, -105, 30, -60, -234, -267, 86, -13, 135, -150, 287, 322, -47, 0, 113, 57, 9, 40, -16, 244, -90, 53, 63, 64, -143, 141, -69, 50, -237, 43, -134, 2, 27, -290, -85, -99, 215, -104, -124, 23, 84, -169, 154, 92, 289, -196, -134, 10, 223, 5, 103, -99, 147, -7, -22, -154, 45, 386, 43, -35, -40, 246, -131, 96, 149, -118, -176, 15, -21, -133, -81, -120, -70, 16, -187, -48, 9, 21, 78, 109, 169]
3311A69j27p2J95k09L46j31q0j82L17q5l4k6j24O1q3Q0j61N3p1k8K61q0j59l7
3335b07J32K12lr7q0J0J26r4J15p8K28k05J11l2K58k56q3J60l65K77l44J52k12
3358b75J68j25J67K03q2K0j35K73L2p7j00j20R2K3q9j15K76k82L61l30K86j91
3380b0L39k61J41j24Rj05Q5j45j06J72J65m1k04J92n3k40n4J65J35%j36P3K0J07
3404A14J0j26J40L3k73Q8KL8r0J15M5O6L6ml4q5j50K97k40L21m26K6J12O9j1r9
3430b6j61L51m28K35j29j63N06j35j56L33j16pQ3m28L82n6P5l51N6L45K8k14r4
3453g0L59k98N2j40n8K70j63j02J45j7l22K29L30N4l94l1N21l01K27k32p7L28
3475C10k12k0j59J17J97k91j4N5j0M5L0l83L84j69J05o8K28o0k2j67L24l44J35
$$ y = [169, 42, -30, 165, -44, 302, 171, 91, -91, 226, 141, 107, 81, -43, 18, -65, 15, -146, -93, -164, -192, 69, -11, -170, -207, -75, 137, 134, 37, -43, -33, 93, -1, 114, 36, 264, 59, 170, 138, 396, 140, 57, 217, -148, 129, -215, -63, -275, -107, -232, -65, 138, 56, 76, -59, 214, 246, 169, 69, -51, 41, 64, -25, -140, 136, -146, 215, -115, 171, -20, 319, 58, 199, 75, 84, -21, 64, -81, -187, -15, 150, 109, -95, 97, 44, -196, -250, -85, 50, 50, -86, -13, 7, 114, 124, -2, 138, 171, -102, -14, -12, 26, -64, 51, 96, 162, 198, 194, 160, 75, -75, 222, -18, 303, -123, -97, 15, 84, 73, -26, -187, 164, -264, -29, -158, -321, 185, 50, -106, 227, 111, 104, 187, -241, 141, 85, 160, -191, -135, 210, 238, 24, -70, 289, -9, 43, -97, -155, 115, -48, -150, -5, -22, -344, -115, 215, 269, -125, -156, 365, 64, 291, 59, -18, 310, 98, 78, -81, 36, 233, -58, -72, -17, -27, 18, 48, -335, 49, -120, -15, -83, 145, 85, 63, -104, 220, -124, 11]
3498A1R7Q5j52l5r7M12n8l9l28K52j65j53K59J38k75o5J19k06N7o8l8L04q0M1
3522A6k8J90l6m01N72k80M3p0Q1k34J54j72l5K48M1R7l74j03L21N2k00N4J65k36
3546a35M8j52K45L27m01p2R6Q1J04j45k7J87q6r3L0o4j2J16m2K27k27n9J01n5
3570hJ80m7N0m9p5k56l4K66K6j51Q5J62k96Q7J8j23M51j7k92Q2r0j98O8J15j50
3595a96J48J82l71J49K48l77K40K3L4N7M8m9k72K13R7k9j71K27k25K44j10k52
3617a42K89m59L97Q5m7J10n7K1j37j48J35N9q6j80M84k96J12j36M2L9j30Q9M5
3640H9M2j95P1k07K85J59m75K72N1L6j44l7J71j73J48j69Q8J73j76j91J11K96
3662B25k70M9l07M36R6m65L6J25r1M08j65j55n0J23K9N2j1k75J59r4K5J07P1j65
$$ y = [11, 108, 193, 41, 6, -91, 321, 263, 224, -104, 148, -17, -170, 89, 227, -48, -113, 6, -200, -143, -211, -249, 55, -25, 16, -12, 178, 142, -259, 313, 33, 76, 6, 87, -147, 7, -165, -200, 48, 89, 186, -188, -291, 30, 82, -118, -64, 101, -135, -87, -239, 6, 333, -68, -140, -44, 37, 141, -4, -31, 156, 70, -23, 7, -57, -69, 47, 5, 232, 5, -54, 47, -8, 172, 125, 175, 126, 51, -205, -239, 27, 53, -98, -13, 149, -147, -60, -42, -165, 286, 269, -23, 59, -31, -229, -161, -46, -196, -48, 134, -237, -88, 160, -217, 23, 46, 80, 137, 185, 136, -136, 77, 174, 145, -26, 201, -24, 220, 110, -142, 147, -312, 85, 170, 123, 233, 176, 197, 60, -88, 47, 106, 20, -160, 324, 28, 140, 4, 46, 85, -45, 44, 89, 131, -64, 7, -200, 85, 244, -231, 41, 92, 128, -16, -53, 118, -55, 93, -76, 12, 185, 9, -182, -71, 225, -45, 4, -303, 133, 229, -236, -200, -75, -166, 242, 77, -78, -128, -5, 24, 76, 65, -210, -51, -145, -120, -13, 58, -107]
3686a07K01m7l25Q8J61j60P2J76j94J73k21o9K39j42M7P4R5n5j49J75l8R7M9k03
3710f3J04K6M2j09Q0j92m3m6L12j97P1j77J10OK51j91P1q6K09l22J70J53k7J01
3734B53j58J09k33J55J06m87N07j36l31L05j03O7j97J19R5k04l9j15K92M4%q0
3756c1J3N0o0K07m15K10L37l39L2pn2J11k03K37m6k8j45J21l1j0K72j20o9J7O2
3781A13k25K55k82k9K55J8J25l36R0n5J9k1K87J22m97k0L14j2j46J6k9L1J61l22
3805a68L67q1j29q1L67k70J97k08K46l15L22k91J20j17K6N1p5N7l5J52j75J41
3827A01j3k8j16j59J87K69q2l7L6q6p8J62k89K55k38l2RJ82l33M61k62Q8M8j80
3851a35PJ3L21k49K24j44J13L7j26o7J94k54J86Pp9j89M4Q8J0j00l6m7J77k15
$$ y = [-107, 94, 47, -278, -190, -29, -189, -117, 59, -135, 38, -183, -252, -13, -155, -108, -34, 61, 6, -143, 32, -6, 91, 140, -63, 41, 67, 109, 0, 80, -112, -155, -201, 111, -86, -15, -192, -82, -76, 175, -16, 55, -31, 178, -144, 26, 179, 152, 253, 95, 204, -29, 126, 232, -255, 252, 116, -215, 90, -13, 54, -143, -24, 71, -133, -172, -287, 5, 49, 49, -31, -18, 32, -28, 179, -236, -26, 311, -28, 4, -3, -55, 56, -147, 90, 44, 16, -129, -8, -39, -49, 223, 103, 34, 51, 113, -112, 143, -139, -168, 87, 105, 230, -106, -16, -71, -52, -73, 214, 336, -161, -181, 133, 121, -25, -9, -38, -7, 154, -168, 199, 118, -11, -92, 275, 5, 202, -6, 240, -75, 247, -44, 76, -41, -15, 36, -39, 18, -17, 135, -40, 101, 88, 60, -56, -215, -28, 241, 159, 122, 158, 72, -6, 156, -133, 122, -116, -148, -139, 43, -290, 171, -91, -3, 45, -135, -128, -115, 206, -43, 181, 37, 150, 187, 61, -6, 188, -66, 120, 127, 48, -141, -97, -9, 1, -99, -135, -182, -5, -220]
3875b20R2K50k30K3l21L75k1o4k6L08kJ22l25O6L2j91M01k27njn4j02P6m9J06
3900A3l3K91l68j6l9J62Q8k97N6mJ40J04K37l89K11N8pk02J0q5j62K22m2J63j10
3925AJ89j29n4QJ16k03L28k59J0j02K16j0k61j33R4K07K14l04j3J54q0nL8K84
3949C06m23Q8lJ24k3k10j03J38K92l73L94k32j1J5N2J33j13J52k42K51k31J8p2
3972g3R7O7m00J05J80j20L1j73J89K3J16j62N0J25j33J10O9L20l66l0n2j02K86
3995A57k59K00K14l05M3j78N0J91k51q4L00j89N1j44K6K59L2k12K42M4o4j55j44
4018a76L7K45K4L7J7k2Mk41J27J09j35j10J87k22M54j84m05M06k48J8p5Q5J57
4041H9k16L07j1q9K9J4j80J26k35N8PL35p1k25j8K6k05K09O8M9J28n48L42K42
$$ y = [-220, -128, 122, -108, -85, -406, -31, -52, -116, -142, 166, 164, 286, -39, 27, 59, -132, 269, 42, 37, 36, -18, -120, -44, -93, 13, -20, 271, -97, -113, -152, 10, 98, -199, -143, -147, -7, 97, 334, -55, 156, 214, 207, 5, 15, -70, -232, -10, -52, 111, 1, 190, 61, 7, 15, 131, -72, 256, -3, 7, -95, 121, 111, -150, -283, -189, 18, 232, -72, -85, 69, -11, -16, 22, 306, -117, -29, -32, 92, 69, -141, -244, -106, 186, -187, 207, -25, -36, -21, 31, 164, 51, 203, -39, 212, -19, -1, -73, 24, 91, -309, -204, -24, -144, -113, -286, -97, -74, 42, -120, -70, 55, -78, 32, 101, 421, 55, 25, -27, -129, 157, -102, 98, 312, 7, 50, -128, -78, 113, -138, -222, 78, -111, -60, -204, -178, 81, 113, -99, 143, 187, 123, -32, -176, -139, 106, 130, 167, 184, 162, 166, -75, 52, 161, 26, -84, 103, -119, 335, 151, -254, 152, -96, -78, -153, -68, 89, -127, 180, 169, 80, 109, 123, -57, 69, -166, -108, -101, 234, 163, -62, -80, -54, -259, -50, 18, 67, 195, -353, -11, 231]
4065B31r6m6m6J86k87j9R9P1k39K66k24J72p0L3k19K72l47N40l31J0q1J14J40
4088A29P4j00n0l11N15j51J03m0k95L35k43K38r4l1l35K23k92J27J41l6K5k19
4110b87J75J36nn2L9p0k33K32K16r0o3j95l8K88o1P6n1R6k74kJ69J56l39M9J22
4135fqj03KJ75L1j72KR1J01J06r3j47Q9q7j68J87K73k09k08N43l61m1Q0m3p0O2
4161B6l3om0j40K74j66p7M39k88q2J38O1j74J4J8q8Q8M5r7J64P0j77J26j74j30
4186b09M18j61K20q8k61O7L62k64l87K73jl1N1J81L4l19rl2L57k04J57l51J0K76
4210H9j23K50l78K20j31j42J44K25k11K3Lj94K71J19j81L3j2j25r9L23Q3k19k00
4233b32N2L3K17l13L23k57L69k90J56j88O0M16l96J51q0L54m16J17l70P2L24k01
$$ y = [231, 135, 89, 43, 229, -58, -77, 22, 93, -146, 120, -104, 68, -2, 31, -188, 84, -263, 277, -54, -44, -125, -11, 129, 203, 103, 53, -258, 257, 106, 209, 169, -126, 209, -34, 204, 110, 79, -256, -33, -325, -198, -57, -93, -68, -287, -112, 24, 19, -33, 6, -64, -297, -65, 151, 61, -2, -197, -235, 53, -8, 68, 17, 113, -161, -163, 6, 162, -177, -128, -6, -14, -117, -115, 60, 91, -81, -79, 12, 113, 219, 126, -21, 68, -19, -187, 0, 273, 64, -144, 399, 38, -3, 77, 34, -36, 26, -7, -13, -53, -193, 81, -85, -162, 277, -11, -93, 45, 106, -68, -54, -36, -124, -36, 9, -88, 76, 146, -31, 95, -79, -209, 209, 48, 268, 180, -81, -14, 348, 84, -303, -30, -31, -62, -11, 170, 204, -115, -124, -156, 201, -3, 154, -197, -187, 89, -34, 216, -162, 58, -73, -215, -71, 154, -57, -34, -31, -225, 46, 165, -16, 17, 5, -120, -219, 104, 187, -32, -232, -180, -147, 70, -243, 80, -177, 192, -98, 58, -130, -70, 346, -50, 101, 21, 375, -41, 76, -294, -222, 102, -99]
4255i9K1J14k70J78N4j98Q4K65j36N5j3J08j58O9j4r3n1L08J53n40L53M7j53J98
4279B82j48L3k36K22j3n5J3j70r2J75P7j5p7j54J09J23o7J21j63k96J67J28j03
4302a39J28k95J28O8j8J91l06O1K92j67l3l2L00j29j29M39q1k62l2j80J87K28
4324B19j69K69m18J93j14o6K01m1k94K56k10J72k17N44l65l4J30Jj97J02J57p4
4346D5j00k3L15l47j0J06J03j15P2j09N9j41K40j71J99j31l0J11l77L39k53J71
4368d7J6m1k8M02k86j36o1K01O7j15L77l68p7L6n3M6K1L5k0k71K97L4M9j02j03
4393a27J58j05K1J36k76L30l19L32K8k64l1KJ87k41J17J39O8k44J6J97m4nj92
4416a17N9J80k00j19J40J46l4j24J8oJ49K3m7k9N4k0q1j97O4K80k13L65l11o5
$$ y = [-99, -78, 36, -234, -56, -2, -200, -116, 149, 13, 68, 55, 163, 5, 74, 60, -33, -84, 224, 377, -163, 190, 237, 84, 282, 134, 167, -69, 153, 140, 85, 98, -72, -164, 11, 88, 73, -4, -158, -49, 74, 7, 128, -35, -331, -164, -36, -139, -11, -306, -178, -110, -128, 63, -243, -182, 110, -57, -90, -122, 178, 49, -80, 359, 278, 16, -16, -196, -9, 219, 50, 319, -99, 94, -20, -86, 115, 74, -220, 36, -174, -2, -219, 325, -40, -74, 56, 57, -140, -38, 119, 45, -55, -78, 237, -110, -120, -14, 89, -26, 46, -63, -4, -145, 95, -76, 123, -8, -38, 73, -304, 35, -218, -47, -31, -72, -100, 302, 16, -120, -181, 20, 87, -28, 349, -19, -96, -60, -113, -67, -46, -11, -31, -302, -5, 29, 78, -24, -127, 31, -74, -53, 83, -193, 137, -182, 150, 178, -86, -117, -115, 72, -169, -52, 87, 155, -89, -73, 124, 80, 75, -117, -58, 122, -78, -197, -57, 89, 55, -69, -51, -57, 92, 115, 68, 39, 93, 73, -8, -205, -141, 139, -74, 291, -20, -85]
4440h5j1M8K31J70m54J42Pr0K90l42L06j25j53O2K39k50q7J38l4N4j63J11K0M4
4464F8J42l54K35r2K2j40j06L97N1j31k53K51j20j8L0K47k28J42j83j20J58N4
4486E2l0j4J19r5r5j09L12j64J1M4j45J28R7j67J47r8L1O7q4J07o7o9j58n6M68
4511B32k10J1k20K79P0k13J26o3L9j08K6L6j2k1Q0o4o1K18k24J64r1j89P0K11
4535H6K82m03L7R1k85J73J94k05j32q1J49J91j63J36lj28M8j62K67j66j3K73l25
4558a39J20K39o78L68L92k66j72JJ12J60m9p4m1J35k11J91j66j0K88j87K78k79
4580A2J61j69J26j78J78L7k03L00o9j87m4O2o0M0rp8r6L01k80J83j76K83j04K18
4604B48J0j43O5m26J23K20J04l38J45L53l23l23J29J97L9k37Q1R4m6k58K04J15
$$ y = [-85, -96, -48, 183, 353, -101, 41, 48, -42, 248, -94, 212, 87, -66, -4, 235, -15, -102, 36, 2, 56, -107, 4, 24, 68, 210, -144, 91, -1, 21, -119, -225, 172, 223, 92, -161, 90, -30, -48, -18, 229, 1, 143, -40, -160, -2, 52, 22, 8, 127, 32, -63, -172, 140, -24, -13, 31, -114, 14, 111, -56, 91, -7, 24, 91, 7, 114, 47, -22, -180, -236, 232, 22, 33, -187, 92, 162, -51, 75, 12, 51, -57, -31, 5, -7, -28, 52, -12, -73, 145, -79, 85, -6, -195, -125, 86, 368, -35, 2, 93, -192, -19, 175, -30, -162, -243, -94, 97, -66, 70, 67, -61, -13, -175, 92, -74, -87, 186, -139, -19, 220, -458, -90, 302, 36, -136, -135, -23, 137, 88, 14, -27, 108, -103, 88, -78, -88, 200, 13, 291, 12, 173, 4, 130, -48, 130, 167, -36, 264, 195, 8, -36, 26, -34, 6, -3, -81, -177, 124, -156, 27, -149, 134, 30, 248, 258, 115, 180, -246, -123, 97, 201, -137, 8, 361, 38, -285, -156, 41, 80, -157, -76, 18, -28, -286, -82, 33]
4626C3k81L48k46O2L85j86M6l08J57J38k14L02j73j69k05L40L7l55K14j74J64
4647h5J01J47r9q2l26K54L20j91J84k98L39j31l3l21L63j4j88L62l17j91K67j13
4669e2n6R7R4m32N05j09o5j09K50L8kP7l78J02K8rj08LJ96j3k42L05j66o1K91
4694A84lj96oN6J7j35K00o6j29J04K11j01m8j00K48m07K32m4j1p3L1j09J40l6
4718d1K08l33J66K22m74J14M2P9ML37n53K3R1L14j68j00R6J18k15L7k06L61l06
4741a84m5O8r2L81j80J05k36J54p7P1O0L3Q3j94J31r3p1L6K95n4k80Q3J48k00
4765e8N2o0J7M88n44j12L71j67l5K94k6l88K06n5K51k44j48J98jj55J52l6K13
4788B13p6j97K54l88K32K9J99k16K21j85J27j70k15j17N10k52O1q3Q0j47L00k69
$$ y = [33, -248, 100, -146, -84, 301, 115, 161, -147, 10, 148, -66, 236, 63, -106, -311, 29, 66, -289, -75, -249, -85, 16, 163, 64, -18, -344, -90, 230, 39, 223, -75, 264, 133, 100, -221, 142, 128, -60, 302, -15, -206, 61, -52, -108, -11, 83, -349, 156, 47, -18, -127, 123, 161, 159, 236, -142, -40, -12, -21, -129, -126, 70, 57, -185, 120, -46, -107, 184, 181, -15, -21, 35, 52, -83, 117, 51, -78, 26, 237, 136, 88, -12, 236, -171, 61, 17, 6, -67, -36, -145, -5, -41, 167, -166, 0, 222, -252, -138, -96, -17, -13, 324, -229, -206, -115, 199, 31, -69, 27, 145, -70, -33, -239, 122, -184, -229, -161, -253, 128, -52, 53, -183, -29, -106, -35, 25, 58, 141, -53, 78, -15, -86, -50, 245, 191, -89, -6, 142, -58, -6, -66, -49, 439, -105, -217, 154, -13, -48, 246, 220, -168, 38, -17, 234, -10, -158, 40, 39, -116, 36, 0, 213, 137, -60, 194, -194, 38, 67, 266, 50, 271, 86, 213, 43, -172, -289, 221, -31, 30, -53, 27, -120, 180, -89]
4810h9L06m47L23j58n4N1J56j3j2N3o3j03j6J05J0K03l65K26k03J53J17k46k2
4833h8J63kK61l16K01n7k03j70K15M1k39K35J12j0k00k3J5j66K35j08J15j90K36
4856E7J2n2p3J4J64j18M2q0j06K85j04j37J49k0q2p1j8L0o8j9P0L4J89k36N4J7
4882f7K64k01oK82j69m9l69K58K36k29J17j94L00l0K7j8l77L01k57J13j05Q9K72
4905A88k73j2K0%j13K28J15j54k06K73r3K6L2J3j01J57o0L0pk6J48j28K3k60K53
4930G3j25J10k12J29O0r0K11l07J32l2K5R8L9k73K23j9j24L9PJ0J40l18n7J11
4954a50K72n4P3Q2j32j11j86J64J34K59j28j27k08J30k7p3Jj43L93k13N4j28J69
4977E1m2j37K32Qk70R5j76Q8K69k10J36N8m4l8K04k88j51J46l18M26j94Q1K7O4
$$ y = [-89, 217, -230, 93, -65, -119, -68, 88, 75, 63, 116, 53, -50, -66, 39, 49, 252, -113, 113, -90, 63, 180, -66, -88, 75, 73, 334, 18, 219, 162, -41, -211, 4, 45, -194, 41, 153, 143, -57, -80, -65, -231, 4, -104, 11, -179, 57, 69, 17, -56, -42, 122, 4, 46, -34, -140, 145, 41, -96, 53, 33, -49, -120, -138, -108, -176, -195, -125, -91, 98, -138, -84, -67, 197, -4, -10, 272, 103, 54, -315, -57, 179, -50, 67, -127, 173, 143, 170, 152, -225, 76, -181, -68, -173, -84, 188, -85, -97, -77, -77, -190, 38, 153, -1, -207, 66, -27, -1, 31, 44, -57, 100, 40, 70, 63, 37, 185, 57, 80, -180, 73, -52, 58, -154, -25, 35, -55, 156, -151, -19, -51, -26, 72, 111, -162, 61, 42, -82, -43, -36, -26, 114, -204, -261, -150, 122, 68, 141, 223, 91, -20, -206, -42, 92, 351, 223, 96, -112, 18, -9, -82, -81, -224, 169, -44, 10, -118, 51, 9, -128, 104, 112, -158, -63, -239, -151, 118, -92, 44, 102, 58, 20, 224, -64, -215, -69, -387, 39, -155, -74, -47, 17]
5001A7%k96J71K29l16j02L05j14J67K2m7k12L03qL9j90q8j06Q6K35r0qk62J79
5025h6j9L39l72K31l34N1J17mk30L04k46J82r2K62j23M9o0k18J64J57r0Q4k0N6
5049A02l1n4J29k11J56l24K98k0j94j4K09k12K5K63k26j8j65M10N2k20LM9mJ68
5073A71k7m25J39K61o9O6j75M4j52J55j28k4J70P1J10j40J9K70k73K29k49j20
5095g7J99r6J86j17n0j48M7n6J37j05m5J53k58J59P8j3p7N0J50l0N1K0j97J64
5119A25j93k6M10k77r4R9J74k51J91j95L6j97K29np3oP4n0L35m43K30R4k55p3
5143a41J61J41k48K30j7j69J65qk18K15l14L56J1p6K02l48m8L3J71N4k34R4M9
5166F1J2N9j26J08j64n0J51oJ51k88J14J15k06j94J88m2k7K33Qj94j54J98QJ17
$$ y = [17, 17, -279, -108, 121, -195, -297, 8, -106, 61, 83, 36, -176, 127, 119, 158, -32, -120, -226, -140, 95, 5, -3, -265, -86, -105, 234, -138, 93, -241, -190, -73, -77, -307, -3, -249, -67, -159, 103, -20, 29, -31, -249, -85, 72, -18, 66, 46, 102, 71, 17, 146, -65, 91, -233, 65, 45, -149, -163, 46, -166, -141, 122, -104, -122, -287, 123, 175, -45, -42, 7, 3, 171, 144, -281, -142, 119, 50, 116, -59, -15, -167, -12, -140, -164, 6, 77, 187, 47, 66, 336, 63, 292, 43, -77, 122, 26, 212, 95, 45, -103, -56, -112, 25, -80, -125, 28, -230, -71, 7, -6, -83, -33, 117, 87, 138, 158, -39, 125, -68, -94, 316, 39, -55, 44, 218, -33, 158, -37, -1, -198, 31, 26, -47, -53, 21, -29, 306, -137, 93, 187, -68, -141, 20, 161, -87, 143, 126, -43, 122, 114, -104, 111, -203, 153, 164, 88, 290, -58, -106, -73, 98, 152, -82, 12, 61, 73, 132, 6, 114, -50, -100, 51, 45, 196, -92, 22, 137, -69, -263, -75, -117, -144, 89, 97, -97, -251, -53, -45, 72]
5190G2j40J03J1K4k98L24o0M0J73l16O1M0j34Q5Q2J30l90M2J74l3n1J42j0j74
5214a03M50k66q0O7l8J6P3n1K85l47Qj09J05q4P1q5J2J99j63J27m3qr7J61j3l18
5240b31J96m3Q0k11K02o8l8K42p4L9j41R9j69K56j56j13K28N0J15j52k45n4O3
5263a25K61k27J0J73j58L39l55J20l47K49O2k42J8J79J57j76Q9J38n4r1m1r9J67
5286D7l6J23k13q1K72q0R9r7k30J93J0P9Ln8Pj4n3K01J03j04j78p0j6P6P3l77
5312c21K52J8j9J63j07N2m2Q4j29m3K14J13k54J8q5J8j3j61L34m8k34j0J38r6
5336a58J64J6K5j4j3j6oq7Q1k52L73j16J00m4J25p7o3k7K8k0K25j56j84J1O9o5
5362h1J46j27J63k67J61m6k37K05J90j00J05K6l3l05K22k7L04l47J54j5j82L98
$$ y = [72, -68, 35, 46, 70, -228, 96, 36, 76, 249, -67, -6, 34, -100, -15, 67, 197, -193, -151, 23, -10, -61, 81, 71, -103, 347, 81, 1, 68, 30, 46, 119, 68, 353, 6, 14, -95, 10, -74, -3, -88, -76, 123, -40, 87, 44, 36, -61, 100, 87, -231, -35, -78, 2, -209, -7, -75, -113, 129, 55, 94, -47, 52, -117, 139, -17, -130, 98, 148, 263, 111, -134, -188, -125, 136, -91, -81, 92, -66, 273, -82, 38, -309, -60, 2, -240, -222, -43, 114, -62, 27, 165, 111, 20, -21, -120, 47, 11, 134, -79, -160, 112, 32, 131, 34, -196, -3, 7, 86, 89, 31, 38, 24, -29, 172, 275, 171, -7, -77, -93, -17, 56, -321, -69, -51, -70, 93, -14, 38, -4, 80, -49, -92, 122, 235, -19, -1, -86, -68, -81, -242, 92, 44, -190, -200, -62, -158, 6, 22, 47, 33, 20, 4, -2, -89, -8, -260, 113, -3, 97, 53, 178, 101, 38, 11, 39, 19, 244, 88, -96, -85, -16, -81, 65, -62, 101, -166, -5, -51, -288, -83, 107, 7, 112, 138, 105, -200, 22, -5, 299, -48, 106, 91, -91, 307]
5384C07k69j43N7o1l2k0O4lNJ89j53N1N5n8k42L86n0q7o1P3P8l3Q9j37j34K24
5410I5J33k41K7J42n1OP6k70K22l31k6J88L3Q0l0m6L7K27k18J14R3l31n2J31J13
5435A21pk07o3R0P1OJ86p4n6k3J82l65K28p4K90k58o0k8K96k63p7K18q9J32j33
5460D3Jk35L49j16J1m8q0k85Q4L93j39J54j51K4Q4j41j98N4K11K67j64n4J24n8
5484A30j41P6K2J89m50Q4K49k01K41k44N5j4r9J12JK21m24K02q7J00J10J12l37
5507i3J42m9k05M34p7k45K03k04J46j19o4J51p0K27m69L52j09K06j37q1J99M7
5529A85k43J26k88J37k7K88l73J06R4k0o0J97q4J07j48l34M12J09k19j08J00m4
5551h7m0l1J41n7J27j59J19K08k93N9K21l82K7L30j73P4j30j7p5K69j66O1J06
$$ y = [307, 38, -105, -48, -109, -141, -161, -97, -100, -95, 94, -59, -8, 47, -11, -253, 133, 83, -4, -65, 8, 86, 53, 142, 5, -129, 95, 228, -13, 14, 156, 105, 111, 187, -83, 139, -192, -218, -30, 3, 83, 53, 7, 44, 271, 53, 167, 260, -71, -123, 8, 121, 114, -93, -156, -66, 5, 11, 197, 123, 67, 44, 226, -139, 89, 15, 305, 47, -13, -41, 255, -8, -85, 133, 44, 176, 43, 44, -191, 158, 42, 53, 5, -75, -360, -276, 117, -22, 132, -19, 5, 89, -52, -250, -196, 15, 282, 118, 64, 188, 130, -11, 65, 87, 276, -174, -90, 159, -42, 199, -45, 10, -4, -103, 9, 10, 231, -193, 9, -78, 22, 132, 244, -93, 49, 0, -205, 229, 152, -93, 110, -94, 52, -67, -131, 20, -50, 177, -292, 60, -49, 157, 20, -61, 138, 185, -58, 68, -220, -83, -110, 178, -195, -89, 5, -15, -75, 122, 38, 145, -3, -337, 75, 184, -35, -143, -43, -87, -127, -158, -17, -74, 53, -106, 13, 221, -72, -13, 208, -174, -147, 183, 10, 84, -46, -63, -138, 131, -35, 26, 132]
5574A32r0q5k8K83k19j5n3J71J9N7l07K16l6l6J54k46n8J25N8Q7j65Q7k20J18
5598e1J56j59P5J91j20j38o3K91p2o4k14L09%r7j4j34o2L3K63k04K29m56J69J50
5622A8M6j76R8K8M5np9P4j27K60k09j17J70L70l20J26q1j13J76j7L8K7k95j62
5646b25J01R1K42j34j85J00j93J92j25J82Ol6K12k69Nj44J4J29J72L9k28n9Q5
5669b8O6p4k3J06M7r1k09QK72k19J74j23Q0PJ56j23j40K84j9K60l87O3k72L27
5693A42j8j3j57j30J97k16o1L60j12J32m0j00l6N2M6m0j8L9j0oj8J27j60oRJ41
5719A04k7q4J68k99R5o3J69r7J14l8j30k78L77O1j13L30m06J79k36J92j01L6K1
5742b6K35l38L8K86k07J22k26N4J24J87l36J33J39k02k06K56j31L9L23k90p8K42
$$ y = [132, 42, -43, -71, 212, -7, -22, -75, 96, 115, 172, -135, 81, 45, 9, 163, -83, -141, -16, 42, 129, -36, 51, -169, -51, 105, -54, 21, 212, 92, -46, -109, 182, 110, 46, -168, 141, 141, 44, 30, -104, -166, -133, 130, -74, 155, -301, -132, 18, 64, -112, -14, 14, 59, 54, -25, 49, -78, 182, -27, -144, 26, 396, 76, 202, 121, 8, 184, 167, 205, 232, -63, -225, -124, -33, 209, 75, -110, -10, -203, -11, -136, 46, 52, 16, 228, -41, -36, -180, -166, -37, 135, 174, -54, -113, -28, 38, -36, -59, 47, 94, 3, -206, -198, 74, -145, 29, -94, -14, -7, 149, 26, -114, 170, 151, 411, 24, 87, -185, 142, 124, 111, -46, -176, 21, -195, -256, 104, -8, 124, 84, -16, -52, 0, 46, 6, -12, 27, 17, 11, -7, 120, -40, -46, -37, 104, 77, -7, 161, -138, -43, -106, 63, -34, 80, 42, -88, -366, 11, 72, -41, 289, -117, 62, -174, 18, -83, -47, -26, 209, -129, -91, 195, -12, 110, -116, -62, 62, 249, -87, 46, 185, -17, -223, 33, -98, -59, 264, -26, -104, 138]
5764A38j23j55J28K86m13J04J52Np4J10m19J12K51r2j40J52m4o1j30o4M52l09
5786a34K64k77L12j20N5N0k74K92k72P8j44K99k83K19P1j18J92l03J75p8J09K75
5808C88m15L8R4j50K81m45K56j97J05J62j36L8kj9L0Q2P0Jo5k83LK63p8pL2q5
5834c9LL34r9Kl6j51j97J2%P8L8R0J26j27Pk37L79m32k0M60J96m06J0J8k24K70
5860E5k81J45k0P3N8P5j09L9j56Q6r3J09J14l34J74j6N1KN8k8K84m79O1P1K7o4
5886i8j19L22j64J40j3Q2l89L97l9n0j42R6o2K06o4l14J58m7j81K05l55O61q2
5909A48k98K1j42K88P9l16J03m9K26Q6q3L7N4p4j36q7K82j35J4J88j83K9N5j99
5933i2N0J50j59J92J69l48L5r8k15J75J64mj64Q9Q1K6l4J7j92J80p2J07j09j62
$$ y = [138, 15, -140, -12, 274, -139, -35, 117, 122, 48, 158, -261, -149, 102, 10, -130, 22, -22, -83, -213, -277, 175, -134, 130, -147, 165, 45, 100, 150, -124, 168, -104, -26, -170, 129, -154, 65, 136, 18, 210, -93, 82, 4, 113, 388, -27, 11, 105, -45, 236, -209, 47, -150, -45, 117, -19, 19, 17, -2, 28, 110, 180, 181, 116, -167, -164, 99, 21, 14, 46, -39, -36, 298, 199, 201, 165, 14, -183, -171, -171, -93, -55, 35, 161, 34, 41, -196, 183, -249, -269, 191, 387, -19, -9, 9, -215, 55, -226, -81, -101, -28, 30, 105, -4, 35, -121, -35, -128, -19, 95, -239, -65, -81, -30, -28, 30, 2, 286, -193, -132, -61, -34, -98, -217, 105, -59, 81, 68, 150, -239, 158, 119, 69, -73, 23, -39, 167, 103, -211, -53, -100, -281, -76, -431, 230, 148, -150, -129, -271, 17, 96, -220, -117, -166, 60, 146, 63, 100, 154, 80, -56, -143, 139, 4, 18, 206, 23, 52, 107, -92, -42, 108, -51, 141, 310, -38, -3, -101, -316, -141, 23, 19, -145, -56, 25, 51, 17, 34, -158, 22, -50, 57, -52, -214]
5957b14K18k7OR8M5k49K74nJ07k76j01K58q3o3J9k33N9K19j42J64J08j53K33m22
5981a60J69K48q3n02J48L26j79K79k66J07k6l26K53n3J49o8O0M9J57k33j84Q0
6003e5K05l69L6K03k42K76m4K48m70J17J87J5j20M3n9O7J35j52k66J76j39K53
6025D5j45k76N25k71J0K92j96J51J7k95L3O4j69J64K65l16K97j74P1j06j50P8
6047h6K52j68r1K09jn3j25J30j24N6n3k48N9N9K89o3k20Q6J94j17j50P2K1l7p5
6072a84M75j68m74M4K88j01J47j7J1j05K34o6p9l41L51L72l46j4k39K09M7J90
6094B34l12J73k32J89J26k63N2r7L28l07L29m10Q5J31j31Q7k42L63j50Nr8J67
6116B7N7M8k53O1o3pQ0M9k04L70q3k25J03r2n0K82o0J83l61K63k23J40n2k3K8
$$ y = [-214, 4, -23, -17, 81, 126, -123, 151, 146, 253, -23, -124, 134, 51, -12, 7, -226, -167, 52, -90, 74, 182, 29, 262, -160, 9, 257, 174, -328, -180, 146, -33, 246, -20, 87, 61, -265, -12, -65, 84, 16, 76, 125, 282, 49, -135, -55, 150, -219, -183, 20, -222, 54, 10, 258, -212, -95, 92, 107, -13, 30, -29, 38, 173, 21, -245, -69, -208, 45, -100, -376, 149, -122, -112, 180, -16, 135, 152, -143, -110, -46, -215, -51, 214, -102, 195, 21, 92, -14, -164, -86, 166, -2, -93, 116, 115, 62, -63, 67, -57, -1, -54, -302, -243, -184, 105, 42, -178, -92, 102, -15, -165, -93, -72, -109, -184, 291, 123, -351, -307, -19, -120, 27, 10, 21, -84, 150, 84, 5, -336, 15, 387, 41, 27, -212, -3, 44, 234, -78, 95, -137, 52, 178, -85, -33, -130, 198, -109, 220, -190, -105, 26, -105, -18, -260, 103, -47, -42, -140, 27, 84, 132, -121, -60, -123, -130, -50, -1, -205, 165, 82, -143, -40, -132, -182, 100, 40, 223, -138, 125, -98, 42, -10, -33, -5]
6141eo8L00j04J3N7k77Q5M5n2K31OL3j47j54J30l3r5l7J97j48J05j4P2j66J21
6166I5O1j45m3J10K81k29j34k10Q2K44k3k29J26L2N7P6j31k20J31L2J31k07PK80
6190A74k75J63k24K17K81l07j71N7L9R4l7J07N5j31O5n6q7J14j52L34n67J13J86
6213hrJ72j89J9n17K98K97j20K04k06n7J11n6J04k7r9K68l05L5R7k28M50m66K36
6237Dl8pk09M47l14J33j03l4L05k60K37M3j68J2p3J94l78J94q7K59j01mN0j4N0
6262A38l8p9k6K4J46k08J19k99K26k3J13j17J42j46J79j8l04J97k16j2L31j12
6284A7M2r9j78L49r8N6l2n9N6j6j23n8M5K3J22k8M3l3j18K83l23J11p4l8L12l13
6310a31J84r2J63N4k68Q3L2m9J35j21O7r8k07M61j6k03k5K86m72J75J68m0M0J17
$$ y = [-5, -73, 227, 123, 136, 193, -84, 1, 46, -6, 225, 231, 264, 117, -37, 93, 60, -35, -72, 125, -23, 82, 68, 140, -26, 95, 156, 11, -32, 78, 359, 130, -4, -214, -132, 112, 89, -140, -14, 18, 75, 151, 20, -200, -69, -37, 94, -113, -106, 174, -101, 62, -162, 55, 336, 29, -142, -85, -46, 48, 11, 118, 173, 42, 107, 51, -36, 78, -74, 260, -307, -194, -8, -17, 155, -34, -15, -532, -234, 63, -57, 147, -59, -116, -5, -61, 43, 16, -83, 185, -120, -85, 12, -216, 234, -232, 4, -34, -41, -250, 197, -117, 16, -87, -121, 184, -76, 161, 204, 36, 48, -25, 169, -209, -15, -102, 157, 56, 52, 102, 88, 138, 100, 21, -5, 19, 165, -43, 76, -223, 3, -20, 93, -24, 118, -28, 151, 133, -171, 26, -190, -202, 129, 17, 59, -40, -218, 131, 33, 89, 57, -2, 54, 38, -85, -143, -98, -75, 47, 19, 62, 29, -89, 194, -129, -18, -92, -130, 182, -131, 53, -39, 124, 178, -90, -7, 25, -24, 111, -10, 57, -41, -248, 213, 197, -6, -31, 255, -217, -42, 126, 86, 126, 243]
6334B43k42r7j8K93l90K77r8J27l73L16r8l8L1L56k29j3L0k13K62m6m3j00J01
6357C8J66j69M8k36n9P9J29M4j16Qr9J77j38L6O5J26K8k70P8L0L36l56J75J22
6381B42r2l72J61Q9J75l48K20j76p3J88j08Q4q6J83O6j24M7j46l3%m4L01k72J66
6405D8k54J47J95L9k10O4Nn4j94J98J11o0l02L22l20K53M7q7J63n3j42J43J66
6428B25j53j19K32k13p4J10j69J57p8K65Om06K87k03O9K8J89nk62R0M2K9l5j9
6452gj40J41J67k16K54j40j54oQ6j89K40k29K4L92j97k40L78j75K03k92K43j86
6474d3P8N5j34J72k53N7J76o9J37j69q5m1k6P4M4J7N8J65k49K25k06j4P7J1j73
6499a16q5M34p3j9j59o0K61k89J32J31k14K57j11m4j17J63j51k86K56M93m17J09
$$ y = [243, 1, -96, -114, 179, -211, 66, -32, 95, -278, 38, -60, -98, -67, 289, 60, 47, 77, -136, 126, 80, 37, -63, 38, 204, 35, 83, -153, -212, -133, -4, 40, -76, -68, -167, 10, -128, -92, -27, 99, 127, -143, -65, -35, 301, -55, 120, 242, 150, -222, -61, 28, 203, -145, 75, -101, -174, 14, -94, -10, -96, 87, 153, 29, 76, -70, -103, -103, -147, 154, -118, 48, -206, -59, 136, 175, -35, 29, 34, -20, -214, -16, 95, 35, -267, 55, -265, -12, 35, -52, 111, 58, -84, 59, 225, 72, -47, 185, -28, -102, 8, -161, -4, -82, 183, 189, -217, 70, -133, -64, -36, 153, 148, -114, -24, 18, 47, 12, -7, -147, -6, 161, -55, 199, 59, -95, -101, -15, -204, 36, -193, -169, 223, 26, -214, 164, -11, 192, -100, 143, -43, 35, 90, -44, 128, -125, -68, 108, 39, 176, 7, -78, -119, -145, -71, -27, -10, 48, 213, -36, 189, -17, -31, 46, 57, -116, -201, 233, 160, 141, -18, -78, 183, -106, 26, 157, -57, 200, 89, 45, -72, 91, -60, -346, -90, 403, -14, 95]
6521I5l63L83pk63K48o1q4J41j81Rj0J68p7J4o4L08j49j68L96j38j04j60L25l43
6545h5J18J12j87J13k3q4L85m88J21J25J35j89J98k61j92M62l41J73Jk52K43r
6567G5j09L82r4r3n23L98J19l08J59P1n4n0Q6j58NN7j03L27n6k26O2K63j82k41
6591a93J55J70l73K67Pk05K81o1q2k3N1J51j35j8r3N9k9M5k6J80K0j26J32m4M8
6616A58p3K34m43J89j50J01QO3Rl3k5j66J45qK79k91j39m1O9K47j50k01M30j71
6640D1m6j48O1LM0k24J20j61J04J27J55J22k47j23q0K06k27K53j27K78J30r1k50
6663h4L28k08k02J91L2q3M5P0o9n5K8J6J23l6K6l78M76k60P8k57K29j88K08j43
6687a13J70r5j46J73j06J69j32J32L51m42QN8R6k88J15N8j44J46j70N53k86q7
$$ y = [95, -268, 115, 108, -155, 93, 32, -52, 89, -92, -83, -93, 75, -2, 12, -52, 256, 107, -61, 335, 197, 93, -67, 258, -85, 33, 145, -42, 71, 48, -36, 349, -139, -18, 107, 242, 53, 251, -10, -202, 260, -81, 92, 93, -159, 84, 75, -34, 348, 254, 161, -362, 36, 155, -153, 6, 77, 23, -27, 59, -99, -94, -37, -140, 187, 131, -95, -33, 230, 48, -193, -38, 132, -241, 26, 33, -172, 109, 48, -34, -57, -6, 145, 10, -8, -101, -42, -71, -26, -52, 128, 148, 22, 154, 110, 158, 85, 319, -124, 65, -85, 16, 24, 87, 96, 63, 38, -128, 17, 9, 288, -3, -142, -183, -114, 133, -17, -218, 212, 41, -5, -153, -92, -89, -49, -273, -153, -314, -210, -83, 72, 194, -53, -176, -256, -50, -277, -24, -151, 127, 257, 166, -84, 244, 36, -166, 25, 57, -26, 19, 89, 20, -35, -7, 9, 132, 96, 122, -256, 220, -40, 38, -219, 10, -178, 30, -113, 57, -38, -184, -11, -117, 52, -80, 52, 403, -39, -31, 27, 123, -165, -50, 8, -136, 10, -160, 393, 107, 20]
6709B0k51J03M6J86l35J93J00k33K55k84M34k62p4M62l18J63k04P8N6j08j05J07
6731B9L7M0Q3p4r9j57N6K27j68j1K4r8J40k59K44j38J24R0K9p4n5j3J12M3o5M6
6757A13M1l1Kr3P3o8q7O6o4J68m6m47M20j7J40j56j21O5j76K67q9M0R4m3o7j01
6783a17P9k3Jl5K22k51K12j10J04k4K32M4o6k20Om1O0k86J93K36j75j85j01K55
6807A0j03K5L92m32J15J1n8j57J19r9K98j19J62r7L0j15J1K17r4R3l83J88k07
6830a93N55k16q7j3k28L46j38j31k86M58j98m3O1K1J58j12J01j58M9J46N7j17
6852C2O5j26l5j30L48j34j06M4o5K91j86J93l84R9J77Q1l54J67L8J20k33K1J07
6875C0l19J54Q0j16k0L04j69P4J91j71m2J29k37R7j19P1J23j32J39k4j60K7K25
$$ y = [20, -231, -128, -82, 104, -231, -38, 62, -171, 84, -200, 234, -28, -102, 360, 42, 205, 1, 79, 135, 27, -78, 29, 66, 106, 189, 115, 16, -141, -85, 142, -26, -37, -13, -111, 29, -230, 14, -124, 0, 90, 119, 45, -10, -23, 89, 132, 67, 113, 154, 123, 125, 32, 105, 37, -50, 16, -48, 120, 74, -373, 47, 30, 170, 14, -107, -42, -218, 49, -40, 0, 94, 51, -16, -117, -38, -61, -60, -95, 127, -124, 88, -22, 82, 58, 290, 334, 268, 48, 54, 13, 73, -213, -20, 216, 41, -144, -245, 10, -93, -68, 324, -108, 7, 18, -40, -197, -78, -177, 121, 2, 164, 67, 97, -18, -7, 210, 116, 209, -174, 14, -193, 362, 146, 59, 46, -182, 164, 26, -105, -391, 67, -131, -174, -113, -92, 66, -46, 55, -103, -54, 92, 149, 32, 97, -29, -64, -194, 154, 20, -86, -42, -107, 184, -2, 191, -193, -94, 83, 164, -190, -23, 15, 135, -98, -77, 30, -289, -135, -55, -171, -191, 113, -56, 18, 209, 38, -4, 125, -112, -15, -134, -63, 60, -72, 67, 43, -117, -90, 135]
6898A35j62K69l32M2k57n5L99k5n9qJ32k00J95Q1j50K2J03K7j60J51k45P8J37
6921A18j41J19K6j26l28M69l75L39J3n32L54J63k9j52J62O7r8l03J34L38l82n0
6943b14M06k00o4J80J73k33N8j1Qm16M73k57L70l86L32p1k85L65l37k3J84k27
6965a75J39nJ31k40K48m8k53J18lK46j41L36j15ll53J47R4j34pk4L0K08l12K3
6989i3K94k10r2K36j94J56j98L90l34K9l9K84k60l62L85R9M1l0k55J47L38k97
7011C5k53L54j66j01J36j79K16j92l8R7k8K5K46k93L8K43k2j04M9j08k6J62j35
7034d4q4P1J60k75n8J57k7K09l12M20l28J17j6L6n7J65k60K07L6o1j38oK23j42
7058gP5ok76M04j36M2j87j6J1l4J25Pj13mO1K8J92k58L9l3J24j58J60J5J7j15
$$ y = [135, -27, 242, -90, -48, -305, -360, 39, 14, -45, -53, 79, -121, 74, 155, 5, 27, 130, 157, -3, 148, -97, -19, 118, -23, 96, 122, -4, -332, 137, -238, 101, 114, -418, -64, 99, 70, -82, 80, 147, 49, -254, -120, 218, -164, -214, 192, -8, -72, 108, 281, 48, 106, 95, 103, -313, 160, -97, 273, -113, 219, 148, -137, 228, -109, -132, 52, -175, -36, -41, 90, -150, 98, 50, -203, -85, -88, 158, 17, 353, 238, 235, -118, 29, 123, -11, -18, -42, -12, 196, -116, -93, 201, -9, -101, 135, -59, 97, -101, 289, -45, -16, -55, 229, -31, -393, -8, 91, 132, 102, -153, -6, 332, 35, -218, 136, -30, -131, 5, -174, 42, -150, -188, -91, -119, -94, 152, -141, -103, 140, 118, 14, 63, -45, -71, 91, -44, -128, -57, 103, -172, -230, -73, -100, 109, -203, 217, -111, 6, -10, 26, -31, 134, -126, 81, 117, 56, -82, -88, 135, -7, 68, 62, -214, 190, 54, 96, -91, -107, -96, -130, -5, 2, -111, -115, -54, -26, 166, -92, -53, -86, 38, -120, 40, 55, 72, -43]
7084d3J40o5L9j8m4j24K8J59j57Jj73K39K2Q8k61K74L6k23J95j66on3N2K0o0J30
7110C0j29m1J92n2o1N1k57J96J77j43JR6j74k1J36j2j24J35j44K32l78J76N8L20
7134B64j64K0k46O1K96k68k15L40j15r0J14j6P8M2J00n5k07R5j24%Q0K07k15J07
7158H9j36j39L02j02R1j58J00k6r3K30k06j8J46j24j35J73J16P9j29J16k63k08
7180b95L16k6P0R7p3Kq3j62K22j47J78j75J78k11j16L98nj59M8j37O8j8J76k55
7204a09K00j28r7l4K27l2k38l3p3K93P3M4j93j76K89K2j81L24l85PK80J29m11
7227b02L16J38k05o0q5q1L26k59J20j42J42R4r5j25J05k79K73m4Q7R5O0K9K4j79
7251E3J46m3j24L01j31k64J49J40m59L36r4o6j57M50l15K23j81J89j59K50l86
$$ y = [-43, 97, 32, 71, 53, 9, -115, -87, 72, -85, -84, -257, -18, 4, 92, -169, 105, 141, -82, 113, -53, -59, -112, -60, -40, -100, 30, -99, -140, 52, 0, -61, -10, -267, -71, 106, -37, -36, 60, -114, -135, 1, -11, -135, 0, -144, 88, -290, -114, -56, 264, 100, 120, -126, -65, 231, -37, -252, 88, -27, -117, -3, -19, 59, 101, 201, 146, -61, 34, -90, -90, -10, 197, -18, 89, -47, -186, 116, 14, 105, -53, 47, 21, -72, 158, -48, -66, 80, -44, -179, -6, 110, 189, 60, 176, -87, -295, 21, -5, 65, 162, 89, 91, 8, -154, 68, -79, 99, -76, 102, -109, -225, 173, 168, 9, 57, -80, -12, -30, 146, -109, 91, -37, -134, -168, 59, 27, -211, -244, -317, -24, 49, 93, -100, -276, 13, 35, -146, 178, -207, -200, 80, 209, -202, 114, 252, 47, -13, -98, -179, 147, -112, 8, -134, 8, 102, 7, -118, -13, -292, -19, -63, 24, 119, 179, 208, 232, 53, 199, 156, 32, 333, 202, -62, 87, 227, -232, 104, 10, -56, -213, 237, -78, 145, -36, 153, -6, 244, -142]
7272a42K34j05M8N0k21J11J84o7k39L94j98o1J02O2l01M03k82J93j54L49n50K72
7294H2o2J03j73p2K37J73k42q3J48R0n7k88L1j6L48l68K06k7P4k08j17K51L1k73
7318b12L70P7j65P1j48j26J16N5k01J76r4P2j41j24K58M8k1R3J72n9j58K7j98
7341a12J36k6N7p9J43l06K67n3j65k0K34n9k35J16k4j2L18l43kL85n8j03R6o8
7365H7l7R4l48K45n3J99N7k91N4o9J16j87m4J55n0j7J94j27M9L4p0M1p8L8j4n1
7391g3j7l8L4NK31l94J41RL21k95J94l50K28R1j44J63j22n3P3k67J97J2m9J20
7415A7l35N00k95K22J22k02P1pj09Q8l35J78K06m27L61k67m0J76J11j82J28J23
7437A04j23j11J13P2m9J01j86J04Mj23K54k40J19J28j95j63K73p8K15o06L59J17
$$ y = [-142, 92, -13, 35, 85, -136, -25, 159, 92, -147, 247, 49, -12, 90, 152, -149, 254, -28, 165, 11, 360, -190, 82, 20, 123, -50, -122, 115, 288, 46, -37, 111, 201, 144, -144, -113, -129, 219, -149, 57, 30, 104, -104, -221, 30, 61, -212, 158, 235, 70, 141, -7, -133, -17, 38, -163, 13, -81, -9, -150, -274, -16, 32, 11, 104, 276, 217, 59, 86, -112, 24, -2, 55, -24, 119, -187, 80, 27, -138, -158, 76, 17, -218, -102, -126, -138, 180, -163, -165, 220, 162, 59, 155, 87, 50, 144, -204, 41, -12, 187, 244, -47, 7, -62, 54, -133, -177, -22, -72, -89, 105, -22, 27, 61, -9, 32, -46, -8, -22, -73, -90, -128, -94, -89, 142, -252, -111, -102, 219, -76, 118, -232, -4, 87, -57, 106, -16, -69, 4, -263, -66, -54, -103, 17, -318, 182, -113, 109, 231, 29, 100, 93, -16, 72, -263, -85, 121, -306, 55, -212, -252, -76, 35, -147, -19, 104, -19, -130, -17, 55, 6, 107, -79, 25, 29, -94, 160, -80, 39, 167, -28, -191, 82, 4, 219, -387, -28, 89]
7459H9j46J87n4nK6O3Nl04R8Ml10K0K36K84k51j9j56J02Q4R1n7O5O8k97o2K54
7485A5m1k0L07k43L0p4r2J61j21K23r9j1L2k33J76m8J23Lj77J70r3J39k31L24
7509B20l99J3J87n6K0j72R1l1L5J51m8l29J62K76k12Q0K10m32M38m98N22k50M06
7532C84k06j23p9K04j76N8J75l98J19K13l4k33K34kl01K63k56qM21l18R8j6m6
7555b7n1P3p3P8l7n0N7L3j95K39n7k0J4k62J61M7K69m10J54M4q6J90J39j57n8
7580A5k22J45j36K83J69Pl13P3J25m17M5K57k52P2M79l65R5l12k77L29j8K61R3
7603A36l75J98j4j27J68L7j60L04k40J2M1J1j11J36mJ9K7j05J14k60L00o8q6l7
7627h4R3j32K90k63pL14j75l2pk03K13l4K88l28mN0J8PK49l63M6L4K58l43K21
$$ y = [89, -57, 130, 76, 71, 97, 160, 165, -139, -41, -37, -347, -327, -91, 193, -58, -77, -233, -131, -47, 44, -13, 52, 120, -177, -239, 15, -26, -46, 261, 18, 48, -26, -118, 43, -78, 145, 46, 35, 67, -166, 10, -38, 85, 88, -89, 81, -12, 127, -104, 220, -179, -166, 21, -35, -15, -187, -96, -127, -92, 59, 11, -318, -156, 120, -92, -12, 198, -234, 204, -294, 228, -22, 384, 178, 55, -24, 180, 4, 62, 237, -161, -42, 171, 137, -96, 138, 136, -165, 98, -158, -166, 255, -63, 35, 19, -27, -78, -5, -78, 0, -37, -87, -30, 3, -192, 47, -10, -30, -16, -278, -117, -70, 199, -211, -57, -13, -99, 91, 230, 73, 15, -207, -62, -198, 85, 254, 261, -52, 21, 146, -271, -226, 31, -221, -149, 330, -35, 60, -252, -529, -200, -218, 43, 136, -239, -41, -55, -182, -14, 23, -137, 167, -73, -61, -20, -9, -120, 16, 12, 31, 58, -47, 67, -193, 107, 39, -47, -84, 9, -123, 167, -96, -103, 211, 36, 4, -3, -206, 7, -27, 261, -67, -71, -21, -3, 4, 253, -110, -64, -30, 228, -115, 106]
7652A06l41J92J72k17J22j36R7k0j34K92j32O5q5L24l15q0J82j85N8M3M8l5r4
7675g3J39j88K58l21J72J70k40oK4R2j57K67k47NK27j73J08k05K17J08m02K40
7697A5QR5L7k40O5k5P7j49J78j76L20m07J48n3M0Q1j19K71Mk54J2j6m0K84j20
7722C6k59P1J72J99j17R6j22j3j16J9j11K46O0j46j37K1P3J47k85M9L75k84J36
7745A10%q6Q2J6n5l5J49j67o0R4K26l81p2O3K90l59m4M65l08R2L8q8j41K68m09
7770c12M44j67k4J98l0k59J26j00J35Q9K5k16J85j70R0N8j34L41j59j68L70k81
7792D1m1j04J46k04p9J54L14j12k09J11k06L92K4k29j88K56k6J68l28K47l0m6
7814E1q0K18o6L0M4jj29K5j60Q9J25k42j66L18M0j15j08Q0m1K3j18K8J73j40q3
$$ y = [106, -235, -43, 129, -88, 34, -102, -5, -25, -159, 133, 1, 66, -19, 305, -10, -90, 92, -93, -35, 8, 56, 21, -73, 66, -122, 136, -185, -13, 157, -83, -89, -65, 27, -130, 137, -110, -105, 122, -51, 57, -148, 69, 177, -225, 15, 23, 118, 155, -85, -20, -45, 32, -117, 61, -115, 205, -202, -54, -107, -67, 14, -105, 166, 170, -84, -72, -88, -128, 156, 36, -223, -152, 20, 219, 102, 198, 76, 63, -53, -34, -145, 101, 161, 15, -122, -101, -28, 119, -166, -117, 258, -26, 110, 110, 24, 106, 122, 67, 32, 181, 14, -46, 48, 274, -107, -179, -116, 174, -185, -229, 236, -72, 20, 58, -30, -171, 97, -312, 132, -35, -59, 139, 109, -150, -24, -124, 11, 100, 125, -91, 94, -76, 14, 72, -62, 279, 120, -48, 322, 41, 0, -104, 42, -162, -241, -87, 227, 115, -94, 17, -189, 203, 227, -2, -190, 66, 40, 208, -120, 127, 97, 51, -29, 189, 123, 153, 197, 196, 67, 92, -68, 21, 146, -96, -262, 56, 96, -19, -127, -47, -88, -65, -183, -155, 18, -122, -205]
7839b05N3j3J62jj14J44nJ08k13J34N5J68m31Q5P1J49k16Q1J71rop5R4j26r1Q2
7865E2j87k45L86j93K37q8J64m48K83K12j68M8k0L0k58L50k99J47K2j40J01N6
7887D2r1jJ82j82J57k98J77J3K4J58O6j78j70L13l2k6m52J89k9J38j08j6JR6j45
7912a72J21k46L11J8J14k25k9J18q4R9j17j62J75J12l8k13K71%n8K57j88j3j23
7935g2k5J63O5j92m1O1o4L6R3j24J93l0j71J64q8k05L16J41l23j02K08k24K48
7958B7Q5J3j82J30j35J41l5K69l21o8N9j09J97rq9J01K05l25R8k29l9M33l45K34
7982A06j30RJ84n4K9j16K11j65j5j00k73J52M07m08K00k1N7j40J6J55k06L35j16
8005A17k18p2J13K10j85J05J21k16RJ35l87K94J17k23J6l4m1J95k08J56j96K58
$$ y = [-205, -152, -165, -3, -4, -118, 26, 21, 129, -84, 50, 105, 273, -158, -73, -2, 147, -69, 12, 183, 174, 168, 93, 187, 61, -30, 52, -135, -380, 6, -187, 50, -38, 126, -322, -39, 173, 5, 53, 33, 63, -195, 155, -144, 3, 25, -115, -14, 42, -49, -50, 132, -50, 107, -191, -14, -1, 23, 181, 247, 69, -101, 212, 180, 154, -298, -109, -138, 0, -108, -124, -123, -27, -172, -51, -297, 14, 32, 146, -79, -108, 10, -74, 25, -92, -254, -79, 33, -5, -218, 53, 53, -5, 252, 64, 51, -72, -97, 66, 131, -61, -102, -41, -105, -69, 24, -100, 93, 63, -108, 56, -32, -237, 79, 220, -103, -205, 3, -221, 27, 112, 125, -57, 73, -62, 79, 44, 313, -8, -76, -17, -126, 71, 62, -27, 74, 279, -46, 52, -177, -216, 217, -128, 106, -24, -15, 169, 115, 144, 28, 239, 74, 59, -41, -314, -162, 245, -163, 37, 16, 73, -67, -51, 104, -102, 233, 117, -101, -173, -60, 150, -35, 70, 191, -25, -16, 119, -268, 26, 143, -80, -64, -98, -139, 56, -152, 4, -192, 66]
8027F6m4j64J30J09k08Q5k0J92n6q5K06k58N5k68K20q5J16r0R5q4L2o2r6L92n
8052A73k33L0O7l6p9Jj23M8K28K4K5m13J52L00j06J43k69M36l73o3P0q9M4O0k7
8077a0R5j80K94q1j05j40J81K9J15K7l82L79j44j15j42K53J55k61rK14k88J07
8099hmj65K74%j52o1R2p4m8K39n4j05J10k22l4K31j34K33l5j96M15m50J95J17
8123A64l01J92m3O4J17N3m01J94j0L1j16q7K12r3n5J38k0mL03j84j02J2K88l22
8147C0j53J42j73J68J20J81k42J4n9k71J12J19K30j88j09Q7m3m8K48r4J16q3k75
8170a71K62o6l55L56j27Q9p8k0Q0r2K78k56J06m6K8mM3J28n3Q7M3
$$ y = [66, 22, -142, -12, 97, -111, -26, -46, 146, 90, 5, 211, -47, 8, -260, -40, -125, -9, -99, -4, -88, -56, -118, -214, 178, 173, -60, -30, 37, 1, -78, -77, -200, -152, 76, 100, 125, -288, -136, 164, 58, 201, -68, 368, -5, -68, 2, -87, -43, 17, -10, 85, -95, 199, 118, 13, -127, 54, 83, 198, 225, -157, 222, 78, -37, -179, 74, 229, -32, -41, 173, -115, -8, -12, -177, 97, 97, -55, -116, -24, -98, -146, 93, 39, -66, 44, -178, -212, 19, -115, 118, 83, -113, 302, -148, 47, 164, -137, 55, 12, 76, 193, 246, -155, 39, 29, 60, -56, -143, 69, -24, -79, 59, 39, 35, 338, 154, 52, 64, 352, 30, -123, 19, -154, 14, 134, 315, 73, 87, 28, -243, -131, -12, 218, 30, -79, 8, -35, -83, 165, 71, 187, 104, -171, 91, 25, -330, 26, -101, -12, -90, -110, -30, -122, 156, -100, 6, -40, -12, -16, 27, 155, 102, 189, 232]
8191B32
$$ Imaginary data points
##PAGE= N=2
##DATA TABLE= (X++(I..I)), XYDATA
0@%%%%%%%%%%%%Nj1J4j6J6j9K7l2L8m6N5o5P4q8J04j20J38j59J83k07K34k67L04
35A62l43L85m31M83n40O01o69P41q20R09j006J110j224J350j488J638j804J988
53A042k193K423k679K970l305L691m144M683n339O160p214Q629j0644J3746j9190
68a1364L1450j07675M3817K19460k37338k42702J67420J90896j91509j03011J70324
79g0232P5820q1179L9989N0584m523J23083J43679j10697j28290P7089L2332j16032
91C1623N442O7749r8371r9591O5821J6317q0692J8808M5916q2729m4445P3604
103h0548l267o0953P5178J01333l3853k0519Q1692L3033j8504L8229Q111o7966
115E1966Q147O4580m5445p4913L5266J8923q0896l8174K1613l4147l7384L4300
$$ y = [0, 0, 0, 0, 0, 0, 0, 0, 0, 0, 0, 0, 0, 5, -6, 8, -8, 8, -11, 16, -16, 22, -24, 31, -34, 40, -48, 56, -64, 74, -85, 98, -109, 125, -142, 162, -181, 204, -227, 256, -284, 317, -352, 389, -431, 478, -528, 582, -642, 708, -780, 858, -946, 1042, -1151, 1272, -1407, 1563, -1742, 1949, -2195, 2488, -2851, 3309, -3905, 4724, -5920, 7826, -11364, 20086, -87589, -43772, 175688, -61650, -304352, -136932, 53964, -137545, -240556, -70232, 5588, -75591, -35602, 14982, 10459, 133542, 277221, 166524, 38234, 115323, 147655, 31623, 37065, 104814, 6443, -93148, -27327, -11010, -91702, -72894, -26978, -109707, -154152, -80548, -83815, -144768, -69590, 31743, -2110, -22629, 59063, 92096, 73592, 111821, 119932, 51966, 60113, 124693, 79248, 4335, 39601, 58524, -22372, -60546, -38933, -73080, -110464, -76164]
127g6164J0857l1633K8190M8599j6061l610M9131M669k6807L5616M1929k0144
139D4572J185M9844N195l2039L631j137m5898k7603r30l2645l4134R866O439j5441
153f9095J3580K6933p613n708K4421L734j9862J1360K9373L667L698K9395K2512
166F6395K549O135R61k0549j9819j0432k2171k6712n309k11j3558l483J4630K144
180b9430q244P585R256p945l702J4681J1115L892J3481J6265O381O765R375l426
194D6049p153J276o842k1801r917K056j1578j5807J087K27j3012l718Q094K034
208b9005K745J1187O218K12J0753R387k404K676J0883k407p142O999P390m123
222B3369q40L973p907j3785p443q676j1670n727k420l160M816J2624P089N861
$$ y = [-76164, -65307, -96940, -68750, -20151, -36212, -39822, 9309, 13978, -12829, 22787, 64716, 44572, 45757, 95601, 100796, 68757, 72388, 71251, 25353, -2250, -3180, -35825, -69959, -60093, -53654, -69095, -55515, -28582, -36195, -41903, -17482, -13748, -33610, -22250, 7123, 10790, 14488, 43883, 66395, 68944, 75079, 76040, 55491, 35672, 25240, 3069, -23643, -28952, -29163, -42721, -46204, -31574, -29430, -37674, -30089, -20833, -28778, -32480, -17799, -6684, -2792, 10689, 26954, 33335, 40100, 49475, 46049, 38896, 40172, 33330, 11529, 1612, 3668, -7910, -23717, -22630, -22403, -35415, -39133, -31039, -29005, -26260, -15073, -8855, -8643, 2110, 11497, 9093, 11769, 22652, 20245, 13103, 20102, 27492, 23369, 22529, 26502, 18595, 4810, -2633, -11309, -22979, -28706, -31126, -34286, -29470, -16846, -9757, -3896]
236c896J2566O018o723m407J990j696l958J995N784L877M342L253J072j67m759
251A5291j1523j1651p892p000n511J519P173O234O166Q463Q843M042j171l156
265I827j630m825o006j559M992M833K049J618J525p58m196o227o834l457l827
280a4475n086Q8P543N539K108M625N772Q79k12L660K959l14j398k634k502m23
296F129j716m879k366L98m452n245J903L705k046k306J335Q00q31K414K847L241
312a069L869K244J444O146P056J139o72J84m750r804p395l829m642n709j996J898
328a5886L966M181J595J155K130k122n827q51M376L532L261O461Q604N309L200
343B3084J550m37l579p993r817p070m163n391l883J441L124R3P97L283K958j08
$$ y = [-3896, 8670, 14688, 7965, 3558, 5548, 3852, -106, 1889, 7673, 11550, 15892, 19145, 20217, 20050, 15291, 3768, -7883, -15775, -22775, -28286, -26767, -19594, -13360, -7194, 1269, 10112, 14154, 12983, 9827, 8197, 3372, -2634, -4193, 799, 5632, 7681, 9299, 10824, 10066, 5870, -357, -7191, -10648, -14475, -19561, -19473, -11930, -6391, -4283, 342, 6114, 6993, 6781, 10441, 13400, 13086, 11688, 9054, 6552, 6129, 4413, -466, -2832, -2434, -6886, -12131, -10228, -6523, -8569, -10875, -9540, -8740, -9571, -7157, -4310, -1069, 2800, 5044, 6488, 12634, 19690, 20829, 20157, 20341, 15591, 5787, -1608, -5437, -10079, -15788, -17784, -15886, -11920, -7739, -6144, -4989, -2859, -4981, -10808, -11659, -7283, -3751, -490, 5971, 14575, 19884, 23084, 24634, 24197, 20618, 12625, 2808, -4262, -8425, -13816, -17699, -16258, -13134, -13041, -12244, -8961, -6003, -6111]
359f111j247n99J032L378K778M057P820O202J776J807K134j751n469n597m837
374E373o813o417m554k305p50q81k401P76M476J879r3M038O256K135J189L684
390E592M457K627J628J371J664J894j041l289j579k302p189q423m378m539o511
405b0018m468M68K295K320L883M652O211N547K391K117L484J627o49J203M052
420A5115J625l8J753J404k431n517o348o166o676p610p694k810J368M00J110N746
436a6769P565M286K881M126L640J778J108J052K510L102R88R22K251J069m088
451A6421n742l726n358q395o494m083l213j911j44J839L870M797L415M261N023
466E60L148J324L603M340Q76q19J652K051j78k182k413k455k430n176o584l660
$$ y = [-6111, -7358, -7957, -6925, -3547, -769, 3288, 11108, 17310, 19086, 20893, 23027, 21276, 15807, 10210, 5373, -1440, -7857, -12411, -14716, -15466, -16347, -18748, -17972, -13496, -11617, -11710, -7672, -1416, 719, 1908, 5592, 10049, 12676, 14304, 15675, 17339, 19233, 18192, 14903, 13324, 11022, 3833, -4590, -8968, -13507, -20018, -24486, -24018, -21723, -19403, -15520, -10868, -4657, 890, 3281, 5398, 8882, 10509, 9860, 11063, 15115, 16740, 16702, 18455, 19859, 17428, 11911, 5563, -603, -7279, -14889, -22583, -25393, -24025, -23625, -22515, -16769, -9204, -4918, -2037, 2089, 5729, 7507, 8615, 9667, 12177, 15279, 16267, 17189, 19440, 20509, 16421, 10679, 6953, 1595, -6800, -13294, -17377, -20590, -22501, -22645, -20806, -16936, -12139, -8724, -4463, 560, 3708, 5032, 8635, 12975, 13851, 13032, 14684, 16735, 16557, 14375, 11962, 9507, 7077, 1901, -4683, -8343]
482h343k017m729m729l60J569P90K310M942O056N182L274K902M225K767m43j456
498A1940M13L02k352j735R36r69l679k726k845m266m748l780k528j433r44r6L667
515a4843O470M873L321N352N431J917o40M91Q56j564k404k166j26J49j494k746
531B877j372j544m678n330k168j928k481n65J894L380L925M456M728M818L609
546I621J066P40J979J36k356j769k42k150l124j860n19j901k811l174k023j088
562i475k413k342R8K423J382R10M360N580L539K451L185K572J051n74j037r45
578A0765j645l017m348j333r88k772k017M63q05k284j306p9l52l90M12J390L141
595e165L616K577L808N358K212l49R1L36k322m291k747k080k019k036j835k36
$$ y = [-8343, -10360, -15089, -19818, -20178, -18609, -17819, -15509, -10567, -4511, 671, 3945, 6847, 11072, 13839, 13396, 11940, 12353, 12655, 10303, 8568, 9504, 8535, 4856, 2130, -715, -4981, -9729, -13509, -16037, -17470, -18414, -18510, -14843, -8373, -3500, -179, 5173, 10604, 12521, 11881, 12372, 13228, 11664, 9260, 7094, 6968, 7117, 5623, 2877, 1505, -39, -4717, -10047, -12215, -14143, -16624, -17189, -15295, -11915, -7990, -3534, 1194, 6012, 9621, 10687, 11427, 13406, 13542, 11186, 9417, 9175, 7025, 3901, 2041, 1522, -379, -3190, -6364, -8387, -9475, -11888, -14230, -14132, -11709, -10327, -9417, -5057, 523, 4062, 6513, 9698, 12270, 13321, 12747, 11710, 10765, 9120, 6103, 1755, 422, -566, -3338, -5355, -4892, -5697, -7981, -9287, -9366, -9718, -10108, -9696, -8306, -5165, -1549, 1028, 4836, 10194, 12406, 12057, 12148, 12484, 10162, 5871, 3124, 1044, -975, -3011, -4846, -5082]
611e082J099n79k096l2P42j221j217N42K833J473J813L539L724K745J694Q18O30
628A1425q38l326l025j569k248l274k502O13l71j518J76R95M69o06n8O47K009
645c001J074K77J606L918J847M20J718K619k85k046j313j710k830l152l246j684
661e788o02j161j570J176J949L10J27K430K034L03J29J614J929R24R31J074J907
678G716J528o83q02J21j567m229l563j621k436k809j408L29R28Q99J244J806K764
695a783J495j40J241J850P48l68J297K158R40l58R36pr86k441k672k283k280l309
713e962k674k99P50q55M98K491K484J106J222K233J679O44R6L32J778P49r17R7
731E452J419p8k526j493p46k091l291k119j392n96r17k08J165J918J444R02K745
$$ y = [-5082, -3983, -4562, -6658, -6690, -5948, -7169, -8386, -7844, -5011, -3538, -1725, 1814, 5538, 8283, 9977, 10795, 11425, 10587, 7261, 4236, 2667, 419, -2855, -5357, -4744, -5115, -6633, -6457, -5462, -4993, -5599, -5657, -5010, -3001, -1927, -1650, -44, 3874, 5721, 6141, 7859, 10478, 10193, 8147, 6834, 5124, 2294, -858, -4104, -5788, -6390, -7551, -9121, -7945, -5996, -5686, -5559, -3129, -1095, -792, -663, 951, 2880, 3804, 4735, 5809, 7716, 9244, 8561, 7759, 7880, 6313, 2084, -1479, -3100, -5536, -8345, -9753, -9424, -8496, -7597, -6353, -4547, -1783, -288, -428, 813, 2663, 3411, 3043, 4340, 6498, 7438, 7080, 8016, 8009, 7023, 4582, 1910, -373, -2653, -5962, -8636, -8935, -8185, -9040, -8542, -6051, -3567, -2461, -1239, 994, 2673, 3317, 3413, 3745, 5523, 6272, 5355, 5452, 6871, 6793, 4267, 2774, 2028, -63, -3354, -5473, -6865, -7461, -8378, -8586, -7421, -5503, -4059, -3157, -412]
748d12L389P61K47J342J075o81q85J94L93q28q97j387m38q70k251k674p21n41
766e184k683j254J178J318O06J585K687L132J781J131J440J497M22j761m44L48
782E799q73j777r19J01j075k200j305j097j226k052j624l12P23Q9P33K734L296
799i85J948J335K840J959K52n45J74p4q35j413j419l36q21j992j862j92q72k676
817e514j532k55O5q92L05J612J947K123J783K465K724J526P7P68Q57m23k250p63
835D623m60j438j763j659q92p62j403j532k96j47o17r84P69K059P16O07K637K405
853A863J479J391J491Q19O41j363n97q92j017k245k209j71r24j872p40Q71l70
870c845j188o68N45M66L82N80J342K209J895J096J780K198N45r84k09l17j499
$$ y = [-412, 2977, 3738, 3985, 5327, 6402, 5721, 4836, 5030, 5423, 4595, 3698, 2311, 1873, 1003, -1248, -3922, -4643, -5184, -7867, -9121, -7943, -6625, -6019, -4434, -1747, 1385, 3166, 4297, 5737, 7234, 7656, 5895, 5451, 5799, 4926, 3149, 2230, 2331, 1256, -944, -2249, -3346, -4572, -6624, -8248, -8560, -7837, -7748, -7015, -4281, -985, 963, 2298, 5138, 7097, 7349, 6804, 6978, 6904, 6069, 4656, 3237, 2901, 2080, 88, -1774, -1966, -2838, -5514, -7046, -7301, -7236, -8128, -7823, -6211, -4264, -2141, -358, 2107, 4831, 6357, 6434, 7202, 8059, 7636, 5386, 4623, 4163, 2725, 962, -697, -1589, -2351, -3754, -5286, -5582, -5729, -6346, -7330, -6561, -4502, -3786, -3179, -542, 1863, 3342, 4733, 6224, 7043, 7684, 6321, 5724, 4832, 3815, 1570, -639, -810, -1734, -3606, -4346, -3475, -3845, -5033, -5701, -5156, -4690, -4308, -3728, -2386, -177, 1718, 2814, 4594, 6792, 7337, 6353, 6144, 5827, 4328]
887D328k631j368j047j074j756o28J50K22n04j029Q78J167o38J70J794J668Q38
904E40J134J821J565J387j16J5l3p04k098k031q39j406k348j146K6o45p93J66
922e505P27O99K88L43O92K265Q44K85J851J910L60K31P77R65l60j653r16j298
940B505j291k490j818p35n44j454m88Q30J077k34L38J663J602L11P59J180J459
957B670P30L14R11J247L81j382m35P5j552k433j657o66j510j972l65L71L34K11
975d728M81J402J174Q03L01J004J710J91K1Q86J089J69k87L94j21n80k292j404
993B13r09q17k181j177L99N4o55P00J494J093P92K93J410J145N32n5R18N19L46
1012D114p50m9N84n31j554j042n53j200j751j133l57k98l54kQ80J214R25O41J652
$$ y = [4328, 1697, 329, -718, -1792, -3548, -4176, -4026, -3804, -4308, -5337, -4459, -3292, -3930, -3760, -1966, -298, 540, 1674, 3495, 5060, 6447, 6331, 6346, 6313, 5609, 3511, 1480, 641, -765, -3113, -4259, -4233, -4878, -5671, -5505, -4778, -4079, -3791, -3448, -2756, -491, 353, 638, 2489, 4399, 4759, 4990, 5767, 6732, 6372, 4719, 3803, 2505, 1214, -1276, -3094, -3829, -4373, -5827, -6315, -5485, -4408, -4642, -4304, -2641, -1039, -728, 31, 1211, 2670, 3400, 3714, 4625, 5872, 6253, 4871, 4436, 4511, 2959, 526, -1131, -1797, -3307, -5279, -5644, -5273, -4939, -4728, -4247, -2845, -1671, -868, -567, 437, 2147, 2338, 2359, 3245, 4334, 4503, 4216, 4610, 4489, 3909, 1617, 213, -696, -1513, -3694, -4871, -4472, -4418, -5073, -4373, -2879, -1786, -994, -701, 709, 1854, 2386, 2331, 3249, 3768, 4114, 3364, 3315, 3899, 3368, 1814, 772, 219, -981, -2732, -3865, -4222, -4520, -4874, -4876, -3996, -2782, -1857, -1216, 436]
1031D36J372N57J66J007O34m17l22J59j27j77j372n99m33p97j978j312j18m30
1049c751j440k58J113O03K29J153J728J332J276K9J254J117j93o91J81J51o95
1066C138j035k17k35q64j391j140m67r62j215p05J94O94j91O26J685J560Q71R95
1084A341J295J229o6j90K26m9k05r90p01j79l04j343q55k40o71j496o60K91k14
1103c781m29J22J201J200Q42R19J252J485M77j81K98N59n97j068M0n39n77j060
1121A63m53l35l93j229l82k94k1n93r9Q93R78j9J200J291J365L95L59Q59K17l06
1141C596q53n46j18o79j500p56Mo84j077l44O08m84k44o2N39O89M50Q7J495J177
1161A298O36M64J058J028n94q54L22l38j351j185o33o19o63j043o00M12J63o87
$$ y = [436, 1808, 2365, 2531, 3538, 4172, 3755, 3433, 3592, 3465, 3288, 1916, 1317, 884, 87, -1891, -3203, -3321, -3751, -5191, -5449, -4336, -3733, -3504, -2351, -623, 709, 1985, 2014, 3268, 4385, 4192, 3501, 3682, 3833, 3138, 2103, 1886, 1651, 787, -604, -1744, -2211, -3173, -4388, -5093, -4899, -4205, -4396, -3770, -2085, -525, 346, 1341, 2636, 3865, 3799, 3609, 3835, 3786, 3581, 2591, 1890, 1711, 1407, 64, -791, -1031, -1702, -3198, -3858, -3567, -3781, -4210, -4088, -2887, -1687, -845, 74, 1326, 2811, 3288, 3107, 3405, 3964, 3367, 2299, 2339, 1800, 1223, 163, -290, -625, -1018, -2247, -2629, -2923, -2944, -3537, -3636, -2743, -1765, -1784, -584, 707, 2072, 2467, 2826, 3685, 3902, 3596, 2743, 2197, 2079, 1400, -100, -856, -852, -1536, -2613, -2957, -2349, -2833, -3077, -3139, -2600, -1911, -1461, -1374, 121, 1298, 1934, 2398, 3456, 4484, 3890, 3036, 3358, 3020, 1669, 484, -149, -768, -1431, -2474, -3074, -2662, -2499, -3186]
1179c186l05R07N23m09M98J329R14N21P16J340P98J90J12l08M0o53j110r82o42
1198B93j123j300l88J09k71r22M49N14RQ1K13Q56J274J07M65J054J339L39R7L00
1218C495L38m84r35o21m24j083j526o88k53p3m29m73P03N20l78J67Q86N27R4M25
1238b12J169O90N06j12N59P23j18r07k00j56j119j381n77j62o24j048kN40M97
1257a934l07J20J159O62J35J94R96O22j60pR70L54l85R4j55l42o01j424o47l25
1277i81o45j154l00N00j62pL81J301L36O67K39P56O92J37k92P12N09p2n77O16
1297B656j06o93j054n84l49j098r20p16K29n27J1j84J423N89J39Q20P26R15j21
1316A156P5R74M50k00m63L09J69j41r74k69o0r82j416n81k38n74n91L2Q07N56
$$ y = [-3186, -3491, -2584, -2061, -2470, -1972, -643, 271, 792, 1508, 2848, 3646, 3836, 3948, 3640, 3680, 3027, 1917, 935, 293, -830, -2130, -2518, -2409, -2680, -3602, -3153, -2639, -2630, -2549, -2336, -1480, -206, -99, 366, 1420, 2759, 3098, 3195, 3495, 3833, 3349, 2414, 1793, 1369, 286, -1240, -1928, -2181, -2254, -2683, -3156, -2453, -1933, -2311, -2144, -1258, -731, -637, -212, 957, 1647, 2153, 2041, 2600, 3323, 3205, 2298, 2098, 1942, 823, -558, -1135, -1297, -1921, -2969, -2971, -2431, -1934, -2241, -2121, -962, -300, -165, 29, 1025, 1647, 1487, 1480, 2450, 2804, 2419, 2513, 2358, 2016, 1415, -9, -656, -981, -1626, -2780, -3080, -2580, -2742, -2749, -2368, -1067, -731, -64, 175, 931, 1623, 1760, 1468, 2180, 2689, 2617, 2040, 2656, 2550, 1857, 803, 219, -130, -1228, -2148, -2864, -2635, -3162, -3151, -3335, -1912, -1323, -1184, -364, 362, 1277, 1156, 1231, 2205, 2655, 2455, 1992, 2301, 2470, 2329, 1355, 1086, 1026, 44, -1372, -1953, -2191, -2765, -3356, -3324, -2517, -1961]
1336a961J29M25J170J115M08k87R11K79k03k01J92K45l12m81j59Q2m88j111n96
1355h43k70n46q52k59J67L10k03M64J019J056K96N58R35M04l50k38J31J31l15
1374A595p62R0P3l70o01m60m1m88j048k26K90k14J8o1R59Q04L04M44J250O09j63
1395B002l00L69K44j056k59k32N0n24m75l91k6m00o53m64N96m56k63r0R64K89
1415a075N2Q07J312O07L26O5L00M62n56p23m76On19q55j96k2k35r41l22P53k79
1436a509o32r8N66K54m6N35Q39J010N67J50P56K50j31n50j00J36r08q00l54k72
1456c37l94o25j32L08j30l45l47N03J61l95M50N28Q21L38N02N51O32q4j5j6J07
1477B081n27q74l80k49k93r64q6J90j61o4j15M13j22m6j58P99K87nK77Q41M29
$$ y = [-1961, -1832, -1407, -237, 878, 1286, 999, 1910, 2189, 1986, 1785, 1977, 2222, 1910, 1429, 1270, 1352, 864, -247, -843, -1113, -1659, -2511, -2770, -2603, -2293, -2496, -2032, -1013, 43, 339, 897, 1832, 2236, 1886, 1648, 1779, 1910, 1595, 833, 923, 996, 626, 25, -435, -476, -964, -2012, -2238, -1948, -2162, -2144, -2205, -1246, -442, -138, 306, 1556, 2165, 2002, 1702, 2071, 2315, 1259, 1000, 768, 818, 294, -181, -572, -598, -998, -1651, -2115, -1519, -1975, -2238, -2328, -1364, -1075, -1023, -216, 1096, 1703, 2029, 2094, 2394, 2856, 2300, 1577, 1101, 1107, 588, -267, -463, -485, -720, -1661, -1983, -1230, -1509, -2141, -2239, -1673, -1419, -1465, -930, -91, 919, 1486, 1636, 2392, 2642, 2511, 1961, 1861, 1997, 1089, 289, -65, -337, -731, -1356, -1488, -1180, -1310, -1655, -2002, -1499, -1338, -1733, -1283, -755, 66, 404, 906, 1457, 2089, 2005, 1990, 1974, 2081, 1554, 680, 300, 51, -242, -1206, -1292, -1102, -1263, -1327, -1442, -1029, -1151, -1197, -1355, -556, -269, -274, 3, 844, 1273]
1498A273P1J25N50j4m31p29j34k22p73q99j17J82j18m91N29K95L3k17M35K96K59
1519i7m1M63K78K57M09j18K24O18l03m36l23n0r37p35k45l95k95k00K42N01j39
1540a322J92L48N04M49j57K82N14J70J30m6N57K90n26O2j8k8n45j025m90j46n38
1561a343o02p6K08P6k3O42N40J51K77K53M97K38k7J92K50J50j70J58L51l24k25
1582A193o98k17l94n08p96k39J26k28m99P48K57L94N40J79M94M43k24N5N09q4
1602A051k23M9K55J78j29l40j61j86m43p54m30J96n85k57K97J22L91K38N02N21
1622B92L63j7J8N87q8l08n7l5J52m5k00k62K29o25m78j24r2l06n27l6N39k2J43
1645h99L45N71N27R7m8P52K09l27m80J11J95l09o80K37j6n18j00j77k07j02n17
$$ y = [1273, 1344, 1469, 2019, 2005, 1574, 845, 711, 489, -284, -1183, -1300, -1118, -1236, -1727, -1198, -903, -870, -1087, -652, -356, -97, -138, 325, 603, 860, 1269, 1151, 1375, 1993, 1690, 1254, 931, 881, -56, -791, -1036, -1431, -1726, -1926, -1684, -1183, -1322, -1130, -782, -278, 171, 14, 296, 810, 980, 1110, 1064, 1621, 1911, 1385, 1447, 1429, 1401, 856, -169, -659, -805, -1343, -1945, -2021, -1813, -1737, -1760, -1118, -578, -427, -150, 103, 600, 838, 811, 1003, 1253, 1403, 1233, 1391, 1742, 1418, 1193, 495, 278, -116, -624, -1420, -1659, -1533, -1761, -2260, -1512, -1255, -861, -321, -142, 352, 795, 571, 626, 1135, 1051, 828, 877, 1132, 1310, 1181, 841, 680, 494, 51, -703, -1133, -937, -1522, -1779, -1482, -1360, -969, -731, -229, 292, 655, 638, 656, 1243, 1155, 847, 790, 755, 907, 862, 662, 400, 629, 4, -474, -598, -690, -996, -1523, -1559, -1020, -1042, -899, -554, 17, 544, 641, 593, 1345, 1554, 1227, 747, 858, 1053, 744, 64, 301, 285, -233, -333, -510, -717, -819, -1336]
1666a336J69k55K05NKR09M07K21K78N24L63j14j19R5L35o91m80j53K28o39p00
1687g46J01J81k40l85j93K00j13p06O28J69L62M49L93O30M75L0k2N48j67M7r66
1708F75p9K65o62m76K03m14N6n82L4L21j16n31k9N50N9r6J41Q23L63K89K20N23
1730A537J57l31n47M55k90q63n0q0j39l59n49L76L46j20n87M8M25m9j88J46L44
1751c18M28M2K37L45L98Pp0J37j06n20n45J42m58m25l14L93k78J89j30K37K75
1772c34p6j05J29L86n8J40J58N38L54L4k3lO1m60m83j60n2l34r20L9K40k50M3
1795a136K07O5K88J06J2N13J86k63M51J06N57j13j22M06J10m32k29j05k42l04
1815F1q21p0j24K1m72L20mL64R5R8L53L99k83P6N20J91q9J42N8N04k38j01N6J49
$$ y = [-1336, -1167, -1422, -1217, -1212, -1210, -301, 106, 327, 605, 1129, 1492, 1378, 1259, 1354, 1689, 998, 518, 365, 593, -46, -746, -645, -464, -704, -1089, -1282, -1082, -1195, -1901, -1273, -1104, -742, -293, 100, 730, 1205, 1235, 1213, 1761, 1594, 1641, 675, 596, 861, 199, -277, -74, -488, -432, -1014, -980, -659, -775, -1306, -1335, -785, -726, -822, -681, 142, 505, 794, 1014, 1537, 1694, 1363, 816, 1271, 981, 118, 68, -12, -151, -510, -1059, -683, -337, -457, -1044, -996, -571, -620, -808, -662, -318, 110, 152, 389, 734, 1132, 1139, 1069, 1206, 1100, 580, 35, 177, -281, -706, -1020, -627, -905, -716, -846, -609, -334, -410, -515, -386, 0, -58, 82, 240, 778, 1132, 1166, 1143, 1140, 1201, 741, 258, 98, 46, -288, -1208, -1169, -929, -1179, -1136, -929, -864, -576, -470, -458, 55, 241, -22, 429, 535, 1092, 979, 857, 1263, 1373, 941, 712, 607, 365, 61, -760, -830, -954, -933, -1405, -1085, -1089, -725, -630, -532, -179, 220, -63, 13, 533, 724, 635, 777, 835, 1339, 1101, 1000, 1056, 1205]
1839A205n57o03l90j05k01n59RL66p6l5J86M51K66k4J9L16MJ7p1M38K00l11M1
1862E86p5O18p48j70P6m38Q4q89K6K34k60j00K22K85L41j20L79N01j8k62N9L93
1884G24l19k25N6M79J98q34J50l11K48l00n67j16K07m37q1M00R1J03P8M29L94
1905C67L59j69q4L05J98m18k66K64k01K19m91K5j4l80k66o2J77k82n79R8L73J18
1927g09qK19N65M35j15K09L24L19m85l0j1j39k79O4q8l70K18l99o0k28L1k08q6
1950h31p0Q2j77J39N36M95m5N87j46R5M3%L24l00j83m8j27j67l91J23M0j17k26
1973c64l46K54J58k97l93K99K69j72J58P27J40L22l08R0K30J22j46k10j88l8n75
1994b68j17R5K67m63j11N1L57j25k01J48P2n0k04M91K91P7q3R5J62L38l33R1j80
$$ y = [1205, 648, 45, -345, -450, -651, -1210, -1201, -835, -911, -946, -760, -309, -43, -67, -48, 268, 272, 289, 218, 656, 856, 545, 586, 511, 1129, 381, 211, 287, -151, -67, -956, -930, -696, -956, -1056, -834, -549, -208, -328, 51, 552, 534, 272, 331, 724, 405, 180, 236, 715, 913, 79, 229, -82, 166, -134, -701, -817, -610, -1047, -1128, -728, -637, -534, -456, -27, 367, 726, 557, 473, 778, 976, 558, 292, 556, 355, 574, 83, 108, 94, -286, -552, -614, -437, -719, -1298, -1200, -827, -709, -717, -498, 67, 502, 387, 596, 920, 1239, 754, 724, 713, 574, 295, 359, 271, -99, 119, -280, -340, -568, -537, -745, -831, -901, -819, -996, -857, -321, 174, 129, 716, 570, 665, 708, 708, 1032, 732, 549, 501, 374, 207, -184, -61, -21, -138, -364, -710, -456, -298, -595, -988, -689, -420, -592, -434, 293, 433, 755, 447, 537, 767, 889, 743, 533, 345, 307, -268, -385, -290, -23, -486, -597, -546, -189, -314, -515, -367, -295, -345, -549, -58, 233, 310, 227, 322, 484, 822, 489, 580, 400]
2017D00k24k11j57l09J45k34j28J98L34m82L1K16K07K43l09J55M09J56j36J39
2037D43K97K20k16l46J48k4m01l18p9r0j70l39NL34L7K18k86L31J12k34K61K01
2059A04k2K6j36Q74j21k57J62K40k02j72k89R2j72l62o75K71J31l4k03J31L42
2080b72qk47N82K02l63%k0P06n5r2J74J89j10p1j43r5q9k66k04J2l31n8n27M37
2104f49M3J82j48PP86k16k8J26m6K67rk22L26J7p9L9N2j96K00m57l52M84n60j49
2128e82L20j44r1L11J32Q2K27k54M5M36j68j46k09O60k27m77M09Q6k78j08l36
2149c12K97r0l14j13k18K16m2j10J59N96j20J14L80q4K59l10j42M18k18l7j04
2170B25K54k99O3l25J33j88L2k88lk4k77p5J36K11J90K43O0N04j75k59L64J51
$$ y = [400, 176, -35, -192, -501, -356, -590, -718, -520, -186, -668, -637, -421, -214, 29, -280, -125, 284, 440, 304, 443, 740, 960, 744, 398, 546, 522, 121, -197, -276, -366, -536, -875, -870, -536, -499, -281, -567, -236, -124, -358, -97, 104, 82, 108, -28, 846, 725, 468, 630, 870, 668, 496, 207, 299, 127, -235, -910, -639, -508, -542, -745, -614, -272, -280, -527, 55, 257, -106, -106, -126, 580, 525, 433, 607, 796, 686, 615, 472, 377, 288, 22, -182, -170, -501, -559, -1086, -649, -606, -424, -572, -565, 221, 5, -23, 103, 57, 324, 315, 93, 419, 436, 357, 396, 448, 252, 452, -5, -357, 127, -433, -582, -262, -406, -497, -186, -54, 28, 255, 1, 46, 482, 314, 168, -41, 619, 392, -85, 324, 410, 132, 24, -312, -15, -105, -419, -532, -750, -534, -576, -686, -527, 69, -51, 63, 443, 359, 618, 308, 166, 584, 366, 329, 225, 479, 180, 243, -82, 51, -137, -105, -393, -396, -420, -697, -772, -636, -425, -235, 8, 68, 572, 397, 138, 502, 653]
2192F53K53k26k99L9j69Q4j29j77J12k63j80J51j86J1m36K55o7K47j85L32K73
2213I3J47J18P5N8rrj72K38O5k11l45J79o0j76j04J17m03K78k81J38j05k66J31
2236e04L30K33k12j93O99J34k9M8k56K95m29K44j05K2j73l90j71K86L77m40k43
2257d77m5L91j9R4j57K72j35R5N8M2L71j37k22N33j95k38K1O0j38l70j62K88K56
2280A86o40N1J9M23k17J5J23N5j20j51L81M57n06K67K00K4k34j34J01N3m4m09
2302a00l94L43k41q6k68M88j1J5j92J87J77j50k28O53l9J41j99K12K10K95l68
2323D45o2K18n4n54m4P3j38l18L20jo7l52N6J15J66K17l78K46L86k13k16M45r6
2346A94J18K05k45J99k9l27j52K58k10k25O4j05Q7r8j58kL99j36k21R2K47O6p2
$$ y = [653, 906, 680, 381, 420, 251, 335, 206, 29, 141, -122, -302, -151, -337, -326, -762, -507, -574, -327, -512, -180, 93, 240, 358, 433, 491, 482, 473, 301, 539, 604, 393, 48, 227, 167, -9, -113, 4, -399, -121, -402, -264, -369, -635, -504, -174, 59, -153, -346, 353, 487, 458, 506, 250, 545, 116, 360, 255, 277, 104, -286, -457, -171, 206, -234, -477, -522, -131, -150, -56, -213, 59, -76, 19, 77, 119, 490, 353, 131, 664, 469, 231, 252, 312, 174, -196, -358, -70, 186, -454, -403, -384, 39, -178, -163, -40, 15, -105, -256, 125, 582, 76, 343, 543, 567, 333, 199, 300, 353, 309, -100, -494, -151, -392, -478, -746, -258, -269, -254, -446, -259, -82, -232, -460, 193, 154, 295, 96, 308, 518, 813, 445, 383, 601, 547, -7, -51, 22, -116, -434, -114, -115, -182, -534, -478, -363, -197, 20, -358, -112, 274, 61, -155, 290, 194, 312, 517, 272, 471, 442, 115, -37, 221, 11, -214, -150, -255, -168, -266, -424, -426, -27, -163, -384, -292, -45, 21, -51]
2369e1J11K92n4j41Q9J92j50k93K03N3k73k67K78k07l05K76l32M51J53k93R2J71
2391eQ2O5J39k44K04P0k65J77J32k08R4k84J21O0j13l43K15o6q2k23MJ52k2J19
2415b21K25L18k57m6N8K83k13R1P3m4L7n0j65k2j7l8j03J10k7l64j31K68M5o5
2439b55j7K36k5j01L6K45r3N56m67K60L46n02P7m6Q1l9j23N4k34o8j10l49J41
2462c97L03n45L75o9K71P8l71K47K22J98o4Ok0K9j41N3K52j52n3k48j61R6K23
2485A32n41K02N2l00Q4R9K46j16j56J97L27j51J31J08Qj40J3k22K25j76k9n8L0
2508c5j8Q6p1n0q8j15K36k69j0L38j71J76k2N5j57M4M99k44k40o6K96Jk86j40
2532b51M75j53j12j91J60J15k53k13L32K06l20n7M24l63J35J21J75q8K60l46K31
$$ y = [-51, 60, 352, 298, 157, 246, 438, 288, -5, 198, 251, -22, -289, -11, -218, -523, -247, -579, -128, 25, -268, -176, -5, 77, 142, 281, 37, 241, 311, 46, 223, 355, 147, 241, -43, 78, 138, 25, -318, -103, -169, -251, -474, -470, -318, -340, -221, 4, 322, 65, 19, 77, 360, 147, 238, 311, 267, 304, 254, 89, 67, 50, 12, -91, 19, -8, -372, -503, -235, -190, -255, -272, -36, -61, -162, -126, 119, 26, 582, 115, 375, 721, 219, 296, 250, 331, 292, 169, 223, -11, -79, -189, -538, -397, -94, -639, -264, -333, -62, 16, -355, -108, 114, 312, 248, 254, 234, 263, 122, 175, 427, 275, 222, -26, -187, -91, 132, -409, -207, -155, -455, -371, -272, -26, -142, -298, -101, 226, 75, 206, 314, 322, 182, 195, -27, 198, 22, -7, -65, -35, -53, 33, -38, -88, -176, -291, -55, -324, -334, 4, -167, 9, -13, 42, -115, -71, 428, 184, -56, -122, 174, 175, -111, -251, 224, 71, -41, -232, -72, 43, -210, -423, -91, 115, -205, -262, 162, -201, -66, 55, 230, 142, 402, 56, 287]
2553B87J44J18l02k73K38l17j76N7K16k23p9l4P5J0J17k4KR3m4N4K91J06j66j08
2577F2M1K60Ll27L06j5k67j61k57M88k27l51R4k6L15j50J01J07k3m00M69n6k6
2600d0J55l86L51L18j27j57R8J7l7j07R4j17j81l3L5j18J79j06k67M08Ql8L7j38
2624a52K36k72jM29k42J56K2j43K06K1j86R3j93M2j81K5R7p8O0j98L05o1j45M98
2648C38k56J08R0r2k2Q2Q7m07J62P1k04N9J9Q2m9j11m40K22n7J30j05JJ18J08
2672f6J99j49J12J82j17m8o0J64J46m54J72J46k31K29j7j24l30J16J5o5k2k27
2694d29L96j66pK34n8m1L7kK10L5n6j62J83j4n0k33R5K33P8m19J20m7J14l92K6
2719c15K8k7J24j60K41l5P0j1J28j56M25%j45mjj93K07l00L10j67J75p0l08K42
$$ y = [287, 431, 549, 247, -26, 212, -105, -281, -224, -8, -231, -310, -344, -269, -259, -142, -166, -164, -71, -115, -61, 230, 336, 170, 62, 103, 363, 366, 39, 345, 330, 63, -98, -355, 133, -94, -445, -351, -377, -62, -212, -111, -4, -27, -427, 42, -14, -40, 115, -271, 80, 398, 271, 114, 212, 229, 192, 85, 179, 62, -119, -152, -117, -235, -56, -162, -429, -21, -13, -51, -14, -152, 84, -188, -189, 240, -2, 154, 176, 33, 239, 260, 74, 167, -26, 16, -165, -140, -43, -121, -61, -259, 46, -15, -160, 338, 82, 190, 280, 188, 166, 248, 335, -72, 90, 161, -43, 16, 35, 117, 68, -43, -483, -261, -318, -188, -293, -292, -174, -66, 133, -16, 96, 278, 161, 113, 53, 217, 363, -91, 81, 227, -4, 225, 208, 84, -246, -130, -115, -180, -202, -429, -33, -199, -206, 28, -30, -71, -34, -36, 174, 209, 153, -9, 174, 160, 110, -123, -28, 205, 283, -136, -16, -63, 51, -341, -315, -287, -314, -190, -350, -109, -144, -74, -85, 43, -113, 312, 312, 167, 163, 162, -31, 176, -124, 186, 19, 194, 124, -184, 58]
2743E8j99r7J74j98n2L28K2j11L0j95J74K37l5K74l88l7n5J2J48o4n9l4n5L08
2767A86j42j33K46O3l69OJ21J90k79k82L80j0nQ0K30k70L4k80L75k59J66j12k2
2790h6n0J50K0j55J52l12K50l01K95M7j61M0K63j29J50L3j15K26k96L3J82k18
2812A8l16N38k08k00j2r3J64j56M6J54j72R5K0j0J9pQJ98l46J66L93k38J32P6
2836B69J16m14j35rJ89N7N1l31l8M33l25J03j41P3j12O3m3J96q9j53R5M20m0j81
2860E4J7L23l77o9M02Pk45k40Q4k4M8j86J53k8L17l11l9m2L89p2l33J79q8K83
2884B02l67J90K87j53k29R5K33m09J81O4j26K29l45j6R2M6K5p7q9J38O5j22L51
2907B65j29j25J13j38R6j3jj07J72J30j27l42K1L35j91k95M15k57r2L0J73k9R
$$ y = [58, -141, -238, -64, -262, -314, 14, 36, -75, -45, -240, -66, 171, 136, 410, 22, -15, -70, -58, 90, 26, -33, -67, -122, 186, 44, -89, 157, 220, -149, -143, -22, 168, -111, -393, -13, -23, -28, 52, 282, 12, 46, -234, 141, -118, 48, -64, -86, -136, 14, 34, -121, 31, -281, -31, -332, -37, 10, -151, -111, 152, 23, 173, 206, 91, 317, 21, 54, 236, 18, -298, 240, 32, -168, -180, -273, -109, -265, -219, -65, -237, -142, -122, -132, -113, -120, -112, 86, -260, -94, 299, 61, 193, 269, 385, -29, -164, -173, 16, 73, 124, -207, -245, 188, -137, -34, -175, -102, -214, -151, -194, 2, -87, -240, -145, 275, 235, 54, 71, 394, 17, -52, 350, 357, 112, -128, -44, -68, -20, -206, -53, -81, 236, -75, -114, -156, 233, 161, -172, 7, -81, 202, -165, 25, 312, 159, -70, 25, 258, -151, 30, 94, -32, 197, -148, -164, -72, -26, -1, -78, -167, -29, 36, -86, 265, 136, 11, 124, -14, 82, 69, 68, -39, 133, 263, 136, -206, -185, 150, -41, -336, 79, -178, -270, -240, -67, -96, -87]
2930h7O2Q8P9jJ2J41k66Nm1J31J97k2m74j1M38k61m1k25%M52k39p9JM5l4k70K30
2957a70M63j50j2O8n1K6n5J03Q6l35p2K87k26L25l57J75J2j58k15J41o3J99j0
2980A1M4Q8k00J05r2o6j04L77R8r8l29Q3J22O9N2j42j43K38j71K45k09j64J89
3003Cp1k08P8K57j5j78K83j42n1K6J65k46M06k71l94L50RK44j53j60J54nj96K5
3027i0L13K3k81J03K12j43N6j02O9j07Q9o0Q3k69L31k55k1P7l16J98Q8j0R6o3
3051B1l31M05j56J7j42K14J79j14r4k5j39K44r8p4M11k27j9r0K75k33j92L02n5
3074G9p6j4K11l51l5k3N5j02J46n6J05J03o0k90P12m10J33p2J20jk28p7p9K22
3098A2L6j47J48j67J52K44m35J22j86K91J64m77l2K83k2p9J90J56m03K31J12k72
$$ y = [-87, -25, 63, 142, 141, 153, 294, 28, 33, -8, 123, 320, 298, -176, -187, 251, -10, -51, -276, -276, 176, -63, -142, -141, -96, -130, -400, -170, 293, 143, 131, 199, 148, 174, 119, 222, 308, -27, -99, 188, -38, 287, -70, 105, 117, -41, -256, -115, -178, 21, 11, 55, 143, -57, 48, -44, -110, -214, 163, 261, 163, -166, -83, 39, 108, 160, 18, -125, 113, -58, 187, -22, -186, 3, -68, -276, -198, 59, 44, -134, 149, 7, -44, -18, 147, -99, 307, 36, -358, -8, 1, 245, 92, -68, 86, 81, -115, -90, 223, 246, -35, 68, 280, 137, 193, 91, 160, 53, 142, 82, 165, -104, 227, -28, -49, 28, -288, -90, -2, -12, 84, 21, -310, 95, -61, -44, -186, 28, 207, 93, -1, -26, -165, 79, -19, -93, 318, 91, 72, -18, 257, 24, -168, 134, 79, 3, -11, 200, -151, -186, -209, -154, -256, -110, -166, -61, 42, -18, -308, 404, -6, 127, 55, 175, 174, -54, -131, -210, 12, 48, -99, 49, -118, 34, 278, -157, -35, -221, 70, 234, -243, -275, 8, -14, -93, 97, 253, -150, 81, 193, -79]
3120g9Q4j45J78J25j78O3JJ16j21n16N79o3j08J19j16J66j94o1R6L44k78o1N4
3143EJ15o0M9j43j49L02p1K8j64K44j94k8J1l4P2l4k4J39j54J13j00L4Q6K6k60
3168a91K37j63K38l23R0K26k27K66j04lk13No1K39O3j42m25N47O6l9o5K56m15
3191a38L08l24K20j00L54p4k58j2m7PL01k22j12k4L0l9K10k71J08l5R6P3p1m5
3215f5n3M4j14R4J47K63j04j66K06k32j28n2j1J45M00l50j10L9Qj11J14l5r7J69
3239Aj3o2L5J05Q6Jk48O4J2L77k36j30K63k90K31l51J46N4p7J48k8j35M3J63l04
3264a45J36j4Q1J41l00J92L2j74J24N2k40J40Oj63q5K41mL2M1p1j50K62j26J30
3288A38q8M3j91L85k62K8K5q9J9k2P3j68Q3j46K50m9J68k21J75j56p0q5M89m46
$$ y = [-79, 5, -140, 38, 163, -15, 48, 49, 165, 44, -472, 107, 44, -64, 55, -61, 105, -89, -150, -54, 290, 12, -49, 5, 120, 60, 109, -34, -183, 119, 48, 76, -88, 156, -38, -66, -55, -89, -17, -51, -75, 64, -90, 23, -77, -43, 43, 69, -191, 46, -117, 121, -202, -112, 114, -113, 153, 49, 46, -167, -162, -223, 16, 79, -63, -488, 59, 125, 86, 21, 277, -138, 170, -154, 66, -34, 320, 246, -12, -24, -71, -64, 237, 15, -97, -121, -91, -130, 80, -191, -83, -118, -22, 51, -20, -65, -118, -74, -188, -94, 53, 316, 212, 46, 252, 20, -108, -160, -171, -26, 374, 24, -86, -47, -39, -150, -36, -71, -168, 1, -12, -74, -39, 66, 152, 153, -95, -31, -19, 358, 122, -8, 255, -35, 196, -155, -9, 45, -32, 116, 88, -47, -4, 159, -145, -9, -23, 58, 199, -101, 91, 123, -51, 73, 125, -115, 25, 31, -132, -217, 24, 20, 52, 93, 22, -128, 134, 8, 138, 50, 93, -98, 287, 25, 53, 78, -11, 8, -14, 59, -109, -26, -172, 78, 29, 197, -24, 151, -5, -75, -160, 329, -117]
3312a17q6M09n19L53j45O4K7L99l54K9p2j2k1K69J47k48j95p0L9K24j30K8J18
3335A37j30o6J14j93P0j01O5l1j03p4L08PJ19j40L4J67j56Ko3k02L89k93J26K59
3359B45m03K38q6r1J6Ok00M01j24K9n3j89J93o2J13j36J35J01p3J61k59L10j81
3382I1J29l81L15m1k75L48j81Lk03L88j69k1j85K60k82J75J01m06K78k24M66j54
3404C2K6k42K57j82Q4R5j68J38j31J26k28K85j06L65j61j29R1q4j38O9Q8j50k
$$ y = [-117, -203, 206, -313, 40, -105, -41, -14, 385, 31, 60, -12, -24, -45, 224, 371, 123, -72, -142, -103, 121, -9, 19, 137, 7, -59, 55, -138, -68, -169, -104, -135, -238, -312, -4, 3, 122, -18, 16, 183, 27, 29, -34, -236, 153, -140, -14, 245, -158, 80, -6, -97, -81, -75, -275, 126, 2, 31, -22, -211, -18, -80, 33, -103, 32, 133, 60, 221, -38, 272, 91, 220, -161, 154, 113, -162, 186, 5, 8, -195, 193, 24, 3, -182, 78, -204, -29, 72, -334, -56, -280, 186, 32, 58, -184, 73, -109, -25, 70, -98, 40, -91, 35, -193, 92, -14, 351, 190, 61, 152, 68, -70, -1, 87, -63, -65]
$$ [...]
8191b8
##END NTUPLES=NMR FID
##END=
