##TITLE=1H_SR-75-TFAA3-V2
 CDCl3
 8 sc, 
 13.7.2023
##JCAMPDX= 6.0         $$ Bruker NMR JCAMP-DX V2.0
##DATA TYPE= NMR FID
##DATA CLASS= NTUPLES
##ORIGIN= UXNMR, Bruker Analytische Messtechnik GmbH
##OWNER= root
$$ XWIN-NMR		Version 3.5
$$ Thu Jul 13 13:44:39 2023 Russian Standard Time (UT+4h)  she@DPX200
##.OBSERVE FREQUENCY= 200.13135
##.OBSERVE NUCLEUS= ^1H
##.DELAY= (6, 6)
##.ACQUISITION MODE= SIMULTANEOUS
##.ACQUISITION SCHEME= undefined
##.AVERAGES= 8
##.DIGITISER RES= 18
##SPECTROMETER/DATA SYSTEM= spect
##.PULSE SEQUENCE= zg30
##.SOLVENT NAME= CDCl3
##.SHIFT REFERENCE= (INTERNAL, CDCl3, 0, 15.7039)
##AUDIT TRAIL= $$ (NUMBER, WHEN, WHO, WHERE, WHAT)
$$ ##TITLE= Audit trail, XWIN-NMR		Version 3.5
$$ ##JCAMPDX= 5.01
$$ ##ORIGIN= Bruker BioSpin GmbH
$$ ##OWNER= she
$$ F:/spectra/data/she/nmr/H-F/1/audita.txt
$$ ##AUDIT TRAIL=  $$ (NUMBER, WHEN, WHO, WHERE, WHAT)
(   1,<2023-07-13 13:42:35.29 +0400>,<she>,<DPX200>,
      <created by zg, POWCHK disabled, PULCHK disabled
       configuration hash MD5:
       00 E9 B6 7A A2 85 ED C7 34 08 36 98 17 FE 4E 26
       data hash MD5: 16K
       B4 5A A6 89 31 C8 72 07 30 8B 61 68 AF B8 29 F4>)
$$ ##END=
$$ 
$$ hash MD5
$$ FD 68 9C FC B9 64 DB 04 E0 81 C9 E9 94 26 DA 1F
##$RELAX= 
##$RELAX= 
##$RELAX= 
##$RELAX= 
##$RELAX= 
##$RELAX= 
$$ Bruker specific parameters
$$ --------------------------
##$DU= <F:/spectra>
##$EXPNO= 1
##$NAME= <H-F>
##$PROCNO= 1
##$TYPE= <nmr>
##$USER= <she>
##$AMP= (0..31)
100 100 100 100 100 100 100 100 100 100 100 100 100 100 100 100 100 100 
100 100 100 100 100 100 100 100 100 100 100 100 100 100 
##$AQSEQ= 0
##$AQ_mod= 1
##$AUNM= <au_zg>
##$AUTOPOS= <>
##$BF1= 200.13
##$BF2= 200.13
##$BF3= 200.13
##$BF4= 200.13
##$BF5= 200.13
##$BF6= 200.13
##$BF7= 200.13
##$BF8= 200.13
##$BYTORDA= 1
##$CFDGTYP= 0
##$CFRGTYP= 5
##$CHEMSTR= <none>
##$CNST= (0..31)
1 1 145 1 1 1 1 1 1 1 1 1 1 1 1 1 1 1 1 1 1 1 1 1 1 1 1 1 1 1 1 1 
##$CPDPRG= <>
##$CPDPRG1= <>
##$CPDPRG2= <>
##$CPDPRG3= <>
##$CPDPRG4= <mlev>
##$CPDPRG5= <mlev>
##$CPDPRG6= <mlev>
##$CPDPRG7= <mlev>
##$CPDPRG8= <mlev>
##$CPDPRGB= <>
##$CPDPRGT= <>
##$D= (0..31)
0 1.2 0 0 0 0 0 0 0 0.06 0 0.03 0 0 0 0 0.0002 0 0 0 0 0 0 0 0 0 0 0 0 
0 0 0 
##$DATE= 1689241354
##$DBL= (0..7)
120 120 120 120 120 120 120 120 
##$DBP= (0..7)
150 150 150 150 150 150 150 150 
##$DBP07= 0
##$DBPNAM0= <>
##$DBPNAM1= <>
##$DBPNAM2= <>
##$DBPNAM3= <>
##$DBPNAM4= <>
##$DBPNAM5= <>
##$DBPNAM6= <>
##$DBPNAM7= <>
##$DBPOAL= (0..7)
0.5 0.5 0.5 0.5 0.5 0.5 0.5 0.5 
##$DBPOFFS= (0..7)
0 0 0 0 0 0 0 0 
##$DE= 6
##$DECBNUC= <off>
##$DECIM= 32
##$DECNUC= <off>
##$DECSTAT= 4
##$DIGMOD= 1
##$DIGTYP= 9
##$DL= (0..7)
0 120 120 120 120 120 120 120 
##$DP= (0..7)
150 150 150 150 150 150 150 150 
##$DP07= 0
##$DPNAME0= <>
##$DPNAME1= <>
##$DPNAME2= <>
##$DPNAME3= <>
##$DPNAME4= <>
##$DPNAME5= <>
##$DPNAME6= <>
##$DPNAME7= <>
##$DPOAL= (0..7)
0.5 0.5 0.5 0.5 0.5 0.5 0.5 0.5 
##$DPOFFS= (0..7)
0 0 0 0 0 0 0 0 
##$DQDMODE= 0
##$DR= 18
##$DS= 0
##$DSLIST= <SSSSSSSSSSSSSSS>
$$ [...]
##$SUBNAM2= <"">
##$SUBNAM3= <"">
##$SUBNAM4= <"">
##$SUBNAM5= <"">
##$SUBNAM6= <"">
##$SUBNAM7= <"">
##$SUBNAM8= <"">
##$SUBNAM9= <"">
##$SW= 18.05172834244
##$SWIBOX= (0..15)
0 0 2 0 0 0 0 0 0 0 0 0 0 0 0 0 
##$SW_h= 3612.71676300578
##$TD= 16384
##$TD0= 1
##$TE= 0
##$TE2= 300
##$TE3= 300
##$TEG= 300
##$TL= (0..7)
0 120 120 120 120 120 120 120 
##$TP= (0..7)
150 150 150 150 150 150 150 150 
##$TP07= 0
##$TPNAME0= <>
##$TPNAME1= <>
##$TPNAME2= <>
##$TPNAME3= <>
##$TPNAME4= <>
##$TPNAME5= <>
##$TPNAME6= <>
##$TPNAME7= <>
##$TPOAL= (0..7)
0.5 0.5 0.5 0.5 0.5 0.5 0.5 0.5 
##$TPOFFS= (0..7)
0 0 0 0 0 0 0 0 
##$TUNHIN= 0
##$TUNHOUT= 0
##$TUNXOUT= 0
##$USERA1= <user>
##$USERA2= <user>
##$USERA3= <user>
##$USERA4= <user>
##$USERA5= <user>
##$V9= 5
##$VALIST= <valist>
##$VCLIST= <CCCCCCCCCCCCCCC>
##$VD= 0
##$VDLIST= <DDDDDDDDDDDDDDD>
##$VPLIST= <PPPPPPPPPPPPPPP>
##$VTLIST= <TTTTTTTTTTTTTTT>
##$WBST= 1024
##$WBSW= 4
##$XGAIN= (0..3)
0 0 0 0 
##$XL= 0
##$YL= 0
##$YMAX_a= 379308
##$YMIN_a= -384535
##$ZGOPTNS= <>
##$ZL1= 120
##$ZL2= 120
##$ZL3= 120
##$ZL4= 120
##$ABSF1= 10
##$ABSF2= 0
##$ABSG= 5
##$ABSL= 3
##$ALPHA= 0
##$AQORDER= 0
##$ASSFAC= 0
##$ASSFACI= 0
##$ASSFACX= 0
##$ASSWID= 0
##$AUNMP= <proc_1d>
##$AZFE= 0.1
##$AZFW= 0.1
##$BCFW= 1
##$BC_mod= 2
##$BYTORDP= 1
##$COROFFS= 0
##$CY= 11.3945322036743
##$DATMOD= 1
##$DC= 2
##$DFILT= <>
##$DTYPP= 0
##$F1P= 15.7292609196834
##$F2P= 12.9074282941183
##$FCOR= 0.5
##$FTSIZE= 0
##$FT_mod= 4
##$GAMMA= 1
##$GB= 0.15
##$INTBC= 1
##$INTSCL= 1
##$ISEN= 128
##$LB= 0.24
##$LEV0= 0
##$LPBIN= 0
##$MAXI= 10000
##$MC2= 0
##$MEAN= 0
##$ME_mod= 0
##$MI= 1.114404
##$NCOEF= 0
##$NC_proc= 0
##$NLEV= 6
##$NOISF1= 3.799351
##$NOISF2= 2.8
##$NSP= 1
##$NTH_PI= 0
##$NZP= 0
##$OFFSET= 15.70392
##$PC= 1
##$PHC0= -20991.6
##$PHC1= 7.052721
##$PH_mod= 1
##$PKNL= yes
##$PPARMOD= 0
##$PSCAL= 0
##$PSIGN= 0
##$REVERSE= no
##$SF= 200.130013532006
##$SI= 16384
##$SIGF1= 3
##$SIGF2= 2
##$SINO= 400
##$SIOLD= 16384
##$SREGLST= <1H.CDCl3>
##$SSB= 0
##$STSI= 0
##$STSR= 0
##$SW_p= 3612.71676300578
##$SYMM= 0
##$S_DEV= 0
##$TDeff= 0
##$TDoff= 0
##$TI= <>
##$TILT= no
##$TM1= 0
##$TM2= 0
##$TOPLEV= 0
##$USERP1= <user>
##$USERP2= <user>
##$USERP3= <user>
##$USERP4= <user>
##$USERP5= <user>
##$WDW= 1
##$XDIM= 8192
##$YMAX_p= 0
##$YMIN_p= 0
$$ End of Bruker specific parameters
$$ ---------------------------------
##NTUPLES= NMR FID
##VAR_NAME=  TIME,          FID/REAL,        FID/IMAG
##SYMBOL=    X,             R,               I
##VAR_TYPE=  INDEPENDENT,   DEPENDENT,       DEPENDENT
##VAR_FORM=  AFFN,          ASDF,            ASDF
##VAR_DIM=   8192,          8192,            8192
##UNITS=     SECONDS,       ARBITRARY UNITS, ARBITRARY UNITS
##FACTOR=    0.0002768,     1,               1
##FIRST=     0,             0,               0
##LAST=      2.2672688,     0,               0
##MIN=       0,             -384535,         0
##MAX=       2.2672688,     379308,          0
$$ Real data points
##PAGE= N=1
##DATA TABLE= (X++(R..R)), XYDATA
$$ [...]
2005A078k26n44J04n40m13n8O4m44kK22j84J46k84O30l3J88K37J19M09l1L65K57
$$ 1078 852 308 412 -128 -541 -599 -535 -979 -981 -759 -943 -797 -1081 -451 -484 -296 -59 60 469 438 803 1060
2027A060q1J52p0j27l36k80r9m45k6o93P5p7j07j2N8J09P3k4P87J32N9K49K76
$$ 1060 979 1131 1061 934 598 318 219 -226 -252 -945 -870 -947 -1054 -1066 -1008 -899 -826 -850 -63 69 128 377 653
2050F53M6K91J13Oj21m1K42o48M0k43n20k53M6m78k32k46M79j98L8J62K35L16
$$ 653 699 990 1103 1109 988 947 1189 541 581 338 -182 -435 -389 -867 -1099 -1345 -866 -1064 -1026 -864 -629 -313
2072c13J27L07N89o4P6K41L8J01Q0l31m2m7k25l43n40J57m63K33p91L75l85J12
$$ -313 -186 121 710 646 722 963 1001 1102 1182 851 809 762 537 194 -346 -189 -652 -419 -1210 -835 -1220 -1108
2094a108J72L34q4J67N00R9K25J97M1J76K87j25j44j68K27k77Q1n61O5n36J43
$$ -1108 -936 -602 -686 -519 -19 80 305 502 543 719 1006 881 737 569 796 519 600 39 104 -432 -289
2115b89j61n42K29k02M1K25N7K54J9L94K09pL07j2K04n7J0J21p0k80k8k65j24
$$ -289 -450 -992 -763 -965 -924 -699 -642 -388 -369 25 234 227 534 522 726 669 679 800 730 450 422 157 33
2138C3l43j16L8o84M14p6n7j26L30K31L30m8j7M73j08J18J32J60R4j16j06l53
$$ 33 -310 -426 -388 -1072 -658 -734 -791 -917 -587 -356 -26 -74 -91 382 274 392 524 684 778 662 556 203
2160B03J18l33L61m06l63P6k77k35j20K18q7L43K95m05N30J9N23n0L49N2Mk31
$$ 203 321 -12 349 -57 -420 -344 -621 -856 -976 -758 -845 -502 -207 -612 -82 -63 460 410 759 811 815 584
2182E84L54l7m61J35k33k30j21k43j60j17o3n08L34k39O0QK01L39ON47O9J62J08
$$ 584 938 901 440 575 342 112 -9 -252 -412 -529 -592 -1100 -766 -1005 -945 -937 -736 -397 -391 156 225 387 495
2205D95K62K60k02LR2j76l15l54J38K3j21k72k41j01j51o8l25K28m0M45J56r4
$$ 495 757 1017 815 818 910 734 419 65 203 226 105 -167 -408 -509 -660 -728 -1053 -825 -865 -420 -264 -358
2227c58K45L39J47r9L49Q9J30J58l66j25j88J2j61j99k38J37k73k4l1k90M8K97
$$ -358 -113 226 373 274 623 712 842 1000 634 509 321 333 172 -27 -265 -128 -401 -425 -456 -746 -698 -401
2249d01j97K21J9K26lK13K47L07j99K94O8k88J29k62r9k19k3l00l64L52k32o4
$$ -401 -598 -377 -358 -132 -135 78 325 632 433 727 795 507 636 374 275 56 33 -267 -631 -279 -511 -575
2271e75L5j4J48r5O4L51l84L03J82M96j23J72Q5l33O51m06r8Q0k85l02j06k2l93
$$ -575 -540 -554 -406 -501 -437 -86 -470 -167 15 511 388 560 645 312 963 557 459 539 254 -48 -154 -176 -569
2294e69k82K49j62J04l57M83O4J03K60q9K91J47J88P2J53k05L96j43J40l41p1
$$ -569 -851 -602 -764 -660 -1017 -534 -470 -367 -107 -196 95 242 430 502 655 450 846 703 843 502 431
2315D31j49k04j63l26K2l73J69o6j7o0J08L77l10J60M2J96L60J10K44m6K23p4
$$ 431 282 78 -85 -411 -389 -762 -593 -659 -676 -736 -628 -251 -561 -401 -359 -163 197 307 551 505 728 654
2337F54k1K55k43k33j25o8k77k52L41l65j84J0j73K18k33K75K21J69J31P9K2J45
$$ 654 633 888 645 412 287 219 -58 -310 31 -334 -518 -508 -681 -463 -696 -421 -200 -31 100 179 201 346
2359C46R8k1L45r5n9j21j41j39J90l76l19J2L5k86Q0j63Q8J69J3l2O8N2J19L76
$$ 346 444 423 768 673 614 493 352 213 403 27 -292 -280 -245 -531 -451 -614 -526 -357 -344 -376 -308 -256 -137 239
2383B39L9k67L57J20K3p9k49J0K15j84k36j8j81j20o9j83P1k16K69R1M6L82J53
$$ 239 278 11 368 488 511 432 183 193 408 224 -12 -30 -211 -331 -400 -583 -512 -728 -459 -368 -322 60 213
2406B13P1q9R3j63J68J92o1Q2j0q7m2j20k70k1p2n2m99q6L11j0n78M55J87n2M8
$$ 213 284 195 288 125 293 485 424 506 496 409 367 247 -23 -44 -116 -168 -667 -753 -442 -452 -1030 -575 -388 -440 -392
2431c92K57J27K04L72j21j01J97L2J0k89%q9j13J60k46q8m0l32M3l28J60j22K28
$$ -392 -135 -8 196 568 447 346 543 575 585 296 296 207 94 254 8 -80 -120 -452 -409 -737 -577 -699 -471
2454d71k8R9L89k70M33N8J24k15J96M58J26m58j01K50j0k04k79j16M2k59J74j80
$$ -471 -499 -400 -11 -281 152 210 334 119 315 773 899 441 340 590 580 376 97 -19 23 -236 -62 -242
2476b42j80j44J8N2K45j92J20K32l3K91M4j14M62q1l6j00J5j69K53k24j74p2n1
$$ -242 -422 -566 -548 -496 -251 -443 -323 -91 -124 167 211 97 559 478 442 342 357 188 441 217 43 -29 -80
2499h0j85J31j74o9J76j28j13M2QM05L56k92K53j72J14K07R4k29J92J1j25j51
$$ -80 -265 -134 -308 -377 -201 -329 -442 -400 -392 13 369 77 330 158 272 479 573 344 536 547 422 271
2521B71l39L3L1j41o6k03K53k63K30N8q7no5J05K72J35J97r7J53J21q2j80l0p1
$$ 271 -68 -35 -4 -145 -211 -414 -161 -424 -194 -136 -223 -228 -293 -188 84 219 416 319 472 593 511 331 301 230
2545B30o2k9j69r8j46k55K9R1P0j83J5J62Ll6L94p5q7L23J76J37J45j23k74M01
$$ 230 168 139 -30 -128 -274 -529 -500 -409 -339 -522 -507 -345 -342 -378 16 -59 -146 177 353 490 635 512 238 639
2569F39j56k2r4j94J59m47q7q3l20K76j79q2J41K22k68J69l3K32J24J43L3M4J68
$$ 639 483 461 367 173 332 -115 -202 -285 -605 -329 -508 -590 -449 -227 -495 -326 -359 -127 -3 140 173 217 385
2592C85k4L7L41l27kJ33k70j76l41j75J03p1j88K22l73K51K34nR9O4Q0M9J45K68
$$ 385 361 398 739 412 410 543 273 97 -244 -419 -316 -387 -575 -353 -726 -475 -241 -246 -147 -83 -3 46 191 459
2616D59p6j12L1n4R0j03l99N47l41j06o7p5n9R6l73k1J92Q2K05M3R3Q3j38J88
$$ 459 383 271 302 248 338 235 -164 383 42 -64 -131 -206 -265 -169 -542 -563 -371 -289 -84 -41 52 135 -3 185
2640A85j7O7J35J49j09j94J47k84j29J6K04l10k79Q8N0M8j27o8O6K35j38N5L57
$$ 185 168 235 370 519 410 216 363 79 -50 -34 170 -140 -419 -331 -281 -233 -360 -428 -362 -127 -265 -210 147
2663A47j08K2L60K8j25p0N0J72k05k35O0J34j96j68J20l05n8N4o9J99m7l26K47
$$ 147 39 61 421 449 324 254 304 476 271 36 96 230 34 -134 -14 -319 -377 -323 -392 -193 -240 -566 -319
2686c19n0J62J20K60R7j73J72J38N2j24J40k82L12l81oK9k63R3j55M8l34K6p7
$$ -319 -369 -207 -87 173 270 97 269 407 459 335 475 193 505 124 118 147 -116 -23 -178 -130 -464 -438 -515
2709e15L92k37k70K42M17J18j64L27k50K42k72j35O69l78j15J14j59j50L50r4
$$ -515 -123 -360 -630 -388 29 147 -17 310 60 302 30 -105 564 186 71 185 26 -124 226 132
2729A32l00q7R8l5o8l7J2J4r7L32q2J14L7N0K20l4R7j51J96r1j62K46l31k12J90
$$ 132 -168 -255 -157 -192 -260 -297 -285 -271 -368 -36 -118 -4 33 83 303 269 366 215 411 320 158 404 73 -139 51
2754E1j53J30j28J7j74k92J17kM95l14J93J66J24q4J1K9K24O0J17j70l81k8L36
$$ 51 -102 28 -100 -83 -257 -549 -432 -434 61 -253 -60 106 230 146 157 186 410 470 587 417 36 8 344
2777C44j76j14n5j11j44m5m5K04j30L5J6o0J83o8L08J71k87L80j64K2L63l21J46
$$ 344 168 54 -1 -112 -256 -301 -346 -142 -272 -237 -221 -281 -98 -166 142 313 26 406 242 264 627 306 452
2800D52k27k78K6q0J20j76r3M6q6J56j54j63L25j54L0oK03J30J29j51J1L37n4
$$ 452 225 -53 -27 -107 13 -163 -256 -210 -296 -140 -294 -457 -132 -286 -256 -262 -59 71 200 49 60 397 343
2823C43j4K01J26n83J89j14o5j99J79j75O8m07K10J36k34m4M5n0K40rq2K63j0
$$ 343 329 530 656 73 262 148 83 -116 63 -112 -44 -451 -241 -105 -339 -383 -338 -388 -148 -157 -239 24 14
2846A4J03P1M4J26k16j2M17m2n31L50m88K78n1k19k30K84l42L94j29J14J31j56
$$ 14 117 188 232 358 142 130 547 505 -26 324 -164 114 63 -156 -386 -102 -444 -50 -179 -65 66 -90
2868i0j25J00k17L73O2j92J78j4R1J88j59j42m9k1Q9j03j66j01K79n5j39J17n
$$ -90 -215 -115 -332 41 103 -89 89 75 166 354 195 53 4 -17 72 -31 -197 -298 -19 -74 -213 -96 -101
2891a01j84K08k3J90N4j84K75k01j43K62L6j62L31k14j17K2j11kl5l38J60K6J37
$$ -101 -285 -77 -100 90 144 -40 235 34 -109 153 189 27 358 144 27 49 -62 -64 -99 -437 -277 -251 -114
2914a14J43l00N2OJ58K21l53N00l5j25m1K7L45j86j49K83j61j42R2k01j59K4k2
$$ -114 29 -271 -219 -213 -55 166 -187 313 278 153 112 139 484 298 149 432 271 129 221 20 -139 -115 -137
2937a37k01J10J38k95J36k9L07k18J01J80O2R3j56J30k8K89k71j0j25J92k14J23
$$ -137 -338 -228 -90 -385 -249 -278 29 -189 -88 92 154 247 91 221 193 482 211 201 76 268 54 177
2959A77l28J31l40L54k35K99k90L3p1r8K27N5J8k32J27O32j70j03l00K81N4L1
$$ 177 -151 -20 -360 -6 -241 58 -232 -199 -270 -368 -141 -86 -68 -300 -173 459 289 186 -114 167 221 252
2981B52L2j84J00j53Q1m10J71K2q5j40L05r9l4J30j26k83M97ok84K97J65j04j94
$$ 252 284 100 200 47 128 -282 -111 -89 -174 -314 -9 -108 -142 -12 -138 -421 76 70 -214 83 248 144 -50
3004e0Q1n5K51k05m5L0J1r2J0l6L31j46k87K04o9j15PJ90J23k41J60P6j04O8k21
$$ -50 31 -24 227 22 -23 7 18 -74 -64 -100 231 85 -202 2 -67 -182 -175 15 138 -103 57 133 29 97 -124
3029a24L65K3j15O6j09k12J47k49L11j33j46j43J90qK66l30j6J74L2L16k77K96
$$ -124 241 264 149 215 106 -106 41 -208 103 -30 -176 -319 -129 -137 129 -201 -217 -43 -11 305 28 324
3051C24j51l65M56j30pQ6j34j0J8K49l25j51l4K20j46O0k36O0K31k27K66j49L41
$$ 324 173 -192 264 134 127 213 79 69 87 336 11 -140 -174 46 -100 -40 -276 -216 15 -212 54 -95 246
3074B46k61o7J42K42l82L63Oj64j63K77J36l95O7P4j44K06l82J35Q6l97K29j97
$$ 246 -15 -82 60 302 -80 283 289 125 -38 239 375 -20 47 121 -23 183 -199 -64 22 -375 -146 -343
3096c43J43p0j61N01k06M1j7K00k32K18K68j57N4L2n5l5j45J57m03P3J34p0m6
$$ -343 -200 -270 -431 70 -136 -95 -112 88 -144 74 342 185 239 271 216 181 36 193 -210 -137 -3 -73 -119
3119a19j2K36l13J35o4J71q4O6J03j76J31q4l7L61R1l79k6j08K36P5q8j97k0J80
$$ -119 -131 105 -208 -73 -137 34 -50 16 119 -57 74 -10 -47 314 405 26 0 -108 128 203 115 -82 -102 78
3143G8k20L2N8k31P3K14j63j5K18k25J75P4L7K51k14L33n54K16O7j7j42k44K69
$$ 78 -142 -110 -52 -283 -210 4 -159 -174 44 -181 -6 68 105 356 142 475 -79 137 204 187 45 -199 70
3166G0l64N4K63k52N4N2kJ74j56L1M1Q2P9J03j74j54M02k2l56J46J73k68M3%l00
$$ 70 -294 -240 23 -229 -175 -123 -125 49 -107 -76 -35 47 126 229 55 -99 303 281 -75 71 244 -24 19 19 -281
3191b81K77j05L0j28o6J89q6N2j40N5L30k87L23K8n40M00KL26m07K79p0k28P0
$$ -281 -4 -109 -79 -207 -273 -84 -170 -118 -258 -203 127 -160 163 191 -349 51 53 379 -28 251 181 -47 23
3214B3J33l88L58m15L03l89L37k19J92p0l3J52j8n5j02L7O9J87lj59P2J87k14
$$ 23 156 -232 126 -289 14 -375 -38 -257 -65 -135 -168 -16 -34 -89 -191 -154 -85 102 99 -60 12 199 -15
3237a5J98r6M2j8n7j07o5J05M3j02QJ59l59j9K3K23q0L4L63l76K73j77q6k9j1
$$ -15 183 87 129 111 54 -53 -118 -13 30 -72 -64 95 -264 -283 -260 -37 -117 -83 280 -96 177 0 -86 -115 -126
3262a26j14J28J99O1j02P0j61N1K35j58j19q6q4K25p6Q6j3l10K62J86J18j89R
$$ -126 -240 -112 87 148 46 116 -45 6 241 83 -36 -122 -206 19 -57 29 16 -294 -32 154 272 83 92
3285I2P3r5J42k90j3K23j57j70K12j3o3l1r0K3n5R5J64l08PK44k8l3J76l34K82
$$ 92 165 70 212 -78 -91 132 -25 -195 17 4 -59 -90 -180 -157 -212 -117 47 -261 -254 -10 -38 -71 105 -229 53
3310E3Q0j09l7j46J23J47j13L61o43L50nj98j18L2m9J81J27n4j14P4J07k45K91
$$ 53 133 24 -13 -159 -36 111 -2 359 -284 66 61 -137 -255 -223 -272 -91 36 -18 -132 -58 49 -196 95
3333I5j90M2K52j01j31n1K41J36k24n1R9J62k97j20K82k94N9k00K24j09QK14K0
$$ 95 -95 -53 199 98 -33 -84 157 293 69 18 117 279 -18 -138 144 -150 -91 -291 -67 -176 -168 46 66
3356F6m5k60M67l76M33m13K01J55j6q8p6n4J4k40J75J27k2j70j66J51N3M8N2l07
$$ 66 21 -239 228 -148 285 -128 73 228 212 124 48 -6 8 -232 -57 70 48 -122 -288 -137 -84 -36 16 -291
3380b91J25K96j69J35l1q2K04M6l26J10j44K99k56L91l03O2O9k90J08P1j44M2
$$ -291 -166 130 -39 96 65 -17 187 233 -93 17 -127 172 -84 307 4 66 135 -155 -47 24 -120 -78
3402g8N9J00p4j26K29j31J85n1l28N20j85J93k02N9l66K04j73J57j41p8QN7M5
$$ -78 -19 81 7 -119 110 -21 164 113 -215 305 120 313 111 170 -196 8 -165 -8 -149 -227 -219 -162 -117
3425a17r1m3Q0j06K97m18L47K1J58k84K06k39M1L36k32q6L65l75L9L73j16l34
$$ -117 -208 -251 -171 -277 20 -398 -51 -30 128 -156 50 -189 -148 188 -44 -130 235 -140 -101 272 156 -178
3447a78P8J19r8N5j15j40q1J25L6J07J5J41qo3k0M1q7K66p2J10j43O8j84J46J9
$$ -178 -100 19 -79 -24 -139 -279 -360 -235 -199 -92 -77 64 56 -7 -27 14 -73 193 121 231 88 156 -28 118 137
3472A37J6q5J27l12O6j20J21j93K22n3k00K14q7J30M8n8K67l43Jk3J02j65L15
$$ 137 153 68 195 -117 -51 -171 -50 -243 -21 -74 -274 -60 -147 -17 31 -27 240 -103 -102 -125 -23 -188 127
3495A27k5k70K73Q5J7j02j4p3o2Q8n0j93M90m32j25K58O8L9n4K00k33k3N0Q2q8
$$ 127 102 -168 105 190 207 105 91 18 -44 44 -6 -199 291 -141 -266 -8 60 99 45 245 12 -11 39 121 33
3520C3K9j20j22J02M5L2R7j41q0J08J30j53R6j30Q5J54j52J5K25l0j78P9Q4kk09
$$ 33 62 -58 -180 -78 -33 -1 96 -45 -125 -17 113 -40 56 -74 11 165 13 28 253 223 45 124 208 206 -3
3545cj51J02R0P0o8n8K30k17N0l79K34n0P0J56k04m8M3K94j28J58j31k35M17M9
$$ -3 -154 -52 38 108 40 -18 212 -5 45 -334 -100 -150 -80 76 -128 -176 -133 161 33 191 60 -175 242 291
3569B91l64J95k17K12L30q78K66%K44p4j89j3K7j33K72j33J19K14l99K4R9L4L50
$$ 291 -73 122 -95 117 447 -431 -165 -165 79 5 -184 -197 -170 -303 -31 -164 -45 169 -230 -206 -107 -73 277
3592B77l67J15J14q4mm83M23O0r6K45k03K79k96R5k74K17N5l49M20O3r2k04L8
$$ 277 -90 25 139 55 51 -432 -9 51 -45 200 -3 276 -20 75 -199 18 73 -276 144 207 115 -89 -51
3615e1N9J3k52K70J09J6j48l8J46j36K40k70J56p3J44k15J18j34r7K55j58KP9
$$ -51 8 21 -231 39 148 164 16 -22 124 -12 228 -42 114 41 185 -30 88 -46 -143 112 -46 -44 35
3638C5Q1j43L3j9r2J12Kj13Mp4M64l48K49l36K86k09P8O8J67k81p9J00k11K73
$$ 35 116 -27 6 -13 -105 7 9 -104 -100 -174 290 -58 191 -145 141 -68 10 78 245 -36 -115 -15 -226 47
3662D7l5n3j13L06q8p5K63L6k29p6k36L9K01j36N2J77k4m01L67j8j8p1q0J26K9
$$ 47 12 -41 -154 152 64 -11 252 288 59 -17 -253 -214 -13 -149 -97 80 56 -345 22 4 -14 -85 -165 -39 -10
3687a0L4qnJ74lj16m1J25J7j07k5K13l20K28j14lm9R8j03P4n4J17j88j93J91O2
$$ -10 24 16 11 185 182 66 25 150 167 60 35 248 -72 156 42 39 -10 88 -15 59 5 122 -66 -259 -68 -6
3713fj82P0l1M2K51J6j50j0J24p6J06J28m88M67k94J62k03qK61j63rJ34k16K37
$$ -6 -188 -118 -149 -107 144 160 10 0 124 48 154 282 -206 261 -33 129 -74 -82 179 16 7 141 -75 162
3737A62l34J48K37k27P5j13J55j57R3lj59q6J59J08k23J19m0K35j05o6J44j98
$$ 162 -172 -24 213 -14 61 -52 103 -54 39 36 -123 -209 -50 58 -165 -46 -86 149 44 -22 122 -76
3759g6k5K51k52K09J36l24o3J48m1M81k63j62n2R1j64R8k42K02n5L28k83J26j50
$$ -76 -101 150 -102 107 243 -81 -144 4 -37 444 181 19 -33 58 -106 -8 -250 -48 -103 225 -58 68 -82
3782h2k23L41j8m6j16K65l92K34K89j06j75k20K12K0K23j24m8K3n1Pk33J77J19
$$ -82 -305 36 18 -28 -144 121 -271 -37 252 146 -29 -249 -37 -17 206 82 34 57 6 13 -220 -43 76
3805G6q6P3J3q3k21J11J77j45K58k82pj9j14M46l28J16j18K69M8O5J6k6K19l89
$$ 76 -10 63 76 -7 -228 -117 60 -85 173 -109 -116 -135 -249 197 -131 -15 -133 136 184 249 265 239 458 69
3829F9L8k17Q2oM3j20J04r2J44j39j34J07J2J89j18n6m7K28O3j00R0j16Q0L4M7
$$ 69 107 -110 -28 -34 9 -111 -7 -99 45 -94 -228 -121 -109 80 -38 -94 -141 87 150 50 140 24 104 138 185
3854A85k81J27P3k24K66n6m0Nj41k18J75K56j37J5J97j96j38j44N87k93P1Rl1
$$ 185 -96 31 104 -120 146 90 50 55 -86 -304 -129 127 -10 5 202 6 -132 -276 311 18 89 98 67
3877F7j80J51j71J3J15n2J74j70q3L5o6jO3j4j34r1M05o0J59m39L84p4J92j68
$$ 67 -113 38 -133 -120 -5 -57 117 -53 -136 -101 -167 -168 -105 -119 -253 -344 61 1 160 -279 105 31 223 55
3901E5r2J84l24L02M6j24j47j0j88J11J69MmN8j22M4J2k79J94K57j61j27J26O3
$$ 55 -37 147 -177 125 171 47 -100 -110 -298 -187 -18 -14 -18 40 -82 -38 -26 -305 -111 146 -15 -142 -16 47
3925D7N5J10l77J41J33R1l94J95k5O1m6q3J81k22J93l05M15l04Q7J28k96L48J5
$$ 47 102 212 -165 -24 109 200 -194 1 -24 37 -9 -92 89 -133 60 -245 170 -134 -47 81 -215 133 148
3948A48k13m3J91Q9k40O9L6r1l6%j1K01J09k80K21j22q8r0OM0J17P9j18rk7K59
$$ 148 -65 -108 83 172 -68 1 37 -54 -90 -90 -101 100 209 -71 150 28 -60 -150 -144 -104 13 92 -26 -35 -62 197
3974A97j11n1k66L65j48j15J79N1n9j22J29J58o3k91J31k1nJ4L25q2l95K5O2J56
$$ 197 86 35 -231 134 -14 -129 50 101 42 -80 49 207 144 -147 -16 -37 -42 -28 297 215 -180 -155 -93 63
3998F3j01l8m2J87J02L7k56r3k6J95J04j68K46j36m6l6L34m80L05j9k71L80k14
$$ 63 -38 -76 -118 69 171 208 -48 -141 -167 28 132 -36 210 74 28 -8 326 -154 151 132 -139 241 27
4021B7J44k53K37l5J16m69J74M4J57n5rL1l18L01j49J61J46m99n6K20j48K12p5
$$ 27 171 -82 155 120 236 -233 -59 -15 142 87 78 109 -209 92 -57 104 250 -249 -305 -85 -233 -21 -96
4044i6Jq4J33m0j10J68K06p5j1k13J02j26M13k85J06j56K99j53j27k71K58r1P3
$$ -96 -95 -179 -46 -86 -196 -28 178 103 92 -121 -19 -145 268 -17 89 -67 232 79 -48 -319 -61 -152 -79
4067g9J03m8k86K47k0%L12m27L37k73L08l01K60k10K23j45J49j29R8j86J49o6
$$ -79 24 -24 -310 -63 -83 -83 229 -198 139 -134 174 -127 133 -77 146 1 150 21 119 -67 82 16
4089A6n8J55k18K59m39L51k16K40k34N10k14j55j67J97r0J63r7j56l4K62q0J2
$$ 16 -42 113 -105 154 -285 66 -150 90 -144 366 152 -3 -170 27 -63 100 3 -153 -187 75 -5 7
4111GJ64r9r7O2n5K35j72j75K19p7J2L2k69K42P2j4o4j93K23Q1j11J0J8p8J45
$$ 7 171 72 -25 37 -18 217 45 -130 89 12 24 56 -213 29 101 87 23 -170 53 134 23 33 51 -27 118
4136A18l2r4j29J8m6m6J25Q8Op2J83l07K85k17J53k42K66j12P1J29k94K70j31
$$ 118 86 -8 -137 -119 -165 -211 -86 2 8 -64 119 -188 97 -120 33 -209 57 -55 16 145 -149 121 -10
4159a0L28m01M7j72L45n8n9j35k4K77j42J96n28M06j92J97m6K32l16Q8k7j92O8
$$ -10 318 -83 -36 -208 137 79 20 -115 -139 138 -4 192 -336 70 -122 75 29 261 -55 33 6 -186 -118
4182a18J61J30j49Q9oJ36k34J15k06k4%M2K46j89j01J19j69j30K40L21k85j5j21
$$ -118 43 173 24 113 107 243 9 124 -82 -106 -106 -64 182 -7 -108 11 -158 -288 -48 273 -12 -27 -148
4205a48K1K57j28Op4K76k7j10k68K20p4J4J89j23q7J05j13j9O7k00K19J37J61
$$ -148 -127 130 2 8 -66 210 183 73 -195 25 -49 -35 154 31 -56 49 -64 -83 -16 -216 3 140 301
4228C01k17l40K27M9l5K7r7L6P1o0p7J27K47m91P5L62j14o3j28j10L12j43K10
$$ 301 84 -256 -29 20 -15 12 -85 -49 22 -38 -115 12 259 -232 -157 205 91 28 -100 -210 102 -41 169
4251A69p0p3m9n3R3k83J56r2L19k86J40k06N12l48j41K86k2r8m8J22M3k33M4M59
$$ 169 99 26 -23 -76 17 -266 -110 -202 117 -169 -29 -235 277 -71 -212 74 52 -46 -94 28 71 -162 -118 341
4275C41o25K75k6n3R3N3j21O0R7k22L02l5J22j44j06L3k45K97k04L8M5k67L24
$$ 341 -284 -9 -35 -88 5 58 -63 -3 94 -128 174 139 261 117 11 44 -201 96 -108 -70 -25 -292 32
4298C2l04L88K3j6q2l4R1j65L76k29J31j22j97M32l84k0J54l04K08J95k09K5j52
$$ 32 -272 116 139 123 41 7 98 -67 309 80 211 89 -108 324 -60 -80 74 -230 -22 173 -36 -11 -163
4321a63M04j52n4N2j70J53j4k05Q6J4J24K15j53o3J1O4j31omk3O7j31J5J94n6
$$ -163 241 89 35 87 -83 70 56 -149 -63 -49 75 290 137 74 85 149 18 12 8 -15 52 -79 -64 130 74
4346G4n7o1j68j25L56P4p0j16O4O0j49K69l23J90j39j77K83k0K81k17k68J30J42
$$ 74 17 -44 -212 -337 19 93 23 -93 -29 31 -118 151 -172 18 -121 -298 -15 -35 246 29 -239 -109 33
4369C3P5l23J39L06k87MJ08k84L74m0J35m18K89n05M04K6k30m8M41k44l8L43j74
$$ 33 108 -215 -76 230 -57 -53 55 -229 145 105 240 -178 111 -394 10 36 -194 -242 199 -45 -83 260 86
4392H6kj8O7j01j6j68L9O8j13K67n8j87L92k97l8J71r2L3kk20M57l90K68J56k12
$$ 86 84 66 133 32 16 -152 -113 -45 -158 109 51 -136 256 -41 -79 92 0 33 31 -189 268 -122 146 302 90
4417I0j46J66N6j86m9L67k79J90k75P0m6o5J23j08j92J44K15j09M9j31M6J49k5
$$ 90 -56 110 166 -20 -69 298 19 209 -66 4 -42 -107 16 -92 -284 -140 75 -34 15 -116 -70 79 54
4440E4j04Q3K70R8n79Q7M01k80k12L4K4j36L78q2l9n6J44J62j46j36O7j84N3J13
$$ 54 -50 33 303 401 -178 -91 310 30 -182 -148 -124 -260 118 36 -3 -59 85 247 101 -35 32 -152 -99 14
4464A4o9p2k1J52k14J41J82k51p1Q2M71l48j10L72j14l54J62P9J0j86J15J52o1
$$ 14 -55 -127 -148 4 -210 -69 113 -138 -209 -127 344 -4 -114 258 144 -210 -48 31 41 -145 -30 122 61
4487F1Q6k83Q9L33l96Q2k0j39L7L26r5j62J65k02J8K7o7J29q9J52Q7J84k65l62
$$ 61 147 -136 -47 286 -110 -28 -48 -187 -150 176 81 -81 84 -118 -100 -73 -140 -11 -100 52 139 323 58 -304
4511c04K40m6J59J75k16k18L7k2o1M20j46J55l17K74o1l05M07j61k00J04J52j45
$$ -304 -64 -110 49 224 8 -210 -173 -195 -256 164 18 173 -144 130 69 -236 171 10 -190 -86 66 -79
4533g9pK4J51k12r2L60l55L05m1NK45k95n7R5L4r6K61r0r6l6j82j6J53j11J69
$$ -79 -86 -62 89 -123 -215 145 -210 95 54 59 304 9 -48 47 81 -15 246 156 60 24 -158 -174 -21 -132 37
4558C7j0l01K31L33l33J49J05m7Lr3n7j53K79j22r7K26m4j39o3j17J94K8j59j
$$ 37 27 -274 -43 290 -43 106 211 164 167 74 17 -136 143 21 -76 150 106 -33 -96 -213 -19 9 -150 -151
4582a51J26L1N1k75J17K88k27L5J2k24L83rj49K57j95L8K08m86J93q2J15J02k36
$$ -151 -25 6 57 -218 -101 187 -40 -5 7 -217 166 157 8 265 70 108 316 -170 23 -59 56 158 -78
4605g8M52m25K79k39P0J64j60p9N3m6N9q0k21M60j40m7J47j72j08J17j4K15l18
$$ -78 374 -51 228 -11 59 223 63 -16 37 -9 50 -30 -251 209 69 22 169 -3 -111 6 -8 207 -111
4628a11MK04q7R4J34j32l56J86J12J00o0o2j58L6p8J79L3j93J04o3K88q5j0j83
$$ -111 -107 97 10 104 238 106 -250 -64 48 148 88 26 -132 -96 -174 5 38 -155 -51 -114 174 89 79 -104
4652a04M4J7O7jJ48J19k88Q9j69K78j64L3P7l0k33K16L4PNk81J23K13k45L4j75
$$ -104 -60 -43 24 23 171 290 2 91 -78 200 36 69 146 116 -117 99 133 140 145 -136 -13 200 -45 -11 -186
4677a86J34Q2o9l7j31K23J74j84j42L0K45k4k50L77k52kj6j11J9J63R7q0J50l44
$$ -186 -52 30 -39 -76 -207 16 190 6 -136 -106 139 115 -135 242 -10 -12 -28 -139 -120 43 140 60 210 -134
4701a34J14R3o9L2j12k5K03j69j46L70j21j0J1J58R0p60N17M2o7O3k70K79j1j6
$$ -134 -20 73 4 36 -76 -101 102 -67 -213 157 36 26 37 195 285 -475 42 84 17 80 -190 89 78 62
4725F2j85K50l6j67j59L35R7k15J78m9p3k2J22j56K7j47K4L93k73K3l7J96J22
$$ 62 -123 127 91 -76 -235 100 197 -18 160 111 38 16 138 -18 9 -138 -114 279 6 29 -8 188 310
4748C10l51J72k93O7L7L2J56j37j8J39k18L15j96J33j32J38q1j61m4J49q0J3p6
$$ 310 -41 131 -162 -95 -58 -26 130 -7 -25 114 -104 211 15 148 16 154 73 -88 -132 17 -63 -50 -126
4771a26L15r4j13N5r6r9J25lQ2l01M90l23M0K8K83l55L82j78k51J22k65Q3K29
$$ -126 189 95 -18 37 -59 -158 -33 -36 46 -255 235 -88 -48 -20 263 -92 290 112 -139 -17 -282 -199 30
4794C0J67l35n4J16P0K1J80r8o8j40JN5J58n4j00n4R7N6K41l27J08j75J04q6J23
$$ 30 197 -138 -192 -76 -6 15 195 97 29 -111 -110 -55 103 49 -51 -105 -8 48 289 -38 70 -105 -1 -87 36
4819C6N2j90J4J1J81j4j1J8k6n4K17k67k05K46j88K56J08k38L15m70q1L50J10
$$ 36 88 -102 -88 -77 104 90 79 97 71 17 234 -33 -238 8 -180 76 184 -54 261 -209 -290 60 170
4842A70j00p6J4n3K5o9J84k9k17K05L3p5pL8Lj54L20k08p8K2K49j76K3J16k64
$$ 170 70 -6 8 -45 -20 -89 95 66 -151 54 87 12 5 43 46 -108 212 4 -74 -52 197 21 44 160 -104
4867a04R5R4j46J18k89K20j0l1K33L3l3k67Q1J59J48k52Q5m9j08j05Q6j0q2OK71
$$ -104 -9 85 -61 57 -232 -12 -22 -53 180 213 180 -87 -6 153 301 49 134 85 -23 -128 -42 -52 -134 -128 143
4892A43n9K1L9n2p0k03RJ78PN4P6l12k3L17j86R8J69q5j06r2o0J78O9L6j97k52
$$ 143 84 105 144 92 22 -181 -172 6 13 67 143 -169 -192 125 -61 37 206 121 15 -77 -137 41 110 146 -51 -303
4918c03L02j04J22q2J7k98M95q4j46K65k65k0J94k90K86j08j59R8R8J35J06l7
$$ -303 -1 -105 17 -65 -48 -346 149 65 -81 184 -81 -101 93 -197 89 -19 -178 -80 18 153 259 222
4940B22j84j6l7o6j99J69J90j86l3O8J07M3m1m3L30m78P7K35kn7L69m21j45K75
$$ 222 38 22 -15 -81 -280 -111 79 -107 -140 -72 35 78 37 -6 324 -154 -77 158 156 99 468 47 -98 177
4964A77l73K06K6l6N0L4N8j13K33l51K27k91QJ62LR9l74M85p5Q5l66j47L22M8
$$ 177 -196 10 36 0 50 84 142 29 262 -89 138 -153 -145 17 20 119 -255 230 155 240 -126 -273 49 97
4988I7k07P2j35Q6J86j95J39N7j37j7J32k12K55j39j33K37k3j30L27l70K5L33
$$ 97 -110 -38 -173 -87 99 -96 43 100 -37 -54 78 -134 121 -18 -151 86 63 -67 260 -110 -85 248
5010B48k35L1j63N6j46K99k39K09N2l2L05m16k9J44k85L16m24J91L9r2M40k08
$$ 248 13 44 -119 -63 -209 90 -149 60 112 80 385 -31 -60 84 -201 115 -309 -118 -79 -171 269 61
5032F1j03M1p2P4K7J51L5j69k43M58k31j68p7O7K23k02K2L9K0k02J50J50j67R
$$ 61 -42 -1 -73 1 28 179 214 45 -198 260 29 -139 -216 -149 74 -128 -106 -67 -47 -249 -99 51 -116 -107
5056a07K25j41l2K1O6l34L67j55M3M20l70J3k94K63k55L15J32m29J82j93M51j77
$$ -107 118 -23 -55 -34 32 -302 65 -90 -47 373 3 16 -278 -15 -270 45 177 -252 -70 -263 188 11
5078A1n0O9J25P1Nm42K42jj9k3m5P7p8j6J67n3k96P3J87J26k6N7l8o5P1j76j63
$$ 11 -39 30 155 226 231 -211 31 30 11 -12 -57 20 -58 -74 93 40 -256 -183 4 130 104 161 123 58 129 -47 -210
5105b10j2J46K2K76k17J66k88L80j62Qj54K15k01o1J33j50J95j55J06k05P4K71
$$ -210 -222 -76 -54 222 5 171 -117 263 101 109 -45 170 -31 -92 41 -109 86 -69 37 -168 -94 177
5127A77j78j10j37K63Q7k39K98j49j24LQ3K4P2Q9j41qK89l65N61l85j57OJ84J72
$$ 177 -1 -111 -248 15 102 -137 161 12 -112 -109 -26 -2 70 159 18 10 299 -66 495 110 -47 -41 143 315
5151C15m09J26O2K6j97J30l0J61k65l9J50p2J91l49K17j03K85k34J77m63N58r7
$$ 315 -94 32 94 120 -77 53 23 184 -81 -120 30 -42 149 -200 17 -86 199 -35 142 -321 237 140
5173A40l97K50j04N3l3K59j76J16j03J12j12n9J68m16L54M4k63J72r8Q6j43JJ15
$$ 140 -257 -7 -111 -58 -91 168 -8 108 5 117 5 -54 114 -302 52 96 -167 5 -93 -7 -150 -149 -34
5196c4J08M0m5j51K26k31r6K32O0j18p8m6j30L0J00J35l0J08R2j63j82M7M05k30
$$ -34 74 114 69 -82 144 -87 -183 49 109 -9 -87 -133 -263 -233 -133 2 -28 80 172 9 -173 -126 279 49
5220D9j1J06M7j28j43q2O3J42J38l8k18N2L5j88L57j63j77J42j95L27l8j61J21
$$ 49 38 144 191 63 -80 -162 -99 43 181 143 -75 -23 12 -176 181 18 -159 -17 -212 115 77 -84 37
5243C7o8q1R3q1J76N3j36O7j55K06j15L0p0K7j52J23j7J76n3n8j89K42k54j45
$$ 37 -31 -112 -19 -100 76 129 -7 60 -95 111 -4 26 -44 -17 -169 -46 -63 113 60 2 -187 55 -199 -344
5267c44J67J10J22J66k34mK28m56K01M8N2j59K92l19L1j20J62P7j3J94j79k04
$$ -344 -177 -67 55 221 -13 -17 211 -245 -44 4 56 -103 189 -130 -99 -219 -57 20 7 201 22 -182
5289a82K61j84J51n9J37k75M4P8K02j92J19l39p6N4L85j57j39J40J78j98p5K86
$$ -182 79 -105 46 -13 124 -151 -107 -29 173 -19 100 -239 -315 -261 124 -33 -172 -32 146 -52 -127 159
5311A59j29L7j03K89l39L8Q6J60k37J31K6j31jk31L36q4k07K09j12O9J64m00J25
$$ 159 30 67 -36 253 -86 -48 38 198 -39 92 118 -13 -14 -245 91 7 -200 9 -103 -34 130 -270 -145
5334a45K5J32J50K5k02j2M5l1K68n77K14K28m21M71r4K9R4j72j11L7j35J12J21
$$ -145 -120 12 162 187 -15 -27 18 -13 255 -322 -108 120 -301 170 76 105 199 27 -84 -47 -182 -70 51
5357E1j54K46j62k6N6k22K65J1L15k77%k22J73o1K9Rk38K76N8j90QJ51l02Qp2
$$ 51 -103 143 -19 -45 11 -211 54 65 380 103 103 -119 54 -7 22 31 -207 69 127 -63 -55 96 -206 -198 -270
5382b70K69ojq5K14l56J25K34j60J27m1P6r4k2K83l00J29j15J45j65R7j94o9J94
$$ -270 -1 -7 -8 -93 121 -235 -110 124 -36 91 50 126 32 10 293 -7 122 7 152 -13 84 -110 -179 15
5406A5ml8j0r9L57n3l95J26J56k97L09m5l75L13k0q0J72J18K3l28L1J12k2j18
$$ 15 11 -27 -37 -136 221 168 -227 -101 55 -242 67 22 -353 -40 -60 -140 32 150 173 -155 -124 -12 -34 -152
5430a52N5K71k86K37o7K5P5j45L7J23m9j84j0q6Q3j85L49j21M2J6l17L10m7j60
$$ -152 -97 174 -112 125 58 83 158 13 50 173 124 -60 -70 -156 -73 -258 91 -30 12 28 -289 21 -26 -186
5454a86q0L72l9K3q1n3J8K4n9J15m0n3J22j12m9PJ7J29k03k6J84K16k51O4j65
$$ -186 -266 106 67 90 9 -44 -26 -2 -61 54 14 -39 83 -29 -78 -71 -54 75 -128 -154 30 246 -5 59 -106
5479a06N7R7j63J78k9j65j32O01m28Q6k42L94j08l17J24j07J63j28L62j71no6
$$ -106 -49 48 -115 63 34 -131 -263 338 -90 -4 -246 148 40 -277 -153 -260 -97 -225 137 -34 -39 -105
5501a05J75m2k05K03R0m1n3O5j36K20k51nJ56k0j89J12K25l56nj07J83J26k59
$$ -105 70 28 -177 26 116 75 22 87 -49 171 -80 -85 71 51 -138 -26 199 -157 -162 -269 -86 40 -219
5524b19M5K84J82k28J96l70k81L84P1K1jj60J92j28QJ22j92M1O9J01m02L58k62
$$ -219 -174 110 292 64 260 -110 -391 -7 64 85 84 -76 116 -12 -4 118 -74 -33 36 137 -265 93 -169
5547a69J93j51L33j3k20P1j42J27p3j32J44j16K20j77m8J8o8J71L32l10J07j34
$$ -169 24 -127 206 193 -27 44 -98 29 -44 -176 -32 -148 72 -105 -153 -135 -203 -32 300 -10 97 -37
5569c7J13P3jr4N9j64M4j4K16j42q7N5L6K2O9l76L42j48p4K46p8n1K78l97R8J5
$$ -37 76 149 148 54 113 -51 -7 -21 195 53 -34 21 57 79 148 -228 114 -34 -108 138 60 9 287 -110 -12 3
5595CO1m5L3j46r4J71J4L2R8m9q6o3J60J7L8l96J97K42j73J74l58K04L5j46L6
$$ 3 64 19 52 -94 -188 -17 -3 29 127 78 -8 -71 89 106 144 -252 -55 187 14 188 -170 34 69 -77 -41
5620d1L5K6Q4j05j7O0j65j32L08j10J70k31J5K78l28mJ2k7J51l2J14k7P8Ln09
$$ -41 -6 20 104 -1 -18 42 -123 -255 53 -57 113 -118 -103 175 -153 -157 -145 -172 -21 -53 61 34 112 115 -394
5645c94L90k34K54Q0l36M02j98J54J32k53k77M65j30o4Q7j33jj92N04k61P7l4
$$ -394 -4 -238 16 96 -240 162 -36 118 250 -3 -280 185 55 -9 78 -55 -56 -248 256 -5 72 38
5667C8J35l08P2L05j38k15r6K77j6Nk16Q3K31k42j7R2o7M2J82J4j83O7J05R1k79
$$ 38 173 -135 -63 242 104 -111 -207 70 54 59 -157 -74 157 -85 -102 -10 -77 -35 147 161 -22 45 150 241 -38
5692c8J88l2q7K14k20O3r1nj5oK02j23j5O7P6%l39N13m23J16J35k24o7K29j07
$$ -38 150 118 31 245 25 88 -3 -8 -23 -29 173 50 35 102 178 178 -161 352 -71 45 180 -44 -111 118 11
5717A1P8j03N9J06k49J11k63L59p4m8j31k0K11k99J29j2J86Q4o5k59N8J54M1j85
$$ 11 89 -14 45 151 -98 13 -250 109 35 -13 -144 -164 47 -252 -123 -135 51 135 70 -189 -131 23 64 -121
5741a21RK34k9k16K24j83K39l96K18J90j91M4pn0r1O9P7J90r8j1j72O6J08j86
$$ -121 -112 122 93 -123 101 -82 157 -239 -21 169 -22 22 15 -35 -126 -57 20 210 112 101 -71 -5 103 -83
5765h3J03j07R1n7J97q4j98K54k04p2R5l0Q8L7p0L14j01j18l99N69m34K77j08
$$ -83 20 -87 4 -53 144 60 -138 116 -88 -160 -65 -95 -7 30 -40 274 173 55 -344 225 -209 68 -40
5788d0J5j77Q7J77k13Q5J77p8j47J10k15J56K30k7p6J90p2L1k60L28l43k23M91
$$ -40 -25 -202 -115 62 -151 -66 111 33 -114 -4 -219 -63 167 140 64 254 182 213 -47 281 -62 -285 206
5811B06j62k2J80j53J82k89J95j85J13j74J07n5q9J16J56j00k52K83K7K0j12n0
$$ 206 44 22 202 49 231 -58 137 -48 65 -109 -2 -57 -146 -30 126 26 -226 57 84 104 -8 -58
5833e8J74J77k36l6q3R0k00K95l05L0j9K49j87N3J99k38J02r2l3J87lr6m6J81
$$ -58 116 293 57 21 -62 28 -172 123 -182 -152 -171 78 -109 -56 143 -95 7 -85 -118 69 66 -30 -76 105
5857A05j18J29k37j52N5J89J21j62J23J0M5j51N0L6k35L96j20J83k26k53%m4q2
$$ 105 -13 116 -121 -273 -218 -29 92 -70 53 63 108 -43 7 43 -192 204 84 267 41 -212 -212 -256 -338
5880c38K92J82r5q3J10r0K39k62J37j6r3j60L72m82K39J48J68n09J79P3n3J08
$$ -338 -46 136 41 -42 68 -22 217 -45 92 76 -17 -177 195 -287 -48 100 268 -241 -62 11 -42 66
5902F6q2K46l27o8J07l12L85k41K06k1p2N8J54k86K24J13k27O8N8k72L44l39N07
$$ 66 -16 230 -97 -165 -58 -370 15 -226 -20 -41 -113 -55 99 -187 37 150 -77 -9 49 -223 121 -218 289
5925B89O3l89L6j50J40J16j51j6J25k42L35j66rm4K55j72L13j17l56J62Q6qk9
$$ 289 352 -37 -1 -151 -11 105 -46 -62 63 -179 156 -10 -19 -63 192 20 333 216 -140 22 108 100 71
5948G1j62k5K19j29M0No1kJ17M0j64O1K09j38J10q7l29J06j78N11k87O2P4q8N
$$ 71 -91 -116 103 -26 14 19 -42 -44 73 113 -51 10 219 81 191 104 -225 -119 -297 214 -73 -11 63 -25 -20
5973b0j8L09l15j2j19k0k7J69R1l6j17J44R6l1m0l42L36K19n11J88J96r6K32k90
$$ -20 -38 271 -44 -56 -175 -195 -222 -53 38 2 -115 29 125 94 54 -288 48 267 -244 -56 140 44 276 -14
5997a4J14n6j77K25j92K08L6k06j84N1R5K44k68J31K5K28k38K09n5k79n2K3K64
$$ -14 100 44 -133 92 -100 108 144 -62 -246 -195 -100 144 -124 7 32 260 22 231 176 -103 -155 -132 132
6020A32j72R7O7k74L30L3m32L51qp3j08N9l48M70Q8k69ok6J50J55j78NJ4k92M48
$$ 132 -40 57 124 -150 180 213 -219 132 124 51 -57 2 -346 124 212 -57 -63 -89 61 216 38 43 57 -235 213
6045B13m97j12L46p1L0R8qj38K67l04K15j3l30L53n5p0M5O5j35n2K27L8j26rJ31
$$ 213 -284 -396 -50 -121 -91 7 -1 -139 128 -176 39 26 -304 49 -6 -76 -31 34 -101 -153 74 112 -14 -23 108
6070A08j42J55K2j31l0j95M69l06m6K71l35J68K49j68j31N8J88k55j60K12n9R7
$$ 108 -34 121 143 12 -18 -213 256 -50 -96 175 -160 8 257 89 -42 16 204 -51 -211 1 -58 39
6092C9M8j12j01R0K9j38K60Kj41K46j41j15j3P4j32l0R4J34j44K56j66P7j24O8
$$ 39 87 -25 -126 -36 -7 -145 115 117 -24 222 81 -34 -47 27 -105 -135 -41 93 -51 205 39 116 -8 60
6116F0k8J84o7j77l0K4L3Q4l41K45j54M48j49K13m68j30K05m5J85j82M8J0P0j24
$$ 60 32 216 149 -28 -58 -34 -1 83 -258 -13 -167 281 132 345 -123 -253 -48 -93 92 -90 -42 -32 38 -86
6140h6K56m6Pj32J3JJ22p6k30j5J81l6O4J66j38m9j2k24M79j64mL8J50j93k41
$$ -86 170 124 131 -1 12 13 135 59 -171 -186 -5 -41 23 189 51 2 -10 -234 245 81 77 115 265 72 -169
6165a69P5Pj8K34l45K16j01J84k02o8K08j73L36l02N2k84L70K09j76N5l2j7j98
$$ -169 -94 -87 -105 129 -216 0 -101 83 -119 -187 21 -152 184 -118 -66 -350 20 229 53 108 76 59 -139
6188a39J71j2k42J53K81k4k04O3k57J46J08m8j0J26q0j2J66l91K24J49K49m65
$$ -139 32 20 -222 -69 212 188 -16 47 -210 -64 44 -4 -14 112 32 20 186 -205 19 168 417 -48
6210d8M2j2J23j44K46j34J5N3n5J57k56J46o8j78J11j32P9N08l08K60m66J19j95
$$ -48 -6 -18 105 -39 207 73 88 141 86 243 -13 133 65 -113 -2 -134 -55 453 145 405 -61 58 -137
6233a37L84k55n1J4j13L66j80j57J48p7J95Kl39K58m17L46o8K51n08L02lJK40
$$ -137 247 -8 -59 -45 -158 208 28 -129 19 -58 137 139 -200 58 -359 -13 -81 170 -338 -36 -39 -38 202
6256B02q8k14J18k62K12J0j83K26j21M7k01K78lq9nm1K88k84K90r2j86Q7K5l12
$$ 202 114 -100 18 -244 -32 -22 -205 21 -100 -53 -254 24 21 -68 -73 -114 174 -110 180 88 -98 -11 14 -298
6280b98J03J24l6K35j42m5L3J60r9k85J95J80q8k62L12j41J1M48m41n6K3j6PL54
$$ -298 -195 -71 -107 128 -14 -59 -26 134 35 -250 -55 125 37 -225 87 -54 -43 405 -36 -92 -69 -85 -78 276
6304B76q1r8q9j59M17m12J23J5l4J23l31K79j64L76j78m1P8j82J71Kj38J41k91
$$ 276 195 97 8 -151 266 -146 -23 -8 -42 81 -250 29 -135 241 63 22 100 -82 89 91 -47 94 -197
6327a97M08k35m5r3J29Q6J73k44n6q0J21m7J39j07J74P0k42O6k8L30k14k98P8
$$ -197 211 -24 -69 -162 -33 53 226 -18 -74 -154 -33 -80 59 -48 126 196 -46 20 -8 322 108 -190 -112
6350a12J52j43K09k51j4L13L8j40j40L0j64J98r4QJ77l7k2R9j03j8J61jl60J30
$$ -112 40 -103 106 -145 -159 154 192 52 -88 -58 -222 -24 -118 -110 67 30 8 107 4 -14 147 146 -214 -84
6374h4L9K49j70L7K2Nj55J8J34k4o0L18m43m3m1L33o5j23L06j02r0k73K37j35
$$ -84 -45 204 34 71 93 98 -57 -39 95 71 11 329 -114 -157 -198 135 70 -53 253 151 61 -212 25 -110
6398a10K03j13R1o5j60J73o2N7p9K7J12r5j0J91p5j7J34k6j35q0j06K23J91j09
$$ -110 93 -20 71 6 -154 19 -43 14 -65 -38 74 -21 -31 160 85 68 202 176 41 -39 -145 78 269 160
6422A60k66j68M57j77M8j47j22J49Q4j77M43k05j55L76l36J7j47J8j68M79k44
$$ 160 -106 -274 183 6 54 -93 -215 -66 18 -159 284 79 -76 300 -36 -19 -166 -148 -316 163 -81
6443h1n7j4K60M5k44O4qJ70m92K30Q1J55q9J20k44k8p6N24l64J09%r9J10j11k46
$$ -81 -138 -152 108 153 -91 -27 -35 135 -357 -127 -46 109 20 140 -104 -132 -208 316 -48 61 61 -38 72 -39 -285
6468b85K86j75L09j6K62l78K5J35l08K72j66K32j95j61L18M8n5m68M28j72J2p9
$$ -285 1 -174 135 119 381 3 28 163 -145 127 -39 193 -2 -163 155 203 148 -320 108 -64 -52 -131
6490a31J86Q5j62j02L2j24K30J67k02P2O4N5m56K96J69M6m06J54j0J4J64O2j90
$$ -131 55 140 -22 -124 -92 -216 14 181 -21 51 115 170 -286 10 179 225 -181 -27 -37 -23 141 203 13
6513A3l06K36k6R3J16n6l24K74J93j37q4M9j48O6q6j82M67j95Q2p6O2n6R8j68
$$ 13 -293 -57 -83 10 126 70 -254 20 213 76 -8 41 -107 -41 -127 -309 158 -37 45 -31 31 -25 73 -95
6537i5J36j05K19j67Q8j74K76j66j4k32K75j02K7K30r2R0j17q8l20L83N0j76J71
$$ -95 41 -64 155 -12 76 -98 178 12 -2 -234 41 -61 -34 196 104 194 77 -11 -331 52 102 -74 97
6560I7K3N7k08R4L47k23l20K06k8l30K10L3P2j75K37J18j01k77K43j54q5K34j31
$$ 97 120 177 -31 63 410 187 -133 73 45 -285 -75 -42 30 -145 92 210 109 -168 75 -79 -164 70 -61
6583f1m1pO9K93m61L79m0J0J63r3j70k15K72k78L25l12J12J77j51j3n6r6J76J74
$$ -61 -102 -109 -40 253 -208 171 131 141 304 211 41 -174 98 -180 145 -167 -55 122 -29 -42 -98 -194 -18 156
6607A56k92J92o6jo3K48l89O60n53j2N4J59j07l9K1P1l11J39J09k23L87L1nl51
$$ 156 -136 56 -10 -11 -74 174 -215 445 -108 -120 -66 93 -14 -53 -32 39 -272 -133 -24 -247 140 171 166 -185
6631a85J50k5K91r2k20R3r2N7j71K52J03j11J50k50j4M0K07k50j96K69O3k13J76
$$ -185 -35 -60 231 139 -81 12 -80 -23 -194 58 161 50 200 -50 -64 -24 183 -67 -263 6 69 -144 32
6654C2j47Jl5K83n1M3r2J75k9k41RJ19j51J04J04p2j26J18k49lK60p6j83O6K45
$$ 32 -115 -114 -149 134 83 126 34 209 180 -61 -52 67 -84 20 124 52 -74 44 -205 -208 52 -24 -207 -141 104
6679A04j16J5k7J9l9K5j05o7J33J28k86J68O2n3r9j3J73J82l59K03pk6j19L01
$$ 104 -12 3 -24 -5 -44 -19 -124 -191 -58 70 -216 -48 14 -39 -138 -151 22 204 -155 48 41 15 -104 197
6703A97p5k83J88Q4l82L39j43J09n1j91K42J03L8m46J64P6k2O1m4J20j27k5K86
$$ 197 122 -161 27 111 -271 68 -75 34 -17 -208 34 137 175 -271 -107 -31 -53 8 -36 84 -43 -68 218
6726B18l13J54Q2K64k47k5l60L95k35J15Nk17L0J40j12M30n61L80j61k11j6P6
$$ 218 -95 59 141 405 158 133 -227 168 -67 48 53 -164 -134 6 -106 324 -237 143 -18 -229 -245 -169
6748a69J36j13L62r4j69j15j01J58K3j18k0Qk7M24p6l00M16j80J4j49L00j56p7
$$ -169 -33 -146 216 122 -47 -162 -263 -105 -82 -200 -220 -212 -239 185 109 -191 225 45 59 -90 210 54 -23
6771b3J65o0L4k18K97k64J14Q0j91Mj32o0J16M7k4k06K92K10r9k9m4J53l8k75
$$ -23 142 82 116 -102 195 -69 45 125 -66 -62 -194 -254 -138 -91 -115 -321 -29 181 82 53 9 162 124 -151
6795a51K21J52k54J59l51J95n9j39L01j17J05n2J33j60j74J89O8j86J91j42k46
$$ -151 70 222 -32 127 -224 -29 -88 -227 74 -43 62 10 143 -17 -191 -2 66 -120 71 -71 -317
6816c17K93J1K17k97j3J54q4L32j41J0J00m22K42PP4j43J51J69k58k68J92J4J08
$$ -317 -24 -13 204 -93 -106 48 -36 296 155 165 265 -157 85 92 166 23 174 343 85 -183 9 23 131
6839A31j5j76J26J70l17J89j2p2j97N5L81k39j02K54j6m44M24l90K26J7K60j27
$$ 131 116 -60 66 236 -81 108 96 24 -173 -118 263 24 -78 176 160 -284 140 -250 -24 -7 253 126
6861A26l13J74j68L54j66J80j63j79K56J33l03P0K2J40k25J4K23k96P0M6j27K47
$$ 126 -187 -13 -181 173 7 187 24 -155 101 234 -69 1 23 163 -62 -48 175 -121 -51 -5 -132 115
6883A15p1o6J50j24J86l74J81j16K68l5l00M70k47j81L50m36K6K25k61L99k78
$$ 115 44 -22 128 4 190 -184 -3 -119 149 114 -186 284 37 -144 206 -230 -204 21 -240 159 -119
6904a19J43L8r4j50N01m04J24r2K16%r9R2Pk92Q8qJ4j02J8J62j53P2JO2J05m2
$$ -119 24 62 -32 -182 319 -85 39 -53 163 163 64 156 163 -129 -41 -49 -35 -137 -119 43 -110 -38 -37 25 130 88
6930H8M8j68J63l33J22L77k94K76m23J86K8k42J19L56r6j43j8j39N7J27k48J34
$$ 88 136 -32 131 -202 -80 297 3 279 -144 42 70 -172 -53 303 207 64 46 -93 -36 91 -157 -23
6952b3J2o2R5o8j70J32J25J95Op6m05Q4%K40j22j64K42k94J30J56K87l83N5M8
$$ -23 -11 -73 22 -46 -216 -84 41 236 242 166 -239 -155 -155 85 -37 -201 41 -253 -123 33 320 -63 -8 40
6976D0r3m7J21R0k59q7K63p2J09j41j00J96j38J45l0O9n9J98l48K79j11NmK17
$$ 40 -53 -100 21 111 -148 -235 28 -44 65 -76 -176 20 -118 27 -3 66 7 205 -143 136 25 30 26 243
7000B43m44K69j54M1K33l61J81j20oJ01o1K4K26n2q9j44J95n9k24L37r3k35J30
$$ 243 -201 68 -86 -45 188 -173 8 -112 -118 -17 -78 -54 172 120 31 -113 82 23 -201 136 43 -192 -62
7023f2L50J67o26K71p5O3J6j04k59L9L22r0K24l06m7n1K75k18K80j18j90L3p5
$$ -62 288 455 -171 100 25 88 104 0 -259 -220 102 12 236 -70 -117 -168 107 -111 169 51 -139 -106 -181
7046a81J00m2R6j41K84k15P6M2n4J97p9j10j36K4K8L26k74N8M0m1j97K95k8L4
$$ -181 -81 -123 -27 -168 116 -99 -23 19 -35 162 83 -27 -163 -139 -111 215 -59 -1 39 -2 -199 96 68 102
7070A02l4J71k64k8o5O1p2L06k17J64J24k69J64L8j37mj96J12J95k77K22N4o9
$$ 102 68 239 -25 -53 -118 -57 -129 177 -40 124 248 -21 143 181 44 40 -156 -44 151 -126 96 150 81
7093H1k7J37j64q6K58l24M3J25j95J87k9N0K6j37kJ2j13J57J38q3N4j84%Q6n3
$$ 81 54 191 27 -59 199 -125 -82 43 -152 35 6 56 82 -55 -57 -45 -158 -1 137 54 108 -76 -76 10 -43
7118d3M6J35l65L77N3j17k0l9J42l71L05ol40K10J61o3l22K86k37M37k10j87J23
$$ -43 3 138 -227 150 203 86 66 27 169 -202 103 97 -243 -33 128 65 -257 29 -208 229 19 -168 -45
7141d5j22L52j83%p7j75L94j99Q8q1k23L30Rm9R5OJ21k09J01k28J47Q7J11j18
$$ -45 -167 185 2 2 -75 -250 144 -55 33 -48 -271 59 68 19 114 120 241 32 133 -95 52 139 250 132
7165A32j77J91p8j91K68j12q0q4J02Or3k9K83p6o3j30k11L76j1N0j61Q1k31L17
$$ 132 -45 146 68 -123 145 33 -47 -131 -29 -23 -116 -145 138 62 -1 -131 -342 34 23 73 -88 -7 -238 79
7189G9l7J17k92M1J57L7N5k63J97qm7n9J00Q5k55O6J25o5K34j69J47l09M9J03
$$ 79 42 159 -133 -92 65 102 157 -106 91 83 36 -23 77 162 -93 -27 98 33 267 98 245 -64 -15 88
7213H8k38N1L24l29L28j15n0k2J02j29k4Q5J18j12l12N62l77K48k2m71N23m08
$$ 88 -150 -99 225 -104 224 109 59 37 139 10 -14 71 189 77 -235 327 -50 198 176 -295 228 -180
7235a80J73q9J43k6P9p3k21L49R2k91j82K96n4k15J36J44k35L11k34Q0Mj93J14
$$ -180 -7 -96 47 21 100 27 -194 155 247 -44 -226 70 16 -199 -63 81 -154 157 -77 3 7 -186 -72
7258g2J7r3j53K88j42J12n2J29PO0j17O5m1r1p1J8L18l34J33o1J81j52J30J51
$$ -72 -55 -148 -301 -13 -155 -43 -95 34 41 101 -16 49 8 -83 -154 -136 182 -152 -19 -80 101 -51 79 230
7282B30l75j15l2R5K27P9k05J36j09K40j76J45p5Nk57K75m65O47m28k27L61j00
$$ 230 -145 -260 -292 -197 30 109 -96 40 -69 171 -5 140 65 70 -187 88 -377 270 -158 -385 -24 -124
7304a24K71k16k37J14q2L36M2pj25l9j66J10K10j27R2j94K14j31J45j85J83j96
$$ -124 147 -69 -306 -192 -274 62 104 97 -28 -67 -233 -123 87 -40 52 -142 72 -59 86 -99 84 -112
7326a12J13O6M4j13K7n2M0l66K14n3L76j77N6M7j66P7J06k7J04l90k3O5L99k68
$$ -112 1 67 111 -2 25 -27 13 -353 -139 -192 184 7 63 110 -56 21 127 100 204 -186 -209 -144 255 -13
7350a3m1J22j80J68j46L29j72j45K7J38j94N9K18j04J20k0m22J46q2Q7K91j79
$$ -13 -54 68 -112 56 -90 239 67 -78 -51 87 -107 -48 170 66 186 166 -256 -110 -192 -105 186 7
7372Gk1K50k97K80l82J86J78l04J19o7L26m10kJ87l31K24k2j3R4R0q1Pp8l0O1
$$ 7 -14 236 -61 219 -163 23 201 -103 16 -51 275 -135 -137 50 -281 -57 -79 -92 2 92 11 18 -60 -90 -29
7397b9j39P6J97j52KK11j82P4j18K23l5j9K38j99N2l47J94l8k09P6O8pK21j91
$$ -29 -168 -92 105 -47 -45 166 -16 58 -60 163 128 109 347 148 200 -147 47 9 -200 -124 -56 -63 158 -33
7421c3P6k36K01J2j32K50k14oL0J01j0j94K17Q7J0L5k75J38Q7l1l04J6J69j75
$$ -33 43 -193 8 20 -112 138 -76 -82 -52 49 39 -155 62 149 159 194 -81 57 144 113 -191 -175 -6 -181
7445a81K12j87J30K93j81p8l3j17m1K53r8J4P0j63J5lK48k10k08L25j08j27K60
$$ -181 31 -156 -26 267 86 8 -25 -142 -183 70 -28 -14 56 -107 -92 -95 153 -57 -265 60 -48 -175 85
7468H5J02k53J88j99L9j15R9q6K47k19K03l3j18m6J44k06K73j34K94Lk85P3Lj81
$$ 85 187 -66 122 -77 -38 -153 -54 -140 107 -112 91 58 -60 -106 38 -168 105 -29 265 268 -17 56 59 -122
7492a22R9K54l3k18N2L2R9j29j29J40K80l41N4o5m4l3L60k37J27j51J72O1j27
$$ -122 -23 231 198 -20 32 64 163 34 -95 45 325 -16 38 -27 -71 -104 256 19 146 -5 167 228 101
7515A01j94q4Qj7K53J77j29m6j41K06j46j68L24m18L19l72K48j8m6K63p4p7ML27
$$ 101 -93 -177 -169 -186 67 244 115 69 -72 134 -12 -180 144 -274 45 -327 -79 -97 -143 120 46 -31 -27 300
7539C00j51l75J09N3j03L64l08J46P5l1nr0k78O95m81K19J14m25O6M6j13L21M5
$$ 300 149 -226 -117 -64 -167 197 -111 35 110 79 74 -16 -294 401 -80 139 253 -172 -106 -60 -173 148 193
7562A93l85M8jL07l02rJ12k01J92Q5J59l31R0j51p0M01k87j09Q2J78R9J8k06J47
$$ 193 -192 -144 -145 162 -140 -149 -37 -238 -46 39 198 -133 -43 -194 -264 137 -150 -259 -177 1 100 118 -88 59
7586E9k73J36J11lk2L3j90J48N3P2p5j53J01j19J45P2r3j58L2o2J54k6K31j86
$$ 59 -214 -78 33 30 8 41 -149 -1 52 124 49 -104 -3 -122 23 95 2 -156 -124 -186 -32 -58 173 -13
7610a3J99j42l7J65m26K52O8j95L08k16p8K33M9o5j44K73n2k48j17J73K24j02
$$ -13 186 44 7 172 -254 -2 66 -129 179 -37 -115 118 167 102 -42 231 179 -69 -186 -13 211 109
7632A09L7l10M10l09k52L24N0j57N2n0p6K72j76k30K86L00l99J44r4m4N5J31j26
$$ 109 146 -164 246 -63 -315 9 59 -98 -46 -96 -172 100 -76 -306 -20 280 -119 25 -69 -113 -58 73 -53
7655e3K39J28j17j96j08j5J12p1N36n98K22k92L96k01J24j65j46K63K53m70J97
$$ -53 186 314 197 1 -107 -122 -10 -81 455 -143 79 -213 183 -18 106 -59 -205 58 311 -159 38
7676C8j5r9J50P4j14j49J09k09O4J16K00j87J64L0k27j41K78p9j04K79k09Q9j25
$$ 38 23 -76 74 148 34 -115 -6 -215 -151 -35 165 -22 142 172 -55 -196 82 3 -101 178 -31 58 -67
7699f7J68l25J24K09j63J04k36O9qK7J21k00K11M7j74K20j91M5l1J75o7J25j72
$$ -67 101 -224 -100 109 -54 50 -186 -117 -125 -98 23 -177 34 81 -93 127 -64 -19 -50 125 58 183 11
7722A1j83K63j10n4j33n3M94l39l7J93N2N8l07L94o13M40n3L4RM9J71k06j33R2
$$ 11 -172 91 -19 -73 -206 -259 235 -104 -141 52 104 162 -145 249 -364 76 23 57 66 115 286 80 -53 39
7746C9l38K75J29k53J21l7k25j3jJ21L50k19n8l7O0K9R4R2l53N1J09J15J86j70
$$ 39 -299 -24 105 -148 -27 -64 -289 -302 -303 -182 168 -51 -109 -146 -86 -57 37 129 -224 -173 -64 51 237 67
7770F7Q8p3l64L59k88J43M7o4J71l05M61j54r0J38jJ42j65k83N3L9N5Q4r5O4J35
$$ 67 155 82 -282 77 -211 -68 -21 -85 86 -219 242 88 -2 136 135 277 112 -171 -118 -79 -24 60 -35 29 164
7795A64p6j21j98J72M4J79k20P0j35j43J72J84j57P9j55J46j07L04k01j87K00
$$ 164 88 -33 -231 -59 -15 164 -56 14 -121 -264 -92 92 -65 14 -141 5 -102 202 1 -186 14
7816A4q9J97J63k54J95J7k19k1m70K46J90k2O7j1K16p8j75l%J17o2R3k7j7k54
$$ 14 -75 122 285 31 226 243 24 3 -467 -221 -31 -53 14 3 219 141 -34 -37 -37 80 18 111 84 67 -187
7841a87J8K13k34J05L8j44j8N4L1J85j37Q8k06J13m8L3L16l68J53K6N0k87Q9o1
$$ -187 -169 44 -190 -85 -47 -191 -209 -155 -124 61 -76 12 -194 -81 -129 -96 220 -148 5 31 81 -206 -117 -178
7865a78J32J50r8ON9L2k21L46j78n3J94j01Rk7j79K79l33J96K4k19L42rj49mn8
$$ -178 -46 104 6 12 71 103 -118 228 50 -3 191 90 99 72 -107 172 -161 35 59 -160 182 173 24 20 -38
7890c8J13q1p3K88l83K42Q4j21L8m56L26K17j38J42k37m5J70L2P5k85L6R9N1L1
$$ -38 75 -6 -79 209 -174 68 152 31 69 -387 -61 156 18 160 -77 -122 48 80 155 -130 -94 5 56 87
7914H7j79N3l6l01M97J73o3j08q9p8K1M4k71M35j53L0jp2l01K81N3j87o3K91k53
$$ 87 -92 -39 -75 -376 121 294 231 123 34 -44 -23 21 -250 185 32 62 61 -11 -312 -31 22 -165 -228 63 -190
7939a90K50j66R8O3k27J01j55L90l8p0j70L1K02n8j14KK72k93J53P5m1n9j2pK00
$$ -190 60 -106 -8 55 -172 -71 -226 164 126 56 -114 -83 119 61 -53 -51 221 -72 81 156 115 56 44 37 237
7964B37k20j73J84j26K15j51J15J92r2q8r1j06J96k47K13R5m05M86m18K59Jj40
$$ 237 17 -156 28 -98 117 -34 81 273 181 93 2 -104 92 -155 58 153 -252 234 -184 75 76 -64
7986f4J23Q6q2Mj23J93J2j84N8j57N1J98J07k86Q3k4J23Kl27J75J97m18Q3J75
$$ -64 59 145 63 67 -56 137 149 -35 23 -134 -83 115 222 -64 19 -5 118 120 -207 -32 165 -253 -170 5
8010Ej2J51M1k27m2K31m29M45q3k88M79m65K17k24R8l2N8n3M21l98K9k0J65j61
$$ 5 -7 144 185 -42 -84 147 -282 163 80 -208 271 -194 23 -201 -103 -135 -77 -130 291 -107 -78 -98 67 -94
8034i4J06O5k83m0K87R6l07J22j45J12K15n89K49J97p9n6K52Q7j16Qo4J48n0j18
$$ -94 12 77 -206 -246 41 137 -170 -48 -193 -81 134 -455 -206 -9 -88 -144 108 195 79 87 23 171 121 3
8058CL9k99J60P3K68l05rK97k43R5m8R4Nj56PK07K7j11j27j92J36K76M1k11j77
$$ 3 42 -257 -97 -24 244 -61 -70 227 -16 79 31 125 130 -26 -19 188 215 104 -23 -215 -79 197 238 27 -150
8083a50K28j48J20j02j58L1J99k6O3Q4j55J20j07Q8M9o5j5q2J38j44J58m8o3j5
$$ -150 78 -70 50 -52 -210 -179 20 -6 57 141 -14 106 -1 87 136 71 56 -26 112 -32 126 78 15 0
8107@p7K22j47M6k70K63j85N9J36j79Q2r9J76K30l55K3M6J61k00PO1r6J0O9K03
$$ 0 -77 145 -2 44 -226 37 -148 -89 47 -132 -50 -149 27 257 -98 -75 -29 132 -68 -61 0 -96 -86 -17 186
8132A86j33K0j46m7J78p4J13J81r4Lj70J4N0r1O7j55K4k06L57j0L1j50J16qJ7
$$ 186 53 73 -73 -120 58 -16 97 278 184 187 17 31 81 -10 57 -98 -74 -280 77 67 98 -52 64 56 73
8157G3K43k50j93J78l7K17k12J74k00q5J81N1j06k47K70k51K24k9r2Q1J52j51
$$ 73 316 66 -127 51 14 231 19 193 -7 -92 89 140 34 -213 57 -194 30 1 -91 -10 142 -9
8179ij05Q5k14M77p5k15N2o4J21m6K24j88
$$ -9 -114 -29 -243 234 159 -56 -4 -68 53 7 231 43
8191D3
$$ Imaginary data points
##PAGE= N=2
##DATA TABLE= (X++(I..I)), XYDATA
0@%%%%%%%%%qJ6j6K4l2L2m0N6p2Q8j04J20j44J76k08K41k81L28l84M45n09N84
$$ 0 0 0 0 0 0 0 0 0 0 -8 8 -8 16 -16 16 -24 32 -40 48 -56 64 -80 96 -112 129 -152 176 -208 237 -272 312
31C12o66P58q61R73j096J232j381J544j724J922k139K374k630K909l216L551l916
$$ 312 -354 404 -457 516 -580 652 -729 815 -909 1013 -1126 1248 -1382 1527 -1689 1862 -2054
48b054M318m759N240n770O362p018P749q572R506j0574J1809j3256J4981j7078
$$ -2054 2264 -2495 2745 -3025 3337 -3681 4068 -4504 5002 -5572 6237 -7019 7962 -9116
62i116J9691k3058K7579l4003M3931o1457J01546l63727q5921M88770k15543j02229
$$ -9116 10575 -12483 15096 -18907 25024 -36433 65113 -298614 -384535 104235 -111308 -213537
74b13537J23517J14371r342Q3313q2302k3987J80876O0091k29360J1101K21243
$$ -213537 -90020 24351 15009 98322 16020 -7967 172909 233000 3640 14741 235984
85B35984L6259r9566L939q2415j22333J5659J0015j26554l1515K6741q5510m6573
$$ 235984 272243 172677 176616 94201 -28132 -12473 -2458 -129012 -160527 -133786 -219296 -265869
97b65869J19872N4575l1441N1726O2126k6770K2245O0266q529K0107R3556l186
$$ -265869 -145997 -91422 -122863 -71137 -9011 -35781 -13536 46730 38201 58308 151864 148678
109A48678o6540L9835O5991l6837n0901k6493n6973l5895O059m6026n8402K4403
$$ 148678 82138 121973 187964 151127 100226 73733 16760 -19135 -13076 -59102 -117504 -93101
121i3101J9127n4202k3818L0603N784P506M9052K9208J2746N1162M4717K042J5238
$$ -93101 -73974 -128176 -151994 -121391 -115607 -108101 -59049 -29841 -17095 34067 78784 80826 96064
134I6064K3758j9808k3270P117j1493k7929K653L576k8514k0326q065l1835l0218
$$ 96064 119822 100014 76744 83861 72368 44439 47092 50668 22154 1828 -6237 -38072 -68290
147f8290n466j7014k8815M72J6799J3949L1883M2149K2997K1825L1812J0260r774
$$ -68290 -73756 -90770 -119585 -119113 -102314 -88365 -56482 -14333 8664 30489 62301 72561 62787
160F2787L040L500j4629j1313R35l330k13N602j0336k2855j5395j8068k8335j9583
$$ 62787 65827 69327 54698 43385 44320 40990 40777 46379 36043 13188 -2207 -20275 -48610 -68193
174f8193p087q538q93J4987J5973J4984K5381K4698J0885Q251Q610K267J391M687
$$ -68193 -75280 -83818 -84711 -69724 -53751 -38767 -13386 11312 22197 30448 39058 41325 42716 47403
188D7403j793n581J306j555j1509r358m772r749j4164j1703j1487r127j454r16
$$ 47403 45610 40029 41335 39780 28271 18913 14141 4392 -9772 -21475 -32962 -42089 -43543 -44459
202d4459k531L293Q368N101O142J3460J5203J3392J2496P470K543L209N79o841
$$ -44459 -46990 -43697 -35329 -30228 -24086 -10626 4577 17969 30465 37935 40478 43687 44266 37425
216C7425j0675q903j0282j0974o323k037N06L308O42n004o012l175l616m898k006
$$ 37425 26750 17847 7565 -3409 -9732 -11769 -11263 -7955 -7313 -12317 -18329 -21504 -25120 -30018 -32024
231c2024K058N469J1612J5100J4708J5044J0686J753p271r731j0603j0405r022
$$ -32024 -29966 -24497 -12885 2215 16923 31967 42653 44406 37135 27404 16801 6396 -2626
244b626o859m935m40L455L677L966L363n09n693p227n622k566J961N027O050P972
$$ -2626 -9485 -14420 -14860 -11405 -7728 -3762 -399 -908 -6601 -13828 -19450 -22016 -20055 -15028 -8978 -1006
260a006J0509J0576Q243N538M81o839j1593j2890j0460n520j539k38l92J256K233
$$ -1006 9503 20079 28322 33860 34341 27502 15909 3019 -7441 -12961 -14500 -14738 -15130 -13874 -11641
275a1641K144J637Q47l16j455p45J982N244P870O834K705J048m56O36J648Q03
$$ -11641 -9497 -7860 -7013 -7329 -8784 -9529 -7547 -2303 5567 12401 15106 16154 15698 16334 17982 18785
291A8785j122m106o369p859p149n474m438n131l464k189K196N832Q566Q599O123
$$ 18785 17663 13557 7188 -671 -7820 -13294 -17732 -22863 -26327 -28516 -26320 -20488 -11922 -3323 2800
306B800L948K481K190L051K234M40j624k387j067J29J987K503m11m054p555r708
$$ 2800 6748 9229 11419 14470 16704 17144 15520 13133 12066 12195 14182 16685 16274 12220 4665 -5043
322e043r782q288p501n544j911L490Q554J2005J3058J0915P182K666j647k852
$$ -5043 -14825 -23113 -30614 -36158 -38069 -34579 -26025 -14020 -962 9953 17135 19801 18154 15302
336A5302j225j08l46O7J483J266J470J83k299n788q925j0633j0377q117m342k366
$$ 15302 14077 13969 13623 13690 15173 16439 17909 18092 15793 10005 1080 -9553 -19930 -28047 -32389 -34755
352c4755R19M106N993Q763J0330R641Q140M897J577K05l52m1j56n47m38r58k640
$$ -34755 -33836 -29730 -23737 -14974 -4644 4997 13137 18034 19611 19816 19464 19423 19267 18720 18282 17324 14684
369A4684k917m037n362n973p447p812o164l191r92m02K120L648N535P452Q767
$$ 14684 11767 7730 2368 -3605 -11052 -18864 -25028 -28219 -29211 -29613 -27493 -23845 -18310 -10858 -2091
384b091Q308Q744P366M344J663L3j787l361m633n343m932m250l613l399l006l117
$$ -2091 6217 14961 22327 26671 28334 28367 26580 23219 18586 13243 8311 4061 448 -2951 -5957 -9074
400i074m512n059m682l642l158l65J870N539Q511R522J0303J0493R219O340K061
$$ -9074 -13586 -18645 -23327 -26969 -30127 -30492 -28622 -23083 -14572 -5050 5253 15746 24965 31305 33366
415C3366j236l187m541o624o125n096l893k117k836m095l347l208m128n570m792
$$ 33366 32130 28943 24402 17778 11653 6557 2664 547 -2289 -6384 -9731 -12939 -17067 -22637 -27429
430b7429l112k08K818M677P012J0343J0603R627P001N741L598N20j998m523m713
$$ -27429 -30541 -30749 -27931 -23254 -16242 -5899 4704 14331 21332 27073 30671 31191 29193 24670 19957
445A9957n315m525m575l913l566l998m760m298l342l057k787j911j28K095L710
$$ 19957 14642 10117 5542 1629 -1937 -5935 -10695 -14993 -18335 -21392 -24179 -26090 -26218 -24123 -20413
460b0413N073P185Q428Q307O531N480M114L137R43j861m308n221n267n433o439
$$ -20413 -15340 -8155 273 8580 15111 20591 24705 27842 28785 26924 22616 17395 12128 6695 256
475B56n131l306l683k961k626j388q0R98j59m81J587L178M687N428O791P127O374
$$ 256 -4875 -8181 -11864 -14825 -17451 -18839 -18919 -17921 -18080 -18561 -16974 -13796 -9109 -3681 3110 10237 16611
492A6611N154L566J928n75l213o567o934o639n889n001l338k002n70o60j119r8
$$ 16611 21765 25331 27259 26684 23471 16904 9970 3331 -2558 -7559 -10897 -12899 -13469 -14129 -15248 -15346
508a5346P19J023L77J51J730L671M898N664O046N557N202L252O80r79k564m443
$$ -15346 -14627 -13604 -13227 -13076 -11346 -7675 -2777 2887 8933 14490 19692 22944 23624 22645 20081 15638
524A5638o653p089o121m373k829j432j296J26J50N53nJ260J238J920J773L041
$$ 15638 8985 1896 -4225 -8598 -11427 -12859 -14155 -14029 -13879 -13326 -13331 -12071 -10833 -8913 -7140 -4099
540d099L622M506N218M183L043K540N54n97k059l379m306n240n972n416m417k711
$$ -4099 -477 4029 9247 13430 16473 19013 19567 18970 16911 13532 9226 3986 -1986 -7402 -11819 -14530
556a4530j412o20O42J562K317K524K226K449K629J964K336K164L108L337K765
$$ -14530 -15942 -16562 -15920 -14358 -12041 -9517 -7291 -4842 -2213 -249 2087 4251 7359 10696 13461
571A3461J761J003J12q92k248l755m533n150n835n154m131j844j01J009K156L091
$$ 13461 15222 16225 16337 15445 13197 9442 4909 -241 -6076 -11230 -15361 -17205 -17306 -16297 -14141 -11050
587a1050L791L368K731K064J610J063O03J441J552K793K133J561O38q33j752l021
$$ -11050 -7259 -3891 -1160 904 2514 3577 4180 5621 7173 9966 12099 13660 14298 13465 11713 8692
603H692m720n241m871m633l468j652l04J401K638L438K831L636K970K373R60J252
$$ 8692 3972 -1269 -6140 -10773 -14241 -15893 -16197 -14796 -12158 -8720 -5889 -2253 717 3090 4050 5302
619E302J172K22Q20P52Q97P95K68j122j915k338k660l961l936l646k724j924j90
$$ 5302 6474 6696 7516 8268 9165 9960 10228 9106 7191 4853 2193 -1768 -5704 -9350 -12074 -13998 -14188
636a4188Q76J683L152L634L436L360L285K267J350M69K2l40o48r78r91p98p19
$$ -14188 -13312 -11629 -8477 -4843 -1407 1953 5238 7505 8855 9324 9346 9006 8358 7380 6389 5591 4872
653D872j462j790k117k324k906l069k368j647j010P59J269K568L999M289M279
$$ 4872 3410 1620 -497 -2821 -5727 -8796 -11164 -12811 -13821 -13062 -11793 -9225 -5226 -937 3342
668C342L659L120J574R51p18j045k006j775j825j818j289j058j136j801j751k645
$$ 3342 7001 10121 11695 12646 11928 10883 8877 7102 5277 3459 2170 1112 -24 -1825 -3576 -6221
684f221k246k269j733j077J20J569K615L600M365M380M096L328K006N14k33j190
$$ -6221 -8467 -10736 -12469 -13546 -13426 -11857 -9242 -5642 -1277 3103 7199 10527 12533 13047 12814 11624
700A1624j750k254j983k271k026j446j534j588j256j949k146j709j046l19J51
$$ 11624 9874 7620 5637 3366 1340 -106 -1640 -3228 -4484 -6433 -8579 -10288 -11334 -11653 -11502
715a1502J426K019K763L513M073L776L199K229J226K3q29j624k110k323l022k480
$$ -11502 -10076 -8057 -5294 -1781 2292 6068 9267 11496 12722 12745 11916 10292 8182 5859 2837 357
731C57k206j796j316j160q13r90p93n79K03K77Q40J622K028L064L156L286L166
$$ 357 -1849 -3645 -4961 -6121 -6934 -7924 -8717 -9296 -9093 -8816 -7976 -6354 -4326 -1262 1894 5180 8346
748H346K563J223P04n05j798k518k803k832l254k730j866j326q74m40P7K00q0
$$ 8346 10909 12132 12836 12331 10533 8015 5212 2380 -874 -3604 -5470 -6796 -7670 -8110 -8033 -7833 -7913
765g913J89O63R28J733J675K385K730K604L202K072J626N11n88j490k089l444
$$ -7913 -7724 -7061 -6133 -4400 -2725 -340 2390 4994 8196 10268 11894 12405 11817 10327 8238 4794
781D794l087k990l208j966j843q75j91J30P70N72O02J102J211J752J927K104K368
$$ 4794 1707 -1283 -4491 -6457 -8300 -9175 -9366 -9236 -8466 -7894 -7292 -6190 -4979 -3227 -1300 804 3172
798C172K594K107K121J399P37n25j606j836k863k958l166l091k684j572j468p51
$$ 3172 5766 7873 9994 11393 12130 11605 9999 8163 5300 2342 -824 -3915 -6599 -8171 -9639 -10390
814a0390K13R07R71J171J683J512J780J587J994J414K282J915J778J111Q51j31
$$ -10390 -10177 -9270 -8299 -7128 -5445 -3933 -2153 -566 1428 2842 5124 7039 8817 9928 10779 10648
830A0648p45j166k484l127k929k989l023j923j811p42PR82R56J728J961J556J799
$$ 10648 9903 8737 6253 3126 197 -2792 -5815 -7738 -9549 -10291 -10284 -9302 -8346 -6618 -4657 -3101 -1302
847a302J615J066J758J715R89J320R54P64K26k27j341j757k556k490k922k950
$$ -1302 313 1379 3137 4852 5841 7161 8115 8879 9105 8878 7537 5780 3224 734 -2188 -5138
863e138k034j872p22P3P52J952J789J504J986J600J596J343P70P15J104R06P24
$$ -5138 -7172 -9044 -9766 -9693 -8941 -6989 -5200 -3696 -1710 -110 1486 2829 3599 4314 5418 6324 7048
880G048J04J86m91j205j596j932k293k359k664j823j202q42J38O77J417J958K004
$$ 7048 7152 7338 6847 5642 4046 2114 -179 -2538 -5202 -7025 -8227 -9069 -8931 -8254 -6837 -4879 -2875
897b875J814K139J687J360P75Q78M23L16j44n30o7o72j107j275j698j866k000
$$ -2875 -1061 1078 2765 4125 4900 5778 6201 6517 6373 5843 5776 5104 3997 2722 1024 -842 -2842
914b842k000j984j403o35J3M73J383J996J976K444K472J937J599J068M24J53j87
$$ -2842 -4842 -6826 -8229 -8864 -8851 -8378 -6995 -4999 -3023 -579 1893 3830 5429 6497 6921 7074 6887
931F887q05m30p15r99j004j303j356j494j627j638j568j791n86k68L82J211J597
$$ 6887 6082 5652 4937 3938 2934 1631 275 -1219 -2846 -4484 -6052 -7843 -8429 -8697 -8315 -7104 -5507
948e507K413K357K565K085J475J509M82J12q45o46p18r53j308n19j105j603j216
$$ -5507 -3094 -737 1828 3913 5388 6897 7379 7491 6646 6000 5282 4329 3021 2502 1397 -206 -1422
965a422j507j426j095j114q00k82K60J285J406K029J875K095K189J590J377K60
$$ -1422 -2929 -4355 -5450 -6564 -7364 -7646 -7386 -6101 -4695 -2666 -791 1304 3493 5083 6460 6720
981F720J83p6j173r88j201r39j504j116q83j157j128r79n86m73n21m31P73P27
$$ 6720 6903 6827 5654 4666 3465 2526 1022 -94 -977 -2134 -3262 -4241 -4827 -5300 -5821 -6252 -5479 -4752
999d752Q65J595J971J836J997J219J189P39L29p39r68j010j712j266j364j403
$$ -4752 -3887 -2292 -321 1515 3512 4731 5920 6659 6988 6249 5281 4271 2559 1293 -71 -1474
1015a474j218o05p51j61n37m81L24k4L56J034J105J118J578J617J697J518J178
$$ -1474 -2692 -3297 -4048 -4209 -4746 -5227 -4903 -4927 -4571 -3537 -2432 -1314 264 1881 3578 5096 6274
1032F274O13l8p50q54j068j898j692j295j574j283q69n81r6j56K08R8P54Q81L02
$$ 6274 6887 6849 6099 5245 4177 2279 587 -708 -2282 -3565 -4434 -5015 -5111 -5267 -5059 -4961 -4207 -3326 -3024
1051c024J417J452R92J751J298J400Q28Q14o9n66p93j419j825j756j277j747j016
$$ -3024 -1607 -155 837 2588 3886 5286 6114 6928 6859 6293 5500 4081 2256 500 -777 -2524 -3540
1068c540j097p69j68n0N25M19M30R01J111R10J242J337R92J579J166N76M76J04
$$ -3540 -4637 -5406 -5574 -5624 -5099 -4680 -4250 -3349 -2238 -1328 -86 1251 2243 3822 4988 5564 6040 6144
1086F144k67o59j592j325j587j415j716j251j118m79l04Q3O18M75Q86R23Q96J214
$$ 6144 5877 5218 3626 2301 714 -701 -2417 -3668 -4786 -5265 -5569 -5486 -4868 -4393 -3507 -2584 -1688 -474
1104d74J032R85J115P40O13Q75M00J29m17o79q31j460j643j271j650r59r28o98
$$ -474 558 1543 2658 3398 4011 4886 5286 5415 4998 4319 3488 2028 385 -886 -2536 -3495 -4423 -5121
1122e121j38J32J000O00P26Q94J085J295O26R37R13J02J073K06L13j76l35o48
$$ -5121 -5259 -5127 -4127 -3527 -2801 -1907 -822 473 1099 2036 2949 3051 4124 4330 4643 4467 4132 3484
1140C484o34j283j527j271j518j352m49p29k46Q20L69J103Q62J325R76J516M27
$$ 3484 2850 1567 40 -1231 -2749 -4101 -4550 -5279 -5525 -4705 -4336 -3233 -2371 -1046 -70 1446 1873
1157A873J321K75N59K88n1O6l49l27j073q18j099j118j245j481r74q28m58J15
$$ 1873 3194 3469 4028 4316 4265 4331 3982 3655 2582 1764 665 -453 -1698 -3179 -4153 -4981 -5439 -5324
1175e324L85M70R12J277J355J407J291Q00O98O78O57%l56J3l36o68j054n54r62
$$ -5324 -4939 -4469 -3557 -2280 -925 482 1773 2573 3271 3949 4606 4606 4250 4263 3927 3259 2205 1651 689
1194F89j263j058j212r39p89n28l00J66M52J135J008J433J493J080J265J174K33
$$ 689 -574 -1632 -2844 -3783 -4572 -5100 -5400 -5234 -4782 -3647 -2639 -1206 287 1367 2632 3806 4039
1211D039K77R3k26k73l50q86l28r82r56j293n81r93r38p59n80p1J79O44M65J175
$$ 4039 4316 4409 4183 3910 3560 2674 2346 1364 408 -885 -1466 -2459 -3397 -4156 -4736 -4807 -4628 -3984 -3519 -2344
1231b344J297J100J477Q29J028L46L38R1j94k78p59q84p31m18j072r46o84n12
$$ -2344 -1047 53 1530 2359 3387 3733 4071 4162 3968 3690 2931 2047 1316 898 -174 -1120 -1804 -2316
1249b316n56p90q9k78L38L65N95J019J061R44J401P44R07M39L90l1n54o39r50
$$ -2316 -2872 -3662 -3751 -4029 -3691 -3326 -2731 -1712 -651 293 1694 2438 3345 3784 4174 4143 3589 2950 2000
1268B000n83o85j053p80o62k41o63p62J8r7kK98M53P28Q39R05J153J022R49Q08
$$ 2000 1417 732 -321 -1101 -1763 -2004 -2667 -3429 -3411 -3508 -3510 -3212 -2759 -2031 -1192 -287 866 1888 2837 3645
1288C645L70J49J6m59r19o68j013q66j016q01p44k65r08j10q1l4L15L77K16J142
$$ 3645 4015 4164 4180 3721 2802 2134 1121 255 -761 -1562 -2306 -2571 -3479 -3589 -3670 -3704 -3389 -3012 -2796 -1654
1308a654N85J027Q94J408R06L71Q16m2m52j56j079m96p65j210r78r50p18l71n92
$$ -1654 -1069 -42 852 2260 3166 3537 4353 4311 3859 3703 2624 2128 1363 153 -825 -1775 -2493 -2864 -3456
1327c456k18o8K74K25L67M21P21Q56P17R46Q72R23P06N63j33P2k50m00j064r39
$$ -3456 -3674 -3742 -3468 -3243 -2876 -2455 -1734 -878 -161 785 1657 2580 3286 3849 3716 3788 3538 3138 2074 1135
1347A135p14j027j022l26p27q5o36J35K85J64N42J69P70O38Q84O37Q43M14R00
$$ 1135 421 -606 -1628 -1954 -2681 -2766 -3402 -3267 -2982 -2818 -2276 -2107 -1337 -699 185 822 1665 2079 2979
1366B979J92K8J8k63n26n36p64j178p53n93q11j72n78L28j1k23O53P19L79O83
$$ 2979 3171 3199 3217 2954 2428 1892 1128 -50 -803 -1396 -2207 -2379 -2957 -2629 -2640 -2863 -2210 -1491 -1112 -429
1386d29P25L03O63K58R45K20K0P1q3l02l80r15p40r54p16l02o81p83q1J54K24
$$ -429 296 599 1262 1520 2465 2685 2705 2776 2693 2391 2011 1096 356 -598 -1314 -1616 -2297 -3080 -3161 -3007 -2783
1407b783O35J63P82O40N38O45Q47M42L39N00L6Nj16O1q45l38p54o72j078m09q75
$$ -2783 -2148 -1985 -1203 -563 -25 620 1467 1909 2248 2748 2784 2789 2673 2734 1889 1551 797 125 -953 -1362 -2237
1428b237r99Qj44J28L70J86O38Q30R10M46Q47L44N56O12K79K08j05j31j67l58
$$ -2237 -3236 -3228 -3372 -3244 -2874 -2688 -2050 -1220 -310 136 983 1327 1883 2495 2774 2982 2877 2746 2579 2221
1448B221p12n55p48p66j054l95p79m49N7j83K58N40Q12N57Q42M83Q56M93L98M87
$$ 2221 1509 954 206 -560 -1614 -2009 -2788 -3237 -3180 -3363 -3105 -2565 -1753 -1196 -354 129 985 1478 1876 2363
1468B363J00K15j18k02J30m72n12o52q77l14q05m19q80j75j82o4N25K15N44O12
$$ 2363 2463 2678 2560 2358 2488 2016 1504 852 -25 -339 -1144 -1563 -2443 -2618 -2800 -2864 -2339 -2124 -1580 -968
1488i68P52N89O13N10N64J60J84k75J54j27m93n69k94o99m97j30p47m19j51l29
$$ -968 -216 373 986 1496 2060 2220 2404 2129 2283 2156 1663 1094 800 101 -396 -526 -1273 -1692 -1843 -2172
1508b172j64RM53K51N39N31P56P13O80K14K23M57k44N7j94m68o06l37j16p79q33
$$ -2172 -2336 -2327 -1874 -1623 -1084 -553 203 916 1596 1810 2033 2490 2246 2303 2109 1641 1035 698 582 -197 -1030
1529a030j61l91l18l64k13k6K28N21L81O82N32N97N00O86L99M92K67p8k98m18
$$ -1030 -1191 -1582 -1900 -2264 -2477 -2503 -2275 -1754 -1373 -691 -159 438 938 1624 2023 2515 2782 2704 2406 1988
1549A988n81l08n81k10p03r56q1l85l77k7m63L77L28K70M05N13N43P66N57M35
$$ 1988 1407 1099 518 308 -395 -1351 -1432 -1817 -2194 -2221 -2684 -2307 -1979 -1709 -1304 -791 -248 518 1075 1510
1569A510O65L21K42r4J70q26k02p72n78n12l71n83k41n84l93K64q4l03N91J04
$$ 1510 2175 2496 2738 2644 2814 1988 1786 1014 436 -76 -447 -1030 -1271 -1855 -2248 -1984 -2068 -2371 -1780 -1676
1589a676M32K25L86Q06Q37M20L98M75J47J84j81l87n72m41m41n02q04l39j94k88
$$ -1676 -1244 -1019 -633 173 1010 1430 1828 2303 2450 2634 2453 2066 1494 1053 612 110 -694 -1033 -1227 -1515
1609a515o03J49rM02j51K74L72M08O72K18N36O15L59K63J52k90m6p5l57n06q81
$$ -1515 -2118 -1969 -1978 -1576 -1727 -1453 -1081 -673 -1 217 753 1368 1727 1990 2142 1852 1806 1731 1374 868 -13
1630a3k45k93p17j98l36K8JR3J68L10N3L78Q13J6M24M65Q69J01P7j19j52j7l17
$$ -13 -258 -551 -1268 -1466 -1802 -1774 -1773 -1680 -1512 -1202 -1149 -771 42 58 482 947 1816 1917 1994 1875 1723 1706 1389
1653A389m04o97k44q67j74m18n13m2J1J46J03J82M03N96J60N50M80L01L67N29
$$ 1389 985 288 44 -823 -997 -1415 -1928 -1970 -1959 -1813 -1710 -1528 -1125 -529 -369 181 661 962 1329 1858
1673A858l7K31K01m04l9m65o56n24o91l20l75n39j73j34k8J87K3K78M43L09M78
$$ 1858 1821 2052 2253 1849 1810 1345 689 165 -526 -846 -1221 -1760 -1933 -2067 -2095 -1908 -1885 -1607 -1164 -855 -377
1694c77L81L64P87K57K40K77L22k86j10l37l73j23l57p57o45l78m78p8N6m98K18
$$ -377 4 368 1155 1412 1652 1929 2251 1965 1855 1518 1145 1022 665 -92 -737 -1115 -1593 -1671 -1615 -2113 -1895
1715a895K09J54N09L45M24J52O22K01J91L12N88k62J43J54n28Q5o03l33m60n70
$$ -1895 -1686 -1532 -1023 -678 -254 -102 520 721 912 1224 1812 1550 1693 1847 1319 1404 801 468 8 -562
1735e62k79l72l11k17N3m30P12L45M25J04O59J4L94J61P01L4O2j41N6k02k01j22
$$ -562 -841 -1213 -1524 -1741 -1688 -2118 -1406 -1061 -636 -532 127 141 535 696 1397 1431 1493 1352 1408 1206 1005 883
1757H83m68l16m64j59m98l0n16j67m9M33j16N53J39M24L01N25K48K85J65l1K26
$$ 883 415 99 -365 -524 -1022 -1052 -1568 -1735 -1784 -1351 -1467 -914 -775 -351 -50 475 723 1008 1173 1142 1368
1778A368J63l16m68Q7k70m54l19l63l56m28j5k91P1j31K43O03K90J69O10L09J06
$$ 1368 1531 1215 747 834 564 110 -209 -572 -928 -1356 -1371 -1662 -1591 -1722 -1479 -876 -586 -417 193 502 608
1799F08P75q5L45K64l14m4k32l73j90l31l69l98k08m19l23l83k26J33K06o9J62
$$ 608 1383 1298 1643 1907 1593 1549 1317 944 754 423 54 -344 -552 -971 -1294 -1677 -1903 -1770 -1564 -1633 -1471
1820a471L39N74M09L85K89N72J68K31L09j65k1k65j85j78n21m01j63m57j37l43
$$ -1471 -1132 -558 -149 236 525 1097 1265 1496 1805 1640 1619 1354 1169 991 470 69 -94 -551 -688 -1031
1840a031k33l49j09J04M5L84L01K46M54N41K66J95O26J55l68L33q2o10j03j08
$$ -1031 -1264 -1613 -1722 -1618 -1573 -1189 -888 -642 -188 353 619 814 1440 1595 1227 1560 1478 868 765 657
1860F57k15m47j98l47j41k42j27j90Q6Q2Q8J81K06M81K13L13K85K91J86n6MQ1
$$ 657 442 -5 -203 -550 -691 -933 -1060 -1250 -1164 -1082 -994 -813 -607 -126 87 400 685 976 1162 1106 1110 1191
1882A191j13k68k62j40m07m05J54o09M1k13Q0k60J03K58j70L82K13K06M39M19
$$ 1191 1078 810 548 408 1 -404 -250 -859 -818 -1031 -951 -1211 -1108 -850 -1020 -638 -425 -219 220 639
1902F39L9L86J58J33j96j62J8k20k02o53l24l52R1m12j15J86j12M1J36J19K70
$$ 639 678 1064 1222 1355 1159 997 1015 795 593 -60 -384 -736 -645 -1057 -1172 -986 -1098 -1057 -921 -802 -532
1923e32N0J36L41N23J49K64J87K93r0J20k99J36n82j37k89p24pl85k46j94j10
$$ -532 -482 -346 -5 518 667 931 1118 1411 1321 1441 1142 1278 696 559 270 -454 -461 -846 -1092 -1286 -1396
1944a396J10OlL62K52l5M15M22L05L05l7O04k76L46M7k72m01K53m00m61k57m60
$$ -1396 -1286 -1280 -1283 -921 -669 -704 -289 133 438 743 706 1310 1034 1380 1427 1155 754 1007 607 146 -111 -571
1966e71o8l12j65M1j15j89L24M15n7J96N86n9K24Q4K52K83K24J15j28j37KJ0o19
$$ -571 -639 -951 -1116 -1075 -1190 -1379 -1055 -640 -697 -501 85 26 250 334 586 869 1093 1208 1080 943 945 955 336
1989C36k91j62l09l59j44j19K81m06K84L70j56J32L32K71O2K85j64P88k51J22
$$ 336 45 -117 -426 -785 -929 -1048 -767 -1173 -889 -519 -675 -543 -211 60 122 407 243 1031 780 902
2009I02J34j7k72j17j74k49p9m28j82m24r1k05J42J52JP16l40N05J98k31M81K84
$$ 902 1036 1019 747 630 456 207 128 -300 -482 -906 -997 -1202 -1060 -908 -907 -191 -531 -26 172 -59 422 706
2031G06Q2j17O2JK21j03n78L43k80k61k75j31l94k36K0j11j9J32K34j76M99M30
$$ 706 788 671 733 734 955 852 274 617 337 76 -199 -330 -724 -960 -940 -1051 -1070 -938 -704 -880 -381 49
2053D9J53k8O44j34rK08L11m15K05l01O9j74r8l59l37k15j35j79l48j32K0O9J0
$$ 49 202 174 818 684 675 883 1194 779 984 683 752 578 480 121 -216 -431 -566 -745 -1093 -1225 -1205 -1136 -1126
2076a126L39J90J82M25M19K0J72J75K99j23J04r4k59O1k93j62k60r3l20j47l12
$$ -1126 -787 -597 -415 10 429 449 621 796 1095 972 1076 982 723 784 491 329 69 -24 -344 -491 -803
2097h03p1k45N0p8K26L80J24P0M38K57qJ87M24m03M59j40m00O4k08k9p9k46k20
$$ -803 -874 -1119 -1069 -1147 -921 -541 -417 -347 91 348 340 527 951 548 1007 867 467 531 323 294 215 -31 -251
2120b51j23l10K67j19m48K27M4J02p7L57K47R6L16J73K52qj85M3Lj2J24m39k90
$$ -251 -374 -684 -417 -536 -984 -757 -713 -611 -688 -331 -84 12 328 501 753 745 560 603 606 594 718 279 -11
2143a1l32J26m59K89j06k08p0j42R4j26N39J38K6M03J80k9K76J59K00Q9j53k25
$$ -11 -343 -217 -676 -387 -493 -701 -771 -913 -819 -945 -406 -268 -242 161 341 312 588 747 947 1036 883 658
2165F58N6n10L64l02n46k40J06k22k02K5K83l36K83p2P8L74j74N81K79L18l9K15
$$ 658 714 204 568 266 -280 -520 -414 -636 -838 -813 -530 -866 -583 -655 -577 -203 -377 204 483 801 762 977
2187I77m1N8K4l31k45j77j23l81J01p8l08o9k54MK5J30m5o3K52L47n5M31J47J5
$$ 977 936 994 1018 687 442 265 142 -239 -138 -216 -524 -593 -847 -843 -818 -688 -733 -796 -544 -197 -252 179 326 341
2211C41L90o6K10n1l8P8k13Q3k73l96j56q2m05J8k99L02N6j92L48k86P4J63J80
$$ 341 731 665 875 824 786 864 651 734 461 65 -91 -173 -578 -560 -859 -557 -501 -693 -345 -631 -557 -394 -214
2234b14K52K54l1O8K60n1L04k95N2j94k50l7j72k55p2r5P2l30O8J74R6m51M13
$$ -214 38 292 261 329 589 538 842 547 599 405 155 118 -54 -309 -381 -476 -404 -734 -666 -492 -396 -847 -434
2257d34K57M9O8K05M37k10K06k29J33L66j33j50k78j39j24j36k34j97J31l11K5
$$ -434 -177 -128 -60 145 582 372 578 349 482 848 715 565 287 148 24 -112 -346 -543 -412 -723 -698
2278f98jK86k29K19J26K06J03L07PM9J24k22P6L80k96n6J91m20o7Q0l00k45L3
$$ -698 -699 -413 -642 -423 -297 -91 12 319 326 375 499 277 353 733 437 381 572 152 85 165 -135 -380 -347
2301c47n60K01j3J44j79N46k83L36J41K38j53M67r6J74k02J23L0J06J1L6l22j03
$$ -347 -907 -706 -719 -575 -754 -208 -491 -155 -14 224 71 538 442 616 414 537 567 673 684 720 398 295
2323B95l61o8l16k1j90k2k15J10m4K84M0L12J70J1J86K39J26j50L18j46O6qQ8
$$ 295 -66 -134 -450 -471 -661 -683 -898 -788 -832 -548 -508 -196 -26 -15 171 410 536 386 704 558 624 616 704
2346G04m61J11j72k85j23P4j38k16j10j47J9M9J49M9J14P2L42L91k54J52L50l09
$$ 704 243 354 182 -103 -226 -152 -290 -506 -616 -763 -744 -695 -546 -497 -383 -311 31 422 168 320 670 361
2368C61J90Ok24J3j45j31J56l49J67k44n7O5j84j64q7K66P6N4J8K85Q8Q5m8K40
$$ 361 551 557 333 346 201 70 226 -123 44 -200 -257 -192 -376 -540 -627 -361 -285 -231 -213 72 160 245 197 437
2392D37p3kM0j2j50nk1l88J37r0j70p8r5R3j58J22l6J58O6J13J22J83J54K60M4
$$ 437 364 362 402 390 240 235 214 -174 -37 -127 -297 -375 -470 -377 -535 -413 -449 -291 -225 -112 10 193 347 607 651
2417F51k2j54J47p7oj58l83J58j26J94n30N2k23J43k38k1K64K1l46R2M56o1J12
$$ 651 629 475 622 545 539 381 -2 156 30 224 -306 -254 -477 -334 -572 -593 -329 -308 -654 -562 -106 -167 -55
2440e5L24K90l1K2J03l6l07J10j3J61m75l26K20k20l92M61m26j76L26K9j66k0
$$ -55 269 559 528 550 653 617 310 420 407 568 93 -233 -13 -233 -625 -164 -590 -766 -440 -411 -577 -597
2462e97N32q4j0J80L32Kj7k5L02k29OJ54j78k0k20k64m1om1k28R6j58Q6j28L55
$$ -597 -65 -149 -159 21 353 355 338 313 615 386 392 546 368 348 128 -136 -177 -183 -224 -452 -356 -514 -428 -556 -201
2487b01k24J06o7J11L41J50k15M31P1l4j64J33q0m6O2k74j80P1l79K11l36K65
$$ -201 -425 -319 -386 -275 66 216 1 432 503 469 305 438 358 312 374 100 -80 -9 -388 -177 -513 -248
2509b48q0Q9J39n4j48j7L55J41K1j47J22M47k15J08R0m33Q9r8O0l96k01n5R3O5
$$ -248 -328 -239 -100 -154 -302 -319 36 177 198 51 173 620 405 513 603 170 259 161 221 -175 -376 -431 -338 -273
2533b73j16j50O2K39J40r3K38r2j13L19J90n8K4j25J87J40m1pn31K61j21j16K5
$$ -273 -389 -539 -477 -238 -98 -191 47 -45 -158 161 351 293 317 192 379 519 478 471 -60 201 80 -36 -11
2556a1l13J35j97k06J30Q8Lj41J24K02J73K10j13R1K89l20N68k36J03j39L7q9
$$ -11 -324 -189 -386 -592 -462 -374 -371 -512 -388 -186 -13 197 84 175 464 144 712 476 579 440 477 388
2578C88j25p6j58P9l92pn8r4l57L18O1r5M3M40J6J5j1K46j17K46j89J53J69k18
$$ 388 263 187 29 108 -284 -291 -349 -443 -800 -482 -421 -516 -473 -33 -17 -2 -13 233 116 362 173 326 495 277
2602B77K05l5O6p96N54j60j66k85J19j82l8J32l7P5J34K74j88K36j34J19O2L9
$$ 277 482 447 513 -283 271 111 -55 -340 -221 -403 -441 -309 -346 -271 -137 137 -51 185 51 170 232 271
2624B71j75N5K13k46L34j34r5k64P0M1l22p0K33l22kJ65m8R3J20K2J49J50j26
$$ 271 96 151 364 118 452 318 223 -41 29 70 -252 -322 -89 -411 -413 -248 -296 -203 -83 -61 88 238 112
2647A12O9rJ06J10p0l0p0M6k77J03n7n9l16Pk04K38nj33J23J45m8K18J89j6k5
$$ 112 181 172 278 388 318 288 218 264 -13 90 33 -26 -342 -335 -539 -301 -306 -439 -316 -171 -219 -1 188 172 147
2672A47N7R7J74k68K07j85j01j21Q7R5l13J70l91L00k55Nj78o8p3M09J35J68J36
$$ 147 204 301 475 207 414 229 128 7 94 189 -124 46 -345 -45 -300 -295 -473 -541 -614 -205 -70 98 234
2695B34l70lL55o8K32J19p9J75k33k88K89ll62k8J00l61Q3Q7L2k22J67p1O8m36
$$ 234 -136 -139 216 148 380 499 420 595 362 74 363 360 -2 -30 70 -291 -208 -121 -89 -311 -144 -215 -147 -583
2719e83K84J41j06K18Q1N5l2P1M21k30K8J08m23J57j67p0j11K60j39l83J75l5
$$ -583 -299 -158 -264 -46 35 90 58 129 550 320 348 456 33 190 23 -47 -158 102 -37 -420 -245 -280
2741b80K65l12J60l13J60N20l15J90m9K14j7R2j67K98m95J94J32l39M06m44l9
$$ -280 -15 -327 -167 -480 -320 200 -115 75 26 240 223 315 148 446 -49 145 277 -62 344 -100 -139
2762a39J16l23L60l95J03l7L1N4K32O7J80k22Lj24P1L56q3K04k63j25Q6j37K17
$$ -139 -23 -346 14 -381 -278 -315 -284 -230 2 69 249 27 30 -94 -23 333 250 454 191 66 152 15 232
2785B32l01k59o0L8J27j27l9K37PJ79q0j31K51m1ON7K30m04L53K2r1K49j30k42
$$ 232 -69 -328 -388 -350 -223 -350 -389 -152 -145 34 -46 -177 74 33 39 96 326 -78 275 297 206 455 325 83
2809H3o3J04m24m5J50Ll66J87k14M25j81R0J1l9J95l8M12k14J09J15J55j96O2
$$ 83 20 124 -300 -345 -195 -192 -558 -371 -585 -160 -341 -251 -240 -279 -84 -122 290 76 185 300 455 259 321
2832C21O1j66m1j96J73j21j03o3r2k45R7R3J04j24P4K50k69L28j10L8Q1K12r5
$$ 321 382 216 175 -21 152 31 -72 -135 -227 -472 -375 -282 -178 -302 -228 22 -247 81 -29 9 90 302 207
2855B07J35k52P8K11j12j66O8M1n10J87k8N8l63M92k11j57J15l9J5MK55J15k72
$$ 207 342 90 168 379 267 101 169 210 -300 -113 -141 -83 -446 46 -165 -322 -207 -246 -231 -227 28 143 -129
2878a29K36M7NJ31j57k6J83m02J27Q2k39J89j13m8rkr5r0R3M7o8K75J14j13J09
$$ -129 107 154 159 290 133 107 290 -112 15 97 -142 47 -66 -114 -123 -125 -220 -310 -217 -170 -238 37 151 38 147
2903A47Q6Qj98M18l67p4J71k92O0p6L1j73J21j11J08P5m86M05Q6n7J14j31M22
$$ 147 233 241 43 461 94 20 191 -101 -41 -117 -86 -259 -138 -249 -141 -66 -552 -147 -61 -118 -4 -135 287
2926B87k29K7J68K1l5M7O3k42R7K0k00K50j03j51k20j59J54j58K69j99L28m76
$$ 287 58 85 253 274 239 286 349 107 204 224 24 274 171 20 -200 -359 -205 -363 -94 -293 35 -441
2948d41K48Q4l02L30q4n6L97j43J63j0o2K92j30p5R0k02j35Mj17k8K46Jm11K69
$$ -441 -193 -109 -411 -81 -165 -221 176 33 196 186 124 416 286 211 301 99 -36 -32 -149 -177 69 70 -341 -72
2972g2KR7j19l86J94K75mJ78q3j69K93R3J13l44K19k10LPK00l25j77j22N52j59
$$ -72 -70 27 -92 -478 -284 -9 -13 165 82 -87 206 299 412 68 287 77 80 87 287 -38 -215 -337 215 56
2996E6p2k00n8J32j90K78Q6k18K73l34K76K93N4k45o8j20J12j05L1L5L49l74j54
$$ 56 -16 -216 -274 -142 -332 -54 32 -186 87 -247 29 322 376 131 63 -57 55 -50 -19 16 365 -9 -163
3019a63K57j05k78J46J14l19P2N16j64l85K97J64k13r0L38O8j44j20M8Q4r6J31
$$ -163 94 -11 -289 -143 -29 -348 -276 240 76 -309 -12 152 -61 -151 187 255 111 -9 39 123 27 158
3041A58l0l46q6K86j24j26K7M6j57J11L57k75K24j14K69J24k13R5r6K26n0k9J6
$$ 158 128 -218 -304 -18 -142 -268 -241 -195 -352 -241 116 -159 65 -49 220 344 131 226 130 356 306 277 293
3064B93l25K52k48M1k21m9o2J73P8k9o0J8m8k45K89L7J02O0o5J24Q0K1k30M43
$$ 293 -32 220 -28 13 -208 -257 -319 -146 -68 -97 -157 -139 -187 -432 -143 -106 -4 56 -9 115 195 216 -14 429
3088D29n7n8k96L59k40j82rR2l0K4k50q6L02l56M06k03p5R9J02m8N3N2J5j6K28
$$ 429 372 314 18 377 137 -45 -54 38 8 32 -218 -304 -2 -358 48 -155 -230 -131 -29 -77 -24 28 43 27 255
3113B55J06m23K88q5j42J0K54j96j62n0J35k35j38K29o8j7J31O9J3N5k81K26o3
$$ 255 361 -62 226 141 -1 9 263 67 -95 -145 -10 -245 -383 -154 -222 -239 -108 -39 -26 29 -252 -26 -89
3136h9L60N0QQ0k52L3m8nj75J22n3L4j09K3j93J3K81k83J92J69l98K97j24N7Q5
$$ -89 271 321 329 409 157 190 142 137 -38 84 31 65 -44 -21 -214 -201 80 -203 -11 158 -240 57 -67 -10 75
3161G5P2J41j52j57L8J9k39J41J2J95m36L58j2j96J88j15j44OK8K98q4l42K35
$$ 75 147 288 136 -21 17 36 -203 -62 -50 145 -291 67 55 -141 47 -68 -212 -206 -178 120 36 -306 -71
3184g1J99p7K91n1j19j10J26k9j48l9Q9j14Q9k8j81J17J40k60k45O2K98l90L89
$$ -71 128 51 342 291 172 62 188 159 11 -28 61 -53 36 8 -173 -56 84 -176 -421 -359 -61 -451 -62
3207f2n1J15J15j21l53M43J50k6K29n41L82r4p1l3n0Q3k4j98Q9J8N9j82k52pJ40
$$ -62 -113 2 117 -4 -357 86 236 210 439 -102 280 186 115 82 32 115 91 -107 -18 0 59 -123 -375 -382 -242
3232b42L01l31O3J89j35J98R0r9J40q9J42l86R5J63k02O5j65J83O6M1l35K82l47
$$ -242 59 -272 -209 -20 -155 43 133 34 174 85 227 -159 -64 99 -103 -38 -203 -20 46 87 -248 34 -313
3255c13K14p7J02j0K8k05M83k05J1K37n6q0n3J41o9k15Q6K6r5O1l32p0N36k47
$$ -313 -99 -176 -74 -84 -56 -261 222 17 28 265 209 129 76 217 148 -67 19 45 -50 11 -321 -391 145 -102
3279a02k28P7L74j65M9K78l57J31K44l50K3L14l07k6J7p8J36N2J5r1O4j39r1O3
$$ -102 -330 -253 121 -44 5 283 -74 57 301 -49 -26 288 -19 -45 -28 -106 30 82 97 6 70 -69 -160 -97
3303i7L9qJ55j25p3J65r0J77Q7k28J73n9j56P6j5J68k6j90K57p1m7k47m0k24M11
$$ -97 -58 -66 89 -36 -109 56 -34 143 230 2 175 116 -40 36 21 189 163 -27 230 159 112 -135 -175 -399 12
3328A2k30J57J23j00j63j12l1O7O2L09j8j51l1J44k41L7K93P2k37K35L1n24K21
$$ 12 -218 -61 62 -38 -201 -313 -344 -277 -215 94 76 -75 -106 38 -203 -166 127 199 -38 197 228 -296 -75
3351g5J18j02K02j72L4l07J26K15j12J5rL67l82M9K91k94j14J82Q8j66L46n29
$$ -75 43 -59 143 -29 5 -302 -176 39 -73 -58 -67 300 -82 -33 258 -36 -150 32 120 -46 300 -229
3373b29L85j41J67j28j05J37j13r2p9J13o5k5L0K78j70l64L11L20k82L4J61M7
$$ -229 156 15 182 54 -51 86 -27 -119 -198 -85 -150 -175 -145 133 -37 -401 -90 230 -52 -18 143 190
3395A90j32j24K12m10K86J0j85K57k42K91q6m40J31J18K5p8K75j59J65j31J23
$$ 190 58 -66 146 -264 22 32 -153 104 -138 153 67 -373 -242 -124 -99 -177 98 -61 104 -27 96
3416I6q6J8p4N5J19L54l10K28j61k32k66K07pK4m4j75J18j1J21q1k8R2J35j49
$$ 96 10 28 -46 9 128 482 172 400 239 7 -259 -52 -59 -35 -79 -254 -136 -147 -26 -107 -135 -43 92 -57
3440e7J05OK42k53K75j74P2J8j87J45j8k1l95R3M1j28p1N28o62K10J75j22J39
$$ -57 48 54 296 43 318 144 216 234 47 192 174 153 -242 -149 -108 -236 -307 221 -441 -231 -56 -178 -39
3463c9j15P3O2n4k92J11L34p2K30q3j98Q0J09K8k48n7qK23m14J57J25J13j78j0
$$ -39 -154 -81 -19 -73 -365 -254 80 8 238 155 -43 37 146 174 -74 -131 -139 84 -330 -173 -48 65 -113 -123
3487a23j82N16k36R6M1k75L38j70K97k12Kk29O0K9P6M3o0j80J83lR0j64M0p9n0
$$ -123 -305 211 -25 71 112 -163 175 5 302 90 92 -137 -77 -48 28 71 11 -169 14 11 101 -63 -23 -102 -152
3512a52K00j62J98k59J19J66j16R7l6p4P1j25K79m3J96l31r6j38O0R2m5J23j5
$$ -152 48 -114 84 -175 -56 110 -6 91 55 -19 52 -73 206 163 359 28 -68 -206 -146 -54 -99 24 9
3535IO0P3j96j55K42p9k0j13J97j33M17j03k48N5K66j57k18K1J97k87K32l83J85
$$ 9 69 142 -54 -209 33 -46 -66 -179 18 -115 302 199 -49 6 272 115 -103 -82 115 -172 60 -323 -138
3558a38J95q8p2pP6j08O3k6L15q8p4l0K16j29q4J52k04J02L1R1n2m08M01l36J92
$$ -138 57 -31 -103 -110 -34 -142 -79 -105 210 122 48 18 234 105 21 173 -31 71 102 193 141 -267 134 -202 -10
3583a0P8l20k9J27R7J31m45K78N5L7k79M36pk49K97r0j56K34k90L66N1k64J2M8
$$ -10 68 -252 -281 -154 -57 74 -371 -93 -38 -1 -280 156 149 -100 197 107 -49 185 -105 261 312 48 60 108
3607A08K3j96J04n1J4j24J75J34N6l09k46K60%j09L85J11l51J33R9k25R1k41J02
$$ 108 131 -65 39 -12 2 -122 53 187 243 -66 -312 -52 -52 -161 224 335 -16 117 216 -9 82 -159 -57
3630e7J99m0pJ43k34o2m5J11M4k64o0J54J03l1l2K03k66N26r9k59j15N7J53Q5
$$ -57 142 102 95 238 4 -58 -103 8 52 -212 -272 -118 -15 -46 -78 125 -141 385 286 27 -88 -31 122 207
3654B07k22k31J43J35q1j90k6L92o4j03j66L88l65n3M35n61L32M4J8j27N4Q7J48
$$ 207 -15 -246 -103 32 -49 -239 -265 127 63 -40 -206 182 -183 -236 199 -362 -30 14 32 -95 -41 46 194
3677A94K05l39L0L4n6q9K05L7j97m04N05k37J23n3M7L3j58Q3q1K63j36n2K35j88
$$ 194 399 60 90 124 68 -21 184 221 24 -380 125 -112 11 -42 5 38 -120 -37 -118 145 9 -43 192 4
3701Dj9K83j11j48K27l07l4N4m1K71l72J04L4J55k57l2m4L30j25o8R0j04N5k84
$$ 4 -15 268 157 9 236 -71 -105 -51 -92 179 -193 -89 -55 100 -157 -189 -233 97 -28 -96 -6 -110 -55 -339
3725c39K55K48j70J62J8m86K98n4K21K13n52K38j2L1j76J74R3m97K52j5J97o4
$$ -339 -84 164 -6 156 174 -312 -14 -68 153 366 -186 52 40 71 -105 69 162 -335 -83 -98 99 35
3747C5o6j80J67K43k19K94l35j1K62l20K15Q0j58m24L13K51l60J45J95k39J72
$$ 35 -31 -211 -44 199 -20 274 -61 -72 190 -130 85 165 7 -417 -104 147 -213 -68 127 -112 60
3768F0l3k36L17l7p7J55jj96j48K20J41r2j74L6J30J24l20K98k31m5J64k0l16
$$ 60 27 -209 108 71 -6 149 148 -48 -196 24 165 73 -101 -65 65 189 -131 167 -64 -109 55 35 -281
3791b81J08K71k9r8K33k3j60Mj01j07J71J46M9o7J2L6k8k95K51j67J11N9j44J97
$$ -281 -173 98 69 -29 204 181 21 25 -76 -183 -12 134 183 116 128 164 136 -159 92 -75 36 95 -49 148
3815A48l00l1o3L69k73K25l37J31K35m01M42j1k81j92N34k33O5r8M5j09j2K47
$$ 148 -152 -183 -246 123 -150 75 -262 -131 104 -297 145 134 -147 -339 195 -38 27 -71 -26 -135 -147 100
3837A00j72R9n8R9j22j16J16K45l17L07q5j59k5J23k2K40k3k27p8k59O03l32J06
$$ 100 -72 27 -31 68 -54 -170 -54 191 -126 181 96 -63 -88 35 13 253 230 3 -75 -334 269 -63 43
3860D3J00j45Pj09L94k37R4k43P1m5O4K69k93j17K80m7n8J4rP2j57M1N7l5K05
$$ 43 143 -2 5 -104 290 53 147 -96 -25 -70 -6 263 -30 -147 133 86 28 42 33 105 -52 -11 46 11 216
3885B16k11Q8J22j78k92J97j69M8J43J12J00l31R8r7N4N6M0J95J72l79K49l06
$$ 216 5 93 215 37 -255 -58 -227 -179 -36 76 176 -155 -57 -154 -100 -44 -4 191 363 -16 233 -73
3907g3K16j2J0l30J29pO0j4j3j83kK80j91J83k58K79j58j8M4m5m7O5L2J01J7N1
$$ -73 143 131 141 -189 -60 -67 -7 -21 -34 -217 -219 61 -130 53 -205 74 -84 -102 -58 -103 -150 -85 -53 48 65 116
3933A16Q4m3j40Q7l5n4K79m11J37j88MJ78k71L46jk18q0K84j34o4K68k13L9J15
$$ 116 200 157 17 104 69 15 294 -117 20 -168 -164 14 -257 89 88 -130 -210 74 -60 -124 144 -69 -30 85
3957H5j86K63l54KK33J67j95J39K02k95n8j27J12o9kj96K14O9l10R0K77L6j35
$$ 85 -101 162 -192 -190 43 210 15 154 356 61 3 -124 -12 -81 -83 -279 -65 4 -306 -216 61 97 -38
3980c8J9l6K23n0k31M14k86j10J43l00K23Q1l53M06p5j23Q5p9r8O6LK94k85N9
$$ -38 -19 -55 168 118 -113 301 15 -95 48 -252 -29 52 -301 105 30 -93 -8 -87 -185 -119 -116 178 -107 -48
4004d8o8m0J24J43j90qo8K72M4l30M39k83k0L0J39l57J69M2m3N1m6J83k04l0J01
$$ -48 -116 -156 -32 111 -79 -87 -155 117 161 -169 270 -13 -33 -3 136 -221 -52 -10 -53 -2 -48 135 -69 -99 2
4029Bj00K61j18l1K19k67J86k20ml8K39J18j9m37J20n1oR2L9J1Q9j11PR5l03k36
$$ 2 -98 163 45 14 233 -34 152 -68 -72 -110 129 247 228 -209 -89 -140 -146 -54 -15 -4 85 -26 -19 76 -227 -463
4055d63N25j8l1J46J0j7k33K79j68J24J94k46j75J06k2J31M0m15K23k3O6j26K92
$$ -463 62 44 13 159 169 152 -81 198 30 154 348 102 -73 33 11 142 182 -233 -10 -33 33 -93 199
4078A99j55J12j04M5J9k28j03N17%l43L34p7r4R7k50Q7J98m93pJ65J69m0k06O8
$$ 199 44 156 52 97 116 -112 -215 302 302 -41 293 216 122 219 -31 56 254 -239 -246 -81 88 48 -158 -90
4102i0J36J36k95k5j00J31K23k69J02p8K59k12K9j8R2K64j37m16O1L99l82J78
$$ -90 46 182 -113 -138 -238 -107 116 -153 -51 -129 130 -82 -53 -71 21 285 148 -268 -207 192 -190 -12
4124a2k01K38k55L04O2j37j2q4qJ93k27K19l76M13J67j7k76J27j73j80K68q6l0
$$ -12 -213 25 -230 74 136 -1 -13 -97 -105 88 -139 80 -296 117 284 267 -9 118 -55 -235 33 -53 -83
4147h3K36K1l18J49L3K97l41O4k01j36K96L0J11l24K9J9K33qk70L34j12j0j32
$$ -83 153 174 -144 5 38 335 -6 58 -143 -279 17 47 158 -166 -137 -118 115 107 -163 171 59 49 -83
4170h3M6n9r1J12L2j72m2J13N8m6R5J67Pp7j16j55M32N3j91N7K8j52P8r3QJ87
$$ -83 -37 -96 -187 -75 -43 -215 -257 -144 -86 -132 -37 130 137 60 -56 -211 221 274 83 140 168 16 94 1 9 196
4196A96n9j59NJ13o8O4q3k0l3J17k72J48J75l71j6M64j45O2q9r4K11q6j45k80
$$ 196 137 -22 -17 96 28 92 9 -11 -44 73 -199 -51 124 -247 -263 201 56 118 29 -65 146 60 -85 -365
4220c65N14k5j70nK11j00J46l33K59k55R2K4OJ01k87L97J43o88R5J54m1R5K10
$$ -365 149 124 -46 -51 160 60 206 -127 132 -123 -31 -7 -1 100 -187 210 353 -335 -240 -86 -127 -32 178
4243A78j54k19J99j4J15k07J3l60M03J49R8j29k68J1J04K61l35R8N5m2Q1k28K02
$$ 178 24 -195 4 -10 105 -102 -89 -449 -46 103 201 72 -196 -185 -81 180 -155 -57 -2 -44 37 -191 11
4266A1j02J95l57K79M8k36K01NQ7l06J63J35M5l10m6L08k20O2R8j06J32p4R6k47
$$ 11 -91 104 -253 26 74 -162 39 44 131 -175 -12 123 168 -142 -188 120 -100 -38 60 -46 86 12 108 -139
4290a39O4jM38k86k96K36L3P3j74j54L08j05r3O3j69M30l53J29k8L3k46L55J29
$$ -139 -75 -76 362 76 -220 16 49 122 -52 -206 102 -3 -96 -33 -202 228 -125 4 -24 9 -237 118 247
4313B47l84K52n8K9k36L43j98j37K05q8J10o6p9K02K1l7j83J75j46j39R6o6L6
$$ 247 -137 115 57 86 -150 193 -5 -142 63 -25 85 19 -60 142 163 126 -57 118 -28 -167 -71 -137 -101
4336a01J31M39m38J05l39k3J95L0l33M26J62j99J27j27KQ3j97j48L65P4j83J7
$$ -101 30 469 31 136 -203 -226 -31 -1 -334 92 254 55 182 55 57 140 -57 -205 160 234 51 68
4358F8J13m0o5k20K09M8j42j3K91l48K18k26J35J59r5k34O3L9R3k2k43L45l83
$$ 68 181 141 76 -144 65 113 -29 -42 249 -99 119 -107 28 187 92 -142 -79 -40 53 31 -212 133 -250
4381b50L80k08K41M3k8M0J54m65J64j56J47m8L0k28L22j73pj40J2J62Ko7K30m9
$$ -250 130 -78 163 206 178 218 372 -93 71 -85 62 14 44 -184 138 -35 -42 -182 -170 -8 -6 -73 157 108
4405A08l65L61k01K9J77j26l9K1q1k49J53L44q1J26m1o6rM4o7n5k8k70L31q4J21
$$ 108 -257 104 -97 -68 109 -17 -56 -35 -116 -365 -212 132 51 177 136 70 61 105 38 -17 -45 -315 16 -68 53
4430E3k21K32q0n3Jl4l2n6J9J71j11J47m3L80k70J9k22m2K57l03L18N9l15M9K29
$$ 53 -168 64 -16 -69 -68 -102 -134 -190 -171 0 -111 36 -7 373 103 122 -100 -142 115 -188 130 189 -126 -77 152
4455A52rq6J38l13J49k88Q4r8L91k90K09n0k64N01k14j31N0K71K4j39k07Q2j42
$$ 152 143 57 195 -118 31 -257 -173 -271 120 -170 39 -11 -275 226 12 -119 -69 202 226 87 -120 -38 -180
4478a80J63J4J47l6k14N2J03q5O7j27q0J70k94L00J61o3j77l1P1Ol9L8Q5j26N6
$$ -180 -17 -3 144 108 -106 -54 49 -36 31 -96 -176 -6 -300 0 161 98 -79 -110 -39 -33 -72 -34 51 -75 -19
4503a9O2q0N4n2J20j13K73m66K56J03k63J35k20L60k07p8J86k7j36P2P1o2j45
$$ -19 43 -37 17 -35 85 -28 245 -221 35 138 -125 10 -210 150 -57 -135 51 24 -112 -40 31 -31 -176
4526a76J38O1M3j60J3m6L21k10N4j32R2o3O1J21j18J41j28j49K50Q6l46J18J1
$$ -176 -38 23 66 -94 -81 -127 194 -16 38 -94 -2 -65 -4 117 -1 140 12 -137 113 199 -147 -29 -18
4549a8L3K48j57n3Q4J01k37J2j44J64o3k62L76q9k1J36j72p1q7K83j03J24l6q4
$$ -18 15 263 106 53 137 238 1 13 -131 33 -30 -292 84 -5 -26 110 -62 -133 -220 63 -40 84 48 -36
4573c6J6o7J89m1l61J78J48k21l8L92j01l2m7n1q4n6K79j11R1k74J69K19l94K21
$$ -36 -20 -87 102 61 -300 -122 26 -195 -233 159 58 26 -21 -72 -156 -212 67 -44 47 -227 -58 161 -233 -12
4597a2j26N0JP1k1J48j68m0J62j80L3Q0J8qk10L42k90J68l5J16M2j69J02k59L62
$$ -12 -138 -88 -87 -16 -37 111 -57 -97 65 -115 -82 -2 16 8 -202 140 -150 18 -17 99 141 -28 74 -185 177
4622A77l08O9j2Q6K90m06J18n8j5J75m1k06J2O6O3o3J31n9k26J00K58p2q6K44
$$ 177 -131 -62 -74 12 302 -104 14 -44 -59 116 75 -131 -119 -53 10 -53 78 19 -207 -107 151 79 -7 237
4646B37l23J58o8p0n6J71O2Rj91K6J0j21J33J72k59j5J86L7mk45K38N9r9j81j27
$$ 237 -86 72 4 -66 -122 49 111 120 -71 -45 -35 -156 -23 149 -110 -125 61 98 94 -151 87 146 47 -134 -261
4671b61M38j37M1O1j90m6o5L84m38K22j74L45j20J9K30m3l60J52M2k9k68J48J86
$$ -261 177 40 81 142 -48 -94 -159 225 -213 9 -165 180 60 79 309 266 -94 58 100 71 -197 -49 137
4694A37k43K88P8o6k02J35m6j22O0lJ63j98O4K36p2m7lj80J03k02K49k08J26l2
$$ 137 -106 182 260 194 -8 127 81 -41 19 16 179 -19 45 281 209 162 159 -21 82 -120 129 -79 47 15
4718A5N1j10j29p1K38j24o0L04r3J8l7j17n4K06K1N0k55J54J73o1k31K61k63L80
$$ 15 66 -44 -173 -244 -6 -130 -190 114 21 39 2 -115 -169 37 58 108 -147 7 180 119 -112 149 -114 266
4742B66K1l58R8j08L42k58j60L98j89r3K3k02RK80L5j08J29L8L6j51J38j91r5
$$ 266 287 -71 27 -81 261 3 -157 241 52 -41 -18 -220 -211 69 104 -4 125 163 199 48 186 -5 -100
4765a00J79r0km0K88k34j82O6K62j19l7J14j18k1J44n7j41N05m07j38L6j02P8
$$ -100 79 -11 -13 -53 235 1 -181 -115 147 28 -9 105 -13 -34 110 53 -88 417 10 -128 -92 -194 -116
4788a16O9Lj3M2l6j40J20l7J12j49oJ68MK0j6K3j32J75K6O4k17R8R4k05r0K16
$$ -116 -47 -44 -57 -15 -51 -191 -71 -108 4 -145 -151 17 21 41 25 48 -84 91 117 181 -36 62 156 -49 -139 77
4814G7M6Nk49K7Q8J02P6j05J7j64n0qR1J36j57O0m1KO9j45K22j75J58J22j15L
$$ 77 123 128 -121 -94 -6 96 172 67 84 -80 -130 -138 -47 89 -68 -8 -49 -47 22 -123 99 -76 82 204 89 92
4840I2j55J20o2k41L34kMk15j28J75J53L0k91j28M55n47K69R2Mj22M17j82NJ53
$$ 92 -63 57 -5 -246 88 86 90 -125 -253 -78 75 105 -186 -314 141 -406 -137 -45 -41 -163 254 72 77 230
4864B30k57J16j20J82J5l9k19K40j06k7Qj9o2J8l5L17k82M8j87Q8j1j47J21K90
$$ 230 -27 89 -31 151 166 127 -92 148 42 15 23 4 -58 -40 -75 242 -40 8 -179 -91 -102 -249 -128 162
4888A62j13P8k52j8J40j22P4J4J69P2q4m3j53J21R9j53o5j58K14J50j56J60p9
$$ 162 49 127 -125 -143 -3 -125 -51 -37 132 204 120 77 -76 45 144 -9 -74 -232 -18 132 -24 136 57
4911E7k88N13l03o1n1L7J90j49J22m0J39j56k8J88J30k01j20L3J69k0j90J01J43
$$ 57 -231 282 -21 -82 -133 -96 94 -55 67 27 166 10 -18 170 300 99 -21 12 181 161 -29 72 215
4934B15j80q5J89l08Q6N2m0J31J90k38J84j3m01M02l90J89K08l79J12J37j15j95
$$ 215 35 -50 139 -169 -83 -31 -71 60 250 12 196 183 -218 184 -206 -17 191 -188 -76 61 -54 -249
4956b49L31n1J0o2R4o1QM9m7Q5J6Q1k56R6l0p4nJ85O7j81JM5j42R6J16l61M24
$$ -249 82 31 41 -21 73 12 20 69 22 107 123 204 -52 44 14 -60 -65 120 187 6 7 52 -90 6 122 -239 185
4983A85j67LP1M3o6O8j21q4j17K75j19K1l8p7K24M4k37j92J82L00l06q9K53k76
$$ 185 18 21 92 135 69 137 16 -68 -185 90 -29 -8 -46 -123 101 145 -92 -284 -102 198 -108 -197 56 -220
5007b20K35j80J62K43O3m65jj6OK50Q8l71M21l07r6K32N5k06Q1K18l04K26l50
$$ -220 15 -165 -3 240 303 -162 -163 -179 -173 77 165 -206 215 -92 -188 44 99 -107 -26 192 -112 114 -236
5030b36J88P3J22Q6k62m2r3M14l68j3P9K8k77K64J8p2L6lP1O3j89K65J47k86r
$$ -236 -48 25 147 233 -29 -71 -164 250 -118 -131 -52 -24 -301 -37 -19 -91 -55 -58 13 76 -113 152 299 13 4
5055Dj6K05k78j05J26J31q6K47j87l53N42r6Q1k23K4K80k55L0J43l69K76P0q5
$$ 4 -12 193 -85 -190 -64 67 -19 228 41 -312 230 134 215 -8 16 296 41 71 214 -155 121 191 106
5078A06l86P4K66l30L48j8j06J5O1n4J13n6o2k23J84k77K63J07J57L8k68M7j34
$$ 106 -280 -206 60 -270 78 60 -46 -31 30 -24 89 33 -29 -252 -68 -345 -82 25 182 220 -48 -1 -135
5101a35L8K67ql22K99l18J33K03P6k26j68M3N3K5M8M0r9J14r9k4pO8o8R6K37j30
$$ -135 -97 170 162 -160 139 -179 -46 157 233 7 -161 -118 -65 -40 8 48 -51 63 -36 -60 -67 1 -67 29 266 136
5127A36L9l47J33K33k63n3p7O2j6J41K64q2j89J57q5k05K24k09Q1%J2J92j10O4
$$ 136 175 -172 -39 194 -69 -122 -199 -137 -153 -12 252 170 -19 138 53 -152 72 -137 -56 -56 -44 148 38 102
5151A02o6j54Q5Q9J21j09j80p7J31P7L1J25l45QK34J34Kj13k70j7J54j7j33N63
$$ 102 36 -118 -33 56 177 68 -112 -189 -58 19 50 175 -170 -162 72 206 208 95 -175 -192 -38 -55 -188 375
5175C75l53P2k04M4J5J2J33q3m5O5k73L4L61r3P4M1qj24Q2j03O0pj69M31m60L1
$$ 375 22 94 -110 -66 -51 -39 94 11 -34 31 -242 -208 153 60 134 175 167 43 125 22 82 75 -94 337 -123 -92
5201i2L00j38j00k15J62r1K41q3n1q1lN67l01j18j7Q4mL6N3kk62J61k20J81q1
$$ -92 208 70 -30 -245 -83 -174 67 -16 -67 -148 -151 416 115 -3 -20 64 60 96 149 147 -115 46 -174 7 -74
5226g4J63j6o6K60l06J62j48J99k24p3J75j10M07k91R9k70J68J87l87J75N9o0
$$ -74 89 73 7 267 -39 123 -25 174 -50 -123 52 -58 349 58 157 -113 55 242 -145 30 89 29
5248B9o8K28k21MJ14l31L40J5k60J87K0j0n2kr5L21l64J08J12K67l68k0K88m00
$$ 29 -39 189 -32 -28 86 -245 95 110 -150 37 57 47 -5 -7 -102 219 -145 -37 75 342 -26 -46 242 -158
5272a58K50k00J71r4K6J55j31r9o7K14j49J7K82mk98o8P8K15m15L29j7M4k23k5
$$ -158 92 -108 63 -31 -5 150 19 -80 -147 67 -82 -65 217 213 -85 -153 -75 140 -275 54 37 81 -142 -167
5296a67K86j26N4k07L85pk76K4j40J32K22l65M8K70j26l6jM9j57K75Mj22j71J63
$$ -167 119 -7 47 -160 225 218 -58 -34 -174 -42 180 -185 -137 133 7 -29 -30 19 -138 137 141 19 -152 11
5320A1J3p2k45K16l8K2K15j48J49l8J27l2l9l30K89k6M3ML3j57J96j05R3k6L5
$$ 11 24 -48 -293 -77 -115 -93 122 -26 123 85 212 180 141 -189 100 74 117 121 154 -3 193 88 181 155 190
5345A90k77J2J05J4Q0n69K42j67M33r6n9n8K16k77K38M5l3J2j08J89N8j80M2M3
$$ 190 -87 -75 30 44 124 -445 -203 -370 63 -33 -92 -150 66 -211 27 72 39 51 -57 132 190 10 52 95
5369I5k39L08m11J15r5N73j29j48j74k6J73K7n9L4O3J63m18L8J74PJ15l47m6J71
$$ 95 -144 164 -247 -132 -227 346 217 69 -105 -131 42 69 10 44 107 270 -148 -110 64 71 186 -161 -207 -36
5393c6j11L30j39j45K31k63Q3J93j49j32M10l52L34j35k56N4R8J03j62J51k08
$$ -36 -147 183 44 -101 130 -133 -50 143 -6 -138 272 -80 254 119 -137 -83 15 118 -44 107 -101
5414a01j48J83r0J14R2j24K39l9j45J07j70J49j33m0J45k72L51n5J31k63J23j28
$$ -101 -249 -66 -156 -42 50 -74 165 126 -19 88 -82 67 -66 -106 39 -233 118 63 194 -69 54 -74
5436g4M3o2K10j38O8k81n3K21K68l4pJ27j25L9l21K2K43P0j72K91m11K70j18j17
$$ -74 -31 -93 117 -21 47 -234 -287 -66 202 168 161 288 163 202 -119 -97 146 216 44 335 -76 194 76 -41
5460d1k78M12k12k0M6k8J00L4j04N8L38l44J01j59K98k20j49M17l08J40j87P9
$$ -41 -319 93 -119 -139 -93 -121 -21 13 -91 -33 305 -39 62 -97 201 -19 -168 249 -59 81 -106 -27
5482b7K58k73K1K51l78jL94j26k09K20m3j18o6J93n6L19k76m7k03J13K62m89O0
$$ -27 231 -42 -21 230 -148 -149 245 119 -90 130 87 -31 -97 96 40 359 83 36 -167 -54 208 -281 -221
5505b21L14j79K01j18J78l61J29J03l08M20l0j08L41k71j55o2K22P3k0j34QO7
$$ -221 93 -86 115 -3 175 -186 -57 46 -262 158 128 20 361 90 -65 -127 95 168 148 14 22 89
5527H9k84K62J07k66O8K91k75R0k10J65J19m0O9j44l91L57O2Ok51K03q6Q7k63
$$ 89 -195 67 174 -92 -24 267 -8 82 -128 37 156 116 185 41 -350 7 69 75 -176 27 -59 28 -235
5550b35J62P9J1o7J91l65J54K07j02J07j68Q6k01J20j43O4L6Kj58L26k99L04o1
$$ -235 -73 6 17 -50 141 -224 -70 137 35 142 -26 60 -141 -21 -164 -100 -64 -62 -220 106 -193 111 50
5573E0j7J10j35R8J42q9j20l15K54j94K30q3J07J05n6j86K01j31P9Q2nK3j21j29
$$ 50 33 143 8 106 248 159 39 -276 -22 -216 14 -69 38 143 87 -99 102 -29 50 132 127 150 29 -100
5597a00K38k4k60o8N9J14j42Q3K42k3q9p8J32m3j53j06K86j59J03j27j15J80J32
$$ -100 138 114 -146 -214 -155 -41 -183 -100 142 119 30 -48 84 41 -112 -218 68 -91 12 -115 -230 -50 82
5620H2m9n3k65L60J07k40J48R6j04m6j50K04l9J86j28j78J33J6L2j79N2j35J11
$$ 82 33 -20 -285 75 182 -58 90 186 82 36 -114 90 51 237 109 -69 64 80 112 -67 -15 -150 -39
5643c9j9J01j69J97j34J3J41K2l1j68J80k70K24n3K3n3Kj66Q3J07J03k75Q0r9
$$ -39 -58 43 -126 71 -63 -50 91 113 82 -86 94 -176 48 -5 18 -35 -33 -199 -116 -9 94 -181 -101 -200
5667b00o1N8L29k00J65j64J35j64J4R6K4nJ14n0L4o9RN9k84L93k30J41j59l3j56
$$ -200 -261 -203 126 -74 91 -73 62 -102 -88 8 32 27 141 91 125 56 65 124 -160 233 3 144 -15 -48 -204
5692b04N2Q2mJ9q1K60k2k2m7k8J82J02Pn09K96Lk41M30k36n3L2k03K63k15J14
$$ -204 -152 -70 -74 -55 -136 124 102 80 33 5 187 289 296 -213 83 86 -155 275 39 -14 18 -185 78 -137 -23
5717b3j98oJL79m29K00K87k6k04m5J28j38K02k24K63q3k78L95J04k77k59L37p6
$$ -23 -221 -227 -226 153 -276 -76 211 185 -19 -64 64 -74 128 -96 167 84 -194 201 305 28 -231 106 30
5740C0lP5L2q5j12J41k94J28LQ0M7q1o5K35nk56K27o6J34j53Qj49L36l0m75N36
$$ 30 27 102 134 49 -63 78 -216 -88 -85 -5 42 -39 -104 131 126 -130 97 31 165 12 20 -129 207 177 -298 238
5766B38l47J97q1J3k03J78j77K14J62k91Q1J77k95K08J29l94M62j85K17k11r0
$$ 238 -109 88 7 20 -183 -5 -182 32 194 -97 -16 161 -134 74 203 -191 271 86 303 92 2
5787Bjj16R0J29n3j0Q5lO4j60p4J70l32L16j59j34K09k32kJ65j27O3n1L66l34
$$ 2 1 -115 -25 104 51 41 126 123 187 27 -47 123 -209 107 -52 -186 23 -209 -211 -46 -173 -110 -161 205 -129
5812a29k05J59J51p2J63k13j7J73j3J17k4j37r6J60m1Q0j04N0J14j16K0J38n7
$$ -129 -334 -175 -24 -96 67 -146 -163 10 -3 114 90 -47 -143 17 -24 56 -48 2 116 0 20 158 101
5835A01nm6j21m2J6K58p7k40K37j79J45r4J01L2q2%j50j5M10j66j12M4j13k17
$$ 101 96 50 -71 -113 -97 161 84 -156 81 -98 47 -47 54 86 4 4 -146 -161 249 83 -29 15 -98 -315
5859c15K40K41j17p0J19j20n4J26k26L20O9k5j55J05L19l86j32K65j05l03L5J57
$$ -315 -75 166 49 -21 98 -22 -76 50 -176 144 213 188 33 138 457 71 -61 204 99 -204 -169 -12
5881a2j69J53M1k43P5K85k81J08j23N4J61ro3mJ35j40J3j01k1J3K60o6J26QLr3
$$ -12 -181 -28 13 -230 -155 130 -151 -43 -166 -112 49 40 -23 -27 108 -32 -19 -120 -141 -128 132 66 192 200 203 110
5907A10j67J0J94m2p8j01pK1R9J0j57K16l14J29%J77j91K44l88L47j08r7P1N7
$$ 110 -57 -47 147 105 27 -74 -81 -60 39 49 -108 108 -206 -77 -77 100 -91 153 -235 112 4 -93 -22 35
5931C5O8l0R3j85Mj2J28o1j34J66j7j46K04j22J32r7k1M0l7N0o1J15l13K14j40
$$ 35 103 73 166 -19 -15 -27 101 40 -94 72 55 -91 113 -9 123 26 5 45 8 58 -3 112 -201 13 -127
$$ [...]
8191I6
##END NTUPLES=NMR FID
##END=
