##TITLE=1H_SR-37
 ,8 sc, 
 10.02.2021
##JCAMPDX= 6.0         $$ Bruker NMR JCAMP-DX V2.0
##DATA TYPE= NMR FID
##DATA CLASS= NTUPLES
##ORIGIN= UXNMR, Bruker Analytische Messtechnik GmbH
##OWNER= root
$$ XWIN-NMR		Version 3.5
$$ Wed Feb 10 11:59:23 2021 Russian Standard Time (UT+4h)  she@DPX200
##.OBSERVE FREQUENCY= 200.1315066352
##.OBSERVE NUCLEUS= ^1H
##.DELAY= (6, 6)
##.ACQUISITION MODE= SIMULTANEOUS
##.ACQUISITION SCHEME= undefined
##.AVERAGES= 8
##.DIGITISER RES= 18
##SPECTROMETER/DATA SYSTEM= spect
##.PULSE SEQUENCE= zg30
##.SOLVENT NAME= CD3CN
##.SHIFT REFERENCE= (INTERNAL, CD3CN, 0, 15.7039)
##AUDIT TRAIL= $$ (NUMBER, WHEN, WHO, WHERE, WHAT)
$$ ##TITLE= Audit trail, XWIN-NMR		Version 3.5
$$ ##JCAMPDX= 5.01
$$ ##ORIGIN= Bruker BioSpin GmbH
$$ ##OWNER= she
$$ F:/spectra/data/she/nmr/H-F/1/audita.txt
$$ ##AUDIT TRAIL=  $$ (NUMBER, WHEN, WHO, WHERE, WHAT)
(   1,<2021-02-10 11:58:10.09 +0400>,<she>,<DPX200>,
      <created by zg, POWCHK disabled, PULCHK disabled
       configuration hash MD5:
       00 E9 B6 7A A2 85 ED C7 34 08 36 98 17 FE 4E 26
       data hash MD5: 16K
       76 1F C6 F1 8B FC 8C 57 54 F2 08 19 0B D5 1D B8>)
$$ ##END=
$$ 
$$ hash MD5
$$ A0 FA D1 9F 2A 7E DB 16 96 DA 1A CA CA 56 62 1C
##$RELAX= 
##$RELAX= 
##$RELAX= 
##$RELAX= 
##$RELAX= 
##$RELAX= 
$$ Bruker specific parameters
$$ --------------------------
##$DU= <F:/spectra>
##$EXPNO= 1
##$NAME= <H-F>
##$PROCNO= 1
##$TYPE= <nmr>
##$USER= <she>
##$AMP= (0..31)
100 100 100 100 100 100 100 100 100 100 100 100 100 100 100 100 100 100 
100 100 100 100 100 100 100 100 100 100 100 100 100 100 
##$AQSEQ= 0
##$AQ_mod= 1
##$AUNM= <au_zg>
##$AUTOPOS= <>
##$BF1= 200.13
##$BF2= 200.13
##$BF3= 200.13
##$BF4= 200.13
##$BF5= 200.13
##$BF6= 200.13
##$BF7= 200.13
##$BF8= 200.13
##$BYTORDA= 1
##$CFDGTYP= 0
##$CFRGTYP= 5
##$CHEMSTR= <none>
##$CNST= (0..31)
1 1 145 1 1 1 1 1 1 1 1 1 1 1 1 1 1 1 1 1 1 1 1 1 1 1 1 1 1 1 1 1 
##$CPDPRG= <>
##$CPDPRG1= <>
##$CPDPRG2= <>
##$CPDPRG3= <>
##$CPDPRG4= <mlev>
##$CPDPRG5= <mlev>
##$CPDPRG6= <mlev>
##$CPDPRG7= <mlev>
##$CPDPRG8= <mlev>
##$CPDPRGB= <>
##$CPDPRGT= <>
##$D= (0..31)
0 1.2 0 0 0 0 0 0 0 0.06 0 0.03 0 0 0 0 0.0002 0 0 0 0 0 0 0 0 0 0 0 0 
0 0 0 
##$DATE= 1612943889
##$DBL= (0..7)
120 120 120 120 120 120 120 120 
##$DBP= (0..7)
150 150 150 150 150 150 150 150 
##$DBP07= 0
##$DBPNAM0= <>
##$DBPNAM1= <>
##$DBPNAM2= <>
##$DBPNAM3= <>
##$DBPNAM4= <>
##$DBPNAM5= <>
##$DBPNAM6= <>
##$DBPNAM7= <>
##$DBPOAL= (0..7)
0.5 0.5 0.5 0.5 0.5 0.5 0.5 0.5 
##$DBPOFFS= (0..7)
0 0 0 0 0 0 0 0 
##$DE= 6
##$DECBNUC= <off>
##$DECIM= 32
##$DECNUC= <off>
##$DECSTAT= 4
##$DIGMOD= 1
##$DIGTYP= 9
##$DL= (0..7)
0 120 120 120 120 120 120 120 
##$DP= (0..7)
150 150 150 150 150 150 150 150 
##$DP07= 0
##$DPNAME0= <>
##$DPNAME1= <>
##$DPNAME2= <>
##$DPNAME3= <>
##$DPNAME4= <>
##$DPNAME5= <>
##$DPNAME6= <>
##$DPNAME7= <>
##$DPOAL= (0..7)
0.5 0.5 0.5 0.5 0.5 0.5 0.5 0.5 
##$DPOFFS= (0..7)
0 0 0 0 0 0 0 0 
##$DQDMODE= 0
##$DR= 18
##$DS= 0
##$DSLIST= <SSSSSSSSSSSSSSS>
$$ [...]
##$SUBNAM2= <"">
##$SUBNAM3= <"">
##$SUBNAM4= <"">
##$SUBNAM5= <"">
##$SUBNAM6= <"">
##$SUBNAM7= <"">
##$SUBNAM8= <"">
##$SUBNAM9= <"">
##$SW= 16.9725356469052
##$SWIBOX= (0..15)
0 0 2 0 0 0 0 0 0 0 0 0 0 0 0 0 
##$SW_h= 3396.73913043478
##$TD= 16384
##$TD0= 1
##$TE= 0
##$TE2= 300
##$TE3= 300
##$TEG= 300
##$TL= (0..7)
0 120 120 120 120 120 120 120 
##$TP= (0..7)
150 150 150 150 150 150 150 150 
##$TP07= 0
##$TPNAME0= <>
##$TPNAME1= <>
##$TPNAME2= <>
##$TPNAME3= <>
##$TPNAME4= <>
##$TPNAME5= <>
##$TPNAME6= <>
##$TPNAME7= <>
##$TPOAL= (0..7)
0.5 0.5 0.5 0.5 0.5 0.5 0.5 0.5 
##$TPOFFS= (0..7)
0 0 0 0 0 0 0 0 
##$TUNHIN= 0
##$TUNHOUT= 0
##$TUNXOUT= 0
##$USERA1= <user>
##$USERA2= <user>
##$USERA3= <user>
##$USERA4= <user>
##$USERA5= <user>
##$V9= 5
##$VALIST= <valist>
##$VCLIST= <CCCCCCCCCCCCCCC>
##$VD= 0
##$VDLIST= <DDDDDDDDDDDDDDD>
##$VPLIST= <PPPPPPPPPPPPPPP>
##$VTLIST= <TTTTTTTTTTTTTTT>
##$WBST= 1024
##$WBSW= 4
##$XGAIN= (0..3)
0 0 0 0 
##$XL= 0
##$YL= 0
##$YMAX_a= 160920
##$YMIN_a= -157984
##$ZGOPTNS= <>
##$ZL1= 120
##$ZL2= 120
##$ZL3= 120
##$ZL4= 120
##$ABSF1= 10
##$ABSF2= 0
##$ABSG= 5
##$ABSL= 3
##$ALPHA= 0
##$AQORDER= 0
##$ASSFAC= 0
##$ASSFACI= 0
##$ASSFACX= 0
##$ASSWID= 0
##$AUNMP= <proc_1d>
##$AZFE= 0.1
##$AZFW= 0.1
##$BCFW= 1
##$BC_mod= 2
##$BYTORDP= 1
##$COROFFS= 0
##$CY= 11.3945322036743
##$DATMOD= 1
##$DC= 2
##$DFILT= <>
##$DTYPP= 0
##$F1P= 15.9154993809931
##$F2P= -4.1035820241983
##$FCOR= 0.5
##$FTSIZE= 0
##$FT_mod= 4
##$GAMMA= 1
##$GB= 0.15
##$INTBC= 1
##$INTSCL= 1
##$ISEN= 128
##$LB= 0.24
##$LEV0= 0
##$LPBIN= 0
##$MAXI= 10000
##$MC2= 0
##$MEAN= 0
##$ME_mod= 0
##$MI= 1.114404
##$NCOEF= 0
##$NC_proc= 0
##$NLEV= 6
##$NOISF1= 3.799351
##$NOISF2= 2.8
##$NSP= 1
##$NTH_PI= 0
##$NZP= 0
##$OFFSET= 15.70392
##$PC= 1
##$PHC0= -10834.68
##$PHC1= 9.00095
##$PH_mod= 1
##$PKNL= yes
##$PPARMOD= 0
##$PSCAL= 0
##$PSIGN= 0
##$REVERSE= no
##$SF= 200.130013532006
##$SI= 16384
##$SIGF1= 3
##$SIGF2= 2
##$SINO= 400
##$SIOLD= 16384
##$SREGLST= <1H.CDCl3>
##$SSB= 0
##$STSI= 0
##$STSR= 0
##$SW_p= 3612.71676300578
##$SYMM= 0
##$S_DEV= 0
##$TDeff= 0
##$TDoff= 0
##$TI= <>
##$TILT= no
##$TM1= 0
##$TM2= 0
##$TOPLEV= 0
##$USERP1= <user>
##$USERP2= <user>
##$USERP3= <user>
##$USERP4= <user>
##$USERP5= <user>
##$WDW= 1
##$XDIM= 8192
##$YMAX_p= 0
##$YMIN_p= 0
$$ End of Bruker specific parameters
$$ ---------------------------------
##NTUPLES= NMR FID
##VAR_NAME=  TIME,          FID/REAL,        FID/IMAG
##SYMBOL=    X,             R,               I
##VAR_TYPE=  INDEPENDENT,   DEPENDENT,       DEPENDENT
##VAR_FORM=  AFFN,          ASDF,            ASDF
##VAR_DIM=   8192,          8192,            8192
##UNITS=     SECONDS,       ARBITRARY UNITS, ARBITRARY UNITS
##FACTOR=    0.0002944,     1,               1
##FIRST=     0,             0,               0
##LAST=      2.4114304,     0,               0
##MIN=       0,             -157984,         0
##MAX=       2.4114304,     160920,          0
$$ Real data points
##PAGE= N=1
##DATA TABLE= (X++(R..R)), XYDATA
0@%%%%%%%%%%%%qJ6j6J6k2L0l2M0m9N7p2Q8j04J20j37J61j86K11k42K80l20L62
34A93m12M66n26N91o63P43q28R20j022J134j256J391j537J695j870K061k269K499
52A310k752L031l345L696m087M530n038N626o316P139q140R389j0994J3144j6199
67i006K0936k9649O9983j69145J53671L8397k33171K86303j56910k7163J63189
78A07435j95544R4117M3153j15034J30008q8993J4752K3948m5711P8083p6056
89b9842M2232J0910r7587J45865r3153j5090J33108j94588J17234M4348j72925
100a09488K10350j13563o9354J88293j79989O8882R3988j85631J37780k0981r3762
111g3475J47594r1146r022O6608p8866M2580J6115k9596J4628j2219Q024j3164
$$ plain form
0 0 0 0 0 0 0 0 0 0 0 0 0 0 -8 8 -8 8 -14 16 -16 24 -25 32 -40 48 -56 64 -73 88 -98 113 -129 151 -169 193
34 193 -219 247 -279 312 -351 392 -436 484 -538 596 -660 731 -806 889 -981 1080 -1189 1310
52 1310 -1442 1589 -1756 1940 -2147 2383 -2655 2971 -3345 3794 -4346 5043 -5951 7193 -9006
67 -9006 11930 -17719 52264 -116881 36790 75187 -157984 128319 -28591 -55754 107435
78 107435 -88109 6008 49161 -65873 64135 -24858 -10106 13842 -31869 46214 -29842
89 -29842 12390 23300 -74287 71578 -21575 -36665 96443 -98145 19089 63437 -109488
100 -109488 100862 -12701 -82055 106238 -73751 -4869 89119 -96512 41268 20287 -73475
111 -73475 74119 -17027 -26049 40559 -38307 4273 20388 -9208 5420 -6799 1225 -11939
123a1939K1820J2113n6960O0841l2132l1566R8282q8699J2478O8616j18652Q3839
135A8041K8137j14970J24044n7256o3219J40949j09765J5955Q4651j33969P8818
146A1416K6273r5029J06133m8858m2264Q3377o6406K6193K5395m7303K7172j3797
158g698R487K652q595K6238n3923L9563J2340o4397R8766o9794k5903J08151j27499
171f0612P2807M6371j41819J36671n1229o9114J55259j31742K6615P8972j38122
182g5943J10216j2028o9924R8113p7143J2574M3335n5258N0393l2892J553J8812
194A1808m0139O5660n4357P894M7261r7406R4299j8913o9897J23549j10858J5360
206b5739R5737j40493J05686m597j06317J38658q3573r405R5818j15810N6417
$$ plain form
123 -11939 9881 21994 -34966 25875 -6257 -37823 60459 -28240 -15762 52854 -65798 18041
135 18041 46178 -68792 55252 -2004 -65223 75726 -34039 -18084 66567 -67402 11416
146 11416 37689 -57340 48793 -65 -42329 41048 -25358 835 26230 -21073 6099 -7698
158 -7698 1789 4441 -4154 22084 -31839 7724 20064 -44333 54433 -15361 -41264 66887 -60612
171 -60612 12195 58566 -83253 53418 2189 -66925 88334 -43408 -16793 62179 -75943
182 -75943 34273 22245 -47679 50434 -26709 -14135 29200 -26058 24335 -8557 -7004 11808
194 11808 -28331 37329 -17028 -9134 38127 -59279 35020 16107 -53790 69759 -41099 -25739
206 -25739 69998 -70495 35191 30594 -75723 62935 -20638 -30043 65775 -50035 6382
217F382J8893o9211P9507l8532j1290L1811l8810L3149j5256P289O757l7596N0595
230B3688l7315L680N1501q3040N4434O824p0713J00981n7274k6572Q6462r6955
242d4299M3511M4894r2393P5764j8007n3876Q4094m8677p007M9062n9455K3306
254c083K0734l3286K5914n077j7175J2282K221q44l602J0548j4770o910L2381
267A9333l0339R278K6079n5918L9188J0809n2438O7003l3000l5801P6814o5275
279b4267J4236N5151q7754N3488R703o4130Q0676l7358k7059O1510n9966K3105
291b665K7711m6904L5009j4886j0464K2667j6149J6294j7623N139J0028l0234
303b2077M7404k9091j5601N4220p1050M1888K7133p9496Q3801l9657l9322R5791
$$ plain form
217 6382 25275 -43936 35571 -2961 -14251 17560 -21250 11899 -3357 3932 10689 -26907 23688
230 23688 -13627 -9947 41554 -41486 12948 19772 -50941 50040 -7234 -33806 52656 -44299
242 -44299 -788 44106 -48287 27477 9470 -44406 39688 -8989 -15996 33066 -26389 -3083
254 -3083 17651 -15635 10279 5202 -11973 309 2530 1686 -1916 8632 -6138 -13048 19333
267 19333 -11006 -1728 24351 -31567 7621 18430 -34008 32995 -5 -35806 41008 -24267
279 -24267 -10031 45120 -42634 10854 20557 -43573 37103 -255 -27314 34196 -25770 -2665
291 -2665 25046 -21858 13151 -1735 -12199 10468 -5681 10613 -7010 -1871 8157 -22077
303 -22077 25327 -3764 -19365 34855 -36195 5693 32826 -46670 37131 -2526 -41848 53943
315E3943q5134K6445M7460r5574P6643j2248m7248P7977o0735O476L5836m9740
327b5899M2232j3294j3072K1235k8493L0691j7409n8K5388n2255M7412j1017l3817
340b8356P0982o7030J2560M8933q2601P0560p210o1593Q4820n9425j560O3563
352D3643p6416M0875R560n2153N7934k3829j1728L0883l3341J4605L866o503J0044
365G440j4822J4066j4730L994K2443l6451K8603m072l4148N4304l3150p863M6239
378C1853o0112K7915K4350n4745N2191j4469l6803N5757l5146k708L9841m6832
390a8908J6492J6818l3382K9659k764k1196K0804j0195k992J3202o244l641L68
403a979M115o801N921R902k3600J5516L733k5884L7835j7325k0369M3701m2835
$$ plain form
315 53943 -31191 -4746 42714 -52860 23783 11535 -35713 42264 -18471 -11995 23841 -25899
327 -25899 16333 3039 -10033 11202 -17291 13400 -4009 -4067 21321 -30934 16478 5461 -28356
340 -28356 42626 -24404 -11844 37089 -45512 25048 17838 -43755 41065 -18360 -19920 43643
352 43643 -32773 8102 17662 -34491 23443 -386 -12114 18769 -14572 33 3899 -2604 7440
365 7440 -7382 6684 -8046 -4052 18391 -18060 10543 6471 -27677 26627 -6523 -14386 31853
378 31853 -28259 -344 24006 -30739 21452 6983 -29820 25937 -9209 -11917 27924 -18908
390 -18908 -2416 14402 -18980 10679 7915 -13281 7523 -2672 -5664 7538 1294 -2347 -1979
403 -1979 2136 -4665 1256 11158 -12442 3074 6807 -19077 18758 1433 -18936 24765 -18070
416a8070J0918L6682n7300L9070J779m6866O1245l0321j5086M8277n3535K1068
428b139K1324m0991L7680j4473j5810K6647k0907J3103q63q268J0519j8485K2880
441A0217j0309r233L0563m2937K4170J4945m6015N5379k9216k3170N9604n8902
453b4904K4834K9472o5151N4905j5162l0972N9104m5613O571K6581m2936L3574
465A0303m903j5478K2154k2137J2136j642l584J5209k5697K1684p973j5707M0292
478B4657l9084J1572K3332n1055M7852q873l3804N5370m5451K846M0648n2364
490b4354L3904L729l8962M2553j9191q088K8291k7943P949P625j2411J1836l923
503A015o78l224R91O820j1522J4331o088j4194K4913j8951J649K3110l3959J7252
$$ plain form
416 -18070 -7152 29530 -27770 11300 13079 -33787 27458 -2863 -17949 30328 -23207 -2139
428 -2139 19185 -21806 15874 1401 -14409 12238 -8669 4434 3571 -4697 5822 -12663 10217
441 10217 -92 -9325 21238 -21699 2471 17416 -28599 26780 -2436 -25606 33998 -24904
453 -24904 -70 29402 -35749 19156 3994 -26978 32126 -13487 -6916 19665 -23271 10303
465 10303 5400 -10078 12076 -10061 2075 433 -3151 12058 -13639 8045 72 -15635 24657
478 24657 -14427 -2855 20477 -30578 17274 8401 -25403 29967 -15484 -12638 28010 -24354
490 -24354 9550 13279 -25683 16870 -2321 -10409 17882 -10061 -2112 5513 -6898 4938 1015
503 1015 337 -2887 -1896 4924 -6598 7733 1645 -12549 12364 -6587 -4938 18172 -15787 1465
517A465R678l0885L4506j0181k2076L5137k6382n80K9995l4183J3825J1596l0374
530a8459K7270k488j8395K3770j5880l794J7651j3763M692L413q747L945J075
543B90L030n534L599J317j3319J9219p299j0775K5238k7355O139K3115l6133K8366
557I898n73l2895M2665k4048p174L6360m1774J7291J3663l3258L4026j1957j4255
570a2031K4797k2403R948O570j2705J1665j1756P497n51o206J7566k3149J1886
583A128P484k6808L5715j9103j2829L6696m1614K0185J8312m3190M0383j5293
595A066k1142M3147l4373Q117J9699l5425K6251l549j3544K1689j7631M210M018
608B533p076J0864j0394P433l486q367K0041j9209Q339J0520k8895K7827p760
$$ plain form
517 1465 11143 -19742 14764 4583 -17493 17644 -8738 -9318 20677 -13506 319 11915 -18459
530 -18459 8811 6323 -12072 11698 -4182 -7976 9675 -4088 604 4017 -4730 -785 290
543 290 3320 -2214 1385 2702 -10617 8602 1303 -9472 15766 -11589 -5450 17665 -18468 9898
557 9898 9325 -23570 19095 -4953 -12127 24233 -17541 -250 13413 -19845 14181 2224 -12031
570 -12031 12766 -9637 311 6881 -5824 5841 -5915 1582 1031 -5175 12391 -10758 1128
583 1128 8612 -18196 17519 -1584 -14413 22283 -19331 854 19166 -24024 16359 1066
595 1066 -20076 23071 -11302 -3185 16514 -18911 7340 3791 -9753 11936 -5695 -1485 2533
608 2533 -4543 6321 -4073 3360 -126 -8493 11548 -7661 678 11198 -17697 10130 2370
621B370j6323L3654k9756L254K3189l3824K4875K159k6628K9482j5456o222K3521
634A4295k1188N423P977j4960J1189P15o162M307k268p13KN100l425l843Q503
649D952j0054L465J0303j5993R640K645j6764J9806n514j1839K1237j7986p10
662f812J9759k2400J0989P985k3632K0418k694j3829K2091j5483k981J5540j5918
675f967Q465M448j2214Q527k795j170M096k376J626o049O759j692n589J4679j5865
690f117K792J3270k2722J9963o70k1589K8782j9118l322K6500l0861J5154P322
703I384k5885K7691j0405r507K0827k0694P592P340j2956J2563p846O5L795o061
717d097J0436j0267M546L768j5042J9987j0410o112K1143k6529J3154J0335k6474
$$ plain form
621 2370 -13953 19701 -10055 -6801 16388 -17436 7439 9598 -17030 12452 -3004 -9226 14295
634 14295 -6893 -1470 6507 -8453 2736 3451 -2711 1596 -672 -1385 -1383 3717 292 -3551 4952
649 4952 -5102 -1637 8666 -7327 2313 4958 -11806 8000 2486 -9353 11884 -6102 -6812
662 -6812 12947 -9453 1536 9521 -14111 6307 3613 -10216 11875 -3608 -6589 8951 -6967
675 -6967 1498 5946 -6268 2259 -536 -1706 2390 14 1640 -4409 2350 658 -4931 9748 -6117
690 -6117 -3325 9945 -12777 7186 6516 -15073 13709 -5409 -8731 17769 -13092 2062 9384
703 9384 -16501 11190 785 -8722 12105 -8589 -997 6343 -6613 5950 -1896 -1831 1964 -4097
717 -4097 6339 -3928 618 4386 -10656 9331 -1079 -7191 13952 -12577 577 10912 -15562
730a5562K7983j2020j3651K8573k4632P613J4455k6214J8992k987j1757J9067
742I860j3021J133N961r032P911l147J275m2m969Q483q585N213N083j5061J4732
757E794n949p817J9767j7706L227J1978k0846J6076J305j5899J8816j0803n196
770g253J6796j4288L833P272j3453Q269K113p344P309k537m312M866o31j551K110
785A199O8m176K735K833n672N314j00q228R704k871n816J2624j0769j392J2401
800G854j4737Q073O155j6956J4340k851j0282J7897j2056j965J2282j5063Q503
813A194M077j1241R951m652k859P135m971K511j419n76J516l455P408o547J9P376
829E467j3297J1544M69j2972J8001j2995k423J7734k0585J1302M887j9313K0144
$$ plain form
730 -15562 12421 401 -13250 15323 -9309 -1696 12759 -13455 5537 2550 -9207 9860
742 9860 -3161 -2028 3933 -5099 2812 -335 940 898 -4071 4412 -4173 1040 6123 -8938 5794
757 5794 -155 -7972 11795 -5911 -2684 9294 -11552 4524 5829 -10070 8746 -2057 -7253
770 -7253 9543 -4745 -912 6360 -7093 1176 3289 -4055 3254 717 -3595 1271 640 -911 1199
785 1199 1267 -2909 -174 2659 -3013 2301 2201 -6027 3677 806 -5010 7614 -3155 -4547 7854
800 7854 -6883 1190 7345 -9611 4729 1878 -8404 9493 -2563 -4528 7754 -7309 1194
813 1194 5271 -5970 3981 -671 -3530 3605 -1366 1145 -274 -850 666 -2789 4619 -1928 -1909 5467
829 5467 -7830 3714 4183 -8789 9212 -3783 -6206 11528 -9057 2245 7132 -12181 7963
842G963q074o603J6975j6650N333O254j1794J1362m577k880N479o305O036l191
856f72N09L192q842J0050m960l146J2307j5439P292N576j5656J7728p349q522
870g932J7679j6469N276J0146j7359J2762k046r504J4164q344m91O601q600M626
884E09P92k246K327k378J726k628K468J963o074O828m101l412J0243r371K656
899f98O154j2509R492O41r143J2055o930m050J0931r374K551O304j0418N655J929
914B590o902P497k002m622N860l289p45M431l383m46J832j534L8K113p27k692
930a981L203j251k562O570n041j525P092q975M629N032j1345R657k153q034J3502
945F818q785j096R719j2810O886L380r559R793m681l237P207o032L222O20l239
$$ plain form
842 7963 -111 -6714 10261 -6389 -1056 5198 -6596 4766 189 -2691 2788 -3517 2519 -672
856 -672 -163 3029 -5813 4237 -723 -3869 8438 -7001 291 5867 -9789 7939 590 -7932
870 -7932 9747 -6722 -1446 8700 -8659 4103 2057 -7447 6717 -1627 -2118 4483 -4117 509
884 509 1301 -945 1382 -996 730 -1898 570 2533 -3541 3287 -814 -4226 6017 -3354 -698
899 -698 5456 -7053 2439 3080 -6063 5992 -938 -4988 5943 -3431 -880 5424 -4994 661 2590
914 2590 -4312 3185 1183 -3439 2421 -868 -1613 2818 -565 -1011 821 -713 -675 1438 711 -1981
930 -1981 1222 -29 -2591 3979 -1062 -2587 4505 -4470 159 5191 -6154 3503 1350 -6684 6818
945 6818 -1967 -3063 6656 -6154 732 4112 -5447 4346 -335 -3572 3635 -2397 825 1445 -1794
960a794K955l090L546j564j407M832p873N685J435q094J1338p844k509J1574j3346
975f156P597L939j3586J3541n574n160J3154j1975L274N382j0255Q993k089l936
989b851N976n518K562O24j560K825m522L962j852j976P108q256L718L108r537
1004f189J0811m021n308J1122j0811K960P130j1360Q617j056p405R871n423q76
1018a938N946o811K508J841l276K917o96j113J39O29K79j271K575k393j154M294
1034B476m320J878K981o611M715M24n171P182l513l282O935n924R64N470p431
1049c227L526K025o293O281r84m306N720l817q61M803m170J195J480l211K117
1064B78L30p25K55r5q5j271K793j248j820M225m911J397M441p234N652k49o746
$$ plain form
960 -1794 1161 -1929 1617 53 -1354 3478 -4395 1290 2725 -5369 5969 -1875 -4384 7190 -6156
975 -6156 1441 5380 -8206 5335 -239 -5399 7755 -4220 -946 4436 -5819 3174 1085 -2851
989 -2851 3125 -2393 169 793 -767 2058 -2464 1498 -354 -2330 4778 -3478 240 3348 -6189
1004 -6189 4622 601 -4707 6415 -4396 -1436 5694 -5666 2951 1895 -5510 4361 -1062 -1938
1018 -1938 4008 -2803 -295 1546 -1730 1187 491 -622 -483 146 425 -846 1729 -664 -1818 2476
1034 2476 -1844 34 3015 -3596 1119 1543 -3628 3554 41 -3241 3694 -2230 -1266 4204 -3227
1049 -3227 299 2324 -3969 2312 1328 -2978 2742 -1075 -1936 2867 -1303 -108 1372 -1839 278
1064 278 608 -117 138 43 -42 -1313 1480 232 -1588 2637 -2274 -877 3564 -3670 1982 1733 -5013
1081e013R286n202j780Q123r640M099L596q217Q184k873m029O927n671J991K591
1096B372m461L270j946M04J290j993L123l953J766K038n334O863l719k948P827
1111D599q436L999M158r732Q731k876n031J0031p867J242N120q419O119j09m291
1126b762N598m024J69K399k511K291j593M80J9j507L651l528J280K083n632N676
1142B089j318l759P002o182M65N520p419N037Q04o300O673k785k108N667m880
1157a494N51K825l799K482P02k416J409j19q09Q96O14j269n8J192j665J004J513
1174A559l028J716O59l061L745q11k949M273k975r44M941m847J232L049n888M441
1190A112O67m708N545l025k013N313m388J274K339m428K934j29j470K198j562
$$ plain form
1081 -5013 4273 -929 -2709 5414 -4226 -127 3469 -4748 3436 563 -3466 3461 -2210 -219 2372
1096 2372 -2089 1181 -765 -361 929 -1064 2059 -1894 -128 1910 -3424 3439 -280 -3228 4599
1111 4599 -3837 162 4320 -5412 3319 443 -4588 5443 -2424 -1182 3938 -4481 1638 1529 -2762
1126 -2762 2836 -1188 -1019 1380 -1131 1160 -433 47 66 -1441 2210 -1318 -38 2045 -3587 2089
1142 2089 771 -2988 4014 -2168 -1703 3817 -3602 1435 2239 -4061 2612 -173 -2281 3386 -1494
1157 -1494 -943 1882 -1917 565 1267 -1149 260 141 -668 228 842 -427 -485 707 -958 46 1559
1174 1559 -1469 247 906 -2155 1590 779 -2170 2103 -872 -1816 3125 -1722 -490 2559 -3329 1112
1190 1112 1779 -2929 2616 -409 -2422 2891 -1497 -223 2116 -2312 622 493 -977 1221 -341
1205c41K53k91L71P26j756K552k273p33M112m915L024J535o258O668k711k862
1221b899P404p160J762M238p511O441q85m782O591m833M92L914m852L048p11j714
1237a457K714k045J702j085o82K247l497L678q17l287N609n260J282M521p332
1252c709N571n85n457Q028m969o34N615p294L868J543m844N237k540j502L293
1267A621k780J530K87j191Q61j199J661j059N5J700l533K784J07k957M692l324
1283g45j024M483n016K581K184n473M472r00l135N273l176j001L644l933J497
1298b69K163l408K027R7k140K264k59j081J113n66o57R37L91j025M97M63j855
1315a308J819N11k525K858j387k008M384l195j01L668n382K857J896n046N250
$$ plain form
1205 -341 -88 -379 -8 718 -1038 1514 -759 -1492 2620 -2295 729 2264 -3994 2674 -37 -2899
1221 -2899 4505 -2655 -893 3345 -4166 2275 1390 -3392 3199 -1634 -1142 2772 -2080 968 257 -1457
1237 -1457 1257 -788 914 -171 -853 1394 -2103 1575 758 -2529 3080 -2180 -898 3623 -3709
1252 -3709 1862 1277 -4180 3848 -1121 -1755 3860 -3434 434 1977 -2867 2370 -170 -1672 1621
1267 1621 -1159 371 658 -533 328 -871 790 -269 -214 1486 -2047 737 844 -2113 2579 -745
1283 -745 -1769 2714 -2302 279 2463 -3010 1462 562 -2573 2700 -476 -1477 2167 -1766 -269
1298 -269 1894 -1514 513 610 -1530 734 475 -606 507 -59 -716 221 612 -413 84 547 -1308
1315 -1308 511 1022 -1503 1355 -32 -2040 2344 -851 -952 2716 -2666 191 2087 -2959 2291
1330B291j943l146N614m254P13L419n102K999K05k622L533k007j53R78j413J544
1346F56j100J081m06j744L255l085J213K589n505M649r47l813O996n369O0M961
1362C491p259N023Q05n516O463l900j100M954m964K576N62l163L255j768O22O51
1378G32j714J963k286J735P00l090M136l264m36M586n745L661R30n711O564l045
1394b84j988O068o266J985K931n463M813r51l073M082k767L02K091k257R79k73
1410g1k14L87j62R34j845J090M91k213L295j709j557L641l690J204K840m702L132
1427H51K15l789M811j909j951M160l807M51L204l903K103Q75l438L041m25j673
1443a184K576j733n08J540j001L53L62l95n82M98P52j528J639l22k390L542k015
$$ plain form
1330 2291 348 -2798 2816 -1438 -725 2694 -2408 591 796 -1826 1707 -300 -453 525 -888 656
1346 656 -444 637 231 -1513 1742 -1343 -130 2459 -3046 1603 656 -3157 3839 -1530 -1470 3491
1362 3491 -3768 1255 2060 -3456 3007 -893 -1993 2961 -2003 573 1135 -2028 1227 -541 81 732
1378 732 -982 981 -1305 430 1130 -1960 2176 -1088 -1524 3062 -2683 978 1908 -3803 2761 -284
1394 -284 -2272 3796 -2470 -485 2446 -3017 1796 845 -2228 1854 -913 -611 1480 -777 202 -71
1410 -71 -285 102 -60 874 -971 119 610 -1603 1692 -17 -1574 2067 -1623 -419 2421 -2281 851
1427 851 1066 -2723 2088 179 -1772 2388 -1419 -968 2236 -1667 436 1311 -2127 914 489 -1184
1443 -1184 1392 -341 -849 691 -310 43 405 10 -572 -74 678 -850 789 467 -1923 1619 -396
1460c96q81M060m888J750K616n347N067r72m061N954m251K9M514n644L017O78
1476A245l767M409k025o69K138k642J702l76j10R41k107K332j814L2L072m654
1492b293L296M0m304O465m055r26N461p155L983J961o158O687l240k454N933n319
1508b078K127K056m566L657j306p94K332k274J404j057J61J401k448K993k020
1523d12j202M094m639K683J655n577N609k215k581O278n615J128L475n895M585
1538A371J2l905M649k799p38L386k950J005P47j819J196Q1j04k41K18k7j067J975
1556I90q68j103K558k809N85K668l841K529N91l985M370j355k282M599l847j47
1572a347L777m459K468J391m324L638p50k156L752k460m44K131k311J282N59j188
$$ plain form
1460 -396 -1277 2783 -2105 -355 2261 -3086 1981 1009 -3052 2902 -1349 -1320 3194 -2450 567 1245
1476 1245 -2522 1887 -138 -807 1331 -1311 391 15 -95 846 -1261 1071 -743 -711 2361 -2293
1492 -2293 1003 1043 -3261 3204 -851 -1777 3684 -3471 512 2473 -3685 3002 -238 -2692 3241 -2078
1508 -2078 49 2105 -2461 1196 -110 -904 1428 -846 558 -499 -338 1063 -1385 1608 -412
1523 -412 -1614 2480 -2159 524 2179 -3398 2211 -4 -2585 3693 -1922 -794 2681 -3214 1371
1538 1371 1383 -2522 2127 -672 -1410 1976 -974 31 778 -1041 155 236 132 -109 109 82 -985 990
1556 990 122 -981 1577 -1232 -647 2021 -1820 709 1300 -2685 1685 330 -1952 2647 -1200 -1347
1572 -1347 2430 -2029 439 1830 -2494 1144 394 -1762 1990 -470 -914 1217 -1094 188 747 -441
1588d41N63l99M42n35P80K93k166K584j363j166M056m288J180K789n605N066n26
1605A264m405O366m650l57N333o306L494J052n034N375k302j132L489l767J697
1620A17L28j267J986j973J411r26o66K949l725K641K88m263N882l597q50N448
1636C783p093L744J908o202P032l193k779O277n905K236K833n378M161j267j883
1651a726L535k533Q56K21j185J478j449J789j006j137K882l568K239J475m583
1666b712M748k191k314N801n083J195L292o011M502J34l934N042l053j107L828
1681B137l413J276J389k808J641J25r24J059k07o19l0P82n98r1J428k092N55J593
1699A203k617K105L71l216L511j297j882M382l557j51L549m732K749J664m759
$$ plain form
1588 -441 122 -277 165 -370 410 703 -1463 1121 -242 -1408 2648 -1640 -460 2329 -3276 1790 1264
1605 1264 -3141 3225 -1425 -1782 3551 -2755 739 1791 -3243 2132 -170 -1302 2187 -1580 117
1620 117 445 -822 1164 -809 602 -324 -990 1959 -1766 875 1163 -3100 2782 -815 -1665 3783
1636 3783 -3310 434 2342 -3860 3172 -21 -2800 3477 -2428 -192 2641 -2737 1424 157 -1726
1651 -1726 1809 -724 132 353 -832 646 -803 986 -20 -1157 1725 -1843 396 1871 -2712
1666 -2712 2036 -155 -2469 3332 -1751 -556 2736 -3275 1227 1361 -2573 2469 -584 -1691 2137
1681 2137 -1276 0 1389 -1419 222 347 -577 482 275 -344 -374 408 -190 -281 1147 -945 -390 1203
1699 1203 -1414 691 1062 -2154 1357 60 -1822 2560 -997 -1148 2401 -2331 418 2082 -2677
1714b677M262j296k584M782l218j18K736l678K053O97j961J863j097j42M50j45
1730g3P44j482J538r29j148L506l472J104K348n293M763o03l932O399n002k04
1746a736N235o660M261R35n565O039l002j223M604m697J942Q37k635K995j668
1761c38M16K54j405K314k421J836M65l558M657l150n06M891o401L577J342n852
1777c879P000l250k382O144o339K430K938n595M745j473k515M182k905Q04J170
1792A075k143J478p86O80n3p92J649k515J684R36l150L867k229j690M683m456
1808a762J584K698n517M188j93l605N243l098j256M037m002J517K068l634K246
1823E14M3j953K349o73r05J057n75k86O97K76r87M07N64j651J728K61k358K720
$$ plain form
1714 -2677 1585 289 -2295 2487 -731 -849 1887 -1791 262 959 -1002 861 -236 -378 72 -73
1730 -73 671 -811 727 -202 -1350 2156 -1316 -212 2136 -3157 1606 1003 -2929 3470 -1532 -1736
1746 -1736 3499 -3161 1100 2035 -3530 2509 -493 -1716 2888 -1809 133 970 -1665 1330 -338
1761 -338 78 332 -1073 1241 -1180 656 1121 -2437 2220 -930 -1436 3455 -2946 631 1973 -3879
1777 -3879 3121 -129 -2511 3633 -2706 -276 2662 -2933 1812 339 -2176 2006 -899 -95 1075
1792 1075 -1068 410 -376 304 251 -541 1108 -1407 277 1213 -1937 1930 -299 -1989 2694 -1762
1808 -1762 -178 2520 -2997 1191 998 -2607 2636 -462 -1718 2319 -1683 -166 1902 -1732 514
1823 514 557 -1396 953 280 -625 432 -143 -429 268 544 -443 -36 528 -1123 605 866 -1492 1228
1841A228j330j599L974l184N0L234m878K904J539m693M835j890k784N379m071
1856a286N53L264m944K962M24k791L474j945m58J500j538J306o67M07j03j343
1872a185K637k450R06K080m698M155q23l354O226n031J64M661o789M826O00n416
1888c491O435l847j019N070n297K606Q37l546L709j781rJ294k038J810j509J022
1904B46P27k653L455k753j79L912n290L552N17n051O425l426j500N679o430K693
1920g6K438n494N268j702k713M508l439Q25J988k841J660m45m20Q39n54P80j435
1937h13R63L60j858K998k023q99L286l836J964J873m484L849q94k881M898l106
1953f03o86L632m286J795K029l815K898k68k614L240j301r21K225j966Q4J300
$$ plain form
1841 1228 -102 -1701 2273 -911 -861 2373 -2505 399 1938 -2755 2080 190 -2594 2785 -1286
1856 -1286 -733 2531 -2413 549 973 -1818 1656 -289 -747 753 -785 521 -146 261 158 -1185
1872 -1185 1452 -998 -92 1988 -2710 1445 622 -2732 3494 -1537 -1373 3288 -3501 1325 1925 -3491
1888 -3491 2944 -903 -1922 3148 -2149 457 1294 -2252 1457 -324 -333 961 -1077 733 -776 246
1904 246 973 -1680 1775 -978 -1157 2755 -2535 1017 1534 -3517 2908 -518 -2018 3661 -2769 -76
1920 -76 2362 -3132 2136 434 -2279 2229 -1210 -385 1603 -1238 422 -23 -443 396 -158 622 -813
1937 -813 150 510 -1348 1650 -373 -1272 2014 -1822 142 2015 -2469 1380 486 -2395 2503 -603
1953 -603 -1289 2343 -1943 -148 1881 -1934 964 696 -1918 1322 21 -900 1325 -641 -557 743
1969G43j114M18L60n82l22P66M9j031J654j098j140K927k531M10K609m387K772
1986E03R11m043M951k330k236N043m634J412K994n175L725m22k916M315k651j19
2002f72K002k690J811k53m22Q15j435J619j499O01J649l485L277j161k414N250
2018B993m580R03L503o305M999j93m439O353m467m38M651n478L316O28l862M065
2034A649k138j73K078k418J525q75J51R20j713K351k140K7K593l951L352k38l702
2051b702N249l625k71M518n774L066J242m733N244k042k079M261l843R99K202
2066A712l130K041k18j434J550m87j4rQ5j91n29J591j322l4J651k772J806Q97
2084A193k937L159j271k021L878k801k2L011m060J878J476l523L326o69k516L454
$$ plain form
1969 743 -371 47 407 -175 -497 269 318 -713 941 -157 -1297 1630 -901 -491 2118 -2269 503
1986 503 1414 -2629 2322 -8 -2244 2799 -1835 -423 2571 -2604 1121 699 -2217 2098 -553 -672
2002 -672 1330 -1360 451 198 -224 591 -844 775 -724 -123 1526 -1959 1318 157 -2257 2993
2018 2993 -1587 -684 2819 -3486 1513 1320 -3119 3234 -1233 -1671 2980 -2498 818 1446 -2416 1649
2034 1649 -489 -662 1416 -1002 523 -352 -201 719 -994 1357 -783 -756 1837 -2114 1238 1000 -2702
2051 -2702 2547 -1078 -1349 3169 -2605 461 1703 -3030 2214 172 -1907 2354 -1489 -490 1712
2066 1712 -1418 623 405 -1029 521 34 20 11 96 -95 -624 967 -355 -389 1262 -1510 296 1193
2084 1193 -1744 1415 144 -1877 2001 -800 -822 2189 -1871 7 1483 -2040 1286 617 -1899 1555
2100A555k019n02K759k803P61J197k108J653J4j088Q57l91k6P9N09m06p36J613
2118I18j666M36J978l381K333L20l340M581k384j522M453m854J897K539n000M321
2134A629j156k813M614l273M81K239l401K242l29r60J697j585J003p52J6J416
2150A068k386K488j169j695L984l866J465K390n286M643j050l200N821m650L64
2165a079L719n406L844J90l574M242k629k63K587k738J557k62q54J202j090J316
2181G62j099n3J416k614K623m83k311L849l310L46L298m670L131L19l842M695
2197B057k292j189L769l887J216J825l118K460k76j787J966q88k62J002o29k57
2213b90K59K33n31N10L76j471J255K5j439K258j240j102K592k330L99K285l326
$$ plain form
2100 1555 -464 -966 1793 -1010 -249 948 -1160 493 507 -581 276 -115 -141 -62 447 41 -695 918
2118 918 -748 -312 1666 -1715 618 938 -2402 2179 -205 -1727 2726 -2128 -231 2308 -2692 1629
2134 1629 473 -2340 2274 -999 -518 1721 -1680 562 233 -727 970 -615 388 -364 -348 1068
2150 1068 -1318 1170 1 -1694 2290 -1576 -111 2279 -3007 1636 586 -2614 3207 -1443 -1079
2165 -1079 2640 -2766 1078 1268 -2306 1936 -693 -956 1631 -1107 450 188 -666 536 -554 762
2181 762 -337 -390 1026 -1588 1035 552 -1759 2090 -1220 -874 2424 -2246 885 1204 -2638 2057
2197 2057 -235 -1424 2345 -1542 -326 1499 -1619 841 565 -1222 744 -144 -406 596 -33 -290
2213 -290 -31 202 -329 181 557 -914 341 366 -1073 1185 -55 -1157 1435 -895 -496 1789 -1537
2230a537J773R01l144L336q54k133L459k602j38K825l184J484Q58k639K409n55
2246B59j028J675j315J39N09l18K79m63P17j012K91J360k330J971j67k516L803
2263A854k428n40L608m659K354J513m331M631j851k197M443l902J209K167l734
2278a863K776p25j333K374j800P74o7o95J230j505J682p99j171K744l112J640
2294A50J503m021M050j700k070M865m362J183K602m921L992n01k789M170l049
2309h98M5K425k910J908o4j395J445r28N65j27j84O08j471J673o18r75K469k696
2327a128P97J814l323K927l95k663L737k398m15L108l504J386J271k937K616l55
2343E38j757K237j328l72J588j198R9O29p83J38N94l34l50O64m85m33J347r78
$$ plain form
2230 -1537 236 1137 -2007 1329 475 -1658 1801 -801 -939 1886 -1298 186 1044 -1595 814 259
2246 259 -769 906 -409 -270 239 -79 200 -263 454 -558 -267 1093 -1237 734 567 -1949 1854
2263 1854 -574 -1114 2494 -2165 189 1702 -2629 2002 151 -2046 2397 -1505 -296 1871 -1863
2278 -1863 913 188 -1145 1229 -571 203 136 -559 671 -834 848 49 -1122 1622 -1490 150
2294 150 1653 -2368 1682 -18 -2088 2777 -1585 -402 2200 -2721 1271 770 -2019 2151 -898
2309 -898 -853 1572 -1338 570 506 -889 556 -372 193 66 -118 490 -981 692 74 -901 1568 -1128
2327 -1128 -331 1483 -1840 1087 692 -1971 1766 -632 -1047 2061 -1443 -57 1214 -1723 893 538
2343 538 -1219 1018 -310 -682 906 -292 -193 436 -347 -209 385 51 -299 365 -120 -553 794 -184
2361a84k86J452j867O74J405k434J772K16k491K994j188j384L203k936L70K383
2377A699l359K253L99k760K951j331p83K299k113O23O16j183J108m65J60k08k31
2394c25R30j436J464k19j797K867k261Q0K752l977K512N05l499M463k342j186
2410a469L795m156J842J566l538L277j274j322K650k175R34M28j301J236r99Q70
2426C64k00p61J663k231J385P69k690L298j914j133L645l843J754J645m146L777
2442A382j097k042L904l130L83K077l011K128Jj589J738j079J03N62m61L65o42
2459d08P12m81k33J435j874R27O96k230K517q30j496K820k430K35K275k997J697
2476C35O42k635K622o55j454K458j752k85J825j803O73Q21j589R21J97p94P62
$$ plain form
2361 -184 -470 982 -885 -211 1194 -1240 532 748 -1743 1251 63 -1321 1882 -1054 -684 1699
2377 1699 -1660 593 992 -1768 1183 -148 -931 1368 -745 -122 494 -689 419 -46 114 -94 -325
2394 -325 605 -831 633 414 -1383 1484 -777 -697 2055 -1922 590 1095 -2404 2059 -283 -1469
2410 -1469 2326 -1830 12 1578 -1960 1317 43 -1279 1371 -804 130 558 -743 493 -506 364
2426 364 164 -597 1066 -1165 220 989 -1701 1597 -317 -1450 2195 -1648 106 1751 -2395 1382
2442 1382 285 -1757 2147 -983 -600 1477 -1534 594 595 -994 744 -335 -232 330 -131 234 -408
2459 -408 304 -177 -410 1025 -849 78 774 -1456 1061 231 -1265 1555 -875 -640 1635 -1362 335
2476 335 977 -1658 964 309 -1145 1313 -439 -724 1101 -702 -29 792 -797 124 321 -473 289
2493B89q0n30K54L01m42J52O31j176N11P68j669J606j05j870K536j463p08K777
2511A782k943R47J606l224K786k93k257L130k128k23K316k579J348L43j661J694
2527F44p69j1M82p35P09q28Q48k9j195K027j943L62J962l187K529j94k702L947
2545A917k584l23L161m075K248Q36l124L524j707r99K586k514J191O00j556J413
2561E94r21K98K80n99J057j457R63K44j632K523j838l17K403l229K086P11l092
2578a926L427j706j182L312l054R36J518k930K269j94j493K003j276j79J018q52
2594c09L86M0j18j77R0N27r40Q19lj262J756r16n84J933k102N78J397k380J827
2613E62J09k066K387j062r01K326j982J43J559k113J234N56j725J506l94q73J378
$$ plain form
2493 289 209 -321 -67 234 -208 -56 575 -601 -90 678 -991 615 510 -1360 1176 -287 -995 1782
2511 1782 -1161 -214 1392 -1832 954 661 -1596 1534 -594 -817 1499 -1080 268 611 -1050 644
2527 644 -125 -136 346 -389 320 -508 340 311 -884 1143 -800 -438 1524 -1663 866 672 -2030 1917
2545 1917 -667 -990 2171 -1904 344 1180 -1944 1580 -127 -1126 1460 -1054 137 737 -819 594
2561 594 -327 -29 251 -348 709 -748 215 459 -1173 1350 -488 -805 1598 -1631 455 1166 -1926
2578 -1926 1501 -205 -1387 1925 -1129 -193 1325 -1605 664 470 -1023 980 -296 -475 543 -309
2594 -309 77 117 -1 -178 -88 439 -501 318 315 -947 809 -107 -691 1242 -860 -282 1115 -1265 562
2613 562 671 -1395 992 -70 -971 1355 -627 -484 1075 -1038 196 752 -973 533 139 -734 644
2630F44p06j98O93o77J06L35m1l52J91L07r66J112j17j246J939j421l62K251k625
2649a133J235J054k952K849p61j691L107k569K63K005k778J929K4j758K054j227
2665c49N9R28j124P62n10K46K38p41J322j431M03J185k324K277o08j827L187k634
2683i41L94K375l632K499Q4k618L481k004n17K384k756J406N78j694J708r43j43
2700c39O98p01P40o97M16O8r36J690j381J09J475k507J926R3k086K890j882n35
2718i59K555k818J353R84k614K306o07j223K154j502p1J149j286O17L45o88L16
2735A1M9j45o0M27k61m18Q65p49J7J097j440N50P25j716J576o0j515K052j175
2754a70o58K050j853L64J328k199J523K36j733J977r11p51J693j331K92P58j167
$$ plain form
2630 644 -62 -260 433 -244 -138 197 156 -196 -5 302 -664 448 331 -915 1024 -397 -759 1492 -1133
2649 -1133 102 1156 -1796 1053 292 -1399 1708 -861 -598 1407 -1371 558 582 -1176 878 -349
2665 -349 -290 638 -486 276 -234 12 250 -491 831 -600 -197 988 -1336 941 333 -1494 1693 -941
2683 -941 -547 1828 -1804 695 779 -1839 1642 -362 -879 1505 -1251 155 733 -961 747 -196 -339
2700 -339 359 -342 398 -299 117 185 -751 939 -442 -333 1142 -1365 561 654 -1432 1458 -424 -959
2718 -959 1596 -1222 131 1115 -1499 807 200 -1023 1131 -371 -442 707 -579 38 383 -305 11
2735 11 60 -85 -145 282 21 -397 468 -281 -264 833 -607 -57 668 -1048 528 468 -1047 1005 -170
2754 -170 -828 1222 -631 -267 1061 -1138 385 621 -1112 865 -46 -797 896 -435 -143 615 -552
2771e52O56M5l51L38j59J23m52N53m4p22J376j216j14J630k201J431N45k434K706
2790A158j232j100K912k769P84J528k837K376l86j590K315j723K37J126j477J068
2806C90m22k28N52o98R50q92K35P26j689J888p30j099K460k493Q31J591l022K609
2824I59n70j952L158k283J48J994k793J710K06j647K003j111k12R37r90O55j92
2841B0l0J34n41R20q74L26P56j683J519l04j252K252j748o0J789k421J487N46
2859H36k106K150q71r59K056j579J76J100j563Q59L33r34P71j51m49M58Kk54J38
2878A3K10n03K70L94q04N74J67j029J114k30r11J611j169l03J626j783P42R93
2896I82k190J686m1j481K144j296m53J685j780P61P23j506J182l77m66Q47n74
$$ plain form
2771 -552 104 149 -202 136 -23 100 -352 201 157 -565 811 -405 -519 1111 -1090 341 886 -1548 1158
2790 1158 -74 -1174 1738 -1031 -247 1281 -1556 820 434 -1156 1159 -564 -327 799 -678 390
2806 390 -32 -260 292 -406 544 -348 -113 613 -1076 812 82 -1017 1443 -1050 -219 1372 -1650 959
2824 959 389 -1563 1595 -688 -540 1454 -1339 371 577 -1070 933 -178 -390 547 -443 212 20
2841 20 -10 124 -417 503 -371 -45 711 -972 547 243 -1009 1243 -505 -565 1224 -1197 290 836
2859 836 -1270 880 9 -950 1106 -473 -297 803 -760 99 432 -502 269 118 -331 127 129 -125 13
2878 13 223 -280 -10 384 -420 154 321 -708 406 176 -735 876 -293 -596 1030 -753 -11 982
2896 982 -1208 478 437 -1044 1100 -196 -649 1036 -744 17 740 -766 416 39 -427 420 -154
2913a54K33j15JJ59m66R01q17nJ038j728J367J50j767K328j480m88K325k619J249
2932A12Q95k541K490q45j123K294k012M99J019j650J362m24m93Q09p62O31l52
2949i1J0M84j137J313o19n60J734k045R34R12k303K373q34j344K591k246N47J501
2967A220k477J815j64j438K025j204j45J027j178O09O8l39L44l62L47l77K46L61
2985C78r48J024m83o47J522j363L34J054j927J346K02j505J907r62o81J770j556
3002e35L43R93j551Q83L13j141J170l50o29R24n07r9N20m34k0K01q3j54L31p4
3022A01m71O72k93m39J042r18q2J148j479Q30O43j792J694m66j187K100j491q0
3040d68J526j985J086M20j450J502o94m57J110r61M55J10m39M33m46N24l43j15
$$ plain form
2913 -154 79 -36 -35 124 -342 559 -258 -263 775 -953 414 564 -1203 1125 -355 -843 1482 -1137 112
2932 112 1007 -1534 956 111 -1012 1282 -730 -231 788 -862 500 76 -417 392 -370 261 -91
2949 -91 -81 403 -734 579 -40 -600 1134 -911 23 935 -1368 1005 171 -1173 1418 -828 -281 1220
2967 1220 -1257 558 394 -1044 981 -223 -368 659 -519 90 158 -181 163 -199 148 -229 17 378
2985 378 -570 454 -29 -676 846 -517 -183 871 -1056 290 492 -1013 894 -68 -749 1021 -535
3002 -535 -192 801 -750 133 446 -695 475 125 -504 420 -87 -186 334 -100 -120 81 -2 -156 175 101
3022 101 -370 302 9 -430 612 -306 -388 760 -719 111 754 -1038 656 190 -997 1103 -388 -468
3040 -468 1058 -927 159 579 -871 631 -63 -520 590 -371 84 194 -245 188 -258 266 -77 -192
3058a92P62j304J054N2j294J940j412k20J832k333J411N12k177K383j133p33K134
3075A282k096P80P81j725J580n07n53J010r41M77%k38M72p38P41m20k76J157j494
3094g08Q57M14j642J954r11p75K005k038P07J105k091J745l33j255J871j218l8
3111c51J106j318O20K30o55O05k05j17O9L4P5k89N09m16k03Q30r47M47N25j297
3131g48J112j49r50J512r64l39J328j403N05Q01j465J033O7j083J302n24n16J075
3149E94q88P5P00q10L90J56n00L52J5j09j9J48j08k62O46n32o7Q10j199O98M60
3170E50j410J504n66r15J845j544K53J259j974J338R9j365J738j011k59J151j248
3187e55O51K01o77P01m84K19jj95N10q42O80J1q47J464j230M6J280j943J388J61
$$ plain form
3058 -192 570 -734 320 372 -922 1018 -394 -614 1218 -1115 296 808 -1369 1014 -119 -852 1282
3075 1282 -814 -34 747 -978 602 95 -458 552 -389 88 88 -150 322 -416 325 -95 -371 786 -708
3094 -708 149 563 -1079 875 -36 -811 1194 -844 -137 968 -1123 622 289 -966 905 -313 -351
3111 -351 755 -563 57 287 -368 237 32 -85 -16 18 93 -196 313 -103 -306 524 -423 24 549 -748
3131 -748 364 215 -735 777 -187 -526 802 -601 -96 705 -760 273 340 -743 559 35 -481 594
3149 594 -294 -219 481 -329 61 217 -283 69 84 -25 -44 104 -4 -266 380 -152 -219 591 -608 90 550
3170 550 -860 644 78 -837 1008 -536 -283 976 -998 340 439 -926 812 -199 -458 693 -555
3187 -555 96 297 -380 321 -163 56 55 -140 370 -472 208 219 -628 836 -394 -348 932 -1011 377 538
3207E38j639K096j258m17J790j977R73N65j651J580o47m75J168j027L92K22m90
3224b57M89l96K99j71j80O75r08O56J01j042J429q85k82J400j687Q33N85j601
3242i42J602n36q76J581j228J34R76j293P02J78p91P89k21l06M03k12p0J40R5
3261A25k34O8K56n10M00J63p05P52k53n60J067p38j38R63j187N02O09j256J039
3280C63r5r70J316p11l16J115j130L07O12j012P43j8o11O68l23p4L05k32O4j11
3300a10K50k28k5N08q19N20K44j018J285o22o20J530j495M73R76j800J429j99
3318B79j169J772j176o0J112j425Q48J14p87R22n95P7K59l82M71m85L39m7n23
3337d56J008q99J98Q18j509J283j80j148J794j273o9J415j854J091L32j462J530
$$ plain form
3207 538 -1101 995 -263 -680 1110 -867 106 671 -980 600 -47 -522 646 -381 11 233 -257
3224 -257 232 -164 135 -36 -216 459 -449 207 308 -734 695 -190 -472 928 -759 74 659 -942
3242 -942 660 124 -752 829 -399 -265 711 -582 120 298 -493 296 75 -231 172 -40 -110 30 125
3261 125 -109 -41 215 -295 105 268 -437 315 62 -498 569 -169 -307 656 -531 -29 580 -676 363
3280 363 268 -702 614 -97 -413 702 -428 -121 491 -521 222 204 -407 261 -62 -136 169 -63 1 -110
3300 -110 140 -88 -113 395 -424 96 340 -678 607 -15 -635 895 -600 -127 849 -951 478 279
3318 279 -890 882 -294 -354 758 -667 181 295 -492 430 -165 -88 171 -211 260 -225 114 67 -456
3337 -456 552 -347 -149 669 -840 443 263 -885 909 -364 -433 982 -872 219 551 -911 619
3354F19p35l55J173j141M45L33p02O22k76k0P8j78L14l91L80j0o05R41p38k5R42
3375F71j299P85K62j209J396o06n77J336j216K65Q13j243Q35P3q42R20l49l12
3393b97O54m80j1L42k88L3J76j31j36K48o3k58M66k83k62O69n81K2O71r78N03
3414A6L86j048J023k05q09J270q65j48J099j273N91M32j138J047l05n40R52p03
3432b18O4M51m94L11j26j8K4r3L25m90L37J70p56J006o04l03J143j351O22O35
3452F35j503J441m64r53J724j358K52R71j478J021m2p42J041p08j8M75n92M42
3470A44k14J46J29n62P30p05K13O24j129J044k82p75J441j244J59J025j587J179
3488C36R7j176J436q73k82J113j158N46L68q50O91k51j61L18k78J83j81K49n2
$$ plain form
3354 619 -116 -471 702 -439 6 339 -363 259 -17 -37 41 -137 177 -214 166 156 -449 492 -246 -271 671
3375 671 -628 157 419 -790 606 0 -577 759 -457 -192 621 -622 213 286 -556 364 15 -297
3393 -297 357 -123 -134 208 -80 -47 129 -2 -138 110 47 -211 255 -28 -290 379 -202 -180 491 -487 16
3414 16 402 -646 377 172 -637 633 -232 -380 719 -554 37 469 -669 378 73 -467 485 -218
3432 -218 -154 297 -197 114 -12 -30 -6 -99 226 -264 73 243 -513 493 -111 -414 729 -622 0 635
3452 635 -868 573 109 -844 880 -478 -226 745 -733 288 246 -496 545 -163 -181 294 -298 144
3470 144 -70 76 205 -357 373 -332 -119 505 -624 420 138 -637 804 -440 -281 744 -843 336
3488 336 433 -743 693 -180 -462 651 -507 39 407 -443 248 -3 -164 154 -124 59 -122 127 75
3507G5l05N62n06N1N62q81O55L5q66J139n77l00J013j130L63O52j113Q16L7q53
3527e71J010m85l04Q15o84P7M59n99L09J53l69K31L0j80R3J29j76m4L06l72Q9
3548h3M15o73M28J96q09Q97k80n88J115r13K2R39j262P38K84j128J167m51m67
3567d53J032r09K17M75p56N60j28k23L08k66K52k05J09J58n34P23m51k12R05j140
3587e38O05M03j245J372n77o47J448j356M14Q00j433J137j87p85J178q12P3N30
3605C80p32N04j31j27K58l30L68l56J27L39p65P85l10n09J137j042K66P59j369
3624g48J096q5r61J381r16j36J024j183O03K94q81Q08k54k99N44l99O4J30j31
3643d9O7n8J80k89J20K28n20N24r7n20Q16n66j12P95r32L83M31r54Q13n8p21R67
$$ plain form
3507 75 -230 332 -174 -123 439 -442 213 248 -618 521 -56 -356 657 -473 -110 542 -571 245 282 -571
3527 -571 439 -46 -350 465 -219 -142 317 -282 27 180 -189 42 72 -108 -15 114 -62 -106 200 -172 -83
3548 -83 332 -341 87 283 -526 371 91 -497 618 -295 -273 666 -596 142 426 -702 465 14 -453
3567 -453 579 -330 -113 362 -394 166 38 -185 123 -143 109 -96 13 171 -363 360 -91 -303 602 -538
3587 -538 67 470 -775 597 20 -627 821 -535 -121 679 -754 383 196 -589 589 -223 -150 380
3605 380 -352 152 21 -106 152 -178 190 -166 -39 300 -465 320 10 -499 638 -404 -138 621 -748
3624 -748 348 263 -698 683 -233 -369 655 -528 75 369 -512 296 42 -257 287 -112 -48 82 -49
3643 -49 18 -40 140 -149 -29 199 -321 203 106 -414 402 -164 -276 519 -413 -30 401 -553 260 202 -519 448
3665D48n48k53Q46p87J98M74p67M96R0n08N20j83k03L31j84oP4lj07J7K40l93
3687b08K67J40o00O90k53m50R59q50R8P61j158Q12J26j018J205o19l17J038j036
3706d13L73M16q43P23k11k88M93m15K00j7o7K01l87M65k92j53O83r01N34K32j001
3727f68J194n75m52J241j258M84N77j275J137k79o76J109q67J80N60q63N64n4
3745G9k55L29k99J94j39M9K29m92N63l11k17P86q88L69M85j054Q82j70o16J093
3765F17r84J62P55j039O03K28q76Q76l28l35O25m29J6K69k96J40P9j35mJ13m4
3786A3j55K79p5j79M00m74O9M38o12K71L57p34O69r6o69R14n25j79P30p23K17
3807f4M14p85N97L0o11P02l11j89M83l94Q5J28k05J08MM8j35J18J22l95M46j59
$$ plain form
3665 448 -100 -353 493 -294 -96 378 -389 107 197 -311 209 26 -177 154 -30 -36 38 35 -72 -55 185 -208
3687 -208 59 199 -401 289 36 -414 545 -305 -207 554 -604 208 334 -684 521 -98 -415 623 -413
3706 -413 -40 376 -467 256 45 -243 250 -165 35 18 -49 152 -235 230 -62 -215 468 -433 101 333 -668
3727 -668 526 -49 -501 740 -518 -34 543 -732 405 126 -550 559 -308 -128 432 -431 133 79
3745 79 -176 153 -146 48 -91 -42 187 -305 258 -53 -270 516 -372 -3 482 -572 310 140 -476 617
3765 617 -367 -205 550 -489 114 342 -534 342 14 -321 304 -125 -109 160 -136 4 83 -52 -56 57 13
3786 13 -142 137 62 -117 283 -191 -122 316 -296 -25 332 -402 267 171 -498 416 -109 -288 442 -281 -64
3807 -64 350 -435 162 192 -419 283 -28 -217 266 -128 -43 85 -120 -12 -8 40 -95 23 145 -250 196 37
3829C7l49P55o77Q1O32j011P38Q8q96J132o38k70R81j028M28L90r02Q12k61l42
3849c00O44n47J91J41k76K88k63K04j01j57M83o09L68J76p40R13m83l18J000j070
3869d56M47N05j144J044k78o33J086q31J01O04q39N41Lm20N05l03K9J17j74J82
3889H6k07K26r5j98M79n27K32L10p28O80j82n01Q94o74kO72r01N14K18p37P37
3910B96k48l83O70m59JL89m49J76J63k71J43P7j51mJ16q9m3K26k48k1L15m23K24
3933GK03n27M58k9m98P07l70k26O80p35K42M75q43O17J7n81P38m02j68N52n50
3954b33K17J96l58K78j01m9R0p4J25k20K28n3k88N56m75K6N23q39O01R1p70R92
3976D63n67k61R39r93M23L80r17Q35k51m01P33n85J51K57m30L66j79K4Q9k25L44
$$ plain form
3829 37 -312 443 -234 -153 479 -532 206 294 -602 530 -108 -378 603 -425 3 393 -509 303 42 -300
3849 -300 344 -203 -12 129 -147 141 -122 82 -19 -176 307 -302 66 242 -498 415 -68 -386 614 -456
3869 -456 -9 496 -648 396 118 -515 571 -260 -159 445 -394 147 150 -270 235 -68 -39 78 -96 86
3889 86 -121 105 10 -188 291 -236 -4 306 -422 258 76 -425 469 -205 -207 465 -436 78 296 -441 296
3910 296 48 -335 335 -124 -123 266 -183 -7 156 -115 28 105 -46 -50 66 -23 -66 160 -88 -109 206 -217 7
3933 7 210 -317 141 112 -386 321 -49 -275 405 -330 -88 387 -456 161 178 -403 335 -67 -235 317 -233
3954 -233 -16 180 -178 100 -1 -50 40 -34 91 -129 99 46 -242 314 -161 -135 388 -451 150 241 -529 463
3976 463 -104 -365 574 -419 4 384 -533 302 51 -350 383 -202 -51 206 -224 142 -37 -13 76 -149 195
3997A95l59J81J95n69O52l35k57P99q65L51M18r54Q81k27n69R54p46Q0N99q23
4017c99N10N7n09N63k67p8K70k47J13l3M8k4r5K49l03J48J98m91M93j45l80O76
4039C54n04j5N60p41M01K14o75O51j75m02O53m31n8M68n24J99K05m06K96K3k60
4060a67K40n9j14J34nr9N6R0j93J29J25l47L10Rl91N52k85k31O19o08J52M63p75
4083c95N57K7o17P76m09j93O35o55K36K65n18M45j40j67K78k20J36o5OQ7k58L70
4105A81k57o5M49o45M25J31o58Q27m42k73Q37q75L56M00q78P78k12m33P53n73
4125a74Q4L47n12L70p3j65K24k09J80j45M8J63l81M28k04k16N91o16K28L52p41
4146d21O66j25m93P85n88K5N25p80M57J46n18N33j88j94L74k91M1J31j36N2J1
$$ plain form
3997 195 -164 17 212 -357 295 -40 -297 502 -363 -12 406 -548 333 106 -463 491 -255 -175 424 -399
4017 -399 111 168 -341 222 -45 -123 147 -100 13 -20 28 4 -91 158 -145 3 201 -290 203 58 -322 354
4039 354 -150 -165 395 -346 55 269 -406 245 70 -332 321 -110 -168 300 -224 -25 180 -226 70 93 -167
4060 -167 73 14 -100 34 29 -70 -14 76 -117 12 137 -210 100 109 -282 270 -15 -246 373 -235 -83 380 -395
4083 -395 162 189 -428 348 -61 -254 381 -274 -38 227 -291 154 14 -153 125 -95 41 -24 -18 69 -189 181
4105 181 -76 -141 308 -337 88 219 -439 388 -54 -327 510 -365 -9 391 -487 291 79 -354 399 -174
4125 -174 -90 257 -255 115 42 -123 101 -108 72 -73 -25 138 -243 185 -19 -235 356 -260 -32 320 -421
4146 -421 245 120 -373 412 -176 -151 374 -406 51 197 -321 212 24 -170 204 -87 -46 85 -51 1 12
4167A2L7j27R4O9k65L07j14k20M27l49jM04n26K64K11n34M89p2m08N72l38j30
4189a98N08m85J22L13n07L28O3l57L77j52j58K91j91J5J06r5qK9O6j45J06O6k89
4212a95L38j15k52N13m58L7M72o89M52J08o31P31l40k60O92o67K05L53o14M92
4232A72r8k80M14k97P1J12j59J54j75J73q4j26L54m33K25J95n76O38k79l20P52
4253D33p25K19M52q35O73r7n25P87n29PM51n93L46N3l00L24j89J5N4p2J48k14
4275a17K16q3j84M36m30J27L10o17N10n3m61P00m69q8N65o53L21K17n82N04j20
4296D9k91M55k84m0K70k64Q4J00j37M4N3m8n0J42p2j13K29j90j6K86l51J43J87
4319A86m41L78J2l97N00k59k16N47m76P8L75n70L33J23m67M80j74k25M09l12M7
$$ plain form
4167 12 49 -78 16 85 -180 127 13 -207 220 -129 -130 274 -252 12 223 -311 178 106 -302 270 -68 -198
4189 -198 310 -175 -53 260 -247 81 144 -213 164 12 -146 145 -46 -31 75 -20 -28 1 67 -78 28 94 -195
4212 -195 143 28 -224 289 -169 -132 340 -349 103 211 -420 311 -29 -289 403 -264 -59 294 -320 172
4232 172 74 -206 208 -89 -18 94 -65 89 -86 87 3 -123 231 -202 23 218 -358 280 1 -319 433
4253 433 -292 -73 379 -456 217 120 -405 382 -147 -140 311 -282 64 117 -183 141 -48 -33 21 -51 97 -117
4275 -117 99 16 -168 268 -162 -35 275 -342 168 115 -346 354 -115 -203 362 -291 30 247 -335 169 49
4296 49 -242 213 -71 -111 159 -105 -21 79 -58 -14 39 -9 -59 83 11 -102 127 -63 -79 207 -144 -1 186
4319 186 -255 123 135 -262 238 -21 -237 310 -166 -88 287 -283 50 173 -294 186 12 -213 196 -116 -69
4340f9K03k61J39Rn1L3k2R1j87J87qk48M19l21p2M72n96L39K11o76P01k78l32
4363c17P46o81J73M14p14N34m3m05N53l58J3K45l01K09r1jN9j54K81k86J04K02
4385A82m97N21j71l24O87o48J58M66p90O19l1n70P84n11n2N62o68L31J36m38M38
4406A84j92r7K09j85J17n6L4J4j39K60k59P6K41m77L92l1l95O07l97r7N23n97
4428b65K63K62n88M91p6l66N37k91j14L79l61Q4K11k79J33O2j78J08L9j02M0P3
4450F2j27K0J60k20Q7J50l26K58N4l77M49j78k62N44m51L8M48o40L78J22n37N92
4472B44k33k65N48m44P5K85m00K56j0j61J95j12N0o1L5M8k11L21k29q9M30n62
4494b90L26K09o41O68k75l51P80o75J58M66p99O04n4m54O51m33j8L69m50L03m0
$$ plain form
4340 -69 134 -127 12 21 -30 3 -19 72 -115 72 64 -184 235 -86 -158 314 -282 57 268 -408 293 15 -317
4363 -317 429 -252 -79 335 -379 155 112 -293 260 -98 -85 160 -141 68 -23 -24 35 -119 162 -124 -20 182
4385 182 -315 206 35 -289 398 -250 -92 374 -416 203 172 -398 386 -125 -177 385 -283 48 184 -254 184
4406 184 -8 -105 104 -81 36 -20 14 28 -111 149 -110 -34 207 -270 122 91 -304 303 -94 -191 332 -265
4428 -265 -2 260 -328 163 87 -279 258 -33 -147 232 -129 -45 166 -113 20 82 -96 12 51 -51 -11 62
4450 62 -65 -45 115 -105 -18 132 -194 64 118 -259 190 12 -250 294 -157 -119 329 -311 67 189 -348 244
4472 244 11 -254 294 -150 -75 210 -190 66 56 -105 90 -22 28 -33 2 50 -161 160 -69 -158 272 -290
4494 -290 36 245 -396 272 -3 -354 426 -249 -91 375 -424 180 126 -328 323 -110 -128 241 -209 94 54
4515E4j59K04j86J76j34K1J81l93L89j07k92N96n59J12M43p53N88k6n61P69m91
4536a28r5O08o93L25J91n32N01j67j82L38k58O0Q7q2N4o5R8j25N6J41l03K76m6
4559E9k95M83l08r4M61n33K09K72n68M72o8m00N69l27j21M66m58J11K73m25K68
4580D6O9l03K77p6j40K12q2o9J00rr2P9Q7k25J67N5k91L69j42k57N11m27J3M76
4604C48o68M00J38o08O68k79k86O52n89J51L30n48M25p3k60L62k47O8O7j13J38
4625G6j96K22j03j33L76m69K54K07o24O78k70l58P83p03J78M88q46O43o6n21P68
4646C84n08l8M60n73L34M0k82L10k16Q3J5p6J88k89K68p1k58N25m83R6L95o98
4668c94N81l0n35P79n34q6O33p51L83K08o19N83j79k60M76l47RK31k46J10L0o9
$$ plain form
4515 54 -105 99 -87 89 -45 -24 157 -236 153 46 -246 350 -209 -97 346 -407 181 155 -406 363 -128
4536 -128 -223 385 -308 17 208 -324 177 10 -172 166 -92 -32 55 -27 27 -38 60 -65 -9 132 -171 105 59
4559 59 -236 247 -61 -155 306 -227 -18 254 -314 158 90 -310 259 -68 -189 277 -181 -70 203 -222 46
4580 46 115 -188 89 13 -127 85 3 -66 34 25 -67 12 99 -126 41 96 -195 174 32 -225 286 -141 -128 348
4604 348 -320 80 218 -390 278 -1 -287 365 -224 -73 257 -291 134 61 -199 163 -84 -16 51 -62 76
4625 76 -120 102 -1 -134 242 -227 27 234 -390 288 18 -340 443 -260 -82 406 -440 203 137 -384 384
4646 384 -124 -162 298 -275 59 99 -183 127 -89 -6 9 -67 121 -168 100 29 -229 296 -187 -91 304 -394
4668 -394 187 157 -378 401 -133 -219 414 -337 46 254 -365 218 39 -221 255 -92 -83 148 -98 12 42 -27
4690b7j0M3M1j74K16p6j98L63k74l0L88m86K22K10n32M84n1m24N93l44j38N32
4712C28n26J47L13n45L88K9l92M51k07j42L31k65N3J31j63N9K3J1q0P7M8k46L00
4735A23j12k16M87m59O8M28o75M67R2o37P59l71k56P37p26K41L59o90N91j27l35
4756b52N08l90R2J73k51K16j60Q8mj50L34l95K00J91n63O48l04l04P57p76K90
4777e2M42q79P69j76n41Q90o50L4N30p22M51M0l91M56k51j1J49j67J67j55J29
4798F2n2j64L84l96J45K64n95N55j17m27P35n67nN56p56M47J62o35O51k49k70
4819b72N74m50M9L04l94K09P5j97J41j4p4L1Q5r0n0J95k16M3K48l88K23J31m51
4842b88M66j02l55N83m15q7N46n99K31L02o57N25l9m40O04l51j31M70m63J86J65
$$ plain form
4690 -27 -37 6 47 -127 89 13 -185 178 -96 -126 262 -224 -2 208 -324 160 109 -315 278 -66 -204 328
4712 328 -198 -51 262 -283 105 134 -258 193 -14 -156 175 -90 -37 94 -69 -10 13 24 -56 21 69 -177 123
4735 123 11 -205 282 -177 -109 319 -356 111 203 -434 325 -46 -302 435 -291 -50 309 -381 210 83 -252
4756 -252 256 -134 -42 131 -120 96 -64 24 20 -130 204 -191 9 200 -363 285 -19 -323 434 -342 -52
4777 -52 390 -489 280 104 -437 453 -197 -163 367 -355 96 136 -255 201 -50 -61 88 -79 88 -67 62
4798 62 10 -154 230 -166 -21 243 -352 203 86 -341 394 -173 -178 378 -378 69 231 -404 247 -2 -272
4819 -272 302 -148 -99 205 -189 20 95 -102 39 25 -49 -18 67 -23 -73 122 -94 -51 197 -191 32 163 -288
4842 -288 178 76 -279 304 -111 -198 348 -251 -20 282 -375 150 111 -329 275 -76 -207 263 -200 -14 151
4863A51l26K58p2p2J13p1P4j48J66m4j87M20m09P5L82o68N20L7o41Q44n15j75
4885b88P85q69M02L00p98P62k46l56O64n64J46K64m24L28j37k9J19j29K17k98
4905a51J44J72m39N48l33j66O60p72L40L43q38Q52l04m55Q93p54J56N16q19N60
4925A53j6m59N95l43k8K67l20J99m5j1J6j09K32k74J45J74m55M80j82k99O44n67
4947b03R1M62p38N11J02o12O85l19k52O22n14Q9L64n27K89R9l43L08p4j61J99
4968G8p9o1R5Jj03M9R8k05J70O7l44L73j01k78N27l91p2N19o38L17K68o89O31
4991B32j48m50P46n03m9N25o44L39J52m60M40j92j23K72k06J02m5J3L1j66L10
5012A76l09O5L10n93N08l1n44Q30n83p9P30r14N34K05q19Q77l96k88P64p29K63
$$ plain form
4863 151 -175 83 11 -61 52 -19 55 -93 73 29 -158 262 -147 -72 310 -358 162 199 -442 402 -113 -288
4885 -288 497 -372 30 330 -468 294 48 -308 356 -208 -62 202 -222 106 -31 -60 59 -70 147 -151
4905 -151 -7 165 -274 274 -59 -225 435 -337 3 346 -492 360 56 -399 494 -260 -104 412 -407 153
4925 153 137 -322 273 -70 -98 169 -151 48 3 -8 8 -101 131 -143 2 176 -279 201 19 -280 364 -203
4947 -203 -112 350 -388 123 225 -387 298 -21 -273 349 -165 -76 288 -239 50 149 -194 114 40 -121 78
4968 78 -1 -62 33 34 -69 -20 78 -127 43 110 -234 139 38 -240 287 -104 -176 343 -295 22 290 -399 232
4991 232 84 -366 380 -123 -172 353 -291 48 200 -260 180 -12 -135 137 -69 33 -12 1 32 -134 176
5012 176 -133 -68 242 -351 157 126 -418 412 -171 -250 480 -434 100 305 -514 363 -33 -321 443 -286 -23
5033b3K80n58M90j71j33K58k59J94j34L9J23l38M31k77j03N41o98L98J93p25Q34
5054C62l84l43Q44q16K50M72q38O53p5m91O78m19k6L74m27K11N2j64J45p9N2j03
5076g2Q9O6k58L38j90j68M94n00J56L39o66N09J1n18O90l80k14O41n98J54L81
5097C04o22L97O9m52M98j74k15L94k85kK19k09O0O2p4j7R6rj55K14q9j81M11l44
5121a04k3M31o10L58K14o78P03k56m20Q15o48P8N45q07N14O3n45O56l60j03M02
5142B25m00K20Rj38J58j68J98j74K3K55m91M58r9m14P45o06M0O14r30O39J03p90
5164e23R67n52k11Q10q53L80K50o59O20k29j94M11l76J80j2q5J76k48K85k12n2
5185a27L99n51L98P1n94P76m53j82P45q49L74L42q10P45j97m51P55n51K6M52n70
$$ plain form
5033 -23 257 -301 189 18 -115 143 -116 78 -56 -17 106 -232 199 -78 -181 360 -338 60 253 -472 362
5054 362 -22 -365 479 -337 -87 385 -453 200 125 -366 312 -107 -133 241 -186 25 77 -87 58 -21 31 -72
5076 -72 17 83 -175 163 -27 -195 299 -201 -45 294 -372 137 148 -370 320 -60 -274 367 -231 -77 304
5097 304 -318 79 148 -304 194 20 -195 199 -86 -88 131 -78 -18 44 -30 -47 49 40 -115 99 10 -171 240 -104
5121 -104 -127 304 -306 52 266 -412 291 35 -385 430 -218 -140 405 -402 112 175 -370 286 -74 -177 225
5142 225 -175 45 54 -84 74 -94 104 -70 -47 208 -283 175 76 -338 407 -199 -159 455 -475 164 267 -523
5164 -523 444 -108 -319 491 -362 18 268 -391 229 0 -194 217 -159 21 9 -76 100 -148 137 -75 -127
5185 -127 272 -279 119 190 -404 372 -81 -263 482 -367 7 349 -461 284 87 -364 391 -160 -134 318 -252
5206b52K88R4l13K81o1j09J01l3rn6J73j63l6K71l72K03J88m89M60q9l83O28m12
5229i0j05N66o42K52L28o53N25m5m78O42l36j57M86m75J25K49l89K64mj88J73
5250D8m8k2%O5n1j01K81k82L4L37n48L71J05n91P30l60k98P80p47K46M48q54O82
5273B25r2n18P81n22j5M57n84L55K0k70L34k48R6k5o0J96l16L01q7l27O84o30
5295b45J65M55q51O85q2n59Q98o77m0P30r29N55J36o75P50l42j91N11m76K00R7
5316A15l00L00k29J26j6n7K64m21L41j8l99O27m39r0N85p16M11J98p36P91l31
5337Fl06P15o51J40M14o22L91N5m01M37j69j31K36j39j5Q9k9p3N2N6j65J70%k48
5361a88L67k13j75M89l94MM05n72K20L39o87O65j88m10O66m19j22M89n49K35K37
$$ plain form
5206 -252 36 130 -183 98 37 -72 29 -4 -13 -69 104 -59 -95 176 -196 7 195 -294 166 77 -306 322 -90
5229 -90 -195 371 -271 -19 309 -344 181 136 -342 300 -36 -193 293 -182 -57 192 -197 67 63 -125 48
5250 48 0 -22 -22 43 -8 -109 172 -110 -76 261 -287 84 189 -402 328 -32 -330 450 -297 -51 397 -457 225
5273 225 133 -385 396 -126 -141 316 -268 87 107 -163 171 -77 19 -6 -66 130 -186 115 28 -299 385 -245
5295 -245 -80 375 -476 209 127 -432 466 -211 -251 479 -450 105 241 -434 316 -26 -217 294 -182 18 115
5316 115 -185 115 -114 12 -4 -61 203 -218 123 105 -294 333 -106 -196 389 -327 84 282 -454 337 6
5337 6 -300 415 -236 -96 318 -304 87 142 -259 178 9 -122 114 -25 -40 49 20 -53 -1 55 -110 60 60 -188
5361 -188 179 -34 -209 280 -114 -110 295 -277 -57 282 -405 260 72 -338 328 -91 -213 276 -273 -38 199
5382A99n10M34n8k37L25k26RJ51j22P2r7J30j15K2K15m17L37K6n00O96m07j73
5404b46O88p99L62L41q17P74k58m43Q29o54Q9M69o89M85l3l33M35k98O1R5j66
5425a08K05k21K12o9k10M67m84J85L28p14O72j80m74Q66p00P3N93q95O30L8o45
5446d31P94m62j32N56n67K53J25l47L28j47mO7r1J24j85K02m7k28M26l86O1L83
5468B92o00M25N2n49P05l42k08O53o92K10L47o18M71K9m39M66k16j36L59l02L2
5489f1J79k10P4P2q7nP5l1j05K06j29j10L32l11L6L26m88L02J15n12N66j94l35
5512b95O55n28K4N04o71L77J37n33N60k33k00M58l94J08J60k58K01p7kOo2J75
5534A12k65K26jl33N21l57q0N50p13M06J98p03P83l38l41P79p31K49L87p23N91
$$ plain form
5382 199 -311 123 65 -172 153 -73 -64 87 -35 37 -60 70 -45 -23 192 -225 112 138 -362 334 -73 -246
5404 -246 442 -357 5 346 -471 303 45 -398 431 -223 -134 335 -354 131 98 -235 200 -98 -37 58 -108
5425 -108 97 -124 88 19 -191 276 -208 -23 305 -409 263 83 -391 475 -225 -152 441 -454 176 214 -431
5446 -431 363 -99 -231 325 -242 11 136 -211 117 -30 -34 33 -58 66 -119 83 36 -192 234 -152 -91 292
5468 292 -308 117 169 -380 325 -17 -225 428 -264 -54 293 -325 146 175 -264 202 -14 -150 209 -93 -61
5489 -61 118 -92 -18 54 -33 -38 37 6 -99 107 -22 -132 200 -111 -75 251 -237 65 180 -332 234 40 -295
5512 -295 360 -168 -144 360 -311 66 203 -330 230 -3 -203 255 -139 -31 129 -129 72 -5 -7 -1 -63 112
5534 112 -153 73 72 -261 260 -97 -177 373 -340 66 264 -439 344 6 -335 444 -287 -38 349 -374 217
5555B17j42l35N35l90P5J75k74K39j47O8K5j63K98l36J80J75n09N50k50k72O74
5576C93o43J94M06p82O38p6m99P34n14k4M91n90L30J02l90L86j54p5J79j45O4
5597B5o0O8j5j02K45k89R7K14m23L77o0l54N52l69p9M96n74K52K32n52M85p9l53
5620b66N14l11r8L98l66R0J89l04J89M0j68J50k1q3O2M1o9j7J48j94M5K05l44
5643a70K45N2l92M82k23k18N51n27J05L99o30M47K3m94O24l45j24M77m74J92J43
5664A43l28L09j25n6J20j20J38j50J10K1k27L67k96nL87n61L73O7n27O87l83j94
5686b50O49p03L08K75o47N92j99k76N32m33J03K00l38K57q9k1J05j40J76j92J00
5707IJ09l28L95k26j44M97n45K44K39n98N75j70l44O27m96M0M02n49L39N2l59
$$ plain form
5555 217 75 -260 275 -115 -40 135 -139 100 -47 21 46 -117 181 -155 25 200 -309 241 -9 -281 393
5576 393 -250 -56 350 -432 206 130 -369 365 -149 -173 318 -272 58 160 -230 156 2 -73 106 -39 25
5597 25 -35 33 18 -84 161 -128 -31 183 -240 137 77 -277 275 -94 -173 323 -251 1 233 -319 166 87 -266
5620 -266 248 -63 -161 237 -129 -39 150 -154 35 75 -93 57 36 -47 15 56 -13 -30 118 -76 -31 174 -170
5643 -170 75 127 -265 217 -6 -224 327 -200 -95 304 -326 121 144 -350 274 -71 -195 282 -192 0 143
5664 143 -185 124 -1 -57 63 -57 81 -69 41 62 -165 202 -94 -99 288 -273 100 167 -360 327 -56 -250
5686 -250 399 -304 4 279 -368 224 25 -251 281 -152 -49 151 -187 70 -19 -40 65 -75 101 -91 9
5707 9 118 -210 185 -41 -185 312 -233 11 250 -348 227 57 -287 340 -156 -116 286 -263 76 128 -231
5728b31L95j75j09K53j99L7P2q0J0JO4j20P7M9k05K52n5j99L63k92lL37m40K30
5752C2J50m49M31j02k80M68l27n3L65m11J66J71l70K96l0k09K69j33p2J65r0m
5774a7K6nl8J5Q7j77J61Ok39L46j82j46M15m30J36K82n54M66l6l94N63l61q7M46
5798B83m91K65J06l67L51j55r3K30k11J22l8k8Q1j63K21k01M2K18m18L36rl62
5820b81N55l68n7M80o03L21J54n37N76k38k27M94m22J18K05l44K54o9r6J65j22
5841d2O7l5mP9j93K54j76n6K98l53J59J52m15M42j59k62M97m21R2L11n00L48L7
5864A20k98L98k21j01K51k32L3J75j93R5j5l7j2Q0J6r7R3q3l0J73j73mJ74k59
5888a47J58Q9k96L22r6k18L85k86l0L19l72J64J34l45L48j14j67L07k31k1K15
$$ plain form
5728 -231 164 -11 -120 133 -66 -29 43 -37 -27 -26 38 -82 -5 44 -161 91 36 -163 200 -92 -95 242 -198 32
5752 32 182 -267 164 62 -218 250 -77 -130 235 -176 -10 161 -209 87 57 -152 117 -16 -88 77 -13 -17
5774 -17 9 4 -34 -19 68 -109 52 58 -181 165 -17 -163 252 -178 -42 240 -314 152 116 -278 285 -76 -163 283
5798 283 -208 57 163 -204 147 -8 -101 129 -82 40 2 -26 55 -108 113 -88 -46 172 -246 90 81 -281
5820 -281 274 -94 -151 329 -274 47 201 -336 240 2 -225 269 -153 -35 170 -174 80 11 -85 80 -42
5841 -42 25 -10 -14 65 -128 126 -50 -106 192 -161 -2 150 -265 177 18 -244 253 -168 -76 235 -265 83 120
5864 120 -178 220 -1 -102 149 -83 -50 125 -68 27 12 -25 -37 43 59 -38 55 -28 -58 115 -58 -62 112 -147
5888 -147 11 100 -196 126 30 -188 197 -89 -119 200 -172 -8 126 -219 129 15 -152 155 -76 -97 118
5909A18j97R4P0r7Lk0L9l1N8J6j75K36j22j06L34l65J36J84m23L89q3l01M94l58
5933a07qL67m65K71O7l47L67j76p0K49k56J20K2r1J14j04J07q2j9J62k51K20j2
5956G8k67M08l00rL62m91K88P7m07M80k45j42M07m10J50J72l32K80q2j28K01j42
5978e2L6L7m2M9q2J14q5j7J55k29J57N2k47L07j59j38L49l28R8J98l55K63J2k51
6002a58L05j61r5K66k37O1J19j96J11J2j07J00nn6M3K5n8J4O9j06N4O7j68J42
6026D1L3j99K34r6j27K75k34J4K30l22J89Q7k97K96j01j64L02k27J9J75k27J26
6048B7K6j32J31p0J3OrL2q4J13p5n3J86k22J11J17l11L20j01k03L91l16L1K77
6072B05l97K74K7k85L42k07n6K42k46J28K3j32J37p8L0%m3R6j48J24j5j43K61
$$ plain form
5909 118 -79 15 85 -12 -9 -29 10 -21 37 53 -122 114 -8 -114 220 -145 -9 175 -248 141 58 -243 251 -107
5933 -107 -115 252 -213 58 125 -222 145 -31 -101 148 -108 12 34 -57 57 -47 60 -22 -41 121 -130 90 78
5956 78 -189 219 -81 -90 272 -219 69 146 -261 219 -26 -168 239 -171 -21 151 -181 99 17 -111 90 -52
5978 -52 -16 21 -21 28 -54 60 -25 -42 113 -116 41 93 -154 153 -6 -144 205 -123 -25 173 -182 81 93 -158
6002 -158 147 -14 -109 157 -80 -19 100 -96 15 27 -80 20 15 -41 2 27 -31 -17 52 -54 0 67 -101 41
6026 41 74 -125 109 13 -114 161 -73 -59 171 -151 38 125 -172 124 23 -141 161 -66 -47 128 -99 27
6048 27 53 -79 52 -18 -5 1 -8 24 -60 53 -22 -75 111 -111 0 117 -194 126 25 -178 213 -103 -72 205
6072 205 -192 82 109 -176 166 -41 -97 145 -101 27 50 -82 55 -23 7 7 -36 60 -88 36 21 -122 139
6095A39k08J2K11l27K36K8k82L51j99q5L14l36J43J23k72K48p5j23K08j40J8P9
6117F3r6N6j9OlqM8j16J03Kj30J88j28o1K17k16Q4J23k53J98k2j79K64j47n9K09
6143A24k09O5J05j78J21Rj19J41m8n3R8o5nL9j1k5L4No4N9Pj01J30o3q1J88j56
6170e3OJ47k21J38M4k16K43r1j15K48k12O1J23k10J56k7j06J55p7j2M2n1M0k7
6194a5L3j8l6R4j25O2Q9j93J80o2j22K52k28N2J63k82K20j7j97K68j72k5J84k06
6218a01J09K4j19J23n0j2N1n1M8o1O0%p6J37j24L1J10k01J61mj72K33j60k4J94
6243A26k26R8Q1k00J98o1j04J51j08PQ0r4M8J0l5K4jJ0l8M6j3m7Q9o7pJ04j29
6270e8N9O5j43J37l9q9J50j01l4J36j42N8O6j25R4or7J11m8m0Q3o2RM1n1RK6k7
$$ plain form
6095 139 -69 -57 154 -173 63 91 -191 160 -39 -124 190 -146 -3 120 -152 96 21 -102 106 -34 -16 63
6117 63 -33 23 4 10 7 -1 47 -69 34 36 -94 94 -34 -95 122 -94 -10 113 -140 58 36 -143 121 -26 -85 124
6143 124 -85 -20 85 -93 28 37 -82 59 11 -42 56 -9 -14 25 14 -11 23 28 -36 23 30 -71 59 -4 -85 103 -53
6170 -53 -47 100 -121 17 61 -155 88 -3 -118 130 -82 -21 102 -108 48 21 -85 70 -7 -19 23 -28 12 -15
6194 -15 18 0 -36 58 -67 -5 84 -109 71 9 -113 139 -89 -37 126 -156 64 47 -150 118 -54 -79 105 -101
6218 -101 8 32 -87 36 -14 -26 25 -26 22 -39 21 21 -55 82 -42 -11 99 -102 59 55 -117 116 -44 -68 126
6243 126 -100 -2 79 -121 77 16 -88 63 -45 -38 42 -52 -4 6 -29 -5 -6 4 -34 12 -1 -48 41 -26 -33 71 -58
6270 -58 1 66 -77 60 21 -68 82 -19 -53 83 -59 -1 65 -60 34 28 -69 42 -6 -46 37 -25 -16 25 -26 -17 9 -18
6298a8j0M2j4k9N5l7l4R6q2J4Q3j37Q9L3j36J67p6p0J60j43M1R8j68J17rj00J36
6325F8r3LO1p4M0lPj0k2M4n8L0M5j05J00l7o3J56j34J5J10j71J35%j24J70j18
6352b8j3J20j36P7K7j00R5l8k7N0l8K7j8KJ1l2O2n9OM9j00Q0Kr5J34q7k4J21j43
6381g5Q0M4j28J20k3o8J09p8J2N2p0M3jl6L5nj3mJ4qj1L8m5NM5o4M5J5p3O2j0
6412Gn3Q9o3rP9r6L8M3r4O6J0o5Q9m6l5Q6n3rM9n2L0J0k4J9mj1nK2j5j0L3l2n
6445a1M6p1L7J9p4R8m3o0J12j01K8N8q7N9rm7J11q7k6O5l7J3Lj8J9KJ1k6rN2o4
6476c7M1rk1N2n2J9N1j01K3O3j00J19m2p0L3k4N9N7p3K4mK2o3J0O8m5P1q5n1R7
6506C2j7k7L0l3J9k0J5L3k8l0O7p3L4N4q4N3on1N1k7oN1n3QJ1Lk9K6Mm0M8n0l
$$ plain form
6298 -18 -28 14 0 -29 26 -11 -45 51 -31 -17 66 -71 18 51 -85 82 6 -64 96 -47 -6 92 -76 41 32 -68 68
6325 68 -25 -22 39 -35 5 2 9 -1 -23 21 -37 -7 38 -67 33 -4 -67 89 -45 -30 80 -91 44 44 -80 90 -28
6352 -28 -41 79 -57 20 47 -53 42 4 -23 27 -11 16 -2 0 11 -21 41 -18 -12 37 -63 17 19 -76 58 -29 -53 68 -75
6381 -75 5 49 -79 41 18 -50 59 -19 -7 45 -25 18 17 -19 16 11 -2 -6 8 0 -11 27 -18 -13 32 -32 13 28 -45 17 7
6412 7 -46 43 -20 -29 50 -46 -8 35 -59 7 17 -48 41 -5 -40 46 -7 -16 33 -19 11 21 -3 16 12 1 -4 18 3 -7 26 -6 -11
6445 -11 35 -36 1 20 -54 44 1 -59 53 -48 -20 38 -49 10 1 -46 65 -22 -48 17 -20 -7 -4 -22 -3 -1 10 -16 -25 27 -37
6476 -37 4 -5 -26 26 -26 -7 44 -57 -34 29 -71 48 6 -64 -31 -55 4 61 -12 12 8 30 -33 -23 45 0 71 -14 -65 32
6506 32 15 -12 18 -15 4 -16 -1 32 4 -26 41 -32 2 56 -28 25 19 -32 19 -8 -14 37 -16 -8 3 6 -23 3 7 -33 15 -35 -38
6539c8M7k5O2n8pKM8l5PJ6o8P4k7j9M4k9j6M3o2P0l0l1O2j5k1M1o5L9L0m6JJ4
6571Hk5M8j4k2m9K6J2Nm4J6NkK1Nj2j4k1O7N9Qp0l8N3j2J5qo0M8Km9P4l0J2N0
6605F4j04K1L0Jl5l1P9k8LJ0j6J8J3p2O7l9N4J3o6N3l8k8P0j7o8J09k9pL6r1M8
6636B0j8J1j7l9O0MrK9o7JL9l6l0J1R9n6m3P3p9J6L1m4J6O0j17N8J7l1P5l4nM5
6668D0n3N1j5Oj4Mm9L5Kn1M0J6k0%j7K0J9%k7K4k6J5k4J7k4K3L8p9P9o4K7J9m0
6701b8M9k8PJ2K6k2J0n5K2M1j05J43r2P5n2n4L3n5O1k0K7O9j77Q7K9j6j7Pl2R5
6731D0n5k4R4j02M8J8q3Q0k1k6N4m6MK8m8M6j9%J6J4j8pJ7jl5Q9o6j7P5r9O5j4
6763Gp5J25m7n6R7r0M0K4m7L4M0o8K5mj3K9m0J4n%J3LJ6k8K0j1k8N7n1J0N9m3
$$ plain form
6539 -38 9 -16 46 -12 -19 -17 31 -4 3 19 -49 25 -2 -21 23 -6 -22 21 -41 29 -1 -32 30 15 -6 35 -30 9 39 -7 -6 8
6571 8 -17 31 17 -5 -54 -28 -16 -11 -55 -39 -34 -36 -15 -10 -22 -36 -57 10 69 77 7 -31 22 10 25 17 -43 5 7 -42 32 2 14 64
6605 64 -40 -19 11 12 -23 -54 25 -3 0 10 -6 12 25 -47 20 -19 35 48 -18 35 -3 -31 39 22 -46 63 34 27 63 -28 20
6636 20 2 13 -4 -43 17 21 12 41 -26 -25 14 -22 -52 -41 58 2 -41 32 -47 -31 0 -44 -28 32 -85 -27 -10 -41 34 0 -5 40
6668 40 -13 38 23 29 15 19 -30 5 7 -44 -4 12 -8 -8 -25 -5 14 14 -13 11 -15 0 -24 -7 -31 -8 30 -49 30 -34 -7 12 -28
6701 -28 21 -7 0 12 38 16 26 -29 -7 34 -71 72 -20 55 3 -51 -18 -73 -12 -32 -5 64 -113 -26 3 -13 -30 -23 -55 40
6731 40 -15 -39 55 -47 1 19 -64 16 -5 -31 23 -23 -19 9 -39 7 -12 -12 4 18 0 -7 10 9 -26 63 -3 -20 55 -44 21 7
6763 7 -68 57 10 -46 51 -39 1 25 -22 12 52 -16 9 5 -8 21 -19 -5 -10 -10 3 6 22 -6 14 3 -25 32 -19 -9 50 7
6795Gk7P4n9J5J8m6N2n6KK4kJ1Ok5k7O2o9J8N1p1P2j2m5L6l4PM2k8Jnjj0J9M5
6829D5p9O9k7j7O1p3M8pr1J12J3q3P8m9m1R0n0JL2o3O6l1l3K9j8RPKjj5L7l1K
6862hM5o9N3%o3R1n9j1Q4j07N7L2j00Q9l5l6Q4o6J0M3o6M1Kj2J0k1QkJNk1L1k2
6895a2qO3q0M7J7p6Q2l5l7Q3p1PP1r7O5On7N8k3k6N0l3JK8l0%RpkK6k6lK7k0l3
6930c6P6q2oK7m6O5J5n3N0nn9R1n0nN4p4L0L9p1N9km8O0k7k2N5l9MJ8l0K1%j2
6963cqJ4Ol6N4l0l0O9p3K2N1j01R3j5p7J24q2j3J03j27O8K4q4Q8m0k7O3n2L3l
6993A1j1J4j0J1k5J2L3o9N4%p2J12r2PQ7j19P1K2j14J24n5m0J10j06K9N9q7O6
7021B2j2l1N5l1qJ4lmj1K6k5LM6p3M7K4p7R1m5l8J01j12M3N9j20R4pp8R2n2l0
$$ plain form
6795 7 -20 54 -5 10 28 -18 34 -22 -20 4 2 13 19 -6 -33 29 -40 -22 29 -42 30 18 -27 9 -25 -18 24 -4 -3 -8 -9 -19 0 45
6829 45 -34 35 8 -9 52 -21 27 20 -71 41 54 -29 49 0 -41 49 -1 0 32 -31 35 4 -29 0 -18 -9 -2 0 -1 -16 21 -10 -8
6862 -8 37 -32 21 21 -42 49 -10 -21 63 -44 13 45 -55 34 -1 -37 47 -19 -9 34 -32 9 11 -1 9 -12 -4 -6 -5 0 -21 10 -12
6895 -12 -20 43 -37 10 27 -49 33 -2 -39 44 -27 -20 51 -46 19 25 -32 26 3 -23 27 -6 -5 23 -7 -7 2 -5 -7 19 -7 -10 17 -3 -36
6930 -36 40 -42 -48 -21 -67 -2 13 -40 10 5 -54 37 -13 -18 36 -38 -8 31 -40 19 17 -31 29 2 -20 35 -4 0 18 -12 9 9 -3
6963 -3 -11 3 9 -27 27 -3 -33 36 -37 -15 36 -65 28 13 -64 60 -22 -35 68 -59 9 33 -51 37 -3 -30 33 -19 14 11
6993 11 0 14 4 15 -10 2 35 -34 20 20 -52 60 -32 -25 62 -57 14 36 -78 46 -9 -49 61 -45 -16 43 -44 22
7021 22 10 -21 34 3 -5 9 6 2 -9 17 -8 -5 41 -32 15 39 -38 53 8 -30 71 -41 2 61 -59 35 28 -50 42 -10 -40
7052d0Q2p9J4N2n3K6Ml2K4Mj8K2LpnJ8j9J0K4n6O0Kp7R3m3m5J00r1J3P7j23O3
7084CM1j10J13l1p0J05p6PO7q8N0jl6M1k4Oj0J6j4j3N9l9k2Q2j04O0L6j07J38
7113G9n2q4J24j06L0R3j36Q3nj07J67r4l6R6r5P0j2l9L5nnj1k0P2j2n3j1m4J47
7142F9j18M3Q9j42J13Lo8J41j71j8J89k00Q1L6j03J13m3m2Q4p0J4K0l7J6mMj9
7169b0J2J9m8O1j8o2J02p4j0R6j24O3L8j05J09j6r1J24q0j0J00j07M2M1r6P6L
7196B5n0N7j7l1M5l5%K5j7j8K6Lm7M1Ln6Q8o3k7J01r2J2Q0j35J10Nj20J54p8l7
7226d8J30j36N4N8j18J11l7o0Q5n9J3K6k5K0j9L0k8kM1p3N8J1r4J34q7l4J29j51
7254g1O6P1j82J67l7j01J68j37K1J03j38R5%o5R2o2J7Lj9L8m6N8l7k6P9r0L7L9
$$ plain form
7052 -40 42 -37 -23 29 -24 2 6 -26 -2 2 -16 6 9 2 -3 15 -4 6 30 -26 34 36 -41 52 9 -36 64 -27 -14 63 -60 3
7084 3 44 -66 47 16 -54 51 -25 -18 49 -39 11 10 -26 15 -9 -3 -13 3 -11 -24 35 -4 -26 56 -48 12 48 -59 79
7113 79 27 -57 67 -39 -9 84 -52 31 26 -81 86 -8 -44 52 -43 27 15 -24 11 6 1 -10 -30 42 30 -23 -34 -78 69
7142 69 -49 -6 83 -59 54 57 -11 130 -41 -59 130 -70 11 47 -56 57 14 -28 56 -14 0 20 -17 -1 -5 -1 -20
7169 -20 -8 11 -37 24 6 -56 46 -28 -38 58 -66 -3 35 -70 39 23 -68 56 -24 -34 66 -41 1 42 -54 22 25
7196 25 -25 32 15 -16 29 -6 -6 19 2 -16 10 13 -34 7 10 -46 42 -21 -48 53 -39 -27 53 -82 28 33 -87 67 -11 -48
7226 -48 82 -54 0 58 -60 51 14 -46 39 -20 -7 19 -6 14 -5 25 -3 -5 36 -37 21 32 -62 72 -15 -49 80 -71
7254 -71 -5 66 -116 51 14 -87 81 -56 -35 68 -70 25 25 -40 52 -10 7 10 -9 29 -17 41 4 -22 57 -33 4 43
7282D3j14J23m6q8J78j41J2J18j71J07L1j38J52p8l7J13j08L2M6q1N5ok7J7J8
7307A0pj5L6j9k6O3o4J9N9j09Q2J5r5J11o0n8J29r8MR2j38P2L2j18J32m7n1Q9
7335D0o1j5R0q7K9J9m2K4LrmK5rk3N8m7j7R4j20N4N3j27J22l1r2J70j28MJ21j66
7365g2R5L1j34J41o9m6J06r7M5J2n0N5l4K1j0k1N9p9O5Nq7J38r5KJ16j67R1N0
7393G1j65J86r7p0J87j69N3Q0j49J16j7q0J19q5J5K4m7M1l0K6k0j6O0q3N4K7j02
7420g1J22n3p7J67j45M9O8j42J18%r4J41j03k1J31j44O0L9r8Q5j8m7O1l5lJ0J8
7447A8k5KJ6l2K1K9o6P4l1o2J05o0l3J21j37M2Q2j56J20K7j47J56o7m6J25j04
7473b8L6M9r0P1j2n8O0k4pK6mnl3L7k9OM1q2M5K8j14J48p0p7J86j70M4J13j89
$$ plain form
7282 43 -71 52 6 -82 96 -45 -33 85 -86 21 52 -86 66 -12 -49 64 -44 -12 34 -47 8 2 -25 -8 10
7307 10 3 -12 24 5 -21 42 -22 -3 56 -53 29 44 -51 60 0 -58 71 -27 -23 69 -69 3 35 -83 49 2 -49 40
7335 40 -21 -36 54 -33 -4 15 -27 -3 0 -9 -13 12 3 -20 38 -9 -26 68 -52 2 55 -72 50 19 -73 97 -31 -27 94 -72
7365 -72 23 54 -80 61 -8 -54 52 -45 0 12 -38 17 -17 4 -6 -27 32 -47 18 23 -64 74 -21 -19 97 -70 21 71
7393 71 -94 92 -5 -75 112 -57 -4 76 -73 43 26 -54 65 -20 -5 19 -28 13 -17 9 -11 -27 33 -50 4 31 -71
7420 -71 51 -2 -79 88 -57 -8 60 -82 36 36 -58 83 -20 -41 90 -54 6 45 -53 32 14 -33 28 -7 -10 0 18
7447 18 -7 -5 11 -21 0 29 -37 37 6 -56 49 -11 -44 77 -60 -18 64 -92 28 55 -92 64 -3 -49 76 -28
7473 -28 8 57 -33 38 26 -32 28 4 -3 23 19 14 -19 18 -11 -5 36 -46 -1 27 -87 61 -9 -86 100 -70 -26 87 -102
7502a02J61l1j33K00j14k1J14j40R7Rr0Q2l6J1K2m1N5o8N7j2o5J17j03J6R5j80
7528a00J44j4j33K06j37l5J59j81J11L4j56J68o1o9J37j13M0M4q0O0k0KQj6K7
7553B5l6L4Op4J12r0j4J11j44Q6M6j48J45n5o9J57j26J4R0j45P9L6j17J18m0m7
7579d6O9n4QP1o6K0J7j5pK4pm1O0l0l6R6o9LN9j12P3N1j40J25k3j07J62j20oJ37
7609I6j49N2M1j18J40o2m5J17j04J3M3l9J1MJNl8O9q3M4L0q9J24q2k6J55j73P3
7637A0P2j76J77n1r9J59j39K9J06j75J21nr2J20p3j6Q3r9O7l6RK2j0P6j17M5O6
7664G4j63J58o0r6J81j77P0J51k66J59K0j17J65j21QJ15j08j5P9j35J42o4l0K5
7688ej1J5j9JL0l8O5j11O0O8p6N4J9j06J26n0p7J48j45N3O4j57J18K7j15J36q2
$$ plain form
7502 -102 59 28 -105 95 -19 -40 74 -66 31 40 -50 32 -4 7 29 -12 43 -25 32 20 -45 72 -31 -15 80 -100
7528 -100 44 30 -103 103 -34 -69 90 -91 20 54 -102 66 5 -64 73 -40 0 44 -36 24 4 6 14 -2 25
7553 25 -11 23 29 -45 67 -23 -37 74 -70 16 62 -86 59 4 -65 92 -34 -20 70 -75 4 40 -77 41 1 -46
7579 -46 23 -31 -23 48 -18 2 19 4 -3 21 14 -27 33 3 -33 63 -6 -3 56 -56 17 68 -72 53 30 -77 85 -35 -41 96
7609 96 -53 -1 40 -78 62 0 -45 72 -32 -19 24 -15 -4 0 1 6 -32 37 -46 -2 28 -61 63 -19 -45 110 -63 10
7637 10 82 -94 83 32 -67 92 -47 -18 88 -87 34 29 -63 57 -16 -32 51 -48 19 -17 -8 14 4 80 -37 8 74
7664 74 -89 69 9 -87 94 -83 -13 138 -128 31 51 -66 99 -22 -14 101 -7 -22 57 -78 64 0 -30 -5
7688 -5 -16 -1 -20 -19 11 -27 38 -73 -13 55 -21 33 52 -54 72 22 -55 93 -52 1 65 -92 26 53 -62 74 -8
7715hn5J57j23L4P3j29N9J6k5J1kj5K8qk9pR0j06jM3l6pN4o0J25l8j06J50j37
7744e2N2R1j92J47Rj29J72q0o5J36j27M3L3r7J11k1m1J6rL6k8rL6k0J02j59J5
7771c0J14j82J16M7j74J94r5o8J93j99P4J05k11J84l9j11J72j18J2P2r7P7j7k5
7795fL1k8M6o3L1K5j01J26n3o7J47j46N3Q8j92J62j8j27K03j35l5J61j86R9N3
7820F8j45J31m7m9R1o5J0K9l2J2NJ7m2L2K8p7Q0j5p2J28j00j7J28j45N9N8j58
7847h8J34k1j04J67j12l3J44j43N8O7j42J08j6p6J12n0k0M9k8OjNk1KL7o4M5K6
7875D1j00J31o5o4J74j75N4J09k22J92kj55J91j01m3J05j43P7M4j22J39o4m7Q4
7899C8q2N3JJ6qj8M7j01N4N9j25J30j0j47K09j36n8K05k14R8Q5k17K13q1r1J83
$$ plain form
7715 -8 -63 94 -29 5 78 -51 8 24 -1 10 8 -7 21 13 -16 -23 67 -39 -40 3 -33 -40 14 -46 79 41 -65 85 -52
7744 -52 0 91 -101 46 55 -74 98 18 -47 89 -38 5 38 -59 52 31 -10 6 -3 33 5 -4 32 12 114 -45 -30
7771 -30 84 -98 18 65 -109 85 -10 -78 115 -84 -10 95 -116 68 29 -82 90 -28 -16 56 -41 36 19 -6
7795 -6 25 -3 43 -20 11 36 -65 61 8 -59 88 -58 -5 83 -109 53 35 -92 111 -24 -59 102 -84 15 68
7820 68 -77 54 7 -42 49 -16 -6 23 -9 3 8 25 -17 15 43 -34 46 31 -41 87 -13 -30 98 -47 12 70 -88
7847 -88 46 25 -79 88 -24 -57 87 -56 2 69 -73 35 19 -57 55 5 -15 34 6 12 11 16 -5 -3 34 -30 15 41
7875 41 -59 72 7 -57 117 -58 -4 105 -117 75 73 -82 109 8 -35 70 -73 4 48 -74 65 1 -46 38
7899 38 -44 9 10 26 18 0 47 -54 0 59 -66 64 54 -93 116 -20 -78 127 -87 11 96 -121 92 11 -80 103
7925A03j74N3Q7j45J07j6n9Q4n9K6rKJ5n4Q7o2k6J24j52Q3O0j64J80o6q3J76j74
7952e6L7J20j87J34J2j46J65o8n9J21q3JM8q0M3J6l5J3MNk4M2j9l2Q0o4j0P1j20
7981g1Q6M0j48J50l9r4J81j51J1J34j68J00L9j51J54n1p4J43j01lP6q9N0jm4L9
8007A8l0K2l3K7J3p3J07o8l9J46j55P0P2j94J89m5j31K25j73J8J43k14J43J7j46
8032i1J74r8j9J04j04N4j0k1L6l8M7l5j0O7j20J01qj10J86j61J7J39k19J53K5
8057E9j80K29j26n9K05k09Q4P5j55J41n5n5R8o0J8K1m3L2l1M4m0oQ0j26P7K7j13
8084f8J48p5o3J65j73N7J03k00J57j7j27J78j04m3J43j39M7P1j12O7lm4O9l1o
8109@L4j7nkL4m6mO2q0N4J0j03J29n9p2J63j30KJ32k01J38K1j71J92r1n9J67j56
$$ plain form
7925 103 -71 -18 69 -76 31 15 -44 40 -19 7 -2 0 15 -39 48 -14 -40 84 -68 15 75 -89 91 25 -58 118 -56
7952 -56 -19 101 -86 48 60 -86 79 11 -48 73 -10 -9 39 -41 2 18 -17 -4 0 5 -19 23 4 -28 52 -12 -22 49 -71
7981 -71 15 55 -93 57 18 -76 105 -46 -35 99 -69 31 70 -81 73 22 -52 91 -10 -13 63 -26 24 23 -21 18
8007 18 -12 10 -23 4 17 -56 51 -17 -56 90 -65 5 77 -117 72 27 -104 121 -52 -34 109 -105 38 55 -91
8032 -91 83 -15 -34 70 -34 20 10 -11 25 -13 34 -1 -11 56 -64 37 29 -81 105 -56 -39 100 -119 34 59
8057 59 -121 108 -18 -77 128 -81 3 78 -77 64 9 -46 52 -8 10 31 -12 20 -11 33 -7 -13 67 -59 18 45 -68
8084 -68 80 5 -58 107 -66 -9 94 -106 51 34 -93 85 -19 -62 81 -58 -11 60 -52 15 12 -32 37 6 0
8109 0 34 17 12 10 44 -2 -6 56 -24 30 40 -63 66 7 -65 98 -32 -30 102 -99 39 60 -111 81 -10 -69 98 -58
8137e8M2P9j34J00k2n2Q7o1K1J6j9M1o8O9l2k1R6j32N7N9j57J79p4r7K11j98N5
8164a3J40k39J80k4j51J99j33NJ17j45Q0K6r0R5o0K2mk5N0o6P7k7p1J45j34L6
8190a0J02
$$ plain form
8137 -58 -16 63 -71 29 7 -45 42 -19 2 18 -1 40 -28 41 9 -12 84 -48 9 68 -89 90 16 -81 130 -68 -13
8164 -13 127 -112 68 44 -107 92 -41 -36 81 -64 16 42 -48 47 -13 9 5 -20 30 -36 41 14 -57 88 -46 -10
8190 -10 92
8191I2
$$ Imaginary data points
##PAGE= N=2
##DATA TABLE= (X++(I..I)), XYDATA
0@%%%%%%%%%%%%%qJ6j6J6j6K4l2L2m0M8n6O4p2Q8j01J14j30J47j66J88k12K38
35A26k67K98l32L72m15M59n09N63o22O87p57Q34r18J010j112J224j347J486j640
54h60J813k011K235k495K803l169L615m167M868n795P074q940J1895j7203K9214
69A8877r3890J1856K24077k96211J74114K2682j92712K36820j17150m5299J45982
80H9146j66815R1810J6511o8310Q3763q0470M3379j0685k3184Q5669j12944P1496
92A9366P411j12440J72465j07184l0041J55705k09198J21266N6439j82717J98565
103H9637r4240q3312J90265j59330M3481R7805j71568J15066l303q2669J15381
114E7213o6259j5710M8388m3825K3548Q439r417o981q985L1292l7659L0353J9836
$$ plain form
0 0 0 0 0 0 0 0 0 0 0 0 0 0 0 -8 8 -8 8 -8 16 -16 16 -24 24 -32 32 -40 48 -53 61 -69 78 -88 100 -112 126
35 126 -141 157 -175 197 -218 241 -268 295 -327 360 -397 437 -481 529 -583 641 -706 780 -860
54 -860 953 -1058 1177 -1318 1485 -1684 1931 -2236 2632 -3163 3911 -5029 6866 -10337 18877
69 18877 -75013 -63157 160920 -135291 38823 61505 -131207 105613 -11537 -56836 89146
80 89146 -77669 14141 30652 -37658 46105 -34365 9014 -1671 -24855 60814 -52130 19366
92 19366 26777 -85663 86802 -20382 -50423 105282 -103916 17350 73789 -108928 89637
103 89637 -4603 -87915 102350 -56980 -13499 84306 -87262 27804 24501 -58168 57213
114 57213 -9046 -24756 23632 -20193 3355 11794 2377 -4604 -13589 17703 -19956 10397 30233
127C0233q0221P8885k6164m7822J10617q9866o870R2322j23226P2625M7540j32178
139g4125J19711l8091p5221J41045r5284o782R1625j21899O2916L8808r2672Q7299
151C7330l6732l7132O7551m5350J7939R420k5102J4551j6215L0773j9110q484
163a0561M3195p7407N7192J8321q6847J15847p5220l5225J26813j34100O3831
174E839N8357j51864J36005l8090p6422J50601j23208J7790P6673j19652R4074
185C0103r981n8943P6087o1983K0381K2971l6096M3068m8667K8251L857m1532
197c2484Q2199p7024J5586N7052j11221J05536j8477q3647J33743j10802J0566
208b8973J03704j42387R6249K250j03454J29490o9596j5560Q4214r8785M5806
$$ plain form
127 30233 -49988 28897 2733 -45089 65528 -24338 -31208 61114 -62112 10513 58053 -74125
139 -74125 45586 7495 -67726 73319 -21965 -28747 62878 -59021 3895 42703 -49969 37330
151 37330 598 -36534 31017 -14333 3606 13026 -12076 2475 -13740 17033 -2077 -10561
163 -10561 32634 -44773 12419 30740 -56107 59740 -15480 -50705 76108 -57992 5839
174 5839 64196 -87668 48337 10247 -66175 84426 -38782 -20992 55681 -63971 30103
185 30103 20122 -38821 37266 -24717 -4336 18635 -17461 25607 -23060 5191 9048 -32484
197 -32484 49715 -27309 -11723 45329 -65892 39644 21167 -62480 71263 -39539 -28973
208 -28973 74731 -67656 28593 30843 -72611 56879 -12717 -28277 55937 -42848 2958
219B958J7745n1450N9024l4477J18J1708k0715L4205l2607K3869j543m3452O7894
232C3277m7520M05O0987r4516N7834J6314p9513J01726n2422l6456R0924q7783
244c6743L1523N0983r0297O2369m645n3174P3608l5434j5756M2138m2930J2934
256e424K1287k3146J0328l95q554R00J0729J417j7825K1293j4221j5260M5473
269B6602l6573N80L8799o3143L7961K3432o5653O7649k4853m6613Q4473o0360
281a7699K272O1030q6377M5567J9967o4327P1522k9706k9794N5670m7362J8032
293a205K1008l5685K4240j4125K827Q740j1385K1679l2836J8074J1684m1420O0389
306C1985l7278k0985O7361p8918M2610L3436q9352Q5808l3870m4175R7994q2001
$$ plain form
219 2958 20703 -30747 28277 -6200 -6082 5626 -15089 19116 -13491 10378 8835 -34617 33277
232 33277 -14243 -13838 47149 -47367 10467 26781 -52732 48994 -3428 -39884 51040 -36743
244 -36743 -5220 45763 -44534 17835 13190 -39984 33624 -1810 -17566 24572 -18358 -5424
256 -5424 15863 -7283 3045 2650 -5904 -5004 5725 7142 -10683 10610 -3611 -18871 26602
269 26602 -9971 -9391 29408 -33735 4226 27658 -37995 29654 4801 -41812 42661 -17699
281 -17699 -15427 45603 -40774 4793 24760 -39567 31955 2249 -27545 28125 -19237 -1205
293 -1205 19803 -15882 8358 -5767 -2940 5800 -5585 16094 -16742 1332 13016 -28404 31985
306 31985 -5293 -26278 41083 -37835 4775 38211 -51141 34667 797 -43378 54616 -27385
318b7385J8791M8640q8691O9389p913m3018O4556n1371Q309K5732l4924L4305
330A6420k0988J614R475k5428M1419l3120O766K8333o2298N9032j2854m1059P7849
343D5161p0881J0538N6185q4992O6465l022o4241Q1964n0489n964N9432o8280
355b8124L1653J1702m2360M5999j8005r204J8650k1008J3614m077M831J456j7904
368a2777K5238k2765N826K8022m6510L2111P80m0404N8977l1720j6099N1197n7671
381b5795K1963L1557n6415M4334n945l9620N2563k5565j0606L7639l9018Q765
393f143K0525k7609J9722J187j8706J3575k134k693N345O13o382l878J4064j1868
407d382K377J7374l1737J7434J1624l4917M1559j5135k8996N1422m1848N071M2784
$$ plain form
318 -27385 -8594 40046 -48645 20744 12831 -30187 34369 -17002 -8693 17039 -17885 16420
330 16420 -4568 -2954 6521 -18907 22512 -10608 -3842 24491 -37807 21225 8371 -32688 45161
343 45161 -25720 -15182 41003 -43989 22476 19454 -44787 37177 -13312 -19276 40156 -28124
355 -28124 3529 15231 -27129 18870 865 -8339 10311 -10697 2917 -1160 3671 5127 -12777
368 -12777 12461 -10304 -4478 23544 -22966 9145 9925 -30479 28498 -3222 -19321 31876 -25795
381 -25795 -3832 27725 -28690 15644 9699 -29921 22642 -2923 -13529 24110 -14908 -6143
393 -6143 14382 -13227 6495 7682 -11024 2551 417 -2276 3069 3682 -2700 -6578 7486 -4382
407 -4382 -2005 15369 -16368 1066 12690 -22227 19332 4197 -24799 26623 -15225 -10154 32630
420C2630o0709L5025Q847m8698N8765k5571j9484M5633m6216J7278K0162l4561
432a6899K8907j3099q553J7766j4656J4966j1689J271Q803k3904L3645j8087j1524
445a3053L8134n0260K7867J9175n3519N8179k8040k6829O3819n7772K0324L0953
457B8978o3609N0749j0231k9686N2091l9794M576K1880l2594K7467p500p475J2214
470G066j7944J8500j1661L195J4520l3245L1143j0702j8809M6368m4821J0833
482e557K8597n4080M8086o145l8096N4807m0523n03M1028m8268K6525O319l4601
495b2411L5712j2797q636K0671j9803M979M969m257M732m672M988r549M711J0150
509H787j8431J7477m989j8648L0304j8829l480K7302l5423J4321J6130l3573L1333
$$ plain form
420 32630 -28079 6946 15793 -32905 25860 289 -19195 26438 -19778 -2500 17662 -16899
432 -16899 12008 -1091 -9644 8122 -6534 8432 -3257 -1986 6817 -17087 16558 -1529 -13053
445 -13053 25081 -25179 2688 21863 -31656 26523 -1517 -28346 35473 -22299 -1975 28978
457 28978 -34631 16118 5887 -23799 28292 -11502 -6926 14954 -17640 9827 2327 -5148 7066
470 7066 -10878 7622 -4039 -844 13676 -19569 11574 872 -17937 28431 -16390 -5557
482 -5557 23040 -31040 17046 10901 -27195 27612 -12911 -13414 27614 -20654 5871 12190 -22411
495 -22411 13301 504 -8132 12539 -7264 -2285 2684 -1573 3159 -1513 3475 -6074 -1363 8787
509 8787 -9644 7833 2844 -15804 14500 -4329 -7809 19493 -15930 -1609 14521 -19052 12281
522A2281n094k6871L5397k0288o344L1192l1459P688J5811k7778K1922J438j9087
535a1192J8904r857m430J4083q676R12Q40j986k14Q95P858j2818O047N334j9220
550a3520K4146p297j6942L1042k8677L720K8578m0066K6621L252l5504M3232k0701
563b116j0880L5537l8583J4250J4985k9643K8456j0540j1392J9042j6659J0359
575B816J62o011P963j4101J5420o577o095K1872l0097J6204R890l1948L9583k0407
589a326j5778M0584m1831J8369K0143m4085L7776j1671k1000M0229l0480N275
601c795J7174k9055K1877l149r100J4129j3843O682j535j116R013j5027J3462
614E717o635q903K4824k4162Q661J3072l1855K9709n829j9861L4286k8043M65
$$ plain form
522 12281 7187 -19684 15713 -4575 -10919 20273 -11186 -3498 12313 -15465 6457 7895 -11192
535 -11192 7712 -2145 -6575 7508 -1168 -256 584 -1402 -1616 -721 7137 -5681 366 5700 -13520
550 -13520 10626 3329 -13613 17429 -11248 -7528 21050 -19016 7605 10857 -24647 18585 -2116
563 -2116 -12996 22541 -16042 -1792 13193 -16450 12006 1466 -9926 9116 -7543 2816
575 2816 2978 -3033 4930 -9171 6249 -328 -6423 15449 -14648 1556 11446 -20502 19081 -1326
589 -1326 -17104 23480 -18351 18 20161 -23924 13852 2181 -18819 21410 -9070 -3795
601 -3795 13379 -15676 6201 3052 -6048 8081 -5762 920 -615 -1731 7282 -7745 5717
614 5717 -918 -9821 15003 -9159 -498 12574 -19281 10428 4599 -15262 19024 -9019 -8554
627h554K5607l2209K0520M441k5920K5718j0231p441J9727j6213J609P606r654
640d994O452J434l548q03J169J211m202Q272m270o953J2543j0439J067J3663j8523
655g921P908P162j9379J9651k608j6163K2225j4945m330K2317k1770O699J1300
668A0146k3570J8320O08j5297J9407j2074m298J4512j2155N195L399q674N218
681G37j564K131j263m2L039j0352J1795k667r108J8864j8618K092J7595k6102
695a3463K0070J218k4690L0452j7407n408K6862k9904J2703Q787k3788K4503q628
708A307r102J7169j6611P367M198q410Q927q905N049o30m269J2495j5380P844
722A049M489j8018K3810j2225q200K4086k7943J3098J2233k8028K6762j0073j4437
$$ plain form
627 -8554 17053 -15156 5364 9805 -16115 9603 -628 -8069 11658 -4555 -2946 4660 -4994
640 -4994 1458 2892 -656 -1459 -290 921 -3281 4991 721 -6232 6311 -4128 -3061 10602 -7921
655 -7921 -13 7149 -12230 7421 4813 -11350 10875 -4070 -8400 13917 -7853 -1154 10146
668 10146 -13424 4896 5504 -9793 9614 -2460 -6758 7754 -4401 794 4193 -4481 737
681 737 -827 1304 41 -1 3038 -7314 4481 1814 -7294 11570 -7048 -4956 12639 -13463
695 -13463 6607 7825 -16865 13587 -3820 -9228 17634 -12270 433 9220 -14568 9935 1307
708 1307 -7795 9374 -7237 130 4328 -4082 4845 -4060 989 359 -3910 8585 -6795 1049
722 1049 5538 -12480 11330 -895 -9095 14991 -12952 146 12379 -15649 11113 1040 -13397
735a3397K7990k1937N096J3582k3201J5977j594r162J4202j0291J653K432m165
748b815O109n503M967l189m641J1814j1914O088O196j7840J6769m947r784K0750
762A2060j7452J042J4136k0167J3782L431j6854J6810p366o490J5614j1359N47
775b266P596j0592N254L787o459L912k14l711K632K157k593j74K932n253J926
790a066N559p971M446K578j0662J0701q77r212J4005r859l783J5055j4805N599
804b92Q384j7906J3395k23j1623J6897j0394l441J2180j2647O500L891r543P315
818B493l245j069M094l023K572m330L110N03n110J0441r447K9J0082j5846J2739
833C993J313j5641J9620j2455l683J9039k0786R746N923j8612J8738o511o769
$$ plain form
735 -13397 14593 -7344 -2248 11334 -11867 4110 2516 -6646 7556 -2735 -1082 1350 -2815
748 -2815 3294 -2209 2758 -431 -5072 6742 -5172 916 7112 -10728 6041 1094 -8690 12060
762 12060 -5392 -4350 9786 -10381 3401 6832 -10022 6788 -578 -7068 8546 -2813 -2266
775 -2266 5330 -5262 -8 3779 -2680 1232 1018 -2693 -61 2096 -497 -671 2261 -2992 -1066
790 -1066 4493 -3478 968 3546 -7116 3585 2708 -6504 7501 -2358 -6141 8914 -5891 -292
804 -292 8092 -9814 3581 3358 -8265 8632 -1762 -5203 6977 -5670 830 4721 -4822 2493
818 2493 -752 -1821 2273 -750 1822 -2508 602 1105 -4005 6436 -3011 -2982 7100 -8746 3993
833 3993 5306 -10335 9285 -3170 -6853 12186 -8600 1146 7069 -11543 7195 684 -6085
846f085J4636j4109M654M984q684Q672n071q9K367m401P313o678L000K767j0518
861g242J3038o405m162J4075j7036P598P103j6907J7512o542r567J7861j4822
874e496L700J0126j6132J0543n69q303J1606o339r99M582n446L286j26K04l87
889B50j933L771m879L727K471q292Q356l714m679J1717r776J141P696j2612Q511
904A755K427j0282J0937m870n383J1001p584K01O817r216L764L591o572N460m62
919A584m920M780j244j545L251j765j589J566N33j686J992O64m777M389l7m772
935c576Q014n131l277R361r486L542O673j2742R369n21r046J3510p953k453R836
950F120j1512N784L659q664P905l745k224N402m346K922j338q55J963l730N814
$$ plain form
846 -6085 8551 -5558 -904 4080 -4604 4068 -1003 -1092 1275 -3126 4187 -2491 509 3276 -7242
861 -7242 5796 -609 -4771 9304 -7732 -134 6969 -9938 7574 1032 -8535 9326 -5496
874 -5496 -1796 8330 -7802 2741 2172 -6131 5475 -864 -1863 2719 -2727 559 433 637 250
889 250 -1683 2088 -2791 936 3407 -4885 3471 -243 -4922 6795 -2981 -1840 5856 -6756 1755
904 1755 4182 -6100 4837 -33 -5416 5585 -1999 -1798 5019 -4197 -433 3158 -3414 2046 1584
919 1584 -3336 1444 200 -1345 1906 141 -1448 118 651 -1035 957 1621 -3156 1233 1196 -3576
935 -3576 4438 -693 -3970 5391 -4095 -553 6120 -6622 2747 2226 -6820 6690 -1263 -3716 6120
950 6120 -5392 392 4051 -4613 3292 -453 -2677 2725 -1621 1301 -37 -892 1071 -2659 3155
965C155l841j273O353r755P060J892r917J2543q003l209J2842j3661O719M618
979E523j3690J2959m350n465J1962j0606K474M895q186P227k117k495L695l990
993b164L405j590L12K146n807O269l000k336Q389r832M069M159j0466J1121l628
1008A047o338J1433r926K060P498j0828P063l8o861Q489l861j534M724m911J437
1023e46J700j704J011l35o9j308J770N82k783L588k400j981N622m704Q80M072
1039C395p139M303J882o179O756k363m523P392m806n50O078p063K199L358o185
1054c445N160P2m813N043k454j319M226l169K34J274j828J059M38J34j345P00
1070c3P13k681M011j500l113N800n462R89N673q435N540P15p589R715m694k806
$$ plain form
965 3155 -686 -1959 4394 -5361 1699 3591 -6326 6217 -1786 -4995 7847 -5814 905 5523
979 5523 -8167 4792 442 -5023 6939 -3667 -1193 3702 -4484 2743 626 -1869 1826 -2164
993 -2164 1241 -349 -37 2109 -3698 2571 -429 -2765 5624 -4208 -139 4020 -6446 4675 1047
1008 1047 -5291 6142 -3784 -1724 5774 -5054 2009 1971 -4890 3599 -262 -1796 2928 -1983 -546
1023 -546 1154 -550 461 126 57 -1251 519 1101 -1682 1906 -494 -2475 3147 -1557 -677 3395
1039 3395 -3744 559 2441 -3738 3018 655 -3868 3524 -1282 -1832 4246 -2817 -618 2740 -3445
1054 -3445 1715 1787 -3026 2017 -437 -1756 2470 -699 -465 809 -1019 40 478 612 -733 -33
1070 -33 680 -2001 2010 510 -2603 3197 -2265 -1276 4397 -4038 1502 2217 -5372 4343 -351 -3157
1086c157Q347r098L457M047p737O991k372l527N800m359J827J218k898K455k374
1101a380K177l08j881M149n558K951K421o611P819m082l555Q928q740L564M671
1116D565j0134Q439k062n179R450p087N74M843p139N095M1l481M011l065P44J050
1132F65j141J740k595K047p89j613M689m762J426K834o424O156r80m693P353n816
1148a903j30O082p218M002J488o182N903j583k598M857l730k21K775k613J243
1163A72Q84j761L02P54m74j11J259j349p34K200j813L02K318l584J394J782l728
1180b187L541l9m026M659k175k006N596m797K59L983n872L840J446n197N025k118
1196f8k333N070l667N66K042l424K211oo81Q75j044Q35j365J454O20k881L760
$$ plain form
1086 -3157 5190 -3908 -451 3596 -4141 2850 478 -3049 2751 -1608 219 1437 -1461 994 -1380
1101 -1380 797 489 -1392 2757 -2801 150 2571 -4040 3779 -303 -3858 5070 -3670 -106 4565
1116 4565 -5569 2870 808 -4371 5079 -2008 -1434 3409 -3730 1365 1406 -2075 1936 -1129 -385 665
1132 665 -476 1264 -1331 716 -73 -1686 3003 -1759 -333 2501 -3923 2233 1253 -3440 3913 -1903
1148 -1903 -2033 4049 -3169 833 2321 -3861 2042 459 -2139 2718 -1012 -1233 1542 -1071 172
1163 172 1056 -705 -403 351 -123 -234 1025 -324 -1058 1142 -671 -369 1949 -1635 -241 1541 -2187
1180 -2187 1354 1315 -2711 1948 -227 -2233 3363 -1434 -1175 2808 -3064 776 2222 -2975 2050 -68
1196 -68 -2401 2669 -998 -432 1610 -1814 397 391 -290 585 -459 376 -989 465 1085 -1796 1964
1213A964k785j058N279n930K988K151o972P066k262l589P586o937J267M676p189
1228c745N718o25m525N795l911N34K947l802K402j100l51J660j996K521k472J87
1244g63K688m563M636j204l924O578n555J051N071p847N354K1n660P837m467j170
1260a917N346o376L194J657m142L979j959j030K296j701J249o39o5K69j337K661
1276A485k036R2K258m225L229M95l738M987l122j603N116m870J830K690n526L905
1292I67P8l458M715k344j711L635l007O44K295k934J068P02j708J436L35j172
1308d59L85K84o93L73J140j553Q3J464k450J768J205l513L112p38k834N015l101
1325e12j038M429n447K478K620n453M824j336l411N494l605J61L147m422K435
$$ plain form
1213 1964 -821 -1879 3400 -2530 458 2609 -4363 2703 441 -3148 4438 -2499 -1232 3444 -3745
1228 -3745 1973 1348 -3177 2618 -1293 -759 2188 -1614 788 -312 -663 997 -999 1522 -950 -763
1244 -763 1925 -2638 1998 794 -3130 3448 -2107 -1056 4015 -3832 1522 1543 -4117 3720 -747 -1917
1260 -1917 3429 -2947 247 1904 -2238 1741 -218 -1248 1048 -653 596 -43 -108 161 -1176 1485
1276 1485 -551 -459 1799 -2426 803 1298 -2440 2547 -575 -2178 2938 -1932 -102 2588 -2938 967
1292 967 1045 -2413 2302 -42 -1753 1882 -1125 -481 1814 -1120 -52 650 -1058 378 713 -459
1308 -459 -74 210 -483 -110 1030 -523 -440 1024 -1426 342 1547 -1966 1146 408 -2426 2589 -512
1325 -512 -1550 2879 -2568 -90 2530 -2923 1901 565 -2846 2648 -957 -796 2351 -2071 364
1340C64L19j873K488j699L35j2m21J553k114K105r51k090M410l915J174L176o401
1357c552N131n35m428P289n325l98N339o976M532J048n391N763l210r28M187m104
1373a558K087L3j949K435j722J403o02j137K432l198K630M65l839M996l613n78
1389a715N223o275L444J416n988O566k532k533N871n648J433L128m846L803n47
1404H00k716L199j779J83J238j299M21n14Q38m27j83J512k687J522R66k928L630
1421A776j591k219M254l521N81L371m886K573J088m048M431j177k699M113k994
1436i48k65L465l525J199J369l122K422J65j732J827j013n75J100j76j73r9N20
1453D39j200N43J547k594J935J71l254M346j964j733M781n134J414L418n743M746
$$ plain form
1340 364 683 -1190 1298 -401 -66 -78 -499 1054 -1060 1045 94 -1996 2414 -1501 -327 2849 -3552
1357 -3552 1579 1044 -3384 3905 -1420 -1818 3521 -3455 1077 2125 -3266 2497 -713 -1641 2546 -1558
1373 -1558 529 562 -1387 1048 -674 729 127 -1010 1422 -1776 854 1319 -2520 2476 -1137 -1715
1389 -1715 3508 -2767 677 2093 -3895 2671 139 -2394 3477 -2171 -738 2390 -2456 1347 800
1404 800 -1916 1283 -496 -313 925 -374 47 -467 371 -56 -239 1273 -1414 108 1074 -1854 1776
1421 1776 185 -2034 2220 -1301 -720 2651 -2235 338 1426 -2622 1809 632 -2067 2046 -948
1436 -948 -1213 2252 -1273 -74 1295 -1827 595 760 -972 855 -158 -733 367 191 18 -81 439
1453 439 -761 -218 1329 -1265 670 841 -2413 1933 -31 -1764 3017 -2117 -703 2715 -3028 1718
1469A718n09m418N893l631l97M290n126K450P96l043L575j779k73J128j739J832
1485G67j261Q88L45k556L511k633J37L664n673L789M04m903O968m130j471N894
1501C740p051L679K303o178O070k684k388N395m478J633J519l541K918j219Q5
1516a97J061j769J818k043J217J222l236L881k509j351M873n191K555K094o060
1531c635N748j712l054O210n228N33L779n350L744M45l780L827j849q40K713k050
1547d99L33N07p95L95K15M28j202O56M33j802K537q36j894L264k807Q9L405m231
1565a804K024J410m386M241o03l112M637l243q24M201m123J588J856m161L066
1580G67k7k256L112j857o59J763j422P65J88m05j96k40J257j553J175O11l114
$$ plain form
1469 1718 1209 -3209 2684 -947 -1344 2946 -2180 270 1066 -1977 1598 -181 -454 674 -1065 767
1485 767 -494 394 739 -1817 1694 -939 -802 2862 -2811 978 1382 -3521 3447 -683 -2154 3740
1501 3740 -3311 368 2671 -3507 2563 -121 -2509 2886 -1592 41 1560 -1981 937 -282 -197
1516 -197 864 -905 913 -1130 87 1309 -1927 1954 -555 -1906 2967 -2224 331 2425 -3635
1531 -3635 2113 401 -2653 3557 -1671 -1138 2641 -2709 1035 1480 -2300 1527 -322 -1162 1551 -499
1547 -499 -166 341 -454 -59 156 584 -618 38 471 -1331 1206 370 -1524 1740 -1067 -978 2427 -1804
1565 -1804 220 1630 -2756 1485 882 -2230 2407 -836 -1660 2541 -1582 6 1862 -2299 767
1580 767 740 -1516 1596 -261 -920 843 -579 186 374 -31 -227 -467 790 -763 412 1023 -2091
1597b091L488j329j924M896m825R10L632o087N000r6m997O451m114p72N354n945
1613b449K863J182m380M629j904q39K406k836J720m37j40J218k389K547j873l46
1629a028L597m875L206M76m896O648l774j364N891p199L527K412o354O598k746
1644A19k929N959n065J706K470m544L288r39j135K390j915J023p69j6J203k071
1660a225K729j787j216L741m260K367J849n303N050j782k810O057m892M98L693
1675B709n688L869O97m004M324k184j363L413k443M12J316k032Q83N13n43J20
1691aK79l45p47J618o97p82K026k301J59K485l156J813J152l943L641m81k811
1708b091M646l307r41M250m556K050K225m922L794n37k787M365k625n48K453k815
$$ plain form
1597 -2091 1397 68 -1856 3040 -1785 -875 2757 -3330 1670 1574 -3423 3028 -1086 -1858 3496 -2449
1613 -2449 414 1596 -2784 1845 -59 -898 1508 -1328 392 -45 -185 1033 -1356 1191 -682 -1028
1629 -1028 2569 -2306 900 1376 -3520 3128 -646 -2010 3881 -3318 209 2621 -3733 2865 119
1644 119 -2810 3149 -1916 -210 2260 -2284 1004 65 -1070 1320 -595 428 -341 -357 846 -1225
1660 -1225 1504 -283 -1499 2242 -2018 349 2198 -3105 1945 163 -2647 3410 -1482 -984 2709
1675 2709 -2979 890 1587 -2417 1907 -277 -1640 1773 -670 -258 1058 -974 -91 422 -121 -1
1691 -1 278 -67 -814 804 107 -675 1351 -950 -791 1694 -1462 351 1503 -2440 1201 720 -2091
1708 -2091 2555 -752 -1693 2557 -1999 51 2276 -2646 1148 611 -2176 2189 -436 -984 1469 -1346
1724a346J532N61j279R38q20N87n19N12Q28k469K540j133j662M452m210R18L128
1741B558n956N036k22m656O618m723n94N520o431L644J147n228N436k402j141
1756a394L710l864J700L16j450K147j885J353q73q15K889l555K590L73m240N634
1772B636l463q62N449o870L495J892o094O803k880k764N988n614J936K858m990
1787b480L813j080j939L206k100O92K65j010J013j104J633r76p60K338l279K124
1803C56J259l968M268k044k168N218m432R54L177n521L727N81l915M730k352j768
1819a898L954l152P09K125l088J408N87j600J501q6r72M24K74m68J94R63j478
1836f03J54J461k242J659Q61l230L038p70k401M542l140p52M016m959K478K227
$$ plain form
1724 -1346 186 747 -532 406 -414 173 -346 166 994 -1475 1065 -68 -1730 2722 -1488 -570 2558
1741 2558 -3398 1638 1416 -3240 3378 -1345 -1939 3581 -2850 794 1941 -3287 2149 -253 -1394
1756 -1394 2316 -1548 152 468 -982 1165 -720 633 -240 -1055 1834 -1721 869 1242 -2998 2636
1772 2636 -827 -1689 3760 -3110 385 2277 -3817 2986 106 -2658 3330 -2284 -348 2510 -2480
1787 -2480 1333 253 -1686 1520 -580 112 377 -633 380 -724 909 -67 -827 1511 -1768 356
1803 356 1615 -2353 1915 -129 -2297 2921 -1511 -557 2620 -2901 826 1407 -2508 2222 -130 -1898
1819 -1898 2056 -1096 -387 1738 -1350 58 645 -955 546 460 -512 -88 186 -282 -88 875 -603
1836 -603 -449 1012 -1230 429 1290 -1940 1098 328 -2073 2469 -671 -1423 2593 -2366 112 2339
1852B339n153M516j222l122N296l528l1L141m310K435N75k230K503j549l6N90
1868B14o29J234j591J445o28j633L708l398R75K667n561M730n35m043O633n060
1884a472k24N134o719M420Q76n402N951l218j004M432m544K094N27k481K868j679
1900d41O74J03j319K143k449J981L44l259M400l261k42M534n990L570R82n451
1916c681O586l114k018N693n984K214K690n094M381j214k464L722k488N59J273
1931A061j845J005n09N08j28l45J236k279J618N44k556L531k152j364L960l941
1947a656J529K387m823L560j16l304M707k504j418L803l658J027K449l624K084
1962D43L94k530K672o14j241J746j182k60J076l88k71K59J45j028J068N19j975
$$ plain form
1852 2339 -2814 1702 480 -2642 2654 -874 -905 2236 -2074 361 936 -1294 1209 -340 -376 214
1868 214 -415 819 -772 673 45 -1588 2120 -1278 -303 2364 -3197 1533 998 -3045 3588 -1472
1884 -1472 -1696 3438 -3281 1139 2015 -3387 2564 -654 -1658 2774 -1770 324 851 -1630 1238 -441
1900 -441 233 336 -983 1160 -1289 692 1036 -2223 2177 -1084 -1326 3208 -2782 788 1770 -3681
1916 -3681 2905 -209 -2227 3466 -2518 -304 2386 -2708 1673 459 -2005 1717 -771 -212 1061
1931 1061 -784 221 -288 220 92 -253 983 -1296 322 866 -1690 1841 -311 -1675 2285 -1656
1947 -1656 -127 2260 -2563 997 881 -2423 2284 -220 -1638 2165 -1493 -466 1983 -1641 443
1962 443 837 -1693 979 365 -876 870 -312 -572 504 116 -155 104 249 -779 289 808 -1167
1979a167K151q69j852L747k732j96L338m791K629J610m624M887j896k733N232
1994B734m223R01L057m860L166m2k563L575k173o8J273j743J570q48N29J2j465
2011a168K531k429J013J968m431M018j119k941N881m892N65M019o446M833J54
2026A556m651O009l929o20M387m819K677M98l067L232j738K92R77j610J513j596
2042h89J225L64k084L157k864K41L148m679L607m9m156N613l428p31M712n635
2058b448K586J709m582M633j504k259L769k942N44J926k371J165op73P24k8J55
2075B98p99P77j92j029K256j677m18K307l053J646J461l491L063o76k566M092
2091A999k391p72L332l784J293K081l564K706n3k755L188j353r27K527k261K85
$$ plain form
1979 -1167 984 115 -1737 2010 -722 -918 2420 -2371 258 1868 -2756 2131 235 -2498 2734
1994 2734 -1489 -588 2469 -2391 775 733 -1830 1745 -428 -496 777 -966 604 -244 285 297 -1168
2011 -1168 1363 -1066 -53 1915 -2516 1502 383 -2558 3323 -1569 -1004 3015 -3431 1402 1556
2026 1556 -3095 2914 -1015 -1635 2752 -2067 610 1108 -1959 1273 -465 -173 804 -806 707 -889
2042 -889 336 700 -1384 1773 -1091 -850 2298 -2381 1226 1177 -2979 2634 -794 -1525 3187 -2448
2058 -2448 138 1847 -2735 1898 394 -1865 1904 -1038 -494 1432 -939 226 220 -553 171 143 298
2075 298 -501 276 84 -945 1311 -366 -784 1523 -1530 116 1577 -1914 1149 473 -2093 1999
2091 1999 -392 -1164 2168 -1616 -323 1758 -1806 900 847 -1908 1280 -73 -1000 1527 -734 -449
2107d49J242j512R83J31p08J74J00K77p09J127n38j310K526k078J58K671m093
2124b008K444R07l946M824k207k073M811m668J548K773m907L819p85k624M092
2139B000k709L15J661k592J855n76j22Q07j447J641j639O89J495l189L235j419
2155Ek021M714m339J316K799n663M757p24l516N730m336M9L746m884L257L12l202
2172b000L512k054o0J780j944J234p49J31N73j155J941j943K97J817l264L093
2188A209n06k831M337l318P3L637m802K777P50l894M388j752j573L518l239P33
2204d93J897k582J667N0j499J314k23l53M38k0m94J9Q74r61L35Q75j958J345N32
2223G63k033K376r16j699L019k113k10K775l436J347J566l385L042l52k577L385
$$ plain form
2107 -449 793 -719 264 395 -313 -139 -39 238 -471 656 118 -1192 1334 -744 -586 2085 -2008
2124 -2008 436 1343 -2603 2221 14 -2059 2752 -1916 -368 2405 -2502 1317 532 -2092 2000
2139 2000 -709 -394 1267 -1325 530 -46 -168 639 -808 833 -806 -117 1378 -1811 1424 5
2155 5 -2016 2698 -1641 -325 2474 -3189 1568 844 -2672 3058 -1278 -1229 2517 -2367 890 1202 -2000
2172 -2000 1512 -542 -602 1178 -766 468 -281 -150 423 -732 1209 -734 -437 1380 -1884 1209
2188 1209 703 -2128 2209 -1109 -1036 2601 -2201 576 1326 -2568 1820 68 -1505 2013 -1226 -493
2204 -493 1404 -1178 489 539 -960 354 131 -222 216 196 -298 -279 595 -366 -31 844 -1114 231 763
2223 763 -1270 1106 190 -1509 1510 -603 -813 1962 -1474 -127 1439 -1946 1096 744 -1833 1552
2239A552k032n70K842k847R75J030k232J882k66q59J013p62K12k9L76o9q55J499
2257H60j561L20J921l114K288J15l092M336k467j031M034m748K143J918m473M336
2273A785j529k281M180l354R26J832l107K242o70o89J545j450J059q59R9J132
2289H61k071K428j318j272L392l663J778J767m522M292j483k355M999m274Q38
2304f03K750m640L581k25k693L592k481pJ972k165J374k70o73P86o92R88r29K85
2322e0P04j965K282p95j354K932k921O68K269l602K738j5k960L709j924q62L094
2339A948l116Q43J587k643K001N5j760J740o86n62J255o59l44N40k31k98O36N
2357C11q89Q91j88r12J685r15q26J980j896K86J989k798J527Q00k906L057p82
$$ plain form
2239 1552 -480 -1050 1792 -1055 -80 950 -1282 600 334 -525 488 -274 -62 -91 285 216 -639 860
2257 860 -701 -381 1540 -1574 714 829 -2263 2073 -394 -1425 2609 -2139 4 1922 -2551 1785
2273 1785 256 -2025 2155 -1199 -273 1559 -1548 694 24 -665 880 -570 489 -370 -271 861
2289 861 -1210 1218 -100 -1372 2020 -1643 135 1902 -2620 1672 189 -2166 2833 -1441 -603
2304 -603 2147 -2493 1088 863 -1830 1762 -719 -726 1246 -919 455 185 -488 298 -394 594 -335 -50
2322 -50 654 -1311 971 176 -1178 1754 -1167 -499 1770 -1832 906 891 -2069 1640 -284 -1146 1948
2339 1948 -1168 -325 1262 -1381 620 675 -1085 655 -31 -593 662 3 -341 199 -32 -330 306 311
2357 311 -578 313 125 -787 898 -17 -843 1137 -759 -473 1516 -1282 245 1045 -1861 1196 414
2374D14j952L349k642n1K688l229J798O42k641K593r40p71J809j626M63L00m95
2391b91O41o30P52q83O0J334k149J911k16k269L468k443j73L156m314K477Q79
2408A310l702M389k112j445L754l770J545J524l156K720j059r48K007j661R10
2423C06j86n58R53j281J554q53p03K163k832J749R16l204L644j909j400L980l879
2440a540J451J876m116L503p17k108L529k660J46J890k384J589%j125J070o55
2456b51L25o5O4K26j025J333p73l99J837k275R58J074k575K557n68j915K962k122
$$ plain form
2374 414 -1538 1811 -831 -882 1806 -1423 375 1017 -1624 969 29 -742 1067 -559 -96 204 -291
2391 -291 350 -280 472 -411 -351 983 -1166 745 529 -1740 1728 -715 -888 2268 -2046 431 1310
2408 1310 -2392 1997 -115 -1560 2194 -1576 -31 1493 -1663 1057 -2 -950 1057 -604 306
2423 306 120 -438 515 -766 788 -65 -768 1395 -1437 312 1228 -1976 1668 -241 -1641 2339 -1540
2440 -1540 -89 1787 -2329 1174 457 -1651 1878 -782 -636 1254 -1130 459 459 -666 404 -251
2456 -251 74 9 73 299 -726 607 -166 -565 1272 -1003 -45 1029 -1546 1011 443 -1472 1490 -632
$$ [...]
8191d3
##END NTUPLES=NMR FID
##END=
