##TITLE=1H_SR-167-R2K-AK
 D2O
 8 sc, 
 1.8.2023
##JCAMPDX= 6.0         $$ Bruker NMR JCAMP-DX V2.0
##DATA TYPE= NMR FID
##DATA CLASS= NTUPLES
##ORIGIN= UXNMR, Bruker Analytische Messtechnik GmbH
##OWNER= root
$$ XWIN-NMR		Version 3.5
$$ Tue Aug  1 16:36:54 2023 Russian Standard Time (UT+4h)  she@DPX200
##.OBSERVE FREQUENCY= 200.13135
##.OBSERVE NUCLEUS= ^1H
##.DELAY= (6, 6)
##.ACQUISITION MODE= SIMULTANEOUS
##.ACQUISITION SCHEME= undefined
##.AVERAGES= 8
##.DIGITISER RES= 18
##SPECTROMETER/DATA SYSTEM= spect
##.PULSE SEQUENCE= zg30
##.SOLVENT NAME= D2O
##.SHIFT REFERENCE= (INTERNAL, D2O, 0, 15.7039)
##AUDIT TRAIL= $$ (NUMBER, WHEN, WHO, WHERE, WHAT)
$$ ##TITLE= Audit trail, XWIN-NMR		Version 3.5
$$ ##JCAMPDX= 5.01
$$ ##ORIGIN= Bruker BioSpin GmbH
$$ ##OWNER= she
$$ F:/spectra/data/she/nmr/H-F/1/audita.txt
$$ ##AUDIT TRAIL=  $$ (NUMBER, WHEN, WHO, WHERE, WHAT)
(   1,<2023-08-01 16:35:20.43 +0400>,<she>,<DPX200>,
      <created by zg, POWCHK disabled, PULCHK disabled
       configuration hash MD5:
       00 E9 B6 7A A2 85 ED C7 34 08 36 98 17 FE 4E 26
       data hash MD5: 16K
       58 83 FA 00 A2 B1 D2 E4 A7 A2 25 CC D5 61 13 9E>)
$$ ##END=
$$ 
$$ hash MD5
$$ 68 43 AF AE D0 48 F2 46 EF 8B 1C 5E F4 2D B7 09
##$RELAX= 
##$RELAX= 
##$RELAX= 
##$RELAX= 
##$RELAX= 
##$RELAX= 
$$ Bruker specific parameters
$$ --------------------------
##$DU= <F:/spectra>
##$EXPNO= 1
##$NAME= <H-F>
##$PROCNO= 1
##$TYPE= <nmr>
##$USER= <she>
##$AMP= (0..31)
100 100 100 100 100 100 100 100 100 100 100 100 100 100 100 100 100 100 
100 100 100 100 100 100 100 100 100 100 100 100 100 100 
##$AQSEQ= 0
##$AQ_mod= 1
##$AUNM= <au_zg>
##$AUTOPOS= <>
##$BF1= 200.13
##$BF2= 200.13
##$BF3= 200.13
##$BF4= 200.13
##$BF5= 200.13
##$BF6= 200.13
##$BF7= 200.13
##$BF8= 200.13
##$BYTORDA= 1
##$CFDGTYP= 0
##$CFRGTYP= 5
##$CHEMSTR= <none>
##$CNST= (0..31)
1 1 145 1 1 1 1 1 1 1 1 1 1 1 1 1 1 1 1 1 1 1 1 1 1 1 1 1 1 1 1 1 
##$CPDPRG= <>
##$CPDPRG1= <>
##$CPDPRG2= <>
##$CPDPRG3= <>
##$CPDPRG4= <mlev>
##$CPDPRG5= <mlev>
##$CPDPRG6= <mlev>
##$CPDPRG7= <mlev>
##$CPDPRG8= <mlev>
##$CPDPRGB= <>
##$CPDPRGT= <>
##$D= (0..31)
0 1.2 0 0 0 0 0 0 0 0.06 0 0.03 0 0 0 0 0.0002 0 0 0 0 0 0 0 0 0 0 0 0 
0 0 0 
##$DATE= 1690893319
##$DBL= (0..7)
120 120 120 120 120 120 120 120 
##$DBP= (0..7)
150 150 150 150 150 150 150 150 
##$DBP07= 0
##$DBPNAM0= <>
##$DBPNAM1= <>
##$DBPNAM2= <>
##$DBPNAM3= <>
##$DBPNAM4= <>
##$DBPNAM5= <>
##$DBPNAM6= <>
##$DBPNAM7= <>
##$DBPOAL= (0..7)
0.5 0.5 0.5 0.5 0.5 0.5 0.5 0.5 
##$DBPOFFS= (0..7)
0 0 0 0 0 0 0 0 
##$DE= 6
##$DECBNUC= <off>
##$DECIM= 32
##$DECNUC= <off>
##$DECSTAT= 4
##$DIGMOD= 1
##$DIGTYP= 9
##$DL= (0..7)
0 120 120 120 120 120 120 120 
##$DP= (0..7)
150 150 150 150 150 150 150 150 
##$DP07= 0
##$DPNAME0= <>
##$DPNAME1= <>
##$DPNAME2= <>
##$DPNAME3= <>
##$DPNAME4= <>
##$DPNAME5= <>
##$DPNAME6= <>
##$DPNAME7= <>
##$DPOAL= (0..7)
0.5 0.5 0.5 0.5 0.5 0.5 0.5 0.5 
##$DPOFFS= (0..7)
0 0 0 0 0 0 0 0 
##$DQDMODE= 0
##$DR= 18
##$DS= 0
##$DSLIST= <SSSSSSSSSSSSSSS>
$$ [...]
##$SUBNAM2= <"">
##$SUBNAM3= <"">
##$SUBNAM4= <"">
##$SUBNAM5= <"">
##$SUBNAM6= <"">
##$SUBNAM7= <"">
##$SUBNAM8= <"">
##$SUBNAM9= <"">
##$SW= 18.05172834244
##$SWIBOX= (0..15)
0 0 2 0 0 0 0 0 0 0 0 0 0 0 0 0 
##$SW_h= 3612.71676300578
##$TD= 16384
##$TD0= 1
##$TE= 0
##$TE2= 300
##$TE3= 300
##$TEG= 300
##$TL= (0..7)
0 120 120 120 120 120 120 120 
##$TP= (0..7)
150 150 150 150 150 150 150 150 
##$TP07= 0
##$TPNAME0= <>
##$TPNAME1= <>
##$TPNAME2= <>
##$TPNAME3= <>
##$TPNAME4= <>
##$TPNAME5= <>
##$TPNAME6= <>
##$TPNAME7= <>
##$TPOAL= (0..7)
0.5 0.5 0.5 0.5 0.5 0.5 0.5 0.5 
##$TPOFFS= (0..7)
0 0 0 0 0 0 0 0 
##$TUNHIN= 0
##$TUNHOUT= 0
##$TUNXOUT= 0
##$USERA1= <user>
##$USERA2= <user>
##$USERA3= <user>
##$USERA4= <user>
##$USERA5= <user>
##$V9= 5
##$VALIST= <valist>
##$VCLIST= <CCCCCCCCCCCCCCC>
##$VD= 0
##$VDLIST= <DDDDDDDDDDDDDDD>
##$VPLIST= <PPPPPPPPPPPPPPP>
##$VTLIST= <TTTTTTTTTTTTTTT>
##$WBST= 1024
##$WBSW= 4
##$XGAIN= (0..3)
0 0 0 0 
##$XL= 0
##$YL= 0
##$YMAX_a= 180336
##$YMIN_a= -227637
##$ZGOPTNS= <>
##$ZL1= 120
##$ZL2= 120
##$ZL3= 120
##$ZL4= 120
##$ABSF1= 10
##$ABSF2= 0
##$ABSG= 5
##$ABSL= 3
##$ALPHA= 0
##$AQORDER= 0
##$ASSFAC= 0
##$ASSFACI= 0
##$ASSFACX= 0
##$ASSWID= 0
##$AUNMP= <proc_1d>
##$AZFE= 0.1
##$AZFW= 0.1
##$BCFW= 1
##$BC_mod= 2
##$BYTORDP= 1
##$COROFFS= 0
##$CY= 11.3945322036743
##$DATMOD= 1
##$DC= 2
##$DFILT= <>
##$DTYPP= 0
##$F1P= 15.7292609196834
##$F2P= 12.9074282941183
##$FCOR= 0.5
##$FTSIZE= 0
##$FT_mod= 4
##$GAMMA= 1
##$GB= 0.15
##$INTBC= 1
##$INTSCL= 1
##$ISEN= 128
##$LB= 0.24
##$LEV0= 0
##$LPBIN= 0
##$MAXI= 10000
##$MC2= 0
##$MEAN= 0
##$ME_mod= 0
##$MI= 1.114404
##$NCOEF= 0
##$NC_proc= 0
##$NLEV= 6
##$NOISF1= 3.799351
##$NOISF2= 2.8
##$NSP= 1
##$NTH_PI= 0
##$NZP= 0
##$OFFSET= 15.70392
##$PC= 1
##$PHC0= -21041.89
##$PHC1= 5.052721
##$PH_mod= 1
##$PKNL= yes
##$PPARMOD= 0
##$PSCAL= 0
##$PSIGN= 0
##$REVERSE= no
##$SF= 200.130013532006
##$SI= 16384
##$SIGF1= 3
##$SIGF2= 2
##$SINO= 400
##$SIOLD= 16384
##$SREGLST= <1H.CDCl3>
##$SSB= 0
##$STSI= 0
##$STSR= 0
##$SW_p= 3612.71676300578
##$SYMM= 0
##$S_DEV= 0
##$TDeff= 0
##$TDoff= 0
##$TI= <>
##$TILT= no
##$TM1= 0
##$TM2= 0
##$TOPLEV= 0
##$USERP1= <user>
##$USERP2= <user>
##$USERP3= <user>
##$USERP4= <user>
##$USERP5= <user>
##$WDW= 1
##$XDIM= 8192
##$YMAX_p= 0
##$YMIN_p= 0
$$ End of Bruker specific parameters
$$ ---------------------------------
##NTUPLES= NMR FID
##VAR_NAME=  TIME,          FID/REAL,        FID/IMAG
##SYMBOL=    X,             R,               I
##VAR_TYPE=  INDEPENDENT,   DEPENDENT,       DEPENDENT
##VAR_FORM=  AFFN,          ASDF,            ASDF
##VAR_DIM=   8192,          8192,            8192
##UNITS=     SECONDS,       ARBITRARY UNITS, ARBITRARY UNITS
##FACTOR=    0.0002768,     1,               1
##FIRST=     0,             0,               0
##LAST=      2.2672688,     0,               0
##MIN=       0,             -227637,         0
##MAX=       2.2672688,     180336,          0
$$ Real data points
##PAGE= N=1
##DATA TABLE= (X++(R..R)), XYDATA
0 0 0 0 0 0 0 0 0 0 0 0 0 -8 8 -8 8 -8 16 -16 24 -24 32 -40 48 -56 64 -72 86 -97 112 -129 150 -168 192
33 192 -217 246 -278 310 -348 388 -433 482 -537 594 -658 728 -804 886 -978 1076 -1187 1309
51 1309 -1440 1588 -1753 1937 -2147 2384 -2656 2973 -3350 3804 -4361 5065 -5989 7262 -9126
66 -9126 12136 -17793 32144 -148353 -227637 24482 -50186 7100 115622 74193 23880 -2076
78 -2076 -145379 -105141 20067 27294 91360 180336 91384 66236 56436 -95823 -98979 61144
90 61144 53007 61699 160170 102317 12898 3218 -98204 -124941 -6328 11467 15192 101658 46022
103 46022 -51985 -44377 -108279 -162077 -51592 9850 4319 59670 40339 -36673 -44739 -95139
115 -95139 -125702 -12891 42977 21851 88125 95903 -5637 -32071 -37039 -63137 3847 65002
127 65002 58152 99377 101328 5517 -31774 -30918 -54098 -8176 49048 43477 69644 73104 -19149
140 -19149 -66386 -51560 -65708 -42222 17328 29882 41566 39444 -31614 -74878 -59494 -63820
152 -63820 -44074 17469 40206 41346 38574 -11858 -54121 -46538 -40250 -17309 36695 56796 52947
165 52947 51502 9373 -39915 -37957 -20618 -2661 34641 57481 55013 41554 1501 -41430 -44143
178 -44143 -28097 -10673 20455 42922 39883 22140 -13044 -49545 -53804 -35886 -16443 10655
190 10655 34680 35562 13671 -18285 -43189 -47268 -33587 -9337 19409 39489 39232 18533 -9539
203 -9539 -29746 -35839 -24997 2698 29711 43056 41389 22540 -6010 -25546 -31081 -22972 3218
216 3218 28352 36750 34299 16785 -13047 -31246 -34064 -27062 -3156 21722 27955 25298 11088
229 11088 -18594 -35663 -34008 -26959 -5817 20939 27663 22772 10721 -15388 -31474 -27457 -20180
242 -20180 -1438 25523 33002 25048 13676 -9535 -26014 -21654 -13724 2351 27545 33525 23131
255 23131 12766 -8583 -27175 -22879 -12285 -45 22132 29344 17414 5440 -12349 -29804
267 -29804 -26540 -14317 -1938 17581 25345 13860 2598 -13010 -29539 -25940 -10882 318 16832
280 16832 26718 16900 2633 -10280 -23446 -21291 -7115 5612 20325 27870 17715 4745 -7610
293 -7610 -21544 -19673 -4199 7213 17465 25601 17489 812 -11497 -20826 -20745 -8447 5455 15497
307 15497 19798 12502 -1414 -13972 -23250 -21468 -7842 4895 13327 18838 12375 -2256 -13565
320 -13565 -19696 -18094 -6513 7580 16709 19185 13389 478 -11694 -16904 -14043 -3526 9483
333 9483 17555 19120 13017 803 -11640 -16851 -13338 -3478 7882 15981 16683 9422 -2224 -13364
347 -13364 -18458 -14166 -4822 5763 13753 14144 7119 -3126 -13927 -18355 -12373 -3341 5232 14377
361 14377 15237 6581 -3065 -11359 -15475 -10619 -907 7915 15869 16278 6973 -1922 -9222 -14077 -9357
376 -9357 650 8147 15016 15090 5600 -3781 -9493 -14123 -10736 -354 7032 11932 12339 3476 -5620
391 -5620 -10882 -14552 -10843 -621 6526 10941 11454 3277 -6524 -10831 -12838 -9342 547 7875 11798
406 11798 12405 4103 -5445 -9050 -9840 -7010 1621 9380 12417 12477 4357 -5805 -8523 -8605 -7046 1089
422 1089 9020 11559 9903 2768 -6519 -9689 -9835 -7873 -232 7855 9598 7580 1119 -7321 -10683
437 -10683 -10060 -7399 144 7406 9438 7294 1526 -6091 -9487 -8131 -4689 1895 7994 10704 8568
452 8568 2461 -5088 -8250 -6828 -3243 2618 8331 10281 8000 1910 -5412 -8556 -7177 -3702 2012
467 2012 7059 9018 6311 -883 -6624 -8672 -8326 -4416 1657 6324 7411 5224 -1052 -6530 -8310
482 -8310 -7727 -3521 2928 7209 7340 5487 205 -5325 -7080 -6015 -2154 4448 7893 7520 5572 879
498 879 -5304 -6346 -5430 -2201 3923 7342 6434 4509 -105 -6215 -7125 -5510 -3065 3072 6828 4945
514 4945 3051 -1100 -7010 -7211 -4998 -2771 3072 7337 4934 2418 -36 -6022 -6820 -3626 -1981 3159
530 3159 8085 5712 2797 251 -4972 -5912 -2739 -1112 2946 8004 5184 1925 1 -5026 -7038
545 -7038 -3032 -845 1920 6906 4953 494 -1107 -4944 -7400 -3156 -590 1788 6313 4894 327
560 327 -1394 -4498 -6634 -2654 587 2242 6500 5398 364 -886 -3227 -6246 -2356 1645 2650
575 2650 6012 5785 394 -1865 -3231 -5731 -2723 1743 2555 5069 5007 -139 -2456 -3463 -6108 -2879
591 -2879 1708 2005 3701 4656 -386 -3316 -3042 -5354 -3380 1850 3165 3439 4542 141 -2724 -2922
607 -2922 -4161 -2589 2460 3740 3723 4517 589 -3148 -2696 -3083 -2907 2444 3766 2958 3690 562 -3343
624 -3343 -3086 -3162 -2677 1615 3434 2790 2968 258 -3446 -3555 -3034 -2374 1411 3802 2693 2376 717 -3254
642 -3254 -3365 -2510 -1933 1445 3977 3126 2176 527 -2947 -3386 -1863 -1469 1520 3705 3171 1938 499
659 499 -2424 -3439 -1986 -957 1011 3681 3132 1504 -146 -2634 -3416 -2264 -880 1003 3114 2750
675 2750 1431 -93 -2277 -3534 -1980 -721 1311 2893 2846 922 -337 -2045 -2931 -1809 -409 1102
691 1102 3100 3087 1160 -633 -1935 -2598 -2019 -42 1269 2961 2764 820 -453 -2000 -2832 -1687 -125
708 -125 1481 2540 2292 844 -667 -2115 -2634 -1833 57 1626 2253 2005 783 -848 -2217 -2644 -1535
725 -1535 24 1540 2412 1953 810 -864 -1904 -2556 -1716 299 1556 2329 1779 796 -787 -2051 -2304
742 -2304 -1165 196 1504 2028 1781 621 -956 -1972 -2145 -1243 157 1498 2218 1726 259 -872 -1959
759 -1959 -2139 -1064 475 1508 2078 1809 207 -922 -1646 -2019 -871 446 1533 2162 1581 -18 -871
776 -871 -1635 -1744 -1115 668 1323 1687 1336 246 -1196 -1664 -1611 -783 523 1426 1839 1270 149 -1067 -1398
795 -1398 -1464 -569 649 1321 1826 1250 -52 -1143 -1535 -1569 -488 616 1360 1558 1407 355 -1016 -1451
813 -1451 -1227 -667 465 1388 1431 887 -273 -1343 -1537 -1232 -336 589 1050 1413 737 -324 -1152 -1524 -1197
832 -1197 -284 718 1072 1311 667 -290 -1024 -1345 -1146 -144 701 1382 1223 614 -72 -727 -1344 -1203 -151
851 -151 589 1434 1190 568 -130 -1081 -1146 -1151 -517 824 1163 1212 508 -302 -1175 -1280 -880 -223 866 1109 1086
872 1086 501 -370 -1088 -1050 -844 181 610 1158 1021 296 -383 -933 -1075 -810 116 654 961 1066 99 -528
892 -528 -929 -1102 -653 -6 695 752 632 187 -594 -824 -1098 -650 -9 687 830 849 196 -378 -884 -822 -502
913 -502 178 896 888 516 147 -641 -1148 -908 -507 172 767 802 714 241 -424 -1064 -1038 -391 270 787 984 678
935 678 290 -609 -576 -638 -398 62 975 858 524 95 -369 -814 -917 -247 96 575 647 773 292 -615 -957
956 -957 -768 -388 271 520 835 563 60 -654 -855 -600 -287 386 700 868 493 -58 -388 -785 -449 -213
976 -213 260 551 669 572 -420 -637 -761 -608 -430 260 788 575 235 -104 -510 -470 -594 -200 108 543 684
997 684 448 118 -620 -375 -641 -124 315 689 503 610 68 -671 -624 -601 -289 159 523 847 231 40 -700
1018 -700 -706 -428 -54 242 676 810 144 -166 -611 -678 -413 -108 316 495 609 268 -324 -155 -480 -443 232
1039 232 507 921 612 132 -126 -432 -412 97 -127 230 474 248 360 27 -446 -788 -279 56 410 351 107
1060 107 218 -54 -475 -544 -687 183 87 534 604 -170 -386 -330 -465 -453 74 379 490 509 122 -356 -376 -519
1082 -519 -359 -94 204 470 193 65 -577 -466 -378 -176 -25 308 519 350 65 -356 -44 -420 -322 160 219
1103 219 363 428 151 -366 -594 -266 -410 133 66 225 128 -25 -146 -652 -59 -336 -22 469 447 190 267 -231
1125 -231 -319 -219 11 491 515 349 26 -49 -363 -27 -292 -66 -303 468 259 93 169 -119 -356 -62 184
1146 184 11 519 104 99 -7 -376 -289 -299 205 -192 149 177 186 2 -570 -314 -239 168 207 331 242 106 -194
1169 -194 -257 -238 -348 37 -120 338 415 21 89 -283 -150 -57 155 -195 349 205 -17 -161 -150 -198 -337 93
1191 93 330 176 243 126 -278 -64 -429 -101 38 -30 138 329 -133 -96 -261 335 73 -50 416 342 396 420
1213 420 125 -80 -15 -299 -94 73 301 258 260 110 -61 -83 -225 204 169 81 287 -65 -188 -345 -119 2
1235 2 18 163 47 510 87 -97 -226 -177 -72 -150 103 322 194 -9 -18 -71 -166 -215 35 379 -31 30 113 -93
1259 -93 -172 -217 -193 44 79 140 65 15 -36 -119 -242 -247 -202 390 272 285 237 -114 20 -173 -210 95 106 431 288 186
1285 186 -251 -46 -134 30 145 269 118 21 101 86 -124 -215 -284 15 327 193 53 -165 -141 -136 -211 146 -54
1308 -54 23 15 22 -184 -38 227 -256 -164 144 49 274 103 -26 -60 -208 -42 146 193 220 190 265 -138 -146 -230 -306 23
1334 23 -80 119 102 100 -108 -76 8 -66 -4 -224 107 71 63 -97 -312 40 -156 -6 -99 209 128 30 311 -149 -18
1359 -18 -303 -94 -30 -70 -13 -71 112 -19 -79 -81 232 228 -65 -79 -114 -262 -250 -326 -158 -1 -282 -43 -98 98 62
1384 62 -287 -229 -175 -40 378 182 -102 172 41 -299 -97 148 100 18 -116 0 -10 -18 -126 70 -212 138 43
1407 43 -41 50 -110 -88 -91 -174 78 45 331 -52 200 -175 -121 -88 -8 -191 -39 165 25 -74 188 -3 -44 17 14
1432 14 -53 131 82 31 17 -210 -99 84 155 5 105 30 70 329 20 -179 -76 -156 -8 85 191 126 166 -181
1456 -181 -71 -171 63 285 52 -21 -104 -89 -78 44 -29 32 80 58 119 60 -140 -145 19 -21 170 -63 132 -36
1480 -36 -149 -172 77 -215 -22 85 197 30 -172 271 161 -25 -58 21 169 15 -164 205 -137 124 37 131
1502 131 -53 -34 -98 84 277 -33 -241 -5 10 -5 17 -125 -30 309 202 -202 201 -74 164 -176 235 29
1524 29 107 270 -38 17 -214 -58 81 -257 27 117 166 -199 -18 -12 -143 234 6 -31 193 -68 -65 75 118 -247
1548 -247 -54 331 -131 -57 225 -189 0 1 -7 98 165 -32 220 -141 188 285 183 -78 4 227 -36 36 316
1571 316 -181 -99 -57 170 110 170 -77 91 -18 -190 -178 20 -86 -161 115 -14 -54 -85 -133 -20 45 214 -89
1594 -89 110 -103 -55 -36 233 54 -58 143 3 -133 86 20 150 4 13 -122 174 -46 -4 152 -26 120
1616 120 -53 -26 -18 -109 170 -219 268 77 -7 -130 91 -64 -46 205 8 250 -89 174 194 1 -115 -142 -142
1639 -142 -58 157 64 47 12 -5 -76 230 94 -40 -146 37 -17 -88 -304 -93 6 233 -24 -140 229 -91 24
1662 24 -130 -66 75 -15 -27 -143 119 99 -107 4 -2 27 -43 84 140 -81 176 -158 -94 279 -15 35 -270 -8
1686 -8 103 -235 -78 116 -70 42 210 -29 87 67 -94 53 32 102 -342 215 138 -61 152 15 -282 215
1708 215 -121 328 -146 -185 57 252 122 106 -107 -175 -109 -121 -77 55 -59 161 -215 -233 117 101 -214 181 27
1731 27 -24 -209 231 14 -22 55 89 234 214 -74 13 34 -110 -121 -209 157 -408 -37 -54 -2 -67 -10 -126 128 -99
1756 -99 -26 -144 -114 -3 94 -35 39 77 -110 118 180 86 -38 -50 172 88 -163 -193 -75 116 232 -41 -108 -154
1780 -154 -171 120 66 248 7 -53 -58 16 -160 -54 50 -177 -79 111 53 -44 -90 -167 118 -155 -271 22 203 44
1804 44 -287 -193 -213 195 62 128 269 -150 170 -62 -13 31 -17 350 -25 -150 -85 166 -178 58 143 141 -117 -142
1828 -142 81 -48 -79 59 37 -107 -200 -61 176 108 75 -47 115 67 -217 -159 29 -140 -143 -12 -197 -137 141
1851 141 107 -40 55 17 -77 -30 -70 -227 -146 28 44 -69 -308 8 -62 -99 -6 27 -25 -312 -253 -59 -85 320 210
1876 210 221 42 37 64 -40 -267 20 255 -62 149 38 34 16 50 -280 2 -59 -62 -209 -115 -79 326 142 -33
1900 -33 -55 40 -6 28 241 44 19 162 -116 -128 3 -79 162 -104 -10 -6 124 22 -202 -43 30 -79 99 -147
1924 -147 -356 115 155 88 96 -12 222 2 -4 281 -120 -153 83 -53 -266 -123 -113 -58 14 -4 9 50 -141 17
1948 17 232 50 214 104 -121 -11 1 57 37 -264 -62 1 -143 -216 65 -125 106 -82 26 -18 -212 -19
1970 -19 -80 -53 -80 -106 85 -111 -62 71 15 -121 -12 15 -44 -89 -138 102 25 -86 179 109 -31 -33 91 217 34
1995 34 115 -46 -225 -151 16 4 -64 -50 -162 179 -56 -124 -22 -23 -272 12 144 -83 32 190 -6 372 -199
2018 -199 35 -125 -35 -14 12 -148 -63 112 -45 342 63 92 -158 179 77 -147 52 134 5 -57 55 246
2040 246 213 58 -20 -181 109 126 -53 21 -80 34 199 31 102 42 68 -18 106 182 -168 26 -99 113 58
2063 58 57 73 -177 -92 -288 -135 119 -16 107 -136 -126 129 35 47 10 66 -212 169 -13 -123 130 -22 165
2086 165 -463 184 -127 15 -98 -128 98 41 63 -46 86 -144 -303 -77 158 285 29 -30 359 -197 101
2107 101 36 39 76 -127 9 -142 -17 -95 62 45 -60 -379 -38 332 -236 -220 -69 -62 120 -275 -242 109 103 23
2131 23 -221 -101 -145 -13 -7 -263 278 -115 -62 -118 -11 170 -68 -299 215 33 87 -104 -223 -17 -80 -85 18
2154 18 214 216 -115 13 210 120 -116 181 17 -100 12 145 -202 -227 -45 -38 177 -136 151 -154 65 66 74 61
2178 61 104 172 -164 64 -157 -116 -67 -127 -121 -251 94 42 -83 114 142 97 -85 95 -179 -83 18 343 -118 -88
2202 -88 -118 -233 -113 -129 -78 -81 -54 71 -76 157 -90 -109 136 107 -116 -64 33 14 156 -291 -110 85 26 9 -50
2227 -50 -308 -51 66 -264 77 -104 230 -113 -256 -130 -245 -252 55 -47 -30 151 -168 88 60 83 23 -341
2249 -341 198 -62 251 -95 -96 -186 -36 -258 -281 70 179 -288 144 214 118 -274 -100 242 3 182 18 55
2271 55 23 -268 132 -53 -104 -33 134 -265 -78 -15 -3 -7 22 138 20 -17 -166 82 183 45 -263 -200 14 -207
2295 -207 26 7 51 25 -136 63 -88 148 -43 69 58 -25 144 -86 39 -129 -87 19 91 236 63 -9 -109
2318 -109 115 39 -160 -127 -80 -10 -12 -126 -37 -98 -98 -94 -19 -23 61 -57 132 101 65 -49 -177 -63 -171 37 132 7
2344 7 48 22 -28 118 -96 27 8 -157 -107 -29 -68 -232 -52 300 97 -136 -107 31 172 236 -253 -72 56 13
2368 13 85 107 -83 -82 -83 153 45 102 187 167 -111 12 -285 -52 -301 -96 101 -155 29 207 45 -231 -78
2391 -78 -95 -93 -197 31 -182 105 -234 30 23 181 -119 130 230 -183 -12 -123 -48 87 -54 89 -158 99
2413 99 -154 -5 -41 -199 -8 71 193 -132 -151 -17 3 -14 25 -132 -154 82 121 44 -159 -213 -341 72 -88 42
2437 42 -94 -177 88 91 -114 -43 142 -86 33 149 143 117 261 3 -33 -83 -23 -147 224 -76 -30 -100 24 -32 27
2462 27 156 123 -14 120 -55 -72 202 55 -154 155 -71 38 284 212 -79 -54 83 12 95 67 82 -54 -16
2485 -16 36 -26 95 91 -154 48 94 9 298 -104 138 -152 56 159 127 -81 62 -93 -59 -11 -154 -95 28 215
2509 215 -34 -30 -280 -161 -219 -110 143 -103 233 -154 152 -75 6 -70 -80 96 -59 -83 -66 -54 148 13 60
2532 60 93 26 -137 20 -19 -187 -46 -119 21 -80 85 -49 -22 -52 7 -162 -67 -135 -228 -224 -150 141 20 33 69
2557 69 87 -66 110 -68 -69 -40 17 -274 -52 -168 -121 131 206 88 -137 -23 57 -94 152 19 -91 -126 -55 60
2581 60 200 -43 -124 -2 -147 29 -89 95 -293 102 -159 -193 82 -145 -16 86 123 63 -95 -193 -184 36 -143
2604 -143 -224 198 -157 -103 103 -21 295 117 32 -284 -129 -5 55 161 30 -38 60 81 -178 79 -86 14
2626 14 91 26 14 -146 -81 -93 -62 115 -86 28 33 281 13 -77 127 22 86 -149 108 38 123 61 -58 -87 -22
2651 -22 -299 332 216 -145 -87 -66 -3 -96 311 -169 -77 76 34 8 115 -51 -368 -149 -67 -172 233 167 -156
2674 -156 -175 -103 -111 312 -111 -15 15 179 -95 -79 102 -219 -159 166 -329 84 -101 -202 129 -68 124 -94 132
2697 132 -40 105 -37 -295 62 -176 98 -12 60 -22 -201 -82 27 -133 -339 -154 -104 -25 327 -247 -5
2718 -5 -18 -206 -168 -347 -79 -67 243 102 -108 -31 72 -182 68 151 56 180 92 154 -60 133 105 39 -65 -154
2742 -154 144 152 -111 -135 128 12 19 -63 165 86 -51 11 20 -110 -175 153 -60 -14 151 73 -190 -219 -13 329 209
2767 209 -249 -145 23 51 0 25 31 42 -83 49 225 -48 -200 30 -11 -105 47 209 0 113 280 -87 28
2790 28 44 -84 343 -32 -147 98 -58 34 27 -79 70 -70 103 93 -48 -11 179 22 -94 -170 122 -124 90
2813 90 259 -123 45 -92 -86 -20 -22 148 -24 258 27 221 104 47 194 187 -133 -208 -29 -72 -230 70 8 29
2837 29 -172 -23 -63 -132 110 201 204 297 -221 -102 87 143 151 87 -146 -215 147 115 -48 5 44 22 113 -77 -199 10
2863 10 40 -271 77 -139 -31 11 -85 161 79 98 -60 -86 -12 -12 229 14 178 -312 0 -138 146 -13 218
2886 218 137 -115 -82 -154 -60 151 0 -76 -103 53 -4 4 197 144 104 80 72 10 255 -153 -26 -155 -113 -128 18 0
2912 0 -110 41 170 83 28 139 -85 -315 -77 35 79 -120 104 -81 129 147 -67 149 -86 -215 80 47
2934 47 205 -99 -269 202 -172 -132 148 -102 -72 156 -221 -188 -149 -48 79 53 -185 -134 -57 133 161 -94 238
2957 238 -135 -74 78 -22 -55 32 74 -74 -168 222 61 25 -238 113 97 14 -55 119 174 -141 -81 -117 -114 -95 86
2982 86 -163 -210 -62 309 246 22 47 142 22 -104 365 -82 357 -168 142 255 89 -87 -14 -7 -112 93 112
3005 112 9 100 200 -32 -17 -48 143 247 85 -3 -83 -3 -201 -233 -147 -51 -63 77 61 -58 -71 -107 -131 287 -98
3030 -98 -164 24 -62 56 -165 -80 18 27 180 44 -124 125 121 5 -186 -90 -4 59 -169 83 -67 -68 109 166 54
3055 54 15 -33 -69 169 -88 89 -8 -129 -93 -161 -19 28 -149 -123 147 250 -63 -166 -62 -167 -56 90 -45
3078 -45 39 -7 239 -158 152 -3 -106 -72 9 -45 -248 -66 256 101 -78 9 -38 -81 128 215 -130 61 -28 18
3102 18 108 145 -34 -248 65 -5 -62 -165 152 221 -151 -50 -13 2 162 30 9 55 17 -279 -103 100 -62 317
3126 317 119 -52 56 -178 147 -38 -94 -119 -96 138 35 32 -237 -96 -11 -64 36 1 140 -79 104 -15 118
3149 118 -177 80 10 -129 114 111 201 241 -60 282 97 -63 -25 -5 138 -184 -45 -50 -111 29 116 3 97 26
3173 26 -288 -183 1 140 169 15 78 -163 160 147 76 35 88 -343 -231 1 -226 -37 -80 40 40 25 227 -218
3197 -218 22 197 150 114 -212 227 -198 -238 -62 55 57 -84 -44 -21 -118 139 -42 -20 199 182 -149 -177 -22 -150
3221 -150 -39 168 -139 -30 88 169 59 163 5 -60 94 -65 -33 -63 243 -137 -109 -29 15 87 17 155 -38
3244 -38 -29 -68 54 -37 65 -78 -6 142 -97 70 -91 141 -96 -91 -72 -98 258 -25 -49 -367 48 -29 -19 -97 -240
3269 -240 116 230 -70 -42 117 -124 -249 -55 61 -12 178 29 -19 -69 -188 10 -72 2 -76 98 247 -58
3291 -58 141 117 101 -122 -42 -39 -25 244 -143 87 189 108 19 88 29 62 -201 -2 -13 -103 -192 26 -97 160 57
3316 57 -285 126 -89 92 179 37 13 10 228 -3 -39 -39 129 119 -94 -134 122 -100 -151 243 39 131 190 150 -240
3341 -240 -155 30 198 78 -87 60 -54 -3 -175 -110 125 211 -20 52 174 -328 57 64 22 117 251 -2 -169
3364 -169 -93 118 -118 -3 -102 -72 285 -71 40 159 -117 54 236 -242 -11 15 -15 -116 -347 168 -72 -94
3386 -94 -183 92 13 94 214 -23 -112 101 186 35 -109 201 120 -6 -94 65 74 45 134 -41 62 31 183 -114
3410 -114 104 -148 -64 60 58 -56 81 -15 -49 -39 147 112 -157 45 -140 144 -212 144 -36 175 186 231 140
3433 140 91 72 14 99 -157 256 -285 74 128 61 -72 119 324 -86 -177 45 -46 71 -104 -286 154 247 -117
3456 -117 -28 45 73 -2 123 -55 50 -51 -55 101 178 117 -115 3 -183 208 52 136 -212 34 -105 -203 -71
3479 -71 -134 -247 -207 76 -60 -53 160 -15 -134 -84 87 -84 119 148 17 -16 324 -6 -32 -206 42 -18 -91 -14
3503 -14 175 -50 59 -38 94 -101 -105 221 -28 125 -93 28 -98 41 82 -117 174 -165 -5 190 154 -44
3525 -44 96 -106 -123 -51 -1 -27 -67 -199 163 -226 103 -44 172 -178 222 -128 295 -1 149 167 167 258 33
3548 33 48 101 -102 -41 76 77 461 -13 85 10 -87 -124 -89 -264 -145 -296 162 -67 -80 -138 -183 -52 15 33 -41 -69
3574 -69 -188 -209 76 -74 140 -175 -168 8 -210 25 -75 25 143 138 207 -75 -14 163 -173 252 41 -97 142
3597 142 177 -65 345 -46 -115 -111 3 -71 -36 -22 -94 -51 -142 -198 -46 -59 -21 -155 31 -232 8 -103 -21 -48 -37
3622 -37 -137 164 -15 -154 -43 145 126 -78 -73 61 -149 89 8 31 -372 -140 -24 -53 -160 -5 -9 17 -1 -25
3646 -25 -33 -310 -66 122 -191 -44 -288 116 -51 -114 307 58 28 137 9 -174 -76 200 179 3 131 -152
3668 -152 -244 -89 104 242 186 -43 28 -90 -196 -66 146 -64 -14 -17 156 -164 -208 77 -122 119 -10 79 164
3691 164 71 134 -77 -157 145 -200 -28 33 -307 -199 -11 -47 -333 -208 -8 -177 74 8 -179 -108 -126 -77 -73 -17
3715 -17 -305 -115 -73 -141 -118 -81 41 -42 -280 -146 73 -102 169 17 146 -258 79 -29 -4 -186 34 43 97
3738 97 151 21 -145 57 -24 -261 19 -1 -78 113 92 83 78 186 50 -112 69 88 236 -178 91 -12 27 155
3762 155 -47 249 -130 -98 91 -70 144 21 40 94 102 168 22 -275 156 -34 -160 -111 -79 169 98 -88 -123
3785 -123 123 -68 -107 -59 -208 -196 -133 138 313 69 -142 162 57 -11 5 -112 2 92 -38 208 -63 -131 -72
3808 -72 -126 -36 24 59 92 55 89 -281 -185 238 -57 -98 -96 201 232 264 -119 -89 -179 -88 -225 -116 137 -119 -38 288
3834 288 101 -143 57 -13 -131 500 -13 108 29 -4 64 220 -145 101 198 -139 -18 1 10 131 -36 -223 -163
3857 -163 -57 86 214 -40 19 -82 -205 -87 163 75 -81 -77 24 85 115 245 -54 -133 117 136 10 2 -13 171
3881 171 146 -38 174 -1 88 -145 146 -53 19 -170 -24 -175 22 -71 -201 -9 -245 121 143 -29 120 170
3903 170 186 92 100 106 -42 -157 -80 5 -112 -59 -150 -73 -91 -124 -58 115 -58 -14 -79 48 229 -179 -7 206 87
3928 87 -42 -6 -230 -56 192 221 -98 -8 148 -174 69 -250 -126 110 -179 -14 -72 54 240 -250 -201 -123
3950 -123 81 171 -172 1 -172 4 196 -95 39 -215 -249 228 162 -90 181 -167 82 -185 98 -20 242
3971 242 222 -84 134 -39 186 -213 65 -261 6 44 54 25 -289 -85 18 -23 -207 -238 -31 58 247 -16
3993 -16 72 -199 127 -3 67 69 -57 -132 -84 47 -99 112 176 65 -398 269 192 16 -204 -216 -7 -268 76
4016 76 1 196 -107 168 30 -39 322 -369 -98 12 -208 -61 58 3 35 70 -64 27 -55 -9 132 87 47 153
4040 153 -69 -177 -167 190 -37 -52 -183 43 47 41 -83 -24 -78 -243 116 56 -74 -32 83 -342 -160 -106 -267 222
4064 222 -38 -230 337 215 -101 131 -70 152 -236 119 59 255 -92 -233 -83 -108 -59 -13 -102 -78 -73 137 145
4087 145 -49 18 -156 -107 3 -147 54 -7 85 123 -9 88 -53 80 -21 61 -63 -78 39 29 -166 153 136
4110 136 -125 -110 0 19 259 -25 -107 -63 -234 29 -326 -8 106 -102 83 -115 -2 38 -12 250 259 -14 9
4133 9 177 96 -1 -25 135 -253 13 159 37 65 69 95 130 94 -171 158 -228 -139 -65 -126 -73 57 -68 14 159
4158 159 -285 119 22 52 27 179 -47 -167 -65 -15 101 38 98 78 124 -86 69 80 -106 225 -15 228 102
4181 102 -110 16 -136 -7 287 147 120 -100 -105 233 -38 -135 -331 222 -251 4 19 101 -109 134 -10 148
4203 148 26 -51 51 172 -263 86 -103 6 -101 -89 -45 -90 78 -19 73 143 -9 -145 -208 -81 127 -135 50
4226 50 167 188 -145 121 -97 14 -168 198 10 -4 51 50 173 -142 -12 151 20 31 17 -106 215 -111 39
4249 39 -89 -424 70 -212 -47 -171 -144 -221 109 205 -13 12 -100 137 69 182 15 -152 -109 17 17 -9 22 -3
4273 -3 -214 -125 -88 280 -92 -49 -83 -174 35 286 -2 143 -115 157 141 -237 -128 50 -34 -105 136 124 -165 221
4297 221 136 -62 -209 117 -67 206 -71 -141 -73 -26 182 -107 -206 232 -1 -90 145 6 213 -224 7 90
4319 90 -153 -101 177 66 -60 -473 25 -208 -233 -222 68 190 52 -57 41 -144 -280 4 -28 -245 60 47
4341 47 8 183 -176 -69 97 -374 -148 38 -101 -171 -16 241 -92 187 63 -16 215 -189 -58 76 87 -2
4363 -2 -23 42 54 -47 225 -314 -335 -100 164 154 279 -275 -142 72 -59 97 233 -28 -108 62 108 -193 49
4386 49 -1 46 40 298 57 236 72 -293 24 23 -232 24 99 88 -68 66 -25 17 -35 -185 -110 162 -65 48
4410 48 99 -78 12 -177 -72 115 139 -106 -154 212 104 -33 -152 -122 133 149 64 -66 105 -74 12 -10 -105 72
4434 72 -89 -174 129 170 -36 165 -14 -197 47 -89 -132 195 136 124 -49 40 44 192 -243 105 -12 113 79
4457 79 -36 168 -83 -412 -67 -41 -102 130 220 -156 -13 -226 66 160 -47 -169 69 85 -281 338 -229 49
4479 49 -135 -162 0 162 -116 39 -43 52 -98 19 -148 -176 -182 254 -26 -153 -9 -85 75 -189 128 232 31
4502 31 -130 61 51 -132 -3 36 46 3 127 81 22 329 17 25 -308 15 -258 105 -190 -105 -33 301 -134 -207
4526 -207 -148 -55 -194 -331 -217 80 77 -233 -257 -65 -271 -115 25 -336 20 -187 -98 -56 97 -2 42 66 -53
4549 -53 -118 36 62 -12 -72 45 15 -322 -17 -4 23 45 -399 107 201 112 111 17 159 131 104 18 -167 -299 -119 163
4575 163 -113 -339 -163 -192 107 6 -164 116 -226 -68 31 113 172 9 -7 156 -150 23 263 -46 17 0
4597 0 21 -151 70 -43 111 120 209 29 -79 55 211 165 -30 -43 18 -62 -202 101 97 -113 286 174 14 -12
4621 -12 138 -351 207 -147 -37 -139 -184 -184 -196 239 -230 -136 134 -20 139 -38 65 -24 -74 -36 16 -49 44 226
4645 226 -40 -202 -289 42 88 -146 -151 -30 182 -98 186 153 -74 2 71 -126 -61 36 -19 55 321 222 166 28
4669 28 60 -158 60 -169 189 268 16 1 261 -75 -120 14 -141 -141 72 -176 23 121 -116 46 -13 86 -112
4692 -112 251 22 66 -188 0 80 219 -119 -175 -123 160 -193 100 -81 -151 -131 81 37 114 -234 47 -182 -89
4715 -89 183 155 -186 126 121 -108 16 -43 79 36 -101 -121 0 -256 -48 2 70 8 -96 -131 28 -126 114 -122
4739 -122 57 -56 22 97 328 55 -131 -47 -123 -309 -64 177 -25 -123 186 -155 -88 26 -35 6 -34 -74 -8 -126
4763 -126 187 -23 -127 -23 -19 -85 -150 -7 -15 168 -140 125 64 -254 -48 -223 140 41 31 69 -102 -176 -72 39
4787 39 226 -153 141 -1 -7 118 -54 86 54 79 104 32 -159 -210 -292 3 315 -21 -222 167 126 -168 162
4810 162 37 201 -50 229 60 12 112 154 -119 124 232 18 -143 29 82 11 -17 -154 -57 -128 -17 -141
4832 -141 118 94 90 18 68 94 -34 138 -236 -8 98 3 8 75 -280 175 186 -177 -175 -66 -209 -182 186 -43 188
4857 188 87 51 -17 -12 -107 -165 -143 -294 132 31 -70 97 43 -17 -157 -7 -193 -300 -333 -23 52 163 191 247
4881 247 110 323 279 27 6 26 -97 184 -189 -18 96 163 -30 -23 23 -133 -105 122 -92 -35 56 -144 -2
4904 -2 139 -243 163 -129 63 296 111 -6 -7 19 -166 -13 -1 -38 -121 -13 -45 -50 -10 19 271 -223 -159 -40 -211
4929 -211 109 -33 80 96 97 -188 25 134 43 -50 -97 96 -33 -208 107 42 78 -157 -116 72 102 97 -57 91
4953 91 -55 27 -199 -52 60 54 -151 112 -20 -283 -174 63 61 -142 91 -132 -8 -150 -71 -343 -138 -14
4975 -14 60 141 132 123 47 77 143 86 -37 -140 -183 -60 279 55 106 226 -52 -134 -44 -35 -216 100 61 -46 3 -199
5001 -199 231 194 -102 227 25 21 -119 51 -177 140 147 -118 -163 -56 94 -256 39 -151 150 2 9 137 -181
5024 -181 128 105 -20 119 -69 22 -61 -51 -12 71 -15 -38 -139 105 -73 74 325 58 190 -122 -104 -145 -58 -241
5048 -241 -142 -74 -26 71 -61 -87 -295 67 217 36 -103 -141 188 -152 227 237 66 213 -117 -121 180 -232 -179
5071 -179 199 45 241 -140 -10 -13 -153 -178 292 -266 18 143 -159 -228 -70 314 43 152 -30 -27 16 -28 -244
5094 -244 10 -150 -208 29 -33 -61 40 -116 139 27 -169 -12 -209 -254 -57 -55 -25 38 -48 -87 117 -16 265
5117 265 -3 -57 -100 52 -38 9 -38 -126 -100 172 -10 68 -295 11 212 294 -116 328 338 239 78 -104 209 -190
5141 -190 -55 277 -125 144 230 18 140 93 -59 -122 -300 -176 -27 -208 -111 -213 64 -61 -36 0 -187 -85
5163 -85 -97 -292 76 33 -137 -58 144 -177 23 32 -150 7 -27 -93 158 188 198 -25 19 85 204 144 -259 144
5187 144 8 -113 137 -35 231 -25 -64 117 -42 141 123 242 -53 133 143 -115 -51 114 140 93 -33 -124
5209 -124 -12 -69 -100 153 -70 -121 164 311 -19 113 -52 -79 85 80 95 53 -40 150 135 3 -83 -171 242 -109
5233 -109 66 114 -99 80 83 -19 147 -2 316 147 -210 172 99 214 68 -49 254 -129 -52 -4 97 -175
5255 -175 -296 -199 174 -163 -166 9 85 -39 138 -70 -29 98 77 11 -74 65 21 140 86 6 -122 269 -82 193
5279 193 206 -160 243 -23 -143 -135 -143 116 -169 22 -91 45 105 265 113 -213 168 162 -98 248 -72 -172 -59
5302 -59 -220 113 -94 38 101 9 96 75 -157 28 52 -127 332 532 -143 -22 69 -185 223 -157 -98 174 24
5325 24 -118 -132 -114 -84 -102 -206 -47 -63 -191 13 280 -1 -32 65 155 -157 27 68 -69 8 11 69 -72 208 -299
5350 -299 13 -48 13 263 148 -193 137 -42 237 -181 -42 -55 123 -117 115 -119 -100 40 -209 83 -18
5371 -18 -37 -99 79 -23 18 -167 60 117 -119 231 22 81 216 100 -149 -27 -27 88 -44 -85 29 -186 -343
5394 -343 -62 -101 -145 121 -269 266 98 174 -80 -185 230 153 -12 -59 -225 84 -104 4 38 188 75 318
5416 318 169 -98 -17 28 -182 -23 -1 -111 118 5 -20 5 92 -83 333 -3 -66 223 -15 152 12 54 -274
5439 -274 214 -264 -11 -37 48 177 -133 -14 -79 -29 -62 82 225 -8 -236 10 131 174 188 167 -17 -3 -200
5462 -200 -88 -176 -169 -93 343 -151 228 -15 123 137 -63 -313 -151 44 -263 -53 86 -180 258 -131 -133 -165 -96
5485 -96 245 -44 52 9 23 -156 67 193 -110 -90 88 -122 261 -3 135 -239 -22 -278 -313 171 -151 -91
5507 -91 -173 -140 31 248 -104 -162 22 11 -224 51 359 78 -29 -20 -58 241 199 -71 -125 -49 32 8 -36 307 315
5532 315 -195 -72 -41 -80 42 95 60 -7 -22 183 25 109 -62 -77 -135 -50 -36 -30 -156 197 -88 -189 -75 -106 -160
5557 -160 85 296 -205 21 98 -69 88 120 -67 179 299 113 -37 -154 160 -71 -138 275 59 -234 -197
5578 -197 38 -108 180 -136 -268 -58 191 5 200 -79 127 1 -237 27 -64 225 -148 165 57 31 239
5599 239 52 -35 55 -151 -39 20 68 -139 32 -350 152 24 44 3 -106 -47 -113 -12 74 -225 177 32 -155
5622 -155 127 55 281 18 61 -67 -86 -127 131 145 198 -83 -56 38 -112 -277 258 -75 -141 216 -122 -160 -21
5645 -21 60 89 173 -187 72 248 -109 -289 -281 -64 -253 -368 69 -108 -83 259 317 33 -114 -78 -60 70 35 -48
5669 -48 -177 -172 -183 -54 -166 -68 -155 63 -153 150 226 36 -266 -74 -154 26 273 244 -219 144 -13 359 239
5692 239 176 65 45 14 -69 -55 -138 -135 -60 -84 111 -88 21 36 166 42 -84 302 -55 -66 54 192 -139 157
5716 157 -50 164 39 -135 -14 30 -150 3 -33 -71 -27 -27 131 96 108 117 -72 171 -255 -93 102 6 135 21
5740 21 -134 208 -117 -187 -80 109 -118 23 99 11 -55 27 -9 -69 -146 31 -150 -61 72 -107 -253 -149 -132 168
5764 168 6 -32 -69 -99 47 183 115 -159 -309 248 -92 -73 -107 43 122 4 -53 -171 168 -167 -3 -187 -254
5787 -254 -9 -139 -138 34 -178 -43 -190 -146 -63 -78 -120 59 143 -44 92 85 -15 63 -129 175 12 205 -1
5810 -1 -130 -8 -22 219 1 38 5 -65 -6 96 145 -85 -123 2 245 -124 60 -32 34 183 1 -48 -102 38
5834 38 26 -24 95 -111 132 8 -82 59 88 109 125 318 395 224 42 -214 -112 -136 -47 -137 -140 -128 -48 132 -52
5859 -52 257 -114 -70 -26 32 48 -238 -49 -122 157 79 291 185 114 -62 -185 -143 21 11 -74 -24 -166 55 253
5883 253 131 58 45 126 121 46 -67 -124 -74 15 106 -70 321 15 222 114 -3 -129 -40 184 71 51 -160 -124
5907 -124 -146 -72 377 -13 398 93 -79 -138 -49 -168 -5 24 129 0 117 -250 -24 -71 107 26 154 76 -69
5930 -69 31 100 54 66 142 88 -147 108 -155 131 94 -17 46 22 -181 -26 5 167 35 109 -381 133 -92 116
5954 116 -16 120 -16 236 71 -180 153 -134 77 -174 71 138 127 -36 24 -70 -162 -132 17 205 -29 145
5976 145 -99 -2 -24 10 10 47 128 -313 30 115 77 -118 57 97 -100 13 11 64 138 -110 -162 127 26 278 160
6001 160 -64 -74 108 -87 -228 62 -39 -101 35 -241 -58 110 59 -155 -185 113 0 -62 -146 -294 27 -135
6023 -135 142 132 -2 376 -189 29 -17 -2 14 -99 97 -3 158 -86 172 -120 55 -98 -175 79 -152 170
6045 170 22 64 -51 21 -29 215 157 105 -16 -35 -120 -26 164 158 -15 111 -55 30 -325 -45 95 66 27 -236
6069 -236 -204 88 18 -101 159 -145 125 -33 46 -218 -55 -166 58 106 -53 -340 133 98 -73 -201 -232 14
6091 14 -22 203 6 216 -222 -50 -331 -194 -54 127 -66 169 89 10 221 -36 310 10 170 -54 -49 -37
6113 -37 252 -28 -59 4 208 -158 -70 113 144 7 152 -31 -117 -114 -126 -55 -327 -85 -54 -2 207 32 -50 -311
6137 -311 -69 -79 -43 -91 -149 326 -55 37 10 73 31 211 -65 -82 312 -68 123 171 -52 74 81 -252 11 178
6161 178 -116 -79 -74 -39 101 -199 72 -74 61 -217 -112 47 124 190 56 116 161 -22 -24 42 209 172 83 92 345
6186 345 352 -115 3 -35 74 -108 -93 -1 -271 -39 120 183 -26 241 -139 50 -13 -113 36 127 198 -120 64
6209 64 -68 -10 -284 5 -306 -95 -61 -189 110 244 102 24 57 101 -128 -244 99 121 1 116 -22 232
6231 232 -86 -226 -112 110 232 29 -112 -109 -34 217 12 84 -146 8 -185 -73 121 45 -100 48 -98 14
6253 14 -5 180 247 -8 42 -75 -109 156 -257 -46 67 -142 162 -139 -128 41 -33 10 -153 16 -18 -45 -77 158
6277 158 216 123 80 7 146 16 -301 25 180 -25 -29 100 -133 -32 -117 -125 85 -53 57 -107 -158 -183 -134 41
6301 41 -84 -23 -10 -26 149 24 184 -182 105 123 -243 -9 86 110 -184 15 186 -95 90 -67 99 -102
6323 -102 -117 -72 -84 -134 125 93 -6 3 -207 199 68 -15 -284 33 271 30 16 78 -1 45 -112 77 -99 48
6347 48 -140 200 159 160 48 14 87 -225 65 69 -215 68 100 -23 48 -67 -85 -50 63 61 115 -110 -87 133 258
6372 258 29 -260 -16 298 80 -15 -99 131 -323 102 -46 13 -91 -112 13 174 215 -261 99 202 -139 164
6394 164 -18 -168 82 -69 142 15 44 91 -121 -141 -119 -158 -23 207 79 -156 82 -30 84 -199 -254 -56
6416 -56 -80 178 137 -77 -23 189 -159 96 379 78 -3 273 58 -101 49 68 -142 -4 -307 -126 156 176
6438 176 19 47 166 150 -101 -234 10 102 73 -36 193 149 121 196 53 48 206 -10 -7 -204 -127 54 76 -214
6462 -214 118 151 -70 -14 -178 -29 -149 -17 110 -3 190 6 23 1 -12 135 -174 -56 -43 51 61 60 -70
6485 -70 -39 -150 102 31 115 -93 -76 192 -60 75 -248 13 -40 282 114 23 83 -163 155 64 -96 -26 80
6508 80 135 1 63 -55 71 194 112 -73 -95 208 33 150 -98 50 -130 -136 145 242 49 -191 78 -224 67
6531 67 59 229 -84 -14 71 -148 -75 204 -5 13 85 -203 19 -110 -117 67 358 40 -52 -12 -139 24 -24 13 -167
6556 -167 -199 -41 -396 31 -7 -160 44 213 82 -182 -120 176 222 -259 -70 -144 169 162 51 -184 -200 135 97
6579 97 -64 -198 65 -61 245 -6 97 -18 7 119 -120 204 -3 41 51 108 -15 -40 106 -39 -287 108
6601 108 -258 76 -48 -4 61 10 -91 130 -74 40 144 138 -187 -101 -198 187 -95 -157 13 198 181 -82 199
6624 199 -76 -241 -13 22 121 -52 100 -67 -94 142 49 139 -44 -30 -89 -101 225 -116 6 92 106 130 207 -60
6648 -60 -80 -31 -10 -170 -36 -42 194 110 55 102 -54 48 47 63 119 159 -5 151 -56 -197 114 211 -10 -153 -140
6673 -140 -167 54 120 -204 70 132 -115 -9 -15 -119 151 -156 -244 -12 -11 65 -266 -48 22 89 5 25 259 110
6697 110 -235 30 -4 42 75 48 -22 127 -371 -277 46 -38 -137 -4 113 235 65 106 -354 200 -226 58 -95
6720 -95 -30 50 7 -132 257 219 -63 107 -217 -138 4 -78 75 -74 -18 248 55 108 100 -91 -63 52 -52 -100
6744 -100 -33 -122 54 -127 120 218 131 -82 118 -29 29 -82 -179 13 -120 37 -64 -122 291 -58 -205 153
6766 153 -85 84 215 46 296 -25 -162 -74 -132 -123 -200 51 13 -92 226 134 -380 -21 135 -235 74 -1 24
6789 24 -70 194 75 40 83 11 -279 -1 249 60 88 133 177 -50 169 35 137 162 253 52 51 7 119 -484
6813 -484 85 -4 -37 109 83 6 15 30 -107 -12 17 222 -194 -169 193 -54 -180 7 9 -22 116 86 13 -5 15 80
6839 80 -137 -79 -90 7 19 103 97 222 84 -313 -19 6 66 -87 -34 -38 7 -35 -36 140 -105 18 -169 -143 -181 -14
6865 -14 18 -227 67 -225 -91 70 -376 -52 25 98 -124 165 -142 -145 -193 -80 -63 30 111 59 -54 -191 292 73
6889 73 -279 -163 80 -171 -109 171 82 125 2 22 -478 60 9 42 92 -261 -205 -39 -115 -39 62 -146 -218 -92
6913 -92 -34 19 157 -91 7 92 -155 -170 -67 -5 -59 -14 -124 -234 -88 -15 -86 21 -212 -4 15 19 -39 -18 16 174
6939 174 169 -137 77 -34 129 -50 93 104 81 50 -72 173 59 -112 175 59 57 -99 232 99 -31 25 90
6962 90 -43 78 146 307 132 -197 -43 -17 -177 79 -228 146 -43 34 37 -314 62 212 77 -157 136 5
6984 5 -49 -101 48 -1 -30 319 -288 -29 -104 -58 31 88 159 -1 141 150 -105 171 281 -92 102 -60 162 54
7008 54 -77 -162 -336 -25 191 248 -266 178 -117 -175 45 -120 194 -132 -121 108 161 -81 -160 -188 -70 49 23
7031 23 49 -98 -37 11 -254 -227 -161 -110 -71 113 -82 78 -48 49 58 -253 -90 -247 -165 106 -13 93 149 -34
7055 -34 -244 95 306 -158 -48 -60 -180 105 237 3 -9 -6 -261 43 -71 15 -22 204 27 156 7 77 -191
7078 -191 -56 -31 69 36 -240 223 -61 -151 32 278 80 -110 -286 -291 220 -127 -148 -252 141 233 208 -34 113
7101 113 33 -29 101 206 -21 -97 -147 152 156 200 -185 -320 63 -178 48 -106 196 -101 150 33 -186 129
7123 129 142 79 156 -28 247 59 10 127 -237 -114 -98 8 255 293 -10 118 -51 77 31 11 -93 -76 -48
7146 -48 -67 61 -229 47 230 -46 37 16 -88 116 209 51 -50 331 -34 -105 -63 -93 52 -136 110 134 174
7169 174 77 -12 -45 200 -130 11 -200 -300 53 -2 82 105 204 -113 20 -137 55 17 -92 -83 -53 143 11 164
7193 164 -26 -67 1 146 -58 133 4 150 -185 113 -58 37 -196 -20 -118 -143 -153 323 -164 -70 -75 48 108
7216 108 6 -65 143 226 -130 139 119 3 83 116 -14 -103 -181 -169 118 231 133 -90 166 28 -103 -185 1
7239 1 120 52 59 -19 -30 -180 -75 -199 6 -171 46 186 54 -85 -279 -21 229 -175 -233 33 -79 -167 -113
7262 -113 15 -132 151 47 -220 -89 113 283 -71 167 -32 -70 -399 -45 -202 124 74 -26 87 103 80
7283 80 -99 -265 6 -99 88 121 29 -72 -89 25 179 30 -56 -12 -297 143 133 145 -46 41 -185 -218 -33
7306 -33 -50 -147 40 -42 192 -50 137 -114 159 -77 -10 123 151 8 -147 185 3 -214 -8 -78 -52 -93 5
7329 5 188 145 144 58 68 76 -45 65 35 -445 -57 166 98 209 -3 138 -145 108 -78 361 300 -87 154 66
7353 66 -16 87 -21 118 106 -199 -162 -198 -203 120 -14 121 -218 16 130 122 108 7 -51 -195 140 -28 -96 -2
7377 -2 155 125 136 -69 -5 87 273 -29 -109 113 -47 -6 -302 63 48 -35 146 -236 280 -74 -415 72 90 183
7401 183 68 145 -14 174 -21 -53 187 -140 42 132 267 -46 261 139 -30 193 102 -131 -149 -22 -188 -143
7423 -143 -24 41 8 -251 59 94 -172 -16 96 22 -21 -130 150 220 87 174 -96 112 -54 -245 56 43 305
7446 305 30 288 122 169 -94 64 11 7 -279 -15 -112 -128 125 142 55 54 78 -23 223 83 -141 -182 52 54 100
7471 100 76 -191 113 86 150 178 -103 -32 161 -134 20 25 58 -211 -1 76 258 46 -95 -202 0 126 -13
7494 -13 117 -110 -63 166 -18 -170 -64 -205 -30 -104 102 -52 103 167 141 -211 -273 482 13 74 249 -92
7516 -92 -83 79 14 109 -122 215 -1 -1 194 -9 134 -85 205 -172 -103 168 -115 62 7 70 -128 74 -130
7539 -130 -161 -40 -20 -79 -33 84 -110 -66 209 3 -69 -11 178 83 5 94 -165 54 110 208 -216 52 27 -127
7563 -127 -46 -95 -70 -61 0 -33 225 -5 39 -147 -63 80 149 -21 147 -129 -113 110 -128 9 148 149 -296 2
7587 2 163 55 279 186 -71 -40 -195 -79 110 -48 -45 -132 35 25 202 -40 -226 79 268 215 -172 -75 -24 168
7611 168 -37 -183 87 50 -99 132 -242 43 71 -177 -48 -72 -271 -262 145 -12 -162 -79 18 -41 39 98 94 -117
7635 -117 -1 -120 111 -162 90 234 184 57 -228 38 -116 -247 -151 331 17 -54 186 -61 142 62 -121
7656 -121 105 -33 21 229 -30 121 53 -95 -19 27 -112 -199 36 -37 189 -222 26 70 9 39 192 202 52
7679 52 58 -220 -103 100 -232 -427 -175 -3 50 -116 -254 208 177 -16 -9 107 77 193 -113 -114 -87 -46 -48 73 63
7704 63 21 -44 -189 48 71 -217 -54 -72 -220 49 -169 -231 -54 246 52 225 -192 101 122 45 -1 -112 335
7727 335 -18 102 194 -40 -158 -129 -30 103 -74 16 156 317 -84 -92 28 -210 39 208 -149 155 119 94 -188
7750 -188 -100 -121 246 -8 57 -107 19 -96 -155 -257 -99 83 -84 118 168 -67 -18 94 22 139 49 -40 -20
7773 -20 193 60 -147 -44 11 -334 1 -11 177 107 11 -143 5 101 -152 12 90 -12 207 -82 17 -38 -74
7796 -74 103 -50 -70 60 102 -180 -83 -58 -194 -60 50 5 -65 -54 -160 18 22 -285 -182 303 -28 -24 -34 189
7820 189 1 117 19 -101 139 93 -12 44 -3 -62 -33 -59 -183 95 -25 -149 -5 17 90 159 76 -76 -164 210
7844 210 258 -108 -219 -47 -233 -108 84 -50 -108 40 118 -263 -94 0 128 286 401 -132 -164 105 41 195
7866 195 -30 -228 -58 163 -205 -108 144 -97 -244 -5 -37 0 -107 61 -114 80 244 108 75 -99 25
7887 25 61 173 117 70 -16 -25 -157 160 46 -176 -89 -217 335 -34 25 33 92 -22 -49 -12 -137 118 121 -110 249
7912 249 -61 -156 164 45 219 -42 60 24 -19 -157 208 190 -147 197 95 -76 -183 44 -142 -12 -14 -30
7934 -30 -154 312 -120 -231 134 99 149 -137 -244 46 -250 119 54 111 16 249 244 61 -188 30 47 -136 -141 -81
7958 -81 -122 273 -14 218 69 -81 19 -33 -8 236 -29 -124 127 -98 171 25 -20 -146 -108 53 91 -54 212
7981 212 27 7 -23 -227 100 -136 98 -78 -16 -3 -86 -120 -161 -126 -38 -19 14 66 -136 -16 -51 -67 -101 -24 -67 -16
8007 -16 5 129 -289 -158 346 88 -123 -132 279 85 -61 38 -8 -52 170 90 15 187 188 85 44 137 -240 -143 51
8032 51 -130 35 85 192 132 -30 21 65 -67 -75 -75 97 201 32 -91 100 62 148 -104 -5 -160 52 -82 -14
8056 -14 172 -37 127 -71 48 -38 -105 2 160 -137 90 177 121 184 9 -38 -11 198 51 68 -166 39 296
8079 296 30 362 -116 -463 -12 92 -109 -51 38 132 131 -180 -10 363 139 -219 -215 -39 -276 190 -31 -71 148
8102 148 -152 -137 -354 133 149 -180 127 -8 -278 -110 -68 26 5 124 43 31 -166 10 -89 -57 18 26 -9 -54 -41
8127 -41 -249 -134 169 30 141 -14 71 -80 -86 -257 -93 44 108 124 101 -113 -58 81 261 219 -2 3 197 -21
8151 -21 -122 4 183 -116 -136 -139 -55 31 -178 83 -269 131 -20 -10 -67 18 153 35 -138 -33 -49 99 121 64
8175 64 45 95 -63 -97 97 56 205 201 -5 -90 304 -2 151 -251 14 39
8191C9
$$ Imaginary data points
##PAGE= N=2
##DATA TABLE= (X++(I..I)), XYDATA
0 0 0 0 0 0 0 0 0 0 0 0 0 0 0 0 6 -8 8 -8 8 -8 16 -16 17 -24 24 -32 34 -40 48 -55 63 -71 82 -93 104 -119
36 -119 134 -150 168 -188 208 -231 258 -287 317 -349 386 -426 469 -517 570 -628 690 -762 841
55 841 -931 1031 -1143 1275 -1427 1609 -1828 2095 -2435 2882 -3499 4407 -5896 8898 -29908
70 -29908 112130 80129 -22056 69535 -23517 -129302 -130842 -179423 -131023 47729 47628 26625
82 26625 70231 -27450 -107432 -62184 -121797 -95483 103770 124815 53300 111389 57149 -60934
94 -60934 -37194 -38683 -35975 106285 144365 81415 108432 54248 -70791 -47634 -31294 -57893
106 -57893 50096 119009 49836 34451 4248 -92373 -95808 -78563 -83140 19346 78532 6453
118 6453 3435 4735 -101020 -120803 -60282 -46489 13151 77824 41046 25192 20989 -62693 -84885
131 -84885 -22744 -1360 40579 98019 70651 45330 37980 -38233 -70700 -8987 17473 33841
143 33841 81710 71363 32658 10335 -48948 -78659 -29692 -1481 10091 52148 49409 5735
155 5735 -20487 -59392 -85477 -48424 -11817 7753 42375 41043 2477 -18324 -46058 -72413
167 -72413 -41239 6501 27483 47225 51061 22582 -5536 -31967 -49393 -23507 18056 38608
179 38608 53034 53795 26342 -5587 -31386 -44469 -24027 13038 33231 41634 40643 16979 -18107
192 -18107 -43730 -48124 -29645 -1257 21589 33724 28737 5631 -24855 -45565 -46024 -28812 -2836
205 -2836 23769 36728 28221 6887 -17399 -36713 -36681 -17992 5469 30447 43644 32297 11405
218 11405 -9807 -29745 -30405 -11109 9307 30212 42417 29516 7489 -11176 -31025 -33540 -12771
231 -12771 6183 21669 34232 23368 -417 -17823 -33981 -36649 -15593 3178 16400 29507
243 29507 21028 -3417 -18877 -30766 -32983 -13144 7479 19578 31134 23918 -371 -14131 -23266
256 -23266 -26656 -8336 13709 23004 30844 25720 1903 -14309 -20342 -23217 -8180 13477 21914
269 21914 26559 20675 -1324 -17159 -22933 -25234 -11560 10502 18338 19603 16248 -3306 -20977
282 -20977 -25021 -23596 -11568 8904 18161 19282 14706 -2857 -18480 -21086 -19921 -8267 12959
295 12959 22347 19680 15826 1550 -16042 -19708 -14383 -3945 12425 22817 21018 13556 -668
308 -668 -14781 -19223 -15585 -4961 10643 19576 16911 9807 -3001 -17537 -21958 -15795 -5463 7720
322 7720 16992 15693 6614 -4860 -16336 -20956 -15073 -3408 9407 17422 16289 7569 -3524 -13131
336 -13131 -17810 -12144 -81 11687 18063 17098 8904 -3064 -12302 -15324 -10906 569 11826 16691
350 16691 15323 7191 -4949 -13618 -16295 -12244 -378 10039 13192 12392 5433 -7364 -15645 -16123
364 -16123 -11421 -1311 9049 13111 11470 4913 -7250 -14025 -13575 -9334 279 11025 14254 12224
378 12224 5924 -5423 -12608 -11089 -6411 1346 12069 15185 11467 5244 -4902 -12539 -10716 -6384
392 -6384 887 11033 13193 8859 3215 -6533 -14286 -12371 -6675 -156 8673 11468 7536 1434 -7027
407 -7027 -14687 -12073 -4855 733 8322 11887 7739 1749 -5991 -12878 -9787 -2685 2419 9251 13260
422 13260 9269 1961 -5491 -10660 -8508 -1865 3200 9084 12934 8316 877 -5911 -10794 -9002 -2667
437 -2667 2457 7595 10222 5891 -1201 -7227 -11446 -10152 -3786 2158 6734 8845 5387 -1011 -7137
452 -7137 -10761 -8693 -2317 3750 7782 9070 6231 251 -5830 -9205 -6686 -275 4756 8528 9454
467 9454 6059 170 -5922 -8619 -6225 -904 4034 8094 8335 4497 -1237 -6682 -9329 -6595 -1854
482 -1854 2858 6849 7127 2707 -2251 -6859 -9279 -6569 -1611 3053 7447 7389 2485 -1770 -5407 -8215
498 -8215 -5116 98 4030 8084 8119 2685 -1330 -4519 -7366 -4389 1336 4338 7294 7648 2457 -2344
514 -2344 -4888 -7381 -4833 1005 3168 5829 6913 1146 -3796 -5223 -7552 -5307 599 3156 5049
529 5049 6396 1400 -4054 -4774 -6200 -4908 1381 4302 5479 6963 2059 -3727 -3919 -4758 -4370 2043
545 2043 5073 4969 6042 2367 -3989 -4618 -4494 -4297 1417 4938 4046 4712 1762 -4489 -5350 -4571 -4257
562 -4257 533 4520 3315 3978 1697 -4737 -5252 -3756 -3891 554 5326 3928 3530 2292 -3784 -5255
578 -5255 -2654 -2523 1054 5642 4627 3163 2306 -3115 -5092 -2629 -2217 822 5556 4224 2257 1752
594 1752 -3364 -5666 -2916 -1805 -89 4607 4349 1384 419 -2937 -5581 -2798 -1405 421 4417 4406
610 4406 1385 531 -2539 -5238 -2857 -907 867 4274 5069 1461 331 -1958 -4814 -2718 37 1251
626 1251 3971 4798 1463 -283 -1804 -4544 -2922 47 954 3391 4232 878 -1098 -2224 -4478 -3229
642 -3229 374 913 2680 3939 1123 -1507 -2315 -3880 -2929 276 1599 2525 3821 1515 -1424 -1910
658 -1910 -3349 -2558 477 1985 2822 3579 1857 -1236 -2339 -3155 -2654 255 2168 2699 2995 1431 -1232
675 -1232 -2458 -2472 -2331 371 2090 2273 2682 1018 -1378 -2704 -2798 -2158 290 2043 2455 2304 881 -1492
693 -1492 -2579 -2468 -1777 282 2115 2480 2333 706 -1030 -2305 -2335 -1353 223 2165 2840 2163 544
710 544 -1346 -2470 -2240 -1321 342 2007 2498 1838 359 -1220 -2144 -2270 -941 456 1964 2440 1798
727 1798 402 -1191 -2305 -2256 -1143 407 1927 2358 1501 219 -1239 -2005 -2211 -867 670 1887 2320
744 2320 1349 -35 -1197 -1947 -2221 -775 600 1791 1945 1251 -34 -1411 -1821 -1629 -1102 383 1828
761 1828 1963 1388 -16 -1342 -1798 -1806 -475 931 1920 1847 1170 -72 -1183 -2151 -1755 -389 756 1875
779 1875 1551 884 33 -1204 -1821 -1396 -494 805 1542 1682 746 -50 -1322 -1907 -1480 -553 831 1910
797 1910 1608 581 -468 -1156 -1897 -1361 -405 600 1619 1573 796 -112 -1263 -1603 -1432 -205 763 1440
815 1440 1751 376 -600 -1101 -1611 -1269 -129 716 1352 1390 499 -423 -1340 -1501 -898 -203 717 1390 1086 553
835 553 -318 -1192 -1135 -1069 -6 616 1263 1167 261 -729 -1137 -1247 -885 -242 880 1287 1074 369 -458 -1057 -1384
856 -1384 -865 -35 1193 1313 1088 382 -232 -958 -1167 -577 80 802 1096 853 289 -412 -1082 -1051 -666 171
876 171 706 1132 841 301 -573 -1173 -1359 -557 40 581 1498 927 45 -701 -1108 -993 -179 77 956 1412
896 1412 989 151 -310 -941 -975 -395 134 819 949 737 92 -405 -1293 -1101 -438 124 918 1122 598 88
916 88 -698 -1011 -819 -289 348 705 913 459 92 -591 -886 -1008 -262 286 779 775 761 -133 -605 -889 -994 -232
938 -232 434 465 1047 531 -229 -471 -691 -670 -205 426 582 753 293 -114 -392 -744 -605 -298 300 643 698
959 698 866 -191 -584 -704 -704 -134 565 897 768 383 -58 -627 -891 -551 -316 456 223 684 466 -129 -543
980 -543 -702 -539 -118 366 747 551 299 -264 -753 -664 -637 106 275 856 658 243 -330 -458 -615 -312 -305 513
1002 513 578 510 292 -251 -515 -792 -189 98 286 556 517 345 -332 -309 -770 -145 232 304 725 631 515 -385
1024 -385 -339 -496 -318 107 662 489 665 77 -101 -626 -357 -67 61 294 615 508 50 -347 -444 -377 -540
1045 -540 212 373 678 355 79 -449 -547 -437 -355 34 342 526 398 60 -425 -498 -418 -359 235 344 458 374
1067 374 -396 -255 -705 -344 -100 78 71 292 472 -76 -237 -743 -392 -84 156 393 374 266 82 -401 -488
1088 -488 -283 25 144 354 790 129 -16 -141 -467 -131 -97 126 383 419 522 -141 -111 -416 -312 -330 153
1109 153 98 244 198 83 -271 -411 -457 -36 -5 280 558 93 -189 -496 -450 -181 40 405 436 459 184 -48
1131 -48 -586 -455 -232 -151 316 82 185 20 -123 -656 -437 -42 -157 143 528 38 231 -185 -282 -434 -110
1152 -110 -10 280 372 302 260 -218 -283 -322 -264 266 261 194 196 163 30 -90 -247 -161 -240 353 99 341 -153 -74 -339
1177 -339 -236 -313 90 -41 -33 366 73 -170 -488 -102 -221 76 375 102 113 154 -279 -303 -212 -157 -196 123 292
1200 292 112 121 -229 -442 -509 -204 96 163 228 328 -64 -35 -220 -279 -356 136 183 135 258 269 -216 -229 -202 27
1224 27 -51 145 187 101 -329 -35 -414 -261 64 -112 182 205 262 158 -181 -105 -303 -254 -188 290 342 385 -33 -245
1248 -245 -481 -114 -63 84 361 233 221 -91 -314 -25 -183 -55 -26 154 395 -202 -181 -90 -192 -168 -38 4
1270 4 72 348 142 75 -304 -266 -100 -135 -39 269 102 299 64 -336 -168 -205 -91 -124 172 -83 -182 -296 -71
1293 -71 -152 -150 -33 70 309 273 175 49 -90 42 -126 -162 66 71 526 -25 158 52 -215 137 -88 4 279
1316 279 112 73 179 -81 -296 -79 154 175 413 207 141 -198 12 -298 -187 51 56 415 140 24 -142 -205
1338 -205 83 -63 -2 -163 -28 103 229 -164 -46 -111 -135 -70 44 -50 -2 93 -268 -22 -253 61 -103 171
1360 171 479 -78 -138 98 -91 -35 1 250 187 39 59 139 -12 89 -114 -105 129 63 -24 299 43 92 -11 125
1384 125 -80 219 49 43 -2 -83 51 -246 -373 87 140 -66 272 295 110 -207 -104 -9 132 114 -5 48 4
1407 4 74 15 93 -200 -166 43 -18 298 -36 -124 0 -312 -75 263 -105 31 -84 244 161 25 -246 29 -62
1430 -62 148 93 104 218 -37 -241 -69 -182 -123 143 -62 193 -18 -297 -158 -148 -139 29 256 131 -108 9
1452 9 216 -291 180 11 -188 -27 192 129 -48 277 -120 -247 -184 17 -199 181 97 284 465 -93 -116 97
1474 97 -14 77 -127 265 -55 -201 28 -48 -14 19 83 -125 12 111 -17 -145 60 -47 228 17 -42 -300 -65
1497 -65 -161 -181 -328 -2 43 -32 297 75 20 225 54 -119 -212 -45 43 -172 163 33 -80 -216 -26 -37 -321
1520 -321 104 296 190 -143 162 193 -261 -124 104 67 143 35 241 -19 -112 -20 0 -6 -123 -25 141 -35 -24
1543 -24 -150 174 127 -219 -25 -33 -122 71 -82 -280 20 -91 9 38 -230 -22 189 -260 -155 -55 189 86
1565 86 28 285 198 177 9 120 -70 -116 15 -262 -5 127 181 -52 -10 201 -33 -42 -29 82 -25 -74 7 -16
1589 -16 9 325 -178 -14 52 61 -51 306 -147 -7 260 132 -31 -20 98 54 182 160 -143 103 -94 18 48
1612 48 -18 47 -170 127 73 0 -152 -253 -249 -104 134 8 -178 -206 101 -72 1 57 95 65 -4 -10 -76 146 -8
1637 -8 35 110 274 193 -31 -62 -221 -204 13 -53 96 95 -152 -8 4 -31 -52 213 50 91 159 62 18 -294 80 4
1663 4 105 -100 -44 -48 188 27 142 155 -104 -13 96 -5 -27 36 188 -2 -40 -183 316 156 56 -189 -48
1686 -48 -35 62 -242 155 -162 -186 -89 -187 -60 16 -293 -23 -62 -84 -84 -34 145 -115 -168 69 189 155 177 -155 141
1711 141 63 -52 233 1 49 74 106 -175 26 -55 -3 -19 145 110 363 -38 -262 -133 20 157 -13 197 -93
1734 -93 196 147 -117 -104 31 29 -313 204 -2 32 67 -82 43 112 -40 -52 -198 1 -234 32 -183 -110 -242
1757 -242 163 37 -27 145 -28 -91 32 238 -88 175 -91 9 -120 16 -78 -13 85 -5 152 133 -220 -141 52
1780 52 -105 40 -105 123 112 100 -136 -136 33 43 -231 -146 12 123 -12 30 381 -64 -8 -74 -136 -21 30 -44
1804 -44 62 12 176 72 95 -23 61 -20 -220 147 143 -29 -204 196 49 99 -30 -308 50 155 61 -35 133
1827 133 115 -107 -88 191 -115 102 -142 -61 233 42 -37 62 165 -118 -67 49 -54 -55 -58 52 13 274 7 2
1851 2 174 -28 -173 -126 -236 104 24 -124 -74 163 272 81 -36 -47 55 -269 -132 1 13 -13 168 80 -151
1874 -151 107 -243 119 212 25 144 -207 -17 94 37 -38 164 5 -18 137 -69 187 -57 -71 -181 29 -64
1896 -64 -164 -238 -120 127 30 48 30 101 -147 -249 9 43 113 -89 119 185 0 16 19 271 -129 -130 -131 84 259
1921 259 -5 240 151 132 -96 241 109 173 253 -237 -61 -34 -315 -388 39 -116 45 260 -24 4 -161 -214 64
1944 64 -80 -73 -83 -12 -19 101 -63 -148 8 -174 17 99 159 20 -55 249 78 254 -74 117 85 -209 91 118
1968 118 277 287 -167 -126 -56 -199 36 28 82 81 155 -89 117 -221 208 -112 41 96 109 82 49 131 77 -72 124
1993 124 99 175 -124 18 188 -154 81 80 114 -133 98 -142 192 -7 -97 -26 78 -36 -60 -94 161 -21 196
2016 196 68 8 -149 -20 -77 -83 -136 160 -103 -151 49 -144 -65 -290 36 72 -32 -71 219 -202 -110 1 153
2039 153 16 168 -1 39 86 266 17 -213 -32 -137 -213 -5 -122 -167 -258 98 79 158 60 1 -141 -166 -87 -136
2063 -136 -61 -56 -220 -3 160 -42 144 236 -252 56 -87 129 -137 132 59 207 98 -31 104 -59 123 -123
2085 -123 -190 34 111 140 179 9 -177 -143 82 -185 -30 -182 -269 -12 -217 269 -53 -23 -15 111 -75 -106 -222
2108 -222 88 36 -172 -60 -262 314 -332 161 72 221 118 76 -270 -312 -58 -80 38 -277 44 -325 -141 71
2130 71 125 -23 91 214 -44 39 -8 -52 -193 8 -121 86 -96 51 -83 99 -30 115 -224 179 -368 90
2152 90 -47 50 32 84 18 -81 141 -72 47 100 -88 -117 -53 -49 185 66 76 121 17 94 83 25 84 -62 -4 88
2178 88 -249 43 295 -51 49 -106 133 -4 -60 109 -84 -8 187 52 11 196 39 -362 288 157 66 -16
2200 -16 4 -39 53 -282 80 132 -14 -75 -141 -80 -15 106 -113 176 -51 241 -48 105 -19 -301 -59 36 192
2223 192 217 -15 103 75 26 -93 110 43 147 -6 40 30 -200 3 48 35 -131 202 185 -212 42 -174 -137
2246 -137 -147 19 151 61 69 -132 172 -11 68 -39 -186 177 12 26 66 -68 -273 -150 106 169 -23 17 -8
2269 -8 97 -207 132 301 -103 101 -51 -87 56 -84 -315 -122 -34 72 -104 27 25 64 -85 153 305 8
2291 8 -230 43 96 -109 48 184 -128 -44 52 -215 130 -168 199 -121 -41 80 188 160 -84 -113 -154 -212 262
2314 262 -62 -77 79 29 55 204 -34 265 3 -114 97 73 204 -26 -41 -9 35 -28 -51 62 10 -119 -43 -151
2338 -151 -107 -199 191 -41 240 -152 89 56 -49 -21 -272 -77 -44 -42 117 -143 -108 52 -344 121 91 -7 -59 298
2362 298 35 -289 85 91 98 -129 -17 137 -139 -86 31 112 79 -88 43 -162 35 -180 36 -5 169 -276 196
2385 196 46 -114 79 -14 -275 -17 1 -79 -63 209 -111 -118 -43 186 -44 -137 245 -83 234 -110 -127 -111 159
2408 159 -178 -92 -113 -32 -82 -41 115 -121 -78 -170 299 -19 39 101 117 5 -31 -222 113 -107 56 221 -83 -20
2432 -20 262 265 -126 17 20 -78 -167 215 -129 -245 -200 83 66 -106 1 -5 -131 -12 -37 -91 -212 -244 111 -120 139
2457 139 71 -129 -69 62 95 -65 130 99 -90 8 -114 -83 -35 127 -44 100 -170 -95 -143 47 176 -280 -27
2480 -27 -2 33 114 -18 -39 65 -55 -60 -164 -193 191 -183 -123 10 -218 -27 83 -158 -34 5 79 -190 -53 39
2504 39 4 -33 -201 248 -23 59 -175 71 244 -287 83 21 6 -103 -196 -12 -5 -217 68 113 199 200 -273 -99
2528 -99 -10 -54 -141 -114 57 -57 162 -246 -76 64 121 -250 23 -4 69 87 -202 45 38 57 73 36 33 -75 31
2553 31 -92 48 223 50 -21 -109 -232 -92 32 -268 -212 -134 47 -224 98 139 -153 -236 -155 13 229 -51 -194
2576 -194 -29 98 112 213 34 58 -22 -185 25 -24 -23 2 302 -37 -71 -208 -94 134 93 212 -115 90 387
2599 387 10 -169 45 -37 10 21 -196 374 -10 3 7 -55 -200 62 -21 -36 49 -130 104 -305 -23 -178 70
2622 70 -201 162 -84 -177 -5 -287 -150 -103 220 -174 109 14 -22 56 399 -160 -103 -58 84 13 102 -51 279
2645 279 -24 74 11 -70 14 5 4 145 -235 -230 -29 -169 -45 27 40 -45 136 143 81 -63 -265 75 34 -16 197 33
2671 33 146 -11 -55 73 -89 160 17 314 111 -94 227 25 21 -231 79 87 39 107 161 25 69 -100 -250
2694 -250 -47 48 141 -60 53 149 77 -2 108 9 6 16 311 236 -32 -201 2 -87 154 56 -23 128 72 167 1
2719 1 -34 162 64 174 84 161 -159 50 -38 207 -26 174 -106 26 2 22 55 65 379 14 -96 -331 226 45
2743 45 26 102 -111 222 216 -214 125 -15 -99 -123 -70 -107 28 -124 194 214 -168 -88 234 -71 -125 2 204 -36
2767 -36 29 -76 140 0 202 -154 127 304 -81 -238 197 80 107 -134 7 150 -67 192 83 262 -277
2788 -277 64 -26 -174 86 -108 9 -94 7 -11 -264 -262 -310 -164 174 -182 -167 62 53 78 33 -42 -394 197 -199
2812 -199 -29 -36 98 198 -149 55 -112 -11 -51 63 195 102 0 -90 160 100 75 88 -175 91 -68 -66 110
2835 110 -69 -71 -143 189 163 -11 139 210 94 -49 27 -128 -67 29 -94 -45 -289 9 35 -70 8 -225 17 89
2859 89 47 273 35 3 -210 -7 -278 33 -104 -175 38 -156 -86 -52 170 -220 -167 229 122 174 -6 -18 320
2882 320 17 -106 -254 -86 235 16 86 342 121 -193 -65 103 -43 139 9 56 -26 28 124 -145 110 182
2904 182 -80 -121 203 58 25 230 22 36 117 -111 86 -17 -21 -170 -14 -153 86 -80 -74 46 -393 -95 128
2927 128 68 -264 49 102 375 74 15 -272 82 -190 -103 43 -246 58 -143 197 -130 2 90 84 -47 17 -79
2950 -79 -155 -321 -4 56 3 -106 42 43 112 -147 -26 -15 71 121 -235 -100 67 -18 -58 23 5 62 -5 259 -57
2975 -57 84 9 -10 193 -108 -388 -102 6 53 102 -30 42 -12 180 55 -131 -12 29 -82 -81 64 -117 135
2998 135 240 -142 145 40 -232 42 148 98 68 -155 204 68 -96 123 -1 -36 -100 -68 31 7 0 -40 173
3021 173 -96 126 116 76 57 -32 -127 -7 81 18 -68 87 2 15 -130 -53 173 88 -111 -135 -121 -98 18 103 16 7
3047 7 -198 -38 -30 -188 -56 113 379 96 -72 17 -97 72 72 167 219 -103 271 91 -37 -32 5 -151 -354 15
3071 15 -28 317 66 -34 -36 -98 38 -255 -21 24 99 231 -29 -148 99 56 -278 -16 -334 134 -3 -63 -103
3094 -103 65 -122 131 -288 -87 -80 -72 121 130 345 -47 25 -300 -198 -25 -325 -85 276 -243 -110 -21 -39 87
3117 87 40 56 -101 38 203 67 111 130 -195 -180 -133 164 -13 -125 169 -77 -54 -40 120 250 129 -180 -376
3140 -376 121 -73 72 -35 -88 -64 258 11 -64 264 -74 -122 221 -88 95 -73 -166 99 38 -122 162 -28
3162 -28 -143 -13 -130 16 -42 -74 126 176 71 265 -193 68 92 157 -25 -50 -194 -183 -115 -116 11 -234 8 69
3186 69 227 81 38 61 -140 -8 15 -192 -8 -37 -257 -159 -53 177 -118 -281 -45 -76 -10 47 -91 -145 -26
3209 -26 -82 -144 200 212 12 -124 298 -40 -95 -128 -224 -14 190 -91 50 -116 -3 -109 -134 -188 -39 -188 42
3232 42 49 -92 -129 84 140 95 -91 -170 156 5 43 -241 180 53 -105 41 138 55 44 53 -95 -115 96 -41 -159
3257 -159 59 -145 -88 86 -189 97 -32 193 86 -22 -133 -178 173 115 123 -78 246 -15 -102 42 -111 -10
3279 -10 307 127 16 -84 161 -44 -51 -36 167 -170 -11 -275 82 215 83 -38 168 -106 32 84 73 130
3301 130 197 -164 45 -151 -18 -42 56 8 -7 -92 -33 34 13 -95 23 -84 321 138 -22 78 -47 135 -5
3324 -5 46 162 -250 39 319 -149 -133 138 -26 2 112 207 59 -257 24 -110 -207 94 -206 -222 60 92 -89
3347 -89 134 -15 39 -71 -157 141 -13 137 75 207 241 53 -118 -43 44 260 -199 140 -27 -131 -72 121 -171
3370 -171 167 15 97 -125 -30 -158 206 38 181 -79 178 -94 121 -156 5 -197 114 -91 102 111 -134
3391 -134 -78 -99 44 -17 229 -38 -216 187 18 55 14 -74 12 -223 -52 -10 60 160 140 220 64 -106 -99 -105 -117
3416 -117 -28 -376 309 17 -66 -138 -45 97 245 219 72 -25 198 -3 -45 -65 81 -94 -172 -222 86 25 101 237
3440 237 -2 78 -60 85 115 -215 146 -146 -231 -87 -174 10 -113 -110 -41 -128 239 9 -165 -119 104 0 116
3463 116 -186 88 -211 38 -46 6 0 54 -82 -149 143 -49 -157 63 249 -118 -1 -142 53 49 -45 -301 213
3486 213 58 82 24 186 -94 -164 -151 119 114 -2 -198 112 252 -22 119 26 146 460 -134 197 234 -123 -62
3509 -62 -326 218 1 135 3 -117 25 25 90 148 33 -7 -31 69 -19 62 -146 16 168 198 24 186 14
3532 14 58 -100 -156 41 24 124 -21 24 39 11 -1 -4 8 -134 -80 119 121 -20 40 -46 -29 -188 -317 112 -29 129
3558 129 38 61 13 73 -46 179 186 -249 29 -64 61 -4 322 -7 42 -55 55 -44 267 -37 37 -92 19 -154
3582 -154 303 86 -40 -60 -21 96 -88 -250 -53 96 -21 -206 -108 -74 -237 -29 -16 269 178 94 -143 -34
3604 -34 58 148 28 -13 173 -39 141 239 -63 -62 -392 131 -51 -72 -13 51 114 46 258 99 -11 -270 179 0
3628 0 69 17 1 -315 -119 -144 -10 -31 71 -17 17 214 -5 30 20 -72 -66 126 -68 -33 -63 -104 46 -11 106 -140
3654 -140 -162 -17 339 -35 -175 164 105 -68 -75 45 281 189 7 168 -1 -15 4 15 -6 -138 239 -152 55
3677 55 -126 -140 168 -135 28 53 -381 -118 -61 -6 162 -120 -146 32 81 -54 -198 65 -167 40 198 38
3699 38 -197 -65 -147 -135 325 268 180 328 253 -107 -81 174 -88 -128 28 -79 172 63 -222 -230 -55 80 -37
3722 -37 -14 -59 101 140 75 -36 -10 -289 138 -15 -64 96 153 26 -221 201 84 23 -71 295 154 165 -180 -57
3746 -57 -259 -44 191 19 -182 -72 34 55 -225 -95 -40 -97 -5 170 42 326 -20 -328 49 -103 115 -120
3768 -120 75 9 -242 74 -171 -37 45 -130 -30 -145 151 211 -100 -76 -24 137 77 157 252 -144 112 -24 -4
3791 -4 -177 -291 -90 81 162 -76 11 35 -41 -279 72 96 9 36 89 -41 -111 124 -33 49 -4 -63 60 221 -135
3816 -135 142 20 -46 -6 -56 170 -163 -287 -122 -417 -29 -14 -85 43 -60 -162 51 -33 -16 -58 133 -94 135
3839 135 91 -186 -227 104 -82 -44 13 20 71 -99 -9 -88 243 281 99 32 176 68 6 142 124 -154 -140 -145 -275
3864 -275 -13 54 3 268 175 93 -73 -15 196 -137 -59 96 213 271 -161 -39 15 -208 166 -93 -23 59 -29 61
3888 61 104 -7 149 -44 -46 -97 -270 -10 -146 233 88 86 107 -8 7 -93 -21 82 -20 20 -22 -43 77 -66
3912 -66 183 30 37 115 -171 91 3 282 -47 294 27 -246 177 90 96 20 51 -111 -15 116 188 -215 -26 -131
3936 -131 198 -67 151 -19 256 -80 -195 -98 -38 -47 144 154 72 76 125 -232 64 -23 -180 -348 239 51 36 120
3960 120 -38 170 -92 121 140 -251 -6 -171 64 -11 113 -294 3 -157 -41 -9 -97 70 167 7 -160 -269
3982 -269 120 -97 -77 114 -139 51 165 -43 22 -70 210 32 176 -56 173 172 -91 206 13 334 48 261
4004 261 56 -28 -4 123 -168 -292 87 -126 54 -85 51 22 -51 80 8 110 -138 -117 211 -162 123 -66
4026 -66 12 69 329 -24 -4 -182 377 -12 123 102 -61 -104 -92 325 -97 -61 -62 -10 163 -40 42 124 124 -92 -11
4051 -11 87 286 -295 -107 -124 -226 -397 -126 212 -41 -137 41 -78 41 -134 18 41 -312 84 -11 161 -14
4073 -14 92 -102 -4 -109 -11 -117 -135 230 -121 -335 -52 40 33 41 -18 -49 233 30 6 -98 52 -106 -214 37
4097 37 88 -119 57 -195 89 -319 -144 112 -137 64 219 6 -5 -242 181 -279 80 -142 76 147 155 139
4119 139 -14 62 32 119 -115 116 -127 40 -158 353 95 -80 144 100 151 -127 190 57 38 32 6 -76 385
4142 385 -97 2 -67 32 165 -75 8 -352 153 -183 109 212 39 97 -54 -3 -321 -24 -79 -47 -11 75 34 159
4166 159 -30 -12 330 -255 17 -101 -232 -150 30 -77 -168 -39 -21 -384 -45 -139 -197 10 42 -47 4 62 125 110
4190 110 76 24 -122 211 -42 42 -19 142 -71 -24 298 85 120 -113 -158 -245 158 68 -98 -66 6 -26 -253 71
4214 71 52 75 82 -176 -212 -287 -27 -5 -21 134 261 -85 -97 -157 -14 220 46 -119 -48 -300 -127 154 38 14
4238 14 128 25 64 -76 -99 -69 -35 -177 154 8 -218 85 37 -232 46 167 183 71 -15 66 -17 198 -112
4261 -112 -138 136 28 -110 -87 -148 -27 -48 62 -62 -152 29 87 103 86 139 -174 151 -52 -235 -116 -95 -104 -184
4285 -184 194 186 7 3 51 203 56 96 -6 241 1 -69 -68 -177 -3 168 231 57 78 42 -94 205 -69 26
4309 26 -151 110 -31 163 79 93 -9 -38 3 53 11 71 67 57 32 -187 86 2 236 272 28 208 13 185 -47
4334 -47 130 -73 -35 447 -66 -24 -53 139 -138 -28 58 -122 -180 48 146 36 118 -117 214 -281 140 252 -48
4357 -48 144 46 -8 -37 -2 267 64 156 215 -142 27 -58 -282 -29 113 -68 56 75 213 -184 58 -25 -46 157
4381 157 -145 -140 -98 82 -184 56 256 -318 225 -206 84 -57 -232 -29 206 234 222 -132 -181 141 -126 -302
4403 -302 -136 136 124 85 -24 63 -29 -339 142 -88 -45 -21 216 155 -85 -155 17 -30 153 94 -21 52 3 40
4427 40 19 166 88 271 -316 -13 -111 -53 196 194 -130 -87 95 -185 83 51 233 265 17 -26 -47 136 -95 -116
4451 -116 261 -200 -88 49 -114 115 -51 14 202 34 80 10 104 11 -53 -246 19 -45 49 72 263 11 -48
4474 -48 -29 239 -70 31 129 96 -87 -67 -61 -71 -126 -67 113 -36 -124 49 -107 276 91 -39 -41 109 -87 -253
4498 -253 96 -198 50 -18 -38 -275 -99 95 132 40 -95 27 180 -223 236 356 -159 -151 -207 -151 -38 -25 -260
4521 -260 -164 40 7 -87 310 -12 184 -244 162 106 68 -48 -59 180 71 -181 -306 -202 82 -61 -76 187
4543 187 122 216 99 116 145 -161 -54 177 152 52 -101 -89 -180 -205 -78 -136 319 -149 93 -105 138 212 -64
4566 -64 -212 -81 -29 -116 70 33 -16 -9 179 -83 170 -109 142 1 247 181 -205 -93 184 -166 -123 -40 115
4589 115 77 81 4 -45 -6 -19 101 142 -50 15 -60 171 174 -82 -140 -102 -151 -265 145 -93 153 221 44 -21 -132 -128
4615 -128 -89 36 296 -108 26 -47 -129 298 -20 64 208 118 -85 98 294 6 -124 167 28 -52 -109 108
4637 108 205 -8 95 109 -60 253 84 -118 75 74 22 -84 110 71 -58 -338 320 -75 12 -319 -94 75
4659 75 4 -272 394 190 -19 70 -48 -41 66 77 -58 25 -42 180 -224 -100 11 162 -48 20 178 51 -168
4682 -168 -110 186 -156 13 -291 -119 35 -166 -86 171 -67 -12 -42 -20 146 37 -149 -14 -83 -127 19 -91
4704 -91 -128 -220 60 -75 -119 54 -69 -53 11 96 -200 138 -64 149 55 -58 -68 -76 57 172 23 -63 -42 -151
4728 -151 83 14 83 66 10 147 319 12 -12 -56 119 28 122 -205 -85 74 11 41 43 99 48 -64 63 -157 -129
4753 -129 118 -366 -21 -4 46 -182 168 136 61 -152 71 110 175 104 98 112 42 -99 -131 151 135 -32 -16 112 -37
4778 -37 -111 -48 -130 18 9 51 11 -80 52 -245 293 317 -36 -114 -173 157 92 -64 -54 220 -19 202 -104 -33 39
4803 39 -126 -22 -81 -28 38 177 -24 80 37 -55 290 62 65 66 -39 173 19 39 76 -209 -80 -112 75 -133
4827 -133 162 -3 121 33 -155 15 -98 11 -14 -125 -184 -142 206 -29 104 198 -36 -209 -109 130 -320 -265
4849 -265 -85 -1 -39 -241 -93 -144 -102 -125 -405 -49 1 -134 -93 138 -106 13 -25 -71 -227 -2 -57 65 266
4872 266 36 -120 -39 -105 -64 -74 51 -71 -52 49 78 169 -166 29 -109 8 242 71 -134 -16 -149 -115 -4
4895 -4 80 301 126 92 -92 -266 -15 88 -98 -134 307 62 74 -423 -96 -171 -198 190 -171 -275 208 -79 201
4918 201 -152 -123 185 -79 84 201 34 262 -123 53 -217 -77 -71 32 153 212 -74 199 168 184 150 -259
4940 -259 155 -63 105 -84 -99 195 169 -83 67 141 169 268 -34 28 34 -162 100 69 111 -87 23 18 146 -155
4964 -155 105 148 29 -63 -34 -122 -1 135 26 145 -19 -203 -40 94 -168 118 -33 -398 -23 -116 54 -214
4986 -214 121 201 -65 82 -7 23 42 57 -17 66 77 -64 -180 -205 71 41 104 -73 -318 -23 -79 206 -90 178
5010 178 -158 152 -109 88 205 -62 -12 148 241 203 -59 198 93 115 173 -176 104 -172 204 233 317 65
5032 65 5 244 142 214 -121 72 57 -167 92 98 -77 -220 128 109 -114 92 211 -28 218 -11 279 -133
5054 -133 25 97 -89 -213 -230 19 27 75 -302 -121 -92 -173 -104 39 81 158 -93 -178 -66 -115 -88 -3 -282 -153 171
5079 171 170 30 124 -192 43 -31 53 196 -102 -43 28 -112 -237 -193 56 29 -168 124 -44 115 -225 258 -64
5102 -64 -26 -21 210 29 56 -112 -288 -187 67 -45 87 -115 -26 47 136 100 196 81 -23 -270 -32 111 -59
5125 -59 162 4 -222 -130 162 -101 159 171 168 137 94 -174 66 66 225 123 57 3 61 156 -259 54 -3 98 -282
5150 -282 181 69 56 -183 -187 -28 -101 105 102 131 140 15 -221 82 95 230 21 -8 216 -138 -153 -84 93 -98
5174 -98 -1 -15 97 245 62 -76 -30 213 -139 88 246 -73 142 -55 207 173 -4 -42 96 22 -197 -53
5196 -53 -121 74 87 23 182 329 -119 -127 58 215 -85 59 24 18 -53 -70 48 -32 -131 -74 -11 2 87 70 -185 -79
5222 -79 -155 -36 -65 50 77 -21 12 96 5 90 27 -21 85 100 -209 -191 -8 192 -93 68 161 150 -299 -126 97
5247 97 19 170 8 -270 -202 24 -35 9 13 -24 -54 183 216 118 -115 252 -343 132 36 235 9 96 30 30 265
5272 265 -100 133 279 -6 -5 73 57 113 10 247 -306 -155 35 -108 37 102 85 -31 33 -14 220 -38 19
5295 19 101 -56 56 18 82 46 -106 76 208 83 -56 66 14 3 -122 320 107 -122 -42 66 249 -2 48
5318 48 184 -216 -39 39 -14 139 -147 -107 109 164 -147 27 64 -3 36 131 -141 135 -149 0 -64 46 -54
5341 -54 77 -119 -152 35 73 -10 213 -41 32 -179 29 -252 41 -93 119 133 -36 60 -124 178 4 -50 37
5364 37 -11 65 -253 11 4 16 19 -103 206 -25 -192 5 151 312 -333 -76 -241 15 216 -270 83 -34 -71
5387 -71 -100 191 75 -127 -22 -234 0 -3 -168 -72 217 23 -37 110 250 171 139 276 108 -73 79 -193 -171
5410 -171 213 38 -200 -66 -99 -65 83 53 -98 131 -213 89 -96 -234 -75 148 -210 192 -14 56 180
5431 180 117 -107 54 -157 50 -67 -184 -144 63 -94 28 56 -184 -158 175 -227 15 245 -41 -135 37 210
5453 210 -256 118 18 -28 231 -29 -88 0 39 178 207 -78 95 140 -135 80 191 -100 21 -33 278 -334
5475 -334 96 105 -48 221 78 258 25 -45 197 69 -63 -143 -87 -39 -159 107 176 -117 80 21 1 35 27 -169
5499 -169 122 129 217 16 -66 -134 -55 75 -62 -45 215 -183 75 96 -30 18 -132 -12 181 34 130 246 372
5522 372 170 89 188 -153 57 -254 -169 -30 7 142 40 -70 253 35 -10 198 -100 -17 34 -46 213 -92 -102
5545 -102 113 47 -162 -190 -34 -167 -369 233 78 -39 -226 -8 -152 338 138 -86 -23 69 -40 49 226 -93
5567 -93 67 -82 -47 21 22 250 -59 -51 -114 38 54 -17 -172 -129 -32 -100 -246 70 74 1 268 240 33 70 212 -98
5593 -98 -92 -161 -61 52 229 -145 178 141 121 -47 333 -204 96 299 44 -241 -77 37 298 -24 -102 -46 96
5616 96 79 -273 -5 -287 110 22 65 252 -93 -139 -191 21 48 52 -110 -212 45 14 209 -92 -28 -276 -49 -58
5640 -58 133 -71 -97 58 151 -56 30 110 -104 209 18 147 -46 74 -47 40 265 240 -98 25 -57 53 70
5663 70 -12 36 90 35 -72 -310 148 -70 -30 141 -51 21 74 160 53 64 156 -136 -127 -112 133 -277 46 51 -13 78
5689 78 234 56 135 266 269 -48 1 16 37 291 34 30 240 100 127 -34 12 12 -28 -158 -153 -66 -42 15 117 -180
5715 -180 -96 147 166 -111 -216 -43 -11 -101 -117 191 95 70 -48 -10 150 -112 178 -182 120 -110 134 93 87 -139
5739 -139 12 63 -39 230 -81 -200 6 94 -5 -16 204 25 -165 -61 5 336 -83 154 72 -15 118 -49
5761 -49 399 -74 -157 72 1 182 3 89 -176 188 58 42 107 191 -1 30 -11 -79 -175 14 -209 109 446 174
5785 174 -315 30 -137 253 -244 121 83 28 7 -8 97 -210 -72 -109 -317 -177 201 69 -27 -17 -49 20 -109
5808 -109 -129 -88 122 -315 65 207 11 303 -18 251 312 -91 -15 -20 191 138 323 -53 15 163 -280 -110 -154
5831 -154 371 14 195 139 -177 -36 100 -126 -16 124 13 -132 -69 120 3 50 -106 119 -170 14 209
5852 209 109 35 -139 -50 -77 -54 -145 -21 -158 -81 129 -104 -49 -36 -138 -11 59 141 142 144 -175 265 285 128 23
5877 23 -192 -143 -14 -188 -34 21 69 93 204 33 -86 96 106 -104 -84 -171 -7 -1 -121 -65 -172 139 -112 100
5901 100 -52 86 150 59 -1 -202 -6 2 -144 77 -1 -212 -39 135 145 -212 128 -247 -56 -58 117 151 39
5924 39 -217 -188 -100 -49 -188 43 99 -79 127 147 8 47 -122 94 140 -35 -11 -144 110 -131 -157 17 -33 114
5948 114 39 -27 -203 109 170 -10 -40 145 -290 297 -147 -95 -1 232 94 -54 64 82 -24 196 -53 -108 230
5971 230 11 -67 36 7 -147 -21 -75 235 209 123 -147 -86 -20 115 96 -126 87 -12 91 -21 -165 -85 -189
5994 -189 264 -101 243 160 -343 -114 -2 -54 -110 -33 -19 -39 4 -13 174 -180 -83 12 65 -101 98 110 -116 253
6018 253 160 20 172 204 17 331 -147 203 74 133 -19 -184 -24 4 -38 -79 -450 34 168 6 96 7 160
6041 160 -52 -66 -232 257 -94 -237 -63 -75 -37 -32 46 -109 191 -159 -75 -119 -173 -181 294 95 136 40 -30 -36 -141
6066 -141 114 -115 -75 3 93 149 -25 110 -157 -165 279 123 98 -13 -51 -86 -27 -112 257 -43 212 30 -62 89
6090 89 131 14 2 -72 34 -194 223 -248 -152 -250 223 35 -443 107 -274 282 -87 141 56 -199 46 33 50
6113 50 134 159 -13 231 -154 58 -35 225 -9 -43 24 -146 131 -68 28 16 -218 354 113 14 94 50 -169 93
6137 93 -34 60 -92 2 -62 -141 7 22 -101 38 179 -40 -63 234 161 64 101 -65 -132 272 262 103 54 85 3
6162 3 -108 -34 -99 -100 25 -33 -302 -78 -40 -193 2 -61 -226 34 166 -257 -10 33 -222 42 -23 -21 -60 -305 115
6187 115 19 406 -223 109 59 291 187 -63 44 -55 75 -223 -58 42 142 41 72 398 54 -169 64
6208 64 -188 -33 44 11 -2 -70 11 -29 202 87 202 -24 -146 -120 24 -13 -117 120 -92 174 -135 129 43
6231 43 -22 -123 -128 -126 -59 88 -22 100 54 60 -248 -92 9 180 92 180 115 69 153 -235 130 185 -167 -156 89 32
6257 32 -115 -78 17 2 -87 -99 141 -23 -245 131 -7 -83 -174 -32 -8 101 238 -96 -80 19 -144 76 45 168
6281 168 194 272 -31 228 -25 164 181 -154 108 136 -161 -175 299 -134 60 79 192 -134 -240 -129 -52 -8 15
6304 15 -77 283 -225 42 135 7 -19 -102 -58 318 69 -102 45 73 278 -376 17 63 220 150 -19 -7 -41 136
6328 136 10 -13 -128 92 231 39 -133 -94 64 88 -157 -54 0 9 136 -59 24 72 99 89 127 -21 -78 -101
6352 -101 -6 -67 -55 117 -43 -38 94 45 -88 162 9 98 -205 53 231 -164 -43 133 110 211 -157 -74 -211
6375 -211 -118 -79 -6 -5 -216 -32 -219 -65 -55 -62 55 104 33 37 31 114 -82 -109 -170 89 118 -73 151 -127 96 184
6401 184 40 13 100 247 7 11 184 32 -134 84 -126 131 81 -4 49 -234 22 10 78 -221 -157 -15 20 160
6425 160 -110 145 -38 167 93 121 115 -25 -32 -164 -115 112 -150 -253 -44 -230 265 -128 4 -13 70 218 -99
6448 -99 268 66 291 211 -88 -127 118 57 -7 75 -74 -107 -299 72 151 -85 -52 -65 -146 -127 121 -191 37 -77
6472 -77 -47 -82 -24 -284 69 121 -102 -16 -37 72 -60 192 -53 127 -103 -195 11 -34 -29 -22 146 -324 -192 117
6496 117 37 -96 190 10 37 56 44 -130 21 -76 155 -22 80 315 -114 519 -72 -150 157 -56 17 151
6518 151 98 -102 206 116 -304 95 119 -169 158 76 -92 -99 115 177 177 135 -114 41 8 -199 0 -141 -120 -283
6542 -283 258 -38 162 -201 -104 -137 100 -4 -33 41 75 -67 27 275 -145 -3 59 2 22 -180 -171 34 -101 -95
6566 -95 -69 -183 -70 -60 79 -25 5 -156 139 -158 -48 -92 -166 -163 -35 12 385 -156 -44 295 43 285 -85
6589 -85 50 43 205 149 -102 100 304 98 -57 -342 21 77 -22 177 -111 111 157 61 189 -6 -138 226 -136
6612 -136 -70 263 -84 88 18 39 -193 58 138 286 -2 -60 -163 -67 -103 -160 -101 56 -172 -18 -135 -46 43 292
6636 292 -203 292 -22 75 -34 -235 -68 -139 -15 -63 38 293 134 99 -8 -194 358 60 39 172 -73 -90
6658 -90 -46 -274 -243 -70 -324 78 -65 213 139 37 11 108 -3 163 -2 12 -21 134 229 -92 125 -85 -220
6681 -220 15 143 98 1 88 65 -74 63 -255 0 -57 -62 -103 -18 -63 -58 106 -138 79 -244 132 44 178 108 -25
6706 -25 -22 129 -93 -48 -107 72 297 176 13 12 306 107 -16 -176 -85 -104 89 164 -198 -111 31 15 47 225
6730 225 -25 91 368 -43 -137 114 212 179 133 183 -144 -185 -17 -148 -279 -83 232 -59 173 -100 -16 72 277
6753 277 187 37 -36 -71 -89 -108 -83 -175 71 -195 93 -59 20 -241 54 144 -31 -202 86 98 -74 50 -5 -86
6777 -86 58 -42 -54 -37 119 -69 15 -79 -51 49 -27 171 106 48 313 154 -125 155 53 53 27 32 -113 -179 107
6802 107 110 99 -269 73 -183 -186 -88 25 -75 -250 194 -107 -167 50 -126 -212 -204 99 -145 136 170 -3 76 0
6826 0 62 109 203 78 91 69 143 93 19 -51 -27 -158 39 -69 6 -126 -116 96 156 54 150 25 -38 158 -111 36
6852 36 -17 -211 214 -29 97 -19 -67 -49 18 -170 6 -114 -106 4 -16 -58 -48 91 7 202 -141 -60 84 270
6876 270 -81 281 73 -95 221 -34 -66 -225 -162 -34 81 -118 -92 199 55 209 163 -206 -82 66 -52
6897 -52 -104 -23 -114 178 -6 -71 21 62 49 268 60 -3 -43 -98 121 110 161 88 -54 83 71 -60 -110 -71 -19 -128
6923 -128 -36 -208 50 188 91 -250 -247 -106 72 70 -65 -159 121 133 -81 -4 201 150 -14 178 110 120 -169 205
6947 205 168 23 -58 -57 100 -58 -163 106 28 98 62 -102 -50 -39 163 271 -44 -146 -26 44 -111 195 61
6970 61 98 243 268 306 -9 27 -71 -146 -145 134 49 -198 -133 -138 -78 152 41 -27 216 139 -232 -83 49 183 -109
6995 -109 43 50 -206 -215 48 -38 159 236 -21 -39 87 119 -143 11 55 -117 37 57 246 66 -8 -104 145 -154
7019 -154 314 98 -87 -24 59 -116 119 161 -105 193 -118 -76 264 163 27 -191 33 -26 -58 -28 104 -223
7041 -223 -169 338 178 -75 43 64 -62 -73 327 187 -152 50 -19 64 18 -40 -24 106 115 70 -2 17 85 33 280
7066 280 -213 -136 -36 -148 -290 153 70 -8 -61 173 45 32 202 362 95 130 240 22 75 -29 38 -19 -62
7089 -62 -196 14 -45 -23 69 -3 54 -140 -40 -95 -7 -12 -85 -76 -4 119 -156 127 -12 25 -51 120 15 -159 13
7114 13 -168 61 84 -17 22 114 149 94 -249 31 -32 225 -143 204 -41 167 -81 -91 1 -131 121 -60 -184
7137 -184 22 92 28 98 -133 -91 -47 159 -209 -11 100 194 92 -282 26 145 -40 -78 49 -171 6 12 15 -46
7161 -46 21 6 -178 147 -114 116 28 220 -84 -57 41 -74 -167 -164 -145 217 55 -55 -104 -159 -56 78 -148 -138
7185 -138 -10 191 -338 128 -72 4 99 27 -21 -46 5 -83 345 -102 -27 98 -61 -101 142 -6 -105 -96 185 26
7209 26 4 84 19 76 -28 70 92 45 -330 296 117 65 -81 73 92 -73 -172 -365 25 -7 9 178 121 86 -143
7234 -143 -375 131 -266 -112 46 1 109 208 -70 -98 -44 120 -85 154 106 -205 -205 -9 15 188 -251 188 -43
7257 -43 -258 -186 -247 105 280 -30 -56 121 -49 -102 4 45 63 117 -232 284 32 154 322 381 -138 -50 146
7280 146 17 177 -107 269 36 -76 -90 -26 125 -96 -84 -30 66 -96 -223 -115 43 -84 -34 -141 180 -4
7302 -4 55 252 -213 130 58 54 -20 -24 175 -64 4 51 117 152 153 25 100 -16 0 -259 -105 36 -155 10 -88 184
7328 184 -48 36 -44 199 143 -85 -12 98 58 -99 101 35 61 139 -83 319 -43 -247 81 -90 -9 -94 66
7351 66 100 -13 -152 310 -116 -66 -61 -366 59 -297 -137 -18 4 126 -8 188 6 -67 119 32 -35 20 -69 160
7375 160 -72 65 278 264 43 248 -75 68 -108 36 228 92 156 -182 -64 183 108 -71 -84 -59 80 -107
7397 -107 -9 -180 220 -53 -39 -28 -166 121 4 336 90 41 161 -52 -50 57 -59 327 -288 -144 -42 83
7419 83 44 135 -29 -13 -25 -39 154 233 49 164 89 105 76 9 -479 175 51 -41 -16 -44 -258 -100 39 -85 -138
7444 -138 51 18 98 -6 -104 108 -163 132 -103 -91 134 164 -55 -28 10 -83 64 88 126 89 -117 -25 -114 95
7468 95 -67 0 25 -1 41 50 -106 182 -45 -115 107 -35 38 149 25 -303 22 -270 74 -65 73 -6 35 -50
7492 -50 46 -71 -86 -33 -6 2 -22 17 -127 33 214 -244 -19 -128 -49 18 -26 335 -120 -172 57 -193 -39 6 -96
7517 -96 -32 62 73 289 -66 -125 -3 -105 397 18 -133 99 -14 108 -127 -182 61 -29 19 245 53 50 -8 43
7541 43 169 50 206 -24 -30 126 137 157 -109 92 57 138 132 -109 -147 -200 5 91 121 -260 -118 -301 -120 -146 -17
7566 -17 -111 66 -114 -113 64 -220 151 136 131 -108 -76 -46 184 -107 143 -89 -81 -168 120 61 138 -90 22 -230 129
7591 129 125 75 -25 -161 -156 -243 -7 -1 -94 122 -159 25 182 173 79 -49 -144 283 53 -164 -15 -37 86 -105 216
7616 216 -50 77 52 -234 145 -107 -156 32 62 360 -13 -51 -122 85 164 125 -120 -200 -215 97 -37 157 79
7639 79 304 -124 -75 43 150 148 -77 129 -77 -449 176 -86 33 112 143 105 -83 134 251 -171 -133 -25 79
7662 79 -113 56 -69 214 90 -100 -129 69 47 -57 246 24 -108 171 72 12 55 -164 -92 -9 38 54 14 -241
7686 -241 -3 -130 -138 -38 61 -226 82 -91 -100 36 -93 -138 140 10 113 -159 -175 133 -17 -286 -295 -1 -31
7709 -31 26 84 219 168 113 117 38 75 2 68 348 -145 7 22 -291 -95 -172 74 2 -68 -173 -32 29 223 -175
7734 -175 64 75 0 27 -158 -171 -40 165 -195 -50 -82 -120 99 -69 -68 115 19 -124 -112 -87 159 -62 -187 -126
7758 -126 -62 -52 1 -63 -70 222 -131 -98 -332 -214 -186 151 314 -122 -88 69 280 57 48 -41 162 -37 73 0
7782 0 -6 -210 21 -75 -56 -72 304 10 171 -156 -104 -95 -295 112 39 58 -133 20 27 -63 7 112 -16 92 -245
7807 -245 -170 -66 85 -92 427 -159 -101 93 -76 154 -61 127 -65 -70 228 101 -201 -196 -174 -151 -30 -31 63 147
7831 147 6 -276 134 181 -116 38 -39 -17 -86 -157 31 -55 99 377 167 -12 194 66 107 -34 103 125 191
7854 191 219 289 189 -202 122 56 94 -60 9 65 108 -35 90 -72 2 -176 80 227 128 10 77 -113 67
7877 67 30 -88 207 48 251 -133 -7 209 -46 266 7 199 -86 65 109 -6 194 76 126 -55 101
7898 101 110 -31 -7 -168 83 -40 24 -89 157 148 -171 52 46 191 -34 -115 101 30 155 135 165 158 -270 -157 -78
7923 -78 19 -167 39 64 -61 68 178 94 -90 -27 -51 -68 57 -87 17 89 171 -150 109 -79 220 -295 -48
7946 -48 -160 -156 -166 -125 -60 116 -261 210 -11 76 285 -15 157 132 -21 111 10 -73 190 -96 2 44 27 34 -47
7971 -47 -4 31 -100 -70 -42 -48 -128 -213 -13 18 104 34 -138 -126 113 105 160 -10 36 1 130 -68 -39 243 -268 -211 -43
7998 -43 419 -142 -8 -54 -137 -60 124 -74 -16 -72 27 42 173 112 -101 -9 -96 204 68 229 -89 254 -181 -48
8022 -48 -37 51 211 -48 49 174 -67 171 103 -1 257 59 64 120 -36 -62 -207 168 268 153 55 -6 -45 55
8046 55 -36 -25 -43 -5 184 120 62 57 -299 41 -113 157 406 76 64 -127 -160 -229 36 95 -111 -184 -118 -278 97
8071 97 14 145 -104 -20 -53 2 -94 62 -302 69 338 50 -248 208 80 72 90 -122 65 -137 -100 -50 17 -30
8095 -30 87 6 -1 -111 12 46 53 -25 -37 119 -182 -106 169 231 52 100 57 245 112 -78 103 78 -50 -31 -21
8120 -21 117 -227 -164 60 62 -155 77 -124 -23 -125 72 23 190 53 -117 71 -124 35 -1 132 58 235
8142 235 6 -155 -35 -244 62 -109 -254 41 -21 160 32 39 165 -107 27 -135 54 42 228 125 -2
8163 -2 163 202 -73 -210 96 239 -112 -181 37 35 17 165 -34 43 32 -80 -84 247 12 -29 -200 -70 -139 96
8187 96 -129 -60 63 -7
8191g
##END NTUPLES=NMR FID
##END=
