##TITLE=1H_SR-167-R23_TFA
 CDCl3
 8 sc, 
 25.12.2023
##JCAMPDX= 6.0         $$ Bruker NMR JCAMP-DX V2.0
##DATA TYPE= NMR FID
##DATA CLASS= NTUPLES
##ORIGIN= UXNMR, Bruker Analytische Messtechnik GmbH
##OWNER= root
$$ XWIN-NMR		Version 3.5
$$ Mon Dec 25 15:06:51 2023 Russian Standard Time (UT+4h)  she@DPX200
##.OBSERVE FREQUENCY= 200.1313
##.OBSERVE NUCLEUS= ^1H
##.DELAY= (6, 6)
##.ACQUISITION MODE= SIMULTANEOUS
##.ACQUISITION SCHEME= undefined
##.AVERAGES= 8
##.DIGITISER RES= 18
##SPECTROMETER/DATA SYSTEM= spect
##.PULSE SEQUENCE= zg30
##.SOLVENT NAME= CDCl3
##.SHIFT REFERENCE= (INTERNAL, CDCl3, 0, 15.7039)
##AUDIT TRAIL= $$ (NUMBER, WHEN, WHO, WHERE, WHAT)
$$ ##TITLE= Audit trail, XWIN-NMR		Version 3.5
$$ ##JCAMPDX= 5.01
$$ ##ORIGIN= Bruker BioSpin GmbH
$$ ##OWNER= she
$$ F:/spectra/data/she/nmr/H-F/1/audita.txt
$$ ##AUDIT TRAIL=  $$ (NUMBER, WHEN, WHO, WHERE, WHAT)
(   1,<2023-12-25 15:05:18.35 +0400>,<she>,<DPX200>,
      <created by zg, POWCHK disabled, PULCHK disabled
       configuration hash MD5:
       00 E9 B6 7A A2 85 ED C7 34 08 36 98 17 FE 4E 26
       data hash MD5: 16K
       D9 F7 9C 63 C1 EF FA 47 AD 8E 1F 73 B1 AB 0F 53>)
$$ ##END=
$$ 
$$ hash MD5
$$ 68 7A 35 70 AC 1F 78 EE 24 E7 2F D1 CF 6E 6B 93
##$RELAX= 
##$RELAX= 
##$RELAX= 
##$RELAX= 
##$RELAX= 
##$RELAX= 
$$ Bruker specific parameters
$$ --------------------------
##$DU= <F:/spectra>
##$EXPNO= 1
##$NAME= <H-F>
##$PROCNO= 1
##$TYPE= <nmr>
##$USER= <she>
##$AMP= (0..31)
100 100 100 100 100 100 100 100 100 100 100 100 100 100 100 100 100 100 
100 100 100 100 100 100 100 100 100 100 100 100 100 100 
##$AQSEQ= 0
##$AQ_mod= 1
##$AUNM= <au_zg>
##$AUTOPOS= <>
##$BF1= 200.13
##$BF2= 200.13
##$BF3= 200.13
##$BF4= 200.13
##$BF5= 200.13
##$BF6= 200.13
##$BF7= 200.13
##$BF8= 200.13
##$BYTORDA= 1
##$CFDGTYP= 0
##$CFRGTYP= 5
##$CHEMSTR= <none>
##$CNST= (0..31)
1 1 145 1 1 1 1 1 1 1 1 1 1 1 1 1 1 1 1 1 1 1 1 1 1 1 1 1 1 1 1 1 
##$CPDPRG= <>
##$CPDPRG1= <>
##$CPDPRG2= <>
##$CPDPRG3= <>
##$CPDPRG4= <mlev>
##$CPDPRG5= <mlev>
##$CPDPRG6= <mlev>
##$CPDPRG7= <mlev>
##$CPDPRG8= <mlev>
##$CPDPRGB= <>
##$CPDPRGT= <>
##$D= (0..31)
0 1.2 0 0 0 0 0 0 0 0.06 0 0.03 0 0 0 0 0.0002 0 0 0 0 0 0 0 0 0 0 0 0 
0 0 0 
##$DATE= 1703502317
##$DBL= (0..7)
120 120 120 120 120 120 120 120 
##$DBP= (0..7)
150 150 150 150 150 150 150 150 
##$DBP07= 0
##$DBPNAM0= <>
##$DBPNAM1= <>
##$DBPNAM2= <>
##$DBPNAM3= <>
##$DBPNAM4= <>
##$DBPNAM5= <>
##$DBPNAM6= <>
##$DBPNAM7= <>
##$DBPOAL= (0..7)
0.5 0.5 0.5 0.5 0.5 0.5 0.5 0.5 
##$DBPOFFS= (0..7)
0 0 0 0 0 0 0 0 
##$DE= 6
##$DECBNUC= <off>
##$DECIM= 32
##$DECNUC= <off>
##$DECSTAT= 4
##$DIGMOD= 1
##$DIGTYP= 9
##$DL= (0..7)
0 120 120 120 120 120 120 120 
##$DP= (0..7)
150 150 150 150 150 150 150 150 
##$DP07= 0
##$DPNAME0= <>
##$DPNAME1= <>
##$DPNAME2= <>
##$DPNAME3= <>
##$DPNAME4= <>
##$DPNAME5= <>
##$DPNAME6= <>
##$DPNAME7= <>
##$DPOAL= (0..7)
0.5 0.5 0.5 0.5 0.5 0.5 0.5 0.5 
##$DPOFFS= (0..7)
0 0 0 0 0 0 0 0 
##$DQDMODE= 0
##$DR= 18
##$DS= 0
##$DSLIST= <SSSSSSSSSSSSSSS>
$$ [...]
##$SUBNAM2= <"">
##$SUBNAM3= <"">
##$SUBNAM4= <"">
##$SUBNAM5= <"">
##$SUBNAM6= <"">
##$SUBNAM7= <"">
##$SUBNAM8= <"">
##$SUBNAM9= <"">
##$SW= 18.0517328524113
##$SWIBOX= (0..15)
0 0 2 0 0 0 0 0 0 0 0 0 0 0 0 0 
##$SW_h= 3612.71676300578
##$TD= 16384
##$TD0= 1
##$TE= 0
##$TE2= 300
##$TE3= 300
##$TEG= 300
##$TL= (0..7)
0 120 120 120 120 120 120 120 
##$TP= (0..7)
150 150 150 150 150 150 150 150 
##$TP07= 0
##$TPNAME0= <>
##$TPNAME1= <>
##$TPNAME2= <>
##$TPNAME3= <>
##$TPNAME4= <>
##$TPNAME5= <>
##$TPNAME6= <>
##$TPNAME7= <>
##$TPOAL= (0..7)
0.5 0.5 0.5 0.5 0.5 0.5 0.5 0.5 
##$TPOFFS= (0..7)
0 0 0 0 0 0 0 0 
##$TUNHIN= 0
##$TUNHOUT= 0
##$TUNXOUT= 0
##$USERA1= <user>
##$USERA2= <user>
##$USERA3= <user>
##$USERA4= <user>
##$USERA5= <user>
##$V9= 5
##$VALIST= <valist>
##$VCLIST= <CCCCCCCCCCCCCCC>
##$VD= 0
##$VDLIST= <DDDDDDDDDDDDDDD>
##$VPLIST= <PPPPPPPPPPPPPPP>
##$VTLIST= <TTTTTTTTTTTTTTT>
##$WBST= 1024
##$WBSW= 4
##$XGAIN= (0..3)
0 0 0 0 
##$XL= 0
##$YL= 0
##$YMAX_a= 106234
##$YMIN_a= -106690
##$ZGOPTNS= <>
##$ZL1= 120
##$ZL2= 120
##$ZL3= 120
##$ZL4= 120
##$ABSF1= 10
##$ABSF2= 0
##$ABSG= 5
##$ABSL= 3
##$ALPHA= 0
##$AQORDER= 0
##$ASSFAC= 0
##$ASSFACI= 0
##$ASSFACX= 0
##$ASSWID= 0
##$AUNMP= <proc_1d>
##$AZFE= 0.1
##$AZFW= 0.1
##$BCFW= 1
##$BC_mod= 2
##$BYTORDP= 1
##$COROFFS= 0
##$CY= 11.3945322036743
##$DATMOD= 1
##$DC= 2
##$DFILT= <>
##$DTYPP= 0
##$F1P= 15.7292609196834
##$F2P= 12.9074282941183
##$FCOR= 0.5
##$FTSIZE= 0
##$FT_mod= 4
##$GAMMA= 1
##$GB= 0.15
##$INTBC= 1
##$INTSCL= 1
##$ISEN= 128
##$LB= 0.24
##$LEV0= 0
##$LPBIN= 0
##$MAXI= 10000
##$MC2= 0
##$MEAN= 0
##$ME_mod= 0
##$MI= 1.114404
##$NCOEF= 0
##$NC_proc= 0
##$NLEV= 6
##$NOISF1= 3.799351
##$NOISF2= 2.8
##$NSP= 1
##$NTH_PI= 0
##$NZP= 0
##$OFFSET= 15.70392
##$PC= 1
##$PHC0= -24594.17
##$PHC1= 13.85273
##$PH_mod= 1
##$PKNL= yes
##$PPARMOD= 0
##$PSCAL= 0
##$PSIGN= 0
##$REVERSE= no
##$SF= 200.130013532006
##$SI= 16384
##$SIGF1= 3
##$SIGF2= 2
##$SINO= 400
##$SIOLD= 16384
##$SREGLST= <1H.CDCl3>
##$SSB= 0
##$STSI= 0
##$STSR= 0
##$SW_p= 3612.71676300578
##$SYMM= 0
##$S_DEV= 0
##$TDeff= 0
##$TDoff= 0
##$TI= <>
##$TILT= no
##$TM1= 0
##$TM2= 0
##$TOPLEV= 0
##$USERP1= <user>
##$USERP2= <user>
##$USERP3= <user>
##$USERP4= <user>
##$USERP5= <user>
##$WDW= 1
##$XDIM= 8192
##$YMAX_p= 0
##$YMIN_p= 0
$$ End of Bruker specific parameters
$$ ---------------------------------
##NTUPLES= NMR FID
##VAR_NAME=  TIME,          FID/REAL,        FID/IMAG
##SYMBOL=    X,             R,               I
##VAR_TYPE=  INDEPENDENT,   DEPENDENT,       DEPENDENT
##VAR_FORM=  AFFN,          ASDF,            ASDF
##VAR_DIM=   8192,          8192,            8192
##UNITS=     SECONDS,       ARBITRARY UNITS, ARBITRARY UNITS
##FACTOR=    0.0002768,     1,               1
##FIRST=     0,             0,               0
##LAST=      2.2672688,     0,               0
##MIN=       0,             -106690,         0
##MAX=       2.2672688,     106234,          0
$$ Real data points
##PAGE= N=1
##DATA TABLE= (X++(R..R)), XYDATA
0 0 0 0 0 0 0 0 0 0 0 0 0 0 0 0 0 0 0 0 1 -8 8 -8 8 -8 8 -11 16 -16 16 -23 24 -27 32 -35 40 -46 50 -57 64 -72 80
41 80 -88 97 -107 119 -131 146 -162 177 -194 213 -235 259 -285 317 -350 390 -435 487 -549 622
61 622 -715 832 -986 1199 -1514 2020 -2981 5422 -24425 -26901 44751 8690 -17869 71129
75 71129 102084 3099 -2041 79097 64156 -6865 -20385 -19319 -9898 -3738 -65121 -106690 -23016
88 -23016 28667 -41282 -52385 33374 45413 2197 14047 41945 44652 39241 131 -25337 22987
101 22987 36470 -38765 -51277 18485 16459 -34795 -25454 -743 -2514 5805 1560 -13948 16537
114 16537 34255 -11460 -10466 51308 38323 -21262 -8718 21280 2666 -14346 -23635 -38462 -13301
127 -13301 11272 -28642 -43376 15360 32700 -4599 6880 39523 25302 10936 16044 7753
139 7753 7557 12314 -18074 -32320 4433 7195 -34997 -28284 9895 3864 -14296 -7106 -1363 3971
153 3971 11570 -3134 -9871 18395 21582 -10382 -4832 23968 12464 -9247 -2802 1787 -1234 -151
167 -151 -12897 -19210 4427 10690 -14653 -10239 17297 8853 -8374 1875 7563 -1643 -2477 -7435
181 -7435 -13813 -1105 3933 -14982 -11682 14914 11515 -5674 4335 16788 9913 5834 4555 -1680
195 -1680 2434 3716 -12091 -14667 1246 -1636 -16713 -10242 1930 -1867 -5162 -1562 973 6385
209 6385 8926 1051 2125 15227 12379 -167 3034 9154 1783 -5508 -6645 -8099 -6900 -7510 -14341
224 -14341 -12570 311 861 -6081 2002 12486 9824 7009 9739 9573 8257 6540 -1460 -4614 338
239 338 -3302 -13217 -10571 -2828 -6352 -10171 -4366 -242 852 2604 2208 3869 9850 9672 3595 4131
255 4131 9019 5337 -1548 -1576 -873 -3752 -6845 -8951 -8326 -4941 -5001 -7007 -3134 2988 3675 2331 5163
272 5163 8712 8709 6519 4148 3639 4005 13 -5114 -4253 -2886 -6351 -8855 -5855 -2964 -2554 -2433 -1328
289 -1328 1926 5048 4312 1985 4677 7044 4685 328 1279 1960 -56 -2091 -2676 -2503 -2682 -3088 -3928
306 -3928 -2403 -952 -1292 -1642 701 2901 2169 977 2319 4025 3590 1203 552 1015 513 -1004 -2346
323 -2346 -2726 -1522 -1100 -2036 -1578 552 1906 665 597 2045 2294 432 -916 -513 -679 -1141 -1637 -1833
341 -1833 -1112 543 242 361 1970 2585 1587 940 1601 1786 -472 -1824 -810 -13 -1186 -2486 -2159 -1221
359 -1221 -507 -782 -1357 -1223 741 849 -350 830 2590 2322 2258 3417 3320 1276 935 298 -859 -2657
377 -2657 -3719 -4903 -5346 -3737 -3124 -3504 -1279 1380 2345 2648 4003 4484 4213 3939 2919 1867 947
394 947 -355 -1774 -2465 -2133 -2529 -3517 -3376 -2871 -2088 -1903 -1849 -1283 345 1074 1480 2598 3630 3342 3784
413 3784 3954 2339 1497 531 -1384 -3027 -2390 -3349 -5136 -4004 -1999 -1891 -932 1689 1859 1914 3605 3202
431 3202 2053 2095 2080 130 -442 118 -1238 -2595 -1297 -985 -2128 -1747 -855 -1220 -1104 172 -70 102
449 102 1427 2276 2206 2606 2875 2191 1799 1058 17 -881 -2029 -2945 -3280 -2560 -3259 -2828 -1338 -589 157
468 157 1467 1753 1236 2383 2950 1592 652 1800 912 -138 450 927 -354 -140 364 -956 -1548 -537
486 -537 -1344 -2538 -1533 -751 -1997 -1296 291 136 166 1705 2088 1160 1750 1984 910 1088 1200 -147
504 -147 -510 701 218 -1150 -418 -69 -726 -944 -1437 -2039 -2154 -1408 -1460 -1511 -636 196 858 1676 2247 2091
524 2091 2510 2856 1803 961 610 -160 -1368 -1200 -1897 -2536 -1635 -1254 -1564 -1096 -384 -342 61 881 701 228
544 228 1451 1569 796 1563 1675 822 147 505 -247 -1354 -1398 -1414 -2527 -2061 -1197 -1281 -896 280 1025 1143
564 1143 1964 2367 1552 1507 1817 666 -558 -471 -1214 -2000 -1389 -1780 -2174 -1591 -581 -573 -391 556 724 836
584 836 1450 1416 1133 1742 1776 1152 818 863 -169 -425 -523 -1465 -1818 -1633 -1953 -2072 -1159 -612 -622 -72 1097
605 1097 1099 1284 2293 2006 1355 1626 940 246 360 -82 -975 -1138 -418 -1653 -1829 -1049 -762 -994 -322 -162
625 -162 -394 212 652 718 196 987 1149 458 846 906 260 323 761 -64 -435 -155 -582 -889 -1079 -763 -658
646 -658 -776 42 -534 -72 485 419 218 597 460 197 624 602 185 244 263 -210 269 304 -218 -281 159 -536
668 -536 -818 -32 -499 -1208 -177 190 -251 239 991 492 365 1295 1150 61 570 911 -473 -672 -129
687 -129 -1035 -1319 -512 -395 -748 -161 235 -410 53 1020 218 196 606 508 506 741 670 188 619 407 -399 -221
709 -221 -267 -995 -1245 -773 -1014 -1124 -335 -179 11 1165 1539 492 1187 1758 523 570 949 -116 -678 -45
729 -45 -662 -1538 -555 -361 -1180 -668 376 -370 -737 727 142 -304 463 922 387 693 1115 464 151 538
749 538 420 -925 -416 -395 -1141 -1288 -601 -798 -929 212 -165 -192 656 733 545 467 555 -37 324 376 -182 -417
771 -417 6 -386 -374 -19 -65 -435 212 161 -740 -452 284 -158 -366 444 -380 -337 585 581 -245 486 784 -79
793 -79 -320 380 -151 -569 61 61 -687 -77 132 -123 -57 157 -74 -417 63 6 -96 -101 395 237 135 601 451
816 451 569 838 280 266 22 -64 -532 -450 -620 -938 -545 -519 -720 -307 -35 -127 424 538 635 296 1128 960
838 960 571 492 571 19 -44 40 -496 -624 -210 -310 -903 -632 -289 -511 -333 34 -1 193 419 814 916 663
860 663 741 751 310 439 148 -332 -914 -560 -840 -946 -946 -531 -444 -405 6 59 414 320 836 641 568 892 400
883 400 -58 -51 276 -472 -401 -337 -560 -615 -501 -410 -674 -271 -283 18 -12 310 550 599 887 948 900 760 455 357
907 357 64 -281 -580 -846 -1061 -972 -886 -578 -543 -124 412 318 773 681 803 632 695 488 247 302 327 -64 -56 -197
931 -197 19 -568 -375 -586 -1007 -686 -469 -613 -789 -109 90 223 710 1020 668 815 972 690 218 150 -381
952 -381 -483 -600 -697 -619 -784 -446 -288 -187 31 393 -203 -43 176 156 280 327 247 245 636 740 400 476 506
975 506 113 -233 -423 -597 -700 -922 -530 -542 -541 -233 258 136 531 508 474 763 251 64 123 -221 -191 -21 41
998 41 -504 207 209 -25 -182 98 -7 -492 -490 -342 -194 -486 46 -31 31 575 706 256 626 681 272 -63 279
1021 279 -260 -628 -176 -339 -493 -424 -20 -368 -122 358 -61 -298 175 150 -24 455 571 181 351 799 449
1042 449 117 252 75 -667 -361 -219 -756 -684 -515 -599 -552 -51 66 234 642 699 512 751 714 315 174 369
1064 369 -277 -488 42 -564 -648 -113 -280 -976 -265 85 -740 -306 269 -78 86 711 736 249 901 1048 213
1085 213 -69 535 -348 -510 -372 -700 -1261 -660 -477 -693 -279 26 -71 108 826 968 316 968 772 303
1105 303 339 650 7 -236 -19 -333 -624 -426 -507 -837 -566 -444 -899 -82 174 257 273 1169 722 465 1011
1126 1011 509 45 671 428 -344 -393 -83 -661 -708 -127 -697 -718 -421 -31 -466 158 638 177 141 816 591
1147 591 263 871 794 52 147 388 -443 -500 -28 -547 -704 -364 -395 -856 -245 -7 -408 -2 354 254 240 780
1169 780 302 360 568 503 -272 -104 214 -238 -280 -92 -667 -512 -153 -279 -645 139 89 40 558 711 -16 324
1191 324 807 355 -218 495 261 -358 3 127 -481 -351 171 -594 -685 61 -276 -338 163 40 -169 -138 634
1212 634 192 317 566 277 200 416 81 -134 -220 -74 -416 -510 -539 -303 -244 68 62 -285 268 56 -198 117
1234 117 313 104 274 570 521 169 622 411 -109 136 79 -518 -456 -596 -708 -812 -305 -193 -372 -19 388
1255 388 242 378 899 580 403 707 375 -258 -51 38 -194 -482 -263 -365 -180 -449 -409 -818 -424 -360 -268
1276 -268 -178 157 -86 306 959 621 870 829 818 269 218 101 -622 -385 -685 -764 -656 -534 -426 -248 -20 169
1298 169 -88 471 375 243 90 532 238 357 452 374 171 115 13 -174 -359 -56 -412 -750 -392 -365 -487 -253
1320 -253 39 305 544 644 642 608 666 166 158 103 -448 -158 -188 -440 -428 -213 -100 -151 -234 -69 204 -204 109 -53
1344 -53 -2 -112 62 241 334 305 279 461 282 225 -9 -334 -363 -576 -624 -356 -494 -7 -258 -34 269 338 16
1367 16 313 21 147 49 52 -88 -26 -112 -8 98 -31 97 -68 176 -48 -376 -497 -468 -529 -466 -189 -168 25
1390 25 156 488 428 211 412 337 147 114 163 -274 -161 -313 -434 -387 -56 -303 -115 -310 -182 -47 5 190
1412 190 206 243 386 394 477 579 352 469 365 84 20 -202 -265 -388 -582 -926 -845 -448 -522 -133 -71 443 207
1435 207 445 384 307 535 157 145 106 -153 -79 -13 -277 28 -170 -403 -514 -231 -252 -731 -574 -322 73 6 221
1458 221 377 165 352 493 253 -96 337 43 11 -395 -285 -707 -430 -205 -235 -237 -3 -139 -111 210 67 41
1480 41 274 358 103 32 97 167 -2 -17 356 -11 99 94 -162 -289 -141 -257 -299 6 33 -194 90 356 273 573
1504 573 366 -56 -68 268 -19 -287 -123 -219 -627 26 -350 -376 -224 -189 -247 -103 51 32 -11 79 250 153 282
1527 282 321 289 499 555 371 164 -50 -322 -342 -369 -323 -584 -192 -468 -123 -345 -372 205 99 385 224 305 264
1550 264 212 177 265 168 -80 -82 119 -317 16 -33 -285 -305 -499 -555 -595 -250 -32 -120 34 174 190 382 435 433 240
1575 240 255 274 116 -12 116 -289 -416 -383 -403 -263 -81 -233 -198 -241 159 4 121 205 101 231 283 167 215
1598 215 98 105 -141 46 -50 -44 -229 -258 -199 -354 -511 -136 -71 -1 274 189 115 585 82 192 237 -20 250 -175
1622 -175 -60 -287 -485 -325 -25 -258 62 -11 43 112 59 -83 -40 242 -66 13 522 395 28 390 36 -28
1644 -28 150 184 -300 -198 -314 -459 -293 -79 -271 -252 -231 366 66 94 410 322 104 227 75 -1 -157 -80 41
1667 41 -76 69 -165 -72 -64 -202 -421 -381 -406 -66 -118 115 -365 163 249 205 250 527 268 190 225 280 30 -35 -305
1692 -305 -490 -239 -244 -116 -357 -249 -172 -190 216 418 115 178 246 145 162 451 257 18 91 313 54 5 8 28
1716 28 -175 39 -368 -667 -453 84 -188 -9 105 256 83 232 312 584 380 205 177 193 -433 -332 -109
1737 -109 -232 -254 -59 -233 -456 -1 -21 -35 -120 -140 80 -69 120 133 196 253 383 279 163 270 -80 -86 -54 -459
1761 -459 -492 -132 -60 -246 -284 1 22 79 58 228 119 414 66 150 -51 -19 168 -72 -13 -414 -174 -79 -315
1784 -315 -226 57 -130 -305 -374 -132 131 107 130 156 69 131 191 1 155 127 36 -4 115 -220 -238 -71 -218 -313
1808 -313 -19 -21 -121 -99 367 78 -5 150 92 118 210 46 -19 -83 246 102 100 -220 -258 -325 111 -118 -25 119 -183
1833 -183 3 -27 -170 44 218 294 143 258 -6 99 -48 110 216 24 84 -119 -312 -122 -219 -145 -44 88
1855 88 -220 -262 136 -253 49 38 100 125 330 451 293 238 -88 201 -310 -128 -137 -304 -220 -362 -18 -29 -327
1878 -327 -226 227 56 135 170 446 284 335 245 151 155 -19 131 -9 285 -132 -288 -82 -125 -9 -245 -233 -147
1901 -147 -228 -89 -244 75 -123 251 443 270 357 183 148 12 -48 -66 -64 -125 -30 -106 -288 -70 -196 -36 -53 -152
1925 -152 -29 177 -30 155 266 100 15 -107 184 166 52 103 -336 -88 -27 -245 -340 -279 -176 -154 13 105 164
1948 164 -130 377 223 186 -78 -251 77 -70 209 -403 -360 -202 -73 -51 -332 -39 25 -119 -86 -219 136 206
1970 206 30 177 115 -78 193 223 213 -3 202 154 -2 -282 -242 -220 -35 -248 -450 -28 -169 -112 -317 74
1992 74 114 66 99 136 74 251 264 -22 -23 85 -72 47 94 169 20 26 17 -223 -57 -233 -27 118 173 -183 226
2017 226 98 262 45 308 -59 229 -102 -33 130 -263 142 -22 -183 -16 -70 -180 -172 192 -43 -93 21 -210
2039 -210 19 -58 114 219 271 -7 87 326 -235 341 128 -230 -94 186 -125 -287 -173 -430 63 162 105 -18
2061 -18 113 79 161 -64 356 308 123 49 -334 -220 -93 26 -80 -116 -316 -333 -225 -47 -137 58 84 -60 420
2084 420 -165 357 216 216 122 -198 155 38 -286 139 -253 -211 -212 -267 -196 -440 -13 8 0 -251 -11 176 486 377
2108 377 128 255 232 183 -92 30 -196 -132 -415 -2 -282 -14 160 -179 -261 -28 -190 -84 0 150 278 -82
2130 -82 58 5 154 -10 69 18 113 150 -300 -218 17 -333 228 9 2 -48 -88 -33 -132 8 316 30 -6 200 124
2155 124 -12 -46 -100 -219 -101 120 34 -129 -198 56 -217 -287 -297 -53 74 115 393 -29 58 96 351 277 320 122
2179 122 -53 -226 30 116 175 -233 -97 -17 -433 -148 -178 -94 98 55 87 -33 -23 218 55 60 30 -17 125 73
2203 73 -151 282 33 -14 -152 142 -70 -102 -278 -60 -282 -311 -45 258 197 50 -58 37 44 84 -38 186 62
2226 62 83 157 152 86 -81 -214 -68 -25 -442 -55 -146 -309 -44 -5 -49 181 39 68 -52 153 -67 -27 141 -187
2250 -187 30 -163 -6 -55 -100 -198 24 -93 -208 -170 117 109 83 13 144 137 170 332 114 -176 25 -84 -113 17
2274 17 -193 -251 -215 -170 -47 98 148 32 98 -145 326 253 -162 53 203 212 174 -43 -158 -107 71 -95 -99 -112 -357
2299 -357 -102 -122 -67 -209 -158 95 16 -16 11 68 144 176 80 -177 146 -225 -145 63 -301 -269 -29 -240 21 -219
2323 -219 -155 21 32 -75 31 -217 202 88 42 49 -32 -155 58 -73 15 -18 18 21 217 49 48 -99 -57 80 -200
2348 -200 -39 73 79 -16 138 113 -109 155 -112 132 47 55 79 -102 -108 -221 109 -3 -425 -34 -154 -149 -52 -4 102
2373 102 -106 -43 127 243 52 321 -54 337 -45 109 71 90 14 -81 -159 -87 -78 -72 -284 -14 -211 16 120 18
2397 18 114 83 79 349 76 145 -6 -18 -57 -54 -246 4 -187 -91 -126 -407 27 -45 -149 -62 -43 -85 74 58 201 -125
2423 -125 150 87 -98 -163 56 -56 -184 -141 -278 18 -113 -144 -47 -103 -145 183 36 -195 279 64 277 42
2445 42 73 6 68 190 114 20 -130 -232 68 4 -86 80 -101 -97 -80 53 -28 246 -68 52 4 -52 107 112 -74
2470 -74 -94 127 -30 -126 80 -154 -166 2 -168 -141 -68 239 132 -42 76 176 26 165 119 45 -49 12 294
2493 294 -3 13 -81 -52 -123 -240 133 -136 -81 129 201 231 112 -134 199 -149 -131 231 86 168 187 -33 -1 -59
2517 -59 48 -45 -100 13 81 -285 56 7 -131 -143 26 -48 76 137 43 254 -138 124 220 -76 -18 -185 43 111
2541 111 223 -341 -93 123 -162 -145 -201 -132 -12 49 -89 90 17 -1 78 178 361 -83 -249 106 -66 70
2563 70 -233 -257 -79 43 -69 25 -100 67 6 76 80 1 -82 209 497 228 -112 192 123 -59 -23 -35 -270 -257
2587 -257 227 -187 -226 64 38 -73 86 51 -333 -129 -176 -125 200 186 95 -13 -195 -92 287 -57 -53 -90 -306
2610 -306 -232 -231 -20 -14 49 66 -216 5 24 -205 269 222 35 215 -118 103 10 -82 138 -36 38 227 12 -60
2634 -60 41 31 65 83 -51 34 -69 72 -33 29 228 37 184 37 168 98 46 -48 -150 56 -65 -63 -11 -45
2658 -45 -4 -18 -143 198 54 359 5 272 5 -10 78 95 -68 341 -18 -76 -242 -54 -107 -55 -152 -98 -78 -140
2682 -140 -116 2 -132 -6 219 36 96 169 74 271 124 -134 182 -93 -52 -107 118 -9 -146 -52 -87 -111 -100
2705 -100 95 -82 -78 -112 125 236 167 170 2 -40 -9 -272 -1 72 -141 264 28 17 55 -155 -347 182 -65 -186
2729 -186 177 -231 73 82 52 160 -30 50 66 -130 -94 2 180 -65 31 -65 32 -86 4 -116 -208 -140 -181 80 98
2754 98 186 122 69 59 -6 -32 42 -54 -88 -7 30 84 15 79 66 9 -89 -70 102 245 119 64 86 -224 108 242 45
2781 45 -31 -205 -128 103 -62 149 194 -16 95 -55 14 -83 -123 41 51 -61 116 124 283 -98 117 2 -87 12
2805 12 -4 154 49 -54 -27 -75 175 86 28 -36 21 4 -65 139 190 3 -373 149 -32 -151 124 -55 -276 84
2829 84 253 152 -6 -12 -422 -26 -82 -227 -103 -119 -86 -66 49 184 43 369 272 199 -216 -200 -260 -100 69 52
2853 52 171 15 2 -68 195 1 22 -79 52 120 289 -78 -49 -116 10 -3 124 -193 142 72 -160 -61 107
2876 107 -148 12 30 11 -184 -242 -153 1 78 -28 -117 -33 79 255 -44 338 34 188 -148 -62 -3 239 31
2899 31 98 106 -132 10 -133 -96 -64 267 49 111 -97 27 37 -25 -57 -97 52 -25 289 -71 -85 11 -287 -7 -17
2924 -17 -129 -303 23 -217 -131 70 -356 18 27 166 42 224 -274 -99 21 -31 189 70 -263 -107 0 -62
2946 -62 -224 -206 75 -68 -12 230 -146 -60 -304 -62 98 -166 147 -6 74 168 67 195 -75 -123 35 -314
2968 -314 70 -107 84 45 -205 -264 -108 -54 -108 45 120 -158 178 120 36 305 11 -85 186 181 85 -108 -20 -61
2992 -61 74 2 -61 -244 130 115 205 -111 -169 -69 128 247 139 178 -216 322 7 62 68 9 143 132 47 22 -159
3017 -159 286 -114 51 10 -24 133 87 11 149 217 -116 254 -169 174 -35 -18 -218 -50 -262 -184 125 83 200
3040 200 231 -251 159 105 -192 -126 6 49 24 0 182 -100 161 157 218 -196 130 -172 -236 1 256 -132 56
3063 56 -154 -154 -51 -111 220 119 106 -89 130 103 6 -151 -115 3 -113 68 42 -96 98 144 -192 222 4
3086 4 -37 -53 -42 -142 160 -31 47 234 49 16 -32 -7 70 118 79 171 -140 -60 127 176 -215 -35 -27 -120 53 -76
3112 -76 -57 480 81 -101 55 78 -201 92 156 183 46 -5 -128 -77 -135 -82 -133 -298 -158 157 -128 84 173 114
3136 114 327 -165 318 59 -249 50 -34 -46 80 -189 -143 -101 -73 105 -29 -65 156 109 -161 -394 -62 -15 117
3159 117 -130 -21 -97 -86 150 254 -5 21 -145 -76 53 286 -201 -125 -164 -12 185 39 -54 62 -45 -45 56
3182 56 102 -135 130 53 -107 140 104 164 -305 107 120 -5 -15 -147 -59 10 32 -60 200 90 -24 72 -75 -91
3206 -91 -129 99 135 70 -13 127 -8 -102 -73 173 -291 102 71 -67 -6 -57 204 270 -146 -18 95 162 100 42 -112
3231 -112 -171 71 -198 107 -249 89 19 -167 -155 194 -42 -115 167 -95 -126 82 -12 312 114 140 77 157 40
3254 40 148 47 -120 91 -206 -108 -94 34 -113 -39 -119 152 -43 -8 -22 -43 31 -165 91 30 49 183 139 -179
3278 -179 336 -159 -189 -145 -144 -99 21 -27 -26 203 -9 -207 14 46 8 79 201 43 183 108 107 -241 -129 -25 1
3303 1 -39 -2 34 -140 240 -234 -50 29 -79 138 213 24 26 123 -15 -76 211 20 -300 -154 -108 -33 16 -120 -122
3328 -122 114 -71 -199 242 -88 78 81 122 -158 -63 241 4 -38 -60 81 -79 -23 -84 -91 -75 -32 -39 64 -154 147
3353 147 -214 10 118 -192 179 48 -32 128 74 -42 -90 14 -2 55 -86 -90 -257 23 -17 -179 30 -88 31
3376 31 203 -95 101 38 57 148 -201 -114 22 -176 163 -262 -205 30 -59 228 -174 -36 263 218 123 -40 157
3399 157 51 43 -93 54 -77 -133 -95 -249 301 50 -11 47 37 -197 13 -9 -77 122 125 42 59 -108 -78 40 -24
3424 -24 -11 7 61 -49 -175 -180 -101 7 -12 133 82 47 214 -264 149 -147 -17 -169 138 -37 219 16 -87
3447 -87 -69 -19 84 63 0 -85 82 213 -62 -63 157 -51 172 73 102 -237 -126 109 -167 -296 -201 82 3 31
3471 31 11 -191 156 -69 1 27 -51 -84 -78 -129 -41 268 76 97 343 140 106 51 -190 101 15 -2 115 130 66 -91
3497 -91 58 92 168 101 -10 -214 -57 -165 117 41 51 36 41 310 -55 -61 39 -9 116 -155 29 -89 135 29
3521 29 -186 -149 227 8 -160 13 -4 109 -126 242 -227 194 30 127 -53 -118 90 -29 112 -151 -113 16
3543 16 -42 -35 71 -157 -60 -94 376 -175 10 273 -92 -35 184 -84 -156 -1 -79 112 -51 -220 64 212 82
3566 82 93 49 16 -55 187 -281 20 -103 27 -83 46 182 -52 98 -21 -263 48 -128 -23 71 -209 62
3588 62 34 13 9 155 -122 -275 -11 -14 -235 -18 32 -14 4 -73 -92 -54 -165 160 76 12 -153 -206 -190 -41 -185 83
3614 83 88 -223 93 -103 -233 5 -8 109 -181 105 -122 15 275 155 198 -18 -207 61 -108 -165 -125 -95 -262
3637 -262 -84 110 56 -45 -149 -29 38 88 238 -1 -227 -7 -170 115 -96 -63 -76 -217 126 58 175 -171
3659 -171 -214 56 40 113 -70 -88 -3 -95 141 -115 -26 185 -257 34 -177 36 -23 -71 206 121 58 -77 155 227
3683 227 119 -8 66 -211 -111 -102 -229 -259 249 -50 234 -15 -46 -105 -5 -47 208 19 -33 -82 -95 270 -260
3706 -260 79 -44 -143 281 61 -63 96 -5 277 134 43 43 276 -89 -67 -116 -66 128 190 106 -161 137 97
3729 97 40 -82 62 96 126 49 -109 34 -28 -77 166 262 -129 -129 6 404 27 342 130 -315 59 -125 161
3752 161 -21 150 -69 -17 -228 304 48 -133 150 33 122 27 -243 -95 29 234 99 32 70 -170 127 -120
3774 -120 -69 -125 141 199 137 -75 52 214 144 -187 -21 -95 205 -128 -78 -105 -146 66 40 23 -30 12 53 -7 14
3799 14 -212 -88 42 -180 48 -221 243 134 -214 -192 -8 -132 65 -68 34 -193 -51 163 168 -189 12
3820 12 -132 -65 189 -210 25 -131 -135 46 117 137 123 122 -7 -70 14 -52 -59 -158 -110 -103 -84 -26 -276 -133 39 -156 -185
3847 -185 160 250 102 182 107 -68 -6 307 335 98 3 52 91 -9 -30 -155 -123 -234 -227 295 -128 86 52 92 -119
3872 -119 -187 -219 -140 -62 252 -56 62 -17 -205 60 124 207 211 -207 -12 23 -21 -63 -176 -51 -33 134 -115 304
3896 304 -106 53 162 66 -57 -228 -149 -56 -36 296 -185 -137 178 62 7 -100 4 155 -97 -78 -249 -75
3918 -75 31 87 18 39 138 -12 27 26 -64 -56 66 5 -43 18 49 119 116 -38 -257 -104 -25 -34 76 -147 211 87 143
3945 143 267 42 -39 -157 87 196 -75 -98 56 -143 -209 12 -103 -92 120 -4 -482 -221 -9 70 -29 -320
3967 -320 -202 176 24 -8 -53 -303 -266 -167 19 -148 -18 -85 -25 66 142 -69 16 17 22 111 94 225 -142 -63 -183
3992 -183 196 83 70 -109 -44 -303 75 -90 -103 -36 40 69 -214 -340 63 -22 -58 114 -132 -12 253 -39 174
4015 174 -59 26 59 48 157 23 175 -18 -35 -67 -78 -77 -197 60 258 -72 -131 -159 -40 245 -33 -122 165 -155
4039 -155 145 143 -202 -74 28 -110 36 102 148 -61 -84 -144 -23 45 117 257 -193 -231 74 -129 133 -152 -53
4062 -53 -8 29 -214 -392 -107 202 -59 184 90 -87 58 131 243 10 125 -33 31 -1 232 -199 26 256
4084 256 41 479 56 -119 35 199 -88 137 8 85 -105 -36 -66 -85 139 -88 215 63 74 151 122 16
4106 16 -172 89 -14 80 84 142 -224 35 68 -59 160 -280 43 139 -143 -123 -43 56 -6 12 150 -52 67 145
4130 145 -100 17 -120 144 132 167 -89 -26 136 -47 44 -34 137 -123 -46 68 -369 239 166 22 -43 -31 -218
4153 -218 -115 -112 129 -205 72 2 -154 66 29 131 -65 -47 -37 166 -8 -73 -436 -180 -91 269 194 -27 86
4176 86 75 36 -28 -202 64 107 -47 14 -11 12 -144 10 -36 -155 -222 -35 -208 110 -206 98 188 51 -6 -34
4200 -34 275 158 -67 67 -35 51 -13 296 -75 9 201 -165 60 -86 139 -141 -124 -82 84 242 -114 26
4222 26 -39 124 -21 19 -117 -9 62 77 12 -181 -150 -112 192 -27 -76 140 -290 -231 170 -164 -89 172 -15 -229
4246 -229 -126 90 27 -337 116 -170 -120 -158 6 235 1 -4 35 -216 258 112 85 140 -70 321 12 -265 254
4269 254 1 -51 -185 -310 -68 165 55 108 -197 111 70 42 24 67 -133 153 17 -114 52 73 185 158 5
4292 5 261 141 -118 -265 -119 178 279 96 49 -95 33 -93 -100 -131 29 312 -83 21 -186 -255 18 82 117
4315 117 159 -225 -135 -142 180 198 187 -108 67 95 -17 123 57 100 140 -4 45 131 -14 -104 -149 -17 110 -10 -125
4340 -125 -102 -55 -98 -30 -244 -301 -8 24 -103 68 218 194 12 160 194 50 -106 -20 -20 13 -151 -101 -327 191
4364 191 63 -169 -144 150 151 106 -132 160 159 -79 -52 -127 70 -31 -6 97 9 98 -106 -105 29 -87 -85 153 -43
4389 -43 -45 190 13 -265 300 72 166 165 103 -13 -243 103 -112 173 -164 333 126 -105 200 71 -107 -251
4411 -251 -124 -111 -139 171 127 -175 -157 205 204 -57 145 168 30 -284 -208 -62 -62 179 -6 188 109 132 -106 -108 99
4436 99 -186 -13 -2 -71 127 37 19 55 -194 74 127 36 -157 -34 138 -59 93 255 -65 -230 32 -50 -45 15
4460 15 46 -82 285 428 185 -129 -221 -302 7 -131 76 0 15 -15 135 5 -187 -177 83 72 -62 11 52 -33
4484 -33 233 -58 -100 -49 -157 136 -309 12 -259 -296 -63 74 -31 105 -119 88 -47 -71 -94 -229 -3 166
4506 166 -61 233 181 -133 -61 137 18 -162 16 186 20 -71 -106 -93 -76 -120 37 184 86 -86 117 128 -212
4529 -212 173 60 9 -8 24 98 -40 -131 -53 5 -66 -96 -275 -154 62 -22 -170 -1 -123 -47 26 25 -171 103 133
4554 133 31 122 172 -62 69 191 -106 -43 -36 212 -68 -71 34 29 -222 88 50 -100 -147 0 146 123 81 68 172
4579 172 -27 -75 3 -2 -200 121 -107 71 113 181 199 176 29 -141 56 172 83 -8 -31 -101 -47 108 -207 -73
4603 -73 70 -39 100 -74 -117 -116 122 2 129 -52 99 101 29 74 57 34 138 149 -152 118 172 -175 -22 -41
4627 -41 -176 145 113 -76 -47 -15 -6 -60 53 -148 89 62 -34 -48 96 -126 -35 139 -159 258 87 108 -299 -222
4651 -222 -98 68 -218 53 32 -128 4 -123 222 97 292 32 -185 -32 296 -91 201 12 22 -143 88
4672 88 -32 1 -60 77 5 -57 -56 87 -121 -164 -57 -194 38 -38 25 233 -377 -138 -169 -98 162 -105 99 -78
4696 -78 1 -136 133 -125 203 184 -12 115 -73 -98 -49 -25 97 198 -20 -168 256 -6 126 209 -21 5 309
4719 309 174 276 -155 58 -155 274 126 122 -86 -107 -148 -86 24 56 97 203 172 -36 274 119 168 -171 -13
4742 -13 -208 155 -154 -155 -47 -99 -133 66 294 -53 25 115 -33 149 -61 -191 -135 -69 77 -63 -73 -134 111 -325
4766 -325 -134 52 -172 -160 -243 -60 99 -226 33 -36 108 282 -144 62 28 -55 -155 89 192 124 -11 54
4788 54 206 -80 -16 -63 -126 181 143 -4 -143 -69 54 95 244 -182 223 -192 218 -33 49 -2 144 -45 -86
4811 -86 150 57 87 -20 18 47 89 43 98 -142 -115 47 175 19 24 59 -135 78 150 76 -1 -118 -124 67 320 -116
4837 -116 49 246 128 -175 145 -135 -274 5 -175 110 -237 -103 -129 35 -76 -30 8 77 -45 70 93 1
4859 1 140 -34 -196 -122 -148 28 38 254 102 88 -83 -357 -48 -214 207 -240 -80 -132 38 -108 52 -21 -173
4882 -173 -65 -276 301 100 218 -87 165 -102 -68 85 27 196 -92 -147 93 -288 153 43 200 -81 -268
4903 -268 -12 -21 90 121 -11 -305 136 -14 32 -60 -167 -27 70 9 -98 171 150 -45 -51 -16 125 -282 -79 174
4927 174 231 -110 87 -118 -134 -79 50 -78 -46 -71 -23 -72 189 -70 19 -49 126 -64 -5 -16 -195 74 -144 -49
4951 -49 -234 48 -251 -81 -109 43 -70 -57 -149 17 15 1 132 -23 -6 93 -49 141 -25 -100 91 -15 34 181
4975 181 97 -291 -74 129 298 107 -12 66 383 -258 -177 -34 -31 -83 -166 135 46 161 85 -8 102 174 44 154
4999 154 39 -33 -61 -82 77 33 -141 -119 89 -109 44 99 -76 115 -209 -18 -129 -80 -142 110 -62 37 104
5022 104 64 122 104 -24 176 -207 216 -196 69 -18 72 -178 18 115 -115 -67 45 214 62 117 -78 91 259
5045 259 19 -31 -8 -90 36 -9 106 -19 8 -71 224 -118 96 126 12 139 -85 -18 188 -146 -168 56 -106
5068 -106 -165 58 -68 -182 35 -122 241 -320 -28 101 95 124 -87 10 69 -174 -75 -297 32 -141 -4 -19 -60
5091 -60 -82 -303 141 -168 -2 -36 -215 -24 255 -244 -239 13 -125 -52 253 -122 -144 -347 -74 156 -219 180
5113 180 131 197 -138 -204 -247 -29 -56 -122 -156 -176 -22 -99 -37 32 -48 101 316 361 55 14 11 162 -59 32 20 205
5139 205 85 -232 139 -77 194 -205 -117 56 -48 -59 77 -44 60 106 -49 -80 -2 -134 81 -194 55 -43
5161 -43 -224 210 -117 -70 47 133 -91 -187 161 28 76 -67 89 207 -146 -97 258 153 -47 239 40 -132
5183 -132 200 -29 183 -179 -82 96 -129 207 -303 -112 28 -48 -80 -109 -93 -80 218 166 -122 -38 -261 160 -285
5206 -285 -58 -31 -63 271 25 13 247 91 154 22 33 -62 24 -28 -51 -88 135 22 26 -200 87 25 -74 27 -233
5231 -233 126 -43 51 -251 40 20 121 131 72 -75 189 -79 178 1 233 -116 181 77 208 -90 -118 -274
5253 -274 -50 37 -142 93 101 2 -132 45 -130 144 -105 -81 126 101 45 -296 101 12 -62 -85 254 130 57 38
5277 38 167 -15 42 -128 -51 172 189 -13 -130 -81 -255 284 -6 1 -161 131 -99 104 -122 12 27 -288 104
5300 104 -181 -56 43 -85 200 -39 -129 131 -135 37 -8 -11 -135 -40 -77 91 44 -29 -193 146 -26 77 -91
5323 -91 -222 -216 -168 -80 -113 -178 208 277 -107 24 44 -69 -39 131 -184 229 47 -214 77 -202 163 42 113 -328
5347 -328 -70 -175 292 -20 42 -150 -148 179 -167 -94 94 61 87 242 62 -102 136 -29 -231 149 57 86 -87
5370 -87 -175 -4 235 218 174 -48 136 68 67 37 5 132 93 -302 123 -98 -198 -37 -8 -64 206 113 188 182 -83
5395 -83 -52 102 30 67 196 186 75 79 -16 -14 -159 65 -156 123 -29 -1 -43 174 -24 -2 -19 -120 173 174 24
5420 24 11 70 63 -242 -58 -249 127 -62 44 62 -41 52 1 -157 53 -136 64 85 -3 -22 -82 -239 9 -98
5444 -98 91 -310 -160 -5 -62 17 -24 216 -248 193 -25 140 -299 -15 -71 -5 165 -94 56 -172 -51 43
5466 43 -56 29 26 195 45 147 -63 -22 -63 -67 57 2 231 -58 313 -44 228 -104 -5 -39 109 45 -118 41
5490 41 65 -224 140 271 -141 228 -103 19 131 -10 -23 -105 201 -49 -75 88 -99 -10 45 281 253 109 225
5513 225 -16 -19 -85 -160 159 66 75 186 54 -201 -168 109 -56 271 153 91 91 -91 -155 139 -3 -260 -86 -91 -5
5538 -5 -41 -122 126 157 -76 -210 141 151 -94 -72 65 -308 186 17 -1 347 -127 -100 36 -15 80 -97 73 -31
5562 -31 -233 187 29 -70 -30 -33 -83 -178 63 72 -119 -119 85 -14 -60 -40 -26 178 -176 -5 -101 15 -34 -100 335 61
5588 61 30 -126 0 -42 -12 49 227 -46 45 -42 -3 11 -109 -105 68 65 44 147 16 43 -79 -89 149 -190 44
5613 44 13 -230 58 -228 -4 -207 54 -200 -106 -73 118 -108 -282 152 -101 -79 203 181 -223 33 -32 -147
5635 -147 240 -62 8 -101 -203 -106 180 6 79 52 124 -36 -135 215 149 93 121 27 123 -80 -52 23 29 72 10 227
5661 227 74 -19 133 91 141 -52 142 148 0 -1 136 88 -34 103 -102 -5 41 -69 60 9 77 -54 36 167
5685 167 -121 184 -63 48 163 -98 56 -291 123 11 11 194 46 87 -179 -79 98 62 86 61 -39 1
5707 1 141 -20 120 -83 150 -116 156 138 -43 71 195 -179 -92 -165 -278 -146 138 142 92 -97 -101 -133 192 -116
5731 -116 198 -109 -118 -237 -48 65 101 148 83 -36 -18 -42 35 186 -180 -157 -75 134 111 36 112 -68 -87 -241 -215
5756 -215 151 -288 141 -147 102 -95 -13 -43 -154 -63 -97 -406 50 82 76 -35 -59 21 -207 150 137 56 -70 -29
5780 -29 145 -135 -152 106 68 15 7 61 301 -10 -134 51 -65 -105 -127 -50 -189 -55 15 -119 -41 0 62 123 -20
5805 -20 186 -204 -300 -65 104 57 -20 60 -76 -17 18 328 -27 38 192 -167 -110 146 206 86 -108 167 127 -47
5829 -47 -151 -46 21 145 -121 85 -40 -158 30 216 -93 -186 90 147 -100 -139 -58 -16 32 96 -29 48 349
5852 349 -107 -195 -133 -165 237 -60 -208 -77 81 60 -78 29 210 -213 117 -96 315 -122 32 -9 83 89 -27
5875 -27 38 189 -36 14 114 31 56 -188 175 -28 140 -108 -35 -46 4 79 -94 -166 -40 204 -19 184 283 21
5899 21 114 81 31 -141 -49 -87 3 -218 -42 -72 -121 -37 -25 -82 -33 -8 -4 -11 167 -77 -96 54 -60 161 173 45 190
5926 190 127 -34 -5 -88 -130 167 -80 -160 279 29 95 26 -188 -7 3 287 23 55 21 232 11 -144 13
5949 13 -107 17 -74 22 -43 -91 13 140 290 -27 -13 -56 -41 -200 163 -51 5 124 58 211 -129 -29 -36 102
5973 102 16 -120 123 22 -233 -173 96 40 -50 -105 -46 -339 40 62 121 -75 -9 209 214 -36 -40 53 -66 -26 301
5998 301 -249 -162 -49 -133 28 -146 66 -226 279 -40 -240 5 5 -126 56 120 81 138 -102 -3 -76 281 31
6021 31 166 149 -114 160 144 -27 -39 -81 161 157 16 74 33 -94 106 -63 -48 -91 -141 28 -323 -56 23 214
6045 214 4 198 -141 -118 68 -123 71 116 113 -178 -185 49 80 -8 131 -188 -208 91 -110 -5 -171 5 147
6068 147 142 -12 106 21 3 312 -130 -128 -194 36 10 67 183 -118 95 -36 -273 -6 146 -2 49 -49 282 -89
6092 -89 314 -109 -158 173 106 62 -335 73 36 37 61 -41 14 -261 -99 196 70 25 -80 -72 80 -174 -3 167
6116 167 -84 -160 -98 114 181 75 124 286 -236 -34 29 23 56 -28 95 -17 -68 75 -61 -51 0 -131 -96 148
6140 148 221 -5 -213 69 133 267 -88 -198 -198 132 -7 -26 143 -94 -81 2 -51 250 61 -26 147 -107 -48
6163 -48 49 81 -192 5 12 219 158 43 -97 -8 -281 32 39 75 10 -105 161 170 12 116 -300 76 -188 52
6187 52 20 -76 233 2 -102 -70 20 334 -60 12 -274 -139 179 -71 -89 146 -13 64 -79 162 -10 -95 -31
6210 -31 163 -154 -21 131 17 25 -106 7 67 -56 25 186 215 274 251 -161 214 145 -100 -126 -84 42 173 354
6234 354 -81 107 -151 -71 -182 -39 -275 -73 10 56 183 51 -277 15 -101 180 -14 -80 198 -230 -46
6255 -46 -64 9 51 42 256 6 12 -145 -103 80 -115 -76 -111 199 -26 -265 132 160 166 -21 -265 115 -61 -75 60
6280 60 87 212 -71 20 93 111 -16 -17 328 -64 -44 74 -138 52 49 -72 189 -90 -86 113 -43 -158 1 -270
6304 -270 -190 -62 284 152 21 -25 -90 18 127 -80 -71 104 -68 250 -35 -198 61 141 -60 137 174 -146
6326 -146 -63 -77 7 270 -274 -1 -155 79 -126 169 115 87 -124 -278 115 158 -279 63 -37 -29 10 157 -181
6349 -181 50 221 -136 -182 117 20 -144 90 -315 293 -72 -129 5 -34 -98 96 -146 99 285 -231 -137 -13
6371 -13 139 -103 157 299 -194 116 25 -135 37 -24 -85 16 182 -63 -86 -187 250 62 -73 -98 260 -300
6393 -300 46 51 -151 5 169 22 -66 -133 28 -22 -28 -134 -67 1 -198 59 -74 78 170 -102 -121 158 -79 122
6417 122 -125 8 205 -35 155 128 113 -116 -25 49 65 198 232 155 5 258 -44 22 7 -108 -83 -27 106 -249
6441 -249 -108 -132 -110 -161 64 195 51 73 248 -58 66 289 9 -46 82 40 -221 91 160 177 274 122 -26
6464 -26 -133 4 86 -75 -50 -188 141 -4 -22 -108 -2 -298 -126 64 -106 -139 -196 -30 -38 13 -245 96 191 -183
6488 -183 -326 -85 183 119 141 20 81 94 19 -117 -95 -98 -108 143 237 190 80 -9 -129 -64 87 251 222 34 -136
6513 -136 -27 17 -103 -45 -95 -178 59 91 183 181 77 -41 201 3 -245 -153 13 30 -42 -43 -169 1 52 3 252
6538 252 -5 -65 -181 34 118 30 120 165 -35 135 -113 26 -31 -59 -47 323 -187 99 143 -82 -130 71 -78
6561 -78 -135 -164 44 -58 -69 -129 -73 61 28 -82 -175 -211 120 -255 177 160 0 323 -21 -104 112 179 14 78
6585 78 -151 -153 24 230 -6 -68 -139 -219 73 10 20 252 -110 -139 140 217 -52 -73 228 -172 70 -147 -8 236
6609 236 47 36 -133 168 -126 88 104 -78 -20 -132 -126 -33 145 -135 -193 94 243 94 278 -234 147 61 59
6632 59 -10 146 51 -1 124 23 -172 33 206 -8 -62 -11 64 -37 -138 -21 -245 82 -86 -275 250 -218
6654 -218 -67 -50 -78 32 -126 209 268 81 172 206 -116 52 -121 -35 -54 -104 -86 -30 -233 204 -53 -89 -123 -210
6678 -210 85 -69 148 42 -9 121 -5 1 4 187 290 196 -174 108 -49 69 -88 -322 -50 -142 -182 -145 140
6701 140 62 -34 -204 -164 -233 93 26 235 122 0 142 -323 197 78 -68 -241 -107 247 -57 197 4 52
6723 52 -83 36 16 -129 -40 -68 141 91 -68 197 143 -54 -8 -4 -192 188 -67 153 -140 -74 150 -16 -68 38
6747 38 -133 -38 139 78 -205 -130 -12 -164 -160 -94 -123 -327 132 -190 94 -126 219 -151 85 -310 -70 -68 -209
6770 -209 42 42 69 -71 -7 -24 76 -173 30 79 -194 126 -344 -125 88 95 29 -165 79 -11 -136 -203 -50 -4
6794 -4 -114 -289 -416 60 48 66 29 -358 141 174 -295 -45 -68 -274 -140 -56 -40 120 89 -43 -85 88 117 26
6818 26 56 83 -30 -20 5 -182 -27 138 -15 191 175 -76 111 -165 -65 73 4 -138 -8 -94 153 130 -73
6841 -73 -60 23 239 42 215 -38 49 285 79 -16 30 22 -189 173 -32 213 61 -15 -87 -28 -64 -155 48 80 43
6866 43 -169 3 157 -19 170 -201 -279 209 39 113 -75 3 146 -38 210 175 98 65 -131 -270 319 -159
6888 -159 84 -89 12 -103 31 -62 -18 53 -144 -83 86 153 -159 -14 -9 -78 71 -54 -113 166 244 -23 183
6911 183 -207 -178 368 90 201 -71 251 -49 48 50 -263 93 68 195 14 -109 -43 -6 -212 -36 117 -14
6933 -14 24 74 61 3 21 124 -130 31 155 -234 -27 223 -107 43 9 -106 -84 -294 9 20 3 171 30
6956 30 -278 -256 18 6 -46 68 -22 151 -27 -167 69 94 42 12 3 -205 42 -48 -79 152 -110 34 55 -178
6980 -178 155 157 -131 40 20 140 45 -32 85 22 -132 -81 202 119 -71 109 -107 -211 46 54 19 -48 44 -140
7004 -140 -240 -117 164 -90 254 76 -183 165 34 157 -29 -142 -41 175 44 95 62 50 399 -86 26
7025 26 70 35 280 114 -172 52 211 -33 -131 -105 151 -14 37 -26 37 -284 -147 -177 65 -93 -233 6 170
7048 170 -55 -243 -9 102 -19 43 94 0 111 174 159 -109 0 -74 -128 -328 78 166 -274 36 -95 -31 -24 208
7072 208 -81 142 -14 -122 40 17 -138 -166 -43 -194 147 35 95 -102 -159 194 -8 34 9 0 49 -127 246
7095 246 -7 96 53 205 39 -156 58 156 245 102 -75 -74 -37 16 19 -61 130 -160 156 68 -14 -37 169 -23
7119 -23 -137 -56 80 27 -104 -110 83 -221 145 126 76 201 -65 32 60 -175 -8 115 3 36 -100 -143 79 43
7143 43 202 84 52 -144 123 100 -86 -67 50 -100 129 -8 -35 -72 105 -101 248 -74 117 240 22 -20
7165 -20 30 145 -17 -157 97 -33 -58 -60 -92 15 -79 -137 -114 -223 151 21 110 283 -173 -17 -124 174 83 -42
7189 -42 103 322 13 -197 138 -135 12 12 71 -52 101 79 156 19 194 191 -14 198 163 60 181 173 -162 118
7213 118 49 -66 -137 -247 101 -123 92 164 -62 -125 -258 62 -87 -104 -58 108 -273 -142 60 -60 14 -148
7235 -148 33 -64 -18 -205 51 -134 -68 172 -35 68 -129 -28 -241 -58 173 -86 87 -22 280 163 229
7256 229 242 -124 64 139 -20 -17 196 192 -45 -62 -76 -12 -115 -29 243 -178 -134 -173 -166 171 120 -126 16 173 108
7281 108 -75 -50 -215 -237 96 61 -127 152 83 -87 -29 96 -210 -175 1 -89 145 79 172 -240 133 -28 163
7304 163 182 -96 140 44 -167 109 5 6 -120 -21 -74 -50 69 51 34 155 47 -99 -106 -125 -20 235 -45 149
7328 149 1 185 -45 59 -246 89 -92 29 -115 11 40 -26 -91 -200 -64 86 -265 45 71 -1 144 -42
7350 -42 6 -114 155 -102 -305 156 -78 179 -243 -116 87 -31 115 188 -20 14 -181 -334 -233 -51 125
7371 125 77 184 -91 -16 23 -178 56 160 38 30 -58 99 207 352 -118 178 0 -217 -99 -31 -107 206 57
7394 57 -131 131 378 -22 -83 143 57 37 -55 -152 -113 67 365 75 -61 104 -29 30 -50 -175 -16 -315 -45
7417 -45 -134 -8 -129 117 141 79 19 -16 5 -77 -97 -262 178 -91 59 -1 244 17 -79 19 -29 165 -29 -3 88
7442 88 -81 115 -14 53 167 31 36 -152 -31 -204 -15 6 -179 310 238 187 128 -12 -420 185 -237 -126 69
7465 69 -40 -66 79 -167 -42 -83 18 23 -8 356 35 32 184 -388 -78 -6 53 170 -97 195 228 19 -72 -285
7489 -285 -32 41 -21 17 132 -162 338 100 -107 25 -79 41 -76 -77 -351 123 31 -85 -66 -45 128 -174 -45
7512 -45 186 199 -99 248 -37 70 -129 41 134 167 -27 9 -5 53 -48 0 84 166 -80 -56 -45 212 -61 -104
7536 -104 17 -148 308 -165 -43 60 242 -76 -34 69 96 -24 39 47 -192 42 138 170 87 82 -33 -168 -20
7559 -20 42 176 150 93 163 50 223 263 29 -194 102 94 -58 -74 -52 131 155 194 205 36 114 179 -38 15 -23 78
7585 78 -56 -179 334 -57 -216 115 38 -117 76 -78 65 95 182 341 103 114 40 111 106 -33 64 -35 95 130
7609 130 67 130 -1 -14 68 117 132 160 2 -34 -10 -79 59 -64 23 -238 -52 7 -94 110 115 170 40 17 7 -53
7635 -53 42 -308 164 427 -346 176 8 -171 173 -195 103 -89 247 27 172 -2 -7 -186 195 57 19 340
7657 340 -191 19 -80 149 -36 -32 -203 -130 183 -350 1 5 193 213 -54 78 -25 19 1 -44 192 -53 69
7680 69 38 -93 108 34 -122 37 -227 -7 -52 72 93 65 79 129 -153 -175 47 -283 197 -119 -259 -139 -121
7703 -121 83 -135 18 -89 -105 3 -49 -48 168 72 51 281 128 6 -105 0 106 -238 200 60 -64 -34
7725 -34 -30 111 -121 -168 30 306 -479 -61 -36 25 -56 -104 32 72 165 286 -24 10 250 -87 -79 181 -30 114
7749 114 -131 126 80 -376 28 40 5 -32 -38 103 -51 76 25 -29 113 -225 93 -62 50 -150 158 4 -6
7772 -6 -25 31 37 -169 225 7 70 -116 -125 229 84 37 91 -332 11 109 -109 -32 37 39 107 215 -102 -50 -191 -19
7798 -19 81 -107 -194 90 -167 197 -73 175 43 -201 -136 42 156 -49 18 260 -67 189 35 -96 -31 -101
7820 -101 -53 29 -73 -206 -139 71 249 48 4 -200 137 -15 -11 -41 -158 37 -157 60 17 84 87 -127 -41 103
7844 103 -89 64 -129 89 -77 67 -50 188 19 -108 122 -58 -141 -35 40 64 72 -125 -56 -187 -88 -104 -93
7867 -93 -12 -85 92 -91 -55 -56 -183 207 -117 8 -1 72 -30 -211 202 -7 -50 72 -145 151 281 247 165 206
7891 206 3 97 30 -42 -4 225 -43 -129 263 124 200 201 93 151 -43 -38 154 69 146 -214 -146 -106 0 -142 189
7916 189 -8 -37 223 198 312 -40 -167 223 335 31 -53 -119 -35 -223 85 6 117 -97 -137 -48 59 142 -4
7939 -4 141 -138 -226 -51 66 114 120 104 46 -92 13 23 -200 62 -62 -97 -39 118 91 -181 -119 -153 -53 164 48
7964 48 -51 -141 4 76 105 -156 70 25 -188 0 -114 -32 69 0 75 65 -130 -55 -102 163 227 8 121 -107
7988 -107 101 103 86 -88 -99 -258 2 -186 -111 38 191 134 -38 51 -66 -65 197 -129 273 207 52 57 -35 -34 284
8013 284 113 -141 23 137 -111 -258 32 -34 78 114 2 -61 -55 -211 101 67 -196 26 -145 10 110 -171
8035 -171 -80 140 29 -44 57 -119 62 199 47 76 -210 9 191 -23 125 42 67 -70 62 115 123 -153 -48
8058 -48 66 -4 -129 128 -83 -120 6 -99 110 17 30 -26 -187 -107 178 152 -42 49 285 110 35 -279 -64
8081 -64 157 -158 204 73 73 -226 -223 -105 152 48 87 110 -88 -252 27 79 24 -44 -189 -128 -140 14 182 -161
8105 -161 35 -85 197 -89 152 -46 115 95 11 162 38 -58 47 -183 9 -15 46 -130 180 -112 76 166
8127 166 -139 80 -31 -264 -149 4 -26 246 -26 30 98 -277 -83 121 29 -153 -38 20 6 -171 -207 134
8149 134 -78 0 81 -83 -37 -4 -72 92 35 11 -94 137 -114 -83 131 -1 -71 145 -66 -154 60 43 -357 68
8173 68 -133 -69 -277 -276 -194 -160 -61 -79 -39 -37 -50 170 139 -23 147 -66 -60 178
8191A78
$$ Imaginary data points
##PAGE= N=2
##DATA TABLE= (X++(I..I)), XYDATA
0 0 0 0 0 0 0 0 0 0 0 0 0 0 0 -8 8 -8 8 -12 16 -16 24 -24 32 -32 40 -48 56 -64 72 -87 96 -111 127 -143 160
35 160 -183 202 -228 255 -284 316 -352 390 -432 477 -527 582 -641 707 -779 859 -945 1042
53 1042 -1150 1270 -1407 1562 -1738 1947 -2191 2482 -2843 3297 -3889 4699 -5879 7766 -11274
68 -11274 20045 -93980 -97353 51822 -34677 -78256 -37896 26554 48423 40764 -11212 31231
80 31231 106234 53459 -38573 24122 75337 -5658 -54708 2489 17791 -16953 -47204 -64703
92 -64703 -35917 19537 -17135 -74471 -15662 51245 4934 -21779 32562 56957 34350 21338
104 21338 7077 12205 34203 -6900 -64684 -20496 28036 -30581 -70679 -15503 19394 4807
116 4807 4037 4483 11171 41831 29549 -15640 7633 44210 -3507 -37083 8074 18834 -24721
129 -24721 -27898 -5197 -2557 1443 -8756 -33995 -8960 32225 2886 -27176 13622 38122 9065
142 9065 3241 20922 17057 13288 8659 -11918 -8883 9427 -14686 -38976 -9046 10009 -14363
155 -14363 -18508 3721 9044 8325 9275 -1571 3073 20330 3258 -18827 1580 15080 -8524
168 -8524 -13377 7304 7880 886 2810 -1606 1495 15580 3185 -16968 -487 14428 -7419 -16995
182 -16995 1503 3025 -7009 -4260 -4367 -5967 3345 -355 -12752 -7 14652 329 -7100 11357
196 11357 16909 5546 4771 7359 4859 4911 -1605 -13578 -8962 -1017 -13561 -20785 -7386 -582 -6665
211 -6665 -4014 4027 8236 11358 9397 4313 9983 14961 3510 -4687 3296 3262 -7458 -9055 -6194
226 -6194 -6824 -6091 -6994 -10196 -3789 3616 -2417 -4721 6813 11675 4880 5138 10405 9112 6211 3782
242 3782 -1525 -2164 -121 -7775 -13850 -7863 -4674 -10311 -9483 -1495 1632 1587 3825 5938 9142 10922
258 10922 7151 3413 5912 6138 -1221 -4830 -3094 -3183 -6874 -8478 -7464 -4647 -3225 -4387 -3163 2162
274 2162 4333 2310 3249 6468 7179 5539 3646 2842 2934 2065 -2157 -5015 -3129 -3442 -7035 -7079 -4085
291 -4085 -3553 -3245 -1142 887 2541 4284 3750 3687 6155 6199 2052 -30 1462 1071 -2639 -4732 -3878
308 -3878 -2845 -2946 -3567 -3279 -935 1367 988 53 2004 3425 2003 650 1285 2183 483 -1285 -180
325 -180 990 97 -1406 -1197 -7 95 -514 -961 -395 618 163 -883 264 1858 1165 -557 172 1115
343 1115 446 -1073 -1364 -1135 -592 -594 -833 -796 1412 2567 2562 1979 2329 2512 1290 186 -240 -1489 -3074
362 -3074 -3587 -3009 -2797 -2757 -1630 -725 787 2547 2361 1570 3196 4354 3025 1267 1541 1432 -107 -893
380 -893 -976 -1461 -2042 -2436 -3013 -3182 -2385 -2689 -2760 -923 1038 838 1621 3425 4492 4544 4009 3726 2712 1403
400 1403 -466 -1697 -2510 -3636 -4890 -4574 -3677 -2927 -1649 -1028 84 1517 3013 2062 1826 2761 2676 1372
418 1372 1455 1108 -319 -369 191 -942 -1688 -961 -1739 -3274 -1705 -678 -2342 -1345 915 1172 1194 2558
436 2558 2537 1886 2592 2292 261 -461 -787 -2422 -3290 -2282 -2574 -3100 -1606 -611 96 756 1660 1638 2053
455 2053 2918 1929 810 1383 789 81 -80 -363 -893 -521 -862 -1940 -1493 -1374 -2415 -2054 -614 -943 -1419
474 -1419 378 1304 1031 2103 2673 1692 1942 2631 1004 -455 461 26 -1886 -1373 -282 -1411 -1414 -86
492 -86 -463 -767 267 -449 -1484 -914 -2 -954 -1020 444 476 263 1419 2163 1570 1900 2234 1436 767 490
512 490 -681 -1350 -861 -1192 -1965 -1632 -939 -1045 -779 -807 -867 -489 608 427 212 1021 1328 1423 1804 1926 1234
533 1234 1562 1274 87 -352 -754 -1518 -2302 -1654 -2044 -2418 -1387 -203 -549 448 1845 1604 1338 2200 2035
552 2035 667 826 708 -835 -1028 -383 -1102 -1512 -1086 -923 -1439 -730 -71 -429 -311 1083 748 464 1596
571 1596 1747 1243 1635 1367 502 -15 22 -777 -1769 -1676 -2248 -2350 -1759 -1400 -1123 218 938 1107 1740 2349
591 2349 2158 1882 1866 1489 354 493 -147 -954 -687 -1068 -1473 -1841 -1057 -1507 -1396 -601 -438 -830 338 1082
611 1082 617 949 1507 1123 1138 1510 964 267 650 298 -754 -1233 -823 -1638 -1568 -995 -943 -1279 -542 -134 -96
632 -96 514 734 329 699 1146 670 294 636 579 -114 597 382 -195 -88 392 -420 -430 -2 -523 -818 -497
653 -497 -860 -920 -354 -126 -318 9 689 186 946 1222 574 531 880 300 -506 27 38 -1075 -540 -264 -1071
674 -1071 -690 108 -298 -691 121 82 -601 -133 599 -47 273 1045 813 509 984 842 -152 102 48 -1315
694 -1315 -1137 -685 -1173 -1494 -825 -106 -385 424 954 910 1068 1088 658 916 761 33 -290 51 -455 -711 -375
715 -375 -605 -960 -437 -53 -1046 -586 99 -131 -241 881 437 302 1251 1318 339 987 1741 77 -307 34
735 34 -574 -1824 -722 -714 -1598 -1152 220 -495 -356 893 587 601 1311 1101 -217 591 683 81 -85 129
755 129 -121 -456 -79 -500 -668 -100 -70 -669 -500 -402 -523 -260 523 -156 134 650 552 171 559 337 -220
776 -220 244 155 -629 -718 158 -387 -434 72 -25 -581 387 498 -382 -100 312 -137 -272 -6 223 -343 -72 726
798 726 -52 2 669 338 -210 487 -250 -672 -98 -317 -750 -733 -7 -400 -450 -66 -30 46 424 469 252 93
820 93 679 369 355 183 219 140 107 -134 -296 -94 -399 -927 -298 -776 -724 -140 -43 -181 229 637 660 295 1104
843 1104 749 652 579 390 19 -188 -160 -545 -838 -690 -787 -1011 -752 -282 -553 -30 147 273 470 499 890 726
865 726 583 550 429 219 157 73 -192 -218 -317 -467 -763 -797 -436 -438 -190 -101 11 189 529 992 869 903 762 681
889 681 202 298 152 -592 -606 -567 -1102 -893 -490 -420 -456 -115 158 562 212 676 574 445 535 567 535 187 199
912 199 53 36 47 -468 -311 -882 -811 -616 -424 -551 -334 6 -185 376 1019 666 897 1023 962 481 426 544
934 544 -189 -536 -473 -720 -787 -745 -591 -475 -424 -136 114 55 235 90 121 456 833 353 161 599 347 460
956 460 688 316 -164 -378 -209 -672 -995 -809 -459 -426 -141 -46 108 495 820 495 642 611 397 438 44 -85
978 -85 -370 -246 -154 -159 -49 -209 -31 -41 -140 -340 -218 -308 -327 -327 -412 242 31 173 401 360 499 820 312 -91
1002 -91 63 173 -508 -551 -462 -497 -496 -9 -35 -237 347 440 -228 39 469 -104 -155 284 123 -191 746 612 236
1025 236 398 240 -99 -164 -220 -394 -836 -549 -433 -800 -344 -59 44 -222 1004 597 397 479 597 315 311
1046 311 365 78 -95 -342 -542 -417 -217 -153 -591 -382 -376 -775 -227 -203 -3 -198 768 384 569 861 799 373
1068 373 445 379 -382 -288 -127 -862 -985 -621 -589 -1100 -116 79 -269 274 705 194 275 851 567 296 633 422
1090 422 -154 209 282 -626 -659 -106 -750 -1040 -361 -593 -1032 -438 283 -425 338 834 564 593 996 572 412
1111 412 715 557 -238 -1 -116 -834 -884 -474 -665 -927 -204 -429 -451 366 386 -338 637 808 422 589 1039
1132 1039 344 172 646 315 -359 -186 -106 -895 -698 -209 -1022 -795 106 -162 -749 112 619 -111 479 670
1152 670 551 262 655 236 -133 317 174 -667 -350 -128 -762 -559 -332 -385 -317 -74 -277 164 290 396 -17
1173 -17 437 601 213 258 385 326 -45 220 -49 -422 -92 -11 -612 -517 117 -586 -497 441 42 -398 543 553
1195 553 24 301 524 1 196 373 147 -605 -307 -312 -726 -273 -27 -323 -295 109 -316 -356 150 70 -129 70
1217 70 603 -10 332 424 59 99 430 311 0 -130 -147 -644 -409 -584 -993 -411 -257 -304 -216 265 111 190
1239 190 525 308 401 574 537 39 304 249 -239 -182 125 -35 -496 -175 -285 -786 -586 -209 -571 -462 -19
1260 -19 -7 -169 283 555 490 696 754 578 157 322 -82 -238 -525 -696 -686 -714 -508 -451 -222 -126 -75 -62 339
1283 339 430 392 70 551 347 416 529 451 343 485 -63 81 -306 -546 -506 -888 -612 -774 -523 -450 -26 176
1305 176 411 743 751 527 490 525 270 256 -470 -415 -296 -512 80 -280 -123 -62 -214 -143 -177 -380 -101 235 83
1328 83 26 288 274 615 533 510 410 420 -16 8 -147 -263 -631 -582 -385 -546 -365 102 188 398 210 87 430
1351 430 192 302 15 37 -75 -115 3 145 76 182 -98 127 -150 -327 -266 -276 -330 -380 -64 -196 -63 172
1373 172 98 348 310 376 255 241 124 111 119 -154 -250 -248 -451 -103 -199 -107 -168 231 -49 -144 -228 -192 -27 -85 210 135
1399 135 472 520 433 383 466 124 3 -312 -221 -625 -504 -622 -453 -633 -537 -98 135 195 353 444 368 390 170
1422 170 301 367 166 -17 -132 49 -136 124 -202 -343 -407 -617 -296 -576 -425 -198 -246 37 166 531 641
1443 641 621 865 548 511 335 189 68 -224 -438 -711 -317 -243 -483 -195 -59 44 -350 154 151 83 259 401
1465 401 446 395 569 195 378 368 109 0 -212 -305 -48 -331 -308 -453 -290 -72 52 2 249 514 368 611
1487 611 300 306 240 278 121 -64 -122 -323 -396 -100 -395 -209 -230 8 -116 48 162 32 -85 266 2 186
1509 186 580 202 262 250 188 -157 -106 53 -161 -284 -325 -460 -465 -512 -189 -182 -364 -12 441 302 259 588 458 292
1533 292 223 -172 -45 61 -93 -154 143 107 -55 -144 -196 -197 -358 -328 -363 -103 -62 -147 67 374 624 318 275 504
1557 504 161 407 24 60 16 -250 -137 -228 -301 -140 -326 -25 -21 -255 -200 298 -84 -25 -74 184 391 281 399
1580 399 262 457 85 194 116 453 102 -315 -409 -442 -488 -301 -220 -353 -360 170 30 247 279 383 382 311 52 -88
1604 -88 -223 12 -125 -97 -286 -198 -224 -63 -16 -506 45 -208 -13 57 164 29 418 334 340 230 345 241 -108
1627 -108 87 -59 -304 -146 -240 -642 -369 -143 -305 -267 -184 70 331 113 363 423 312 143 -220 165 200 -68
1649 -68 39 -30 34 -3 -102 -113 -215 -208 -317 -43 -111 -42 -45 119 402 120 66 139 435 263 -27 162 49 -203 87
1674 87 -120 -169 -107 -212 -341 -299 -172 -96 77 121 141 5 200 266 73 128 182 38 118 182 68 118 -47 -78 -166
1699 -166 -106 -100 -558 -645 -288 -342 -134 141 -3 131 313 267 543 191 292 210 -90 -89 267 -163 -155 -354 -164 -99
1723 -99 -75 -424 -326 -109 -101 -193 44 -191 20 301 -81 190 207 485 127 400 61 -158 -206 -81 -291 -178 -132
1746 -132 -138 -283 -201 5 -208 125 132 161 63 260 21 40 83 70 -49 42 88 -171 -229 110 251 -167 -71 -436 -124
1771 -124 -379 -292 -166 -89 114 250 428 198 278 157 85 89 -73 -163 -29 -713 -197 -281 -188 -194 -57 0 9 87 68
1796 68 263 -7 163 259 36 -5 282 255 259 157 -269 -16 -26 -290 -217 61 -145 -330 -105 -220 -229 42 -90
1819 -90 94 114 127 160 293 199 340 -18 -156 134 66 -182 -70 -64 -168 -81 -582 15 24 -333 -233 15 105 49
1843 49 -203 45 -42 205 243 -141 297 -71 -151 -61 -112 69 -423 -106 -185 -153 -179 -68 -91 -8 -89 335 123 42
1867 42 531 13 -10 112 201 189 30 395 109 -185 -195 -63 -169 -165 -587 -145 -300 -212 -177 -161 -214 -21 110 161
1891 161 304 316 258 99 278 38 157 30 82 -121 -190 -27 -3 -163 -124 -62 4 176 158 160 -37 157 102 95 249
1916 249 165 189 93 34 -161 -371 -112 -410 -377 -288 -335 -223 -114 -9 90 268 124 18 327 139 308 103 -5
1939 -5 -104 -228 -106 -322 2 -228 -264 -279 -152 -74 -2 -52 38 -50 -44 157 61 295 112 259 10 174 145 -77 -15
1964 -15 -171 -233 -145 -396 -303 -204 62 -163 -180 -140 14 280 111 131 110 79 113 28 41 14 113 233 52 -192 3
1989 3 -158 -156 -165 -142 238 -67 251 -239 80 32 13 120 172 106 -8 175 61 61 58 -207 -79 -179 -168 -155 -137 112
2015 112 -138 -43 60 78 -176 -96 31 -85 195 87 171 287 288 302 172 79 104 124 68 132 -107 -303 -287 -180
2039 -180 47 52 15 -126 86 -44 114 176 286 217 270 95 -36 288 48 -260 -153 1 -76 -88 -209 -261 -259 -165
2063 -165 -20 73 74 124 -112 144 232 201 207 57 -8 -109 -112 -77 -193 -238 -20 -346 -249 -86 -96 -59 -164 313 259 -51
2089 -51 271 -19 180 34 217 156 110 135 -229 -95 -205 -150 -325 -231 -17 -134 -231 -87 51 -123 199 165 20
2112 20 256 195 92 168 -99 176 127 13 -113 27 -21 -458 -76 -183 -235 -247 -6 -98 93 136 -55 41 -74
2135 -74 134 113 -55 -153 -25 149 -2 44 -21 -125 -171 -322 -252 -12 -52 -143 -18 69 7 -23 474 51 87 227
2159 227 139 -5 310 -58 -114 -268 61 -64 -161 -60 -190 138 -129 -30 55 85 -82 65 -137 137 275 -18
2181 -18 152 144 110 97 179 186 2 -313 -64 -263 -272 -158 -169 -187 -249 -178 99 -74 40 21 414 387 61 14 193 99
2207 99 260 70 -146 47 28 115 -174 -312 189 -145 -59 -83 -250 -81 -2 299 179 150 -4 50 34 -62 14 77
2231 77 -41 97 -119 -147 190 -64 -189 -426 188 3 -53 -24 272 100 -5 173 319 -40 -25 154 246 9
2253 9 15 193 -65 120 -277 -114 -141 -199 17 21 -199 -89 32 305 143 374 222 7 133 132 23 -258 201
2276 201 -196 57 -333 21 -175 14 -206 24 -38 -74 26 312 187 194 271 -63 29 167 310 62 23 -9 87
2299 87 -223 -232 -169 -164 -180 -210 -60 -28 35 53 56 284 146 99 217 -85 -236 -28 5 70 40 185 20 135 -112 -139
2325 -139 -51 26 6 35 -46 70 301 57 176 165 -121 86 -109 348 -70 -151 30 -7 48 -233 97 -211 -25
2348 -25 266 -67 -282 -35 -28 44 -90 -156 -66 155 51 -89 18 -211 147 67 10 215 -97 -241 -103 -47 -101
2371 -101 -115 -373 -19 37 -95 -47 -25 101 74 -172 -60 79 234 193 123 130 -137 62 89 -195 35 -48 -98 170
2395 170 -210 -254 -96 39 40 -3 138 120 198 245 157 203 -1 -296 -97 -62 -218 -200 -65 -97 -185 -46 -214 -52
2419 -52 -36 -25 280 110 45 -29 186 -7 145 87 10 33 -264 -79 77 -117 -429 -262 -191 4 73 -190 -214 -267
2443 -267 -366 136 -125 -60 -22 211 17 -14 147 -82 -268 243 232 -257 131 23 -43 -142 -255 11 -196 171
2465 171 83 -98 -61 -59 84 -13 -95 111 335 149 179 -50 -187 165 -115 121 -34 -388 84 -77 -3 64 105
2488 105 -272 -193 -140 233 157 -23 150 191 116 -196 96 20 12 119 -133 -29 -45 460 -88 -317 152 96 -320
2511 -320 373 -117 58 5 305 87 147 -19 -18 236 -79 37 -53 -74 14 29 -230 -58 -328 -75 -149 -128 -72 199
2535 199 -258 -36 58 223 192 131 226 144 -85 233 16 -119 -65 -77 -352 -258 -40 -155 -118 -58 -164 -288 46
2558 46 328 214 -48 22 222 65 54 -265 82 -258 -60 55 -82 124 -290 -222 -249 37 86 30 288 -51
2580 -51 231 258 203 -111 162 420 116 52 216 102 -11 -39 -41 63 -3 -307 2 -107 62 -124 -211 67 93
2603 93 92 163 -88 -151 28 141 228 -134 -6 47 8 222 -111 -86 -286 -99 28 -79 -181 -136 -113 17 24 122 199
2628 199 -77 -184 139 98 231 -78 -16 -72 -13 -151 -318 -87 242 -3 11 -70 -289 188 152 -7 -118 -83 149
2651 149 106 56 233 9 175 -32 67 59 -82 32 -158 -47 82 -151 -91 -307 -101 43 148 83 97 -15 -81
2674 -81 385 26 -25 197 170 -237 -94 -143 -269 -141 89 13 -333 -59 -229 -153 99 43 -124 155 -118 -27 -21
2697 -21 -73 -17 91 -199 -223 -126 -140 -76 208 46 -128 -20 13 179 -49 31 74 33 -82 142 -134 189 147 0
2721 0 148 -91 -77 -42 84 151 -373 -236 -20 -25 -98 -108 91 -107 122 294 25 222 340 129 76 -161 94
2744 94 -83 -1 11 -92 -106 -126 -60 50 -179 -18 82 -35 78 76 10 254 4 52 80 -10 63 198 40 92 117
2769 117 124 71 24 -155 -31 34 -115 65 -61 42 226 -33 -65 26 190 139 116 -31 18 79 -19 -134 64 209
2793 209 178 86 -137 -23 -82 100 -130 93 -134 196 -37 169 -34 265 123 152 193 55 28 -63 128 -99
2815 -99 -181 -122 88 -331 93 -58 129 -44 239 -101 -73 -10 129 -36 2 27 -6 361 25 -138 -2 -123 99
2838 99 64 -84 0 -76 -295 -28 330 -99 6 27 69 75 153 76 18 27 -134 100 -93 40 63 -27 -244 277 -17
2863 -17 -62 -33 39 -90 16 47 194 107 -53 15 309 -49 -188 402 228 -25 -245 -29 59 48 -82 -65 -82 -81
2887 -81 -385 -201 -150 33 161 124 -39 113 -266 84 -116 44 -64 46 106 198 17 159 -42 -15 -8 -198 43
2910 43 72 27 -38 65 -172 -162 -96 53 72 -17 143 -140 215 49 120 -180 -11 259 76 35 8 -39 -80 -86 160
2935 160 -99 241 138 193 -196 -65 49 -166 -103 9 -136 -238 33 -199 -128 -75 -172 -69 -166 -22 106 94
2957 94 -37 105 10 -231 70 -65 108 -51 75 97 120 -187 88 -119 282 175 167 68 -18 10 -24 -230 24
2980 24 139 -150 -17 -111 92 61 5 -155 77 278 33 3 -2 194 -55 -113 -153 34 -55 -46 -139 10 36 212 77
3005 77 -94 -33 -112 -57 -142 14 -200 151 115 -25 -140 -24 -3 23 68 -188 -173 127 -36 -23 -12 288 125 138
3029 138 160 -86 264 22 123 -11 -335 45 73 38 74 -81 -70 -239 298 -103 -228 124 -25 -394 59 45
3051 45 -320 -161 88 140 179 -29 13 16 133 18 -2 -143 -195 -70 -35 230 -18 31 44 108 -42 65 149 58 69
3076 69 124 -19 59 16 35 -138 -67 -47 29 113 15 -68 -195 -74 -87 118 -212 -122 -8 290 135 91 -32 192 311
3101 311 -35 64 137 72 -131 -9 -37 -219 -172 -107 -174 30 -81 131 -4 122 -28 -88 242 1 83 37 -109
3124 -109 -41 -50 215 -132 105 9 -46 -20 -90 -66 76 166 -158 -185 -83 -124 -106 347 207 50 54 -297 -5 -131 -81
3149 -81 131 67 51 -187 -114 97 108 -73 61 -114 58 343 76 -57 110 126 262 -9 98 29 78 -141 -288
3172 -288 242 -152 -22 -148 43 -162 -44 -201 -67 -285 245 201 54 66 30 108 -137 183 53 90 -139 -79
3194 -79 28 17 21 96 -82 -124 -45 -5 -240 158 91 90 129 220 -154 3 102 6 265 149 -16 -91 -83 -45 61 27 -232
3221 -232 -346 -181 -155 78 -4 -198 32 139 -50 -5 8 -73 -41 24 125 -21 41 75 -146 264 62 134 -31
3244 -31 155 -22 -81 -65 -93 -32 128 -17 55 249 -136 -65 193 -138 178 -102 66 37 -62 38 -101 13 -101
3267 -101 42 146 20 12 29 -245 100 -8 10 -26 133 100 228 -9 161 111 152 125 -245 -91 -166 -48 -217
3290 -217 13 51 -28 -24 -67 -184 -25 171 -153 1 108 241 107 -53 -140 -44 -95 198 -97 -45 166 -64 -27
3313 -27 -48 6 -65 124 235 164 267 44 -109 -122 372 -45 -327 144 78 91 116 83 8 24 -77 74 185 29
3337 29 -97 97 80 -80 102 1 -30 113 81 22 -144 166 -34 16 -48 22 48 56 6 -35 58 104 131 235 176 114
3363 114 -73 210 170 -42 -64 -77 -242 81 29 -3 -217 219 30 -84 191 -15 -42 -34 195 73 58 25 -147
3386 -147 82 -146 104 -28 -42 -111 -374 161 195 -42 174 21 -71 118 -203 -37 -212 57 -1 -358 16 -65
3408 -65 -170 2 323 -58 92 44 -73 63 -95 11 -46 -45 112 66 -18 -69 -148 -316 150 214 189 -110 -216 -238
3432 -238 18 84 19 -90 201 99 22 -329 -101 114 -149 184 46 -91 -144 35 -73 -265 -79 310 -29
3453 -29 46 -28 59 -15 89 132 270 41 334 -1 -34 151 -300 224 -61 157 50 -178 -207 -60 -84 -76 238 61
3477 61 -64 -83 278 162 2 81 -10 122 244 57 -6 -110 -159 -176 -26 -155 -181 58 -50 -88 141 -75 59
3500 59 62 114 -68 -19 106 -21 354 -179 130 23 47 -88 113 90 -135 123 30 164 27 98 -185 105 6
3523 6 132 -113 -26 -24 -49 122 59 54 40 138 -123 -88 -186 -133 -229 -108 -16 -30 -60 -28 157 34 397 -2 130 -166
3549 -166 -49 -121 -28 181 -172 -4 114 12 112 22 223 -155 73 -62 -129 -80 125 113 -293 -224 -101 72
3571 72 164 -119 -1 204 -98 18 -111 -47 -177 91 -155 8 -81 -182 130 47 0 -24 -22 64 -120 74 -155
3594 -155 100 -143 18 -93 232 -57 -267 -79 -122 20 -38 -214 3 37 1 -60 -48 119 173 -9 17 20 -199
3617 -199 10 -131 114 169 107 -50 -91 -195 -156 -259 -5 23 70 58 -159 83 -50 -173 92 122 45 -99 -15
3640 -15 10 167 53 -46 -99 114 -7 -142 66 16 102 141 -117 48 -89 95 91 -210 174 -146 -106 -141 168 -92
3664 -92 -17 -71 -62 -161 -100 225 -57 87 32 -7 73 -209 62 127 -188 38 65 -140 -206 -84 -40 -117 272 95 -28
3689 -28 77 127 -135 88 96 39 -130 -212 -93 167 63 -98 153 -200 -24 118 142 94 244 -303 241 -179 109
3712 109 -179 -221 41 9 213 98 96 -60 3 27 212 71 -105 -208 49 -132 -27 73 202 152 -59 -13 -91
3735 -91 -34 151 8 -193 -97 283 -118 -156 158 -158 -342 -115 -139 18 80 -146 121 59 -34 122 -66 105 106
3758 106 -70 143 -80 194 235 -102 99 -161 -49 115 166 -186 -50 226 146 -218 91 222 -31 -326 -235
3779 -235 -93 34 -156 216 163 -225 -36 76 -67 34 -103 141 48 121 -61 -105 -158 91 -32 -39 -18 222 -63
3802 -63 -213 180 62 239 -12 40 -19 43 56 180 220 -151 -146 -95 -289 11 -208 -52 -28 49 133 -53 84 180
3826 180 94 121 -38 -92 -114 10 396 -87 142 27 -50 75 -145 -29 -157 -11 70 -44 190 175 -29 -116 188
3849 188 -225 -314 71 -235 -149 -10 26 18 88 90 -134 167 -61 -134 5 29 89 -43 -118 44 -77 -73 241 -48 -208
3874 -208 -155 -158 -98 44 191 -97 -170 -34 75 152 -7 -266 -46 -33 -128 -95 -2 71 58 240 -1 -8 -51 208 230
3899 230 96 51 -194 -313 42 -358 -74 19 -109 183 -131 64 -230 -341 -110 45 -81 163 44 86 56
3920 56 -32 238 33 -167 50 186 -103 -96 -102 89 184 -28 102 -36 83 -75 46 -97 154 -79 -161 6 -20
3943 -20 -59 148 -55 -307 -113 -130 40 -57 -168 -189 132 28 -80 106 -7 84 -203 -154 -40 -101 313 138 -95
3966 -95 149 -133 -33 32 -262 284 83 -41 11 -94 -130 -17 -128 -289 -118 95 80 -103 64 11 -42 -288
3988 -288 38 121 32 118 82 -51 98 17 -9 104 19 125 -195 65 -163 -63 24 -46 -263 -64 -120 129 -101
4011 -101 -129 159 -52 -15 -77 305 160 223 -231 274 11 5 -133 53 -142 -163 74 154 121 -31 -89 -20 221 104
4035 104 -162 22 -110 -54 -152 -195 267 -4 -110 -126 -101 -35 114 41 -26 138 -106 108 -57 -76 -172 50 170
4058 170 55 -121 78 266 229 25 229 -173 -172 52 22 -99 -119 81 -198 -3 -92 82 -194 -153 44 40 5
4081 5 31 49 43 -290 70 139 -16 31 176 44 -17 -12 98 203 -307 121 -108 67 -198 -168 12 33 -67 -77 122
4106 122 -363 -85 91 -39 194 -1 87 -124 271 -27 -5 -383 -176 133 24 -70 -259 81 -40 -125 65
4127 65 28 -194 -12 -285 -17 -20 -86 26 52 41 -157 84 309 -93 147 7 -15 -79 -190 -57 -143 70 161 129
4151 129 -85 -81 -38 211 -3 43 -30 85 -86 -156 106 -287 127 151 -118 51 -78 40 -55 109 -114 171 -8
4174 -8 329 -140 367 69 18 -171 -128 3 132 -64 -18 95 -115 46 -151 -65 -103 -191 146 -95 12 83 74 -49
4198 -49 30 -86 180 -10 25 -55 147 -102 138 -30 118 -43 -156 -112 -36 -15 -209 171 214 -40 136 25 -199
4221 -199 -91 -42 48 -144 -157 196 107 -235 -149 -75 -231 68 110 32 -262 181 167 -287 -52 -119 252 236 -21 -215
4245 -215 4 26 64 -1 257 -240 32 -43 -17 18 -39 201 158 78 177 48 -129 -64 -197 26 71 -90 78 70 56
4270 56 22 12 137 -123 81 -13 -176 -25 12 -154 100 -48 -33 -280 35 -196 70 -50 -198 -182 51 -44 134
4293 134 -240 -240 118 -115 225 -1 -295 151 19 159 -85 -117 189 114 -18 66 -25 94 -114 -226 -49 116
4315 116 310 -35 -4 186 -46 -256 -41 -52 108 76 1 153 10 200 80 184 -130 63 -101 268 -34
4336 -34 -172 -122 149 83 125 49 40 -387 -106 126 -10 -140 -56 222 -12 58 49 -328 -83 -301 -118 -54 -189 -192 398
4361 398 -79 45 -172 108 -40 110 4 50 304 19 -114 -114 -97 -328 324 -9 2 43 -49 -142 159 -193 107
4384 107 -125 -193 -31 125 -114 -27 -63 -83 -16 -42 48 189 -135 14 -217 -109 -57 70 10 -110 -241 -187 -53
4407 -53 -4 48 -177 -8 -338 93 -34 111 196 211 -70 -54 -60 74 -180 165 260 -160 -143 -80 202 -21 -65 108
4431 108 -55 -136 -169 -148 78 71 -125 95 193 -69 120 102 10 -170 82 0 8 77 85 -77 86 472 219 45 360
4456 360 -139 59 2 -27 -11 -3 159 216 -193 22 70 45 -83 124 -66 -77 157 -112 -32 -31 86 93 43 77 -53
4481 -53 36 44 -123 -92 -48 -198 -52 222 -133 147 -18 -22 -91 128 -266 30 192 -56 -87 166 76 52 106 185 -174
4506 -174 -79 -81 68 -123 208 -19 24 -94 139 31 -132 172 -94 54 -95 -28 -58 57 -75 85 43 28 -122
4529 -122 -175 -85 -178 62 -21 -202 109 -186 -35 80 16 -27 -95 -22 92 -111 34 -31 36 -70 31 -40 52 -91
4553 -91 -111 -196 139 -40 45 95 -195 104 22 116 -105 126 -81 -93 301 -33 -85 17 -100 -54 -219 114 59 -86
4577 -86 43 -132 -280 -55 154 -143 76 -125 35 48 -9 -20 144 128 99 131 -112 45 15 -259 -129 69 101
4600 101 -168 156 235 268 135 -197 302 -60 -46 95 -183 105 41 117 178 -207 83 -222 -77 -101 155 -112
4622 -112 -201 71 293 28 -294 -145 102 6 -310 -201 -237 -46 -1 -109 -62 -102 -315 -69 356 158 -199 -23
4644 -23 71 -177 257 8 185 19 -51 56 2 131 142 273 -96 -81 -150 148 214 -158 2 -26 -110 66 146 127
4668 127 -11 -154 86 98 -84 33 -255 -59 107 134 -5 -215 25 -103 25 -135 78 259 87 -4 -136
4689 -136 4 -113 27 130 -108 -21 153 117 74 5 -68 28 12 -44 -33 84 -163 -54 -76 2 55 34 360 174
4713 174 -343 60 -151 -23 -96 -62 54 -52 -61 7 -93 -115 -58 -25 130 6 257 -162 -43 142 -59 -3 -71
4736 -71 111 -149 -128 -90 48 157 -44 -113 -97 1 87 211 -46 -172 111 -6 -28 -80 22 -199 246 26 -93
4759 -93 -76 -120 12 144 128 -38 121 -10 -82 -60 -73 7 -324 132 66 -162 89 -211 89 -26 -114 7 -58 22
4783 22 -213 197 105 167 -17 78 -21 -148 -77 130 46 9 -65 -3 121 67 -70 -15 -52 -18 -8 -15 81 -130 -19 -91
4809 -91 68 -105 -141 -41 -81 -37 -138 -65 -216 -47 -88 -106 -106 -70 166 -101 -22 36 -34 74 -109 130 18 27 74
4834 74 165 9 -172 -199 220 18 -45 85 57 -8 34 5 139 -139 22 397 226 -58 137 22 75 -203 -110
4857 -110 24 38 -12 -183 -80 -143 100 -90 88 83 109 125 -25 3 110 84 -71 310 -23 18 228 -15 229
4880 229 -128 -112 264 74 64 -68 50 -56 -15 -87 -28 39 144 173 138 -119 51 27 111 102 -69 9 -5 27 115
4905 115 -6 -34 -271 135 -148 -19 -81 -28 281 -61 -105 82 60 -124 18 60 -19 188 114 -70 -111 92 -249
4928 -249 -199 89 194 -81 -160 62 252 45 226 99 -188 113 -43 112 -34 27 -88 94 -16 -98 46
4949 46 -99 -209 -203 35 50 -17 -110 -9 -82 126 -104 -71 -26 19 208 100 45 1 -175 17 211 78 11 -84 -66
4974 -66 -8 92 -65 106 -84 65 24 -177 171 144 -197 -123 96 -89 77 -52 -40 -66 -175 13 160 74 285
4997 285 -85 184 -15 309 29 140 -210 -124 -95 -5 -35 139 91 64 -71 -226 22 293 70 30 1 -96 47
5020 47 -238 -129 99 35 82 81 169 14 -70 58 -33 -149 -41 -186 142 -65 83 -279 -1 142 -57 8 -22
5043 -22 243 19 36 -107 -33 -49 -52 183 -188 129 -253 -82 -110 -95 49 13 -3 85 -35 21 -30 -143 362 -115
5067 -115 135 -5 -210 189 174 162 133 -218 -86 -42 -143 -155 194 1 79 183 -54 59 149 -65 5 -70 93
5090 93 197 -168 -84 -73 98 28 166 63 228 18 -94 222 76 -183 -109 5 241 111 6 -48 42 -134
5112 -134 47 56 -13 143 222 -53 -41 223 -11 -35 72 88 -143 11 148 -18 -5 -34 43 74 109 -13 -52 -9 29
5137 29 145 89 -267 193 67 -70 -42 32 15 75 41 -357 -8 231 47 -67 136 354 -11 72 252 134 188
5160 188 96 51 20 124 39 -124 -135 -157 -43 -39 -197 49 -264 -50 37 -98 94 -22 344 94 92 83 169 -205 4
5185 4 -35 173 -19 -36 37 -126 153 55 -69 -173 87 32 31 -45 88 63 56 139 177 -51 236 57 -123 -54 12 -9
5211 -9 -118 -38 216 174 -201 133 -145 -104 -133 257 -137 -121 103 210 -94 133 52 -55 -58 -71 -56 -142 194 89
5235 89 71 -68 -140 -189 -24 10 214 -125 222 -109 79 36 135 68 -224 81 -183 -128 177 216 37 -78 26
5258 26 -197 -119 -51 117 5 -303 -115 -9 -138 -172 -99 123 14 -44 125 -199 -53 -60 58 -84 97 12 79
5281 79 -1 -216 33 -95 -69 -2 -52 -77 114 -70 230 -61 -55 103 -143 134 -293 -177 188 -30 -99 363 -50
5304 -50 -389 -35 -193 232 173 15 202 -67 237 -176 -46 70 -218 58 3 -52 63 139 -37 44 -25 -51 93
5327 93 -150 -115 92 -17 -113 59 -158 -232 23 32 -92 -111 -43 -155 107 40 201 -187 197 212 60 -67 113
5350 113 137 260 187 49 5 -134 109 -50 -158 -17 63 117 -66 -62 -35 90 -63 65 89 135 -134 109 -5
5373 -5 2 -95 108 7 291 -183 -272 241 8 127 70 68 -143 155 -109 -168 -40 -251 45 45 70 7 188 -153 190
5398 190 -81 7 8 157 -196 -328 63 -33 28 -81 -68 231 -228 98 3 -21 -183 -74 -1 95 186 -171 74 -151
5422 -151 112 48 60 -158 -29 190 33 -55 190 -145 -138 173 207 149 -42 36 22 90 -103 72 -15 44 104 148 -116
5447 -116 -154 46 189 -152 -79 141 -30 -90 81 24 136 190 29 171 123 -83 20 159 -57 -104 -270 -84
5469 -84 40 51 -59 84 43 -36 59 -38 153 -67 220 33 -105 116 16 79 -228 107 103 -66 -155 38 -151
5492 -151 -18 -153 -164 5 225 130 -193 171 -160 285 162 93 114 -109 142 -33 64 -141 33 -128 -7 -20
5514 -20 11 9 18 181 74 349 210 80 -113 -150 57 -247 -31 10 345 195 -66 -36 136 -140 183 -103 86
5537 86 45 208 72 -213 -55 48 -96 90 161 -144 91 25 98 22 1 98 -74 -12 -151 -274 67 -10 162
5560 162 209 -180 -53 193 95 85 84 113 163 -4 -33 -103 -87 151 -116 30 106 10 -189 -92 106 -38 -47 155 34
5585 34 168 -27 126 0 189 221 -85 -42 151 -104 -228 227 46 31 53 10 -188 -28 131 -77 307 -99
5607 -99 -184 277 -41 142 32 184 -76 -313 -67 141 -119 -166 56 -202 36 24 104 111 89 -8 35 -114 103
5630 103 -176 -5 -24 -114 25 42 -85 82 -83 31 -261 131 199 43 126 -27 -151 369 -75 38 156 -254
5652 -254 10 -7 -157 91 -8 25 -119 100 -166 145 -283 220 174 -145 62 11 84 165 -63 -33 -20 -28 -146 -196
5676 -196 30 157 -58 71 67 -36 -1 -69 40 -173 126 -101 14 -94 -33 -15 141 -167 -156 -47 74 -86
5698 -86 61 129 -12 -8 -154 -67 -8 -74 -97 96 279 89 -137 -22 48 127 15 285 68 9 72 34 -87 -64 23
5723 23 -132 5 22 219 -42 132 -117 -240 26 -64 134 -87 -36 -131 77 194 -14 261 78 55 -158 -132
5745 -132 -141 50 220 0 86 -49 -49 -58 -71 -118 -12 -90 -151 30 -33 21 -6 2 -71 -175 191 165 -130 -22 24 18 -159
5772 -159 -248 -13 117 -16 243 43 -212 -132 -30 -102 111 -274 -97 21 2 -52 58 -143 -47 -67 -122 -92 -31
5795 -31 59 21 -3 -15 -36 -69 208 -126 210 12 -114 159 60 2 222 -142 -52 47 -220 170 108 82 -17 -36 183
5820 183 175 -103 94 -70 51 78 -45 -12 196 -42 162 205 184 60 56 51 -188 -127 0 88 124 5 49 172 78
5845 78 204 91 -9 374 -201 51 135 -88 -84 30 244 103 86 -27 227 266 307 -6 -252 -23 186 -71
5867 -71 -90 36 6 -86 -147 167 187 119 88 -31 -64 163 -39 49 -65 -109 21 185 -52 -173 118 -104 70 301
5891 301 -6 -83 -243 50 83 -89 185 -74 -41 37 -55 -205 148 66 -219 -142 -212 197 -193 -101 133 -166 -23
5914 -23 -219 119 57 -81 184 0 -141 70 -293 -124 -9 17 -98 25 -10 20 50 58 -63 -65 -101 255 413 -61
5938 -61 120 -69 85 -239 -2 -93 -112 21 143 131 88 18 -28 35 13 -166 217 57 -13 40 -254 -64 188 29
5962 29 -56 -167 0 49 -199 45 -175 -88 -155 -105 -181 97 38 -54 165 105 -79 181 -15 -258 72 134 168 -10
5986 -10 38 19 -70 -157 -248 -90 -280 76 92 -193 -201 257 -89 -114 -35 -38 359 -44 -112 -100 -108 49 -55 -81 48 57 -187
6013 -187 200 -128 -1 30 55 272 178 -85 157 160 266 -15 32 -332 -29 191 12 319 132 -159 -66 -70 -11
6036 -11 -117 -144 109 211 -444 122 -175 63 -61 -72 230 -249 -173 -75 162 165 -33 -188 81 -102 287 1
6058 1 64 62 -249 7 -178 -91 -197 278 61 43 9 -175 -55 -119 260 -134 23 18 60 287 -17 -406 -13 10
6082 10 -111 -34 13 -41 112 -77 34 103 19 132 80 127 329 54 116 44 -6 -77 19 54 -6 213 -170 -181 99
6107 99 -119 2 78 145 -70 105 -72 107 53 -123 -250 236 -125 180 109 40 -335 175 88 -104 -116 -86 5
6130 5 -122 211 98 94 178 -134 400 40 144 -84 -67 -176 -101 -141 -50 -51 40 -266 -100 146 60 -21 41 230 -51
6155 -51 -75 -20 -106 -76 3 -48 33 -102 -86 -25 361 -105 157 8 75 -67 114 9 -161 282 62 -42 42 -108
6179 -108 148 -111 -79 35 37 -215 217 364 113 60 -121 -143 169 172 0 -34 69 176 -20 5 -192 -56 -94
6202 -94 -68 33 74 -5 20 -166 247 -40 80 5 -19 15 193 -131 -157 0 85 0 -39 194 -39 71 -276 -230
6226 -230 53 303 1 44 -1 -71 11 274 -67 -74 -92 242 169 51 84 -39 22 26 110 -32 167 -49 57 -110
6250 -110 -192 144 255 129 -184 20 -106 157 -74 32 -20 -260 -16 -111 -136 5 -81 163 -108 -21 -62 -64 -99
6273 -99 -58 240 40 -102 209 70 73 119 -227 104 23 -39 66 105 -76 189 -196 34 131 125 -64 -86 -160 132
6297 132 120 183 83 -19 98 -29 118 7 4 36 109 -273 50 83 48 -144 -18 -71 106 -8 -95 -97 -26 -173
6321 -173 -5 290 186 -259 -36 -211 65 -217 229 182 51 -161 258 -75 -273 -207 153 -4 214 -124 -61
6342 -61 18 -111 -49 47 -68 -107 -233 65 159 -236 16 134 84 164 232 -321 -173 -127 -97 -15 -47 -71 -149 -164 64
6367 64 -245 24 102 -128 -117 -128 258 76 40 -143 -22 -162 -252 45 -99 21 100 -156 48 -300 34 150
6389 150 -116 22 17 164 126 -207 -138 248 -43 -245 386 -5 54 -115 120 158 -145 191 39 -96 116 -127
6411 -127 12 -178 -34 -105 -97 84 40 -119 89 14 78 183 54 155 -33 -84 -239 209 146 -70 175 44 -123
6434 -123 3 151 95 169 145 -189 -60 -252 -20 -130 -224 -258 113 -152 112 13 -77 -32 13 40 27 145 18 128
6458 128 -66 -128 -126 126 166 118 114 -52 -122 -173 41 116 -106 -15 21 131 55 0 232 47 -5 20 62 117 180 64
6484 64 68 20 -86 -42 -57 189 -304 60 -13 -16 255 62 -343 179 146 -175 -175 149 40 -235 -19 -175 -4 23
6508 23 -168 -103 3 -38 13 -68 133 -99 -117 84 -267 169 -217 49 230 119 197 261 181 170 81 65 -140 -60
6532 -60 148 60 21 199 -60 -85 -139 -7 97 -226 86 126 291 86 8 155 4 106 -6 136 -13 39 84
6555 84 89 -43 -167 29 -194 -95 36 83 -177 170 -145 -37 -85 218 131 32 29 -9 80 -51 213 130 -130 72
6579 72 194 -129 263 133 106 -92 97 63 -124 -191 -121 -211 -96 -45 102 217 194 -85 364 -258 10 127 -87
6602 -87 170 -240 82 -113 -47 -32 40 238 99 -97 -124 82 -111 13 -1 158 -326 57 -145 -155 -44 -110 -121
6625 -121 101 136 -30 -35 -41 -111 53 8 164 40 -103 174 -76 194 104 53 101 -70 12 -146 190 -39 80 44
6649 44 -22 16 25 80 20 104 312 -33 23 53 -137 25 -177 63 123 -112 -135 -10 -77 70 -10 60 -57 -54 -114 189
6675 189 59 -113 75 138 -120 13 220 -19 76 74 -191 -227 -183 148 62 -84 -164 -12 151 -122 25 -4 -182
6698 -182 80 42 188 117 290 -317 14 71 -27 91 7 138 94 -29 95 4 -46 30 -340 -110 126 181 20
6721 20 264 23 114 127 81 126 -41 -37 -150 -81 98 -24 -89 -50 -140 118 32 -18 86 -193 231 -49 -303 -209 -262
6746 -262 146 49 -108 -281 128 -31 -53 -128 3 -124 -23 -121 84 -59 23 67 2 95 -32 124 113 -265 108
6769 108 -20 -60 -33 -45 167 59 25 -45 -19 -47 195 -68 -131 -45 -77 248 -174 231 250 79 -199 -203 -41 -87 -29
6794 -29 172 -258 110 177 70 -159 -90 -139 130 12 -279 -345 -77 84 6 51 150 34 -46 72 26 50 -170 145
6818 145 -120 -43 325 144 45 -151 -9 233 27 233 -125 14 -159 -226 84 4 -261 -100 -56 -26 -134 17
6840 17 38 -65 54 44 63 177 -111 -125 85 -44 133 100 -44 154 -48 -122 69 -29 -103 79 113 115 4 -28
6864 -28 -190 223 -13 -57 189 60 -61 -170 -95 -48 -2 76 193 56 11 33 28 273 186 -54 -65 181 11 -235
6888 -235 91 40 -30 120 131 221 95 -11 -133 162 -75 2 -79 125 90 -51 125 63 -62 8 -108 57 153
6911 153 -132 -143 -148 114 59 142 -174 96 99 -59 17 159 218 -187 80 -58 72 126 -10 85 -43 44 234 -130
6935 -130 44 188 211 254 241 -88 63 128 20 79 -101 -80 -47 -245 60 97 69 260 -83 -270 -13 -63 18 57
6959 57 -94 85 -28 -38 193 -222 -166 -74 15 -72 -174 84 99 91 16 90 172 48 220 -3 -32 80 -243 -172 -113
6984 -113 -30 22 24 -12 -21 -31 -211 -133 -90 -150 -171 7 25 213 -82 -135 -61 21 -105 -56 -156 -135 -170 -80 -54 17 175
7011 175 110 21 -202 49 -97 160 36 33 -70 -103 -176 8 46 -156 142 48 -16 134 94 -51 1 -36 31 -116
7035 -116 -35 -378 232 135 79 71 -66 -26 117 -227 -49 -115 -76 22 -16 9 -51 83 -109 171 16 41 73 -11 62
7060 62 -3 15 187 15 -41 23 -24 69 -142 13 -32 -7 157 -25 70 92 -3 -200 136 75 199 93 112 -111 -150
7085 -150 55 -185 115 174 108 207 168 171 94 -140 88 -41 -33 23 259 -48 82 -28 220 -36 -97 128 197 115
7109 115 110 145 -12 -63 -77 -106 -248 -153 19 40 -132 262 -172 309 -197 -11 30 64 46 38 8 -119 45 392 169
7134 169 112 12 27 -53 -27 68 -113 -92 -254 -117 -175 -141 35 -267 -166 25 -325 81 -172 -110 -245 126 78
7157 78 103 58 51 38 78 103 -131 77 145 -42 117 118 -92 61 119 91 99 20 -22 -159 191 29 10 -14 145 -149
7183 -149 245 138 156 -56 -85 72 241 -129 -116 90 98 119 -117 51 43 -171 -111 -210 -108 -175 1 -87 136 30
7207 30 15 101 -115 -5 -24 -80 9 21 -157 36 61 -82 -152 60 -19 77 235 137 -145 -184 -55 -200 19 -67 -43
7232 -43 84 84 -148 47 136 11 147 187 67 -70 -38 242 -98 -117 -55 -187 139 -50 55 -1 -66 2 36 54
7256 54 38 96 4 -136 267 -132 51 87 141 -184 94 -196 -43 32 52 207 -83 -63 -102 31 141 215 192 -102
7280 -102 132 46 -144 2 -20 55 -102 -133 -135 -33 -101 29 -97 -200 -118 -123 -93 -150 -59 -97 -152 -19 -87 -149 203 137
7306 137 12 -104 115 228 135 -30 -268 125 132 0 -30 31 5 140 -194 -65 132 50 -190 118 97 -32 -45
7329 -45 108 -154 -41 -24 -130 177 -22 -10 80 -68 5 138 186 118 144 -134 150 -36 117 65 -150 55 -6
7352 -6 -27 111 -149 -27 55 210 -196 -153 46 129 101 -38 -18 -133 50 -144 240 6 164 165 107 -174 -81 181
7376 181 181 309 130 19 -192 -22 10 62 -133 -160 -68 -80 101 7 -205 -36 -32 83 42 -249 88 -63 -2 -165
7400 -165 -127 -169 -95 -30 17 68 -123 91 78 110 125 30 125 126 -5 -1 75 157 -147 -504 -130 -33 -62 29 203 -9 181
7427 181 -40 -68 127 -149 -28 -21 20 77 -6 11 57 -89 -39 -299 -39 110 -125 48 -5 146 -252 301 38
7450 38 -2 58 194 -148 20 -74 -139 150 96 143 -44 -197 -222 98 85 245 201 -25 30 -153 77 77 73 47 230
7475 230 264 84 25 81 -156 65 19 143 -60 176 124 181 111 -78 120 116 -38 9 120 121 -110 352 -132 22
7499 22 194 4 -18 152 -7 -78 48 -148 105 32 -92 -89 84 -23 78 -19 -133 -53 130 41 -107 -66 248
7522 248 60 27 17 48 291 -76 -33 -65 213 -41 32 -253 80 8 -164 164 -68 -46 111 162 134 29 39 -181
7546 -181 107 108 -292 -96 -254 221 -19 148 133 -40 -116 100 -229 -133 -160 -165 -131 -41 -78 -224 -196 -61 99 118
7570 118 -248 -169 -13 24 -63 69 -27 70 163 53 222 71 -39 120 -20 1 5 72 191 -100 170 25 -69 -86
7594 -86 206 81 57 -213 133 103 33 52 29 27 49 73 -151 -122 72 140 -61 114 -91 -155 131 -104 -207 52
7618 52 -111 34 55 76 -53 85 249 129 -148 73 -176 183 37 86 107 -29 84 -137 57 -226 83 -35
7640 -35 -202 104 148 188 38 -92 100 -43 -171 22 41 -23 113 -219 137 14 -327 -137 -221 -51 18 86 48
7663 48 6 -34 -46 -97 45 1 -43 -82 5 263 -177 -139 -87 165 40 -13 119 -75 -32 -109 72 287 74 -91 -100
7688 -100 -70 82 -186 -30 78 -103 -19 -50 258 -160 79 175 -229 218 -63 43 -114 -60 -112 -84 8 -187 -90
7711 -90 -1 -69 -149 123 -328 -65 34 -114 66 27 -77 -55 87 -89 -175 -83 28 -1 -187 91 145 -43 -152 157
7735 157 -88 10 -3 161 58 63 -65 47 128 -209 -245 58 -91 -6 -29 -183 9 30 -128 -63 -198 146 -45
7758 -45 104 56 42 118 149 -13 -39 -15 131 -118 18 264 303 193 -113 -123 -163 150 121 21 -102 1 -40 -60
7782 -60 40 -98 -63 -120 121 -7 -158 -184 188 -172 -33 23 39 -9 -48 -42 158 208 210 127 4 -68 -144 -160 36 -64
7808 -64 73 174 -181 -55 96 -77 115 -29 122 -41 50 64 17 4 56 179 191 -256 -33 -16 -58 -49 -22 -127
7832 -127 53 25 123 356 40 -265 86 -259 105 81 39 47 -33 91 15 57 95 315 108 18 127 -56 -223 46
7856 46 -32 42 -16 325 90 72 -2 117 64 -164 -216 -20 -59 -70 -150 -215 -210 -67 267 0 -41 144 175 -1 61 184
7882 184 -123 14 160 -27 66 -257 57 234 -59 75 59 -166 -75 -84 205 -199 -3 -33 21 -140 76 -143
7904 -143 19 -73 295 -58 2 77 250 111 113 74 -157 -5 -24 52 -65 38 60 187 -10 67 -13 -201 -92 -56
7928 -56 131 -120 131 75 -262 160 41 2 -22 -134 358 13 -243 -113 66 -81 -2 -259 -14 64 -7 79 147
7951 147 19 -67 -165 -12 -143 -130 -55 -7 -344 -110 -73 205 40 45 65 107 -21 -80 103 -257 -6 -39 146 168
7975 168 14 174 85 -349 304 -3 93 98 155 13 -30 -311 -4 95 11 163 197 -213 -200 -62 -84 80 -83 8
7999 8 -216 -9 103 -31 195 127 112 70 23 -26 166 -236 44 98 20 -110 68 -65 -169 -45 20 216 95
8022 95 15 147 -66 -26 -230 58 -29 235 -91 -177 52 143 97 -62 -123 -242 -144 89 233 -81 -70 -9 6 12 -133
8047 -133 55 -38 -90 57 148 160 -23 13 108 143 -98 57 -86 -7 12 -26 0 -188 -108 -313 -83 -210 -105 128
8071 128 202 120 -151 -165 -332 -247 -81 -2 45 161 36 -50 -68 35 53 309 -22 -371 14 142 6 143 111
8094 111 -34 146 342 47 -257 122 -75 -28 127 -10 -48 -152 138 -236 20 -19 43 -15 -60 -219 177 -32
8116 -32 116 90 208 253 -14 61 238 -64 32 -161 -180 -109 229 -132 -56 -166 38 5 -153 98 -48 382 -217
8139 -217 97 87 39 -84 184 -116 49 91 165 26 92 -112 66 19 160 -70 103 -10 -80 52 -35 -19 -174
8162 -174 -6 -120 -227 -182 34 39 -48 23 -35 -13 -162 -22 -35 -58 -33 -82 111 -117 177 408 150 -117 -121 50
8186 50 -23 -81 67 -119 -207
8191b07
##END NTUPLES=NMR FID
##END=
