##TITLE=1H_SR-167-R22_TFA
 CDCl3
 8 sc, 
 22.12.2023
##JCAMPDX= 6.0         $$ Bruker NMR JCAMP-DX V2.0
##DATA TYPE= NMR FID
##DATA CLASS= NTUPLES
##ORIGIN= UXNMR, Bruker Analytische Messtechnik GmbH
##OWNER= root
$$ XWIN-NMR		Version 3.5
$$ Fri Dec 22 14:11:02 2023 Russian Standard Time (UT+4h)  she@DPX200
##.OBSERVE FREQUENCY= 200.1313
##.OBSERVE NUCLEUS= ^1H
##.DELAY= (6, 6)
##.ACQUISITION MODE= SIMULTANEOUS
##.ACQUISITION SCHEME= undefined
##.AVERAGES= 8
##.DIGITISER RES= 18
##SPECTROMETER/DATA SYSTEM= spect
##.PULSE SEQUENCE= zg30
##.SOLVENT NAME= CDCl3
##.SHIFT REFERENCE= (INTERNAL, CDCl3, 0, 15.7039)
##AUDIT TRAIL= $$ (NUMBER, WHEN, WHO, WHERE, WHAT)
$$ ##TITLE= Audit trail, XWIN-NMR		Version 3.5
$$ ##JCAMPDX= 5.01
$$ ##ORIGIN= Bruker BioSpin GmbH
$$ ##OWNER= she
$$ F:/spectra/data/she/nmr/H-F/1/audita.txt
$$ ##AUDIT TRAIL=  $$ (NUMBER, WHEN, WHO, WHERE, WHAT)
(   1,<2023-12-22 14:10:04.35 +0400>,<she>,<DPX200>,
      <created by zg, POWCHK disabled, PULCHK disabled
       configuration hash MD5:
       00 E9 B6 7A A2 85 ED C7 34 08 36 98 17 FE 4E 26
       data hash MD5: 16K
       74 34 7E AC 49 15 37 FE FA 53 38 71 E1 E5 19 1A>)
$$ ##END=
$$ 
$$ hash MD5
$$ AF 64 33 3E BA 3D C5 A1 1F EA 6C DA E9 8A 85 76
##$RELAX= 
##$RELAX= 
##$RELAX= 
##$RELAX= 
##$RELAX= 
##$RELAX= 
$$ Bruker specific parameters
$$ --------------------------
##$DU= <F:/spectra>
##$EXPNO= 1
##$NAME= <H-F>
##$PROCNO= 1
##$TYPE= <nmr>
##$USER= <she>
##$AMP= (0..31)
100 100 100 100 100 100 100 100 100 100 100 100 100 100 100 100 100 100 
100 100 100 100 100 100 100 100 100 100 100 100 100 100 
##$AQSEQ= 0
##$AQ_mod= 1
##$AUNM= <au_zg>
##$AUTOPOS= <>
##$BF1= 200.13
##$BF2= 200.13
##$BF3= 200.13
##$BF4= 200.13
##$BF5= 200.13
##$BF6= 200.13
##$BF7= 200.13
##$BF8= 200.13
##$BYTORDA= 1
##$CFDGTYP= 0
##$CFRGTYP= 5
##$CHEMSTR= <none>
##$CNST= (0..31)
1 1 145 1 1 1 1 1 1 1 1 1 1 1 1 1 1 1 1 1 1 1 1 1 1 1 1 1 1 1 1 1 
##$CPDPRG= <>
##$CPDPRG1= <>
##$CPDPRG2= <>
##$CPDPRG3= <>
##$CPDPRG4= <mlev>
##$CPDPRG5= <mlev>
##$CPDPRG6= <mlev>
##$CPDPRG7= <mlev>
##$CPDPRG8= <mlev>
##$CPDPRGB= <>
##$CPDPRGT= <>
##$D= (0..31)
0 1.2 0 0 0 0 0 0 0 0.06 0 0.03 0 0 0 0 0.0002 0 0 0 0 0 0 0 0 0 0 0 0 
0 0 0 
##$DATE= 1703239803
##$DBL= (0..7)
120 120 120 120 120 120 120 120 
##$DBP= (0..7)
150 150 150 150 150 150 150 150 
##$DBP07= 0
##$DBPNAM0= <>
##$DBPNAM1= <>
##$DBPNAM2= <>
##$DBPNAM3= <>
##$DBPNAM4= <>
##$DBPNAM5= <>
##$DBPNAM6= <>
##$DBPNAM7= <>
##$DBPOAL= (0..7)
0.5 0.5 0.5 0.5 0.5 0.5 0.5 0.5 
##$DBPOFFS= (0..7)
0 0 0 0 0 0 0 0 
##$DE= 6
##$DECBNUC= <off>
##$DECIM= 32
##$DECNUC= <off>
##$DECSTAT= 4
##$DIGMOD= 1
##$DIGTYP= 9
##$DL= (0..7)
0 120 120 120 120 120 120 120 
##$DP= (0..7)
150 150 150 150 150 150 150 150 
##$DP07= 0
##$DPNAME0= <>
##$DPNAME1= <>
##$DPNAME2= <>
##$DPNAME3= <>
##$DPNAME4= <>
##$DPNAME5= <>
##$DPNAME6= <>
##$DPNAME7= <>
##$DPOAL= (0..7)
0.5 0.5 0.5 0.5 0.5 0.5 0.5 0.5 
##$DPOFFS= (0..7)
0 0 0 0 0 0 0 0 
##$DQDMODE= 0
##$DR= 18
##$DS= 0
##$DSLIST= <SSSSSSSSSSSSSSS>
$$ [...]
##$SUBNAM2= <"">
##$SUBNAM3= <"">
##$SUBNAM4= <"">
##$SUBNAM5= <"">
##$SUBNAM6= <"">
##$SUBNAM7= <"">
##$SUBNAM8= <"">
##$SUBNAM9= <"">
##$SW= 18.0517328524113
##$SWIBOX= (0..15)
0 0 2 0 0 0 0 0 0 0 0 0 0 0 0 0 
##$SW_h= 3612.71676300578
##$TD= 16384
##$TD0= 1
##$TE= 0
##$TE2= 300
##$TE3= 300
##$TEG= 300
##$TL= (0..7)
0 120 120 120 120 120 120 120 
##$TP= (0..7)
150 150 150 150 150 150 150 150 
##$TP07= 0
##$TPNAME0= <>
##$TPNAME1= <>
##$TPNAME2= <>
##$TPNAME3= <>
##$TPNAME4= <>
##$TPNAME5= <>
##$TPNAME6= <>
##$TPNAME7= <>
##$TPOAL= (0..7)
0.5 0.5 0.5 0.5 0.5 0.5 0.5 0.5 
##$TPOFFS= (0..7)
0 0 0 0 0 0 0 0 
##$TUNHIN= 0
##$TUNHOUT= 0
##$TUNXOUT= 0
##$USERA1= <user>
##$USERA2= <user>
##$USERA3= <user>
##$USERA4= <user>
##$USERA5= <user>
##$V9= 5
##$VALIST= <valist>
##$VCLIST= <CCCCCCCCCCCCCCC>
##$VD= 0
##$VDLIST= <DDDDDDDDDDDDDDD>
##$VPLIST= <PPPPPPPPPPPPPPP>
##$VTLIST= <TTTTTTTTTTTTTTT>
##$WBST= 1024
##$WBSW= 4
##$XGAIN= (0..3)
0 0 0 0 
##$XL= 0
##$YL= 0
##$YMAX_a= 143209
##$YMIN_a= -122209
##$ZGOPTNS= <>
##$ZL1= 120
##$ZL2= 120
##$ZL3= 120
##$ZL4= 120
##$ABSF1= 10
##$ABSF2= 0
##$ABSG= 5
##$ABSL= 3
##$ALPHA= 0
##$AQORDER= 0
##$ASSFAC= 0
##$ASSFACI= 0
##$ASSFACX= 0
##$ASSWID= 0
##$AUNMP= <proc_1d>
##$AZFE= 0.1
##$AZFW= 0.1
##$BCFW= 1
##$BC_mod= 2
##$BYTORDP= 1
##$COROFFS= 0
##$CY= 11.3945322036743
##$DATMOD= 1
##$DC= 2
##$DFILT= <>
##$DTYPP= 0
##$F1P= 15.7292609196834
##$F2P= 12.9074282941183
##$FCOR= 0.5
##$FTSIZE= 0
##$FT_mod= 4
##$GAMMA= 1
##$GB= 0.15
##$INTBC= 1
##$INTSCL= 1
##$ISEN= 128
##$LB= 0.24
##$LEV0= 0
##$LPBIN= 0
##$MAXI= 10000
##$MC2= 0
##$MEAN= 0
##$ME_mod= 0
##$MI= 1.114404
##$NCOEF= 0
##$NC_proc= 0
##$NLEV= 6
##$NOISF1= 3.799351
##$NOISF2= 2.8
##$NSP= 1
##$NTH_PI= 0
##$NZP= 0
##$OFFSET= 15.70392
##$PC= 1
##$PHC0= -24591.77
##$PHC1= 9.252729
##$PH_mod= 1
##$PKNL= yes
##$PPARMOD= 0
##$PSCAL= 0
##$PSIGN= 0
##$REVERSE= no
##$SF= 200.130013532006
##$SI= 16384
##$SIGF1= 3
##$SIGF2= 2
##$SINO= 400
##$SIOLD= 16384
##$SREGLST= <1H.CDCl3>
##$SSB= 0
##$STSI= 0
##$STSR= 0
##$SW_p= 3612.71676300578
##$SYMM= 0
##$S_DEV= 0
##$TDeff= 0
##$TDoff= 0
##$TI= <>
##$TILT= no
##$TM1= 0
##$TM2= 0
##$TOPLEV= 0
##$USERP1= <user>
##$USERP2= <user>
##$USERP3= <user>
##$USERP4= <user>
##$USERP5= <user>
##$WDW= 1
##$XDIM= 8192
##$YMAX_p= 0
##$YMIN_p= 0
$$ End of Bruker specific parameters
$$ ---------------------------------
##NTUPLES= NMR FID
##VAR_NAME=  TIME,          FID/REAL,        FID/IMAG
##SYMBOL=    X,             R,               I
##VAR_TYPE=  INDEPENDENT,   DEPENDENT,       DEPENDENT
##VAR_FORM=  AFFN,          ASDF,            ASDF
##VAR_DIM=   8192,          8192,            8192
##UNITS=     SECONDS,       ARBITRARY UNITS, ARBITRARY UNITS
##FACTOR=    0.0002768,     1,               1
##FIRST=     0,             0,               0
##LAST=      2.2672688,     0,               0
##MIN=       0,             -122209,         0
##MAX=       2.2672688,     143209,          0
$$ Real data points
##PAGE= N=1
##DATA TABLE= (X++(R..R)), XYDATA
0@%%%%%%%%%%%%%%%%%pJ5j6J6j6J6j7K5l2L2m0M8n3O1p1Q1r0J03j16J30j46J62
39H5j80K01k25K51k75L02l35L74m15M56n01N52o08O69p40Q18r04J002j114J246
59F59j401J583j801K077k434K910l587M628o459J0592l6004N629N8461m4499L1420
74B1774R5726n2095r9089J08015O8878j51965n2383J29383l6863j41787M6809
85f3597P9399r0375m5160R8931N4241m0713j9617L5994N4726q07n5838J2945O3719
98H3848n6798q5559O5723M9131j03588k6027J01270j1109q0873M4881N3579n4159
110a9681j2922O3831O255m1291m802K2837K4085m823m0899L694M2583l5262n4461
123e0856M6941K2512q0227k408Q8010j8246o7718M8625N9950l0901j1173L6977
$$ plain form
0 0 0 0 0 0 0 0 0 0 0 0 0 0 0 0 0 0 0 -7 8 -8 8 -8 8 -9 16 -16 16 -24 24 -29 32 -39 42 -48 55 -61 69 -77 85
39 85 -95 106 -119 132 -143 159 -176 198 -217 239 -262 290 -318 351 -389 429 -475 527 -587 659
59 659 -742 841 -960 1117 -1317 1593 -1994 2634 -3825 6767 -29237 -23608 34853 -9646 21774
74 21774 117500 65405 -33684 74331 143209 -8756 -61139 68244 31381 -110406 -63597
85 -63597 15802 -74573 -119733 -20802 33439 -7274 -26891 9103 63829 63022 7184 20129 83848
98 83848 27050 -58509 7214 56345 -47243 -73270 28000 16891 -63982 -19101 34478 -19681
110 -19681 -32603 31228 37483 -3808 -8610 14227 38312 33489 -7410 -3716 38867 3605 -50856
123 -50856 -3915 18597 -61630 -64038 23972 5726 -61992 -13367 46583 15682 4509 41486
135D1486m346k2658M388j482q541q471k3477j513K6388j8334l1364L6439K7041
148A5556m1163R94N1546j6855l9866L5985K7526l7458q106L1776m409j9124P390
161C792O942m553n168j0069L035J4421j6963j9387K7564J4493l1347L275L6022
174B2057j3472k6646K5417J4096l0574o073K0860o696j4089O468O050J336L900
187B634r22M515J1954q327j0754J6359K964k6981j218K0053j5103k0125J7636
200g315J0299j8303N94J7938j719p340O996O049k77o96k327L445N837q130o783
215a732J0781m00j7530J417J2031j2250j1572J3144M319j1712L852J3300j17k694
229H37O688M304L13j884l721L27O95r164o946O095j850j1870M321J0812o169m634
$$ plain form
135 41486 37140 14482 18870 17388 8847 376 -23101 -24614 1774 -16560 -47924 -11485 15556
148 15556 -25607 -24613 26933 10078 -29788 6197 33723 -3735 -11841 19935 15526 -3598 3792
161 3792 10734 6181 1013 -9056 -6021 8400 -8563 -27950 -386 14107 -17240 -13965 22057
174 22057 8585 -18061 7356 21452 -9122 -15195 5665 -1031 -15120 -8652 -2602 -1266 2634
187 2634 1712 6227 18181 9854 -900 15459 18423 -8558 -9776 10277 -4826 -24951 -7315
200 -7315 2984 -15319 -14725 3213 1494 -5846 1150 7199 6922 6226 3899 7344 13181 5051 -1732
215 -1732 9049 8649 -8881 -7464 4567 -7683 -19255 -6111 -1792 -13504 -9652 3648 3531 837
229 837 7525 11829 12142 10258 6537 6864 7559 -1605 -8551 -2456 -4306 -16176 -11855 -1043 -7212 -11846
245a1846J2965N390p404L350Q107k046m658K943J335l461l427k011N95p36n560
260f464j953M585p40n435L517O924k646k020Q531L439l698J106M353j262l618
275D619r47k96k990m194j847J210j172l539J204N703j16j512M921M187k423P77
291C585M790j529m682Q38J963l625m086l31Q45r76j477j49K178N33j250K372L252
308B251j487j716L628L045l425k055K564J151l219j152R58p27k629j50R66q02
324b799j498J755K230k32k03K186J433q08j96R33l15k067j565P0l9j681j74P10
342b260O59K14J520J814j72p35Q43J248j598j834l05k52n71l89L37l63m10J265
360i89J980q90j365J493J838n58j754J211J077j205n56J803j35k021l14L9n11
$$ plain form
245 -11846 1119 6509 -895 2455 10562 8516 3858 6801 8136 4675 1248 -763 -168 -904 -6464
260 -6464 -8417 -3832 -4572 -10007 -6490 434 -2212 -4232 4299 7738 4040 5146 9499 8237 4619
275 4619 3672 3376 386 -3808 -5655 -4445 -5617 -9156 -7952 -2249 -2365 -3877 1044 5231 2808 3585
291 3585 8375 6846 2164 3002 4965 1340 -2746 -3077 -2232 -3208 -4685 -4834 -2656 -2123 -3373 -1001 2251
308 2251 764 -952 2676 5721 2296 241 2805 3956 737 -415 543 -184 -2813 -2963 -1997 -2799
324 -2799 -4297 -2542 -312 -544 -747 1439 2872 2064 1868 2801 2486 419 -1146 -1076 -1115 -2796 -2970 -2260
342 -2260 -1601 -1387 133 1947 1775 1040 1883 3131 1533 -301 -606 -858 -1429 -1818 -1481 -1844 -2254 -989
360 -989 991 101 -1264 229 2067 1509 -245 966 2043 838 282 2085 1950 -71 -385 -346 -857
377h57j750j000K34Q44K93j72J783K321M28O08K514r3j862o09J14j756j867m21
395a248j280j611kJ152L07M76R07J340J140J15l78R84K11l70LQ40q09j016R97
414A758j86j548k23m37j553n07J99n36K60J373L98J096K102K40l61J803L45k134
432B089j145N20k500k108J383l13j847R22K081J6O8J862L36m73J101O8j054O1
450A067J72j093M37J107j479r95J445k74k303M78j17j143M8J018l12N28J885O15
468A084J93J289K65q19J21R3j371o41l23j544j84J353q68k11J458P04j532P41
486a92P51j043p67R75q65l33Q83J3o6J332J103p84M07J177j363p40P12r17j249
505i66N26J80j067M11P57p63q7J008m54j046N36N03o42L05N95J67P58J221n95
$$ plain form
377 -857 -2607 -3607 -3373 -2529 -2236 -2408 -625 1696 2124 2732 5246 5153 3291 2682 2796 1040 -827 -1248
395 -1248 -2528 -4139 -4141 -2989 -2682 -2206 -1299 41 1181 1296 918 1902 2113 1743 1746 2586 1777 761 1758
414 1758 1572 24 -199 -636 -2189 -2696 -2497 -3033 -2773 -1400 -1002 94 2196 2436 2075 3878 4223 2089
432 2089 944 1464 -1036 -3144 -1761 -2074 -3921 -2999 -918 -902 -834 1028 1364 891 1992 2060 1006 1067
450 1067 1239 146 583 1690 211 -784 661 387 -1916 -1438 -1555 -2698 -2650 -1632 -1944 -1416 469 1084
468 1084 1277 2566 2831 2012 2133 2226 855 214 -109 -1653 -1837 -484 -1352 -1563 -105 599 -933 -192
486 -192 559 -484 -1251 -276 -1141 -1474 -591 -578 -644 688 1791 1007 1414 2591 1228 488 1200 283 -966
505 -966 -440 -260 -1327 -916 -159 -922 -1009 -1 -455 -1501 -965 -462 -1104 -799 -204 -37 721 1942 1347
524A347J82J242l43j180o52m43j128m42m9j218j2J325K29M4J257P09j69O34M94
543A827r03o23N69m41q55K43q3m93L23N45p52L93J89j57r96P88M66o14M16Q40
563F82J00L1P29j95n11j1m09q85r08j83m96q5P20L75JQ97J185J08R7N49k25O9
585A635l49m79p10k11k31n32o3j1K75j37q6J64J34J30m02N73P46j44K03M97J61
606A163N6K6P8n41j46k95r76m99K07k80m76N72O25Kj77J199J94k51L57K42o75
627D05n9K69p86k47N24k6o93P77K49p10L86N27n53m48M55j71m70M11o1m59M77
648b03O66n44l18P30q0m12L00R5n11K76K62j57J28K45n1j70K13n2n41K60m47m21
670g32l5j29Q8M07K78l71N01P93k68j9M14k37o13L38k35o09K98j52l15j64P09
$$ plain form
524 1347 1529 2771 2428 1248 596 153 -975 -1417 -1466 -2684 -2696 -1371 -1142 -1098 159 868 699 1333 1827
543 1827 924 301 870 429 -426 -183 -266 -759 -436 109 -643 -250 -61 -218 -1214 -426 40 -574 -158 682
563 682 782 813 1542 1347 836 825 416 -469 -1377 -1560 -2056 -2141 -1421 -1046 -1045 -148 1037 1145 1242 1791 1566 1635
585 1635 1286 807 97 -114 -345 -877 -940 -951 -676 -813 -899 -735 -601 -471 -873 -300 446 302 505 1002 1163
606 1163 1219 1245 1323 782 636 341 -635 -1134 -927 -1207 -1683 -1111 -486 -484 -661 538 732 481 838 1080 405
627 405 346 615 -171 -418 106 80 -613 164 413 -297 89 616 63 -385 70 -101 -571 -160 -221 -680 -203
648 -203 463 -81 -399 331 251 -161 139 234 -277 -1 261 104 232 477 426 256 469 417 -124 136 -311 -732
670 -732 -767 -896 -808 -401 -123 -494 7 800 532 513 927 690 77 415 180 -429 -131 -283 -598 -762 -53
691e3m33o4P83mk47N10K51n03rO60o75l49P08m13m13M0N03r18L89J48m00j1K01
714b99K67l20L64L60j9M32K56o10J5J89P1n91J33p30m02K90J59k65K00N07k61
735b54L10L47k43J46L83m5p31L25l5m54o8M07k86j01M37m08l87L66M86qk40J59
757A06m74k3O22k29k12M10J17n35M22l62k65M86J28l33k01M11j58J37M94p2k95
778A74K21l2n18K6P4k40k09K29l1n65L95O56l66J81N20l22j5K86l16j56L25K60
800E77o53J23j82j62k34L93j58p9M23m25J17L46L00k12J01K36l44J71M11k61l88
821A00K40l68m00k11k42j55L63J41K03J54J27L10J72K55m6j2m1K8j83k84j89k53
843b91m2J68n31n3K59n6J76K76J02k92J95N20k12NL80j09J88k24k03j32k57m3
$$ plain form
691 -53 -486 -550 233 229 -18 492 743 240 231 891 216 -133 575 162 -251 -211 292 -626 -237 -89 -489 -500 -299
714 -299 -32 -352 12 372 353 785 1041 431 446 635 706 115 248 -482 -884 -594 -435 -700 -500 7 -254
735 -254 56 403 160 306 689 644 -87 238 203 -251 -319 88 -198 -299 138 -270 -657 -291 195 187 -53 106
757 106 -368 -391 231 2 -210 200 317 -218 204 -158 -423 63 191 -142 -343 68 -90 47 541 469 174
778 174 395 363 -155 -129 -55 -295 -504 -275 -306 -871 -476 180 -186 -5 515 193 178 464 148 -8 317 577
800 577 -76 47 -135 -297 -531 -138 -296 -375 48 -377 -260 86 386 174 275 511 167 338 749 488 100
821 100 340 -28 -428 -639 -881 -1036 -673 -532 -329 -175 -48 262 434 689 643 631 590 618 435 151 -38 -291
843 -291 -333 -165 -696 -749 -490 -546 -370 -94 8 -284 -89 431 219 224 604 495 683 459 256 124 -133 -176
865a76j49K0l72N2J07m8K50L99rJ64K00k18K19K03j55k66n2MJ47l91j51l18oJ65
889c81R7k26p6K83K96n7K34J45l5K13L06m60rp2j62k08R7l04Lk6J61k39J14J46
913a60J30k38N53l67L60Jj01j2J23J99m23l9k07Q8N3j34k05j99K00o5K50J52P2
936C1o1K25O0l17M8M09O7n59J11K18k71K11o6k16J36K23j0l13K58j06l14j9K89
959C4k1k24K86J93m64K33K79m62j2M80l63l9r6J3M9L4L91j20L3J41o73K60Oq3
983a25l64J75q0L93l02J7J93M42K05j29k67L79p1l36K36k72m05L1pj82K62J8j5
1006b04l3L44o0m40M40J28j60K71K97o88M03J90m52j4J64K43o35k15J24l90K80
1027d07O0J1j43M31L01l22M47L53j61j42L5p9m03K18j37k16k64L31m83J63M04
$$ plain form
865 -176 -325 -305 -677 -625 -518 -566 -316 83 74 238 438 220 439 642 487 221 169 173 320 -71 -222 -540 -546 -381
889 -381 -284 -510 -586 -303 -7 -64 170 315 280 493 799 339 330 258 96 -112 -15 -319 -316 -342 -181 -420 -306 -160
913 -160 -30 -268 285 -82 278 279 178 166 289 488 65 26 -181 -93 -40 -174 -379 -578 -378 -443 -193 -41 31
936 31 -30 195 255 -62 -14 395 462 -97 14 232 -39 172 106 -110 26 249 239 -74 184 78 -236 -255 34
959 34 13 -211 75 268 -196 37 316 -146 -158 322 -41 -80 -176 -163 -114 -80 311 191 224 365 -308 -48 -42 -125
983 -125 -489 -314 -394 -1 -303 -286 -93 349 554 425 158 537 466 130 366 94 -311 -280 -287 -469 -207 -189 -204
1006 -204 -237 107 47 -393 47 175 15 286 583 -105 298 488 36 22 186 429 -206 -421 -297 -687 -407
1027 -407 -347 -336 -479 -48 253 -69 378 731 570 428 463 384 -19 199 62 -154 -418 -87 -570 -407 -3
1048cj14k77L30P8k65K31J94l8J44K02p2l17j13M06o28K61R6m69k13N1K39j19
1070c96L12K82j05K72K4j37r7J68J41p11N13l6l06J17k18k22M11J32m50K8M81
1091B03j41k20R3K53k81K90J60J21k25K12k61j04Q7q0l72j11K33k94q7O51k03
1112g6m02M68J74q4p5M14l77J58J66k51k51M62k94p3M60l6m95r0L80n64K73J83
1134G0l66K1J95N0j48L15Q6j68k1L90m88j80K76J1k08J12J20k91o3P13n33k23
1156c30M38r6j58p3J44k41Q6M02l89J73N21k76k47K70R8n03L01p0l14M6K98k39
1178a59k03L62l81L02J7L28l09j94L91r5J7Kl17K4L43K98p92L31L55l07N1J56
1200B20l10k39M63l42n1L10J08q00P23Q4m49J70N14m65l1Q7k25k37L90K8l24L62
$$ plain form
1048 -3 -117 -394 -64 14 -251 -20 174 136 280 482 410 93 -20 386 -242 19 115 -354 -567 -516 -277 -396
1070 -396 -84 198 93 365 389 252 155 323 464 -247 266 230 -76 41 -177 -399 12 144 -306 -278 203
1091 203 62 -158 -65 188 -93 197 357 478 253 465 204 100 187 107 -265 -376 -143 -437 -524 127 -76
1112 -76 -478 -10 164 80 5 419 42 200 366 115 -136 326 32 -41 419 383 -112 -202 178 -386 -113 70
1134 70 -296 -275 -80 -30 -178 137 223 55 34 424 -64 -244 32 43 -165 -53 67 -224 -287 426 -107 -330
1156 -330 108 12 -146 -219 -75 -316 -230 172 -217 -44 477 201 -46 224 322 -181 120 50 -264 -218 80 -159
1178 -159 -362 0 -381 -79 -62 266 -43 -237 154 59 76 78 -239 -215 128 426 -366 -35 320 13 64 220
1200 220 -90 -329 134 -208 -259 51 159 -641 82 166 -283 -113 401 -64 -95 -8 -233 -470 -80 -52 -376 -14
1222a4L95l51J00K67l21k32L88K2m04J18P5k84K41K60L5j49n6L68o34K01N7j42
1244f0k98L32P9m19L97l8j93L03J63l72r0M63j88r0K37j54k20L24N3O4O2m87l6
1267a68J43L0l59m9J62K86m39K75J77j48J76L16k38n5Q4l57k2L24p2j85k8L2l18
1290d33L21N7j15J28K69l39k68L28L02l45k6J78J19K2k08L31j29O4j37j53q7J03
1312a8m7L8l83J42J86mO8J20O8N8j98q7j1L5N2j2K41m73L72k06m6K58j18n4o7
1337h6m4J1O5l6K42j78o0J18N6J31K5L3j31k2j32j74N7J95j83P5n0P0p6J42j94
1362a46l5J00J39j00J73k36j46O25k97j00K11j24P6m0L6j77j68J96k43K79j58
1383a35J49j36J21j19M8k2K8j32K05J77l96K35r3Q0J39k0m20K73J81m11J82p3
$$ plain form
1222 -14 381 30 130 397 76 -156 232 254 -150 -32 43 -241 0 260 295 146 90 458 -176 25 82 -60
1244 -60 -358 -26 53 -366 31 -7 -200 103 266 -106 -196 267 79 -11 226 72 -148 176 229 293 355 -132 -168
1267 -168 -25 5 -354 -403 -241 45 -394 -119 58 -90 86 402 164 109 193 -164 -186 138 66 -119 -147 -115 -433
1290 -433 -112 -55 -170 -42 227 -112 -380 -52 250 -95 -121 57 176 198 -10 321 192 256 119 -34 -121 -18
1312 -18 -65 -27 -410 -268 -82 -86 -18 102 170 228 30 -57 -68 -33 19 7 248 -225 147 -59 -105 153 35 -19 -86
1337 -86 -130 -119 -54 -90 152 -26 -86 32 88 219 244 277 146 124 -8 -182 -125 70 -113 -38 -88 -18 -94 48 -146
1362 -146 -181 -81 58 -42 131 -105 -251 374 77 -23 188 64 140 100 136 -41 -209 -13 -256 23 -135
1383 -135 14 -122 -1 -120 -72 -94 -66 -198 7 184 -212 23 -70 10 149 129 -291 -18 163 -248 -66 -139
1405a39J90l10L25j4j14J25p9M6k8L35k57p5N1j44N6m5J3k38L40k81j0L4l5M10
1429A56k26o6K3K11k88K75Qo6k63L42k5j03J02p3o9J33k62J28j67K43k09K37L2
1452G3k40K65on1L3Oj58L94k41q2K29o4J95m25K74k25l08K39J98J56l22j3J55
1475H2k18j86L62j73O7L52m34K0N30l39l0K2p9k04K01p9J13l36M08m3j80L54l52
1498a42N6R7j52j07J09K02mj25J38M9j44o8J01m9M2k0j53j30J05n7L27R7j60o4
1522e2J50j35n6J54m8q7P9J63k41K77J1r8j03J07j45k44PL91m55K0L38r1j41L48
1546A49l7j82K52O1k45l32L87j97K5J93P1k52R2K61m80Q7r4L44q6j96K88j60N6
1569EJ39k07j03L57m0n1j13P9r3r5L30l72K05k04J41J26p9k7M7J55j83J57j11
$$ plain form
1405 -139 51 -259 66 52 -62 63 -16 30 2 337 80 5 56 -88 -32 -77 -64 -302 38 -243 -253 -219 -254 156
1429 156 -70 -136 -113 98 -190 85 93 27 -236 106 81 -22 80 7 -62 71 -191 -63 -230 13 -196 41 73
1452 73 -167 98 92 41 74 80 -78 316 75 -7 222 158 353 -72 202 -23 -331 -92 106 262 -60 -73 82
1475 82 -136 -322 40 -133 -66 286 -148 -128 402 63 33 55 -24 -228 -27 -106 7 -329 79 36 -144 210 -142
1498 -142 -86 11 -141 -248 -139 63 59 -66 72 121 -23 -91 10 -39 3 -17 -170 -300 -195 -252 75 172 12 -52
1522 -52 98 -37 -93 61 13 -74 5 168 -73 204 215 117 14 121 -24 -268 -261 130 -325 -305 33 -58 -199 149
1546 149 112 -70 182 243 -2 -334 53 -144 -119 74 145 -107 -15 246 -234 -147 -241 103 17 -179 109 -51 5
1569 5 144 -63 -166 191 151 100 -13 66 -27 -122 208 -164 41 -163 -22 104 25 -2 45 200 17 174 63
1592F3J57m76M01j86k88N67k22j88J0K69j16k04J92j12l23K25J58n7j69M50l20
1613a69K66K3Jj97J73Q5k22N1NN6k95J85Q5j29K42j20l3K08p0P3j48k46J82K01
1637B07j99j82K30j55j00K49L3p2j51J66l11L32j22j45J88LR2L6k43L14m1k54
1659a25k7L31m05M62m05J63j41N7N1O5J2J25k33m5K11l5l3J33j88Mj2j40L41o7
1683I9q1N6Ojk49j53M36o2l23M46k70k35O89k70k12K32P1k76M0l8J89Rl1J53j58
1708F7K7j18N2N5k81K85k34J61j32M7q8m9J24J32m2n3J3J10pO3l6J44n30K28J48
1733H6J77k52p1R7k26P5L08l02J00Q8j85P3J41R0k72J49j42J7L19n7l0P6j29j1
1757A19m01K17M6O9j52Ok6J14M9j87O3J85l25J12q6R2R3J88J18k90R3K6l67K53
$$ plain form
1592 63 220 -256 145 -41 -329 238 16 -172 -162 107 -9 -213 -21 -133 -456 -231 -73 -130 -299 151 -169
1613 -169 97 120 121 -76 97 182 -40 11 16 72 -223 -38 47 -82 160 40 7 215 145 218 70 -176 6 207
1637 207 8 -174 56 -99 -199 50 83 11 -140 26 -285 47 -75 -220 -32 -29 63 99 -144 170 129 -125
1659 -125 -152 179 -226 236 -169 -6 -147 -90 -39 26 38 163 -70 -115 96 61 28 161 -27 -23 -35 -175 166 99
1683 99 18 74 80 79 -170 -323 113 51 -272 174 -96 -331 358 88 -124 108 179 -97 -57 -95 94 103 72 225 67
1708 67 94 -24 28 83 -198 87 -147 14 -118 -71 -159 -208 -84 48 6 -47 -34 76 69 132 96 240 -290 -62 86
1733 86 263 11 -60 37 -189 -114 194 -108 -8 80 -105 -32 109 199 -73 76 -66 -49 270 213 183 259 130 119
1757 119 -282 -65 -19 50 -102 -96 -122 -8 41 -146 -83 102 -223 -111 -197 -105 -12 176 294 4 97 123 -244 9
1781Ir0R2j07M0j3L1R9j02j7j6J57n0N1Ql3K0q5k71J81K2J26jJ26pj09K41m05
1808a03N7q9J43M6m8k04K78n5O6rL8o9qJ70k77J14K6J91l36r1J95j02j3K08j82
1833e4j31R8K76j22O5J4j65L2O0n7J71k29j08K69k55K17j1O8j36r6j10L08%j96
1857i2J64M0L5k63J42J26Kk92K17k58J82j43L3N3J16n5k25L19k26K25j58n0J41
1880C3L8kJ88k41J85k53J19l3O4j37k9k2KJ34O3j45m3L08n55M48L6k07M34l07
1904G8J12l29J08J10j11J65n9J3p7n6l2k8l4J62j50J30P6J08k26j11K05mJ89l76
1928a37K02k3p7K49l53J11j90K46k54J01m2QJ38k2L49m50M4P0M3LJ24m8k22J15
1952a5j34o2M11k56K51j85k04L16j11r6J22O6j8J9k1k57L51o0r3Pj20L53j48p6
$$ plain form
1781 9 -81 11 -96 -56 -69 -38 61 -41 -58 -74 83 33 84 92 59 79 -6 -277 -96 -74 52 51 177 170 61 302 -103
1808 -103 -46 -135 8 54 6 -198 80 25 91 82 120 51 43 213 -64 50 76 267 -69 -160 35 -67 -80 128 -54
1833 -54 -185 -87 189 67 132 146 -19 13 73 16 187 -42 -150 119 -136 81 70 138 2 -94 -204 104 104 -92
1857 -92 72 112 147 -116 26 152 154 -138 79 -179 3 -140 -107 -54 62 7 -218 101 -125 100 -58 -108 33
1880 33 71 69 257 16 201 -52 67 34 98 -39 -68 -90 -88 46 109 -36 -79 229 -326 122 158 -49 385 78
1904 78 190 -139 -31 79 -32 133 74 87 10 -46 -78 -106 -140 22 -128 2 78 186 -40 -151 54 50 239 -137
1928 -137 65 42 -35 214 -139 -28 -218 28 -226 -125 -167 -159 -21 -43 306 -144 -100 -30 13 16 140 92 -130 -15
1952 -15 -149 -211 200 -56 195 10 -194 122 11 -85 37 103 85 104 83 -174 177 117 24 31 -89 264 116 40
1976D0j63J05k26J96J00J86j80j56r3M5L02l95R2L53k93K3K14k86K35r0K7o7j3
1999d4J34j35J1J5K64l59L19j12MM0n00M67o4r1O2j96J11j84L60j68K14k72J24
2022@J92k18J9k2L7k20k0L14j26k04K90jl73L11p8J47j46J6L69j87r7J56k73J24
2046A0q4k0K72k25o6qJ86l29K51k55K66M1J07j61P4p3J93j06M8j02j34J64j89
2069a40M50l89K26l7k54K30J10o4j77j13K1J85n3k5N1j55J21J39j39K15j75K33
2091B60k25j61l1kj11J14J60j24K32l9j38J70j27p0K22l83L17Mp6jO6j85K10k11
2115a29rK00p5K07j92J31l35J05Q3J56r2P3K27j27l11J5N6p0J74j31NpQQ2k18
2140a74J03L14k40q7p3L1k6K13l53O02m65J34K52j81j33j19M45J49l88o8J38K9
$$ plain form
1976 40 -123 -18 -244 -48 52 238 58 -98 -191 -146 156 -239 -147 206 -87 -64 150 -136 99 9 36 -31 -44
1999 -44 90 -45 -34 -19 245 -114 205 93 97 137 -363 104 40 -51 11 -185 -74 -258 102 -66 148 -124 0
2022 0 192 -26 -7 -29 8 -212 -232 82 -44 -248 42 41 -332 -21 -99 48 -98 -82 287 100 3 159 -114 10
2046 10 -74 -94 178 -47 -113 -121 65 -264 -13 -268 -2 39 146 -15 59 -14 179 73 121 19 -115 49 -140
2069 -140 310 -79 147 110 -144 86 196 132 -45 -158 -137 48 -5 -30 21 -134 -13 126 -13 202 27 260
2091 260 35 -126 -157 -159 -270 -156 4 -120 112 73 -65 105 -22 -92 130 -253 64 68 -8 -9 57 -128 82 -129
2115 -129 -138 62 -13 194 2 133 -202 -97 -14 142 50 123 350 223 -88 -73 -17 -87 87 -44 -39 -46 -38 44 -174
2140 -174 -71 243 3 -84 -157 -126 -152 61 -292 310 -155 -21 231 50 -83 -202 243 392 4 -64 74 103
2162A03P2l94K31j22J3J65J6j43j56K52L6qj06J39k31J40m7R7k46L81l21k7J76
2185B0k9k5J33q6J93p5k27J44M0N2k30K06m15L37r6j8L3K71k88j47J29Oj36J50
2209e8O1K2j47J02P5J53j98J71k79r3L10p3qL1q2J07Q4j40j63K9n4O6N6j57J23
2234f2O0J75n0P6n3j13j63j0K94%j7k33j28L49r9L2nm3J8o1J32Lk13J58q9R2J08
2261A58j52K8P4l47K03J55N3l85J86j70L13j92o9K41r2o6q0J71N8l7J88j61Q1
2284A58r7p3j01K37j18k7M0j03Q1R2j61R7o1j82J55r4K93j26l9M3m3m0J61k26
2308a34K05J03j61j24K76j09J01Q8l02J06j88J97l00M26j70K39l42J29k93O9K55
2329G1k34M29j91O1J93k11k94M57k53J25k09j94K88j09N5k6l26K95N10m89p2K07
$$ plain form
2162 103 175 -219 12 -110 -97 68 84 -59 -215 37 73 65 -41 98 -133 7 -40 57 -189 192 -129 -156 20
2185 20 -9 -34 99 13 206 131 -96 48 88 140 -90 116 -299 38 -58 -76 -43 228 -60 -207 -78 -72 -208 -58
2209 -58 3 25 -122 -20 55 208 10 181 -98 -191 119 46 38 69 -13 94 178 38 -125 -96 -150 -84 -28 -185 -62
2234 -62 -2 173 123 199 146 33 -130 -140 154 154 137 -96 -224 125 26 58 53 10 28 -33 99 102 -111 47 -42 50 158
2261 158 6 34 108 -239 -36 119 172 -213 -27 -197 116 -76 -145 96 4 -62 -142 29 87 50 238 77 158
2284 158 61 -12 -113 124 6 -21 19 -84 -3 89 -72 25 -36 -218 -63 -157 136 10 -29 14 -29 -69 92 -134
2308 -134 71 174 13 -111 165 56 157 245 -57 49 -139 58 -242 184 14 253 -89 40 -253 -184 71
2329 71 -163 266 75 136 329 118 -176 281 28 153 -56 -250 38 -71 -16 -42 -368 -73 437 -52 -124 83
2351H3o7j3K3n0R2q6J06pj68J02o1l6k4J65o8Kj60K85k74n8K56J25j97K26j45
2376E1J4k45J05K05Q4k01L8k65n5N39l24M7O8p0m7K38q2j65O8n1J15q7k00L40
2400A20l3k4N6k03k3oJ58K0k59J32j1LJ60j37J76n01L57q6rJ08j85J36J50k63
2424a64P8J5M2m1k3j64K41j6M7N1p6K3J33K5k20L08k00J63m00L6J97k36J50O3
2448C2r0J0J9J92k42l9J91m9j67O5j12L02j90K6K2K64l97qK77n09L52o8J02k5
2472d2Q9l03M16J4j28J2qj46RJ49J72k36p5P4J0j28J22q4J05J1j11JN7M4j5Q9
2498I8j13q3J40R5k33J13k1N1q5J48K0k21j22J80n2r2K61L5n6k2k09J93q4q1L5
2523a05J92k1L9K77m24P1J47k5l83M73r4l05L16j06k00K78j63J89l1j62J74l43
$$ plain form
2351 83 16 3 26 -24 68 -18 88 81 -87 15 -46 -82 -106 59 -9 -7 -167 118 -156 -214 42 167 -30 196 51
2376 51 65 -180 -75 130 214 13 51 -214 -269 270 -54 -7 61 -9 -56 182 100 -65 3 -48 67 -20 -220 120
2400 120 87 63 119 -84 -107 -113 45 65 -194 -62 -73 -70 90 -47 129 -372 -15 -101 -110 -2 -187 -51 99 -164
2424 -164 -86 -71 -29 -70 -93 -257 -16 -32 15 66 -10 13 146 171 -49 259 59 222 -178 -142 55 -181 -31 32
2448 32 -58 -48 -29 163 -79 -118 73 24 -143 -78 -190 112 -78 -52 -30 234 -163 -171 106 -403 -51 -119 -17 -42
2472 -42 47 -256 160 174 46 58 50 -96 -87 62 234 -2 -77 -3 7 -121 1 -83 22 33 -78 -77 -20 24 9 98
2498 98 -15 -98 42 137 -96 17 -4 47 -38 110 130 -91 -213 -33 -85 -177 84 119 63 41 -168 25 -59 -140 -105
2523 -105 87 66 105 382 -42 29 176 151 -232 241 147 -158 158 52 -148 130 -33 156 125 -37 137 -206
2545b06R4k50L27J67k28n9J67N9k32L16l48J97k8J64k03J29K0j63P8L3m5O8j51
2568i4K03k82K79r5k91K68l5O1M8m4j28JK97l12O7p5M6n7K42K2j82l2J5J65k35
2593a48J86P7k85J07j4J50J14j17n1k55L52k39r9L22l66L50j47n1o4M5K13k99
2615b19J06J28P6j91k05L15J21k75J9K31P5L1l5j95j34R3O7J50k38R5m3j34J75
2638A3Q8j8j66Q4J16q3J13m48L38Lm05L06K40l99K40j54m9K55N1j59J18kj87J11
2662FL2L7o4q6KK68l88J42Q3J06k18L21k90R1o5p4L4Q2j14P2J54j51M5m3Q9j78
2688a07J38m7K1OM9p6M4K69k83n3N6p4O1j74J51n9L58l74J88j87K14j62m4n4r7
2713b36L88k48r0K99J77l03O0pq2k8n5J01J93j81K7J27j44K81l88P3K37j90j20
$$ plain form
2545 -206 -112 -362 -35 132 -96 -155 12 71 -161 155 -193 4 -24 140 -63 66 86 -77 1 34 -11 57 -94
2568 -94 109 -173 106 11 -280 -12 -47 14 62 18 -110 -109 188 -124 -57 -132 -86 -143 99 121 -61 -93 -78 87 -148
2593 -148 38 115 -170 -63 -77 73 187 70 19 -236 116 -123 -222 100 -266 84 -63 -114 -178 -133 80 -219
2615 -219 -113 15 91 -100 -305 10 131 -144 -125 106 181 212 177 -18 -152 -59 8 158 -80 15 -28 -162 13
2638 13 101 83 -83 1 117 34 147 -301 37 40 -365 -59 181 -218 22 -132 -181 74 125 -34 84 82 -105 6
2662 6 38 75 11 -75 -73 195 -193 -51 32 138 -80 241 -49 42 -23 -97 -63 19 -95 -23 131 -20 25 -18 71 -107
2688 -107 31 -16 5 11 60 -16 28 297 14 -39 17 -57 4 -170 -19 -78 280 -94 94 -93 121 -41 -85 -139 -236
2713 -236 152 -96 -186 113 290 -13 47 40 -42 -70 -125 -24 169 -12 15 142 -2 279 -109 -36 201 11 -109
2736a09J70k75J95K0j69K02J1j58pmL91r0j84K07n2o6P5k06o5L12j04j31k67J15
2760a89K78k64K92r6R7m4j99J91l2j31J18k19L81kK5j28L3Kq0O9j2J06j77j9M3
2785D3j52J63K5m6j9j35L3nJ12n0J34k01J43Q3o2K21l13J91l22Q4n6K8k4K39k6
2810H8l06k9L16k01J6R9J5P0l13J31K8J1%J16l7J11l64K18K7L04n01l1K19J5k78
2835b76M30j85k7K17k16P1J74j22k13J71q1L8r9L46k1j03j05R6m12K26J20K6k70
2858b15M75k43M4j11J64J3j00L10j68k1K3j14K51j96p4j05J40j56j50K21j24J15
2880b1K0K18k77J33o1k97J77J49n8lm7l9R6j74J31J42j40KL3j22L5R0Q1l1j26
2905h9K6K61k49p3O7j73K87M9n7j72J57k20M6K97k73K26m2k60N6J00P6j79L9J97
$$ plain form
2736 -109 61 -214 -19 1 -168 34 45 -113 -120 -124 267 177 -7 200 148 82 157 -49 -114 198 94 -37 -304 -189
2760 -189 89 -175 117 21 118 74 -125 66 34 -97 21 -198 183 181 206 78 111 113 33 102 90 196 19 0 43
2785 43 -109 54 79 33 14 -121 -88 -93 19 -31 103 -98 45 128 66 287 -26 165 -157 -73 -129 -101 -125 114 88
2810 88 -218 -247 69 -132 -116 -17 -2 68 -245 -114 -86 -75 -75 41 4 115 -249 -31 -4 300 -201 -232 -13 2 -276
2835 -276 154 -31 -58 159 -57 14 188 66 -147 24 -57 -19 -118 228 207 104 -1 95 -317 -91 29 55 -215
2858 -215 260 17 61 -50 114 127 27 337 169 148 171 57 308 112 38 -67 73 -83 -233 -12 -136 -21
2880 -21 -1 217 -60 73 12 -285 -108 41 -17 -20 -67 -106 -10 -184 -53 89 -51 -49 -16 -138 -103 -13 68 37 -89
2905 -89 -63 198 -51 -124 -57 -230 57 106 49 -123 34 -186 -140 157 -116 110 68 -192 -136 -36 40 -139 -100 97
2929I7M0j24r1j47J95o2K09k81K01r6j31J19k6m7J15oO0j39P7j03J22P5k10K54
2953A01j25J3N4J20J2j95N2L1o2j68L74j86k56N54k43j50J79j08j6j30N3J99j04
2976aj72P3K45J22m16R9J40j95L70m80J05J78J6J3K37j80j59j21l1N4J44jKj24
3000h2J44J26k90M6jM6K91j40oj78j02J23J0m2K1j45mj43J59J21Q3j25K04k61
3024a45J43l0K15k12J19J06j51k63J48J43k58J54N3k3k2o3p1K11k48J02K93j36
3046F5l0J17k40J48j9k34J39Q2N1k33J45M0J44k21j90J84p1j02J16J30K00r5M8
3069A74R6m12J09J75l34K46m9k45J75k70K62K83j28L0l2L2k19P7K39k40N6j07
3091h2L61j21m09K04J03j32K42M8j49o7J39l76J39K1L88l25j00j49J77J37j51
$$ plain form
2929 97 137 13 -78 -225 -30 -92 117 -164 37 -59 -190 -71 -97 -144 -29 -35 25 -114 -37 -140 -18 57 -153 101
2953 101 -24 -11 43 163 175 -20 32 63 1 -167 207 21 -235 319 76 -74 105 -3 -19 -149 -96 103 -1
2976 -1 -173 -100 145 267 -149 -50 90 -105 265 -215 -110 68 84 97 334 154 -5 -126 -157 -103 41 40 42 -82
3000 -82 62 188 -102 -56 -57 -11 280 140 134 -44 -146 -23 -13 -55 -34 -179 -183 -326 -167 -46 37 -88 116 -145
3024 -145 -2 -32 183 -29 90 196 45 -218 -70 73 -185 -31 22 -1 -23 -86 -157 54 -194 -92 201 65
3046 65 35 152 -88 60 41 -193 -54 28 79 -154 -9 31 175 -46 -236 -52 -123 -225 -109 21 221 126 174
3069 174 270 -142 -33 142 -192 54 5 -240 -65 -335 -73 210 82 112 80 112 -107 -30 209 -31 25 -82
3091 -82 279 158 -251 -47 56 -76 166 214 65 -2 137 -239 -100 -79 309 -16 -116 -265 -88 49 -102
3112a02k8N7j74L76j17O9k15N3K18k59J05o2j8J01m9N1J7M7K46Ml66J37l39J28
3136a20K08j89J88k43pM47k85j7r9q5J45r9J22j61K66m28N07j58K36o0j32J31
3158A67l15Jm6J07O3R3P7k03O9k14J74j52P5p9K56k75L30j02N2J01j30Q6m50K17
3182i8K4QR6j18j32K20k41L28k51J19L6N7k94K36p9OJ86j89n6k4K46nL5p2j30
3207i2K19j21m1j89K35J24j95K43m56L68l9jq3l2M3O3k4K7m3j14Q4j03J76l44
3231b95K45o5L17j88L8q3OJ81j37J00l36K29j23j30J10K36n6PJ90k53j76j30K66
3254d7P2j61j2Rl5J04J79N1l03K55j39J46j31n7N1j52k9K12m0j29J19k70L84k51
3278a74L08j43K2J94m47K98J08m6J2j98J71j36o3N4J0R6l6k09P8L6j21J83J00
$$ plain form
3112 -102 -130 -73 -247 129 12 81 -134 -81 137 -122 -17 -79 -97 4 -45 6 23 70 316 320 -46 91 -248 -120
3136 -120 88 -101 87 -156 -163 284 -1 -18 -117 -202 -57 -156 -34 -195 71 -357 150 -8 228 168 36 167
3158 167 -148 -147 -193 -86 -23 70 147 -56 13 -201 -27 -179 -104 -183 73 -202 128 26 78 179 49 135 -315 -98
3182 -98 -74 -66 30 -88 -220 0 -241 87 -164 -45 -9 48 -246 -10 -89 -83 103 -86 -142 -166 80 75 110 38 -92
3207 -92 127 6 -35 -224 11 135 -60 183 -273 95 56 55 -28 -60 -17 46 22 49 6 -108 -24 -127 49 -295
3231 -295 -50 -115 202 14 52 -31 -25 156 19 119 -217 12 -111 -241 -131 105 49 56 246 -7 -183 -313 -47
3254 -47 25 -136 -148 -139 -174 -70 109 160 -143 112 -27 119 -12 -69 -18 -170 -199 13 -27 -156 -37 -307 77 -174
3278 -174 134 -9 13 207 -240 58 166 120 132 -66 105 -31 -94 -40 -30 66 30 -179 -101 -65 -186 -3 97
3301I7j42K48l13M5J12k37J85k22J91k07M15r4l65K91m5k8K71o2no2J44k3j64
3324C0l19L15j24j93K82K0l18L35M5J00N0l32J65j07J00q4N9o3j61J42m3K86j92
3347gk53K87n1K4O2Q6j07j20k1J57p3P2J7N1jk13j05J08j03PM79j77r7j99K56
3372G9k12L12m7k28K23k85L29k99J67j95K12J75m24L17k14Q8K1r1J88K5m60M57
3394A38L3l48L01R5l42J05K40n0m40L31n8j49j4K19j54K64j90R1j69J34Q5l96
3416b74K45r8k43K28J66j17P4LO3l6J20j52M1q8j07M6J08j63Q6J24Q7R4k98NO6
3441b0k17K03K10j90K43n6j99k55L13o9Q3j49n7L8J72l7l7L39m48M2J96j75J97
3464A27j60q6J36On1J20j58J13P4k83K8K47l88k7J54J63j18J24j76N9q4m5J94
$$ plain form
3301 97 -45 203 -110 -65 47 -190 -5 -227 -36 -243 172 78 -287 4 -41 -69 202 140 135 73 217 194 30
3324 30 -289 26 -98 -291 -9 11 -307 28 73 173 223 -109 56 -51 49 -35 24 -39 -200 -58 -101 185 -7
3347 -7 -260 27 -24 0 62 148 41 -79 -100 57 -16 56 73 124 123 -90 -195 -87 -190 -183 296 119 22 -177 79
3372 79 -133 179 132 -96 127 -158 171 -128 39 -156 56 231 -193 124 -90 -2 19 -72 116 141 -319 138
3394 138 171 -177 124 219 -123 -18 222 172 -268 63 5 -144 -158 61 -93 171 -19 72 -97 37 122 -274
3416 -274 -29 -127 -370 -142 24 -93 -19 -16 47 11 131 -21 20 -68 -175 -129 -21 -184 -98 26 113 207 -91 -86 -20
3441 -20 -237 -34 176 -14 229 173 -26 -281 32 -37 46 -103 -160 -122 50 13 -24 315 -133 -91 105 -70 127
3464 127 -33 -119 17 23 -28 92 -66 47 121 -162 -134 113 -275 -302 -148 15 -103 21 -155 -96 -180 -225 -31
3487c1O3j10kJ29k02K51R6J55k64k03K61J48n56P2L67j78R8rj70j20K67J68j54
3510G6J87j51p5K17j36j08j72j71L18J95j80j16R8J60j4m40K62p4L19j28J58o1
3532A64j69k9J77l25j02M29j1j89Q5j27k7R1Mk7R5j29p6P1nK14l3k4J27q3o9j56
3558a24Jk0M71l76k61M13k64J88J13k66M83k24n7J08P9l1j33j49j84L05oj3r6
3581d3L55m39J63J03o0M5n2k17J35q6J83r8p6j18K44k95K32K93k77j76K39K74
3603C29m78Qj88M41J20l66P6j51J48LR5J84K20m50K3rJ60j82p0J72n9M5k37L50
3627A84k68J27P9k1j72R6K6K8j57J76j15k9MK29j94m8j79K62j5J30j60Q9j38K3
3651d3J39j52K40k97J16O5l44K97K27k18j0o4J40p6P2j41K12o6o3n1J71k73o0
$$ plain form
3487 -31 32 -78 -80 49 -153 98 194 349 85 -118 143 291 -265 -193 174 -4 94 85 -85 -205 62 230 76
3510 76 263 112 37 254 118 10 -162 -333 -15 180 0 -116 -18 142 128 -312 -50 -124 195 67 225 164
3532 164 -5 -34 143 -182 -284 145 134 -55 30 -97 -124 -33 -29 -56 39 -90 -166 -95 -100 114 81 57 184 101 32 -124
3558 -124 -123 -143 328 -48 -309 104 -160 28 141 -125 358 134 77 185 264 233 100 -49 -233 72 66 53 -43
3581 -43 312 -127 36 139 79 124 72 -145 -10 -96 87 -11 -87 -205 39 -256 -24 269 -8 -184 55 329
3603 329 -149 -141 -329 112 232 -134 -58 -209 -61 -58 37 221 441 -9 14 5 165 -17 -87 85 26 71 -166 184
3627 184 -84 43 122 101 -71 25 51 79 -78 98 -17 -46 -42 187 -7 -55 -234 28 13 143 -17 72 -66 -43
3651 -43 96 -56 184 -113 3 68 -276 21 248 30 20 -44 96 20 92 -49 163 97 34 -17 154 -119 -179
3674a79M01l53j7Q7j8J4rJ96j93j4P0o7J66J2k8k79Q6J27J0J5l06L81O3k46K95
3699B14p4j63r8L55o3l15l6J3K36J23n6k1o5l8J52j06m34M95L2k25K95n3k18J15
3723F5j61k16M84l99R1K6LO3J55j46p2J29j35M05n0m22KL38l04J57qr7K19o0m6
3748B1nK2J24j21N3K75k62P2j11j00l5k7n1O6K7J91k15o3KR2L8k17J31R0j19K99
3774A77j19j61N7J28Rl3K7j89J93j03j0m7K20q8q7J70q4L6j35mO2j89K42P5k26
3799g9J4J6J33n5j42P8j4J43k3o7n6o1N2J86ol7p0j20O7K4L19k30mP7j83J42j21
3826a7J82k31Q2k30L58p5J04j81J07k89J24n4O3K10m1j42K11j79J34r8j05j05
3848a72N1J6l0L23k77%K33o4j93L58k76n3J57J5p2J9p8J02l1l0j38J49J16j66
$$ plain form
3674 -179 222 -131 -148 -61 -79 -65 -74 122 -71 -85 -15 -82 84 96 68 -211 -125 2 12 27 -279 102 165 -81 214
3699 214 140 -23 -121 234 171 -144 -180 -167 69 192 136 115 50 12 164 58 -376 119 151 -74 221 168 -50 65
3723 65 -96 -312 172 -227 -136 -110 -107 -44 111 -35 -107 22 -113 292 242 -180 -178 160 -144 13 5 -92 127 67 21
3748 21 16 38 162 41 94 369 107 179 68 -32 -67 -94 -145 -79 -52 139 -76 -139 -137 -45 -7 -224 -93 -3 -122 177
3774 177 58 -103 -46 82 91 58 85 -104 89 -14 -24 -71 149 61 -26 144 60 96 -39 -43 19 -170 72 147 -79
3799 -79 -65 -49 84 29 -113 -35 -49 94 71 4 -52 -113 -61 125 119 82 12 -108 -41 -17 302 72 68 145 -38 104 -17
3826 -17 165 -66 16 -214 144 69 173 -8 99 -190 -66 -120 -57 153 112 -30 181 2 136 38 -67 -172
3848 -172 -121 -105 -135 188 -89 -89 144 80 -113 245 -31 -84 73 88 16 35 -43 59 28 -2 -140 9 125 -41
3872d1j0K50j00J3k09K4J07r8qL89l09j09R1P7r5K32k18r1o5P0K07Qj81n6J89
3897F7p2j5L4p6J09K93m37J97j37qJ19L5N7l47L7J10Q6J07l75J93J56k44j13K04
3921b0o7K35Qk35K27l47L50j04l04J48kK61j50l2K8Kj16K77j45m7J47P5k92Q6
3945a7Q8j00k21n9M29j56k23M44j83j84K94K1p9q8j98K43r2J65K07r4nO1l49P4
3969b2K61j42j30K4J02j54J62j08k2j77K20q8J29m9j73j01J00K85Pj46l7J54j86
3992i1J66r8l0R3mQ8j63K66O0k10j73J37J37k41j58r6L34j29K36o2J12p1j98J11
4016A6L4j7m5L6K27k06J03r5l8j51J70J0N9k04j83M28q3j08J44j90K19R0j29j46
4040e9K87j95L1p5k54M43k52R2P0j59m9M24q3m30L42k40j08L02m62L36QQq8p8
$$ plain form
3872 -41 -51 199 99 112 -97 -73 34 -64 -72 317 8 -101 -10 67 -28 204 -14 -105 -170 -100 107 115 -66 -122 67
3897 67 -5 -20 14 -62 47 340 -97 100 -37 -45 74 109 166 -181 -144 -34 52 159 -216 -23 133 -111 -224 -20
3921 -20 -87 148 156 -79 148 -199 151 47 -257 -109 -111 150 0 -32 -4 -2 -118 159 14 -33 114 189 -103 -17
3945 -17 71 -29 -250 -309 120 -36 -259 185 2 -182 112 133 54 -34 -232 11 -81 84 291 197 192 253 -96 -22
3969 -22 239 97 -33 -9 93 -61 101 -7 -29 -206 14 -74 55 6 -167 -268 -168 117 124 -22 -59 95 -91
3992 -91 75 -23 -53 40 36 124 -39 227 287 77 -96 41 178 -63 -221 -317 17 -112 124 62 174 103 -95 16
4016 16 50 33 -12 24 251 45 148 53 15 -136 34 44 103 -101 -284 144 61 -47 97 -93 126 216 87 -59
4040 -59 228 33 64 -11 -265 178 -74 18 88 -71 -120 304 221 -209 133 -107 -215 87 -375 -39 -31 -23 -111 -189
4064a89K50j70j58L78N8j20J9n9J22k28L47n35M20K1q0O3p2q8k95N05j66M4j0
4087E7j69K00N7k64L15m10L27k44K8J54j8N1j37q2pL45k80Q6r1r7L50r1J00j75
4111Ej87L30k49J28P9k84K46l8J46k87J46j65J48J99q7q4Ok81L8Q8m1J43J71k18
4135d8k1J89J05k73r5K44k56K96k54J54k36M71k36J42m11L33K2n30L50%L10k54
4157BM0l3J60k86n1K42J33l67J22k6N7n1j23L48l48J39J61k09n1k6J99J40j46
4180B6l2k5J65l84L57j24J03k88j37M85J6j74K26k26j2P0P4K79m62P5j5Nq5O3
4204b0j34L6r4K26r4J45lkj19OK5P3k62L99j27J28m2k70K08j62n6K77j23J02j50
4229c3J73K59l25N3j20l9M3K21m40J08J11j45J56n7J34l9k22K51p1j22J68k51
$$ plain form
4064 -189 61 -109 -267 111 169 49 68 9 131 -97 250 -285 135 156 76 139 67 -21 -316 189 23 67 57
4087 57 -112 88 145 -119 196 -214 113 -131 -103 51 33 84 -53 -135 -142 203 -77 9 -82 -179 171 80 180 5
4111 5 -182 148 -101 27 106 -178 68 30 176 -111 35 -130 18 217 130 46 52 -229 -191 -103 -144 -1 170 -48
4135 -48 -69 120 225 -48 -143 101 -155 141 -113 41 -195 276 40 182 -229 104 126 -404 -54 -54 256 2
4157 2 42 9 169 -117 -168 74 207 -160 -38 -64 -7 -58 -181 167 -181 -42 119 -90 -141 -167 32 172 26
4180 26 -6 -31 134 -250 107 -17 86 -202 -339 146 162 -12 214 -12 -24 46 120 399 -63 12 -3 2 -83 -20
4204 -20 -154 -118 -212 14 -80 65 62 60 -59 -53 -28 45 -217 182 55 183 141 -129 79 -83 -139 138 15 117 -33
4229 -33 140 399 74 127 7 -32 11 232 -208 -100 11 -134 22 -35 99 60 -162 89 18 -104 64 -187
4251a87K17j93jJ38J36j10K00l17k2K34K3m7O5Q8m73K46K27p6j71N9k0n8M6j40
4275a36K38p2k04L25Mp9j51P1J32k0j15M4k13R9J70l13K62Lm4o8J33j41N7M1j63
4300a40L7J38j47J33P3j11L5J00k0j26Q8J88l45J98o3J28k45j2J24r2j24J09j4
4323h8k65K97L27l62j00K47j16k86M99j27q0j07L76J04k13J3k79M0J68j1q2J46
4345A01r8j2j75K72m6l3K2j45J04r9L0O3j33J40j22J81j85J59n3m3J79j79Q5j41
4369a28L57o23L06J92rJ7lM5j21J33j25n7r3K76j52k9N8l96L25j6J78r1rk18M76
4394B93M8n28Q5N2N3K08l39J16L2J22k16J37J69m15q2L93l3O7m21K42L6N6j16
4417d1o8j0L6N4N5J40p2L0j43j2q5J77M0J26k74K03r3j07L7o6j97K23k90J20N2
$$ plain form
4251 -187 30 -163 -164 -26 110 0 200 -117 -139 95 118 71 136 224 -249 -3 224 148 -23 36 16 -42 4 -136
4275 -136 102 30 -174 151 155 76 -75 -4 128 108 -7 37 -176 -77 93 -220 42 45 1 -67 66 -75 -18 23 -140
4300 -140 -103 35 -112 21 94 -17 18 118 98 -28 60 248 -97 101 38 166 -79 -91 33 -59 -183 -74 -88
4323 -88 -353 -56 271 -91 -191 56 -60 -346 153 26 -54 -161 215 319 106 119 -160 -120 48 37 -45 101
4345 101 3 -9 -184 88 42 9 31 -114 -10 -109 -79 -16 -149 -9 -131 50 -135 24 -29 -72 107 -72 13 -128
4369 -128 229 -394 -88 104 95 112 109 154 33 166 41 -16 -109 167 15 -14 44 -352 -27 -43 135 44 35 -183 293
4394 293 341 -187 -102 -50 3 211 -128 -12 20 142 -74 63 232 -183 -265 128 95 162 -259 -17 19 75 -41
4417 -41 -109 -119 -83 -29 26 166 94 124 -19 -31 -116 61 101 227 -47 156 63 -44 -7 -73 -270 -47 -337 -217 -165
4442a65K67l74L45j98J19N6Q6j36q8J75j93N5L0q5O4K5L9R1j6m3j76L9j05J28
4466f0j57K69J1q7Q9l28J82%o0J05m2K63l40K31k45J99p3j24J17N0k5J28o2r6
4490e5J68j84K26j10L43k85l2j14O0j01L61l54J5l2J07P6j6kj25K13j94n4K98
4513B09o5k85L26o7J04k27j65K3K82J20k64m6j48J47n2P6j8J44r3j1L9l40L43
4536C2P0J27m16K93R2q6j06Rn1K17J39R3l26j27K75k89J77k19n2L32l96L66k78
4559a24K63j04j12j08M94k57J00m01M06j47j79L60k48J40j57j40q5K37K55j47
4579D6k03K0J35m6L02o83K78K57R9n2j90p9K12K4j51L05j95j50J26o8%K22j11
4602I8P8j51o2j78P0J97j51p0K62j89J89k34O1K1r7K45l86M68j64J46n1j55K47
$$ plain form
4442 -165 102 -272 73 -125 -6 50 136 0 -88 87 -106 -51 -21 -106 -42 -17 22 113 97 54 -122 -83 -188 -60
4466 -60 -217 52 63 -24 65 -263 -81 -81 -141 -36 -78 185 -155 76 -169 30 -43 -167 -50 0 -25 103 41 -55
4490 -55 113 -71 155 45 388 103 71 -43 17 -84 277 -77 -62 -94 13 89 73 71 -54 159 -35 -89 209
4513 209 144 -141 185 118 222 -5 -170 -147 135 255 -9 -55 -203 -56 -108 -32 -50 94 1 -10 29 -311 32
4536 32 102 229 -187 106 198 112 6 15 -36 181 320 413 87 -40 235 -54 123 -96 -148 184 -212 154 -124
4559 -124 139 35 -77 -185 309 52 152 -249 157 10 -169 191 -57 83 -74 -214 -299 -62 193 46
4579 46 -157 -137 -2 -48 254 -429 -151 106 205 153 -37 -116 96 120 -31 274 79 -71 55 -13 -13 209 98
4602 98 176 25 -37 -215 -145 52 -99 -169 93 -96 93 -141 -80 -59 -156 89 -297 171 7 153 102 -53 194
4625A94k27P9P6oJ21m31J42J2l3o1J90N1l3l4k08J68K50j60n9l2k4O8l2N3k91
4650b27M05j48p3J9J03j45J04J33l37J22j40J11O5Pj81J03P7r9K23k6l21K32r7
4673i0r9J92l69J08K02J73l22L28j22j83K75N3l26L34j04n0Q2J99j10k1n4j05
4695ij31RJ97M8j25j99K64OJ27j56or5L5j63M5K10l1j57q3K62j37J31k30J09J85
4720A06j12K56j53R9lj64J63n8m42K42J08l37K80Q6M9JJ6j63l4L2J58j57J09j7
4744F5p0j54K79k71J1J72j02qJ30JK6K13l70R8n4n0M6J13q3j80m2L04m43K77q
4769a00j15K73j71k5K42j17j57J38P3L0M6j51J86j35m0J70l64K82O5L3l2m5k19
4792a33K37l5k1K2j79N0L3j8n1K73n44L59J32j26K86j36j92J70l3N3j82j2J04
$$ plain form
4625 194 -33 46 122 116 237 -194 -52 -40 -73 -134 56 107 74 40 -168 0 250 90 31 -1 -25 43 11 64 -227
4650 -227 178 30 -43 -24 79 -66 38 171 -166 -44 -184 -73 -8 -1 -182 -79 -2 -101 122 96 -225 7 -90
4673 -90 -189 3 -366 -258 -56 117 -205 123 1 -182 93 146 -180 154 50 0 82 281 171 150 96 -9
4695 -9 -140 -131 66 114 -11 -210 54 60 187 31 25 -70 -35 -198 -153 57 26 -131 -214 48 -89 42 -188 -79 106
4720 106 -6 250 97 196 193 29 192 134 -308 -66 42 -295 -15 71 120 121 137 -26 -60 -28 130 -27 82 65
4744 65 -5 -159 120 -151 -140 32 -70 -78 52 53 79 292 -78 20 -34 -84 -38 75 -8 -188 -230 74 -369 -92 -100
4769 -100 -215 58 -113 -138 104 -13 -170 -32 41 71 117 -34 152 17 -23 147 -217 65 130 163 131 86 -133
4792 -133 104 69 48 70 -109 -59 -26 -44 -95 178 -366 -7 125 -1 285 149 -43 127 94 147 -35 -47 57
4815E7Qk07N09l79j39n2J72M0k19J18J61m07K17J79j44Q3j63J37j41J82K2qR4
4838A20k31K75m21Q6J48no4o9K20k22J06K12l58k6J25p0L0J59K35l72K21j53o1
4861a15K13o6j04JM60n15K38j2j04L1k88L68k4l48J87J64nj08m8j35J19J39J18
4884A66j57J91k48Q8J0k26K72j24L69k41n8k44J85O2j71J42O7p7K4j70L01n4l20
4907b13K76J24k03n0j40O4J15j45K02k19L33N2k52J40j34m8J14O8l0k69O0j09
4929b64Q3O1JK39j04o5J62Q7l76l6K64o2j6P2K42j67k21rK24oj7P7j01l69N0J67
4955h4J17j1J03j00j48J12l1J35l26N54j59l35K40J7j22n4K05l2J58j36j61j46
4977b04J59K55q8q7n5J6k59kK44j85L08J0j83nq1N7J86j91K02rJ1m8m1l1n8O0
$$ plain form
4815 57 65 -142 367 -12 -151 -203 -31 9 -210 -92 69 -338 -121 58 -86 -3 -166 -29 -170 12 34 26 120
4838 120 -111 164 -257 -171 -23 -28 -92 -161 59 -163 -57 155 -203 -229 -104 -174 -144 15 250 -122 99 -54 -115
4861 -115 98 32 -72 -71 389 -126 112 100 -4 27 -261 107 83 -265 -78 86 81 -27 -75 -210 -91 48 166
4884 166 9 200 -48 40 50 -176 96 -28 341 100 42 -202 -17 45 -126 16 83 6 30 -140 161 107 -213
4907 -213 63 187 -16 -66 -206 -142 -27 -172 30 -189 144 196 -56 84 -50 -98 16 84 54 -215 -155 -264
4929 -264 -181 -120 -119 120 16 -49 113 200 -176 -212 52 -10 -26 46 288 121 -100 -109 115 109 92 169 68 -301 -251 -84
4955 -84 33 22 125 25 -123 -11 -42 93 -233 321 162 -173 67 84 -38 -92 113 81 239 103 -58 -204
4977 -204 -45 210 122 35 -20 -4 -263 -265 -21 -206 102 112 -71 -76 -157 -100 86 -105 97 88 99 51 10 -21 -79 -19
5003a9J66k47O3j86J6K29j59J72k70M67l06M5J52Jl47L34O6k07J5j50K09K0p2
5026hm7pK7J18o4l11J00J86J46j46j99K52P0k09K9O8P8j55j09J86Q9k72K98P4
5050A94j39m5m5K8J47k8j14n1q5J94K99m01r6K0j16K17J03L4l9n7o0K8R6Q8j84
5075a2JJ9P7o9r9o2M1j01L55q8j30mp2K53q0K07j6j45n95M97J19j62P8K2J25k34
5101g5J06J38k26j64P3J75j14j50K37J48kl5l75K46j11l4K24rmk63N3L68rj60
5125C7K3o8r1j70J63J17j0k3P7r8J63p2r9R6R6J7j14k02K60j59KJ76Q5n0k25J74
5151A05J04m6j33k53mM24k99k7P5k2k9J5P3j24J11Q4n7N98n33L9k64P3J37j25
5175g8K12K0k48Q1k15K67j16jO0j2k4O1L6j20j59J41K07j04K6O1k22J42j21L1
$$ plain form
5003 -19 147 -100 -37 -223 -207 22 -137 35 -235 232 -74 -29 123 124 -223 111 177 -30 -15 -165 44 64 -8
5026 -8 -55 -62 -35 83 19 -292 -192 -6 140 -6 -205 47 117 -92 -63 5 83 -72 -181 5 94 -178 120 194
5050 194 55 10 -35 -7 140 112 -2 -53 -138 56 355 -46 -142 -122 -238 -21 82 116 77 20 -40 -12 84 172 -12
5075 -12 -11 8 85 16 -83 -145 -104 -205 150 62 -68 -72 -144 109 29 236 220 75 -520 -23 96 -66 12 34 159 -75
5101 -75 31 169 -57 -221 -148 27 -87 -237 0 148 146 111 -264 -18 -129 -163 61 52 48 -215 -162 206 197 37
5125 37 60 -8 -99 -269 -106 11 1 -22 55 -43 120 48 -51 45 141 158 44 -158 102 -57 -55 121 206 156 -69 105
5151 105 209 163 30 -223 -227 197 -102 -129 -54 -76 -105 -90 -17 -141 -30 54 -3 595 62 101 -163 -90 47 -78
5175 -78 134 154 -94 -13 -228 39 -77 -78 -18 -30 -54 7 43 -77 -236 -95 112 8 34 95 -127 15 -106 -75
5199g5J65k98K66o1k8O3j19K22k03J5M8j42L71K9p8k07N1j08J35k96M77k06j95
5222a74J64R9l18M80l23J00q9O1J70k03J10k06L05k06O7j96L49m21J62L07k93
5243e5K49j06o2L1j55J69l21K15K15p6j57R3j5j50K05k89L5L02p3j07pm5J25o3
5267d2k56J82J89j80p9K01N3k07K89k63K62j40J71j06k45n2K95K89j66m42L03
5288E6l7J49k63J77k53O2J13j33P3K02j74J1m9n4J44K26l99J90N7k4J44k04n2
5311c8r7q6J47K15j92L52n49M58k24J20m7j36N7J39J4l9J41j18j19J06J31j38
5333I7K7j79p1P5J41k90K2L71j90k04N28l7j49k10L26k40Q4j31j9N2o9J94k08
5356h0J45l42K77O7K65j50k37P6j25J21m4J39P2l57L73k25R8N2j20j3m8J86k19
$$ plain form
5199 -75 90 -208 58 -3 -31 32 -87 135 -68 -53 -5 -147 224 253 175 -32 19 -89 46 -250 227 21 -174
5222 -174 -10 89 -229 251 -72 28 -61 0 170 -33 77 -129 176 -30 37 -159 190 -231 -69 238 -55
5243 -55 194 88 26 57 -98 71 -250 -35 180 104 -53 40 25 -125 80 -209 -174 128 55 -52 -59 -104 21 -42
5267 -42 -298 -116 73 -107 -186 15 68 -139 150 -113 149 9 180 74 -171 -223 72 361 195 -247 56
5288 56 19 168 -95 82 -171 -109 4 -129 -56 146 -28 -17 -66 -120 24 250 -149 41 98 74 218 14 -38
5311 -38 -135 -221 -74 141 -51 301 -248 210 -14 106 59 -77 -20 119 133 94 235 117 -2 104 235 97
5333 97 124 -55 -126 -51 90 -200 -178 193 3 -201 327 290 141 -69 257 17 101 -30 -49 3 -66 128 -80
5356 -80 65 -277 0 67 332 182 -55 21 -104 17 -27 112 184 -173 200 -25 73 125 5 -8 -56 130 -89
5379h9j38K82j9l3k05J57K72k10j86j09J64J7n9O7L7J98j91J11J15r5P8m22M1
5402b17K50K2J50k21j13R2q8J95k11j23J87K0K45m78K87R3l68M17q0J60k07N1
5424F3L2J89j58l7l4m8j3m1L41k45k28J89K69j51l5j36j93J42j1K44M0l02J52
5447B9l8rk45K19L14l25J54k29L02k92J94J1k07o1K19J43R5r8k74K0K12l40L28
5470A22k07n9k9L28k85LJ8K0J26qk47J17Q8Mj30l2K50j30L1OJ37k79J4J29J65
5495A52n1j8p3M5j61L5L1j82L73l28K52K20m44K73R0j69J24k37K10l58J82k47
5517b81M52k31K19k30J07l7j47J58j83M13j65m5k74K94L0j71L04k93J40j13K4
5538b9Pp7J12l4J45k33K53r9Kl9r8L24k52j22L34j22j2n8q3J96l33L36lJ02k3
$$ plain form
5379 -89 -227 55 36 3 -202 -45 227 17 -169 -278 -114 -97 -156 -89 -52 146 -45 66 181 86 164 -258 -217
5402 -217 33 55 205 -16 -129 -37 -125 70 -141 -264 -77 -57 188 -290 -3 90 -278 139 59 219 12 63
5424 63 95 284 126 89 55 7 -6 -47 294 49 -179 10 279 128 93 -43 -236 -94 -105 139 179 -123 29
5447 29 -9 -18 -263 -44 270 -55 99 -130 172 -120 74 85 -122 -183 36 179 274 176 -98 -78 134 -206 122
5470 122 -85 -144 -173 155 -130 -127 -109 -89 37 29 -218 -101 -13 -9 -139 -171 79 -51 -20 -14 123 -156 -142 -13 152
5495 152 101 83 10 55 -106 -71 -40 -222 151 -177 75 295 -149 124 214 45 169 -68 142 -216 -34 -281
5517 -281 171 -60 159 -71 36 -1 -148 10 -173 240 75 30 -244 50 80 -91 213 -80 60 -53 -29
5538 -29 -22 -99 13 -21 124 -109 144 45 47 8 -90 234 -18 -140 194 72 60 2 -81 115 -218 118 115 217 194
5563A94k40J08l01K24l4k8j15J7M38l73J1n7L9L44j47J50l07J2o0K9J11KJ7q4
5587e0J78k3N2j32J91p9j33J0J88l75J90K9M9J08j39j6Q7p9Rj18J68j18j67J58
5611a2j07L40k80j2K85j60N7p2j70L0p0K12n0J6J06o3j13J51j27J36k60L27k5
5634A39P9k1j83j98M62k93l7L6k9P5r8K07k21J03p6j24L38k33J30j49K03J01l08
5657i7J21j37n1K75j44O4j5k49K33q1k49M21J2m7j22r2L54l15K71k46n7J83J57
5680A89k03O4p6p8L9R6J9j39J59oR3k98pP5K8J39n5k9m8q8J44L3q4O0q1R3J30
5707A69j21K14j85k60K23j16J99p7m1R0j73J66p0k99L42M8l67J24K22K9j86M5
5729b4O0j4K07k10K71l85J44Pj24jj13L74k86J02J07n8o0l2L77k27r6Pj30P1L23
$$ plain form
5563 194 -46 62 -239 -15 -49 -77 -192 -175 263 -110 -99 -156 -117 227 80 230 -77 -65 -125 -96 15 17 34 -50
5587 -50 128 105 157 25 216 137 4 14 202 -173 17 46 95 203 64 48 135 56 65 -53 115 -3 -170 -12
5611 -12 -119 221 -59 -71 214 54 111 39 -131 -101 -171 41 -9 7 113 50 -63 88 -39 97 -163 164 139
5634 139 218 197 14 -184 278 -15 -52 -16 -45 30 -68 139 -82 21 -55 -179 159 -74 56 -93 110 211 -97
5657 -97 24 -113 -164 111 -33 31 16 -233 0 -81 -330 91 103 56 -66 -158 196 -119 152 -94 -151 32 189
5680 189 -14 50 -26 -104 -65 31 50 -89 70 64 157 -141 -148 -73 -45 94 39 10 -38 -126 18 51 -33 27 -54 39 169
5707 169 48 262 77 -183 40 -76 123 46 5 95 -78 88 18 -281 61 109 -258 -134 88 117 -69 -24
5729 -24 36 22 229 19 290 -95 49 56 -68 -69 -182 192 -94 8 115 57 -3 -35 342 115 19 26 -104 -33 290
5754B90r4q5j13k6M5j24j00K66L4k6L1L9j13j69J04J02j6J2r4j1L22m82J10J74
5778G6j28k05N48l06L2nO9o7P2n9j96K68j69J63k36M66l23J31J1j55l39K69N8
5801b5oj02R7J17j85n6J80k31K31j00J27m0K52k41L41l71k2p3K3M2j27N0J49K87
5825C17l39J88o8J36j69j8j1K40j63l91L66l5O3j08j14J02J31P6r5k41N2J09k9
5848aj47J7O6J10j72J19N3k5j11N9j19P2K71n09L28k27O4J3J85L4j81o6K39l30
5872b58L86k68j3n4K53j32N5J49j49j32K24n7j30R9P1J17J9j88j5P0N5k42M8m2
5896a34K28j23N7p1O4j31R2Q5k24J8L53j61l34K57o4m3M0J06p3N4r2j20L23o4
5920D3k84l1K54j0m9om5m2J03R5k73L09k47K72j36J22J00k14p7P9O7Lj36K1M1
$$ plain form
5754 290 196 111 -2 -28 17 -107 -207 59 93 67 98 137 24 -145 -41 61 45 57 -37 -48 274 -208 -98 76
5778 76 -52 -257 291 -15 17 12 81 14 86 27 -169 99 -70 93 -143 323 0 131 142 -13 -352 -83 -25
5801 -25 -31 -133 -36 81 -104 -160 20 -211 20 -80 47 7 259 18 359 -12 -34 -107 -84 -42 -169 -119 30 317
5825 317 -22 166 98 234 65 47 36 276 113 -278 88 53 116 8 -106 -4 127 203 108 -133 -81 28 -1
5848 -1 -148 -131 -65 45 -127 -8 45 20 -91 -32 -151 -79 192 -317 11 -216 -152 -139 46 80 -101 -167 72 -258
5872 -258 128 -140 -153 -207 46 -86 -31 118 -31 -163 61 4 -126 -27 44 161 180 -8 -23 47 102 -140 -92 -134
5896 -134 94 -29 28 -43 21 -110 -18 67 -157 -139 214 53 -281 -24 -88 -131 -91 15 -58 -4 -96 -216 107 43
5920 43 -241 -272 -18 -28 -77 -83 -128 -170 -67 28 -245 64 -183 89 -47 75 175 -39 -116 -37 30 33 -103 -82 -41
5945d1N9J31j96j8M1R1J48l90J13L09k25n8J11kj23J7PJ85j78l33J17L63l18K12
5969B2l6J29j32q3M6n7J73j94K44j00j36L75l62m8J05K49j93k95K58J42l9k07
5991a39K78n7j75L3n8q2K30J6j19jq7j4L32m9k14p7P9M9J00o7J7j09j45K39oQ0
6017E4J5k76K42j81J0N2M0M7j71J45K03q1m4p8r4N1j34J88J22k45O3k01o1K12
6041a22K88l97J88j83K00o0M8M8N1l45L25j2k23L47k13K72j17l46L45k79o9M13
6063A59l41L48l7J4l69j57M90J03l40K38j4j63K30j24M6n1M2j06J4k10J75N1M0
6086C8J87j70l7j13J21Q0R0o0l47N02j51k87J74k09L52l01n8K69l56O87n83K23
6108E1l8j06J20L55m50J15o3j46J06K13k45%M8J47p0k4k03M89l27j8K92p1j61
$$ plain form
5945 -41 18 149 -47 -65 -24 67 215 -175 -62 247 22 -36 75 73 -50 -33 -26 159 -19 -352 -235 128 -190 22
5969 22 -14 115 -17 -100 -54 -111 62 -132 112 12 -124 251 -111 -159 -54 195 2 -293 -35 107 68 -139
5991 -139 139 82 -93 -60 -118 -200 30 46 -73 -74 -161 -175 157 108 -106 -183 -104 -55 45 -22 -5 -114 -259 -20 -26 54
6017 54 69 -207 35 -146 -136 -84 -44 3 -168 -23 180 99 55 -23 -117 -66 -200 -12 110 -135 -72 -273 -334 -122
6041 -122 166 -231 -43 -226 -26 -86 -38 10 61 -284 41 29 -194 153 -60 212 95 -251 94 -185 -254 159
6063 159 -182 166 129 143 -226 -383 107 210 -130 108 94 -69 161 37 83 32 74 -32 -18 -228 -53 -2 38
6086 38 225 55 18 -95 26 106 196 136 -211 291 140 -147 27 -182 170 -131 -189 80 -276 411 -172 51
6108 51 13 -93 27 382 -68 47 -16 -162 -56 157 -88 -88 -40 107 37 13 -190 299 -28 -46 246 175 14
6131A4k19J53R4l3j69j5O0L38p9Mk16j45J88nR3j58J56j44r4M02j14k87Pj0K11
6156C2J38k3l39P9L42l94K20k24K00j59J52j75K07k17M60m81k0N40l54Q6k26j51
6178c07J91J97n8p6j51L47l17K40l12K77O8j07J43Q4J32l12n4K0j51J62o9N6r2
6201h9M81l51n9J20p1O9p7J62k13j03J8J44k03L4J22K02k63J02Q0n2k44J36Q7
6224C2R1k14J93K9p2p2M7j05J84o4K06j94r1j6M6j62K01J1k33P5m4L97m80J19
6248a16m4k0K1o1p8K33J04nj90J75j11K38m98L90q4J28J71j69K82r4k08k37J98
6271B5j51K60p9l4j37J18q0r6L16J1k43K20j80R1j1J65m8o2l46K78O0p4L1JQm6
6297cK2j26k3J28J92k71K39q6l86L50q3JL6j39J39q1LJ49j90J36L03k96K58m03
$$ plain form
6131 14 -205 -52 42 9 -160 -175 -115 223 144 148 -68 -213 -25 -30 63 -95 61 -83 -177 225 111 -176 -169 -179 32
6156 32 170 147 -192 -113 229 -165 55 -169 31 -128 24 -151 56 -161 299 -182 -202 338 -16 70 -156 -307
6178 -307 -116 81 23 -53 -204 143 -174 66 -246 31 99 -8 135 219 351 39 -15 5 -146 16 -53 3 -89
6201 -89 392 41 -18 102 31 100 23 185 -28 -131 -113 31 -172 -138 -16 186 -77 25 105 53 -191 -55 32
6224 32 123 -91 102 131 59 -13 34 -71 113 49 255 61 -30 -46 0 -162 39 50 -183 -108 -152 245 -235 -116
6248 -116 -160 -180 -159 -220 -298 -65 39 34 -156 19 -92 146 -352 38 -46 82 253 84 366 272 64 -173 25
6271 25 -126 134 55 21 -116 2 -78 -174 142 153 -90 130 -50 41 30 195 147 85 -261 17 77 3 34 35 43 -3
6297 -3 19 -107 -130 -2 190 -81 158 72 -314 36 -47 -46 -10 -149 -10 -91 -88 61 -129 7 310 14 272 -131
6321a31J64l9j87K09K98k96K2P5l28q0N67m49PJ98k29K67j93q4K34j80j7J00j15
6344a87L88rj19L3j05k9J10Q0l82L6L6k6J23j9R0r1N5L36m24L81j79k69K00R6
6368A25K1j97L45l83J44l22J78K20o3p1M3r9o2J06lL7k86L67k0%o7K9o9pJ18m33
6394c49M05J93n76M58j21N5R9k77P7R9J67n9j18j7J51m6J20k98j11O6j31JJ69
6417d3J77L5j05p9K42n8r9Oj33Qj46J31q4L21j75K09k39J2J06j67O5J57j59J92
6441A74k64n3PJ68j82L8L2j27K17N0j09J43j98J79q9k02K98L3j05N2m5o0p4M3
6465g4J54k90J88J7J0M7j25j86M00j82J55o4J7j77Q4Q3J0J67j53k66J57N9J00
6488A31j78K14j92J85j20j5j61J25L9k09R8J53r4M0P6n4l97L37J13j02J10J51
$$ plain form
6321 -131 33 -6 -193 16 314 18 40 115 -213 -293 274 -175 -168 30 -199 68 -125 -209 25 -155 -172 -72 -187
6344 -187 201 192 73 106 1 -28 82 162 -220 -184 -148 -174 -51 -70 20 -71 -16 320 -104 277 98 -171 29 125
6368 125 146 -51 294 -89 55 -267 -89 131 68 -3 40 -59 -121 -15 -18 19 -267 100 80 80 13 42 -27 -34 84 -349
6394 -349 56 249 -327 131 10 65 164 -113 -36 63 230 171 53 36 187 141 261 -37 -148 -82 -213 -212 -43
6417 -43 134 169 64 -15 227 169 70 76 -57 -49 -195 -64 -148 173 -2 207 -32 -20 86 -81 -16 141 -18 174
6441 174 -90 -143 -136 32 -150 -112 -80 -207 10 60 -49 94 -104 75 -14 -216 82 115 10 62 17 -43 -117 -74
6465 -74 80 -210 -22 -5 5 52 -73 -259 141 -41 114 50 67 -110 -26 57 67 234 81 -185 -28 31 131
6488 131 -47 167 -25 160 40 25 -136 -11 28 -181 -83 70 -24 16 92 38 -359 -22 91 -11 99 250
6510B50k3l66L34j26n0j26N7L25m17L89l68M9K38k27J8k22RJ90p4K38Kk28q8K54
6534C8N5k56L06k44J39J25j93k5mJ89k38L70k82p0J38K45j31o8j6J34r0l25o0
6557b63K99p7J66J4j05k16K57OLJ15j41k48p1J24j16K70j71J82k22K77k05J26
6579DJ68k69O%L67j68j05j5r%L1l8j9K16k20J61l70K67J67k99L44k07ok28K33
6604A1KJ93l26K57j2k97J42J67j25j2k50Q0K72m3m0j52J00j46Q6J51P8j05q3L07
6628B55l54O4k0k81M10M4K4k92P1R2J23m30L31m6p6R5J03j19j6K12l45L22k73
6651a06q0N8N8p4Q8L08j91J98j02J26j87j42P0j53K07n1p6O2q1J12J45QK2k26
6675gj41K05k36L84k57o7l76N74j02O4l66M27L4m6j1k47j2J70o6M8j82K45k96
$$ plain form
6510 250 227 -139 195 69 19 -107 -50 275 -142 247 -121 -72 166 -61 -43 -265 -256 -66 -140 98 100 -128 -216 38
6534 38 93 -163 143 -101 38 163 -30 -55 -59 130 -108 262 -20 -90 48 293 162 94 78 212 122 -203 -263
6557 -263 36 -41 125 139 34 -182 75 81 84 199 58 -190 -261 -137 -253 17 -154 28 -194 83 -122 4
6579 4 172 -97 -91 -91 276 108 3 -12 -21 -21 10 -28 -47 169 -51 110 -260 7 174 -125 219 12 6 -222 11
6604 11 13 206 -120 137 125 -172 -30 137 12 0 -250 -170 102 59 19 -133 -33 -179 -93 58 136 31 -52 255
6628 255 -99 -35 -55 -336 74 118 142 -150 -79 13 136 -294 37 -9 -85 10 113 -6 -22 190 -155 167 -106
6651 -106 -186 -128 -70 -144 -56 252 61 259 157 283 96 -46 24 -129 78 27 -49 13 -68 44 189 197 219 -7
6675 -7 -148 57 -179 205 -52 -119 -495 79 -23 41 -325 102 136 90 79 -168 -180 -10 -76 -28 -210 35 -261
6698b61L29k56J64q0N9L3K41m40L01J90l65K33j65K37r1j34qJ37j35K05p5L0n
6721A44j09l01K05Q6qj69l6K84j60J26Q5k28J2K73m56K09j10K75k52P4p0J04j50
6744a72L0O2R3p5m4J12p1k8Rl7K23n4k80L62j04m1J06k41J15j17K48J47k67M6
6768B2L8k63O9K70j96q8L7J77k74J00J88j91j3K17j81K15K5l04M0K2K7O6n8M9
6792fk4J66p5k6m8k10L29j68L5m6M3J05j60L3j28K63O1n09K52m0O7Q3K8J00j8
6817A07l14J83K04M6j32j49o9J81K1j2K2n1q7o8o1O9L47k04q4K91j04j52J1l6
6841d1J26j90L89j09m10J71n5K26q1Mj30j56L5K63M6RO2j08p5J10k0j01J03j4
6865E4k18O0K08j59R1k14L09l0L7j90%K4r5o0J99J39m28J00J62J18J93k10M6M5
$$ plain form
6698 -261 68 -188 -24 -104 -45 -12 229 -211 90 280 -85 148 -17 220 129 -5 -13 124 -11 194 119 149 144
6721 144 35 -266 -61 25 17 -152 -188 96 -64 62 147 -81 -69 204 -252 -43 -153 122 -130 -56 -126 -22 -172
6744 -172 -142 -80 13 -62 -106 6 -65 -93 -84 -121 102 48 -232 130 26 -15 91 -150 -35 -152 96 243 -24 22
6768 22 60 -203 -134 136 -60 -148 -111 66 -208 -108 80 -111 -124 93 -88 127 152 -152 -112 -90 -63 3 -55 -6
6792 -6 -30 136 61 35 -13 -223 106 -62 -27 -73 -30 75 -85 -52 -180 83 144 -365 -113 -153 -86 -3 25 125 107
6817 107 -207 -24 180 226 94 -55 -124 57 78 66 88 37 -50 -118 -179 -110 237 33 -51 240 136 -16 -5 -41
6841 -41 85 -105 284 175 -235 -64 -119 107 26 30 -100 -256 -221 42 88 97 159 51 -24 86 66 -35 68 54
6865 54 -164 -104 104 -55 36 -178 131 101 138 -52 -52 -28 -123 -183 16 155 -273 -173 -11 107 300 90 136 181
6889A81k14k94N70l40j08j22K81L50l05j64K74k08J41K2rj74J86k56N6J05m0j25
6911a93L73j20n3P2q3j28J99k15M09j14k00O1J76o0m2o6M2J00q0L0k46k9L05q9
6935D9r0J02Q0n2Kj69K9J06l3L6o9K08Q3l61j70K63p7Q3J99k66K0J55k2j90J77
6960I3j98J34J46k69J4j6K04J51l51r9J24R8J27j98P3J9J39m40K90r1j39K41j05
6983e3k16K24k1PJ53kk69J27P7J41k58J66j32m7J83k04K13j34J35n1P3n7jj32
7007g8kq6K49j54L34k56J1J16k67mL48l56J32j14J55n0L44k01r1l27K58j31J84
7030A4n4p6J50r2j3j76K98k25J56N6j9j09R1k09J67p8J97Q7n5j83K41Qj99n6K31
7055A52r9k9J32k14K58j21k14K60k07J97L3j67N9N0o6P2J48j69j79P4r7P2J57
$$ plain form
6889 181 -33 -327 243 -97 -205 -327 -46 304 -1 -165 109 -99 42 64 55 -119 67 -189 -133 -28 -68 -193
6911 -193 180 60 7 79 -4 -132 67 -148 261 147 -53 8 184 124 82 16 58 158 78 108 -138 -167 138 49
6935 49 -41 61 141 89 91 -78 -49 57 24 60 -9 199 282 -79 -249 14 -63 20 219 -47 -27 128 106 -84 93
6960 93 -105 29 175 -94 -80 -96 108 259 -92 -191 -67 31 158 -40 33 52 191 -249 41 -50 -189 52 -53
6983 -53 -269 -45 -66 -59 94 92 -177 -50 27 168 -90 76 -56 -103 80 -124 89 -45 90 39 112 55 54 -78
7007 -78 -80 -166 83 -71 263 7 18 134 -133 -137 211 -145 -13 -127 28 -22 322 121 30 -297 -39 -170 14
7030 14 -40 -116 34 -58 -71 -247 51 -174 -18 38 19 -90 1 -208 -41 -119 78 165 110 -73 168 176 -23 -79 152
7055 152 53 24 156 -58 200 79 -135 125 -82 115 148 -19 40 90 24 96 244 75 -104 -30 -127 -55 102
7078A02j25l1K0K2m4L4n7J52j27j44K15l62M32j64j58K14m9J96m20J24R3O7O1
7101E1k4q6Mj08J86m0K0Q1jp0M7J96n88L69J4K5ql2K06k35j75j16K30J50K1L7
7127A54j29N2l08J02J47R9r3l94L30Q0j01n9J59k45J42J17k88M67k99L21q7k24
7149e7J47k34n6K95n5j62KL16j68j57J12R9k61K18l53N28j49NJ51k37mj07K84
7172A57O6m81K90r4JQ6R1n2K00j78q8J77j42J06j84j84L36j16J7j73J03J03J93
7195B34k49j27J98Lk63J19J53L2p3l63K95M0m1J57m6j73O6J14j98N0N3K01j5p6
7219I1L8m47J15J32J64r7K1J74k19q9J37j47L09j00Q0j02R3l32P3K88k56Q1M2
7242D9l4j78L93L9m25N7L24J0j16k56K38j9j67J63k35L57k6j16N2j44J95k66M4
$$ plain form
7078 102 -23 -54 -34 -12 -56 -22 -79 73 -54 -198 17 -345 87 -77 -235 -21 -70 126 -294 -170 -77 -10 51
7101 51 27 -59 -55 -163 23 -17 3 84 83 13 60 256 -332 37 51 76 68 36 242 7 -168 -284 -54 96 117 154
7127 154 25 77 -231 -129 18 117 24 -370 -40 40 -61 -120 39 -206 -64 53 -235 232 -67 254 167 -57
7149 -57 90 -144 -200 95 40 -122 -120 196 28 -129 -17 82 -179 39 -314 214 65 70 221 -16 -20 -127 157
7172 157 223 -258 32 -62 -61 25 116 64 264 86 -2 175 33 139 -45 -229 107 -9 8 -165 -62 41 234
7195 234 -15 -142 56 59 -204 -85 68 100 27 -336 -41 -1 -42 115 69 -104 -38 76 -122 -72 -19 182 167 91
7219 91 129 -318 -203 -71 93 -4 17 191 -28 -117 20 -127 182 82 162 60 153 -179 -106 182 -74 7 49
7242 49 15 -163 230 269 -156 -99 225 235 119 -137 101 82 -85 78 -157 200 174 58 110 -34 161 -105 -61
7265f1Oj42K08K52n01J90p1K01l65P9R5J85o6n1j0J11L5j41J42j78J96l3p6n0
7289d5J24j01P7R3k82J12J06p3n6j7L09k70Q1M0j87K10j43Mj3N7L0p8j54J79j52
7314a49J42K73k82j21L53k44J85j33l15L08N7j41j68M01k49R3K44l04O0m01L91
7335@MM8j41M4R5NJ1j14J90m3J00l24P6l0Q0J63k80qL5J73l20J11J97j69q3K65
7361H5R5o2l00K90K05m18J62j57P9%O4j88R8RK9J08j9k03MJ12J07k36K25k07k43
7386c61N49k41j21L85m87K38n8R5jL34n62K57k19R6Q5Nj01Q6r9L47j81j14J48
7409H0o9rk81K37K09j34o6n4K14n7j72M07m71L67k58M1L7N5Mo5j0R7k02J44L6
7434H0m8M6m4J71k54j0R1J34r4M1k94N40k47k85q6J99J10J12l9k80J19j9K64j81
$$ plain form
7265 -61 -55 -197 11 263 -238 -48 -119 82 -283 -204 -109 76 10 -41 -51 60 95 -46 96 -82 114 81 5 -45
7289 -45 79 -22 55 148 -134 -22 84 11 -45 -62 247 -23 58 98 -89 121 -22 -18 -31 26 56 -22 -176 3 -149
7314 -149 -7 266 -16 -137 216 -28 157 24 -291 17 74 -67 -235 166 -83 10 254 -50 10 -391 0
7335 0 4 52 -89 -45 50 55 66 -48 142 99 199 -125 -49 -79 1 164 -116 -124 -89 84 -236 -125 72 -97 -180 85
7361 85 180 118 -182 108 313 -105 57 -100 -21 -21 43 -145 -47 -38 -9 99 80 -123 -119 -7 100 -136 89 -118 -361
7386 -361 188 -53 -174 211 -276 -38 -96 -1 -2 332 -230 27 -192 -96 -11 -6 -107 -21 -120 227 46 -68 80
7409 80 11 2 -279 -42 167 33 -33 -87 127 70 -102 305 -166 201 -57 -16 21 76 80 15 5 102 -100 44 80
7434 80 32 78 34 205 -49 -59 32 166 72 113 -181 359 112 -173 -259 -60 50 162 123 -157 -38 -57 207 26
7458B6K3j44L13l06Q6p4K7K35l27J68J33j95n5J74Q1l30P6K0L1J12q9L34l15Q9
7482I3p2K87l02r3K48j22jM9R9l63J87L4j59J27j33N6J73k64J60L02q8k01m3j4
7506d0J20L2k12J39k1qj12J54j04j24K11j73J04J32l1j91K04j48L9j73N1J07j00
7529a44O6O6k1jl24M26J96l33L0j65K29O9j46J52L3j63N8o0j03K65r2J56j85j35
7553a26m3J35P3j09O5O2P5k9l48J80J45j88K09l47N93n27L74l24m2J17jL7L18
7576B99n97L54k48M6K15m4Q3k9j83L9J01N0k4j54pP6K03l99O6K47k75J54k7J1
7600d3O6m1j47K39k22J59j97K63l1qj18L1L19k69k58L07R8j59k5K15j47k89J38
7623a19J5jK62k39L05k95J70j76M3J12J24l08J89j14n5O0J64m18M08l60L96m83
$$ plain form
7458 26 49 -95 218 -88 -2 -76 -49 186 -141 27 160 -35 -90 84 165 -165 -89 -69 -38 74 -15 319 4 93
7482 93 21 308 6 -87 161 39 38 87 186 -177 10 44 -115 12 -121 -65 108 -156 4 306 218 17 -26 -40
7506 -40 80 112 -100 39 18 10 -102 52 -52 -176 35 -138 -34 98 67 -124 80 -68 -29 -202 -151 -44 -144
7529 -144 -78 -12 -33 -34 -358 68 264 -69 -39 -204 25 94 -52 100 133 -30 28 -32 -135 130 38 194 9 -126
7553 -126 -169 -34 39 -70 -5 57 132 103 -245 -65 80 -108 101 -246 347 -180 194 -130 -172 -55 -56 -19 299
7576 299 -298 56 -192 -146 69 25 108 79 -104 -65 36 86 62 -92 -99 -23 180 -219 -153 94 -181 -27 -54 -43
7600 -43 23 -18 -165 74 -148 11 -186 77 46 38 -80 -49 270 1 -257 50 148 -11 -36 179 32 -257 -119
7623 -119 -104 -105 157 -82 223 -72 98 -78 -35 77 201 -107 82 -32 -87 -27 137 -281 127 -233 163 -320
7645c20M8M44k50K56j82Q9l04N49m13K2K26k06N0N8j7L1m3J58k90J71l2o9K5k28
7669b27j38K69K78j78J89m69L85J62k58k32L44j23j7J54k05M21k15j60q3K86l11
7690a28n0J58r1R3o9%K0k16K86p2m8O2j93R5J59j41L0L40k46K0j25L03l00K45
7714A32m07J4K38p3R2J79r2O1k54J77k54PO2P1P4J17j18J26l65J75p5J1K34J28
7738B60k81J6j95J31r2J55j18j19J93O9J20j47J6Rp0K30p3k5Q7L8n22M06l7N3
7762A04l17L37m3j31K1O9p6m6j12Q2K62k63K3M3J44j13M1K14j14J17k22n7n0p7
7786a64R2O9k7M2J69l30J22j03N2L9J85k3j93RJ2j5J2L1J41j71p8Q0L9j48J9K08
7812F9r2L74n05k1J55P2j23J70j5O4j17K2l26K46K31l09K03k84K31J45m40M32
$$ plain form
7645 -320 -272 172 -78 178 -4 85 -219 330 -83 -61 165 -41 9 67 50 81 38 196 -94 77 45 -24 1 -227
7669 -227 -365 -96 182 4 193 -276 109 271 13 -219 125 2 -15 139 -66 355 140 -20 -103 183 -128
7690 -128 -178 -20 -111 -18 -87 -87 -67 -283 3 -69 -117 -55 -248 -153 6 -135 -105 235 -11 9 -116 187 -113 132
7714 132 -275 -261 -23 -96 -4 175 83 144 -110 67 -187 -180 -118 -47 27 144 26 152 -213 -38 -113 -102 132 260
7738 260 -21 -5 -200 -69 -161 -6 -124 -243 -50 19 139 -8 8 17 -53 177 104 79 166 204 -318 88 51 104
7762 104 -213 124 81 -50 -29 40 -36 -82 -194 -112 150 -113 -90 -47 97 -16 25 239 125 242 20 -37 -87 -164
7786 -164 -72 -3 -30 12 181 -149 -27 -130 -78 -39 146 123 -70 -61 -49 -64 -52 -21 120 -51 -129 -49 -10 -158 -139 69
7812 69 -23 351 -154 -175 -20 52 -71 99 84 148 31 53 -273 -27 204 -105 98 -186 45 190 -250 182
7834A82k18R3q5J77j14k3j99J23m3K57m00K03K08o4p9r5J45j75J18j35O4K14k14
7857f0J90j55J00K8lO1j18ml84J51N2J13o9M8j42L30j90o0J68Q3k04n9P0k0o1
7882a35J67J45p0j18O6l26J22L8K88j25j73L17j93m1j83J1J57P4j32J87m9j62
7904a35K17j80L34k88J48k96J53N8j12Nj63K25R9j59K37k8k80K52j56J09n3O2
7926D9j75j54L77Jk55K91k26L03m89K50J85m1q4J9j20j58L32k32Q2J60k91K36
7948F0j86K35q4k24K63j65L1k47K84j94p9L06m7N8mk05o4K88k02J80J17j49j77
7971b05L48j58K95k03j08m1J21J66j96J6n0M8n3P1j71M6m3J58J71k97J01k81J20
7994a45J95o8N3N7j84K7n0L24n19K24j92M24k97J14q8L25ok86J33o1K3m6o0M9
$$ plain form
7834 182 -36 57 -28 149 35 12 -187 -64 -107 150 -250 -47 161 97 18 -77 68 -107 11 -124 -60 154 -60
7857 -60 130 -25 75 103 100 161 43 39 -345 -194 -142 -29 -98 -50 -192 138 -52 -112 56 139 -65 -124 -54 -74 -135
7882 -135 32 177 107 -11 55 -271 -149 -111 177 52 -121 196 3 -38 -221 -210 -53 21 -111 76 27 -135
7904 -135 82 -98 236 -52 96 -200 -47 11 -101 -96 -259 -34 65 -94 143 115 -165 87 -69 40 -13 49
7926 49 -126 -280 97 98 -157 134 -92 211 -278 -28 157 116 32 51 -69 -227 105 -127 -45 115 -176 60
7948 60 -126 109 25 -199 64 -101 -70 -317 -33 -227 -306 0 -47 11 7 -198 -262 26 -176 4 121 -28 -205
7971 -205 143 -15 280 77 -31 -72 49 215 19 35 -15 33 -20 51 -120 -74 -117 41 212 -85 16 -265 -145
7994 -145 50 -18 35 92 -92 -65 -115 209 -310 -86 -278 146 -151 -37 -125 200 194 -92 41 -20 3 -43 -103 -54
8018e4M6j75K21j41K15J8j49j92J24R1l4J25j3P3L2l45K57k23Qj3j46J85J69j46
8042f7l2J30M4j35l2K88l99K86Rk06L7MN1N6R3MJ02j47j62j3j61K31n3m0k7L62
8068B23k20o2k02M12j05J92j71k61J89J37k27Q8OK55k40o5P1n8N7r3L69k15k06
8091a26P1OrQ2K09k28j8j22qM2j69K27lj26NN3q6K77j8R8j90J11j51j13L89m4
8117A59k20j43K62J9m1j6k05K22M9J01k42J78n2r2k80J80K5K34j25j03j8J43n5
8140b0J79l13N5J27k04L02j91r1J76J13k14O9J21k06L5j46J13L10j44L1j80m7
8162a25k27M97k60K73j00l8l5J31n8q9j32J10j54L18j63J23N0m6J88l58rL27l99
8185a76m5L27l56K40J54j94
$$ plain form
8018 -54 -8 -183 38 -103 112 130 -19 -211 -87 4 -30 95 82 155 187 -158 99 -124 -116 -129 -275 -90 79 -67
8042 -67 -99 31 75 -60 -92 196 -203 83 92 -114 -77 -73 -22 34 127 131 233 86 -76 -89 -250 -19 -72 -112 -139 223
8068 223 3 -59 -261 151 46 238 67 -194 -5 132 -95 -7 -1 254 14 -51 20 -38 19 -74 295 80 -126
8091 -126 -55 -49 -58 24 233 5 -13 -135 -143 -101 -270 -43 -46 -172 -167 -114 -200 77 59 157 -33 78 -73 -186 203 159
8117 159 -61 -204 58 77 36 20 -185 37 86 187 -55 123 71 -21 -301 -121 -96 138 13 -90 -108 35 -20
8140 -20 159 -154 -99 28 -176 126 -65 -156 20 133 -81 -12 109 -97 -62 -208 -95 215 71 102 -78 -125
8162 -125 -352 145 -115 158 58 20 -15 116 58 -31 -163 -53 -207 111 -52 71 121 75 263 -95 -104 223 -176
8185 -176 -221 106 -250 -10 144 -50
8191e0
$$ Imaginary data points
##PAGE= N=2
##DATA TABLE= (X++(I..I)), XYDATA
0@%%%%%%%%%%%jRj6J6j6K4l2L2m0M8n6P2q8J04j20J36j57J81k08K40k73L11l52
34a86L96m48N05n66O34p08P88q76R73j078J194j321J458j607J771j952K151k370
52a242K611k880L182l520L900m338M846n440O146p003Q073r449J1294j3909J7938
67A0209k5015M1039j47022O482J95680j56361m7221J25317O3233p3438J8470N5344
79F6717J9906m2913l0399L0684M2912q7306o8599Q9221M2797j24785j5540R7755
91B0450m6451q7327R3121O0030r3224j1282J02103R7n0898L3346M4413j7670k6247
104B0461p710J5674J213o0506l2566O7920J2743q8601Q195R0252k5093m5779P5687
117C1890L5038p4633J876O6545k3732n2496J5639J2996j8828n626n622l729J2708
$$ plain form
0 0 0 0 0 0 0 0 0 0 0 0 0 -1 8 -8 8 -8 16 -16 16 -24 24 -32 40 -48 56 -64 72 -85 96 -112 128 -145 166 -186
34 -186 210 -238 267 -299 335 -373 415 -461 512 -566 628 -693 765 -842 929 -1023 1128 -1242
52 -1242 1369 -1511 1671 -1849 2051 -2287 2559 -2881 3265 -3738 4335 -5114 6180 -7729 10209
67 10209 -14806 26233 -120789 -114307 81373 -74988 -122209 3108 66341 -7097 11373 66717
79 66717 86623 43710 13311 43995 86907 -399 -68998 20223 63020 -61765 -77305 20450
91 20450 -26001 -113328 -20207 39823 -53401 -64683 37420 37517 -13381 19965 64378 46708 20461
104 20461 12751 28425 29638 -30868 -63434 4486 17229 -71372 -63177 27075 1982 -43797 31890
117 31890 66928 -7705 -5829 60716 36984 -15512 127 13123 -5705 -11331 -16953 -20682 -7974
130g974q511p839L6121K76n2066K3242O3302l6513m3614N8207K6101n7006K498
143c776M9421k3150l9829K1147J1762k5975j3119J902M774Q560r069o003L0199
156F844Q859k9125J4530L8908k6837l1124L4210R812m2786J83L0145j7008j9276
169b2665K2385J1057j4002L9P709K486K588r452p865J4933k80k4051P564K2554
183A3000k0203j6116K9644N906l0022N443K4867j1472j3054J5807O542r944K278
196B676O348J161R2n880m355P413m450j8037M194J1609j5504r034K0410M360j5346
211a4343R600J9081n571o862J1775L053q974k839L72k049l584o999k497O645k849
226f041r374P959R953r275k473J5360J432j1251P225J0859p685n242P499L2o995
$$ plain form
130 -7974 -16485 -24324 11797 12073 -39993 -16751 46551 10038 -33576 24631 50732 -6274 -3776
143 -3776 45645 22495 -17334 3813 15575 -10400 -23519 -21617 -16843 -8283 -17352 -23355 6844
156 6844 15703 -13422 1108 40016 13179 -17945 16265 26077 -16709 -16526 13619 -3389 -22665
169 -22665 -280 10777 -3225 -3186 4523 7009 9597 145 -7720 7213 6933 -17118 -9554 13000
183 13000 -7203 -23319 6325 12231 -17791 -12348 12519 1047 -12007 3800 10342 398 2676
196 2676 9024 10185 10277 4397 42 7455 3005 -15032 -10838 771 -14733 -23767 -3357 1003 -14343
211 -14343 -4743 14338 8767 1905 13680 16733 7759 4920 5292 3243 -341 -7340 -9837 -3192 -6041
226 -6041 -15415 -7456 2497 -6778 -9251 6109 7541 -3710 3515 14374 6689 1447 8946 8978 1983
241A983j549k15k528k797m138o71M233j916m393P646Q131m491k5J1157J612p769
257D270L461N050o983o365K206j201o694k328J825L64j639l30L970M166j040J88
273a080O148K639m511K97N479j759n706Q93J648m631l469J765k47l027j160J780
289d941K663r90j373L584M627o84j488L714J758l059j14K722l294m678P67Q50
305F4l563k709J455J404m17J025K143Q21j76K234K184k81k059j90J271j329l223
322a346J59J307j326j457J032J983p62r06J709J708j546r74J504L45k220j21K347
339A436p77k666R31K062o97k114P79R87q42m14J129J159q67J16K348R98j677j048
357H43P50K91k324k246n69q5l84n18P63J357P89J176K593J658p17j41J103j170
$$ plain form
241 1983 434 219 -2309 -5106 -9244 -9915 -5682 -7598 -11991 -4345 3786 -705 -730 10427 12039 4270
257 4270 7731 12781 5798 -567 1639 438 -6256 -8584 -6759 -6395 -8034 -8364 -4394 -228 -1268 -1080
273 -1080 5068 7707 3196 3493 8972 7213 1507 2400 4048 -583 -4052 -2287 -2534 -5561 -6721 -4941
289 -4941 -2278 -3268 -4641 -1057 3570 2886 1398 5112 6870 3811 3697 6419 3125 -1553 -786 64
305 64 -3499 -6208 -4753 -3349 -3766 -2741 -598 223 47 2281 4465 4184 2125 1935 3206 1877 -1346
322 -1346 -1187 120 -1206 -2663 -1631 352 -410 -1316 393 2101 555 -419 1085 1430 -790 -911 1436
339 1436 659 -2007 -1076 986 289 -1825 -1046 -59 -901 -1315 -186 973 106 222 2570 3568 1891 843
357 843 1593 1884 -440 -2686 -3255 -3340 -3724 -4242 -3479 -2122 -1333 -157 2436 4094 3377 3236 4339 3169
375C169j605j45r98k195n98P86j116j317J479J034n34L90O06N11m2P54J166O93
393B038O06l34N98J080n22j764k30q46j825j614k63j144m02R21J468O70J231J060
411G28J289J515j95k98j94q35j859j42M91j962r33J875J65j404J156J361j383
428f25N68J113l71j103P30L97n42J186L88j418N12O52j622j008Q51j222j710J372
446a852P40j475J311K556l0K49K250k94j085N20jk060j613J81j531o45Q55p89
464b713N51J739k57l54J437N40j300L06J261q76n39J171L74o59P21J12o60Q52
482A706l05k111k37L59r67o77P57J10m60J461O08q46J068J234j287n52P57p30
500a12j192R00K81o19R78J110m67O06P50l27j073K79j083j441K61k45j295N4J280
$$ plain form
375 3169 1564 1419 421 -1774 -2372 -1586 -2702 -4019 -2540 -1506 -2040 -1650 -1044 -533 -575 179 1345 2038
393 2038 2644 2310 2908 3988 3466 1702 1472 626 -1199 -2813 -3076 -4220 -4622 -3701 -2233 -1563 -332 728
411 728 2017 3532 3337 3039 2845 2010 151 9 500 -1462 -2395 -520 -355 -1759 -603 758 -625
428 -625 -57 1056 685 -418 312 709 167 1353 1741 323 835 1487 -135 -1143 -292 -1514 -3224 -1852
446 -1852 -1112 -2587 -1276 1280 1250 1499 3749 3455 2370 2890 2889 829 -784 -603 -2134 -2779 -1924 -2713
464 -2713 -2162 -423 -680 -1034 403 943 -357 -51 1210 334 -205 966 1340 681 1402 1514 854 1706
482 1706 1401 -710 -947 -588 -1555 -2232 -1475 -1365 -1825 -364 244 -602 466 1700 413 -139 618 -112
500 -112 -1304 -404 -123 -742 236 1346 879 1485 2235 1908 835 1114 31 -1410 -1149 -1394 -2689 -2635 -1355
519a355P8L00J193Q8m56J129P86j133l67O63n31RM13l73j35M80j09j138J14K57
539h7j185l76M88n00l29J270Q86j89J211R10l05N2O5q73j054m5p71q68Q6N50o93
560a757N42J095L01M1J085J75p58L48L79j046l10M2q3k37r7J97m74l01P07l92
580e43n69J51J50O3L11K47M86P87M40K16K7J43n55j56r05n52n73o98k73k01N71
601a433J94K0P62P66L47M32J60j09q0l09q0l52K2L2q85L52O57o90o34O22R1k41
623c56j47L12p85N02N22L7l93J064q0m29O92l6q33k76M66k06q03L07M96k79L81
644A56K38p6L8L63l51n96M36l1q36J72j09r4J66L47M3J75M61L2q9K18j14k8O5
667E86k41j91o1k60k15K01j26m86N36K40n11l41P74P1k74K95P3k95M66N92m18
$$ plain form
519 -1355 -1277 -977 216 304 -152 977 1763 630 263 926 395 404 817 444 309 789 680 -458 -344 -87
539 -87 -1272 -1648 -1160 -1660 -1989 -719 167 -22 1189 2099 1794 1846 1911 1038 -16 -61 -832 -1700 -1614 -1064 -1757
560 -1757 -1215 -120 181 222 1307 1482 724 1072 1451 405 95 137 54 -183 -280 -83 -557 -858 -151 -543
580 -543 -1112 -961 -811 -748 -437 -190 296 1083 1523 1739 1766 1909 1354 1198 293 -259 -832 -1530 -1803 -2004 -1433
601 -1433 -1239 -1219 -457 309 656 1088 1248 1139 1059 750 670 318 340 372 -513 -161 496 -194 -828 -206 -115 -356
623 -356 -503 -191 -976 -474 48 85 -308 756 676 247 939 903 70 -206 260 54 -749 -442 54 -225 156
644 156 394 318 356 719 368 -228 208 177 -659 -487 -596 -690 -524 -177 -134 41 502 534 445 663 549 521 586
667 586 345 154 93 -167 -382 -181 -307 -793 -257 -17 -528 -869 -95 -24 -298 -3 70 -225 241 833 415
688D15k71L97K3r55N27q5o06mL03l99J4M41m9J90K81N94o81J61N41o74K31k91
710A03n69m06K90l2k46M05K91j38J30N64j59M5J57j04K57k20j75n47N75K03p24
731c00L60p7j18k93R7j47n0N43J25k32o5O45l38L46L53n2m42K71j21o88L02j43
753b4m47k0L37k98J37O00K21n70L51K90n78K05j98j71K07K97q52k18O93j03k82
774d23N35l2k68Q6M56n42Q7L06m3r2L1J7m17N13J50l55j22j4l51k42P52m0n97
797f05R12J19k96J81J43J1k99J19n6m31j49k74l84L33J80j80L93l6R6J56O27J11
819F71k44P9J99r9j75n30K64j69k42k48l36L30k48N5M49k49K25k18L04M24p4O97
841H65j15nJ71j42l01m80q9p1j82j56k60o6q4L98j88L23K42J47M44o0J74k21L70
$$ plain form
688 415 144 541 564 -391 136 51 -555 -559 -256 -655 -641 -200 -249 -59 222 816 135 296 837 163 394 103
710 103 -466 -872 -582 -614 -860 -455 -164 -302 -172 392 233 278 435 331 588 368 193 -354 221 424 -300
731 -300 60 -17 -135 -428 -331 -478 -528 15 140 -92 -157 488 150 496 849 797 355 626 505 -183 119 -24
753 -24 -471 -491 -154 -452 -315 285 506 -64 287 577 -1 204 6 -165 42 339 -513 -731 -38 -141 -423
774 -423 112 80 -188 -102 354 -188 -101 205 162 70 101 118 -299 214 364 9 -113 -127 -478 -720 32 -8 -605
797 -605 307 426 130 311 454 465 166 285 229 -202 -351 -625 -1009 -676 -496 -676 -283 -319 -223 -67 560 671
819 671 427 506 705 606 431 -99 165 -4 -246 -494 -830 -500 -748 -693 -244 -493 -268 -486 -182 242 168 865
841 865 750 745 916 774 473 -7 -96 -167 -349 -505 -765 -831 -915 -517 -705 -382 -140 7 451 391 565 344 714
864G14n2k32p5j93q4k12n3j82J02k89l6K17J71j22J47Q2K23K45q1k7L34l16j55
887A26j32L45l05l46Rj27m4m6L05k82L75n1P9J96L01Q3p4N8j61j23J79k63P4j59
911A7k55r8P7k38M93l85K14J2o6Q2K63n4K03Oj14J20j2k7m93Q4K96m71J40N0q3
936b39O2L07m22j48K66L27l22m4L75k96L27K65m22%J33j07m00P3J50j06l0O52
958D01m22k68P02Rp25L58j5k01o2K22j99k16J78l0L30j35L80k19J81R7j90n67
980c91O84k98l12K33J9j21l1P4jL64k91P4r3j65K73k76L52J09j72K32L97j90j63
1003C07M6k54P5k3m44j68K42j58Q1QK33j20K59M20J2k52O6K74m99o8K26k70k00
1026b07J74k93K61q9J48l58j51M46k47l3J74J73j48L13M45l23L5N3J08l78K44
$$ plain form
864 714 662 430 355 162 78 -134 -187 -369 -267 -556 -592 -375 -204 -326 -179 -97 126 371 290 263 597 281 126
887 126 -6 339 34 -312 -303 -430 -474 -520 -215 -497 -122 -173 -94 102 403 486 412 470 309 186 365 102 176 17
911 17 -238 -336 -259 -497 -4 -389 -175 -163 -229 -147 116 62 265 271 157 277 265 238 -255 -171 125 -346 -206 -156 -239
936 -239 -177 130 -292 -440 -174 153 -169 -213 162 -134 193 458 36 36 169 62 -338 -265 -115 -221 -251 401
958 401 -21 -289 413 422 -303 55 40 -161 -223 -1 -200 -416 -238 -268 62 -73 307 88 269 366 176 -391
980 -391 293 -5 -317 -84 -65 -186 -217 -143 -144 220 -71 3 -90 -255 18 -258 94 203 31 263 660 470 307
1003 307 353 99 174 151 -293 -461 -219 -377 -296 -288 -55 -175 84 504 516 264 330 604 105 37 263 -7 -207
1026 -207 -33 -326 -65 -154 -6 -364 -515 -69 -316 -349 -175 -2 -150 163 608 285 320 373 481 103 347
1047C47m27k10j48J46k55J70K38k82l5O32J13l22L94M7k64j25K48j88l29N14j43
1068A21l37KL27l85O4K57n51K31J40K18k97O82n16L28J59Q0k13j77M65o07k86
1089b95J79K6m12R1K99j85J5M36k22q2M03j24j43J09K24k86o0L75l25J40K03k22
1111A44m18K86k15l32L24J47m52J85K12J2j09N16j30l69K75O07j030M32L25m35
1131b5o2J96k56j64M08P4k90J85J13l47L8K77j10n61L82L62l86k1N35k53NK89
1153C89j79l31M1J35l04J85j10q9n9P98n91k78N69j2m88O29j27m25K24J29L3k04
1175f5J46J28k03J04R0j48J13J12l50k9mk39N4K36K21k14K13Po9j43J54m22K33
1198g5L49l24l96L41m7j3J17L79m34K30K58p13M22K6k82j94K57L91m06R0J72j94
$$ plain form
1047 347 -80 -290 -438 -292 -547 -377 -139 -421 -456 176 289 -33 361 408 144 19 267 79 -250 264 121
1068 121 -216 -214 113 -272 -208 49 -502 -271 -131 87 -210 472 -44 284 443 523 310 133 598 -9 -295
1089 -295 -116 -90 -502 -411 -112 -297 -282 154 -68 -150 253 129 -14 95 319 33 -27 348 23 163 366 144
1111 144 -274 12 -203 -535 -211 -64 -516 -331 -119 -107 -216 300 170 -199 76 683 -347 85 410 -25
1131 -25 -87 109 -147 -311 97 171 -119 66 179 -168 -130 147 37 -524 -142 220 -166 -187 348 95 100 389
1153 389 210 -121 -80 55 -249 -64 -174 -263 -322 476 -115 -393 176 164 -324 305 178 -247 -23 106 139 -65
1175 -65 81 209 6 110 200 52 165 277 -73 -102 -106 -345 -291 -55 166 -48 165 172 103 -40 114 -308 -75
1198 -75 274 -50 -446 -105 -152 -165 -48 331 -103 127 385 -328 94 120 -162 -356 -99 292 -114 -24 148 -46
1220d6J86P0O1p28O01r7l40K14J58j73j77O51k85l96P50j31p20O97j03k45k11
1241b64M75p3k95J63m7K0L87m05R1j70J40k02j12M06p5j43m5J26K7L45J8l12o
1264D9K1j07n1K02l71j6K38J11j35J25Q5m48K15K26l47K22n1O7q6o2M43k65m6
1287A9N47k39r8o5j05j38K1o9J37k90J08R8j71L46j01K33j81J91j60l5J85k32
1309Ao5J15L5j12K10j57p0j47L78l14J5k15n4K73Kj02m2M62pk8J16j41R3q8l2
1334A26q3j5K0j9n9j52J25J64j51J59j85k86N69k63l3N0N7j54P9r4J38j67L02
1357A28k82Q9l7j01J74kj30l7J71k0K64k23P3j46K82j66k19K43j94M24m24K7K16
1380A10j40K23k83R0l2r3R6M6N6j50k12K64R9l1k03L04j97nJ55r8L51m04J52n13
$$ plain form
1220 -46 140 210 271 -457 144 47 -293 -79 79 -94 -271 380 95 -301 449 318 -402 295 192 -53 -264
1241 -264 211 138 -157 6 -41 -21 366 -39 52 -118 22 -180 -292 114 39 -104 -149 -23 4 349 367 55 49
1264 49 70 -37 -88 114 -257 -273 -35 76 -59 66 151 -297 -82 144 -203 19 -32 35 -51 -113 330 65 19
1287 19 566 327 229 164 59 -79 -58 -127 10 -280 -172 -74 -245 101 0 233 52 243 83 48 233 1
1309 1 -64 51 86 -26 184 27 -43 -190 188 -126 -111 -326 -380 -107 -105 -207 -249 213 206 178 294 153 246 158 126
1334 126 43 28 48 29 -30 -182 -57 107 -44 115 -70 -356 213 -50 -83 -33 24 -130 -51 -145 -7 -174 128
1357 128 -154 -65 -102 -203 -29 -31 -161 -198 -27 -47 217 -6 67 -79 203 37 -182 61 -133 291 -133 -106 110
1380 110 -30 193 -90 0 -32 -125 -29 17 73 -77 -289 -25 74 43 -160 144 -53 -58 97 -1 350 -54 98 -415
1404d15M61n4n6J24m39K35J21J46r3o7j5P3K22j66L02m17L18k24O3n0j14J53k15
1427a07j4J69j40M5N0l79K37Q1p9J50p7R0Mj91J94L2m2j9j35L16j08j36M2j84
1451b01J57J89m4k01p6O4N9k54L00j1P8J05j08j91L7L48k32J59j06r4J42k20l5
1474a35K2J01K10k80m2J61q0l1l28L98k16n1N16k12O5J77k91J7J08O9j96p0J78
1497I0l80L93p2r0KL10m5l17J99j36M8j12r4L94j36m1l2J53pj66J95r4m21L66
1521Gn5O2j39K17j52J37J14P4k14j67M09l00l6J02r9o7N2j20j23J30j29K72m9
1544g4N9J42k83j22M44j36k48L23j32k24N99m0j32P7j11j72R5M26m66k65K56k16
1566b00J81j92K73l88L74J0O5J40k97j32O9J70q2K66N9l44J47j03K14l05K0K03
$$ plain form
1404 -415 46 -8 -64 60 -379 -144 -23 123 30 -37 -52 21 243 77 379 -38 280 56 119 69 -45 108 -107
1427 -107 -121 48 -92 -47 3 -376 -139 -58 -137 13 -64 26 30 -161 33 65 23 4 -131 185 77 -59 -17 -201
1451 -201 -44 145 101 -100 -176 -112 -53 -307 -7 -18 60 165 57 -134 -97 251 19 178 72 -22 120 -100 -135
1474 -135 -113 -12 198 -82 -124 37 -43 -74 -402 -4 -220 -271 245 33 98 275 -16 1 109 178 -18 -88 90
1497 90 -290 103 31 -59 -57 253 208 -109 90 -46 2 -110 -204 190 54 13 -19 134 127 -39 156 62 -359 7
1521 7 -48 14 -125 92 -60 77 191 265 51 -116 293 -7 -43 59 -40 -107 -55 -175 -298 -168 -297 -25 -74
1544 -74 -15 127 -156 -278 166 30 -218 105 -27 -251 348 308 176 253 142 -30 65 491 25 -240 16 -200
1566 -200 -19 -211 62 -326 48 58 123 263 -34 -166 -97 73 -9 257 316 -28 119 16 230 -75 -55 148
1588A48k05J9J04O9j98q7M53k62k41M80l44j49K59P0j42J50p2j51P4m7j32K59
1610E5k5ol02L17N8l4n8J16j57J65p0O6m30J31M09r8r2j88k00K71L5k09Q9K22
1634F5j39J24J7nn4J2M10n19K74n9K4j76m2%Q7l1J8p9j37K60l34m6M40l67K79
1659B2l60K11Rm7L50l02J53K7m3J17J9n35N48j31j53K6k03L98j73q2N36m95L9
1682f9K34n9k59K92k55J42J55k45J02k40L39j05k93K26Oj6p0l5K42k95N6M24j49
1705A28j92J26k0J71q2j77J37j06m7J33m4lQk65M06k73J19n3j78N0M4L9RJ47j12
1730c5j48K13K77k41J33k27K18j91j46N4o4J36M8J36n23K86K75l35L20k16O8K08
1752B46l99K01J26n8O5j58R6k48L15k29O5K61l76j22L20k7o4P8j2M1j61N5l33
$$ plain form
1588 148 -57 -38 66 135 -63 -150 303 41 -200 280 -64 -213 46 116 -26 124 52 -99 -25 -72 -204 55
1610 55 30 24 -278 39 97 63 5 121 -36 129 59 125 -305 -174 235 137 45 -143 -343 -72 -37 -246 -157 65
1634 65 -74 50 67 62 8 20 430 -89 185 126 150 -26 -68 -68 19 -12 6 -73 -210 50 -284 -330 110 -257 22
1659 22 -338 -127 -118 -165 185 -117 36 63 20 137 156 -379 169 38 -115 -89 -292 106 -67 -149 387 -108 -69
1682 -69 165 106 -153 139 -116 26 181 -64 38 -202 137 32 -261 -35 -29 -45 -115 -150 92 -203 -147 277 128
1705 128 -64 62 42 213 131 -46 91 -15 -62 71 27 24 32 -233 173 -100 19 -34 -212 -162 -118 -79 -70 77 -35
1730 -35 -183 30 307 66 199 -28 190 -1 -147 -93 -157 -21 27 163 -360 -74 201 -134 186 -30 38 246
1752 246 -153 48 174 116 181 23 119 -129 186 -43 22 283 -93 -215 105 78 14 92 80 121 -40 15 -318
1775c18L57j80J91j9o8j9j6j14J00K91k20o6J1M6j5J84j81l7O9k5RL9n3J51j37
1800b0J17K05l25j57R2J51l10Q7kK84n4k32J01J26j10j11L01j33K4L9J39k91K33
1823A54n9q2p7J38nj71l0Q4j66J59L25l74J44j03K04k72o1L10k60J88m2J41j32
1846A3Q3Q5P3l67J93k00K01l22K15j80J71L5M6k4on7J47J54l41M09Pn8j50j43
1870a6N4K1k11J70j15P3j09l02L95J2j8p1n9L26k29K84j10j17K67o7k22J98k42
1893h8J89P9l60J72j32kK20k6j63m0J19j02O6J66r4K35l81P2J45q1J45k4j28J5
1917Bj86L15jj60j58L58n78M59K4j09k2m8K4J06j02L04q0o2j7k67K96k74K69l38
1941b45M21r0m98O74j03j23l9P0j80J45kJ50o7J20l52k07K90J70j76M5rj96J98
$$ plain form
1775 -318 39 -141 50 31 -37 -56 -72 -186 -86 205 -15 -81 -70 -24 -39 145 -36 -73 -4 -29 -20 19 -34 117 -20
1800 -20 97 302 -23 -180 -88 63 -247 -160 -162 122 68 -164 -63 63 -47 -158 143 10 34 73 212 -79 154
1823 154 95 13 -64 74 69 -102 -132 -48 -214 -55 270 -104 40 -63 141 -131 -192 118 -142 46 4 145 13
1846 13 96 181 254 -113 80 -120 81 -241 -26 -206 -35 0 46 22 16 -41 106 260 -81 328 335 277 127 -16
1870 -16 38 59 -152 18 -97 -24 -133 -435 -40 -28 -46 -117 -176 150 -79 205 95 -22 245 178 -44 154 -88
1893 -88 101 180 -180 -8 -140 -142 78 52 -111 -151 -32 -134 -68 98 4 239 -142 -70 75 -6 139 115 -13 2
1917 2 -184 131 130 -30 -188 170 -408 51 75 -34 -56 -104 -80 26 -76 228 148 86 69 -198 98 -176 93 -245
1941 -245 176 86 -412 262 159 36 -3 67 -113 32 30 180 113 233 -119 -326 -36 134 -42 3 -6 -202 -4
1964dJ02P4j80N1O0l40P1L42j88K64l04N8l1k3k45J38K07j16M4J08k93L1M18k50
1988fM2l41K72L09l93Q4L3P4KM9L9l68M1N32l70m3j62J91O2N4j03N1Pj01q0N8
2014f7O6q2m8j73M24l38r2M67Kj20N5J16m55L58n7j12R0J51j62k18K35N1p0j91
2038a70L35k79J29k3m5P6J29j97j36K59o1j42K90o7q8P7j45L4Po6J58l61K24K00
2062A38j30L20k40N6oj85P9lp5mrJ25k45L08m13M18j27j03J25K96m55K45j91K8
2086d8J86j2l7M8j52J25J6O2O6p1o8l25J99M3k24J67j3j02k3K3L93j07M4k20J37
2111A07J2l3j15r3J31o2Q3j7n2n3O8p3J9l7L46l11Q6j34L28J9k66K50j27k6Ok61
2137b05L24p7q8q2J16Oj07J10l8m6K15J5j35r7JK89k11j16J22K43l88J54k31L17
$$ plain form
1964 -4 98 172 -8 43 103 -237 -166 176 -12 252 -52 6 -25 -48 -293 -155 52 -64 -20 88 -205 -174 244 -6
1988 -6 36 -305 -33 276 -117 -33 0 74 76 125 164 -204 -163 369 -1 -44 -206 -15 47 101 -2 49 56 -45 -125 -67
2014 -67 -1 -83 -131 -304 120 -218 -310 157 159 39 94 210 -245 113 56 -56 34 185 23 -195 40 91 21 -170
2038 -170 165 -114 15 -8 -53 23 152 -45 -181 78 17 -125 165 98 10 87 -58 -24 -17 -83 75 -286 -62 138
2062 138 8 328 88 144 138 -47 32 29 -46 -50 -59 66 -179 129 -284 134 7 -96 29 325 -130 115 -76 -48
2086 -48 138 126 89 137 -15 110 126 188 254 183 115 -210 -11 32 -192 -25 -38 -140 -163 -140 253 146 190 -30 107
2111 107 119 86 -29 -122 9 -53 30 13 -39 -92 -24 -97 -78 -115 231 -80 6 -128 200 219 -47 203 76 50 56 -205
2137 -205 119 42 -46 -128 -12 -6 -113 -3 -41 -87 128 143 8 -89 -88 201 -10 -126 -4 239 -149 5 -226 91
2161I1j43J50j73J57j57r8J37K09m24Q7J74r1J52j5q4l8J50m2j3l10K26k39L31
2184C7r1J86p0J3o2j24J01j10J12K74q0k69%N6K78k2j89j42K33m9J11n6p2mJ14
2209A75j61o5KJ3N9M8n7l5J04O9O6k17J85l06L29j64J46l6k05J9J82k2k48J89
2233G0j10k12M35j76j80J71j16N4J68q0J70j22K7o8L9m0m5j86K95l59P5M55l71
2256a06L15l67K48j81L19j09k20o0M2J99n5k04J82L43k64j00Kj22J14L98l49l1
2278fl28L33j03K76k02M7q9n8J0L30k24R1J47k31J80l53L16m06L10j8J13k17o2
2301a44k1J45k07K37r7l3o2K42M3j29R7l05M08p3l4k03NR7j69K94r2k81J46n5
2325a91M08j67j45l5L6P2L3j07K25J32j16o2j19J95j71J2p2j86K78L2R6k68M8
$$ plain form
2161 91 -52 98 -75 82 -75 -173 -36 173 -251 -164 10 -81 71 56 -28 -66 84 42 29 -281 -55 -294 37
2184 37 -54 132 62 75 13 -111 -10 -120 -8 266 186 -83 -83 -27 251 229 40 -102 131 82 193 137 65 61 175
2209 175 14 -51 -49 -36 23 71 14 -21 83 152 218 1 186 -120 209 45 191 155 -50 -31 151 129 -119 70
2233 70 -40 -252 183 7 -173 -2 -118 -64 104 24 194 72 99 31 70 30 -15 -201 94 -265 -190 265 -106
2256 -106 209 -158 90 -91 228 119 -101 -161 -119 80 25 -179 3 346 82 -18 -16 -138 -24 374 25 -6
2278 -6 -334 -1 -104 172 -30 17 -72 -130 -120 210 -14 77 224 -7 173 -180 136 -270 40 22 135 -82 -144
2301 -144 -165 -20 -227 10 -87 -120 -182 60 103 -26 71 -234 174 101 67 -136 -131 -34 -203 91 -1 -282 -136 -191
2325 -191 217 50 -95 -130 -94 -22 11 -96 129 261 145 83 -36 159 -12 0 -72 -258 20 52 148 -120 -72
2348g2J16J41k48J04k64K98j42P1P8k46L59r0R3O3k80j32K46m1L6L5N6n8k59P4
2372f2L01j72P2l72L23k44JK10N7j88J31J3j15j2Q4L2r2O0M8q9K0K6k38K10l3
2397b9J38J23l32M5K11J07o55M92r1L4QP1J35k34k85L50j50j35Q3J84J20j67O5
2420H8j61J10PJ00j88J86m0j37k4K90kl39P9j7M7k9K16k26K12k28n7k9L60k29
2444a1J87pl23K21j3n7j7l12N00Q3j18r2Q7k23P0J01r1L10l06J7J38K23m82K47
2468A32l44J27Q1J33r7o5k55K00J39j98L13l61K38l37J72l2J30K86k49o1J29K01
2490B82o0l06K3K73k94J17O5r3k4jK7k05NJ40J06j9J20j86oJ46m9P4k33K54k15
2515e9pK03k77L8J32nj97RJ36M3l7P9J82k09p7n7J1K25j91J53o8j40K39l10K83
$$ plain form
2348 -72 44 185 -63 41 -223 75 -67 4 82 -164 195 105 198 261 -19 -151 95 54 90 125 181 123 -136 -62
2372 -62 239 67 139 -233 90 -154 -153 57 114 -74 57 70 -45 -57 27 59 -33 27 75 -14 6 32 -206 4 -29
2397 -29 109 232 -100 -55 156 263 -392 100 9 43 51 122 257 23 -262 88 -62 -197 -114 70 190 23 88
2420 88 -73 37 44 144 -44 142 102 -35 -59 231 229 -110 -31 -48 -1 -30 186 -40 172 -56 -113 -142 218 -11
2444 -11 176 169 -154 67 54 -3 -20 -332 168 251 133 41 128 -95 -25 76 -15 295 -11 6 144 367 -115 132
2468 132 -212 -85 -4 129 32 -33 -288 -88 51 -147 166 -195 43 -294 -122 -154 -24 262 13 -48 81 282
2490 282 222 -84 -61 212 -82 35 100 7 -17 -18 9 -196 -191 -51 55 36 156 -30 -36 110 61 135 -98 156 -59
2515 -59 -66 137 -140 -102 30 25 -172 -163 -27 16 -21 58 240 31 -46 -103 -92 133 -58 95 27 -113 126 -184 99
2540I9l1j6k52K08j7n1M7LJ32k82J17j23L96l6j45k15j3L94k60L1j18K8L07l01
2564i8j9J27j6r8r6k4K2K91K6k44J78K01n70L62j04Q9J58l59J57j90l2J91N5j12
2588a05P0J34L7j26L4Q7k61K06J34l34jk8K86n0L1l58L7n8L31j02O2l0Q5j91j20
2613b30J00J5K56k02J65j16J52J09l03L8j36J80P2r5L24k14l2o9R7p2Q9m80M30
2636G8l9j97M19k20k9m7L40l01j01j49J19J41m9j07L31n43L04R7O5l72L68j38
2658c0o0J30l10K71M0Jk25L01l24J90j08J54J11j93P8l7n5l9q9J61J19j92k54
2681c60K95P1k15K84q4J60r2K27k41j58Q3R0j33J53n8N3O9k4j23J61n4RK21l84
2705e0MK30l04J81j07M6q0O8P8O4k05J03J12k97Q0lJ18j9k6k9n7j26J69O4qJ86
$$ plain form
2540 99 68 52 -200 8 -9 -60 -13 -10 122 -160 -43 -166 230 194 49 -166 -179 215 -45 -14 -132 -104 203 -98
2564 -98 -117 10 -6 -104 -200 -224 -202 89 115 -129 49 250 -320 42 -62 27 185 -174 -17 -207 -239 -48 7 -105
2588 -105 -35 99 136 10 44 131 -130 76 210 -124 -125 -153 133 83 114 -244 -207 -265 66 -36 26 -4 81 -110 -230
2613 -230 -130 -115 141 -61 104 -12 140 249 -54 -16 -152 28 100 5 329 115 83 14 111 39 128 -352 78
2636 78 39 -158 261 41 12 -35 305 4 -97 -246 -127 14 -35 -142 189 -354 -50 47 112 -260 108 -30
2658 -30 -90 40 -270 1 41 42 -183 118 -206 -16 -124 30 141 -52 26 -11 -66 -105 -194 -33 86 -106 -360
2681 -360 -65 6 -209 75 -9 151 59 286 45 -113 -30 60 -73 80 22 75 144 120 -3 158 104 113 334 -50
2705 -50 -46 184 -120 61 -46 0 -80 -12 66 130 -75 28 140 -157 -77 -80 38 19 -7 -36 -93 -219 -50 14 6 192
2731A92l22MK38j60J42k69L56j77J8j50J8K74O6n0k66K79l39J41r1P1j16J95P1
2754A25j96P7n3j53J99j51J01m9J60j47o9R8j2J27m2L84o60K94j4K31k35R4k58
2777a49K02j10P5k80L43r6n7R8J01j44q9%J73j76K3j71J63L24j32o1l67K42J7
2800g1q0O3k27J46L36k61pK03p4J34Q3m0k75j57J93rN3k82K02J88pJ03j40O6L
2825A43k03qK19j49%o4Q7P7k53j09J21JQ4J56J56l19o4p6L39l19J65J76l35M16
2849B41k60J05j70L5k8R5j45RJ15QR4J3k37Rj4Q3r5J92q6j8j38L12p1k33J41j3
2875e6K18l15K21j63r1Q6K33Kk10J98K98l62k86L61j56Q3j36K04j81M7j65J53
2897a7j18R9q5J12j46J38N1p7r5J14r7J8m9k26L91k91R7K59J75j35j94J09K3m
$$ plain form
2731 192 -130 -126 112 -48 94 -175 181 4 22 -128 -110 164 230 180 -86 193 -146 -5 -96 -25 -141 54 125
2754 125 -71 6 -47 -200 -1 -152 -51 -100 60 -87 -156 -58 -70 57 15 399 -261 33 19 250 15 109 -149
2777 -149 53 -57 18 -262 81 -15 -72 26 127 -17 -106 -106 67 -109 -86 -257 -94 230 98 37 -330 -88 -71
2800 -71 -151 -88 -315 -169 167 -94 -101 102 28 162 245 205 -70 -227 -34 -43 10 -272 -70 118 111 214 74 140 143
2825 143 -60 -68 151 2 2 -62 25 102 -151 -260 -139 -138 -54 102 258 -61 -125 -201 138 -181 -16 160 -175 241
2849 241 -19 86 -84 -49 -77 18 -127 -118 -3 5 99 112 -125 -116 -130 -47 -142 50 -36 -54 -192 120 49 -184 -43 -56
2875 -56 162 -153 68 -95 -186 -100 133 135 -75 123 421 59 -227 134 -22 61 -75 129 -52 -5 -170 -17
2897 -17 -135 -36 -121 -9 -155 -17 34 -43 -138 -24 -121 -103 -152 -378 13 -278 -181 78 253 118 -76 33 56 52
2921E2O2P0j24l7MJ05O8p2j25q1NK05k22K6Q7J32j47k07K15O8l33K48r5K02k02
2946i6k1K16q8m5j20l6J20k7K33k28L8J5M7j15K47J61j28k49j14K38N0J03j52
2969D9P7j47m7L08j69M3k35l57N40m2J06k52K10l12K35k5M0R8j22p8L9O0j77K29
2993G1j15J29j98%Q8j0j09J86l16M55j04j36J12o3L3O2j89L36k11K7R4m15K44
3016b9J12Q8m2j04N1j10j77O7M5j6j1J79n2O3PL5j26lj87J01L52n9k01j06K73
3041A50l25J80J32k71Q5j56J65J37kp5K05j71n7N6Q1j28m9J17J4oj4j19RR0L1
3066G9j84K99l38J12q4J02J5J03j91J74j02m07L52K06M6k14L3J17j60k08L32k22
3088a40J36L3O3j64K81j48j26Kj49K41j8p6J55l48K69K04M4k51Q2J07l23K7K18
$$ plain form
2921 52 114 184 60 23 27 132 200 128 3 -78 -73 132 -90 -64 23 155 8 -199 16 84 -249 -1 -96 106 -96
2946 -96 -117 99 11 -34 -154 -190 -70 -97 136 -92 -54 -39 8 -107 140 301 173 -76 -190 48 98 201 49
2969 49 126 -21 -68 240 71 114 -121 -478 62 20 126 -126 84 -228 7 -18 22 120 -2 -80 -41 19 -158 71
2993 71 -44 85 -113 -113 -25 -35 -144 42 -274 181 77 -59 53 -10 23 85 -104 232 21 48 142 -273 -29
3016 -29 83 171 129 25 76 -34 -211 -144 -99 -115 -126 53 1 64 71 106 -20 -23 -210 -109 243 184 -17 -123 150
3041 150 -175 5 137 -134 -49 -205 -40 97 95 20 225 54 -3 53 134 6 -43 74 88 82 68 -51 -42 48 79
3066 79 -105 194 -144 -32 -116 -14 1 104 -87 87 -15 -422 -70 136 182 -32 1 118 -42 -250 82 -140
3088 -140 -4 29 92 -72 209 61 -65 -63 -212 29 11 -65 90 -258 11 215 259 8 90 197 -126 -99 119
3111A19o2k77lJ74j22L73k76J44P0k64K52k84O5N8NJ69j26j44N4k4K27K75l73
3134C0J44k9m1k52L8J07l1jK07j52n9K04k47j87L56j21J08P0k15m5J05Q1k36n7
3158b23L35m7j39M0j69M11m98L95j13Q1L56n18P9O8J54r0k65l7K95j13J02o7k02
3181a65R1j91J74K66K7r4J52k60k09O3R1J53qj16k7N1j36Q7r7p3K90j36K19Pj12
3206D7k21K60j29J96k56j35M89k01j34L92m80O3M7kO2k9L6P8l64K90k57J58K17
3229A27m0k35O9K46k79J87j69j19M7j42M06M6j08nj55R6l3J8k86M90j74J08j9
3252G6KJ08j48k05J88o3J9K41J9o7k76K49k12K09j94o3K22j00k7J6K18k21k07
3275b16N9K28j10n8Q4M4J1R9k56J44q5K12k38j82qM0J30P6j72JL07q8k95M0K69
$$ plain form
3111 119 57 -220 -223 -49 -171 202 -74 70 140 -124 128 -156 -91 -33 -28 141 15 -129 -75 -99 128 403 30
3134 30 174 145 104 -148 -110 -3 -34 -35 172 20 -39 165 -82 -269 87 -34 74 144 -71 -116 -11 70 -166 -223
3158 -223 112 65 -74 -34 -203 208 -290 105 -8 73 429 -89 -10 58 212 122 -143 -180 115 2 104 37 -165
3181 -165 -74 -265 -91 175 202 108 260 0 -209 -146 -55 98 90 -26 -53 -2 -138 -51 -148 -221 69 -67 152 159 47
3206 47 -174 86 -43 153 -103 -238 251 50 -84 308 -172 -109 -62 -64 -2 -31 5 83 -281 9 -248 -90 127
3229 127 87 -148 -79 167 -112 75 -94 -213 -166 -308 98 144 36 31 -124 -28 -61 -43 -329 161 -13 95 76
3252 76 78 186 38 -167 21 -42 -23 218 237 170 -106 143 -69 140 -54 -117 105 5 -22 -6 212 -9 -216
3275 -216 -157 71 -39 -97 -13 31 42 141 -115 29 -56 156 -82 -264 -272 -232 -102 -26 -198 -197 110 22 -273 -233 36
3300C6l15L18n0l9J11o7K2j32q2K1K54P1k0j35K5N8K57k6k45k52R6L0m8L26m94
3325b80J40R2L3j23P7j02oL22j89O4N4l6O2p0K31j67k61L5j47L01k12J69n2O3
3349bPp5j41Q8N8L6l9j07l5L81j23k5j5j45J27L6j57m0K91m5k55J19N9J65r1K2
3375I4q1J60k22L9N9k77J76Q2n8p1j39J29N6J21J04l53J45J38mp6p3L6K7J01k49
3400a36Q7j22J26jL2K28o8j75J79l39M22j69j34J18N8j78O4l6j01K70k26L3j04
3423a72K18J32k51J01N7n5j20l9J65o7j84J46o7J12N7O8j97K5K05j66J4J42m7
3446G7j42R5L4k52K40k57R0J55k36L58l13K11k8R6j46L12k82J6J41j72j91J56
3468c8J60m5q9j28l3J27J05k96L64j05q3o9J26n7M4OO3j78J9M7J2Qj95K01J4J40
$$ plain form
3300 36 -279 39 -11 -50 61 -6 16 -116 -198 -177 77 148 128 -7 18 76 333 307 62 -190 -94 -64 -112 214 -280
3325 -280 -140 -48 -15 -138 -61 -163 -169 153 -36 28 82 46 108 38 269 102 -159 -124 -271 30 -182 -13 -65 -2
3349 -2 5 -70 -211 -123 -65 -29 -68 -175 -210 171 48 23 8 -137 -10 26 -131 -171 120 75 -180 -61 -2 163 72 94
3375 94 13 173 -49 -10 49 -228 -52 30 -28 -99 -238 -109 -53 68 172 -181 -36 102 98 22 -51 -15 12 113 -136
3400 -136 -49 -171 -45 -46 -14 214 146 -29 150 -189 233 64 -70 48 106 -72 -8 -44 -145 125 -101 -68 -172
3423 -172 46 178 -73 28 85 30 -90 -129 36 -31 -215 -69 -136 -24 33 101 -96 -71 134 -32 -18 124 77
3446 77 -65 30 64 -188 52 -205 -115 40 -196 162 -151 60 32 128 -18 294 12 28 169 -3 -194 -38
3468 -38 122 77 -12 -140 -173 -46 59 -237 127 22 -61 -130 -4 -61 -17 -11 52 -126 -107 -60 -48 -40 -235 -34 -20 120
3494A20L2j74m6KO4JJ91l95J30j86J23k4P5RN9RK7K33j06O5m07K87oj86K14L7
3520A48J34k37k2n0oL17j90j71J08j50p7K64j71L85l95J67j34Q1r6j17K06O3j28
3543g1K01m4J6O8k46J93j77J22j32J64rj42J46r8n4k81K99l0J25kK83j26l21K05
3567H9p7K67m40P3K88j27k05Q9O7j71L29k06J25j38J73j23J76l02L9P9L4P0k51
3590a42J31j56PL14Po5l1Pk38K44J06r7j27K4k45L53j45J04J10j57lL5N3P1k71
3615a11R9j16k01L82q7n5N7r1J36k6J10j67P2p3O7k44K90J6j74J26J42Jj71k4
3639d2L0L0ML0O2j28p0J99J10k51J8K74k13K69m65K03J04k02K06J28m15K03j42
3662e8K1j46J75M2q4J47k27M01k87R4m7m3K9J68j05R2k29P7k2O0p7J99k28J15
$$ plain form
3494 120 152 -22 -68 -66 -2 -1 190 -205 -75 -261 -138 -162 -87 -78 -19 -10 17 250 144 209 -198 89 83 -103 111 148
3520 148 282 45 23 -27 -33 284 94 -77 31 -119 -196 68 -103 282 -113 54 -80 1 -95 -212 -6 57 -71
3543 -71 130 86 102 170 -76 117 -60 62 -70 94 85 -57 89 -9 -63 -344 -45 -75 50 48 331 205 -116 89
3567 89 12 279 -161 -88 200 73 -132 -43 24 -147 182 -24 101 -37 136 13 189 -113 -74 5 39 109 -142
3590 -142 -11 -167 -160 154 161 96 65 72 -166 78 184 87 -40 -16 -261 92 -53 51 161 4 1 36 89 160 -111
3615 -111 -12 -128 -329 53 -34 -89 -32 -123 13 -13 97 -70 2 -71 -4 -248 42 58 -116 10 152 153 -18 -42
3639 -42 -12 18 22 52 114 -14 -84 115 225 -26 -8 266 53 322 -143 60 164 -38 168 296 -119 84 -58
3662 -58 -37 -183 -8 34 -50 97 -130 271 -16 78 31 -12 17 185 80 172 -57 20 -2 58 -19 180 -48 67
3686F7j30j08J06J34l9r4P9j23J49P0k95K92k04J12j42P4j64R6N2J42K05l88j04
3709b13K58J0n1o5q6J50j2j27P4M2J36l0j76J11q5L48m45OJ80l26M05J02j54J63
3733B15j50j05N5j30L9l46N51j13j87L65j30n1p7L1l0pK44k04J35j35j11P5j8
3756h4K00m3M2J01k48J28J67j90j53J34j78M2J15J65l91P8J56j53J2L9Q9P3l41
3779b40L26o5K29j36k54L29k85j6K7R3J7j0j4R9R2j88j71m9K72Pj02j02N7J80
3803I6k36J20L28m71Q9m0K03j39mO7Q5m8j13J0L5q4j48J80K13k22M4J69j11j25
3827a02k62M07lo6M7K7L8n57O37j45k29J89K77j90J20j76k21n6K79K28k56j41
3849a55J37k06K82J09k20J59Q8n4M0Jn0j85j30J03qP5k39J88K83k72J27o1O7k56
$$ plain form
3686 67 -63 -171 -65 69 30 -64 15 -108 41 111 -184 108 -96 16 -126 -52 -216 -120 -68 74 279 -109 -213
3709 -213 45 55 4 -61 -147 3 -9 -136 -62 -20 116 86 -90 21 -64 284 -161 -155 25 -301 104 206 52 215
3733 215 65 -40 15 -115 -76 -422 129 16 -171 194 64 13 -64 -33 -63 -70 174 -30 105 -30 -141 -66 -84
3756 -84 116 73 115 216 -32 96 263 73 -80 54 -124 -82 33 198 -193 -115 41 -112 -100 -61 28 101 -240
3779 -240 86 21 250 114 -140 189 -96 -112 -85 8 25 15 1 100 192 4 -167 -216 56 63 -39 -141 -84 96
3803 96 -140 -20 308 -163 -74 -114 89 -50 -54 13 98 50 -63 -53 -18 -102 -250 -70 143 -79 -35 134 23 -102
3827 -102 -364 43 40 -26 21 48 86 -471 166 21 -208 -19 258 68 188 12 -209 -265 14 242 -14 -155
3849 -155 -18 -224 58 167 -53 106 194 140 180 181 131 -54 -184 -81 -89 -14 -253 -65 218 -54 73 12 79 -177
3873a77N9L73m12L42J15q6l52J35N9O1k45L67k16oR6L0n2j51j88K39j10J8O8P
3897b6N0k85J65J71J09k31N6K61l73K46ll03J18O1P7l01J41m4K25j21j36o7J31
3920g9k5K3L17j80k8r8Q7k35L36j87K5p8L4J6J38J14q8n5O3k8k08J20j80K22N3
3945G9q6J80j07L0k69K80j52k3M21j65l00N7J70l95L21j83K57j1L5j29r9J0n0
3968a29J43j27n6K36j20n8Q6j16Q6L9O6j08L2q2R5j10J35j09J63j02M3j23J88
3991G2j06J77l09K14j60K56j85n6J82j34p9J37Q7l38L21k83K34K8r8j7l2l6K04
4014G9k75J58r5m1K57j98J08R7j98K12N3j78qm2K85j66m9QJ84l75K9J45l8j07
4038a55J63J32m2k5j30r8J52J18o7l21M39l5N7k83RN0p6j70L62j38K79k20J33
$$ plain form
3873 -177 -118 255 -157 185 300 214 -138 -3 56 117 -128 239 23 17 113 143 91 -60 -248 -9 -119 -101 -33 -26
3897 -26 24 -261 -96 75 184 -47 9 270 -103 143 140 -163 -45 16 93 -208 -67 -111 114 -7 -143 -210 -79
3920 -79 -104 -81 236 56 28 -70 17 -218 118 -69 -44 -122 -88 -72 66 180 92 37 100 72 -136 -16 -196 26 79
3945 79 -7 173 66 96 -173 107 -45 -68 353 188 -112 -55 115 -280 41 -142 115 104 139 10 -89 -79 -129
3968 -129 14 -113 -169 67 -53 -111 -25 -141 -55 -16 50 -58 -26 -108 -13 -123 12 -97 66 -36 7 -116 72
3991 72 -34 143 -166 48 -112 144 -41 -97 85 -49 -128 9 96 -242 79 -204 30 58 -40 -57 -89 -125 79
4014 79 -196 -38 -133 -174 83 -115 -7 90 -108 104 157 -21 -29 -71 214 48 -1 7 191 -184 -155 -10 -48 -155
4038 -155 8 140 98 73 -57 -155 -3 115 48 -273 166 131 188 -95 -86 -36 -112 -282 80 -58 221 1 134
4061A34m2N0l15N6l7J65m6j0P0l06O34l76J63j91O3L2J50l06m5P1j88J82K5J27
4085F0%j1l2k0K2Q6p1J25l50J11N2J27M7j18N9k76p1K12j9j10L15j26j81J85K55
4110B71l02K07p4l02R3J61J26j80k01J96qk64L32o8j6o2J19k4j31J47j83M71k54
4133E4j34k7L44j21l48L31k18J84R4l3j9Q5k5k15j8J65m5O0n8j28J19j93J7L72
4157B43l15R2mj63L87k96K2J00J38m43L53k86K92j39J3l4J73k55p1M85k18j95
4179a21K63O4k73M9K38l93L36k33J63k14J26j92J5L09j68p4k31M06J83n1m54K07
4201d5qK85k23m3J95r4j47J96r7M8J87m30j6KM6P4N4n8J4J01N3l09L22J73j13
4226A67n5m9K23n23L42O7j18l6j74K48o3j76K62j09j33j75O08n45K20J10k2L7
$$ plain form
4061 134 92 142 -173 -117 -154 11 -35 -45 25 -281 353 -23 140 -51 12 44 194 -112 -157 -86 -274 -92 -67 60
4085 60 60 49 17 -3 19 105 34 159 -191 -80 -28 99 146 28 87 -189 -260 -48 -67 -177 138 12 -169 16 271
4110 271 -31 176 102 -200 -107 54 180 0 -201 -5 -13 -277 55 -13 -29 -91 28 4 -127 20 -163 308 54
4133 54 -80 -107 237 116 -232 99 -119 65 159 126 107 192 167 -48 -66 99 54 114 56 -72 47 -146 -129 243
4157 243 -72 20 16 -147 240 -56 -34 66 204 -239 114 -172 120 -19 -6 -40 133 -122 -193 292 74 -121
4179 -121 142 206 -67 -18 220 -173 163 -70 93 -121 5 -187 -172 137 -31 -105 -336 70 253 202 -252 -45
4201 -45 -53 232 9 -34 161 67 -80 116 19 67 254 -176 -192 -190 -144 -70 -16 -74 -60 41 94 -215 107 280 167
4226 167 112 63 286 -237 105 172 54 18 -156 92 29 -147 115 6 -127 -302 306 -239 -19 91 69 106
4248A06k61K52n8q9K9j99K28q6K21l06Q1r2J69K61k73J18m62K57L03k94K85q6
4270A04k59K05J8j83J33k22j08K44J77J4n6j48P1K79k24J20j96M8J86j10j26j13
4292a46K8M5N6Q8l42J52K19j57j17l8L69k93J6L4J14N9K4Lj4q9M8j52L1L08q9
4317A57%k31J64j13QJ92m16M45j06p1k64L0L72j36q4J46L0Q5k56j52J00K82l6
4340A46j6j22J4M2j40K31j3j64J23j6k7j15O2p1l0L08k34J70k44K12r1Rjl50M42
$$ plain form
4248 106 -155 97 39 -50 -21 -220 8 -78 143 -163 -82 -174 -5 256 -17 101 -361 -104 199 -95 190 104
4270 104 -155 50 68 -115 18 -204 -312 -68 109 123 67 -81 -10 269 45 165 -31 17 203 93 -33 -146
4292 -146 -118 -73 -17 71 -271 -119 100 -57 -174 -212 157 -136 -120 -86 28 87 111 114 100 11 59 -93 -62 246 157
4317 157 157 -74 90 -23 -15 177 -239 206 100 29 -235 -205 167 31 -53 93 123 208 -48 -200 -100 182 146
4340 146 130 8 22 64 -76 155 142 -22 101 85 58 -57 5 -66 -96 212 -22 148 -96 116 25 34 33 -317 125
$$ [...]
8191D2
##END NTUPLES=NMR FID
##END=
