##TITLE=1H_SR-167-R2_TFA
 CDCl3
 8 sc, 
 21.12.2023
##JCAMPDX= 6.0         $$ Bruker NMR JCAMP-DX V2.0
##DATA TYPE= NMR FID
##DATA CLASS= NTUPLES
##ORIGIN= UXNMR, Bruker Analytische Messtechnik GmbH
##OWNER= root
$$ XWIN-NMR		Version 3.5
$$ Thu Dec 21 12:48:41 2023 Russian Standard Time (UT+4h)  she@DPX200
##.OBSERVE FREQUENCY= 200.1313
##.OBSERVE NUCLEUS= ^1H
##.DELAY= (6, 6)
##.ACQUISITION MODE= SIMULTANEOUS
##.ACQUISITION SCHEME= undefined
##.AVERAGES= 8
##.DIGITISER RES= 18
##SPECTROMETER/DATA SYSTEM= spect
##.PULSE SEQUENCE= zg30
##.SOLVENT NAME= CDCl3
##.SHIFT REFERENCE= (INTERNAL, CDCl3, 0, 15.7039)
##AUDIT TRAIL= $$ (NUMBER, WHEN, WHO, WHERE, WHAT)
$$ ##TITLE= Audit trail, XWIN-NMR		Version 3.5
$$ ##JCAMPDX= 5.01
$$ ##ORIGIN= Bruker BioSpin GmbH
$$ ##OWNER= she
$$ F:/spectra/data/she/nmr/H-F/1/audita.txt
$$ ##AUDIT TRAIL=  $$ (NUMBER, WHEN, WHO, WHERE, WHAT)
(   1,<2023-12-21 12:47:39.50 +0400>,<she>,<DPX200>,
      <created by zg, POWCHK disabled, PULCHK disabled
       configuration hash MD5:
       00 E9 B6 7A A2 85 ED C7 34 08 36 98 17 FE 4E 26
       data hash MD5: 16K
       97 27 0E F9 AF 55 A8 03 0F EB 13 E9 DD 26 69 D0>)
$$ ##END=
$$ 
$$ hash MD5
$$ 84 AB 3B B9 A3 C6 92 6E 5E 52 54 0C 9E E5 1F 90
##$RELAX= 
##$RELAX= 
##$RELAX= 
##$RELAX= 
##$RELAX= 
##$RELAX= 
$$ Bruker specific parameters
$$ --------------------------
##$DU= <F:/spectra>
##$EXPNO= 1
##$NAME= <H-F>
##$PROCNO= 1
##$TYPE= <nmr>
##$USER= <she>
##$AMP= (0..31)
100 100 100 100 100 100 100 100 100 100 100 100 100 100 100 100 100 100 
100 100 100 100 100 100 100 100 100 100 100 100 100 100 
##$AQSEQ= 0
##$AQ_mod= 1
##$AUNM= <au_zg>
##$AUTOPOS= <>
##$BF1= 200.13
##$BF2= 200.13
##$BF3= 200.13
##$BF4= 200.13
##$BF5= 200.13
##$BF6= 200.13
##$BF7= 200.13
##$BF8= 200.13
##$BYTORDA= 1
##$CFDGTYP= 0
##$CFRGTYP= 5
##$CHEMSTR= <none>
##$CNST= (0..31)
1 1 145 1 1 1 1 1 1 1 1 1 1 1 1 1 1 1 1 1 1 1 1 1 1 1 1 1 1 1 1 1 
##$CPDPRG= <>
##$CPDPRG1= <>
##$CPDPRG2= <>
##$CPDPRG3= <>
##$CPDPRG4= <mlev>
##$CPDPRG5= <mlev>
##$CPDPRG6= <mlev>
##$CPDPRG7= <mlev>
##$CPDPRG8= <mlev>
##$CPDPRGB= <>
##$CPDPRGT= <>
##$D= (0..31)
0 1.2 0 0 0 0 0 0 0 0.06 0 0.03 0 0 0 0 0.0002 0 0 0 0 0 0 0 0 0 0 0 0 
0 0 0 
##$DATE= 1703148458
##$DBL= (0..7)
120 120 120 120 120 120 120 120 
##$DBP= (0..7)
150 150 150 150 150 150 150 150 
##$DBP07= 0
##$DBPNAM0= <>
##$DBPNAM1= <>
##$DBPNAM2= <>
##$DBPNAM3= <>
##$DBPNAM4= <>
##$DBPNAM5= <>
##$DBPNAM6= <>
##$DBPNAM7= <>
##$DBPOAL= (0..7)
0.5 0.5 0.5 0.5 0.5 0.5 0.5 0.5 
##$DBPOFFS= (0..7)
0 0 0 0 0 0 0 0 
##$DE= 6
##$DECBNUC= <off>
##$DECIM= 32
##$DECNUC= <off>
##$DECSTAT= 4
##$DIGMOD= 1
##$DIGTYP= 9
##$DL= (0..7)
0 120 120 120 120 120 120 120 
##$DP= (0..7)
150 150 150 150 150 150 150 150 
##$DP07= 0
##$DPNAME0= <>
##$DPNAME1= <>
##$DPNAME2= <>
##$DPNAME3= <>
##$DPNAME4= <>
##$DPNAME5= <>
##$DPNAME6= <>
##$DPNAME7= <>
##$DPOAL= (0..7)
0.5 0.5 0.5 0.5 0.5 0.5 0.5 0.5 
##$DPOFFS= (0..7)
0 0 0 0 0 0 0 0 
##$DQDMODE= 0
##$DR= 18
##$DS= 0
##$DSLIST= <SSSSSSSSSSSSSSS>
$$ [...]
##$SUBNAM2= <"">
##$SUBNAM3= <"">
##$SUBNAM4= <"">
##$SUBNAM5= <"">
##$SUBNAM6= <"">
##$SUBNAM7= <"">
##$SUBNAM8= <"">
##$SUBNAM9= <"">
##$SW= 18.0517328524113
##$SWIBOX= (0..15)
0 0 2 0 0 0 0 0 0 0 0 0 0 0 0 0 
##$SW_h= 3612.71676300578
##$TD= 16384
##$TD0= 1
##$TE= 0
##$TE2= 300
##$TE3= 300
##$TEG= 300
##$TL= (0..7)
0 120 120 120 120 120 120 120 
##$TP= (0..7)
150 150 150 150 150 150 150 150 
##$TP07= 0
##$TPNAME0= <>
##$TPNAME1= <>
##$TPNAME2= <>
##$TPNAME3= <>
##$TPNAME4= <>
##$TPNAME5= <>
##$TPNAME6= <>
##$TPNAME7= <>
##$TPOAL= (0..7)
0.5 0.5 0.5 0.5 0.5 0.5 0.5 0.5 
##$TPOFFS= (0..7)
0 0 0 0 0 0 0 0 
##$TUNHIN= 0
##$TUNHOUT= 0
##$TUNXOUT= 0
##$USERA1= <user>
##$USERA2= <user>
##$USERA3= <user>
##$USERA4= <user>
##$USERA5= <user>
##$V9= 5
##$VALIST= <valist>
##$VCLIST= <CCCCCCCCCCCCCCC>
##$VD= 0
##$VDLIST= <DDDDDDDDDDDDDDD>
##$VPLIST= <PPPPPPPPPPPPPPP>
##$VTLIST= <TTTTTTTTTTTTTTT>
##$WBST= 1024
##$WBSW= 4
##$XGAIN= (0..3)
0 0 0 0 
##$XL= 0
##$YL= 0
##$YMAX_a= 134483
##$YMIN_a= -118779
##$ZGOPTNS= <>
##$ZL1= 120
##$ZL2= 120
##$ZL3= 120
##$ZL4= 120
##$ABSF1= 10
##$ABSF2= 0
##$ABSG= 5
##$ABSL= 3
##$ALPHA= 0
##$AQORDER= 0
##$ASSFAC= 0
##$ASSFACI= 0
##$ASSFACX= 0
##$ASSWID= 0
##$AUNMP= <proc_1d>
##$AZFE= 0.1
##$AZFW= 0.1
##$BCFW= 1
##$BC_mod= 2
##$BYTORDP= 1
##$COROFFS= 0
##$CY= 11.3945322036743
##$DATMOD= 1
##$DC= 2
##$DFILT= <>
##$DTYPP= 0
##$F1P= 15.7292609196834
##$F2P= 12.9074282941183
##$FCOR= 0.5
##$FTSIZE= 0
##$FT_mod= 4
##$GAMMA= 1
##$GB= 0.15
##$INTBC= 1
##$INTSCL= 1
##$ISEN= 128
##$LB= 0.24
##$LEV0= 0
##$LPBIN= 0
##$MAXI= 10000
##$MC2= 0
##$MEAN= 0
##$ME_mod= 0
##$MI= 1.114404
##$NCOEF= 0
##$NC_proc= 0
##$NLEV= 6
##$NOISF1= 3.799351
##$NOISF2= 2.8
##$NSP= 1
##$NTH_PI= 0
##$NZP= 0
##$OFFSET= 15.70392
##$PC= 1
##$PHC0= -24589.95
##$PHC1= 8.85273
##$PH_mod= 1
##$PKNL= yes
##$PPARMOD= 0
##$PSCAL= 0
##$PSIGN= 0
##$REVERSE= no
##$SF= 200.130013532006
##$SI= 16384
##$SIGF1= 3
##$SIGF2= 2
##$SINO= 400
##$SIOLD= 16384
##$SREGLST= <1H.CDCl3>
##$SSB= 0
##$STSI= 0
##$STSR= 0
##$SW_p= 3612.71676300578
##$SYMM= 0
##$S_DEV= 0
##$TDeff= 0
##$TDoff= 0
##$TI= <>
##$TILT= no
##$TM1= 0
##$TM2= 0
##$TOPLEV= 0
##$USERP1= <user>
##$USERP2= <user>
##$USERP3= <user>
##$USERP4= <user>
##$USERP5= <user>
##$WDW= 1
##$XDIM= 8192
##$YMAX_p= 0
##$YMIN_p= 0
$$ End of Bruker specific parameters
$$ ---------------------------------
##NTUPLES= NMR FID
##VAR_NAME=  TIME,          FID/REAL,        FID/IMAG
##SYMBOL=    X,             R,               I
##VAR_TYPE=  INDEPENDENT,   DEPENDENT,       DEPENDENT
##VAR_FORM=  AFFN,          ASDF,            ASDF
##VAR_DIM=   8192,          8192,            8192
##UNITS=     SECONDS,       ARBITRARY UNITS, ARBITRARY UNITS
##FACTOR=    0.0002768,     1,               1
##FIRST=     0,             0,               0
##LAST=      2.2672688,     0,               0
##MIN=       0,             -118779,         0
##MAX=       2.2672688,     134483,          0
$$ Real data points
##PAGE= N=1
##DATA TABLE= (X++(R..R)), XYDATA
$$ plain form
0 0 0 0 0 0 0 0 0 0 0 0 0 0 0 0 0 0 0 0 7 -8 8 -8 8 -8 14 -16 16 -20 23 -24 29 -32 38 -44 47 -53 59 -67 75 -83
40 -83 93 -104 115 -126 140 -153 170 -188 206 -228 250 -277 306 -338 372 -413 457 -512 573 -648
60 -648 736 -848 987 -1172 1432 -1819 2446 -3658 6817 -32219 -55763 34151 25049 18977 98692
75 98692 85606 -5770 65090 134483 16806 -42693 47086 16915 -88089 -59228 -24769 -90707
87 -90707 -91684 -24752 -6640 -2434 3875 -10487 36335 94361 35048 -8054 67721 60839 -42585
100 -42585 -19823 50290 -13754 -63246 -1146 11848 -31012 -20113 -8971 -20794 7297 19578
112 19578 -10135 6887 28940 -3286 15070 67279 19812 -29189 26329 35442 -37524 -33576
124 -33576 2861 -38910 -55209 -6211 -8733 -35668 -6048 19998 22475 42085 33134 4589 35426
$$ packed form
0@%%%%%%%%%%%%%%%%%%Pj5J6j6J6j6K2l0L2l6M3m7N3o1P0q2R1j00J12j26J42j58
40h3J76j97K19k41K66k93L23l58L94m34M78n27N83o44P10p85Q70r69J085j221
60f48J384j584J835k159K604l251M265o104J0475l9036k3544Q9914r102o072P9715
75I8692j3086r1376P0860O9393j17677n9499Q9779l0171j05004K8861L4459o5938
87i0707r77O6932J8112M206O309j4362M6822N8026n9313m3102P5775o882j03424
100d2585K2762P0113o4044m9492O2100J2994m2860J0899J1142j1823K8091J2281
112A9578k9713J7022K2053l2226J8356N2209m7467m9001N5518R113p2966L948
124c3576L6437m1771j6299M8998k522k6935K9620K6046K477J9610q951k8545L0837
$$ plain form
137 35426 53627 -2714 -16353 24851 -3655 -46679 -10232 6170 -37108 -30921 6257 -6188
149 -6188 -17568 -157 -3779 -5670 13698 5640 -5419 19582 19894 -7684 11369 31808 -2434
162 -2434 -13105 16533 3712 -24776 -7291 1276 -19857 -11355 7048 -2187 -1283 10732 2512
175 2512 1953 15890 244 -15419 1733 -482 -25063 -13750 4526 -12409 -13297 12579 10778
188 10778 -2106 12134 19926 9436 10686 11622 -390 290 3298 -10398 -11915 -1242 -11453 -20387
202 -20387 -5635 -3439 -17499 -8257 5307 -2517 -2905 10019 10489 7816 15639 15849 10506 13034 9056
217 9056 -1473 -624 -2590 -16280 -17042 -9613 -16762 -20162 -6549 -1673 -6093 3155 13242 10712 11492
232 11492 16499 13015 9243 10110 3697 -2226 -1096 -5679 -13271 -9089 -7093 -14319 -12060 -3560 -4682
$$ packed form
137C5426J8201n6341j3639M1204k8506m3024L6447J6402m3278O187L7178j2445
149f188j1380J7411l622j891J9368q058j1059K5001L12k7578J9053K0439l4242
162b434j0671K9638j2821k8488J7485Q567k1133Q502J8403r235R04J2015q220
175B512n59J3937j5646j5663J7152k215k4581J1313J8276j6935q88K5876j801
188A0778j2884J4240P792j0490J250R36j2012O80L008j3696j517J0673j0211q934
202b0387J4752K196j4060R242J3564p824l88J2924M70k673P823K10n343K528l978
217I056j0529Q49j966j3690p62P429p149l400J3613M876m420R248J0087k530P80
232A1492N007l484l772Q67o413n923J130m583p592M182J996p226K259Q500j122
$$ plain form
247 -4682 -6265 1867 6304 4163 8153 12482 10420 9665 9973 6857 3789 1376 -4551 -7704 -7163 -10610
263 -10610 -14025 -10454 -7581 -8448 -5122 1700 3894 4874 8717 10706 10399 9698 7425 5435 3830 -40
279 -40 -4177 -4629 -5914 -9863 -9471 -6294 -6330 -7078 -3301 521 1633 3497 5741 6012 7012 7513 5472
296 5472 3827 3274 802 -1199 -1579 -3227 -5934 -5912 -4072 -4371 -4383 -3231 -1317 633 2165 2659 2460
313 2460 3985 5969 5077 2923 1868 1657 722 -1186 -2711 -3314 -3657 -4064 -2760 -1515 -996 -407 1855
330 1855 3690 3616 3042 2928 2633 1167 -445 -1698 -1656 -2107 -2998 -3215 -1593 -316 -31 1173 1994 2681
348 2681 2569 2511 1944 1007 850 1490 832 -1468 -2197 -760 -682 -1975 -2262 -2232 -2856 -2855 -1494 -939 78 1769
368 1769 2912 4699 5325 4198 3264 4725 4071 -26 -3186 -3472 -4877 -6492 -6666 -5202 -4764 -3088 -1023
$$ packed form
247d682j583Q132M437k141L990M329k062p55L08l116l068k413n927l153N41l447
263a0610l415L571K873q67L326O822K194R80L843J989l07p01k273j990j605l870
279d0m137m52j285l949L92L177l6p48L777L822J112J864K244K71J000N01k041
296E472j645n53k472k001l80j648k707K2J840k99j2J152J914J950J532M94j99
313B460J525J984q92k154j055k11r35j908j525o03l43m07J304J245N19N89K262
330A855J835p4n74j14k95j466j612j253M2m51q91k17J622J277K85J204Q21O87
348B681j12n8n67r37j57O40o58k300p29J437P8j293k87L0o24JJ361N55J017J691
368A769J143J787O26j127r34J461o54m097l160k86j405j615j74J464M38J676K065
$$ plain form
385 -1023 515 2650 4056 4406 4860 5455 4008 2205 1842 1732 333 -228 -979 -2381 -2992 -3545 -3458 -3597
403 -3597 -3436 -4099 -3561 -1975 -818 -45 2214 3972 4641 5404 5378 3542 2436 2262 -194 -2582 -3231 -4148
421 -4148 -5747 -4101 -2481 -2603 -1315 1247 1740 1783 3270 2960 1548 1975 1981 -587 -914 -241 -1495 -1639
439 -1639 -78 -681 -2431 -1776 -1086 -2009 -1653 -27 -1067 0 2193 2235 2095 3722 3780 2462 2687 2148
457 2148 -989 -2071 -1850 -3568 -4713 -3480 -3900 -3747 -960 406 26 1473 3202 2333 2102 2816 1268
474 1268 240 1885 1099 -722 32 1408 -380 -280 704 -683 -1826 -679 -1131 -2966 -1865 -978 -2161
491 -2161 -901 1116 379 172 2614 2429 734 1518 1211 -296 224 697 -1058 -372 1340 786 163 1833
509 1833 1604 -138 284 81 -1899 -2044 -1578 -2917 -2888 -384 -678 -1107 936 1865 1402 2611 3199 908
$$ packed form
385a023J538K135J406L50M54N95j447j803l63j10j399n61p51j402o11n53Q7j39
403c597J61o63N38J586J157P73K259J758O69P63k6j836j106j74k456k388o49r17
421d148j599J646J620j22J288K562M93M3J487l10j412M27Ok568l27O73j254j44
439a639J561o03j750O55O90r23L56J626j040J067K193M2j40J627N8j318K25n39
457B148l137j082K21j718j145J233m20J53K787J366l80J447J729q69k31P14j548
474A268j028J645p86j821P54J376j788J00R84j387j143J147m52j835J101Q87j183
491b161J260K017p37k07K442j85j695P84l07j507N20M73j755O86J712n54o23J670
509A833k29j742M22k03j980j45M66j339K9K504k94m29K043R29m63J209N88k291
$$ plain form
527 908 1166 2380 491 -724 645 -58 -1756 -95 399 -2058 -1603 263 -1338 -2091 34 -1137 -2146
544 -2146 690 1540 -516 1064 3294 1754 1414 2755 1123 -870 -16 -447 -2944 -2131 -1164 -2673 -1879
561 -1879 644 44 -201 1590 2296 1215 1914 1959 -159 59 1024 -462 -1501 -135 -1086 -2154 -270
578 -270 -390 -1945 -1312 -321 -1059 -35 869 -154 517 2371 1929 1019 2444 2719 916 1132 969 -1533
596 -1533 -1669 -1000 -2573 -3411 -1667 -2040 -2680 -297 801 -376 1265 2515 1399 1432 2702 1535 365
613 365 1282 921 -731 168 316 -1238 -1255 413 -1158 -2184 -555 -1426 -2232 -293 -259 -1449 -174 1874
631 1874 938 672 2243 1694 803 2099 1152 -765 -387 -326 -1673 -1602 -541 -1555 -1203 653 -280 -1043
649 -1043 755 1056 -84 276 761 -548 -339 597 -164 -150 1255 662 -233 750 1075 -453 -426 286 -1203
$$ packed form
527I08K58J214j889j215J369p03j698J661M94k457M55J866j601p53K125j171j009
544b146K836Q50k056J580K230j540l40J341j632j993Q54m31k497Q13R67j509P94
561a879K523o00k45J791P06j081O99M5k118K18R65j486j039J366r51j068J884
578b70j20j555O33R91p38J024R04j023O71J854m42r10J425K75j803K16j63k502
596a533j36O69j573q38J744l73o40K383J098j177J641J250j116L3J270j167j170
613C65R17l61j652Q99J48j554j7J668j571j026J629q71q06J939L4j190J275K048
631A874r36k66J571n49q91J296r47j917L78O1j347P1J061j014L52J856r33p63
649a043J798L01j140L60M85j309K09R36p61J4J405n93q95R83L25j528K7P12j489
$$ plain form
668 -1203 -1516 -297 -1039 -1242 409 55 -412 996 1813 137 389 1171 -499 -773 129 -674 -1478 -42
686 -42 -51 -738 342 1006 45 99 828 -172 -420 358 -397 -1270 676 765 -123 640 1428 425 304 1123 -22
707 -22 -1115 84 -645 -1914 -1133 170 -866 -359 946 158 532 1519 754 102 1112 879 -652 -255
725 -255 653 -662 -576 741 351 -520 491 272 -538 -253 -65 -929 -782 6 -680 -579 892 1029 501
744 501 1065 1096 581 932 299 -709 -411 121 -919 -1225 -326 -216 -694 373 235 -386 33 637 -352 153
764 153 631 -314 -112 920 661 -349 459 1020 96 -50 273 -411 -938 -356 -1266 -1580 -144 84 -649
783 -649 -199 486 734 308 1176 619 62 527 507 -568 -322 -10 -591 -559 132 -748 -1051 -512 -226 -563 -582
804 -582 -356 -177 -42 174 139 426 998 853 629 565 504 123 154 -215 -767 -686 -384 -934 -825 -484 -396 -384 263
$$ packed form
668a203l13J219p42k03J651l54m67J408Q17j676K52P82j670k74R02q03q04J436
686d2ro87J080O64r61N4P29j000k48P78p55q73J946Q9q88P63P88j003j21Q19j145
707b2j093J199p29j269P81J303j036N07J305p88L74R87p65o52J010k33j531L97
725b55R08j315Q6J317l90q71J011k19q10K85J88q64J47P88o86J01J471J37n28
744E01N64L1n15L51o33j008K98N32j040l06Q99J10m78J067j38o21M19O04r89N05
764A53M78r45K02J032k59j010Q08N61r24j46L23o84n27N82r10l14J436K28p33
783f49M50O85K48m26Q68n57n57M65k0j075K46L12n81L2O91q80l03N39K86l37j9
804e82K26J79J35K16l5K87N72j45k24o4o1l81L1l69n52Q1L02n50J09L41Q8J2O47
$$ plain form
827 263 47 -259 235 304 399 634 376 285 184 377 113 -2 155 40 -519 -313 -628 -245 -504 -314 -181
848 -181 -287 214 232 418 389 244 395 212 194 272 -162 -242 36 -140 -113 -268 -191 86 60 95 -187 -301 -1
871 -1 177 76 -20 206 248 362 277 186 385 164 137 88 -17 85 -304 -249 -115 112 164 -37 412 297 7 29
895 29 -202 30 -290 -344 61 -40 113 194 131 658 462 201 -23 -348 -411 -264 -317 -674 -459 -197 -403 -128
917 -128 43 -213 75 457 240 221 248 385 136 256 411 160 139 377 167 48 -150 -550 -930 -768 -781 -1054
939 -1054 -1024 -250 -277 -351 806 1183 796 929 980 647 85 326 -64 -550 -308 -600 -975 -318 -355 -442 -195 319
961 319 -121 -579 256 54 -119 -45 399 608 244 771 761 549 518 -68 -553 -420 -741 -1181 -737 -510 -591 -333
983 -333 351 755 644 873 1355 663 571 412 -429 -335 -272 -635 -693 -235 -5 -209 -34 307 -7 -84 98 -158
$$ packed form
827B63k16l06M94O9R5K35k58r1j01J93k64j15J57j15n59K06l15L83k59J90J33
848a81j06N01J8J86k9j45J51j83j8P8m34q0K78j76K7j55P7K77k6L5k82j14L00
871aJ78j01r6K26M2J14q5r1J99k21k7m9j05J02l89N5J34K27N2k01M49j15k90K2
895B9k31K32l20n4M05j01J53Q1o3N27j96k61k24l25o3J47n3l57K15K62k06K75
917a28J71k56K88L82k17j9K7J37k49J20J55k51k1K38k10j19j98m00l80J62j3k73
939a054L0P74k7p4J157L77l87J33N1l33n62K41l90m86K42k92l75O57l7q7K47N14
961C19m40m58Q35k02j73P4M44K09l64N27j0k12l1n86m85J33l21m40M44K27q1K58
983c33O84M04j11K29M82o92r2j59q41R4O3l63n8M58K30k04J75L41l14p7J82k56
$$ plain form
1005 -158 -67 -198 -420 -199 170 263 221 79 744 341 12 -29 -190 -557 -339 -425 -423 -150 -122 -83 428 606 472
1028 472 482 207 -80 -333 -104 -579 -756 -435 48 -478 -155 837 371 547 545 473 80 270 132 -376 -318 102
1050 102 -253 -427 121 54 -500 32 369 -428 -148 293 -219 -390 456 261 -86 458 703 122 274 684
1070 684 -321 -721 -145 -370 -855 -639 -187 -694 -238 417 183 404 1186 870 251 549 766 -138 -119 30
1090 30 -651 -521 -615 -581 -434 -171 -49 -443 -58 255 -56 207 452 447 719 714 538 54 388 235 -91 -261
1112 -261 -369 -707 -786 -731 -949 -573 -311 -206 -385 349 781 171 739 1165 437 304 563 -89 -302 176 -177
1133 -177 -701 -331 -232 -774 -667 54 -107 -216 374 125 -176 79 642 136 298 796 62 -368 294 153
1153 153 -334 -38 -46 -609 -434 136 -278 -384 89 253 -70 473 255 -213 304 334 73 41 133 -327 -482 -108
$$ packed form
1005a58R1j31k22K21L69R3m2j42O65m03l29m1j61l67K18q6KK73K8L9N11J78j34
1028D72J0k75k87k53K29m75j77L21M83n26L23R92m66J76kp2l93J90j38n08N8M20
1050A02l55j74N48o7n54N32L37p97K80M41n12j71Q46j95l47N44K45n81J52M10
1070F84j005m00N76k25m85K16M52n07M56O55k34K21P82l16o19K98K17r04J9J49
1090C0o81J30r4L4J47K63J22l94L85L13l11K63K45nK72nj76m84L34j53l26j70
1112b61j08l38p9N5k18L76K62J05j79P34M32o10N68M26p28j33K59o52k13M78l53
1133a77n24L70R9n42J07P21j61j09N90k49l01K55N63n06J62M98p34m30O62j41
1153A53m87K96qn63J75N70m14j06M73J64l23N43k18m68N17L0k61l2R2m60j55L74
$$ plain form
1175 -108 -13 -457 -358 21 -585 86 407 113 278 642 28 -192 7 -36 -264 -198 -4 -205 107 201 -63 -33
1197 -33 246 296 -332 71 372 -319 93 7 -159 -216 -44 207 -225 244 37 8 -210 378 81 -39 359 -239
1219 -239 75 482 269 253 333 248 -58 -135 253 -427 -551 -492 -522 -528 50 97 -314 266 707 622 407 820 568
1242 568 155 414 154 -247 -114 -174 -577 -689 -195 -304 -351 25 -126 -281 -77 193 222 -82 462 228 405
1263 405 721 584 145 272 130 -169 -262 -268 -707 -753 -621 -578 -285 105 145 135 726 598 768 626 581 57 204
1286 204 91 -262 -510 -260 -557 -540 -86 89 -219 -62 454 -109 31 145 -196 254 391 252 298 405 770
1307 770 402 -139 -74 -431 -253 -591 -505 -631 -500 -276 75 192 504 472 566 688 547 342 219 37 -222
1328 -222 -366 -389 -89 -243 -181 -206 103 39 7 215 245 -31 -140 124 411 -155 -1 203 227 11 276 167
$$ packed form
1175a08R5m44R9L79o06O71L21k94J65L64o14k20J99m3k28O6J94k01L12R4k64L0
1197c3K79N0o28M03L01o91M12q6j66n7J72K51m32M69k07k9k18N88k97j20L98n98
1219b39L14M07k13j6Q0q5l06p7L88o80j24N9l0oN78M7m11N80M41q5k15M13k52
1242E68m13K59k60m01J33o0m03j12M94j09m7L76j51j55K04K70K9l04N44k34J77
1263D05L16j37m39J27j42k99r3om39m6J32M3K93L90M0j0N91j28J70j42m5n24J47
1286B04j13l53k48K50k97J7M54J75l08J57N16n63J40J14l41M50J37j39M6J07L65
1307G70l68n41O5l57J78l38Q6j26J31K24L51J17L12l2R4J22j41k05j23j82k59
1328b22j44k3L00j54O2k5L09o4l2K08L0k76j09K64K87n66J54K04K4k16K65j09
$$ plain form
1350 167 -116 -169 -376 -422 -296 3 -150 -277 -287 350 429 374 327 335 231 277 91 139 -231 -138 58 -304 -208 37
1374 37 107 226 165 231 88 288 4 -116 -161 -416 9 -263 -86 55 -60 -124 232 73 111 -68 164 287
1396 287 511 3 82 209 -64 90 132 164 393 -235 -195 -322 -437 -645 -681 -279 -39 69 132 336 390 498
1418 498 598 381 187 203 51 99 -422 -91 -214 -477 -362 -353 -210 -177 71 -44 493 136 -27 484 166 364
1440 364 289 492 166 363 287 161 -195 14 -431 -623 -411 -431 -225 -457 191 54 193 325 625 466 353
1461 353 316 -167 17 -52 -192 -637 -218 -208 -226 -270 -27 -118 -70 44 129 79 357 194 -17 113 414 8 108
1484 108 230 105 -97 148 -189 -388 -20 -372 -425 -299 135 -172 12 92 206 544 456 255 125 363 264
1505 264 -292 -32 -105 -272 -394 -116 -521 -168 -140 -87 -50 244 118 -65 13 -67 -66 -10 88 101 218 66 -53 85
$$ packed form
1350A67k83n3k07m6J26K99j53j27j0O37P9n5m7Qj04M6j86M8l70R3J96l62R6K45
1374C7P0J19o1O6j43K00k84j20m5k55M25k72J77J41j15o4L56j59L8j79K32J23
1396B87K24n08P9J27k73J54M2L2K29o28M0j27j15k08l6M02K40J08O3K04N4J08
1418D98J00k17j94J6j52M8n21L31j23k63J15RJ43L3K48j15N37l57j63N11l18J98
1440C64p5K03l26J97p6j26l56K09m45j92K12k0K06k32O48j37J39J32L00j59j13
1461C53l7m83J84o9j40m45M19J0j8m4K43r1M8J14Q5n0K78j63k11J30L01m06J00
1484A08J22j25k02K45l37j99L68l52n3J26M34l07J84Q0J14L38q8k01j30K38r9
1505B64n56K60p3j67j22K78m05L53K8N3L7K94j26j83P8q0JN6R8J3J17j52j19J38
$$ plain form
1529 85 238 173 75 148 22 -7 106 -199 -109 240 0 36 -319 -191 28 54 -8 -38 -265 -296 -88 116 78 202
1553 202 155 35 48 205 63 116 289 -172 -426 -286 -192 -627 -181 111 -160 -4 170 -64 -126 53 196 90
1575 90 365 68 162 151 -121 -80 220 148 -154 70 0 -202 12 99 -316 -225 -54 29 134 118 245 499 186
1598 186 542 87 128 -95 175 -501 -305 -106 -278 -412 14 -110 -108 345 356 197 575 297 211 75 285 171
1620 171 -235 187 -202 -204 -159 234 -220 -216 -151 -381 -384 -183 -185 -291 4 179 -5 174 313 255 306 363 111 20 -181
1645 -181 -245 -412 -302 -219 -539 -184 -205 237 156 276 254 -2 366 260 -19 337 112 -156 38 -4 -16 -26 272
1668 272 -315 -268 143 -278 -309 -182 -90 -133 190 268 -41 31 361 153 212 226 -54 -291 -142 -79 -160 -191 -111 -145
1692 -145 -168 7 22 -274 6 16 -33 31 79 -135 -77 185 -161 -183 150 69 -85 -57 54 -88 37 209 -47
$$ packed form
1529H5J53o5r8P3j26k9J13l05R0L49k40L6l55J28K19K6o2l0k27l1K08K04l8J24
1553B02m7j20J3J57j42N3J73m61k54J40R4m35M46K92k71J56J74k34o2J79J43j06
1575I0K75k97R4j1k72M1L00p2l02K24p0k02K14Q7m15R1J71Q3J05j6J27K54l13
1598A86L56m55M1k23K70o76J96J99j72j34M26j24KM53J1j59L78k78q6j36K10j14
1620A71m06M22l89kM5L93m54MO5k30lK01kj06K95J75j84J79J39n8N1N7k52r1k01
1645a81o4j67J10Q3l20L55k1M42q1J20k2k56L68j06k79L56k25k68J94m2j2j0K98
1668B72n87M7M11m21l1J27R2m3L23P8l09P2L30k08N9J4k80k37J49O3q1l1Q0l4
1692a45k3J75J5k96K80J0m9O4M8k14N8K62l46k2L33q1j54K8J11j42J25J72k56
$$ plain form
1715 -47 -155 193 -141 -76 -25 148 -43 152 -20 -2 -19 174 140 -285 -82 -98 99 -291 -91 -33 42 -277 146
1738 146 -436 1 -114 66 -214 -182 -83 141 42 -58 125 441 228 -27 117 29 -11 -62 -281 -357 -157 -168 -235
1761 -235 -248 -149 -183 -215 84 57 18 -69 161 22 -138 273 54 -144 29 202 48 55 -2 -72 -88 -119 -185 -173 -147
1786 -147 -110 -211 14 2 182 86 340 309 244 4 68 22 -132 0 -158 129 -51 -120 -197 -82 -9 -217 -174 172
1810 172 -57 -26 21 -225 -64 85 153 90 375 152 -73 236 -9 -61 -142 -153 -134 -250 -179 22 -194 93 -233
1833 -233 218 82 301 -57 167 213 284 43 -50 -46 279 123 -84 -20 14 160 -52 -7 89 249 142 62 -115
1856 -115 17 -53 -7 192 190 270 220 112 -111 31 14 -313 -26 13 -338 -280 -185 -34 16 3 -119 19 316 209
1880 209 87 133 -19 144 116 -183 33 196 -104 57 -96 -114 128 -245 -63 -181 -8 -88 -92 -82 -188 78
$$ packed form
1715d7j08L48l34O5N1J73j91J95j72J8j7J93l4m25K03j6J97l90K00N8P5l19M23
1738A46n82M37j15J80k80L2R9K24r9j00J83L16k13k55J44q8m0n1k19p6K00j1o7
1761b35j3R9l4l2K99k7l9q7K30j39j60M11k19j98J73J73j54Pn7p0j6l1o6J2K6
1786a47L7j01K25j2J80r6K54l1o5k40O4m6j54J32j58K87j80o9p7J15P3k08M3L46
1810A72k29L1M7k46J61J49O8o3K85k23k25L09k45n2q1j1J9j16P1K01k16K87l26
1833b33M51j36K19l58K24M6P1k41r3ML25j56k07O4L4J46k12M5R6J60j07q0j77
1856a15J32p0M6J99kQ0n0j08k23J42j7l27K87L9l51N8R5J51N0j3j22J38K97j07
1880B09j22M6j52J63k8k99K16J63l00J61j53j8K42l73J82j18J73q0mJ0j06K66
$$ plain form
1902 78 299 45 176 -44 145 66 135 -14 67 -182 112 -28 -121 -126 -368 -181 -6 -81 125 209 33 175 -121
1925 -121 193 204 -219 123 50 249 156 -243 271 -113 -145 -320 -137 -183 174 -133 -211 -73 -64 54 191 -30 182
1948 182 21 236 189 128 -52 -68 -200 145 48 -286 -61 -93 -97 107 105 -2 -134 111 117 231 126 136 -89 -46
1972 -46 138 -20 154 96 209 128 37 -2 -108 -61 23 173 88 103 -126 -86 51 -168 -194 -44 -104 174 -13 -54
1996 -54 -8 -143 14 -114 -41 25 173 -197 -193 -18 -337 -90 -87 -76 -37 158 7 12 168 169 313 231 82 54 -190
2021 -190 36 64 -111 183 -269 -101 -187 -51 -131 122 -62 -87 234 -70 -36 118 87 35 18 -23 -133 89 183
2044 183 -63 92 33 -53 -302 -145 -279 52 11 -13 -174 -34 393 34 -123 252 219 146 73 187 -39 -329
2066 -329 178 -43 19 21 -2 44 -221 -97 -102 -132 86 27 125 369 189 150 125 255 -152 110 38 200 132 36 -268
$$ packed form
1902G8K21k54J31k20J89p9O9j49Q1k49K94j40r3nk42J87J75p5K06Q4j76J42k96
1925a21L14J1m23L42p3J99r3l99N14l84l2j75J83m6L57l07p8J38RJ18J37k21K12
1948A82j61K15m7o1j80j6j32L45r7l34K25l2mK04kj07j32K45OJ14j05J0k25M3
1972d6J84j58J74n8J13q1r1l9j06M7Q4J50q5J5k29M0J37k19k6J50o0K78j87m1
1996e4M6j35J57j28P3O6J48l70MJ75l19K47LJ1L9J95j51NJ56JJ44q2j49k8k44
2021a90K26K8j75K94m52J68q6J36q0K53j84k5L21l04L4J54l1n2j7m1j10K22R4
2044A83k46J55n9q6k49J57j34L31m1k4j61J40M27l59j57L75l3p3p3J14k26k90
2066c29N07k21O2Kk3M6k65J24nl0K18n9R8K44j80l9k5J30m07K62p2J62o8r6l04
$$ plain form
2091 -268 -194 7 -269 335 190 49 -93 280 -128 50 -22 14 -55 254 153 91 -197 33 122 -19 40 8 -183
2114 -183 -130 -319 20 -172 21 24 -112 224 32 164 -5 -123 147 -1 -211 75 60 -76 -104 -150 107 -79
2136 -79 52 7 -55 112 -107 -11 -76 32 80 -109 130 -113 -9 115 -6 62 99 61 79 -32 94 108 116 -250
2160 -250 -67 75 -113 -35 226 -146 70 1 267 -43 159 -65 271 201 52 86 -177 282 -122 -184 -3 48
2182 48 -163 -180 237 -8 -144 254 177 -111 -46 -72 -10 53 -7 24 -31 201 -30 -60 -3 -163 262 68 -67 219
2206 219 -366 24 -159 -66 108 -33 -294 -74 40 123 -120 271 538 33 143 -159 8 11 14 -45 -63 -1 -285
2229 -285 -77 -67 131 -144 -160 -108 74 225 -58 41 104 149 131 21 91 13 -95 96 176 -68 -54 217 -144 55
2253 55 -39 52 60 27 -7 208 93 15 -186 201 73 74 73 -108 99 -145 49 -170 -75 -247 -89 -68 -29 -70 -256
$$ packed form
2091b68P4K01k76O04j45j41j42L73m08J78p2L6o9L09j01o2k88K30Q9j41N9l2j91
2114a83N3j89L39j92J93Lj36L36j92J32j69j18K70j48k10K86j5j36k8m6K57j86
2136g9J31m5o2J67k19R6o5J08M8j89K39k43J04J24j21O8L7l8J8j11J26J4Ql66
2160b50J83J42j88P8K61l72K16o9K66l10K02k24L36p0j49L4k63M59m04o2J81N1
2182D8k11j7M17k45j36L98p7k88O5k6O2O3o0L1n5K32k31l0N7j60M25j94j35K86
2206B19n85L90j83R3J74j41k61K20J14Q3k43L91K67n05J10l02J67LLn9j8O2k84
2229b85K08J0J98k75j6N2J82J51k83R9O3M5j8j10P0p8j08J91Q0k44J4K71l61J99
2253E5r4R1Ql3l4K15j15p8k01L87j28Jjj81K07k44J94k19R5j72J58K1L9m1j86
$$ plain form
2278 -256 -153 122 122 -76 83 -51 65 -44 52 115 -7 22 141 139 -111 -60 88 -114 -99 -91 54 187 278 187
2302 187 145 169 -29 87 128 35 19 -86 140 149 -54 13 -28 -141 -46 -67 121 -76 17 31 49 -42 24 -95 256
2327 256 -32 120 -112 19 329 9 -120 22 -55 -46 -42 192 169 -243 -144 -241 2 181 113 -259 13 -60 -30 6
2351 6 1 -100 -40 -52 -206 -117 -21 220 152 -65 -38 -27 -151 12 98 56 115 141 -215 18 -133 -46 -228 7 234
2376 234 88 296 55 210 92 23 71 -276 100 118 -42 -126 -246 -61 173 49 146 69 82 -20 -171 68
2398 68 31 243 233 197 341 -98 -119 -6 451 -100 10 -116 -22 46 38 -108 20 -143 105 -10 135 134 -99 201
2422 201 -353 2 33 34 89 -293 -105 -86 79 -47 73 142 53 -114 -145 -1 49 148 26 132 139 -99 -139 -58 -155
2447 -155 -11 143 19 -55 122 38 -122 -100 34 117 -17 127 249 375 231 178 62 -64 -149 257 -107 -83
$$ packed form
2278b56J03K75%j98J59j34J16j09R6O3j22K9J19kk50N1J48k02J5QJ45J33R1r1
2302A87m2K4j98J16M1r3j6j05K26Rk03O7m1j13R5k1J88j97R3J4J8r1O6j19L51
2327B56k88J52k32J31L10l20j29J42p7RMK34k3m12R9r7K43J79o8l72K72p3L0L6
2351Fnj01O0j2j54Q9R6K41o8k17K7J1j24J63Q6m2N9K6l56K33j51Q7j82K35K27
2376B34j46K08k41J55j18o9M8l47L76J8j60q4j20J85K34j24R7p7J3j02j51K39
2398F8l7K12j0l6J44m39k1J13M57n51J10j26R4O8qj46J28j63K48j15J45jk33L00
2422B01n54L55L1JN5l82J88J9J65j26J20O9q9j67l1J44N0R9j22J06Pk38m0Q1r7
2447a55J44J54j24p4J77q4j60K2J34Q3j34J44J22J26j44n3j16j26q5M06l64K4
$$ plain form
2469 -83 94 -16 59 233 48 -43 -89 -95 -119 -252 170 -26 92 -28 -329 -67 80 92 24 12 182 -161 -137 -35
2493 -35 123 -75 -120 40 -202 -117 2 -123 -78 48 -56 2 -94 155 -87 216 86 204 24 -55 -91 227 -171
2516 -171 395 -236 -274 -26 -257 -5 -273 234 37 -211 -79 134 45 7 -106 -135 236 82 0 -89 11 209
2538 209 -48 -133 37 -300 -228 -105 62 284 13 -38 12 115 -54 224 -123 197 42 -173 83 68 327 105
2560 105 -192 138 -219 -55 249 -4 -226 -55 -91 -103 13 -17 -81 -207 168 -1 40 54 -222 140 -86 -104
2582 -104 -67 -4 36 62 -172 -82 -31 -160 -17 -168 21 93 186 113 -108 112 -244 252 -131 141 -104 185 4
2605 4 150 183 213 30 0 118 73 202 152 148 118 254 103 -16 82 166 109 -88 -60 312 -68 -142 185 148 301
2630 301 -152 11 -41 -61 -363 -191 -62 29 134 55 5 -200 218 53 -175 -48 -12 38 65 25 53 21 -185 106
$$ packed form
2469h3J77j10P5J74j85r1m6ok4j33M22j96J18j20l01K62J47J2o8j2J70l43K4J02
2493c5J58j98m5J60k42Q5J19j25M5J26j04N8r6K49k42L03j30J18j80p9l6L18l98
2516a71N66o31l8K48k31K52k68N07j97k48J32K13q9l8j13k9L71j54q2q9J00J98
2538B09k57q5J70l37P2J23J67K22k71n1N0J03j69K78l47L20j55k15K56j5K59k22
2560A05k97L30l57J64L04k53k22J71l6j2J16l0o4j26L75j69M1J4k76L62k26j8
2582a04L7O3M0K6k34R0N1j29J43j51J89P2R3p3k21K20l56M96l83K72k45K89j81
2605DJ46L3L0j83l0J18m5J29n0ml0J36j51j19R8Q4n7j97K8L72l80p4L27l7J53
2630C01m53J63n2k0l02J72J29R1J05p9n0k05M18j65k28J27L6N0K7m0K8l2k06K91
$$ plain form
2654 106 -57 43 45 -145 -36 -162 -114 29 217 71 -96 31 35 -210 -2 252 81 -88 240 -51 164 -209
2676 -209 -86 -65 62 -197 0 127 -88 62 56 128 16 -8 96 -33 -67 97 -5 -67 87 -60 -114 -153 59
2699 59 -59 199 -85 -72 78 -224 -104 136 -102 -64 -64 -96 -87 60 168 -204 136 -26 154 -158 -6 -202 -19
2722 -19 139 105 -44 180 45 -80 74 89 -46 244 -170 98 193 -22 107 -239 -107 -59 -9 -16 12 -117 -122 4
2746 4 -39 -51 -256 -27 84 21 54 112 21 -99 -20 252 206 310 -38 -176 135 47 -33 -19 -192 -79 -110 102 452
2771 452 -24 -24 124 -259 185 -127 28 388 -64 -73 -150 -93 23 -22 -393 151 -170 -133 297 129 149 182 -168
2794 -168 190 -4 -102 14 189 159 129 54 28 10 -17 -198 -77 -50 -167 -383 -198 -115 -1 34 -175 137 -12
2817 -12 2 -115 176 70 -219 -163 -102 88 6 132 -267 -198 24 1 -90 -88 -133 151 34 -69 55 96 -21 6
$$ packed form
2654A06j63J00Kj90J09j26M8J43J88j46j67J27Mk45K08K54j71j69L28k91K15l73
2676b09J23K1J27k59J97J27k15J50oP2j12k4J04j29l4J64j02o2J54j47n4l9K12
2699E9j18K58k84J3J50l02J20K40k38L8%l2RJ47J08l72L40j62J80l12J52j96J83
2722a9J58l4j49K24j35j25J54J5j35K90m14K68R5k15J29l46J32M8N0pK8j29nJ26
2746Dm3j2k05K29J11o3L3N8r1j20P9K72m6J04l48j38L11q8q0J4j73J13l1K12L50
2771D52m76%J48l83M44l12J55L60m52rp7N7J16m5l71N44l21L7M30j68K0L3l50
2794a68L58j94r8J16J75l0l0p5k6j8k7j81J21K7j17k16J85Q3J14L5k09L12j49
2817a2J4j17K91j06k89N6O1J90q2J26l99O9K22k3r1Km5K84j17j03J24M1j17K7
$$ plain form
2841 6 -35 -155 65 42 244 54 -59 -13 13 -101 -52 34 -64 -78 -172 -102 -136 -74 54 69 -198 106 -129 0 185
2866 185 -67 -118 52 170 -31 193 131 71 99 -56 -41 -60 -122 100 -99 29 -54 61 250 335 144 70 -337
2889 -337 -103 75 -121 -70 107 -143 14 211 -121 87 188 23 78 -4 -120 -41 -9 54 -61 11 -72 -65 -46 -63
2913 -63 -52 18 -141 85 -2 22 -59 -43 43 -102 -1 135 137 -62 -37 224 -42 -77 -202 116 -30 144 68 115 -298
2938 -298 -91 62 -58 106 -209 72 63 38 -124 -10 -118 -109 202 232 188 157 -340 -79 363 15 4 53 -21 52
2962 52 -160 47 36 249 2 -93 16 -21 18 -204 100 -38 19 56 -148 -153 -176 96 -124 21 -91 68 123 -137
2986 -137 -170 -194 44 -13 82 -86 -275 -7 12 358 -92 236 85 95 119 -71 86 -4 -181 -115 -156 -54 -22 -93
3010 -93 -295 -100 -183 -88 -215 -211 -9 18 -17 101 39 123 -53 -13 -80 89 76 -212 158 31 304 75 78 -34 -96
$$ packed form
2841Fm1j20K20k3K02j90j13M6K6j14M9Q6r8j4r4P0l4O2J28J5k67L04k35J29J85
2866A85k52n1J70J18k01K24o2o0K8j55J5j9o2K22j99J28q3J15J89Q5j91p4m07
2889c37K34J78j96N1J77k50J57J97l32K08J01j65N5q2j16P9L2O3j15P2q3PJ9j7
2913f3J1P0j59K26q7K4q1J6Q6j45J01J36Kj99K5K61k66l5j25L18j46J74p6M7m13
2938b98K07J53j20J64l15K81rk5j62J14j08RL11L0m4l1m97K61M42l48j1M9p4P3
2962E2k12K07j1K13k47r5J09l7L9k22L04j38N7L7k04nk3K72k20J45j12J59N5k60
2986a37l3k4K38n7R5j68j89K68J9L46m50L28j51J0K4j90J57r0j77O6m1J02L2p1
3010i3k02J95q3R5j27MK02K7l5J18o2Q4j76M0o7J69j3k88L70j27K73k29Lj12o2
$$ plain form
3035 -96 -168 183 -123 29 155 -58 62 213 342 25 -75 8 115 14 36 -233 -34 32 113 34 -278 -95
3057 -95 184 -104 -91 16 298 -252 47 -54 143 -153 -179 -11 21 93 19 288 -262 -107 -130 -234 148 -1
3079 -1 34 193 201 -263 -240 -114 54 -28 270 211 75 209 30 166 169 223 -75 -81 1 -67 -18 69 -148 25 155 3
3105 3 -6 248 -34 -201 -92 26 127 -40 -81 259 -218 199 -32 -172 -101 54 -27 -128 9 99 20 72 46 -26
3129 -26 17 -121 -81 -90 -61 151 -71 -134 -51 11 -103 178 -263 -22 -119 128 26 -3 122 431 54 -251 -206 -75
3153 -75 183 -139 62 11 63 -20 -40 -68 60 233 -168 -69 -218 -92 -16 64 -201 -37 122 88 11 -75 -69 78 -352
3178 -352 -20 227 12 108 -13 211 -91 -26 118 91 62 -48 77 157 129 8 113 421 35 -100 -24 -29 20
3201 20 178 217 -101 -84 -36 -102 -107 -43 15 -307 11 51 41 46 -169 -57 168 -28 -277 -287 -98 260 -238 -102 102
$$ packed form
3035i6p2L51l06J52J26k13J20J51J29l17j00Q3J07j01K2k69J99O6Q1p9l12J83
3057i5K79k88J3J07K82n50K99j01J97k96k6J68L2P2p4K69n50J55k3j04L82j49
3079aL5J59Qm64K3J26J68q2K98n9j36J34j79J36LN4k98oQ2o8M9Q7k17J73J30j52
3105CrK54k82j67J09J18J01j67m1L40m77M17k31j40P1J55q1j01J37R0p9N2k6p2
3129b6M3j38M0rK9K12k22o3Q3O2j14K81m41K41r7K47j02k9J25L09l77l05M5J31
3153g5K58l22K01n1N2q3k0k8J28J73m01R9j49J26P6Q0k65J64J59l4p7q6OJ47m30
3178c52L32K47k15R6j21K24l02O5J44k7k9j10J25Q0k8j21J05L08l86j35P6nM9
3201B0J58L9l18J7M8o6nO4N8l22L18M0j0Nk15J12K25j96k49j0J89L58m98J36K04
$$ plain form
3226 102 -166 67 -336 -63 -251 -227 148 56 43 83 101 75 118 -13 -43 60 78 -50 -74 79 -219 69 210
3249 210 -138 -9 3 282 -31 -436 123 -56 -144 -2 -79 -108 173 -128 -78 -118 46 -116 -110 -31 -250 40 -11
3272 -11 -44 73 -133 -10 -1 -200 -88 104 18 -191 -27 41 27 78 -126 120 -110 -79 176 128 305 51 81 82
3296 82 -24 160 144 151 -23 -115 -178 -1 -219 -99 -134 -51 152 376 -110 67 193 117 79 -193 144 -148 -149 71
3320 71 -136 171 -182 129 96 123 105 -156 102 -67 135 61 264 28 8 5 -188 -27 -33 164 -235 36 -41 -239
3344 -239 -67 66 -112 83 -38 -142 -73 179 -30 -28 93 -14 72 31 -23 41 211 -182 155 131 -32 -321 -5
3367 -5 113 69 -178 -39 -163 120 147 -72 79 106 -162 -19 -108 -87 53 84 -221 -167 -145 123 82 -258 115 -96
3391 -96 287 21 248 26 -107 -121 433 -222 111 135 -118 88 -306 42 -43 -64 155 192 -27 -96 195 42
$$ packed form
3226A02k68K33m03K73j88K4L75r2j3M0J8k6M3j31l0J03J8j28k4J53k98K88J41
3249B10l48J29J2K79l13m05N59j79q8J42p7k9K81l01N0m0J64j62OP9k19K90n1
3272a1l3J17k06J23Rj99J12J92q6k09J64O8j4N1k04K46k30L1K55m8J77k54L0J
3296H2j06J84j6Pj74r2o3J77k18J20l5Q3K03K24m86J77J26p6l8k72L37k92jK20
3320G1k07L07l53L11l3K7j8k61K58j69K02p4K03k36k0lj93J61oJ97l99K71p7j98
3344b39J72J33j78J95j21j04O9K52k09KJ21j07Q6m1n4O4J70l93L37k4j63k89L16
3367eJ18m4k47J39j24K83K7k19J51K7k68J43q9K1J40L1l05N4K2K68m1l40L73k11
3391i6L83k66K27k22j33j4N54o55L33K4k53K06l94L48q5k1K19L7k19o9K91j53
$$ plain form
3413 42 -15 -30 28 -5 -216 73 130 13 1 -83 -114 54 -34 151 32 156 -16 310 -44 2 101 -119 -291 -74
3437 -74 -129 -22 -74 -205 -123 62 -156 -6 -91 -82 211 -136 2 -32 -96 -1 -37 40 -190 65 -122 56 119 -118
3461 -118 31 19 65 -37 -20 -96 87 -205 -46 -158 326 3 -177 -163 -24 142 88 266 5 125 283 38
3483 38 -65 179 3 -44 18 13 66 154 -67 -12 113 305 117 177 140 109 29 343 -89 12 136 52 96 -48 -79
3508 -79 331 -231 306 91 -64 115 399 -69 168 230 -55 -15 -119 53 -29 265 -177 148 -7 47 163 128
3530 128 -5 -44 58 150 182 -83 -164 -128 -208 364 20 -207 63 215 165 -105 -78 -137 -26 93 82 -181 -33
3553 -33 -42 -250 -112 161 22 85 140 -43 44 -37 204 105 -93 23 -353 -183 16 2 -123 151 291 -225 -34
3576 -34 -63 -60 -58 -13 155 77 177 -140 93 -48 58 -156 -147 -91 180 -119 -99 -59 322 148 144 -9 -31 52 130 -162
$$ packed form
3413D2n7j5N8l3k11K89N7j17j2q4l1J68q8J85j19J24j72L26l54M6R9k20j72K17
3437g4n5J07n2j31Q2J85k18J50q5RK93l47J38l4o4R5l6P7k30K55j87J78O3k37
3461a18J49j2M6j02J7p6J83k92J59j12M84l23j80J4J39J66n4J78k61J20J58k45
3483C8j03K44j76m7O2nN3Q8k21N5J25J92j88O0l7l1q0L14m32J01J24q4M4j44l1
3508g9M10n62N37k15j55J79K84m68K37O2k85M0j04J72q2K94m42L25j55N4J16l5
3530A28j33l9J02R2L2k65q1L6q0N72l44k27K70J52n0k70K7n9J11J19j1k63J48
3553c3rk08J38K73j39O3N5j83Q7q1K41r9j98J16l76J70J99j4j25K74J40n16J91
3576c4k9LKM5J68p8J00l17K33j41J06k14RN6K71k99K0M0L81j74mj53k2Q3P8k92
$$ plain form
3602 -162 96 -98 -99 105 -266 -99 -198 -159 -167 -98 -38 108 -118 -199 -366 52 125 48 102 -10 -70 -85 101 -93 -27
3627 -27 -192 -300 -292 67 97 -39 23 -107 136 123 83 -87 -15 119 -218 -41 -75 -42 -18 340 18 206 300 51
3651 51 187 82 -39 -1 19 269 48 83 250 -8 -84 104 11 -40 21 111 32 121 78 -87 46 134 -68 133
3675 133 -148 56 -132 22 -103 -99 -22 -79 -47 -115 155 -61 -29 -77 -69 -107 50 -13 135 -162 -173 14 -157 -122 -71
3700 -71 67 210 -10 -454 -131 169 34 -51 -220 -255 93 30 -209 61 58 50 -40 267 -59 -19 -49 -5 -182 13
3724 13 -236 -48 109 -94 -159 9 185 55 88 194 -37 25 -92 -45 22 218 -117 -32 101 58 -29 -137 206
3747 206 73 66 117 -30 -339 -47 85 -159 -39 115 -176 182 212 -247 146 200 -153 -97 -113 52 -17 -121 -283
3770 -283 19 73 -280 30 -114 157 27 -70 -56 13 48 3 -182 -68 281 45 -24 95 30 297 -111 9 333
$$ packed form
3602a62K58j94jK04l71J67r9L9qO9O0J46k26q1j67M18P3p7N4j12o0j5J86j94O6
3627b7j65j08QL59L0j36O2j30K43j3m0j70P2J34l37J77l4L3K4L58l22J88R4k49
3651E1J36j05j21L8K0K50k21L5J67k58p6J88r3n1O1R0p9Q9m3j65J33Q8k02K01
3675A33k81K04j88J54j25MP7n7L2o8K70k16L2m8Ql8J57o3J48k97j1J87j71L5N1
3700g1J38J43k20m44L23L00j35q5j69l5L48o3k39K70lqr0L07l26M0l0M4j77J95
3724A3k49J88J57k03o5J68J76j30L3J06k31O2j17M7O7J96l35Q5J33m3q7j08L43
3747B06j33pN1j47l09K92J32k44J20J54k91L58L0m59L93N4l53N6j6J65o9j04j62
3770b83L02N4l53L10j44K71j30r7J4O9L5m5j85J14L49k36o9J19o5K67m08J20L24
$$ plain form
3793 333 17 102 -166 -101 11 61 38 -8 -290 -182 57 -7 221 130 -160 4 -22 57 -222 19 -137 112 -57
3816 -57 82 204 -18 66 -98 -13 -91 -95 199 256 31 -75 53 -117 9 83 -8 24 -148 224 -16 49 16 124
3840 124 250 261 54 -46 4 54 88 47 137 13 85 -73 24 -18 -196 -267 -182 -133 183 74 10 -149 -190 9 35
3865 35 -115 -7 -50 204 21 222 7 64 125 -115 110 -90 20 -24 132 -108 -150 -129 -67 -267 122 141 108
3888 108 9 14 142 128 69 -38 -63 104 6 81 43 98 -119 19 -42 31 -85 -101 145 97 84 -43 42 12 -55 100
3914 100 -8 48 56 276 35 39 -88 -40 169 19 -96 -110 87 215 -100 -75 109 -86 -5 -317 -178 -154 -169 26
3938 26 67 175 29 62 -53 -40 -39 244 5 -16 61 163 19 -113 156 26 18 -10 154 -12 170 -101 97 -128
3962 -128 -93 -161 -113 -140 -216 107 -343 -23 -185 -132 -134 128 318 -35 47 -7 163 -128 309 -28 6 5 1 44 -198
$$ packed form
3793C33l16Q5k68O5J12N0k3m6k82J08K39o4K28r1k90J64k6P9k79K41j56K49j69
3816e7J39J22k22Q4j64Q5p8mK94N7k25j06J28j70J26P4r1L2j72L72k40O5l3J08
3840A24J26J1k07j00N0N0L4m1R0j24P2j58R7m2j78p1Q5M9L16j09o4j59m1J99K6
3865C5j50J08m3K54j83K01k15N7O1k40K25k00J10m4J56k40m2K1O2k00L89J9l3
3888A08r9NJ28j4n9j07k5J67r8P5l8N5k17J38o1P3j16j6K46m8j3j27Q5l0o7J55
3914A00j08N6QK20k41Mj27M8K09j50j15j4J97J28l15K5J84j95Q1l12J39K4j5J95
3938B6M1J08j46L3j15J3JK83k39k1P7J02j44j32K69j30qk8J64j66J82k71J98k25
3962a28L5o8M8k7p6L23m50L20j62N3kK62J90l53Q2n4J70k91M37l37L4jmM3k42
$$ plain form
3987 -198 13 -50 -14 50 -28 -47 -72 55 87 5 106 -145 142 104 33 36 -16 4 -94 -91 162 37 -105 234 53 225
4013 225 29 53 15 -149 81 135 201 -53 -110 54 113 25 -31 -90 -94 127 -13 -158 8 -159 135 -91 37 276
4037 276 -44 -116 122 172 171 66 161 -112 57 -1 145 -225 61 -59 -69 70 -111 -134 -56 118 -123 10 -70
4060 -70 155 -229 -74 -51 -79 28 -50 -114 -199 32 154 -72 28 12 -87 -351 119 39 -51 -294 -145 -7 -101 74
4084 74 17 -136 17 306 22 -34 197 85 33 50 161 -10 88 37 27 -367 -126 -5 123 -111 350 96 -211
4107 -211 -32 77 78 -51 30 106 29 -1 92 168 -54 -34 223 137 128 -126 92 18 -172 27 -179 181 -163 -48
4131 -48 -203 106 -76 -101 -195 -22 168 -16 136 -93 61 33 -24 84 -126 75 -89 58 95 9 359 58
4153 58 179 203 0 106 -81 -165 68 166 -18 -188 107 -89 -88 -455 228 146 -111 -90 31 169 -84 -47 92
$$ packed form
3987a98K11o3L6O4p8j9k5J27L2q2J01k51K87l8p1Ln2K0r8LK53j25j42L39j81J72
4013B25j96K4l8j64K30N4O6k54n7J64N9q8n6n9mK21j40j45J66j67K94k26J28K39
4037B76l20p2K38N0jj05R5k73J69n8J46l70K86j20j0J39j81k3P8J74k41J33q0
4060g0K25l84J55K3k8J07p8o4q5K31J22k26J00j6r9k64M70q0r0k43J49J38r4J75
4084G4n7j53J53K89k84n6K31j12n2J7J11j71R8n1j0l94K41J21J28k34M61k54l07
4107b11J79J09Jj29Q1P6p7l0R3P6k22K0K57q6rk54K18p4j90J99k06L60l44J15
4131d8j55L09j82k5r4J73J90j84J52k29J54k8n7J08k10K01j64J47L7q6L50l01
4153E8J21K4k03J06j87q4K33R8j84j70K95j96Jl67O83q2k57K1J21J38k53L7J39
$$ plain form
4176 92 -22 -129 39 -57 9 -398 -24 19 66 135 -53 -146 -61 49 -23 110 177 144 161 -263 -116 35 -68 33
4200 33 -11 -456 -160 -44 113 25 -234 252 53 22 -203 -409 -8 135 -222 -122 -38 -144 62 44 95 137 -157
4223 -157 13 88 -82 90 180 -111 -118 7 7 5 -65 -55 104 -37 -117 219 52 -91 -82 267 -49 -67 -53 -40 153
4248 153 103 31 103 -2 -18 134 24 -415 -195 107 -199 -46 47 75 -2 90 -34 -319 62 -88 -71 10 16 -155
4272 -155 52 -66 -78 -199 -29 8 81 50 -11 103 -133 112 -65 39 66 190 72 -29 90 -6 20 -87 213
4295 213 290 36 -23 -155 -48 -41 29 81 -139 15 39 -70 158 196 106 -45 32 -185 178 143 224 71 116 -101
4319 -101 35 218 -37 71 157 184 60 177 -168 10 -147 -34 -157 193 11 218 177 146 -202 -9 40 62
4341 62 85 141 -61 -219 278 207 190 -92 57 -258 109 -212 -48 76 -265 133 200 -118 88 -19 103 351
$$ packed form
4176I2j14j07J68r6O6m07L74M3M7O9j88r3Q5J10p2J33O7l3J7m24J47J51j03J01
4200C3m4m45K96J16J57q8k59M86j99l1k25k06M01J43l57J00Q4j06K06j8N1M2k94
4223a57J70P5j70J72R0k91pJ25%kp0J0J59j41q0L36j67j43RL49l16j8J4J3J93
4248A53n0p2P2j05j6J52j10m39K20L02l06J53R3K8p7R2j24k85L81j50J7Q1Oj71
4272a55K07j18j2j21J70L7P3l1o1J14k36K45j77J04K7J24j18j01J19r6K6j07L00
4295B13P7k54n9j32J07PP0N2k20J54K4j09K28L8r0j51P7k17L63l5Q1j53M5k17
4319a01J36J83k55J08Q6K7j24J17l45J78j57J13j23L50j82K07m1l1l48J93M9K2
4341F2K3N6k02j58M97p1j7k82J49l15L67l21J64J24l41L98O7l18K06j07J22K48
$$ plain form
4363 351 -44 -36 -5 -116 104 -6 87 29 62 31 8 -9 -65 4 -96 130 -293 -296 -213 113 91 61 229 46 101 157
4389 157 -11 101 144 -57 -84 -156 -65 -18 26 -1 76 30 -30 -79 -170 112 43 215 -63 -167 41 -306 149 -30
4413 -30 204 -2 -263 65 -11 32 188 -108 -210 -23 73 -3 2 90 112 58 -154 61 -112 -52 119 -51 77 -63
4437 -63 184 269 123 109 -176 -4 114 -66 92 -22 -91 -299 -75 25 8 -75 105 -165 197 98 -10 3 19
4460 19 -30 -303 -22 -108 -133 34 -14 104 97 88 106 27 -200 -92 58 -101 -12 -89 231 -148 108 206 -113 26 297
4485 297 105 17 3 262 -169 -91 -145 172 -23 -239 -131 -167 214 71 130 -284 -150 -82 -60 -77 90 14 -46 -47
4509 -47 -59 -114 -170 125 -120 173 97 32 -77 -29 19 -61 83 168 134 38 61 -28 60 -1 33 -51 -83 164 -55 4 169
4536 169 163 108 97 -34 281 82 -21 -161 56 62 226 60 225 176 79 237 9 80 -31 -78 155 -82 -53 43
$$ packed form
4363C51l95QL1j11K20j10R3n8L3l1k3j7n6O9j00K26m23lQ3L26k2l0J68j83N5N6
4389A57j68J12M3k01k7p2R1M7M4k7P7m6o0m9r1K82o9J72k78j04K08l47M55j79
4413c0K34k06k61L28p6M3J56k96j02J87R6p6NQ8K2n4k12K15j73O0J71j70J28j40
4437f3K47Q5j46j4k85J72J18j80J58j14o9k08K24J00j7q3J80k70L62r9j08J3J6
4460A9m9k73K81q6k5J67m8J18prJ8p9k27J08J50j59Q9p7L20l79K56R8l19J39K71
4485B97j92q8j4K59m31P8n4L17j95k16J08l6L81j43N9m14J34O8K2j7J67p6o0j
4509d7j2n5n6K95k45K93p6o5j09M8M8q0J44Q5l4r6K3q9Q8o1L4q4l2K47k19N9J65
4536A69on5j1j31L15j99j03j40K17OJ64j66J65m9r7J58k28P1j11m7K33k37K9R6
$$ plain form
4560 43 348 61 -46 112 93 112 87 -11 74 111 65 -62 94 -23 136 -200 -226 -100 19 5 18 129 -272 -88
4584 -88 104 -22 161 91 146 -101 163 318 30 76 -162 -74 -18 -54 -16 236 51 -158 111 -95 -152 19 -8
4607 -8 -15 -192 45 -111 -213 -184 239 -70 -144 -119 188 -154 -100 -43 100 -72 -154 -57 116 109 -19 188 -326 116
4631 116 -230 55 -258 9 110 -17 4 117 166 128 114 51 91 207 -17 -13 -4 197 -260 92 111 75 77 135 -14
4656 -14 163 -75 62 -68 -16 39 -29 138 -75 -124 -33 14 -73 -116 -247 154 -242 14 115 49 79 42 58 25 -80
4681 -80 138 95 -176 130 81 -159 -84 -163 -246 176 13 -120 -33 145 291 53 69 -130 -295 -23 62 55 23 -99
4705 -99 -30 -120 60 -264 156 207 -36 -143 246 259 72 -43 -42 -81 -78 -178 52 20 9 -229 -159 61 14 -44 44
4730 44 -68 -21 -35 -96 74 -22 -11 54 149 9 360 78 8 26 65 289 -55 166 217 -84 115 -34 36 -125
$$ packed form
4560D3L05k87j07J58j9J9k5r8Q5L7m6j27J56j17J59l36k6J26J19j4J3J11m01J84
4584h8J92j26J83p0N5k47K64J55k88M6k38Q8N6l6L8K52j85k09K69k06n7J71k7
4607hpj77K37j56j02K9M23l09p4K5L07l42N4N7J43j72q2R7J73pj28K07n14M42
4631A16l46K85l13K67J01j27K1J13M9l8j4o3M0J16k24MRK01m57L52J9l6KN8j49
4656a4J77k38J37j30N2N5o8J67k13m9R1M7q7m3j31M01l96K56J01o6L0l7J6l3j05
4681h0K18m3k71L06m9k40P5p9q3M22j63j33Q7J78J46k38J6j99j65K72Q5pl2j22
4705i9O9r0J80l24M20N1k43j07L89J3j87j15Jl9Lj00K30l2j1k38P0K20m7n8Q8
4730D4j12M7j4o1J70r6J1O5R5j40L51k82p0J8L9K24l44K21N1l01J99j49P0j61
$$ plain form
4754 -125 7 -29 -77 -155 25 4 151 108 -227 -202 64 -205 -33 19 -141 268 -112 16 87 246 171 -151 -69
4777 -69 75 89 53 55 -137 170 140 72 -154 -178 148 326 -52 -304 145 0 9 -161 -53 94 -98 -139 115 -173
4801 -173 -17 -134 114 -136 -39 -70 177 19 27 153 108 74 96 -43 -2 -102 -147 85 -83 -227 109 152 143 -7
4825 -7 6 -19 -238 22 116 -110 146 41 56 60 0 -126 119 52 177 222 316 161 -15 120 101 274 293 -11 217
4850 217 -192 -203 -173 140 31 -57 232 -286 -114 -238 142 73 -26 293 -9 88 -112 -105 97 28 208 242 42
4873 42 -116 210 48 -163 -215 114 53 -62 160 116 -241 72 -32 -48 132 -212 -27 83 333 92 131 49
4895 49 -114 57 31 -141 145 -54 94 -122 92 54 -22 55 -165 -176 121 72 87 33 183 94 -8 -58 151 217
4919 217 -71 -42 -10 107 47 70 20 -102 79 -133 -158 54 -77 -94 48 56 98 -184 -62 -177 124 127 116 3
$$ packed form
4754a25J32l6m8p8J80k1J47m3l35K5K66k69J72N2j60M09l80J28P1J59p5l22Q2
4777f9J44J4l6Kj92L07l0o8k26k4L26J78l78k52M49j45Rj70J08J47j92m1K54k88
4801a73J56j17K48k50R7l1K47j58QJ26m5l4K2j39M1j00m5K32j68j44L36M3rj50
4825gJ3k5k19K60R4k26K56j05J5Mo0j26K45o7J25M5R4j55j76J35j9J73J9l04K28
4850B17m09j1L0L13j09q8K89n18J72j24L80o9r9L19l02R7k00PK02o9J80L4k00
4873D2j58L26j62k11n2L29o1j15K22m4l57L13j04j6J80l44J85J10K50k41L9q2
4895D9j63J71k6j72K86j99J48k16K14l8p6P7k20j1K97m9J5n4J50q9j02n0K09O6
4919B17k88K9L2J17o0K3n0j22J81k12k5K12j31j7J42QM2k82J22j15L01Lj1j13
$$ plain form
4943 3 -251 216 27 -49 14 -90 7 -4 -168 144 132 42 -9 -16 221 -73 90 168 103 -9 -102 -193 93 6 33 97
4969 97 6 43 -84 -305 -185 -19 141 -198 -85 352 -38 -1 -229 -3 -148 287 -29 112 -99 89 -8 30
4991 30 60 24 3 30 -15 54 -18 -138 213 -347 197 -136 203 -13 -195 -28 -84 79 -242 -71 -106 25 8 148
5015 148 139 -65 -5 41 22 4 -8 -72 -94 -305 -96 -125 107 6 -34 65 123 39 -314 -7 246 -87 -110 -145 -58 -180
5041 -180 261 139 -82 -4 84 127 -45 -51 49 -335 -49 33 34 73 -146 333 -20 -48 -51 118 -58 75 -146 -334
5065 -334 -63 165 -102 -49 153 -53 -82 -120 273 2 0 -263 -221 10 129 -90 306 140 -314 37 -188 -70
5087 -70 200 177 -45 8 183 39 -12 155 -64 -152 142 104 -182 -9 -57 -33 -53 -24 178 -23 -33 45 -80 40
5111 40 -102 -153 166 117 -34 84 -30 -130 -53 75 240 44 -271 236 -25 -56 186 -237 113 -7 40 49 -55
$$ packed form
4943Ck54M67j89p6O3j04R7j1j64L12j2r0n1pK37k94J63P8o5j12r3r1K86q7K7O4
4969I7r1L7j27k21J20J66J60l39J13M37l90L7k28K26j45M35l16J41k11J88r7L8
4991C0L0l6k1K7m5O9p2j20L51n60N44l33L39k16j82J67n6J63l21J71l5J31j7J40
5015A48rk04O0M6j9j8j2o4k2k11K09k9K32j01m0R9N8q4l53L07K53l33k3l5Q7j22
5041a80M41j22k21P8Q8M3j72oJ00l84K86Q2JL9k19M79l53k8lJ69j76J33k21j88
5065c34K71K28k67N3K02k06k9l8L93k71kk63M2K31J19k19L96j66m54L51k25J18
5087g0K70k3k22N3J75j44n1J67k19q8K94l8k86J73m8K4k0K9K02k01j0P8j25J20
5111D0j42n1L19m9j51J18j14j00P7J28J65j96l15N07k61l1K42m23L50j20M7Rj04
$$ plain form
5134 -55 44 23 -126 -66 120 -107 -41 -152 81 -151 12 -15 -55 -111 95 168 144 -41 -45 -139 -89 -126 257 145 -24
5159 -24 -225 313 269 -206 113 156 -54 -41 -43 -271 41 -147 -165 -13 -141 -216 -109 21 -16 -205 -58 -54 -174 33
5183 33 -257 -37 -309 -42 44 -140 219 13 247 92 43 90 2 193 95 105 11 -89 -327 25 31 5 34 53
5207 53 119 75 -291 153 36 157 -146 119 78 -51 -37 26 89 217 -229 -64 87 33 75 214 20 -73 91
5230 91 -99 198 -150 -91 -149 -132 -131 -351 111 -31 8 175 -131 -16 -51 -98 -4 133 34 101 -2 168 -87 -83 133
5255 133 -182 -140 -15 -121 -75 43 193 93 82 -97 309 286 -163 55 11 -117 210 -135 151 168 -216 -12
5277 -12 97 143 -64 -95 7 192 110 51 12 -103 86 219 -82 -152 -195 -102 -121 39 -139 99 -91 -86 -282 77
5301 77 65 -27 -297 188 -129 14 112 -144 117 -178 175 -56 -222 59 -133 -222 14 282 -15 -219 68 -49
$$ packed form
5134e5R9k1j49O0J86k27O6j11K33k32J63k7m0n6K06P3k4j85mr4N0l7L83j12j69
5159b4k01N38m4m75L19M3k10J3kk28L12j88j8J52j28p5J07J30l7j89J47Mj20K07
5183C3k90K20k72K67Q6j84L59k06K34j55m9M7q8J91r8J0r4j00k38L52Ok6K9J9
5207E3O6m4l66M44j17J21l03K65m1j29J4O3O3J28m46J65J51n4M2J39j94r3J64
5230I1j90K97l48N9n8J7Jk20M62j42L9J67l06J15l5m7R4J37r9O7j03J70k55MK16
5255A33l15M2J25j06M6J18J50j00j1j79M06k3m49K18m4j28L27l45K86J7l84K04
5277a2J09M6k07l1J02J85q2n9l9j15J89J33l01p0m3R3j9J60j78K38j90Nj96L59
5301G7j2r2k70M85l17J43R8k56K61k95L53k31j66K81j92q9K36K68k97k04K87j17
$$ plain form
5323 -49 244 47 -24 -102 183 305 128 -85 108 -41 31 84 -209 -97 142 115 200 -172 78 -223 63 163
5345 163 206 57 144 169 76 -207 -274 -40 -53 130 -109 -85 -55 294 84 -94 161 39 -313 -17 83 159 112
5368 112 -19 -19 -68 219 -15 -173 100 137 38 4 -55 -291 -42 -187 -83 -40 71 -209 -179 -16 -45 145 132 -89
5392 -89 -24 401 -133 0 157 75 -141 129 33 -241 -295 248 -154 31 130 85 101 -25 -127 61 67 34 132 68
5416 68 -16 -71 84 54 -272 -58 135 168 162 76 -32 -342 -114 -118 11 -121 296 -9 63 91 -161 94 149 -9
5440 -9 -147 187 150 -133 1 53 -189 70 -66 369 117 24 66 -70 83 41 -169 40 -128 -60 -58 221 142 -170
5464 -170 30 -36 76 -13 38 -1 115 -13 -124 32 43 -175 -142 44 -167 -142 -17 -29 -213 53 -25 17 -102
5487 -102 -61 -114 60 -52 10 -177 26 -50 62 -67 -182 84 31 51 -15 271 -17 241 158 -86 316 239 -3
$$ packed form
5323d9K93j97p1p8K85J22j77k13J93j49P2N3k93J12K39k7Q5l72K50l01K86J00
5345A63M3j49Q7K5r3k83o7K34j3J83k39K4L0L49k10j78K55j22l52K96J00P6m7
5368A12j31%m9K87k34j58K73L7r9l4n9k36K49j45J04M3J11k80L0J63k9J90j3k21
5392h9O5M25n34J33J57q2k16K70r6k74n4N43m02J85R9m5J6j26j02J88Ol3R8o4
5416F8q4n5J55l0l26K14J93L3oq6j08l10K28mJ29j32M17l05P2K8k52K55N5j58
5440ij38L34l7k83J34N2k42K59j36M35k52r3M2j36J53m2k10K09j68O8KK79p9l12
5464a70K00o6J12q9N1l9J16j28j11J56J1k18L3J86k11K5J25j2j84K66p8M2j19
5487a02M1n3J74j12O2j87K03p6J12j29j15K66n3K0o6K86k88K58q3k44M02p7k42
$$ plain form
5510 -3 -141 -68 -84 144 -63 69 -22 158 -5 -92 -84 16 -99 39 -179 -77 129 -71 77 -224 125 91 123
5533 123 -254 -65 61 -43 174 -517 134 57 -66 15 -104 68 369 -100 -121 -19 -71 -155 158 150 -84 181
5555 181 -275 140 -49 -73 -262 15 -240 -193 177 106 -51 -81 73 -77 -161 163 -80 -162 65 -76 -187 -284
5577 -284 -37 69 41 29 95 -46 214 -41 68 323 114 -177 212 -83 -123 346 -186 -13 229 40 -89
5598 -89 -34 -171 -112 -26 -205 -234 158 -236 -56 -14 126 14 202 -68 -52 108 181 197 40 -58 -206 52 222
5621 222 16 202 143 93 -15 9 -64 87 -9 196 -98 77 201 11 -80 -168 286 -68 -106 -277 -40 270 -96
5644 -96 126 157 60 -125 96 165 -133 -95 95 22 166 117 -165 -37 107 238 126 90 242 -127 88 47 96
5667 96 -118 -57 72 18 -21 -64 156 -92 5 -318 78 -114 192 -157 -225 -111 140 -190 18 98 -17 -14 84 -168
$$ packed form
5510cj38P3j6K28k07J32r1J80j63q7QJ00j15J38k18J02K06k00J48l01L49l4L2
5533A23l77J89J26j04K17o91O51p7j23Q1j19J72L01m69k1J02n2q4L13qk34K65
5555A81m56M15j89k4j89K77k55M7L70p1j57l0J54j50q4L24k43q2K27j41j11r7
5577b84K47J06k8j2O6j41K60k55J09K55k09k91L89k95m0M69n32J73K42j89j29
5598h9N5j37N9Q6j79k9L92l94J80M2J40j12J88k70J6J60P3J6j57r8j48K58J70
5621B22k06J86n9n0j08K4p3J51r6K05k94J75J24j90r1q8M54l54l8j71K37L10l66
5644i6K22L1r7j85K21O9k98L8J90p3J44m9k82J28J44J31j12l6J52l69K15m1M9
5667I6k14O1J29n4l9m3K20k48R7l23L96j92L06l49o8J14K51l30K08Q0j15LR8k52
$$ plain form
5691 -168 123 -39 -138 -326 64 -154 249 -17 82 204 -149 -270 66 -293 66 33 11 109 -132 -63 -207 7
5713 7 38 -191 114 128 -110 26 -101 -76 128 -115 29 79 94 147 -295 88 68 374 66 212 51 61 49 -23
5737 -23 -155 -41 -95 -39 -202 159 -36 -170 -21 -19 88 49 49 -74 98 12 16 -100 92 45 34 -184 57 -316
5761 -316 -151 36 -4 -137 -99 -169 -2 -104 -51 21 -32 -268 -68 255 -81 2 -70 -134 -38 56 -98 265 -23 244
5785 244 -6 124 6 156 96 166 -61 42 -91 168 -69 115 140 23 21 -163 80 46 99 52 -48 33 -255
5808 -255 62 110 83 -76 -162 -66 135 148 233 -10 119 -142 55 56 -282 66 -18 -5 -24 -89 -15 62 189 -140 38
5833 38 -126 -210 -238 -194 -24 14 -193 -43 -206 45 169 11 -9 -75 6 -89 -14 57 -98 51 113 238 -10 280
5857 280 -66 87 100 79 21 70 106 47 -68 90 -84 -95 -222 156 152 101 -28 79 51 -132 186 -46 -21 -4
$$ packed form
5691a68K91j62r9j88L90k18M03k66R9J22l53j21L36l59L59l3k2R8k41O9j44K14
5713GL1k29L05J4k38J36j27K5K04k43J44N0J5N3m42L83k0L06l08J46j61J0j2p2
5737b3j32J14n4N6j63L61j95j34J49KJ07l9%j23J72q6Mj16J92m7j1k18K41l73
5761c16J65J87m0j33L8p0J67j02N3P2n3k36K00L23l36Q3p2o4R6R4j54L63k88K67
5785B44k50J30j18J50o0P0k27J03j33K59k37J84K5j17kj84K43l4N3m7j00Q1k88
5808b55L17M8k7j59q6R6K01J3Q5k43J29k61J97Jl38L48q4J3j9o5P4P7J27l29J78
5833C8j64q4k8M4J70L8k07J50j63K51J24j58k0o6Q1r5P5P1j55J49O2J25k48K90
5857B80l46J53J3k1n8M9L6n9j15J58j74j1j27L78mn1j29J07k8j83L18k32K5J7
$$ plain form
5881 -4 180 -284 248 138 69 84 -91 63 13 -5 48 -53 -41 -146 -97 69 94 -84 6 -209 16 327 8 -64
5905 -64 105 -61 -5 57 108 -47 -59 -286 28 -146 200 -122 -155 235 181 -144 -32 196 43 -124 -166 80 89
5928 89 -21 -58 1 -116 151 154 209 88 90 -215 -184 -85 -18 163 49 -84 230 -79 -16 62 88 -265 -286 -92 -105
5953 -105 -64 -288 -142 -19 -5 81 141 -103 -157 10 115 155 116 196 121 -99 81 -117 -86 -320 36 102 23 -61
5977 -61 80 14 -107 -10 -83 77 228 54 4 112 52 73 113 262 -98 70 -5 62 162 184 176 271 -192 -178 -165
6002 -165 -107 -77 132 21 42 3 69 9 -102 -46 97 -24 -57 -186 -229 72 100 41 177 340 -20 195 85 61
6026 61 -200 -197 59 -140 45 -121 193 180 258 101 -93 -165 51 304 -131 79 -93 134 -40 -159 268 -145
6048 -145 -68 -156 136 95 285 -48 -159 -86 -199 -230 34 -31 -12 244 -164 40 -96 3 109 -289 122 129 -134
$$ packed form
5881dJ84m64N32j10o9J5j75J54n0j8N3j01J2j05M9J66K5j78R0k15K25L11l19p2
5905f4J69j66N6O2N1j55j2k27L14j74L46l22l3L90n4l25J12K28j53j67m2K46R
5928H9j10l7N9j17K67LN5j21Kl05L1R9O7J81j14j33L14l09O3P8K6l53k1J94j3
5953a05M1k24J46J23J4Q6O0k44n4J67J05M0l9Q0p5k20J80j98L1k34L56O6p9q4
5977f1J41o6j21R7p3J60J51j74n0J08o0K1M0J49l60J68p5O7J00K2qR5m63J4J3
6002a65N8L0K09j11K1l9O6o0j11N6J43j21l3j29m3L01K8n9J36J63l60K15j10k4
6026F1k61LK56j99J85j66L14j3P8j57j94p2K16K53m35K10j72K27j74j19M27m13
6048a45P7q8K92m1J90l33j11P3j13l1K64o5J9K56m08K04j36R9J06l98M11Pk63
$$ plain form
6071 -134 -94 -62 -97 119 51 117 -42 118 43 304 -110 363 83 -26 38 -83 60 56 1 -90 -50 45 45 12 -22 58
6097 58 177 -6 -15 -67 -315 -114 -203 85 195 -108 48 -3 -22 182 -68 -13 215 -80 -209 55 147 229 -167
6120 -167 -44 -228 -92 174 -7 -296 -257 -77 -29 233 87 54 266 -320 43 125 -106 236 139 194 81 -160
6142 -160 -199 -116 -12 -10 -14 98 36 -144 40 -13 -38 -55 -8 -65 4 -72 -224 -87 -57 -33 25 109 -157 -207 25 -122
6168 -122 -10 -235 -165 91 -19 -191 53 -14 -27 10 4 -50 -102 17 -140 -48 129 105 207 102 227 5 -259
6191 -259 -113 100 -25 -205 -35 16 -39 -19 -123 -100 94 -86 -92 -131 -112 159 67 148 44 -73 125 36 143 71
6215 71 101 -245 -80 243 -11 -87 -145 162 -12 248 -138 -12 -31 27 171 -80 -96 -23 14 -179 196 -43 -3
6238 -3 272 70 83 -212 -85 -105 -56 -70 -80 137 -68 -54 -115 -56 150 87 -96 10 -344 83 28 -53 -225 -59
$$ packed form
6071a34M0L2l5K16o8O6j59J60p5K61m14M73k80j09O4j21J43mn5r1M0R5%l3l4Q0
6097E8J19j83rn2k48K01q9K88J10l03J56n1j9K04k50N5K28k95j29K64R2Q2l96
6120a67J23j84J36K66j81k89L9J80M8K62j46l3K12n86L63Q2k31L42r7N5j13k41
6142a60l9Q3J04KmJ12o2j80J84n3k5j7M7n7O9p6j52J37L0K4N8Q4k66n0K32j47
6168a22J12k25P0K56j10j72K44o7j3L7on4n2J19j57R2J77k4J02j05J25k22k64
6191b59J46K13j25j80J70N1n5K0j04K3J94j80ol9J9K71r2Q1j04j17J98q9J07p2
6215G1L0l46J65L23k54p6n8L07j74K60l86J26j9N8J44k51j6P3L7j93L75k39M0
6238cK75k02J3k95J27k0M9j4j0K17k05J4o1N9K06o3j83J06l54M27n5q1j72J66
$$ plain form
6262 -59 -13 -146 -205 21 -79 148 -63 -361 -46 -229 54 -68 94 47 -35 29 -85 68 166 -44 37 64 66 -69
6286 -69 84 -28 -145 177 -131 64 207 21 -31 -266 106 -61 -68 89 -52 -257 -48 -16 149 -69 38 161
6308 161 149 89 -157 39 -193 -108 -20 116 -54 154 9 -13 169 -110 102 -17 173 -40 -102 -155 26 -42 -174
6331 -174 13 141 -56 231 21 -4 87 -1 -40 -102 -30 -101 174 -10 2 60 -127 -27 -29 -72 212 -106 -123 -112 32
6356 32 -112 -124 256 85 -62 181 63 -108 34 65 -109 23 -74 275 -209 86 -98 148 85 73 80 -54 214
6379 214 -97 35 -73 9 -27 -2 -33 174 -257 5 -49 -89 -120 165 -9 60 62 -63 -10 -36 6 -38 -11 -15 -37 -230
6405 -230 107 87 -44 -121 285 29 149 -150 -21 -32 202 -13 91 26 33 -230 -111 -29 66 -47 69 205 204
6428 204 -154 -57 -203 504 -88 39 40 -101 175 37 -85 -16 73 -6 92 -102 -130 -14 -103 112 -195 112 -76
$$ packed form
6262e9M6j33n9K26j00K27k11k98L15j83K83j22J62m7q2O4j14J53R8k10Q1K7Kj35
6286f9J53j12j17L22l08J95J43j86n2k35L72j67pJ57j41k05K09L2J65k18J07J23
6308A61j2o0k46J96k32Q5Q8J36j70K08j45k2J82k79K12j19J90k13o2n3J81o8j32
6331a74J87J28j97K87k10k5R1q8l9o2P2p1K75j84J2N8j87J00km3K84l18j7J1J44
6356C2j44j2L80j71j47K43j18j71J42L1j74J32r7L49m84K95j84K46o3j2Pj34K68
6379B14l11J32j08Q2l6K5l1K07m31K62n4m0l1K85j74O9Kj25N3k6M2m4K7mk2j93
6405b30L37k0j31p7M06k56J20k99J29j1K34k15J04o5Pk63J19Q2R5j13J16J36j
6428B04l58R7j46P07n92J27Jj41K76j38j22O9Q9p9R8j94k8J16q9K15l07L07j88
$$ plain form
6451 -76 153 92 -114 119 -217 -14 -46 147 43 -61 -185 81 -15 87 -66 105 50 269 -78 -341 -265 -73
6473 -73 -110 -83 84 191 126 59 25 -98 -41 70 -129 334 -77 30 36 -134 120 240 70 -40 55 18 306 9
6497 9 100 194 -121 77 -89 158 -208 -190 -242 -289 -147 -162 176 -197 104 -39 -167 -135 90 190 -220 43 85
6520 85 131 -202 115 111 -32 -44 -242 -142 -238 90 243 123 -127 -74 -195 67 -23 16 20 13 -357 5 -62 -6 121
6545 121 12 -147 -102 72 128 -18 -142 130 -103 -116 202 119 -140 342 -86 -7 -285 40 -47 238 -152 -13
6567 -13 57 -238 107 -113 -187 126 -69 -208 -46 175 -221 -47 0 72 -11 22 -24 67 -164 -140 -123 -189 106 -284
6591 -284 -189 4 372 70 -2 -6 33 70 73 126 -17 -44 115 -234 -89 -64 -109 91 -93 -40 -92 8 214 -190 -103
6616 -103 39 106 -216 59 1 36 -159 -134 27 8 -166 -49 32 37 182 12 -236 -303 -16 120 164 -17 -2 102
$$ packed form
6451g6K29o1k06K33l36K03l2J93j04j04j24K66r6J02j53J71n5K19l47k63P6J92
6473g3l7K7J67J07o5o7l4j23N7J11j99M63m11J07Oj70K54J20j70j10R5l7K88k97
6497IR1R4l15J98j66K47l66J8n2m7J42j5L38l73L01j43j28L2K25J00m10K63M2
6520H5M6l33L17mj43j2j98J00r6L28J53j20k50N3j21K62r0L9Mpl70L62o7N6J27
6545A21j09j59M5J74N6j46j24K72k33j3L18q3k59M82m28P9k78L25q7K85l90J39
6567a3P0k95L45k20p4L13j95j39J62K21l96J74M7P2q3L3m6R1k31K4J7o6K95l90
6591b84R5J93L68l02p2mL9L7LN3j43k7J59l49J45K5m5K00j84N3n2J00K06m04Q7
6616a03J42O7l22K75n8L5j95K5J61j9j74J17Q1NJ45j70k48o7K87J36M4j81J5J04
$$ plain form
6640 102 77 -22 133 97 -67 19 -301 23 22 201 -62 254 -119 -182 163 -18 -92 153 -87 42 78 63 159 -158
6664 -158 115 -220 115 107 -151 59 -95 66 83 -11 -200 -26 209 15 95 5 -33 -121 47 46 -135 -25 141
6687 141 73 -72 -111 -241 -97 -21 146 -135 29 -66 163 -57 353 326 13 -189 -4 -188 150 154 -5 -185
6709 -185 52 -231 -26 39 -221 -120 -168 -4 3 -246 -2 293 27 -107 -219 -53 107 46 -39 117 78 167 -114
6732 -114 -177 -358 1 -75 192 -55 222 200 8 -81 42 -56 -256 81 122 63 31 156 -14 -110 74 69 -59 133
6756 133 157 216 138 35 -156 -98 93 5 65 61 40 -17 -219 -8 11 -19 197 -57 -18 6 -48 -60 161 -2 186
6781 186 -207 188 318 -263 -76 6 88 -15 149 24 -97 150 46 -79 123 -229 -177 -32 67 -49 9 -63
6803 -63 -36 173 64 -103 -143 -80 139 -126 -16 20 -7 -177 2 42 335 260 10 -84 62 -26 -124 233 -162 69
$$ packed form
6640A02k5r9J55l6j64Q6l20L24jJ79k63L16l73o3L45j81p4K45k40J29L6j5R6l17
6664a58K73l35L35qk58K10j54J61J7r4j89J74K35j94Q0r0l8q8J68jj81J10J66
6687A41o8j45l9j30J44P6J67k81J64r5K29k20M10k7l13k02J85j84L38Mj59j80
6709a85K37k83K05O5k60J01m8J64Pk49K44K95k66j34j12J66J60o1q5J56l9Q9k81
6732a14o3j81L59p6K67k47K77k2j92q9J23r8k00L37M1n9l2J25j70r6J84nj28J92
6756A33K4N9p8j03j91N8J91q8O0mk1n7k02K11J9l0K16k54L9K4n4j2K21j63J88
6781A86l93L95J30n81J87Q2Q2j03J64j25j21K47j04j25K02l52N2J45R9j16N8p2
6803f3K7K09j09j67m0O3K19k65J10L6k7j70J79M0K93p5k50r4J46q8r8L57l95K31
$$ plain form
6827 69 -221 118 -107 -10 -24 -214 60 10 202 -185 -109 -24 -34 -203 3 -58 -280 -184 -96 166 77 5 -170 -299
6851 -299 -41 105 232 -1 -113 -161 166 -204 98 -89 99 -202 190 -93 22 207 170 -32 29 324 -36
6872 -36 268 -131 -77 -60 16 -93 64 2 29 23 53 211 -55 174 6 -63 -200 84 124 -137 80 -113 25 264
6896 264 225 44 -10 -147 97 20 -42 -58 188 148 -139 4 169 147 -190 -158 139 -106 -151 207 152 -8 -233
6919 -233 -248 -204 -160 254 157 220 82 -33 122 -90 122 -103 -156 145 -23 24 44 -76 13 -93 -150 -117 63 -35
6943 -35 -36 25 180 1 -31 -40 63 208 -41 -13 158 -147 54 68 11 20 95 97 -43 53 -89 -3 53 -188 -156 -248 -32
6970 -32 -180 -195 -106 54 93 78 -176 96 -91 -36 -62 60 241 36 -95 89 -127 -167 -201 -245 146 -40 169
6993 169 -264 -42 -133 -115 -48 15 -197 119 121 -18 23 -5 -124 310 276 9 -63 199 -59 97 98 -217 -111 -180
$$ packed form
6827F9k90L39k25R7j4j90K74n0J92l87P6Q5j0j69K06o1k22R6Q8K62q9p2j75j29
6851b99K58J46J27k33j12m8L27l70L02j87J88l01L92k83J15J85l7k02O1K95l60
6872c6L04l99N4J7P6j09J57o2K7oL0J58k66K29j68o9j37K84M0k61K17j93J38K39
6896B64l9j81n4j37K44p7o2j6K46m0k87J43J65k2l37L2K97k45m5L58n5j60k25
6919b33j5M4M4M14r7O3j38j15J55k12K12k25n3L01j68M7K0j20Q9j06n7L3J80r8
6943c5jO1J55j79l2rJ03J45k49K8J71l05K01J4n7RP5Kj40R6j42Q6N6k41L2r2K16
6970c2j48j5Q9J60L9j5k54K72j87N5k6J22J81k05j31J84k16m0l4m4L91j86K09
6993A69m33K22r1J8O7O3k12L16Kj39M1k8j19M34l4k67p2K62k58J56Jl15J06o9
$$ plain form
7017 -180 248 -33 -79 53 -58 -172 -70 24 -127 4 -125 -82 -100 114 34 -247 -20 226 -7 24 75 167 -258
7040 -258 -284 45 -267 41 -12 -95 -74 -128 -49 152 175 -150 119 253 -257 75 -120 -196 156 135 92 113 -172 50
7064 50 -56 27 -161 -118 247 124 -120 -68 23 -9 -138 1 -62 119 -3 -266 -57 -93 103 -43 -66 125 88
7087 88 -190 -135 259 82 32 149 73 55 111 -67 187 106 -72 -113 -435 332 -66 -20 265 165 -214 -124 72
7110 72 -57 -54 272 -155 -138 -173 -2 215 -120 -30 27 -6 -102 -119 -62 -32 27 -180 86 18 5 -31 -74 -16 -121 132
7136 132 56 -23 122 -76 49 118 52 164 216 150 -42 -34 24 156 78 62 -131 -47 -39 136 -63 40 1 146 71
7161 71 267 -144 2 -186 -153 2 204 48 13 -74 -322 164 -94 216 -78 64 -56 -145 -40 142 -75 -68
7183 -68 163 153 78 -50 172 200 83 -173 8 15 -16 134 -258 -264 102 -139 77 7 -231 -69 122 -8 135
$$ packed form
7017a80M28k81m6J32j11j14J02R4j51J31j29M3j8K14q0k81K27K46k33L1N1R2m25
7040b58k6L29l12L08n3q3K1n4P9K01K3l25K69J34n10L32j95p6L52k1m3K1k85K22
7064E0j06Q3j88M3L65j23k44N2R1l2j29J39o3J81j22k63K09l6J96j46k3J91l7
7087H8k78N5L94j77n0J17p6j8N6j78K54q1j78m1l22P67l98M6K85j00l79R0J96
7110G2j29LL26m27J7l5J71K17l35R0N7l3r6j7N7L0N9k07K66o8j3l6m3N8j05K53
7136A32p6p9J45j98J25O9o6J12N2o6j92QN8J32p8j6j93Q4QJ75j99J03l9J45p5
7161G1J96m11J46j88L3J55K02j56l5q7k48M86k58L10k94J42j20q9J05J82k17P
7183f8K31j0p5j28K22K8j17k56J81Pl1J50l92oL66k41K16p0k38J62J91j30J43
$$ plain form
7206 135 229 -111 32 125 197 71 73 -39 -1 161 275 -3 162 -311 -103 211 115 4 159 -7 -48 64 -190
7229 -190 -187 24 117 49 8 -125 -48 139 165 -56 90 52 51 -204 -107 170 -118 95 -64 -169 -68 -184 71 167
7253 167 -85 8 -5 -78 22 103 -273 151 -318 79 7 156 179 -159 -165 83 5 31 34 -123 -9 128 -109 104
7277 104 -137 95 -47 110 -8 -83 -38 -59 145 11 8 35 -118 -125 -100 -86 216 -92 -112 -15 35 -87 5 -93 -23
7302 -23 -92 -47 98 54 29 -236 -91 32 -206 -182 189 -21 -229 -59 -99 -14 -169 -30 128 72 149 -162 -110 195
7326 195 47 97 120 308 -132 -147 34 345 141 118 18 -30 80 78 107 -222 -186 -142 293 72 -197 -40 4 -45
7350 -45 2 -12 90 102 -72 269 13 -104 62 -171 -151 22 -81 59 134 -50 -38 -8 -6 -210 -51 -97 112 -78
7374 -78 15 -15 66 52 67 -196 167 -10 -26 -22 39 34 48 -104 44 7 83 138 60 89 -126 -58 -88 197 113 -175 -40
$$ packed form
7206A35R4l40J43R3P2j26Kj12L8J62J14k78J65m73K08L14r6j11J55j66m1J12k54
7229a90LK11R3o8m1j33P7J87K6k21J46l8jk55R7K77k88K13j59j05J01j16K55R6
7253A67k52R3j3p3J00Q1l76M24m69L97p2J49K3l38oK48p8K6Lj57J14J37k37K13
7277A04k41K32j42J57j18p5M5k1K04j34lK7j53pK5J4L02l08k0R7N0j22R2r8P0
7302b3o9M5J45m4k5k65J45J23k38K4L71k10k08J70m0Q5j55J39J58n6P7l11N2L05
7326A95j48N0K3J88m40j5J81L11k04k3j00m8J10kK9l29L6M4M35k21k69J57M4m9
7350d5M7j4J02J2j74L41k56j17J66k33K0J73j03J40P5j84J2L0Kk04J59m6K09j90
7374g8R3l0Q1j4J5k63L63j77j6MO1nJ4j52J48l7P6N5p8K9k15O8l0K85q4k88J35
$$ plain form
7401 -40 -116 -131 92 65 84 -93 62 -102 226 -198 104 71 -157 8 198 -99 162 -183 -3 8 -44 43 -94
7424 -94 42 61 -287 207 -195 49 358 -201 128 -6 9 197 168 63 14 -126 -122 124 -22 -167 51 276
7446 276 -60 213 224 230 -31 -9 -17 -16 330 -164 -142 -60 -81 67 -73 223 -33 79 93 -21 40 -50 -204 25 132
7471 132 -97 -240 -160 -2 147 -15 257 -119 37 -135 309 -236 249 -116 -89 -252 -20 310 207 -47 -162
7492 -162 87 -117 -26 110 -19 98 -144 -86 -28 110 139 90 155 -132 41 -110 -234 80 -334 -144 10 116
7514 116 -154 82 237 142 100 83 -133 -21 -150 -115 -90 -106 -199 -53 15 75 -49 59 235 5 112 -59 -85
7537 -85 186 91 -30 -115 -85 -48 -180 -49 50 -118 25 -70 -34 -101 269 139 -281 124 -101 -11 -187 42 107 -158
7561 -158 -153 2 -113 29 -114 -91 -66 -158 -96 94 124 -63 -104 30 146 61 4 -185 -29 -7 -82 53 -69 -119
$$ packed form
7401d0p6j5K23k7J9j77J55j64L28m24L02l3k28J65J90k97K61l45J80J1n2Q7j37
7424i4J36J9l48M94m02K44L09n59L29j34J5J88k9j05m9j40MK46j46j45K18K25
7446B76l36K73J1Ok61K2qJL46m94K2Q2k1J48j40K96k56J12J4j14O1r0j54K29J07
7471A32k29j43Q0J58J49j62K72l76J56j72M44n45M85l65K7j63K32L30j03k54j15
7492a62K49k04R1J36j29J17k42N8N8J38K9m9O5k87J73j51j24L14m14J90J54J06
7514A16k70K36J55r5m2j7k16J12j29L5K5j6r3J46O8O0j24J08J76k30J07j71k6
7537h5K71r5j21q5L0L7j32J31R9j68J43r5L6o7L70j30m20M05k25R0j76K29O5k65
7561a58NJ55j15J42j43K3K5r2O2J90L0j87m1J34J16q5n7j89J56K2p5J35j22n0
$$ plain form
7585 -119 -186 50 42 76 -47 175 -46 -174 246 -207 30 171 20 143 -59 -174 -219 -85 -186 83 -5 -71
7607 -71 -158 -8 41 37 -48 -29 126 -114 -281 -47 98 196 -24 -160 79 401 305 -89 -180 -22 47 201 -107 -252
7631 -252 68 -33 -220 113 -45 137 -89 -104 -215 81 49 3 33 -150 -11 -131 153 62 -28 -98 57 3 28
7654 28 -16 -56 32 -160 -124 -18 8 -101 -185 74 276 24 225 187 -221 58 79 -254 -192 26 -67 77 57 140
7678 140 -227 -6 58 115 -96 43 23 9 75 -88 213 54 -186 38 -66 46 95 123 -106 84 267 -73
7700 -73 -29 -54 131 100 66 -168 -3 -51 74 171 -111 26 83 267 68 -137 100 -62 231 151 -25 -172 168
7723 168 -304 -7 102 -122 -101 -155 -46 10 -156 273 -89 84 -132 -30 161 -23 -186 39 -272 -42 282
7744 282 130 -14 -52 -80 -101 33 -219 126 -48 -39 -131 -161 -130 70 178 -241 -42 -371 56 38 -100 23 -32
$$ packed form
7585a19o7K36qL4j23K22k21j28M20m53K37J41j51J23k02j15m5J34j01K69q8o6
7607g1q7J50M9mq5J9J55k40j67K34J45R8k20j36K39L22r6l94r1J58O9J54l08j45
7631b52L20j01j87L33j58J82k26j5j11K96l2m6L0j83J39j20K84r1r0p0J55n4K5
7654B8m4m0Q8j92L6J06K6j09q4K59K02k52K01l8m08K79K1l33O2K18r3J44k0Q3
7678A40l67K21O4N7k11J39k0j4O6j63L01j59k40K24j04J12M9K8k29J90J83l40
7700g3M4k5J85l1l4k34J65m8J25R7k82J37N7J84j99k05K37j62K93q0j76j47L40
7723A68m72K97J09k24K1n4J09N6j66M29l62J73k16J02J91j84j63K25l11K30L24
7744B82j52j44l8k8k1J34k52L45j74Rr2l0L1K00J08m19J99l29M27j8j38J23n5
$$ plain form
7767 -32 190 -67 -183 -284 58 182 236 -146 -5 -58 133 -55 -34 76 8 -7 79 34 148 51 12 -32 -25 -32 67
7792 67 54 18 -63 -72 -147 157 108 164 17 -47 -267 -52 5 -50 -60 -3 -250 52 -81 -97 44 -50 181 -18 -203
7817 -203 11 50 57 30 190 104 -120 -94 -32 -91 9 -22 -136 -100 -57 122 -175 43 88 115 46 297 73 -23 -84
7842 -84 98 -41 -61 42 67 -46 38 -211 -99 0 -262 -94 -54 18 -109 -213 -58 100 -64 -114 -264 1 -60
7865 -60 -90 30 -68 -198 22 78 -10 0 24 -73 142 -77 -195 -105 77 132 -218 -26 -64 211 128 8 58 -293
7889 -293 135 225 -96 22 -145 160 -24 -30 -210 -21 -55 78 -13 -169 60 -32 -36 56 81 59 -48 208 159 253
7913 253 46 163 62 45 29 50 106 159 -16 33 119 127 -129 -33 89 -17 -155 -72 18 -21 -76 -111 -99 20 62 73
7939 73 -149 68 -21 267 228 -228 40 -28 -123 -12 15 -217 -92 -333 151 222 28 -40 16 27 130 -340 68
$$ packed form
7767c2K22k57j16j01L42J24N4l82J41n3J91j88K1J10o8j5Q6m5J14r7l9m4PpR9
7792F7j3l6q1rp5L04m9N6j47o4k20K15N7n5j0N7k47L02j33j6J41r4K31j99j85
7817b03K14L9Pk7J60q6k24K6O2n9J00l1j14L6M3J79k97K18M5K7o9K51k24r6o1
7842h4J82j39k0J03K5j13Q4k49J12R9k62J68M0P2j27j04J55J58j64n0j50K65o1
7865f0l0J20r8j30K20N6q8J0K4r7K15k19j18R0J82N5l50J92l8K75q3j20N0l51
7889b93M28R0l21J18j67L05j84oj80J89l4J33r1j56K29r2mR2K5k2j07K56m9R4
7913B53k07J17j01j7j6K1N6N3j75M9Q6Qk56R6J22j06j38Q3R0l9n5l5J2J19M2J1
7939G3k22K17q9K88l9m56K68o8r5J11K7k32J25k41M84P1j94o8N6J1J03m70M08
$$ plain form
7962 68 231 44 60 16 99 -9 33 275 -55 -47 159 -133 -142 -144 -185 145 -61 -121 162 213 -93 -260 -170 78 -184
7987 -184 -3 -42 -161 -102 232 -71 -68 30 -125 9 103 25 -219 -113 -142 -28 -10 -105 11 273 -28 11 115 244
8011 244 -186 -52 -102 -115 -25 -248 5 -173 -42 23 378 116 -131 -33 184 234 -68 -260 -24 -86 264 34
8033 34 74 -169 -261 -106 -45 141 21 98 -160 -163 36 -105 117 -89 -72 2 124 -304 25 83 50 51 -67 107
8057 107 18 14 24 407 22 -184 134 162 83 176 223 32 -195 -105 148 -409 -17 212 -55 -189 -123 -90 -31 -221
8081 -221 -82 209 -49 -77 -160 -45 56 -41 -39 -92 -82 230 129 81 109 -221 -97 30 288 57 -28 66 -67 141
8105 141 267 108 36 -128 3 175 -117 -85 21 -209 204 50 97 47 17 -6 -106 0 150 -45 -56 86
8127 86 127 24 -107 216 -63 -13 -25 141 39 -284 176 -72 -181 37 -207 197 184 68 84 -46 -100 55
$$ packed form
7962F8J63j87J6m4Q3j08M2K42l30QK06k92rkm1L30k06o0K83N1l06j67R0K48k62
7987a84J81l9j19N9L34l03LR8j55J34R4p8k44J06k9J14J8r5J16K62l01L9J04J29
8011B44m30J34n0j3R0k23K53j78J31O5L55k62k47R8K17N0l02j92K36o2L50k30
8033C4M0k43r2J55O1J86j20P7k58lJ99j41K22k06J7P4J22m28L29N8l3Jj18J74
8057A07q9mJ0L83l85k06L18K8p9R3M7j91k27R0K53n57L92K29k67j34O6L3N9j90
8081b21J39K91k58k8q3J15J01r7Kn3J0L12j01m8K8l30J24J27K58k31q5R4j33K08
8105A41J26j59p2j64J31J72k92L2J06k30M13j54M7n0l0k3j00J06J50j95j1J42
8127H6M1j03j31L23k79N0j2J66j02l23M60k48j09K18k44M04j3j16J6j30n4J55
$$ plain form
8149 55 -94 221 -50 -76 -156 -261 -8 152 -4 -214 -60 118 -23 -20 168 185 -118 -90 -75 -184 -45 -51 64
8172 64 -81 -101 -74 -103 -129 -235 -131 -41 -33 82 -8 79 -28 203 -144 149 1 124 344
$$ packed form
8149E5j49L15k71k6q0j05K53J60j56k10J54J78j41LJ88J7l03K8J5j09J39oJ15
8172F4j45k0K7k9k6j06J04R0QJ15r0Q7j07K31l47K93j48J23K20
8191C44
$$ Imaginary data points
##PAGE= N=2
##DATA TABLE= (X++(I..I)), XYDATA
$$ plain form
0 0 0 0 0 0 0 0 0 0 0 0 0 0 8 -8 8 -8 10 -16 16 -24 24 -32 40 -46 53 -62 72 -80 95 -108 123 -142 160 -182
34 -182 206 -231 256 -288 323 -360 402 -446 494 -549 606 -670 739 -815 898 -990 1090 -1201
52 -1201 1322 -1462 1615 -1786 1984 -2210 2472 -2784 3156 -3610 4187 -4940 5968 -7464 9854
67 9854 -14286 25323 -116953 -118779 53427 -81501 -103444 -4565 41270 9876 41324 51975
79 51975 73090 78576 33010 18546 87712 35316 -69603 -6761 75503 -34431 -96244 -14681
91 -14681 -18792 -91818 -42696 3398 -43298 -43010 9692 12746 22646 47730 33721 39888 68016
104 68016 23690 -9542 32194 5361 -73412 -30135 24664 -51782 -85662 -2015 19541 -16696
116 -16696 10688 34886 12756 22738 34986 12999 18791 21243 -21339 -11467 32844 -12645 -59139
$$ packed form
0@%%%%%%%%%%%%Qj6J6j6J8k6L2m0M8n6P2q6R9j15J34j52J75k03K31k65L02l42
34a82L88m37M87n44O11o83P62q48R40j043J155j276J409j554J713j888K080k291
52a201K523k784L077l401L770m194M682n256N940o766P797r127J0908j3432J7318
67I854k4140L9609j42276j826J72206j34928k1943R8879M5835l1394L1448J0651
79E1975K1115N486m5566j4464O9166n2396j04919O2842Q2264j09934o1813Q1563
91a4681m111p3026M9122M6094m6696K88N2702L054R900K5084j4009O167K8128
104F8016m4326l3232M1736k6833p8773M3277N4799p6446l3880Q3647K1556l6237
116a6696K7384K4198k2130R982J2248k1987N792K452m2582R872M4311m5489m6494
$$ plain form
129 -59139 -1363 21890 -33707 -27422 9972 -19590 -27672 17622 13894 -10544 15340 28437 14854
142 14854 29566 30548 2912 13685 26103 -13407 -24118 3705 -19015 -44821 -6866 6631
154 6631 -27729 -13871 21814 6770 -1898 20421 15176 129 9407 3814 -9017 3266 -192
167 -192 -19178 479 17985 -8115 -10625 19720 10251 -10148 9825 16754 -8597 -5429 9916
180 9916 -2199 -7665 1804 -5171 -8161 1374 -8625 -17960 -1811 -937 -16244 -3600 11121 -2836
194 -2836 -1497 21537 18411 6460 17213 19648 4568 2430 2544 -9492 -12848 -11959 -20814 -19761
208 -19761 -9942 -14327 -14385 3186 6659 -1305 9789 20192 10412 8100 16808 11275 2848 4955 2104
223 2104 -5274 -4689 -6949 -13800 -10258 -8129 -14923 -11223 -1777 -4977 -4849 7972 11535 5867 12152
$$ packed form
129e9139N7776K3253n5597O285L7394k9562q082M5294l728k4438K5884J3097j3583
142A4854J4712R82k7636J0773J2418l9510j0711K7823k2720k5806L7955J3497
154F631l4360J3858L5685j5044q668K2319n245j5047R278n593j2831J2283l458
167a92j8986J9657J7506k6100k510L0345r469k0399J9973O929k5351L168J5345
180I916j2115n466R469o975k990R535r999r335J6149Q74j5307J2644J4721j3957
194b836J339K3034l126j1951J0753K435j5080k138J14j2036l356Q89q855J053
208a9761R819m385n8J7571L473p964J1094J0403r780k312Q708n533q427K107k851
223B104p378N85k260o851L542K129o794L700R446l200J28J2821L563n668O285
$$ plain form
238 12152 17841 11181 8411 10134 3723 -3219 -4410 -8907 -13495 -12406 -12748 -14489 -8182 -3136 -4356
253 -4356 717 9232 9084 7714 12610 12955 8235 7343 6549 1605 -2006 -3892 -6927 -8432 -8741 -10657
269 -10657 -9820 -6584 -6228 -4990 190 3090 3058 6846 10010 8647 7975 9053 6547 3484 1821 -985
285 -985 -4406 -6366 -7621 -8512 -7926 -7443 -7493 -4037 245 103 981 5238 7388 6354 6753 7298 4674 2048
303 2048 2208 448 -2560 -5434 -5649 -4601 -4479 -5820 -4816 -1521 741 677 896 2848 3597 3222 2666
320 2666 2741 1920 209 -358 154 -606 -2138 -2048 -576 -721 -1910 -1731 -550 -310 -136 442 773 1434 1719
339 1719 1525 1280 1079 747 -198 -1161 -2114 -2302 -2566 -2448 -1920 -930 1263 3051 3302 2939 3601 4979 4047
358 4047 1446 128 -991 -3253 -4204 -4201 -4567 -4384 -2564 -1095 -54 922 1842 2354 4305 5568 3100
$$ packed form
238A2152N689o660k770J723o411o942j191m497m588J089l42j741O307N046j220
253d356N073Q515j48j370M896L45m720q92p94m944l611j886l035j505l09j916
269a0657Q37L236L56J238N180K900l2L788L164j363o72J078k506l063j663k806
285i85l421j960j255q91N86M83n0L456M282j42Q78M257K150j034L99N45k624k626
303B048J60j760l008k874k15J048J22j341J004L295K262o4K19J952P49l75n56
320B666P5q21j711n67N12p60j532R0J472j45j189J79J181K40J74N78L31O61K85
339A719j94k45k01l32r45r63r53j88k64J18N28R90K193J788K51l63O62J378r32
358D047k601j318j119k262r51Ll66J83J820J469J041R76R20N12J951J263k468
$$ plain form
375 3100 1905 3035 2883 1531 786 872 -899 -1989 -2421 -3969 -4442 -3862 -4614 -4597 -2847 -1870 -1084 1582
393 1582 4645 6016 6519 6535 5774 4361 3379 1209 -737 -2523 -4729 -5947 -5515 -4731 -4882 -3027 -841
410 -841 -384 878 2144 2208 1969 3691 3445 2161 2227 2005 650 1154 1251 -728 -2157 -1587 -2399 -4267 -3476
429 -3476 -3136 -3475 -1675 474 510 1344 4090 4345 3898 4952 3626 562 66 -497 -3161 -4348 -3727 -4364
447 -4364 -4703 -2090 -1368 -1254 656 2222 1660 2191 3340 1866 1383 2470 2067 643 1334 947 -730
464 -730 -119 -176 -2526 -3209 -2150 -3553 -4047 -2761 -2587 -2540 97 1903 836 2311 4300 3523 2409 3061
482 3061 1763 -228 544 -64 -1968 -1270 -509 -1548 -1078 701 -64 -1505 2 80 -2191 -1862 -840
499 -840 -1989 -1611 30 -277 157 2438 1901 1389 2762 3153 777 538 1352 -140 -375 21 -1201 -1520
$$ packed form
375C100j195J130j52j352p45Q6j771j090m32j548m73N80p52J7J750R77P86K666
393A582L063J371N03J6p61j413r82k170j946j786k206j218M32P84j51J855K186
410h41M57J262J266O4k39J722k46j284O6k22j355N04R7j979j429N70q12j868P91
429c476L40l39J800K149L6Q34K746K55m47J054j326l064m96n63k664j187O21o37
447d364l39K613P22J14J910J566n62N31J149j474m83J087m03j424O91l87j677
464g30O11n7k350o83J059j403m94J286J74M7K637J806j067J475J989p77j114O52
482C061j298j991P72o08j904O98P61j039M70J779p65j441J507P8k271L29J022
499h40j149L78J641l07M34K281n37n12J373L91k376k39Q14j492k35L96j222l19
$$ plain form
517 -1520 354 -166 -2148 -1110 -139 -2029 -1941 -790 -2008 -1975 544 597 119 2467 3291 1993 2880 3932
535 3932 1083 175 1559 -759 -2647 -1649 -2084 -3661 -1683 -207 -1978 -1153 1876 1136 -155 2174
551 2174 1686 -217 1383 1570 -337 24 1230 -281 -762 1098 -103 -2124 -809 -237 -1715 -1391 -340
568 -340 -1424 -278 1976 1354 977 2683 2676 878 1683 1411 -1219 -1635 -1063 -2289 -3173 -1911 -2624 -2309
586 -2309 406 423 -459 1355 2280 1517 1573 2512 1166 798 1855 759 -637 898 21 -1476 -654 -94
604 -94 -2422 -2258 -757 -2102 -2408 -460 -588 -1199 759 2011 977 2199 3846 1838 1359 2781 1245
621 1245 -1010 -468 -690 -2535 -1791 -1058 -2916 -1676 210 -314 -1025 783 946 -104 1172 1234 -169
638 -169 349 1608 437 308 1761 632 -18 1414 275 -1506 -889 -355 -1887 -1720 -752 -1593 -1382 541
$$ packed form
517a520J874n20j982J038R71j890Q8J151j218L3K519N3m78K348Q24j298Q87J052
535C932k849r08J384k318j888R98m35j577J978J476j771Q25L029p40j291K329
551B174m88j903J600J87j907L61J206j511m81J860j201k021J315N72j478L24J051
568c40j084J146K254o22l77J706pj798Q05k72k630m16N72j226q84J262p13L15
586b309K715J7q82J814R25p63N6R39j346l68J057j096j396J535q77j497Q22N60
604i4k328J64J501j345l06J948j28o11J958J252j034J222J647k008m79J422j536
621A245k255N42k22j845P44P33j858J240J886n24p11J808J63j050J276O2j403
638a69N18J259j171j29J453j129o50J432j139j781O17N34j532J67R68q41K11J923
$$ plain form
656 541 467 121 1562 1688 543 1244 1390 -270 -233 214 -731 -1364 -140 -479 -1250 303 586 -913 -192
675 -192 640 -789 -1015 466 -591 -857 448 477 -163 1186 1883 75 771 933 -167 -772 -133 -1126
693 -1126 -2062 -873 -821 -1722 -183 967 -73 384 1359 518 61 974 378 -618 328 353 -832 -387 1222
712 1222 -146 -645 478 -457 -1118 -145 -683 -1696 -698 -400 -1233 -624 960 443 583 1823 1319 317
730 317 1022 995 -294 -315 -80 -1052 -1096 -349 -826 -1068 429 586 -673 -62 79 -202 -191 149 -583 117 1391
751 1391 370 318 1057 1101 182 786 405 -670 -701 -202 -1046 -1719 -301 -711 -617 624 752 -447 667
770 667 1615 489 62 720 535 159 349 302 -613 224 250 -390 -645 159 -377 -875 -152 -374 -662 -62 133
791 133 -76 466 929 700 1030 1229 659 -150 192 303 -543 -732 -707 -812 -827 -305 -827 -594 69 209 -319
$$ packed form
656E41p4l46J441J26j145P01J46j660L7M47r45o33J224l39p71J553K83j499P21
675a92Q32j429k26J481j057k66J305K9o40J349O97j808O96J62j100o05O39r93
693a126r36J189N2r01J539J150j040M57R75q41m57R13n96r96R46K5j185M45J609
712A222j368m99J123r35o61R73n38j013R98K98q33O09J584n17J40J240n04j002
730C17P05k7j289k1K35r72m4P47m77k42J497J57j259O11J41k81J1L40p32P00J274
751A391j021n2P39M4r19O04l81j075l1M99q44o73J418m10R4J241J28j199J114
770F67R48j126m27O58j85l76J90m7r15Q37K6o40k55Q04n36m98P23k22k88O00J95
791A33k09N42M63k29L30J99n70q09L42J11q46j89K5j05j5N22n22K33O63J40n28
$$ plain form
812 -319 162 135 392 798 512 263 178 658 443 -22 507 74 -321 -311 -787 -967 -770 -413 -672 -406 7
833 7 16 103 384 752 118 429 698 21 -337 -138 110 -134 45 -264 -404 -127 -201 -247 -604 -154 -221 -103 -94 -1
857 -1 -146 72 284 293 177 146 -60 0 -182 -38 -329 -313 -187 84 -183 -143 113 293 226 66 203 330 23
880 23 -51 -172 35 63 135 18 365 -92 198 159 169 -45 -211 -291 -214 -244 -264 25 -79 240 52 282 193 240
904 240 260 101 181 -122 372 245 126 181 359 499 251 26 -115 -283 -593 -678 -671 -1054 -643 -207 -378 58
926 58 480 482 697 925 904 639 531 499 -243 -673 -450 -438 -522 -216 -411 -568 -238 -95 -335 -578 -232 -89 -201
949 -201 137 377 630 906 799 735 820 690 245 -258 -352 -1075 -1035 -1169 -1062 -939 -685 19 107 631 722 892
971 892 777 1009 455 247 -210 -244 -356 -445 71 -234 -422 75 102 -450 -422 -69 -501 -297 -95 -264 -46 608
$$ packed form
812c19M81k7K57M06k86k49q5M80k15m65N29m33l95J0m76j80J97L57k59K66M13
833GRQ7K81L68o34L11K69o77l58J99K48k44J79l09j40K77p4m6l57M50o7J18RR3
857aj45K18K12Rj16l1k06O0j82J44k91J6J26K71k67M0K56J80o7j60J37J27l07
880B3p4j21K07K8P2j17L47m57K90l9J0k14j66q0P7l0k0K89j04L19j88K30q9M7
904B40K0j59Q0l03M94j27j19N5J78J40k48k25j41j68l10q5Pl83M11M36j71M36
926E8M22KK15K28k1k65j08l2p42m30K23J2q4L06j95j57L30J43k40k43L46J43j12
949b01L38K40K53K76j07o4Q5j30m45n03r4p23M0j34J07J23K54P04Q8N24R1J70
971H92j15K32n54k08m57l4j12q9N16l05j88M97K7n52K8L53m32K04K02j69K18O54
$$ plain form
993 608 550 399 808 845 710 33 158 -692 -819 -722 -776 -1009 -699 -135 -176 191 752 617 694 977 474 -217
1015 -217 -169 -100 -494 -216 -293 -198 -183 494 307 81 540 147 -279 -102 -214 -393 -10 -121 -341 16 535 51
1037 51 48 289 45 -303 -135 -211 -412 -233 58 -20 112 767 415 67 669 771 -184 -168 -21 -359 -942 -450
1059 -450 -486 -594 -200 14 -273 276 1102 414 259 928 624 -423 295 238 -382 -225 -253 -332 -670 -103 -275
1080 -275 -532 30 -213 -627 -135 439 60 353 806 539 495 773 419 105 260 68 -809 -588 -750 -969
1100 -969 -830 -333 -294 -294 310 405 426 622 1127 617 916 559 278 186 294 26 -631 -326 -460 -922 -509 -368
1122 -368 -587 -246 292 -83 -211 76 400 311 751 851 418 346 466 -126 -59 332 -369 -966 -318 -298 -853
1143 -853 -611 39 -163 -274 455 317 -19 822 616 80 385 683 -92 -99 122 -281 -171 35 -74 -434 -116
$$ packed form
993F08n8j51M09L7j35o77J25q50j27R7n4k33L10N64m1L67N61j35P7K83n03o91
1015b17M8O9l94K78p7R5J5O77j87k26M59l93m26J77j12j79L83j11k20L57N19m84
1037E1lK41k44l48J68p6k01J79K91p8J32O55l52l48O02J02r55J6J47l38n83M92
1059d50l6j08L94K14k87N49Q26o88j55O69l04j047P18n7o20J57k8p9l38N67j72
1080b75k57N62k43m14M92N74l79K93M53k67m4K78l54l14J55j92q77K21j62k19
1100i69J39M97L9%O04R5K1J96N05n10K99l57k81r2J08k68o57L05j34m62M13J41
1122c68k19L41N38l75j28K87L24q9M40J00m33p2J20n92O7L91p01n97O48K0n55
1143h53K42O50k02j11P29j38l36Q41k06n36L05K98p75pK21m03J10K06j09l60L18
$$ plain form
1164 -116 33 -267 171 236 -35 -127 315 166 -81 52 488 -219 -78 100 -306 -568 116 -87 -415 -121 92
1185 92 -239 -77 286 -223 172 558 211 -8 319 227 22 -11 -7 -647 -277 -69 -306 -83 252 0 110 410
1207 410 413 186 227 51 35 -302 -224 -687 -589 -221 -98 -355 294 415 156 392 448 154 87 407 256 -175 -51
1230 -51 -237 -425 -457 -156 -538 -248 106 -78 -593 -145 -98 -236 319 528 291 444 783 659 116 604 324
1251 324 -38 80 -337 -925 -830 -560 -758 -747 -132 -208 283 610 562 627 770 821 167 341 326 -3 -282 -293 -222
1274 -222 -368 -355 -386 -378 -147 -183 -368 -212 -59 -316 1 428 406 493 535 609 88 529 -53 -93 -564 -419 -772
1297 -772 -778 -545 -759 -326 -4 327 247 613 720 95 279 410 116 -47 -143 96 -243 -296 174 -50 -356 -77
1319 -77 -59 -48 -28 -79 -424 117 202 333 165 446 420 686 469 -5 181 -40 -223 -548 -496 -594 -369 -133 7
$$ packed form
1164a16J49l00M38O5k71r2M42j49k47J33M36p07J41J78m06k62O84k03l28K94K13
1185I2l31J62L63n09L95L86l47k19L27r2k05l3Mo40L70K08k37K23L35k52J10L00
1207D10Lk27M1j76j6l37P8m63R8L68J23k57O49J21k59K36N6k94o7L20j51m31J24
1230e1j86j88l2L01l82K90L54j84n15M48M7j38N55K09k37J53L39j24n43M88k80
1251C24l62J18m17n88R5K70j98J1O15p6M91L27m8O5J43N1o54J74j5l29k79j1P1
1274b22j46J3l1QK31l6j85J56J53k57L17M27k2Q7M2P4n21M41n82m0m71J45l53
1297g72oK33k14M33L22L31q0L66J07o25J84J31k94j63r6K39l39n3M70k24l06K79
1319g7J8J1K0n1l45N41Q5J31j68K81k6K66k17m74J86k21j83l25N2r8K25K36J40
$$ plain form
1342 7 45 94 364 334 398 326 259 221 30 -150 -384 -314 -141 28 -203 -36 -62 -42 -96 -12 34 147 -155 -123 -167 -84
1368 -84 52 -1 -96 251 182 -16 126 244 -142 -410 -196 -156 -224 -167 53 -132 512 387 138 122 280 136 -284
1391 -284 -181 -371 -451 -195 -95 -244 209 184 268 594 251 613 461 103 201 -242 -109 -164 1 -165 -244 -120
1413 -120 -7 -289 -57 -333 26 70 -47 46 119 267 246 282 49 347 344 -125 111 -325 -478 -260 -508 -413 -454
1436 -454 -157 -204 -69 -138 438 415 376 536 471 291 261 37 -73 -329 -184 -178 -295 -74 -78 -354 18 44 -131 96
1460 96 -18 14 -107 240 451 221 252 289 134 30 -6 -30 -204 -297 -353 -457 -319 -474 -205 286 -34 188 297
1483 297 419 466 89 123 -46 -107 -4 -196 -261 -272 94 -262 -121 -141 -2 -49 132 118 -190 -48 -72 -62 20 216
1507 216 43 241 284 -6 -44 162 48 51 -110 -148 -90 -143 -145 -85 -95 130 -143 23 456 213 260 52 58 -69 -192
$$ packed form
1342GL8M9K70l0O4p2o7l8j91j80k34P0J73J69k31J67k6K0n4Q4M6J13l02L2m4Q3
1368h4J36n3r5L47o9j98J42J18l86k68K14M0o8N7K20j85O44j25k49j6J58j44m20
1391b84J03j90q0K56J00j49M53k5Q4L26l43L62j52l58R8m43J33n5J65j66p9J24
1413a20J13k82K32k76L59M4j17R3P3J48k1L6k33K98lm69K36m36j53K18k48R5m1
1436d54K97m7J35o9N76k3l9J60o5j80l0k24j10k56J45Oj17K21mk76L72K6j75K27
1460I6j14L2j21L47K11k30L1L7j55j04l6k4j74r3n6j04J38j55K69M91l20K22J09
1483B97J22M7l77L4j69o1J03j92o5j1L66l56J41k0J39m7J81j4l08J42k4J0Q2J96
1507B16j73J98M3k90l8K06j14Lj61l8N8n3kO0j0K25k73J66M33k43M7k08Oj27j23
$$ plain form
1532 -192 -144 -87 -226 170 210 192 277 176 -167 128 516 -66 -242 178 134 -185 -60 -126 -94 47 -140 174 -332
1555 -332 63 18 -33 55 89 -219 268 -15 26 17 316 -37 -23 336 -268 -316 -76 -141 -343 -181 -146 30 -46 276
1579 276 219 182 400 -59 -53 7 249 -232 -236 -114 -134 -399 49 -389 -251 249 -169 187 107 220 74 144 266
1602 266 -104 123 143 141 -8 178 -60 -342 5 -239 -88 -84 -27 -377 -325 214 -169 309 279 200 535 368 292
1625 292 109 -212 -208 -60 -360 -82 -256 -395 -289 8 -195 -189 163 -143 189 120 -122 -38 92 230 -51 163
1647 163 194 -57 1 105 -332 -183 -162 -178 -195 -147 -231 -326 180 190 -18 223 258 25 239 329 177 156 67 -113
1671 -113 -363 -83 -26 -276 -211 -258 -37 -69 -8 -222 -52 355 5 -96 144 211 -59 -293 251 305 168 209 -109
1694 -109 157 -134 -100 -206 -43 -52 -34 -122 88 162 40 45 286 -59 77 143 -50 -19 -11 148 -255 -126 -109 -101 94
$$ packed form
1532a92M8N7j39L96M0j8Q5j01l43K95L88n82j76M20m4l19J25o6L2J41j87L14n06
1555c32L95m5n1Q8L4l08M87k83M1rK99l53J4L59o04m8K40o5k02J62L5J76p6L22
1579B76n7l7K18m59OO0K42m81mJ22k0k65M48m38J38N00m18L56q0J13j46P0J22
1602B66l70K27K0kj49J86k38k82L47k44J51MN7l50N2N39l83M78l0p9L35j67p6
1625B92j83l21MJ48l00K78j74j39J06K97k03OL52l06L32o9k42Q4J30J38k81K14
1647A63L1k51N8J04m37J49K1j6j7M8q4r5N06J0k08K41L5k33K14R0j52k1q9j80
1671a13k50K80N7k50O5m7K21l2O1k14J70M07l50j01K40O7k70k34N44N4j37M1l18
1694a09K66k91L4j06J63rJ8q8K10P4j22NK41l45J36O6j93L1QJ59m03J29J7QJ95
$$ plain form
1719 94 343 -92 178 -36 -293 -220 81 -16 -218 -27 -159 48 36 -81 143 -4 217 -58 40 208 -25 -54
1741 -54 -54 -217 67 -4 -9 53 -49 149 270 197 -92 83 24 112 37 75 0 255 69 40 57 -25 -49 55 -175 -270
1767 -270 -359 137 -278 82 -237 -145 -138 -81 434 -21 434 122 57 -7 -40 -135 -97 102 -105 -88 34 -88 -89 -167 -14
1792 -14 -97 41 -207 289 -23 17 315 291 366 80 67 102 185 121 -86 35 -49 -315 -207 -232 -176 47 -53 -7
1816 -7 -58 -36 -145 189 81 154 6 25 77 37 103 -106 373 -51 110 224 39 95 -17 26 19 -109 -104 20 -89
1841 -89 261 180 118 302 86 168 222 2 136 -76 -2 -306 -74 62 -153 -31 -14 165 139 138 238 36 74 245
1865 245 107 152 53 277 10 -24 246 -305 -160 -43 -272 -23 9 15 -32 -145 -83 -198 -55 69 132 129 4 110
1889 110 -248 36 -229 40 -126 95 31 -271 12 -16 -94 223 -21 -107 -40 -20 137 -3 16 44 -14 -2 95 87
$$ packed form
1719I4K49m35K70k14k57P3L01r7k02J91j32K07j2j17K24j47K21k75R8J68k33k9
1741e4%j63K84p1nO2j02J98J21p3k89J75n9Q8p5L8p5K55j86k9J7q2k4J04k30r5
1767b70q9M96m15L60l19R2PN7N15m55M55l12o5o4l3r5L8J99k07J7J22j22jp8J53
1792a4q3J38k48M96l12M0K98k4P5k86j3L5Q3o4k07J21q4k66J08k5N6K23j00M6
1816gn1K2j09L34j08P3j48J9N2m0O6k09M79m24J61J14j85N6j12M3pj28NJ24j09
1841h9L50q1o2J84k16Q2N4k20J34k12P4l04K32J36k15J22J7J79k6jJ00k02L8J71
1865B45j38M5r9K24k67l4K70n51J45J17k29K49L2Om7j13O2j15J43J24O3lj25J06
1889A10l58K84k65K69j66K21o4l02K83k8p8L17k44q6O7K0J57j40J9K8n8J2R7q
$$ plain form
1913 87 -94 133 67 53 -5 -164 0 -22 -182 185 -222 -9 -68 -100 191 -24 349 78 168 123 176 134 117 121 136
1938 136 116 44 -164 -214 -61 16 -49 -112 123 -146 -17 -99 -469 -123 94 282 -104 138 314 -81 128 209 242
1961 242 -108 78 -131 55 -60 -32 -196 -45 50 -8 -175 249 -140 101 -58 6 -54 -99 105 -49 -12 -52 0
1984 0 38 47 -51 96 30 23 36 -68 0 -11 59 -167 -132 -152 76 219 237 116 160 -102 217 -81 -128 -58 -177 -8
2010 -8 77 207 103 -43 46 15 -119 -16 -2 171 -2 -43 163 159 -55 -83 115 42 163 194 -150 71 -15 -134
2034 -134 -17 -189 -49 -136 -164 104 105 -197 -60 0 154 57 150 9 141 19 -192 -28 -179 -11 -208 -166 -88
2057 -88 -102 160 -2 -108 -66 -76 -52 107 233 -201 111 215 345 163 -118 101 253 109 -165 -176 -201 -46
2079 -46 10 -127 82 -63 -11 227 74 -118 112 -80 150 228 55 42 41 14 -233 -133 8 169 -1 -168 -100
$$ packed form
1913H7j81K27o6j4n8j59J64k2j60L67m07K13n9l2K91k15L73k71R0m5N3m2j7MJ5
1938A36k0p2k08n0J53P7o5o3K35k69J29q2l70L46K17J88l86K42J76l95K09Q1L3
1961B42l50J86k09J86j15K8j64J51R5n8j67M24l89K41j59O4o0m5K04j54L7m0N2
1984@L8Rr8J47o6pJ3j04O8j1P0k26L5k0K28J43J8j21M4k62L19k98m7P0j19J69
2010hQ5J30j04j46Q9l1j34J03J4J73j73m1K06mk14k8J98p3J21L1l44K21q6j19
2034a34J17j72J40q7k8K68Jl02J37O0J54r7R3j41J32j22k11J64j51J68j97M2P8
2057h8j4K62j62j06M2j0K4J59J26m34L12J04J30j82k81K19J52j44k74j1k5J55
2079d6N6j37K09j45N2K38j53j92K30j92K30P8j73j3jk7k47J00J41J61j70j67O8
$$ plain form
2102 -100 -117 -272 -122 -86 349 -228 -181 139 118 158 199 -13 295 46 -280 73 149 84 -94 -349 -149 -235 43
2125 43 103 -179 100 120 140 40 152 73 28 39 -108 -163 -142 -181 10 -61 3 51 192 91 109 -279 122 43 -105
2150 -105 -284 182 63 191 -211 32 5 -9 -185 -73 247 129 -28 -198 243 39 76 -228 -234 -154 -30 -70
2172 -70 -187 -174 -248 104 287 -32 65 208 265 219 43 100 225 -36 -96 -267 -11 -177 -103 -43 -92 -85 -241 -154 -103
2197 -103 205 -309 -6 -104 -107 202 18 119 151 88 -83 -67 -210 217 -17 -201 -209 -193 -161 -126 -28 -7 -37 -59 -54 24
2223 24 -98 -86 36 368 -57 280 22 -188 90 -79 -67 7 -21 68 74 342 55 -93 171 104 -24 200 217
2246 217 -153 -114 256 68 6 -16 -41 -67 -218 -112 78 -35 -263 -237 -260 -2 -204 63 278 95 -321 121
2268 121 -42 239 281 153 190 21 172 -24 -392 59 -181 194 -63 135 -328 -45 63 -160 -223 208 43
$$ packed form
2102a00j7j55J50L6M35n77M7L20k1M0M1k12L08k49l26L53P6o5j78k55K00q6K78
2125D3O0k82K79K0K0j00J12p9m5J1j47n5K1l9J91p1O4M8J41j01J8l88M01p9j48
2150a05j79M66j19J28m02K43k7j4j76J12L20j18j57j70M41k04L7l04oQ0J24m0
2172g0j17J3p4L52J83l19R7J43N7m6j76N7J25k61o0j71K56j66P4O0m9Pj56Q7N1
2197a03L08n14L03r8lL09j84J01L2o3j71J6j43M27k34j84qJ6L2L5R8K1l0k2NP8
2223B4j22J2J22L32m25L37k58k10K78j69J2P4k8Q9OK68k87j48K64o7j28K24J7
2246B17l70L9L70j88o2k2k5k6j51J06J90j13k28K6k3K58k02K67K15j83m16M42
2268A21j63K81M2j28L7j69J51j96l68M51k40L75k57J98m63K83J08k23o3M31j65
$$ plain form
2289 43 239 143 115 -26 -84 126 -15 -85 -56 -242 -96 14 9 48 -47 -148 -115 -152 -20 -148 184 -364 -54 -100
2313 -100 31 31 -36 -48 -235 -75 -40 -22 -4 -80 -69 -20 118 -64 88 71 -153 -53 37 72 124 -13 78 32 15 82
2339 82 -57 130 -211 -107 -51 -15 118 -70 -8 56 72 -122 -86 -245 -175 -96 -151 -159 19 118 80 303 -178 -226 -4
2364 -4 -25 -21 273 188 -102 -192 -54 -4 92 -74 21 -114 -111 13 200 105 196 -136 130 -195 -159 97 -102 155 -133
2389 -133 -102 -111 -47 53 239 -185 416 70 113 -87 215 122 146 -38 -112 -142 100 30 106 124 27 35 -81 355 -267
2414 -267 -38 111 -12 5 -40 -54 102 -96 131 140 137 209 -104 -106 68 150 -122 1 -97 -37 -74 -25 -64 62 -179
2439 -179 52 -242 -133 199 4 191 -12 147 -14 -52 -115 92 -84 31 22 -25 -179 -38 -316 -148 -113 -171
2461 -171 -4 24 -143 179 13 -42 -88 -18 -60 -80 182 15 95 -73 15 64 36 223 -103 -127 21 -87 -107 -31
$$ packed form
2289D3J96r6k8j41n8K10j41p0K9j86J46J10nL9r5j01L3l7J32j28L32n48L10m6
2313a00J31%o7j2j87J60L5J8J8p6J1M9J38j82J52j7k24J00R0L5N2j37R1m6j7O7
2339H2j39J87l41J04N6L6J33j88O2O4J6j94L6j59P0P9n5qJ78R9l8K23m81m8K22
2364dk1MK94q5k90r0J38N0R6j66R5j35LJ24J87r5R1l32K66l25L6K56j99K57k88
2389a33L1rO4J00J86m24O01l46M3k00L02r3K4j84p4l0K42p0P6J8r7Qj16M36o22
2414b67K29J49j23J7m5j4J56j98K27RlP2l13kJ74Q2k72J23r8O0l7M9l9J26k41
2439a79K31k94J09L32j95J87k03J59j61l8o3K07j76J15rm7j54J41k78J68L5n8
2461a71J67K8j67L22j66n5m6P0m2k0K62j67Q0j68Q8M9k8J87l26k4J48j08k0P6
$$ plain form
2485 -31 18 -28 77 -37 146 -81 -25 294 -2 -230 58 -97 -233 73 -89 -39 74 28 -42 29 57 119 -1
2508 -1 -83 44 110 25 124 183 -88 55 20 228 87 -27 66 -323 -158 212 -80 -143 82 -225 -178 314 26 -23
2532 -23 29 90 11 23 207 51 113 -50 70 66 -71 -147 -228 -99 104 -14 24 128 -82 -58 -70 -161 -47 113 316
2557 316 78 125 10 -135 259 120 132 -60 -281 -37 4 -47 -10 -4 128 10 -164 -70 76 -130 175 254 -70
2580 -70 11 38 -51 16 115 0 -83 -67 -52 150 -183 -209 153 -95 -21 -149 -127 96 185 -249 209 -190 -45 -4 110
2605 110 86 3 -1 34 161 109 62 -253 62 62 101 -148 -4 -211 -4 128 23 15 -16 159 -70 18 92 -30 28
2630 28 40 223 40 -355 -26 -95 -29 -174 78 146 240 -10 -87 459 163 51 -168 230 -143 -245 -348 -15
2652 -15 131 147 -108 40 -75 43 355 119 152 36 167 8 88 175 -121 -263 -2 152 47 158 -24 -122
$$ packed form
2485c1M9m6J05j14J83k27N6L19k96k28K88j55j36L06j62N0J13m6p0P1K8O2j20
2508aq2J27O6q5R9N9k71J43l5K08j41j14R3l89J65L70k92o3K25l07M7M92k88m9
2532b3N2O1p9J2J84j56O2j63J20mj37p6q1J29K03j18L8J04k10K4j2r1J14J60K03
2557C16k38M7j15j45L94j39J2j92k21K44M1n1L7OJ32j18j74R4J46k06L05P9l24
2580g0Q1K7q9O7R9j15q3J6J5K02l33k6L62k48P4j28K2K23Q9m34M58l99J45M1J14
2605A10k4q3mL5J27n2m7l15L15%L9k49J44k07K07J32j05ql1J75k29Q8P4j22N8
2630B8J2J83j83l95L29o9O6j45K52O8R4k50p7N46k96j12k19L98l73j02j03L33
2652a5J46J6k55J48j15J18L12k36L3j16J31j59Q0Q7k96j42K61J54j05J11j82r8
$$ plain form
2674 -122 -35 -266 257 114 -123 -252 -234 -128 0 -105 -289 171 -32 137 17 -180 82 309 -120 -3 223
2695 223 -30 147 -67 -187 -99 -66 196 126 -45 27 68 -167 46 160 26 102 31 45 -261 -30 -19 15 -37 -92
2719 -92 -61 172 -1 -40 -299 -14 31 -11 82 118 160 62 210 73 -79 42 -287 -105 -62 -257 -96 75 -41
2742 -41 89 6 -236 21 -215 -78 228 -10 -32 274 -9 2 -79 252 -50 1 -74 -6 99 52 157 4 -253
2765 -253 114 -106 34 -77 -149 -119 245 -24 -235 -269 -99 -172 -23 -25 111 73 -43 -25 -125 245 -112 101 183
2788 183 174 -33 -62 -40 -156 -119 -13 33 181 1 -189 93 -95 32 -187 -19 143 185 136 141 163 -79 89 -130
2812 -130 35 -7 15 52 -14 -203 -42 15 18 -91 245 83 -51 -101 -160 154 -130 -88 -26 181 -261 -15 -256 -105
2836 -105 -23 -74 91 -75 192 -20 53 -171 -186 126 40 209 1 -125 -164 -62 -92 143 145 -126 97 69 24 -24
$$ packed form
2674a22Q7k31N23j43k37j29J8J06J28j05j84M60k03J69j20j97K62K27m29J17K26
2695B23k53J77k14j20Q8L3K62p0j71P2M1k35K13J14j34P6p1J4l06K31J1L4n2n5
2719i2L1K33j73l9k59K85M5m2R3L6M2r8J48j37j52J21l29J82M3j95J61J71j16
2742d1J30q3k42K57k36J37L06k38k2L06k83J1q1L31l02N1p5O8J05m7J05j53k57
2765b53L67k20J40j11p2L0L64k69k11l4J70p3J49kJ36l8j16J8j00L70l57K13Q2
2788A83rk07k9K2j16L7J06M6J48j80j90K82j88J27k19J68J62M2m9NK2k42J68k19
2812a30J65m2K2L7o6j89J61N7Lj09L36j62j34n0n9L14k84M2O2K07m42K46k41J51
2836a05Q2n1J65j66K67k12P3k24j5L12q6J69k08j26l9J02l0K35Kk71K23k8m5m8
$$ plain form
2860 -24 157 -148 120 58 -29 140 -37 -93 72 87 -123 19 10 15 -144 37 -84 -58 -59 61 149 161 -67 -56 -2
2885 -2 -350 173 -131 -169 -2 -121 49 -131 -153 47 75 -1 5 -27 -135 -67 -29 -16 -173 -29 -103 -69 56 56 -12 -60
2911 -60 -28 102 91 -110 24 2 -55 -23 -48 -376 95 -114 -36 73 -31 -147 -87 -212 -67 -23 -23 260 390 119
2935 119 160 285 -209 -13 -35 -141 27 -83 -152 -22 173 -23 229 230 36 -31 -46 346 81 -234 -102 290
2957 290 186 -123 -26 -29 126 -125 116 111 -17 135 -101 -106 89 -9 -87 67 157 -165 -37 -73 291 -164 33 -68
2981 -68 -40 222 -22 -113 40 55 -9 77 -212 125 -67 -113 132 -307 -208 -87 -214 -132 -81 14 -100 174 87 15
3005 15 204 -85 85 -96 -237 -60 333 249 -29 3 17 -371 63 -101 -20 -212 229 -106 14 90 -12 -61
3027 -61 -116 34 110 311 108 -63 -158 66 -104 76 92 -78 50 97 25 -35 -116 86 -34 85 74 20 -4 75
$$ packed form
2860b4J81l05K68o2q7J69j77n6J65J5k10J42rNj59J81j21K6jJ20Q8J2k28J1N4
2885bl48N23l04l8J67j19J70j80k2K00K8p6Ol2j08O8L8J3j57J44p4L4J25%o8m8
2911f0L2J30j1k01J34k2n7L2k5l28M71k09P8J09j04j16O0j25J45M4%K83J30k71
2935A19M1J25m94J96k2j06J68j10o9J30J95j96K52Jj94o7j5L92k65l15J32L92
2957B90j04l09R7lJ55k51K41nj28J52k36nJ95r8p8J54R0l22J28l6L64m55J97j01
2981f8K8K62k44r1J53J5o4Q6k89L37j92m6K45m39R9J21j27Q2N1R5j14K74q7p2
3005A5J89k89J70j81j41J77L93q4k78L2J4l88M34j64Q1j92M41l35J20P6j02m9
3027f1n5J50P6K01k03j71r5K24j70J80J6j70J28M7p2o0q1K02j20J19j1n4k4P9
$$ plain form
3051 75 -10 -83 144 94 26 -188 -259 51 40 16 24 -179 -64 -183 26 124 218 67 -18 -26 30 126 -197 163 90 8
3077 8 88 8 -84 100 39 -52 39 -149 38 -70 -61 -167 218 6 -80 210 67 12 309 -53 135 0 -114 -38
3101 -38 -81 260 -161 74 126 27 -57 404 170 18 -211 37 92 -27 56 17 14 118 168 62 -286 -1 -71 -78 -244
3126 -244 -89 -136 75 -207 -66 -60 -276 -23 74 137 189 34 -48 159 -234 -39 -178 1 -1 -134 -332 -152 -135
3149 -135 43 88 123 94 100 174 44 -226 155 307 157 39 8 -41 114 292 -201 192 -126 40 -75 -18 -45
3172 -45 -13 9 -4 126 -69 124 -241 -9 73 -27 -8 43 47 -187 -109 -89 -183 -19 -193 -292 -244 119 -116 118 53
3197 53 147 11 -154 101 32 -87 -51 -218 -18 -7 -259 -36 74 146 187 231 28 -24 2 174 -5 -12 -183 -69
3221 -69 141 -114 6 61 185 -9 -75 434 242 73 110 125 158 -186 210 3 177 141 129 -145 74 -85 207
$$ packed form
3051G5q5p3K27n0o8k14p1L10j1k4Qk03J15j19K09R8R4j51q5qN6R6l23L60p3q2
3077HQ0q0r2J84o1r1R1j88J87j08Rj06L85k12q6K90j43n5K97l62J88j35j14P6
3101c8m3L41m21K35N2r9q4M61k34j52k29K48N5j19Q3l9lJ04N0j06l48K85p0pj66
3126b44J55m7K11k82J41Ok16K53R7O3N2j55q2K07l93J95j39J79kj33j98J80J7
3149a35J78M5L5k9OP4j30k70L81J52j50j18l1m9J55J78m93L93l18J66j15N7k7
3172d5L2K2j3J30j95J93l65K32Q2j00J9N1Mk34P8K0r4J64j74r9M8L63k35K34o5
3197E3R4j36j65K55o9j19L6j67K00J1k52K23J10P2M1M4k03n2K6J72j79pj71J14
3221f9K10k55J20N5J24j94o6N09j92j69L7J5L3l44L96k07J74l6j2k74K19j59K92
$$ plain form
3244 207 154 413 -62 -282 -195 123 -5 -261 -34 -11 -127 -5 3 -21 263 144 -53 -178 -49 20 -17 -128 -93
3267 -93 62 1 45 365 -18 25 133 63 30 80 -210 45 -8 -236 -97 86 -188 -220 -14 -88 60 146 19 198
3291 198 128 99 -291 111 151 -254 -156 -84 -5 75 36 149 -224 43 191 -62 145 -54 -14 -61 32 -3 31 22 -142
3316 -142 57 -50 94 64 -31 -139 34 203 225 -20 69 -311 280 -51 189 260 89 -25 -200 -14 212 -142
3338 -142 -147 45 -15 -27 -198 -37 312 -167 -267 181 -67 111 276 -40 14 -33 55 116 81 81 -37 158 272 49
3362 49 116 -119 157 22 122 129 171 73 9 239 -97 123 18 199 -261 -194 -78 -151 -37 87 110 -136 68
3385 68 -62 -17 -182 58 64 -69 286 16 -80 -21 -24 -269 -28 -52 6 292 -296 128 -10 135 47 95 -126 35
3409 35 131 25 212 -25 -195 -32 -112 81 -135 126 188 2 181 -83 179 43 -115 -87 136 84 -71 73
$$ packed form
3244B07n3K59m75k20Q7L18j28k56K27K3j16J22Qk4K84j19j97j25J29O9l7j11L5
3267i3J55o1M4L20l83M3J08p0l3N0k90K55n3k28J39J83k74l2K06p4J48Q6j27J79
3291A98p0k9l90M02M0m05R8P2P9Q0l9J13l73K67J48k53K07j99M0m7R3l5L4rj64
3316a42J99j07J44l0r5j08J73J69K2k45Q9l80N91l31K40P1j71j14j75J86K26l54
3338a42nJ92o0j2j71J61L49m79j00M48k48J78J65l16N4m7Q8O1l5%j18J95J14k23
3362D9O7k35K76j35J00PM2r8o4K30l36K20j05J81m60O7J16p3J14J24K3k46K04
3385F8j30M5j65K40Oj33L55k70r6N9lk45K41k4N8K86n88M24j38J45q8M8k21J61
3409C5R6j06J87k37j70J63q0J93k16K61O2j86J79k64K62j36j58K8K23n2j55J44
$$ plain form
3431 73 115 268 59 -89 -47 184 -174 -57 -120 147 32 22 109 41 33 -93 140 -59 -45 -76 -162 69 57 -259
3455 -259 247 87 -263 99 35 100 -200 -5 0 48 -36 -175 110 68 219 49 176 -79 54 106 -111 -66 170
3478 170 107 98 78 -55 -119 112 -83 -3 271 -88 65 143 -37 365 327 -101 -38 60 -58 77 106 140 -112 -49
3502 -49 27 40 19 -139 -69 -79 99 -6 -93 185 -18 376 17 -51 3 -7 297 -289 -96 30 -126 -203 -6 234
3526 234 -224 -252 -40 -13 235 111 80 115 114 105 -151 122 254 -324 -308 59 -243 -263 36 -4 28 92 -297 -70
3550 -70 145 269 221 -289 95 87 48 241 268 -152 147 305 26 192 70 -32 -184 -199 -15 -96 -11 142 112
3573 112 -35 117 170 61 39 -146 38 -63 19 186 -197 -47 -49 -150 84 161 75 79 -167 -116 192 -9 -52 -40
3597 -40 -16 71 166 -51 -293 32 -208 -29 41 164 81 -65 -77 43 -53 -148 376 -281 169 -235 23 -84 -231
$$ packed form
3431G3M2J53k09j48M2K31l58J17o3K67j15j0Q7o8qj26K33j99J4l1q6K31j2l16
3455b59N06j60l50L62o4O5l00J95NM8q4j39K85m2J51j70J27k55J33N2k17M5K36
3478A70o3rk0j33o4K31j95Q0K74l59J53P8j80M02l8m28O3R8j18J35K9L4k52O3
3502d9P6J3k1j58P0j0J78j05q7K78k03L94l59o8N4j0L04n86J93J26j56p7J97K40
3526B34m58k8K12K7K48j24l1L5jrk56K73J32n78J6L67l02k0K99m0L2O4l89K27
3550g0K15J24m8n10L84ql9J93K7m20K99J58k79J66j22j02j52j5J84q1Q5J53l0
3573A12j47J52N3j09k2j85J84j01Q2J67l83J50kj01K34P7q6Mk46N1L08k01m3J2
3597d0K4Q7R5k17k42L25k40J79P0J23q3j46j2J20r6r5N24o57M50m04K58j07j47
$$ plain form
3620 -231 192 9 142 158 173 18 -83 37 -21 -148 -198 141 -145 35 -191 158 44 132 117 9 -47 -3 -30
3643 -30 -72 84 41 -38 13 52 99 -87 83 94 -57 -87 -207 101 142 110 -29 -59 -38 -127 -27 136 101 4 20 -55
3669 -55 -41 -15 260 160 -24 -63 -72 51 82 272 -147 -196 180 60 -186 26 -70 -135 -258 136 -20 -249 -8
3692 -8 45 26 48 -52 211 346 26 139 35 264 -131 -34 253 292 93 -221 -54 7 143 136 274 190 -81 -159
3716 -159 159 7 149 327 -1 32 189 -101 26 -12 -30 -41 31 -150 0 77 29 -8 90 -156 29 42 -41 -230
3740 -230 2 -50 5 -100 -111 -156 -5 -75 4 83 -43 -166 -64 41 -77 5 40 -149 -91 86 143 76 -58 9
3764 9 134 152 -17 -73 -170 92 65 98 -97 59 2 37 -15 -50 -36 214 -7 230 -70 -43 36 -42 132 153 45
3789 45 -93 -117 2 -59 -225 6 -126 83 117 -176 7 -149 102 -7 -7 -43 52 -68 -23 132 132 -33 154 -60
$$ packed form
3620b31M23j83J33J6J5j55j01J20n8j27n0L39k86J80k26L49j14Q8j5j08n6M4k7
3643c0m2J56m3p9N1L9M7j86J70J1j51l0j20L08M1l2j39l0K1q9J00J63l5r7J6p5
3669e5J4K6K75j00j84l9rJ23L1J90m19m9L76j20k46K12r6o5j23L94j56k29K41
3692hN3j9K2j00K63J35l20J13j04K29l95R7K87L9j99l14J67O1J36pJ38q4k71p8
3716a59L18j52J42J78l28L3J57k90J27l8j8j1P2j81J50P7m8l7R8k46J85J3q3j89
3740b30K32n2N5j05j1m5J51p0P9P9j26j23J02J05j18Q2L5j89N8J77N7o7j34O7
3764IJ25J8j69n6r7K62k7L3j95J56n7L5n2l5J4K50k21K37l00K7P9p8J74K1j08
3789D5j38k4J19o1j66K31j32K09L4k93J83j56K51j09%l6R5j20M5J55%j65J87k14
$$ plain form
3813 -60 2 -61 38 -5 -3 55 -142 -106 77 99 69 -7 160 -50 -44 298 90 -111 105 -99 -29 247 -77 -104 7
3838 7 -174 -29 118 281 -81 -27 -255 -57 344 -6 44 12 -70 -123 40 -103 122 -209 -166 117 58 60 193 -149
3862 -149 235 -33 123 163 135 128 90 253 127 20 -112 -178 45 -123 211 4 93 4 -36 -137 12 123 -380
3885 -380 -6 110 -141 17 126 -52 227 283 -63 -26 -120 -38 -107 -78 12 -367 -51 -119 7 -42 162 -61 32
3908 32 -178 -54 -123 -2 -139 42 153 61 -24 184 120 -17 175 -119 -294 79 171 65 98 168 105 -22 24
3931 24 243 -198 -28 135 43 140 -9 22 -181 -66 56 -34 21 -111 80 -50 -143 -59 -103 -136 -205 14 -210 34
3955 34 109 44 -31 -116 -10 -7 117 -136 114 -26 42 -302 -89 5 60 116 -235 -33 -316 236 -72 202 223 21
3979 21 351 181 -121 70 8 -17 120 52 109 100 265 -73 -24 -25 16 -131 -187 166 165 77 108 -50 15 -97 56 -59
$$ packed form
3813f0O2o3R9m3KN8j97L6J83K2l0p6J67k10OL42k08k01K16k04P0K76l24k7J11
3838Gj81J45J47J63l62N4k28J98M01l50N0l2q2n3J63j43K25l31M3K83n9KJ33l42
3862a49L84k68J56M0k8pl8J63j26j07j32o6K23j68L34k07Q9q9m0j01J49J11n03
3885c80L74J16k51J58J09j78K79N6l46L7r4Q2o9K9R0l79L16o8J26m9K04k23R3
3908C2k10J24o9J21j37J81J11r2q5K08o4j37J92k94j75L73R2j06L3P0o3j27M6
3931B4K19m41J70J63r2R7j49L1k03J15J22r0N5j32J91j30r3Q4m4l3o9K19k24K44
3955C4P5o5p5q5J06LJ24k53K50j40O8l44K13R4N5N6l51K02k83N52l08K74K1k02
3979B1L30j70l02J91o2k5J37o8N7rJ65l38M9jM1j47n6L53jq8L1j58O5j12J53j15
$$ plain form
4005 -59 86 -214 59 147 -17 -68 117 -210 -10 -102 254 97 -36 37 90 251 134 98 -216 98 225 96
4027 96 -68 -29 -10 211 159 -19 -265 -71 193 -162 -248 -159 47 -90 111 -177 -66 -39 -3 131 211 121 -34
4050 -34 -17 32 6 164 35 -83 -2 -441 -225 107 -206 6 -48 29 -88 -88 -15 -130 96 150 -118 192 8 -45
4074 -45 225 -151 10 -245 57 -287 -95 17 -179 6 -37 137 -20 -43 244 -128 117 317 -177 -60 -185
4095 -185 -210 270 214 -248 -45 1 -331 62 -2 286 48 -13 80 57 64 -115 -33 -111 -126 67 150 32 112 97 92 160
4121 160 -77 63 75 -371 -184 -140 -29 -203 -127 135 166 -161 -25 27 -42 69 73 -2 5 28 330 -2 -187 -249
4145 -249 -70 -15 121 21 -46 -203 105 46 -120 83 241 168 104 61 -65 -107 -47 -13 20 251 -99 -75 -104 -166
4169 -166 4 -21 305 239 126 169 -258 -27 133 114 -63 -257 -24 112 -153 -267 -135 -176 -120 104 -115 131
$$ packed form
4005e9J45l00K73Q8j64n1J85l27K00r2L56j57j33P3N3J61j17l6l14L14J27j29
4027I6j64L9J9K21n2j78k46J94K64l55q6Q9K06j37K01k88J11K7L6J34Q0r0j55
4050c4J7M9k6J58j29j18Q1m39K16L32l13K12n4P7j17%P3j15K26N4k68L10j84n3
4074d5K70l76J61k55L02l44J92J12j96J85m3J74j57k3K87l72K45K00m94J17j25
4095a85k5M80n6m62K03M6l32L93o4K88k38o1R3k3Pj79Q2p8j5J93Q3j18Q0j5nO8
4121A60k37J40J2m46J87M4J11j74P6K62L1l27J36N2o9J11Mp5PK3L02l32j85o2
4145b49J79N5J36j00o7j57L08n9j66K03J58p3o4m3j26m2O0L4L3K31l50K4k9o2
4169a66J70k5L26o6j13M3m27K31J60j9j77j94K33J36k65j14J32m1N6K24k19K46
$$ plain form
4191 131 38 -12 -167 -56 163 -54 -24 -70 106 218 -236 16 -65 3 42 -175 111 -313 55 -31 -72 39 -98
4214 -98 -201 -82 295 -130 234 -190 67 169 -291 -146 -157 14 -117 147 -131 -51 -70 -69 150 -106 -118 32
$$ packed form
4191A31r3n0j55J11K19k17L0m6J76J12m54K52q1O8L9k17K86m24L68q6m1J11j37
4214i8j03J19L77m25L64m24K57J02m60J45j1J71j31K64k78Q0j9JK19k56j2J50
$$ [...]
8191i1
##END NTUPLES=NMR FID
##END=
