##TITLE=1H_SR-167-R2-K
 CDCl3
 8 sc, 
 12.7.2023
##JCAMPDX= 6.0         $$ Bruker NMR JCAMP-DX V2.0
##DATA TYPE= NMR FID
##DATA CLASS= NTUPLES
##ORIGIN= UXNMR, Bruker Analytische Messtechnik GmbH
##OWNER= root
$$ XWIN-NMR		Version 3.5
$$ Wed Jul 12 15:37:45 2023 Russian Standard Time (UT+4h)  she@DPX200
##.OBSERVE FREQUENCY= 200.13135
##.OBSERVE NUCLEUS= ^1H
##.DELAY= (6, 6)
##.ACQUISITION MODE= SIMULTANEOUS
##.ACQUISITION SCHEME= undefined
##.AVERAGES= 8
##.DIGITISER RES= 18
##SPECTROMETER/DATA SYSTEM= spect
##.PULSE SEQUENCE= zg30
##.SOLVENT NAME= CDCl3
##.SHIFT REFERENCE= (INTERNAL, CDCl3, 0, 15.7039)
##AUDIT TRAIL= $$ (NUMBER, WHEN, WHO, WHERE, WHAT)
$$ ##TITLE= Audit trail, XWIN-NMR		Version 3.5
$$ ##JCAMPDX= 5.01
$$ ##ORIGIN= Bruker BioSpin GmbH
$$ ##OWNER= she
$$ F:/spectra/data/she/nmr/H-F/1/audita.txt
$$ ##AUDIT TRAIL=  $$ (NUMBER, WHEN, WHO, WHERE, WHAT)
(   1,<2023-07-12 15:36:30.06 +0400>,<she>,<DPX200>,
      <created by zg, POWCHK disabled, PULCHK disabled
       configuration hash MD5:
       00 E9 B6 7A A2 85 ED C7 34 08 36 98 17 FE 4E 26
       data hash MD5: 16K
       E1 29 08 19 56 7D E7 27 DA C8 4A 9A DA 57 08 EB>)
$$ ##END=
$$ 
$$ hash MD5
$$ 7E 19 D2 0B 96 3A AB CB 5E 22 5C D5 6D 62 01 51
##$RELAX= 
##$RELAX= 
##$RELAX= 
##$RELAX= 
##$RELAX= 
##$RELAX= 
$$ Bruker specific parameters
$$ --------------------------
##$DU= <F:/spectra>
##$EXPNO= 1
##$NAME= <H-F>
##$PROCNO= 1
##$TYPE= <nmr>
##$USER= <she>
##$AMP= (0..31)
100 100 100 100 100 100 100 100 100 100 100 100 100 100 100 100 100 100 
100 100 100 100 100 100 100 100 100 100 100 100 100 100 
##$AQSEQ= 0
##$AQ_mod= 1
##$AUNM= <au_zg>
##$AUTOPOS= <>
##$BF1= 200.13
##$BF2= 200.13
##$BF3= 200.13
##$BF4= 200.13
##$BF5= 200.13
##$BF6= 200.13
##$BF7= 200.13
##$BF8= 200.13
##$BYTORDA= 1
##$CFDGTYP= 0
##$CFRGTYP= 5
##$CHEMSTR= <none>
##$CNST= (0..31)
1 1 145 1 1 1 1 1 1 1 1 1 1 1 1 1 1 1 1 1 1 1 1 1 1 1 1 1 1 1 1 1 
##$CPDPRG= <>
##$CPDPRG1= <>
##$CPDPRG2= <>
##$CPDPRG3= <>
##$CPDPRG4= <mlev>
##$CPDPRG5= <mlev>
##$CPDPRG6= <mlev>
##$CPDPRG7= <mlev>
##$CPDPRG8= <mlev>
##$CPDPRGB= <>
##$CPDPRGT= <>
##$D= (0..31)
0 1.2 0 0 0 0 0 0 0 0.06 0 0.03 0 0 0 0 0.0002 0 0 0 0 0 0 0 0 0 0 0 0 
0 0 0 
##$DATE= 1689161789
##$DBL= (0..7)
120 120 120 120 120 120 120 120 
##$DBP= (0..7)
150 150 150 150 150 150 150 150 
##$DBP07= 0
##$DBPNAM0= <>
##$DBPNAM1= <>
##$DBPNAM2= <>
##$DBPNAM3= <>
##$DBPNAM4= <>
##$DBPNAM5= <>
##$DBPNAM6= <>
##$DBPNAM7= <>
##$DBPOAL= (0..7)
0.5 0.5 0.5 0.5 0.5 0.5 0.5 0.5 
##$DBPOFFS= (0..7)
0 0 0 0 0 0 0 0 
##$DE= 6
##$DECBNUC= <off>
##$DECIM= 32
##$DECNUC= <off>
##$DECSTAT= 4
##$DIGMOD= 1
##$DIGTYP= 9
##$DL= (0..7)
0 120 120 120 120 120 120 120 
##$DP= (0..7)
150 150 150 150 150 150 150 150 
##$DP07= 0
##$DPNAME0= <>
##$DPNAME1= <>
##$DPNAME2= <>
##$DPNAME3= <>
##$DPNAME4= <>
##$DPNAME5= <>
##$DPNAME6= <>
##$DPNAME7= <>
##$DPOAL= (0..7)
0.5 0.5 0.5 0.5 0.5 0.5 0.5 0.5 
##$DPOFFS= (0..7)
0 0 0 0 0 0 0 0 
##$DQDMODE= 0
##$DR= 18
##$DS= 0
##$DSLIST= <SSSSSSSSSSSSSSS>
$$ [...]
##$SUBNAM2= <"">
##$SUBNAM3= <"">
##$SUBNAM4= <"">
##$SUBNAM5= <"">
##$SUBNAM6= <"">
##$SUBNAM7= <"">
##$SUBNAM8= <"">
##$SUBNAM9= <"">
##$SW= 18.05172834244
##$SWIBOX= (0..15)
0 0 2 0 0 0 0 0 0 0 0 0 0 0 0 0 
##$SW_h= 3612.71676300578
##$TD= 16384
##$TD0= 1
##$TE= 0
##$TE2= 300
##$TE3= 300
##$TEG= 300
##$TL= (0..7)
0 120 120 120 120 120 120 120 
##$TP= (0..7)
150 150 150 150 150 150 150 150 
##$TP07= 0
##$TPNAME0= <>
##$TPNAME1= <>
##$TPNAME2= <>
##$TPNAME3= <>
##$TPNAME4= <>
##$TPNAME5= <>
##$TPNAME6= <>
##$TPNAME7= <>
##$TPOAL= (0..7)
0.5 0.5 0.5 0.5 0.5 0.5 0.5 0.5 
##$TPOFFS= (0..7)
0 0 0 0 0 0 0 0 
##$TUNHIN= 0
##$TUNHOUT= 0
##$TUNXOUT= 0
##$USERA1= <user>
##$USERA2= <user>
##$USERA3= <user>
##$USERA4= <user>
##$USERA5= <user>
##$V9= 5
##$VALIST= <valist>
##$VCLIST= <CCCCCCCCCCCCCCC>
##$VD= 0
##$VDLIST= <DDDDDDDDDDDDDDD>
##$VPLIST= <PPPPPPPPPPPPPPP>
##$VTLIST= <TTTTTTTTTTTTTTT>
##$WBST= 1024
##$WBSW= 4
##$XGAIN= (0..3)
0 0 0 0 
##$XL= 0
##$YL= 0
##$YMAX_a= 174266
##$YMIN_a= -168981
##$ZGOPTNS= <>
##$ZL1= 120
##$ZL2= 120
##$ZL3= 120
##$ZL4= 120
##$ABSF1= 10
##$ABSF2= 0
##$ABSG= 5
##$ABSL= 3
##$ALPHA= 0
##$AQORDER= 0
##$ASSFAC= 0
##$ASSFACI= 0
##$ASSFACX= 0
##$ASSWID= 0
##$AUNMP= <proc_1d>
##$AZFE= 0.1
##$AZFW= 0.1
##$BCFW= 1
##$BC_mod= 2
##$BYTORDP= 1
##$COROFFS= 0
##$CY= 11.3945322036743
##$DATMOD= 1
##$DC= 2
##$DFILT= <>
##$DTYPP= 0
##$F1P= 15.7292609196834
##$F2P= 12.9074282941183
##$FCOR= 0.5
##$FTSIZE= 0
##$FT_mod= 4
##$GAMMA= 1
##$GB= 0.15
##$INTBC= 1
##$INTSCL= 1
##$ISEN= 128
##$LB= 0.24
##$LEV0= 0
##$LPBIN= 0
##$MAXI= 10000
##$MC2= 0
##$MEAN= 0
##$ME_mod= 0
##$MI= 1.114404
##$NCOEF= 0
##$NC_proc= 0
##$NLEV= 6
##$NOISF1= 3.799351
##$NOISF2= 2.8
##$NSP= 1
##$NTH_PI= 0
##$NZP= 0
##$OFFSET= 15.70392
##$PC= 1
##$PHC0= -20990.86
##$PHC1= 10.65272
##$PH_mod= 1
##$PKNL= yes
##$PPARMOD= 0
##$PSCAL= 0
##$PSIGN= 0
##$REVERSE= no
##$SF= 200.130013532006
##$SI= 16384
##$SIGF1= 3
##$SIGF2= 2
##$SINO= 400
##$SIOLD= 16384
##$SREGLST= <1H.CDCl3>
##$SSB= 0
##$STSI= 0
##$STSR= 0
##$SW_p= 3612.71676300578
##$SYMM= 0
##$S_DEV= 0
##$TDeff= 0
##$TDoff= 0
##$TI= <>
##$TILT= no
##$TM1= 0
##$TM2= 0
##$TOPLEV= 0
##$USERP1= <user>
##$USERP2= <user>
##$USERP3= <user>
##$USERP4= <user>
##$USERP5= <user>
##$WDW= 1
##$XDIM= 8192
##$YMAX_p= 0
##$YMIN_p= 0
$$ End of Bruker specific parameters
$$ ---------------------------------
##NTUPLES= NMR FID
##VAR_NAME=  TIME,          FID/REAL,        FID/IMAG
##SYMBOL=    X,             R,               I
##VAR_TYPE=  INDEPENDENT,   DEPENDENT,       DEPENDENT
##VAR_FORM=  AFFN,          ASDF,            ASDF
##VAR_DIM=   8192,          8192,            8192
##UNITS=     SECONDS,       ARBITRARY UNITS, ARBITRARY UNITS
##FACTOR=    0.0002768,     1,               1
##FIRST=     0,             0,               0
##LAST=      2.2672688,     0,               0
##MIN=       0,             -168981,         0
##MAX=       2.2672688,     174266,          0
$$ Real data points
##PAGE= N=1
##DATA TABLE= (X++(R..R)), XYDATA
$$ [...]
1791g4J37L4j88L01K9q5k59J9M58l80p3J06j19K85l66j57M88k4k6k51lK87j42
$$ -74 63 97 -91 210 239 154 -105 -86 372 -8 -81 25 -94 191 -175 -332 156 132 106 -145 -148 139 -3
1814cj07n0L36k79M86m69J56p9J75q2K20l09k4K97k25L29m91j1mJ56j31j75L02
$$ -3 -110 -160 176 -103 383 -86 70 -9 166 84 304 -5 -29 268 43 372 -119 -130 -134 22 -109 -284 18
1837A8k2l05M0M6OK56p1j30J53l5M5j74Q8J87k21L80k37K77K12l41J62l21O8j4
$$ 18 -4 -309 -269 -223 -217 39 -32 -162 -9 -44 1 -173 -85 102 -119 261 24 301 513 172 334 13 81 67
1861F7j06P9k66J16n9j4K13k29rm5l8R3k5K0P2j3%K87K8q3k3Q3l2K82k81j9K0
$$ 67 -39 40 -226 -110 -169 -183 30 -199 -208 -253 -291 -198 -223 -203 -131 -144 -144 143 171 88 65 148 116 398 117 98 118
1888A18J02J07j24k92j28P7N9r1J02k79K04ML29j22k70R2J7K6k05K74p9J28K69
$$ 118 220 327 203 -89 -217 -140 -81 -172 -70 -349 -145 -141 188 66 -204 -112 -95 -69 -274 0 -79 49 318
1911C18j6k68J27j48J03k47L83j62j25P9MJ20j89j7o0J42k55J07m0J36M9J92r4
$$ 318 302 34 161 13 116 -131 252 90 -35 44 48 168 -21 -38 -98 44 -211 -104 -144 -8 41 233 139
1934A39r5k7O5K61j84j30j01J61op7j40K13k9J14l00J84J23L0j39K20l41Q6j9
$$ 139 44 17 82 343 159 29 -72 89 83 6 -134 79 50 164 -136 48 171 201 62 282 -59 27 8
1957HJ39j68j14K58l71K58k68L5K77j68K9K95l05R7L6j89N0J87j28k91L26l8n6
$$ 8 147 -21 -135 123 -248 10 -258 -223 54 -114 -85 210 -95 2 38 -151 -101 86 -42 -333 -7 -45 -101
1980a01J08q2n9Q8K39k39Np0L3l3j11L28q2J16j95j68J51j16L36o85K31L7K30
$$ -101 7 -75 -134 -46 193 -46 -41 -111 -78 -111 -222 106 24 140 -55 -223 -72 -188 148 -537 -306 -269 -39
2003c9j38J41J9P1q9J32JK51k63r5L47l23M39o26R4j32L58l8K56k34m15L86Q5
$$ -39 -177 -36 -17 54 -35 97 98 349 86 -9 338 15 454 -172 -78 -210 148 110 366 132 -283 103 188
2026A88k39k9j2m3J96p7j1M9k72K36k8K7j37L12o4j74K69no3l11J77J17OQ2n3
$$ 188 -51 -80 -92 -135 61 -16 -27 22 -250 -14 -42 -15 -152 160 96 -78 191 186 123 -188 -11 106 112 194 141
2051A41l04L05j05M5k67J55P0l44J63L7K1j30L09k45o8Q5n4J60J75r0N8j67L06
$$ 141 -163 142 37 82 -185 -30 40 -304 -141 -104 -83 -213 96 -149 -217 -132 -186 -26 149 59 117 -50 256
2074B56j83J53j95J59J14l25m5K46o9k45J45l19M59m01K44J6q1k13M16M8r9k14
$$ 256 73 226 31 190 304 -21 -66 180 111 -134 11 -308 151 -250 -6 10 -71 -284 132 180 81 -133
2096a33o8J81q7JJ92m10J26M40k23K04j52l9k4n3M27m18J98j51p1J23o2j4j08
$$ -133 -201 -20 -107 -106 86 -324 -198 242 19 223 71 32 8 -45 382 -36 162 11 -60 63 1 -13 -121
2119a21j6K38j78J69j55J49p7j22k49K58K0Q1L3p5K17q7J03j73j62J73k4r6q9
$$ -121 -137 101 -77 92 -63 86 9 -113 -362 -104 -84 -3 30 -45 172 85 188 15 -147 26 2 -94 -183
2142a83J30n8lJ10M4O0J33l12k4J43p2K05k15O9j19m7K57O9k66nJ52o6k07K97
$$ -183 -53 -111 -114 -4 40 100 233 -79 -103 40 -32 173 -42 27 -92 -139 118 187 -79 -84 68 2 -205 92
2166I2j14l04P8M82p7N2k62J84o9j87K47o0Q6J77j76k87L86k18Rk96K80n7J02
$$ 92 -22 -326 -248 234 157 209 -53 131 62 -125 122 62 148 325 149 -138 248 30 39 -257 23 -34 68
2189F8j64L32j84l05J50q2J07J31k36K10N4Rm6j6J02M1k9M8J89j06k89j9m5K4
$$ 68 -96 236 52 -253 -103 -185 -78 53 -183 27 81 90 44 28 130 171 142 190 379 273 -16 -35 -80 -56
2213e6K63j82J31r4k26kJ42J85j53j54J24l4K9l45M51lo3K26j52j97L16j69j00
$$ -56 207 25 156 62 -164 -166 -24 161 8 -146 -22 -56 -27 -372 79 76 13 239 87 -110 206 37 -63
2236f3j26K15M6l0j33L15j85N4j24K0l2n5p9K22j13j43L14M0P4l75J91j44K95
$$ -63 -189 26 72 42 -91 224 39 93 -31 -11 -43 -98 -177 45 -68 -211 103 143 217 -158 33 -111 184
2259A84J39m37O8J2J66l0j03N2j0j58o8L76k58J76j87J42j91M18m50O8J5K07k67
$$ 184 323 -114 -46 -34 132 102 -1 51 41 -117 -185 191 -67 109 -78 64 -127 291 -159 -91 -76 131 -136
2282a36k7R7L6p9j99O7J23M3k03M93l20L2P1M5l2r5J61q1Q5j52J15k42K30N9l49
$$ -136 -163 -66 -30 -109 -308 -241 -118 -75 -278 215 -105 -73 -2 43 11 -84 77 -4 81 -71 44 -198 32 91 -258
2307b58K13J7q3K31m9J18k48k52L43o9j09j9J2n1J71K44l02o0K10O6k7j42J15
$$ -258 -45 -28 -111 120 71 189 -59 -311 32 -37 -146 -165 -153 -204 -33 211 -91 -151 59 125 98 -44 71
2330G1N4j47J72k0J9j07J28o6p6R7j16J00o7K16j76P3l88K41K8O2l95L11N9k55
$$ 71 125 -22 150 130 149 42 170 104 28 125 9 109 42 258 82 155 -233 8 36 98 -297 14 73 -182
2354a82J47p2Q4j48J82R1k9k83J85j05O7R7j89O2l7J19QR8j91p5K37m7k22M15
$$ -182 -35 -107 -23 -171 11 102 73 -210 -25 -130 -63 34 -155 -93 -130 -11 -3 95 -96 -171 66 19 -203 212
2378B12k8l07O2J55k59j05K03J8J06q7J70l00J03J51j44P0K6l9j68K22O5j1K2
$$ 212 184 -123 -61 94 -165 -270 -67 -49 57 -30 140 -160 -57 94 -50 20 46 7 -161 61 126 115 137
2401A37L0k66n8K02j30J87k2rL8L2k76Q4J13j37q8M26k36j86n8K86j39o8J97k47
$$ 137 167 -99 -157 45 -85 102 80 71 109 141 -135 -51 62 -75 -163 263 27 -159 -217 69 -70 -138 59 -188
2425a88J85P7J4Rj02K9J09q8M4R5j09r9K2O0L59j48pj98k12R7J41M2l11J08RK94
$$ -188 -3 74 88 97 -5 24 133 45 89 184 75 -24 -2 58 417 269 262 64 -148 -51 90 132 -179 -71 -62 232
2451B32l65J61J19L3j49L7J31k02P5o7P2m8L7M3l08M69k33o3Q7K3O9k16J02k17
$$ 232 -133 28 147 180 31 68 199 -3 72 5 77 29 66 109 -199 270 37 -26 61 84 153 -63 39 -178
2475a78L49k27J54on22N07Pqj14P2J16k07J5J38j37j29K42J5j83R4n8p9k1L42
$$ -178 171 -56 98 92 -430 77 84 76 -38 34 150 -57 -42 96 -41 -170 72 87 -96 -2 -60 -139 -160 182
2499A82k78J20q3M9m7nj17K93j70n9K70j61l7j78K26j71J29k0r5L61l35O7M09
$$ 182 -96 24 -59 -10 -57 -62 -179 114 -56 -115 155 -6 -43 -221 5 -166 -37 -57 -152 209 -126 -59 350
2522C50k27k86K29k05J20J96k29J56j04J16j87K23j07kJ62k04l5q2K61r2k7J59
$$ 350 123 -163 66 -139 -19 177 -52 104 0 116 -71 152 45 43 205 1 -34 -116 145 53 26 185
2544A85j21m8k9P9j27K5J13J4k63J1K22R6m01MN18l14j02L26q5J32k22J88j63
$$ 185 64 16 -13 66 -61 -36 77 91 -172 -161 61 157 -244 -240 278 -36 -138 188 103 235 13 201 38
2567C8j13J20L94m34q1OM2j96Q4J73K2lONm6j03R6J97l54j65J22K65p7J12j51
$$ 38 -75 45 439 5 -76 -70 -28 -224 -140 33 55 52 58 63 17 -86 10 207 -147 -312 -190 75 -2 110 -41
2592d1j54K9L70j88j96K49j6j49J40M1j50j34K13l5j67J86l99O20j15j48p6KM40
$$ -41 -195 -166 204 16 -180 69 53 -96 44 85 -65 -199 14 -21 -188 -2 -401 219 104 -44 -120 -118 322
2615C22m96K95r0LJ14j78J26j0k97N4L63k10K25k17M0r3K5n2J22q0M7q9j3l9J67
$$ 322 -174 121 31 34 148 -30 96 86 -211 -157 206 -4 221 4 44 -49 -24 -76 46 -34 13 -76 -89 -128 39
2640C9j1M5j3Q3n0j66k19N44j71j23N6r0Q3J48K5j64k15J89m7K82k0l28K97r8
$$ 39 28 73 60 143 93 -73 -292 252 81 -42 14 -76 7 155 180 16 -199 -10 -57 225 205 -123 174 76
2664G6o0j60PK45j55J32n4j17n2R5R1L2m9k44L02j77J01R6K9q8kl7j15J5J85k41
$$ 76 16 -144 -137 108 -47 85 31 -86 -138 -43 48 80 31 -213 89 -88 13 109 138 50 48 11 -104 -89 96 -145
2690a45J19M8l06L46Pl5K9J5j46m8K1O2O9L9J1n3J04q8M7l24L56j06Pn9r0J55
$$ -145 -26 22 -284 62 69 34 63 78 -68 -116 -95 -33 36 75 86 33 137 49 96 -228 128 22 29 -30 -120 35
2716C5k85J63k71M55j76Q6P5J97k05p7N8M2j43J28m2J46j93K73o5k27p3J14j26
$$ 35 -250 -87 -358 97 -79 7 82 279 74 -3 55 97 -46 82 40 186 -7 266 201 -26 -99 15 -111
2739a11J15k17J49k96J43K74l83N23K5r6P4k39P1n7J32j5R7k77J79J13l43L63
$$ -111 4 -213 -64 -360 -217 57 -326 197 222 126 200 -39 32 -25 107 92 189 -88 91 204 -139 224
2761B24J2l00K10j40o7L16l07J37m58K59l8J7K05j83M9L67k04O4k21J6k2L3K11
$$ 224 236 -64 146 6 -61 255 -52 85 -373 -114 -152 -135 70 -113 -64 303 99 163 -58 -42 -64 -31 180
2784A80Lq5k19J20J01j74L90l29mK2j10J03K49n03J01J50J67j76J16j1k25K89
$$ 180 183 98 -121 -1 100 -74 316 -13 -17 5 -105 -2 247 -256 -155 -5 162 -14 102 91 -134 155
2806A55j29O0o5k78J22K03j82J86j95J37j95L44Q9k88K3q8K47J6j22M6q4L5j63
$$ 155 26 86 21 -257 -135 68 -114 72 -123 14 -181 163 252 -36 -13 -101 146 162 40 86 2 37 -126
2829a26J31l65L67j43K25k01r8K25J61j63M24o06K22j20l9J88k44K86j43J64r
$$ -126 5 -360 7 -136 89 -112 -210 15 176 13 437 -169 53 -67 -106 82 -162 124 -19 145 136
2850A36j09r4J68J64k27j16j18M45j41j66J17J81m29J98k89J92J24k4J52k00j08
$$ 136 27 -67 101 265 38 -78 -196 249 108 -58 59 240 -189 9 -280 -88 36 12 164 -36 -144
2871a44K2LO8p9J76n6L1J45j70N4M7J33p7j41R3j24k54L24q0R5ko4j01L7J21K6
$$ -144 -122 -119 -51 -130 46 -10 21 166 -4 50 97 230 153 12 105 -19 -273 51 -29 66 64 0 -101 -64 57 83
2897H3k55J06j62K14K81k09Nj26j80j29L51J27k33J09M9j19L02p6m18L52l7J91
$$ 83 -172 -66 -228 -14 267 58 63 -63 -243 -372 -21 106 -127 -18 31 -88 214 138 -280 72 35 226
2919B26l7k63K34l1j54q6n5l2L6J7L25J29k66k45N5Q4j56j5M02k94RJ79K1nq9
$$ 226 189 -74 160 129 -25 -111 -166 -198 -162 -145 180 309 43 -202 -147 -63 -219 -234 168 -126 -117 62 83 78 -11
2944a1p8q2J13K02j84M1j09P2M6j08J60j64J61k51P6j4j3J73J02m5m7K02K4j41
$$ -11 -89 -171 -58 144 -40 1 -108 -36 10 -98 62 -102 59 -192 -116 -130 -143 30 132 87 40 242 266 125
2968A25L2l21O0K56j57j30K42k13P5J03k15P3J26np7J16j66J16k83L8K24j03J91
$$ 125 157 -164 -104 152 -5 -135 107 -106 -31 72 -143 -70 56 51 -26 90 -76 40 -243 -205 19 -84 107
2991A07J00j19r6j13j7K58r0j71K49k0K0Q3k83J4m7P7q7J05q5J15j33L99l78N3
$$ 107 207 88 -8 -121 -138 120 30 -141 108 88 108 191 -92 -78 -125 -48 -135 -30 -115 0 -133 266 -112 -59
3015e9N2k06J83K96l99J72j0J85k67l1J39j09L6j85K91J29k26k7K10k06J15j40
$$ -59 -7 -213 -30 266 -133 39 29 214 -53 -84 55 -54 -18 -203 88 217 -9 -36 174 -32 83 -57
3037e7q2j20L40q6j26L34k26j99L90k46k9M67k48k83N25k46k36mL40l48o3K60
$$ -57 -139 -259 81 -5 -131 203 -23 -222 168 -78 -107 360 112 -171 354 108 -128 -132 208 -140 -203 57
3059E7j77J31K46m13M0K53l49K32q0J58n3m9k89L91j41M4m8K48r3K27l05j6J24
$$ 57 -120 11 257 -156 -116 137 -212 20 -60 98 45 -4 -293 98 -43 1 -47 201 108 335 30 14 138
3082A38lj37p5O7N8%j6J7l8K27n9k16P3K38j96J16k85L18l31m60N33j46M38P0
$$ 138 135 -2 -77 -10 48 48 32 49 11 238 179 -37 36 274 78 194 -91 227 -104 -564 -31 -177 261 331
3106C31l03P5o0J08j64L77o45K95j5RR5j37Nj82Q9l5K90j92O2j26Q4r9K48l1J34
$$ 331 28 103 43 151 -13 364 -281 14 -1 8 103 -34 -29 -211 -122 -157 133 -59 3 -123 -39 -138 110 79 213
3131B13r2k16j04K87j44%j97K1L02n7k06Q4k54K93j44M29j53l5J07N7j20J8j08
$$ 213 121 -95 -199 88 -56 -56 -253 -232 70 13 -193 -109 -363 -70 -214 215 62 27 134 191 71 89 -19
3154a9k40K27J19J27k05k40N15l93J47p8J30p6k23J37k54N21k69J16jK29l08k7
$$ -19 -259 -32 87 214 9 -231 284 -109 38 -40 90 14 -209 -72 -326 195 -74 42 41 270 -38 -65
3176f5J1K98k94J46L2k72J79J7K8m45O12k77j48MJ33N3KK3n1O4j31R4J74j89L8
$$ -65 -54 244 -50 96 128 -144 35 52 80 -365 247 -30 -178 -174 -41 12 14 37 -14 50 -81 13 187 -2 36
3201C6j1P1O5l01K57j47J52k80M9L08j92J1l06J70J88j08l5p2k2L99p6p5j92P9
$$ 36 25 96 161 -140 117 -30 122 -158 -109 199 7 18 -288 -118 70 -38 -73 -145 -167 232 156 81 -111 -32
3225c2K65m24J23k8R3L9K42j52j56K22J78m06P4J13k27J14j58J04J02j67O7L8
$$ -32 233 -191 -68 -96 -3 36 278 126 -30 192 370 -36 38 151 -76 38 -120 -16 86 -81 -14 24
3247B4p6j44L8J55k0P8N6j31J27k00r4J18j07L11K6l89J16q4L50Pj54p4j0J85
$$ 24 -52 -196 -158 -3 -23 55 111 -20 107 -93 -187 -69 -176 135 161 -228 -112 -196 154 161 7 -67 -77 108
3271A08k5k38K89k41L6p7K31j09n3pK48k55M74k69j81OJ24j58O2q1K48n2N0k74
$$ 108 83 -155 134 -107 -71 -148 83 -26 -79 -86 162 -93 381 112 -69 -63 61 -97 -35 -116 132 80 130 -144
3295a44JR5L15k01l0j15q8K08J44l39m7L09l1r0j15K07q7J68q9J9p3J43l43K44
$$ -144 -143 -48 267 66 36 -79 -167 41 185 -154 -201 108 77 -13 -128 79 -8 160 71 90 17 160 -183 61
3319F1j29J29l69J88J99n2k5J44j64r5n6O7J32L26l89M0K05j35J14m33M33j61
$$ 61 -68 61 -308 -120 79 27 2 146 -18 -113 -169 -102 30 356 -33 7 212 77 191 -242 191 30
3341C0J72n5l18K53l08K13j9l0R7j79L46k41J78r8p5j21NK33j74j31L10L2K6p6
$$ 30 202 147 -171 82 -226 -13 -32 -62 35 -144 202 -39 139 41 -34 -155 -150 83 -91 -222 88 120 146 70
3365G0k86J66n1K34k33L7r9K33kj26j02K73L6j06N6Q1j8j62Q2N4j12N0k09M3N8
$$ 70 -216 -50 -101 133 -100 -63 -162 71 69 -57 -159 114 150 44 100 181 163 1 83 137 25 75 -134 -91 -33
3390c3r5L7k29L86j12q0K34k85n0K83J7j80N6Lj57J81k73L60l4J67l8n8P5j57
$$ -33 -128 -91 -320 66 -46 -126 108 -177 -227 56 73 -107 -51 -48 -205 -24 -297 63 29 196 158 100 175 18
3414A8J99k44J4J70j70J53l57L83ol28J38l5K59k55O0J08J40j79K4J06j78J1L
$$ 18 217 -27 -13 157 -13 140 -217 166 160 -168 -30 -65 194 -61 -1 107 247 68 92 198 20 31 34
3437C4L01k93pRk18J15o0J11J99L8k77r4J98k04L9R6j28L06k3n4j46jJ57m90L15
$$ 34 335 42 35 44 -174 -59 -119 -8 191 229 -48 -142 56 -148 -109 -13 -141 165 142 88 -58 -59 98 -392 -77
3462g7J00m5L3J07k53j3L59l68J12J83k52O2N4k09L4J77K93j41p7n5j36K22j68
$$ -77 23 -22 11 118 -135 -148 211 -157 -45 138 -114 -52 2 -207 -173 4 297 156 79 24 -112 110 -58
3485e8R6P5j38j0K2k39J92K40l1q2j54L0K18n6j25R6j38k67M79J73m73L77k97
$$ -58 38 113 -25 -35 -13 -252 -60 180 149 67 -87 -57 161 105 -20 76 -62 -329 150 323 -150 227 -70
3508g0J02j71O8n4Q9J26m42K66K96j23J50r1p0k43K22k8K8J48k67J86j90J3j58
$$ -70 32 -139 -71 -125 -36 90 -352 -86 210 87 237 146 76 -167 55 27 55 203 -64 122 -68 -55 -213
3531b13K31j7J28N3l34k2L62lk71M5Qj1j82K29Pj52K20k6n3j68K56j58j07K05
$$ -213 18 1 129 182 -152 -174 188 185 -86 -41 -33 -44 -226 3 10 -142 78 52 -1 -169 87 -71 -178 27
3555B7j87K74k11j00K55O6k84L88k14J35k98K47rl49R9J93J4j82K53k08J74l13
$$ 27 -160 114 -97 -197 58 124 -160 228 14 149 -149 98 89 -260 -161 32 46 -136 117 -91 83 -230
3577b30J14J02J2L2k0J37j56N4K01m8m9m5l4r5l1K35j62J2j73K14j80q1L30j23
$$ -230 -116 -14 -2 30 10 147 -9 45 246 198 149 104 70 -25 -56 179 17 29 -144 70 -110 -191 139 16
3601A6j9l9k9R3L5j64K81k04K58n1j38j00J69J2J15k98k4L18j40J74l33j29m8
$$ 16 -3 -42 -71 22 57 -107 174 -30 228 177 39 -61 108 120 235 -63 -87 231 91 265 -68 -197 -245
3624b45m4K27l8J69j79R2nm9K8j62J15K84m3j93N0J65j25o8K19n51L97J03l88
$$ -245 -289 -62 -100 69 -110 -18 -23 -72 -44 -206 -91 193 150 -43 7 172 47 -21 198 -353 44 147 -241
3647b41J70O3j02l6j90J04K22q5j29P1K10k22L42q5j62j77L17j4R5j49j7j2k5
$$ -241 -71 -8 -110 -146 -336 -232 -10 -95 -224 -153 57 -165 177 92 -70 -247 70 56 151 2 -15 -27 -52
3670e2q7qK42k05P6l3k9Q2k7K60k96K13J01j69j04J24j71N5K64R0o66Q5L14k79
$$ -52 -139 -147 95 -110 -34 -67 -96 -14 -41 219 -77 136 237 68 -36 88 -83 -28 236 326 -340 -255 59 -220
3694b20L19q2j11O7K0J87l01l7J60J07lN6m35K96J41l48M2J95r3N3j7j25P2QK8
$$ -220 99 17 -94 -27 -7 180 -121 -158 2 109 106 162 -273 23 164 -184 -142 53 -40 13 -4 -129 -57 -49 -21
3719b1R9j16j0Qj45J62J9L5j91K35j16P6j13L7J05k37J54k1L1o7N7P6J82l81K79
$$ -21 78 -38 -48 -40 -185 -23 -4 31 -160 75 -41 35 -78 -41 64 -173 -19 -40 -9 -76 -19 57 239 -142 137
3744A37k85K40l9o8P9k60nJ22m3J28L2k39K60R3j02R9j11K55l38K6m9J04RJ18
$$ 137 -148 92 53 -15 64 -196 -201 -79 -122 6 38 -201 59 152 50 149 38 293 -45 -19 -68 36 45 163
3768A63k50P4k8n2J05n5k3m6J67l25L10j49K87j03K5l9pQ0j05J3j76Q4J74k66
$$ 163 -87 -13 -41 -93 12 -43 -66 -112 55 -270 40 -109 178 75 100 61 54 134 29 42 -134 -50 124 -142
3792a42J0L39k98P7k21jJ53j26K94j13J48r0K64k48l69L17r3L16m56P1K10kj99
$$ -142 -132 207 -91 -14 -235 -236 -83 -209 85 -28 120 30 294 46 -323 -6 -99 217 -239 -168 42 40 -159
3815a59J59nK3P5k40K67M0k70K06nk4j47j2j3K11k21J68l3Q5p4p0J84m15K03M
$$ -159 0 -5 18 93 -147 120 160 -110 96 91 67 -80 -92 -105 106 -115 53 20 105 31 -39 145 -270 -67 -63
3840f3J55j20j00J65k22K00k79L20N2J46l4n10L20N7k67J84j9pJ8R7j23O2J66
$$ -63 92 -28 -128 37 -185 15 -264 56 108 254 220 -290 30 87 -180 4 -15 -22 -4 93 -30 32 198
3863A98p1j83l5J08m3J52j25NN8P6P0l49Q1J80q8m6N3K6l0KN7Q3m71J20L87k80
$$ 198 127 -56 -91 17 -26 126 1 6 64 140 210 -139 -58 122 34 -12 41 67 37 39 96 179 -292 -172 215 -65
3889f5J63k94lL6J19J19RJ41n58L62k37L10l16k7K65M3j97pK33N5j89J80J52k3
$$ -65 98 -196 -199 -163 -44 75 84 225 -333 29 -208 102 -214 -241 24 67 -130 -137 96 151 -38 142 294 271
3913B71l40J77j52LP5k02m3P9K52k0j10p2K39j98K08k95J44j07J65J29j93J7j
$$ 271 -69 108 -44 -41 34 -168 -211 -132 120 100 -10 -82 157 -41 167 -128 16 -91 74 203 10 27 26
3936B6j5q4J81j94J06r4L13j46J20j31n4j66j23M31j77J01k24K16m9Q4k34K8J90
$$ 26 11 -73 108 -86 20 -74 239 93 213 82 28 -138 -261 170 -7 94 -130 86 37 121 -113 -85 105
3959A05j64K6j93L81j78O2j65K88N3j08r2O9Q4k76J67r2L0o0j97L98j93R2j35
$$ 105 -59 -33 -226 155 -23 39 -126 162 215 107 15 84 168 -108 59 -33 -3 -63 -260 138 -55 37 -98
3982i8q8K44j43J00Qr3K15o9r9r1K06J62m34J53J16J09n4J12p5m00p1R0R5j39
$$ -98 -186 58 -85 15 23 -70 145 76 -23 -114 92 254 -180 -27 89 198 144 256 181 -219 -290 -200 -105 -244
4006b44J45J50o3j10R7j39J62l70K75Q2Nk41M05j05R2j54j30L4K29j75p4L98m91
$$ -244 -99 51 -12 -122 -25 -164 -2 -372 -97 -15 -10 -251 154 49 141 -13 -143 -109 120 -55 -129 269 -222
4029b22O3K6J17L30l14k87K38O7K63l81J26r1J17J49p5j60j72J53j00J9J92r5
$$ -222 -159 -133 -16 314 0 -287 -49 18 281 -100 26 -65 52 201 126 -34 -206 -53 -153 -134 58 -37
4051c7K6L7K19j88oj84J49o9J42j47K02K17l73o4O5K31n76L51p2J19j15J64Q1
$$ -37 -11 26 245 57 51 -133 16 -53 89 -58 144 361 -12 -76 -11 220 -356 -5 -77 42 -73 91 172
4074A72q1nj63j3L4P0Q2k61J84P0l8l11K11k2o7M08l44K4L9K4m04P12j53k47J96
$$ 172 91 86 -77 -90 -56 14 96 -165 19 89 51 -260 -49 -71 -138 270 -74 -50 -11 13 -391 321 168 -79 117
4099A17m2j60L10k7l66J06Q0%r2K65L0k08K5nQ1k92L55k68J36J84j94j91J43J75
$$ 117 75 -85 225 198 -168 -62 18 18 -74 191 221 13 38 33 114 -178 177 -91 45 229 35 -156 -13 162
4123A62l36J9K09N2J8j04JJ21j14j7k37K47M0M3l7l5nJ11j89N4k19K27p4j20J94
$$ 162 -174 -155 54 106 124 20 21 142 28 11 -226 21 61 104 67 32 27 138 -51 3 -216 11 -63 -183 11
4148A1j16J78l3m5Ll4j38J60p2P0J95k43LJ54j38R9O5j16j62J84J46k01j58K46
$$ 11 -105 73 40 -5 -2 -36 -174 -14 -86 -16 179 -64 -61 93 -45 54 119 3 -159 25 171 -30 -188 58
4172E8M9l29p6K50Rj00M6J19Oj2Q6o7m1j17R8j35K12j23J28k93L70j01j0j35Q
$$ 58 107 -222 -298 -48 -39 -139 -93 26 32 20 106 39 -2 -119 -21 -156 56 -67 61 -232 138 37 27 -108 -100
4197a00J90j54L43p44O62j94j77K24p6J82R8m06J6J46j20N7N6K15l75j76M3L32
$$ -100 90 -64 279 -465 197 3 -174 50 -26 156 254 -152 -136 10 -110 -53 3 218 -157 -333 -290 42
4219D2J8L1Q1p7k76J87j12O2Q6J07Nk7l20L05j87O03m87j11R1q2J23l63M0K43
$$ 42 60 91 172 95 -181 6 -106 -44 42 149 154 127 -193 112 -75 528 41 -70 21 -61 62 -301 -261 -18
4243a8K97j83O9o5k26p3J49n4J92j94L2K7K88j58j33K13j78Q1l15M65k05k60K45
$$ -18 279 96 165 100 -126 -199 -50 -104 88 -106 -74 -47 241 83 -50 163 -15 66 -249 216 11 -249 -4
4266dJ88k24l0J69j57k7m3j16N31l88K73l67N8J96j26j62L80k46K01m5O0k02p2
$$ -4 184 -40 -70 99 -58 -85 -128 -244 287 -101 172 -195 -137 59 -67 -229 151 -95 106 61 121 -81 -153
4289a53J40MO6j7K24l65K23l21M4P0J67j44L4K8J33j54j02J25K44j77j53K17j99
$$ -153 -13 -9 57 40 264 -101 122 -199 -155 -85 82 -62 -28 0 133 -21 -123 2 246 69 -84 133 -66
4312f6K51j33n6j54M4J95Po9M8p2J92k7k39P6J31k41P1J93r9j60M2P6j69J72j33
$$ -66 185 52 -4 -158 -114 81 88 19 67 -5 187 160 -79 -3 128 -113 -42 151 52 -108 -66 10 -159 13 -120
4337a20j53M63l57K98k51J94R1j18j24K17k12l3K79R1q9k37P4m1J23j97J3P3l19
$$ -120 -273 190 -167 131 -120 74 165 47 -77 140 -72 -105 174 265 176 -61 13 -28 95 -102 -89 -16 -335
4360c35L50m7K75l90J18Q9J1l51L52k08J53Q9k84K38j4m6l0M4l00J81n7L35l16
$$ -335 15 -32 243 -147 -29 60 71 -280 72 -136 17 106 -178 60 46 0 -30 14 -286 -105 -162 173 -143
4383a43K48J81l23N2j37J62j28L5O0L3n11J18L93l16K00l40N81j66J64k25N8J95
$$ -143 105 286 -37 15 -122 40 -88 -53 7 40 -471 -353 40 -276 -76 -416 165 -1 163 -62 -4 191
4405A91n1J3j87J31m1kk51K1J24M3l39K02K91j61K77m98J41KJ23R9k09k9L7M0
$$ 191 140 153 -34 97 56 54 -197 -176 -52 -9 -348 -146 145 -16 261 -237 -96 -94 29 128 -81 -110 -73 -33
4429c3m6P1QR9J1J65l69J07k3Q5P8q1J6m8k80K46k6J50k32p6Q8L5J89k27l4K16
$$ -33 -79 -8 0 99 110 275 -94 13 -10 75 153 72 88 40 -240 6 -20 130 -102 -178 -90 -55 134 -93 -127 89
4455H9j32L78j55l06J60K1l21J46Q0J65l00K5J15q2Q1p3M9K74k84J26J71k63N1
$$ 89 -43 335 180 -126 34 55 -266 -120 -40 125 -175 -150 -35 -117 -36 -109 -60 214 -70 56 227 -36 15
4478A5j78J33J53Q1j95j25O6J3L11m34J9K68j27L5m0P5j51J25j42R7J39j87k07
$$ 15 -163 -30 123 204 9 -116 -50 -37 274 -160 -141 127 0 35 -5 70 -81 44 -98 -1 138 -49 -256
4501b56J22O7P8O0N6l54J58J19n7M1J81k26K66l40j64J92Q9j89P7k06K18K79k94
$$ -256 -134 -67 11 71 127 -227 -69 50 -7 34 215 -11 255 -85 -249 -57 32 -157 -80 -286 -68 211 -83
4524h3K98j61j35K82j93J45P4j83n7j01K57l61J10K4J60p7K5J9L8k0j84J98J70
$$ -83 215 54 -81 201 8 153 227 44 -13 -114 143 -218 -108 -84 76 -1 24 43 81 61 -123 75 245
4547B45k01j95L43l01N9o2K84l05QJ17j81M64m05j81J15p9M61P8l73J08k07M61
$$ 245 44 -151 192 -109 -50 -112 172 -133 -125 -8 -189 275 -130 -311 -196 -275 186 264 -109 -1 -208 253
4569B53q5k44p1K54K6l42K80j37Q8K12l37K21P6k05o7%p5j9J74q6q6L92m48R3
$$ 253 168 -76 -147 107 133 -209 71 -66 22 234 -103 118 194 -11 -78 -78 -153 -172 2 -84 -170 222 -226 -133
4593a33q0K95o2K56p4l16J55o1J53l54K81on1q7J99k21J97k28J34j08J62j08j54
$$ -133 -213 82 20 276 202 -114 41 -20 133 -221 60 54 3 -84 115 -106 91 -137 -3 -111 51 -57 -211
4616b11K70k0L3jq4K53j96J32r1k24J47n5L3J31j47k3j67K26o7K61r8p2j50R1
$$ -211 59 39 72 71 -13 240 44 176 85 -139 8 -47 -14 117 -30 -53 -220 6 -61 200 102 30 -120 -29
4640b9q8J17l7q0k96L06J30j00l2L66j60k73J12m7O3LJ53k95K08O4j88K79k18
$$ -29 -117 0 -37 -117 -413 -107 23 -77 -109 257 97 -176 -64 -111 -48 -45 108 -187 21 85 -103 176 -42
4663d2J3L13l16j56J62j05K69j31q1Mp3K89q9J2j59m5m6J09J72q4j15K16Q0k69
$$ -42 -29 284 -32 -188 -26 -131 138 7 -74 -70 -143 146 57 69 -90 -135 -181 -72 100 16 -99 117 197 -72
4687g2pR3L13l19QO6J13k14J16J98n93K72K52n9j09k45K31J3j11N7j14K91q7N4
$$ -72 -79 14 327 8 16 82 195 -19 97 295 -298 -26 226 167 58 -187 44 57 -54 3 -111 180 93 147
4711A47l3k24j27K57n2r3j57O7L77j91L9l9K57k43k68L36p6K17k52O9R3j60J36
$$ 147 114 -110 -237 20 -32 -125 -282 -215 162 -29 10 -29 228 -15 -283 53 -23 194 -58 11 104 -56 80
4734H0J84j92J81k04k49L25j28L3k6O1p2O6L6m9j12K96j97o1k17L99j96K9M8j62
$$ 80 264 72 253 49 -200 125 -3 30 4 65 -7 59 95 46 -66 230 33 -28 -245 154 -42 -13 35 -127
4758a27Q9J85p7N0o8j26K08l13m0K82j29P1R3j63N6Q1j27j00L8K13k25O4K4J5
$$ -127 -38 147 70 120 52 -74 134 -179 -219 63 -66 5 98 -65 -9 72 -55 -155 -117 96 -129 -65 -41 -26
4782b6oJ31j84K44j65j9o1J02J90q2j68Ll0J42q0p3J46l7j41J14J08k45N1r4M8
$$ -26 -32 99 -85 159 -6 -25 -86 16 206 124 -44 -41 -71 71 -9 -82 64 27 -114 0 108 -137 -86 -180 -132
4807a32O9J33L6o5Q1m97K16J47o3K6J00j6k71LL11JJ30j76r0L13j27k44l4J39
$$ -132 -63 70 106 41 122 -375 -159 -12 -75 -49 51 35 -236 -233 78 79 209 33 -57 256 129 -115 -149 -10
4831a0Q5j81p4J17J18M3j5j14l4m1K06N3l74Q3J35p1J09j47q7L5O1k18L45j1j84
$$ -10 75 -106 -180 -63 55 98 83 -31 -65 -106 100 153 -221 -138 -3 -74 35 -112 -199 -164 -103 -321 24 13 -171
4856a71J60k01J83o3J71j97q7J03J78l9o2K14k64nL0K38o5o2p5J47l37K73m22
$$ -171 -11 -212 -29 -92 79 -118 -205 -102 76 37 -25 189 -75 -80 -50 188 123 61 -14 133 -204 69 -353
4879c53M67k09J13K09k06k69K65M7j16L1j9K07j41kn7K08r8k95K17j89K23Q4m9
$$ -353 114 -95 18 227 21 -248 17 64 -52 -21 -40 167 26 24 -33 175 77 -218 -1 -190 33 117 68
4902F8K0j48J30l9j64N2K34j12P6j1l62L51k39J21l0J77p9r3l1L19k45R4QQ4k17
$$ 68 88 -60 70 31 -133 -81 153 41 117 106 -256 95 -144 -23 -53 124 45 -48 -79 240 -5 89 97 181 -36
4927c6M1o6J10L14l72N2j95R1J18j4o2j6r8K95j06j26k06J19J86k41J20L78k33
$$ -36 5 -61 49 363 -9 43 -152 -61 57 43 -19 -35 -133 162 56 -70 -276 -157 29 -212 -92 286 53
4950E3j19j43K19J2l18L89Pj47j05L41l30J11j57K18O4J1j75L23m66M39k1k64
$$ 53 -66 -209 10 22 -296 93 100 -47 -152 189 -141 -30 -187 31 95 106 -69 254 -212 227 206 -58
4972e8K1OO9O1j60M5m2K19n1J2O2k32l67M80j16J38j69J7L84l57rq6J54Q5k75
$$ -58 -37 -31 38 99 -61 -16 -58 161 110 122 184 -48 -415 65 -51 87 -82 -65 319 -38 -47 -133 21 106 -169
4997a69J36k95M49j08O7p9K28l28K18j47P5m1J8k67M21j1n10L95J14l18n1L88
$$ -169 -33 -328 121 13 80 1 229 -99 119 -28 47 6 24 -243 178 167 -343 52 166 -152 -203 185
5019A85l92K41m3QJ63k75K72l34J96J53k00J01j1P7l56K06K94n3j88j50O5k10
$$ 185 -207 34 -9 -1 162 -113 159 -175 21 174 -26 75 64 141 -215 -9 285 232 44 -106 -41 -251
5041b51O8J97l2j60PP6MK17j39m9J23N4L0m59J15L17j91k4O3Q8j72J1M2Q2p9J03
$$ -251 -183 14 -18 -178 -171 -95 -91 126 -13 -62 61 115 145 -314 -199 118 -73 -97 -34 54 -118 -107 -65 17 -62 41
5067D1o3j00J36J02l24J63P6M5J12j41j41K8J95l05K03O9Kj38N0n8Oj41J11J66
$$ 41 -22 -122 14 116 -208 -45 31 76 188 47 -94 -66 129 -176 27 96 98 -40 10 -48 -42 -183 -72 94
5091I4R4j03k65mK81R5j88QJ44j38k6o3j0J30pl36J74J92r0R6j41L7j64J16j09
$$ 94 188 85 -180 -184 97 192 4 12 156 18 -8 -71 -81 49 42 -294 -120 72 -18 78 -63 -26 -190 -74 -183
5116a83J47J30L7J82k99j16J32k79K0K73p2K12k50J85l2j45J53o0Q9k56o8K83
$$ -183 -36 94 131 313 14 -102 30 -249 -229 44 -28 184 -66 119 87 -58 95 35 124 -132 -200 83
5138H3l0O8l77K63J38Pj9L2k45Q4l33K37j43J42k9J66k99K54J68k17J50l09K61
$$ 83 53 121 -256 7 145 152 133 165 -80 4 -329 -92 -235 -93 -122 44 -255 -1 167 -50 100 -209 52
5161E2J90j05l34L21k19L80o75L67k25J33J9l57N78l89K95K24j61Q8m81N90l27
$$ 52 242 137 -197 124 -95 285 -390 -23 -248 -115 -96 -453 125 -264 31 255 94 182 -299 291 -36
5182c6J79j02l1l7Q4l2J60l72K71J0k64J33k53L85j19l8J81j41J2j79J84j72J20
$$ -36 143 41 10 -27 57 25 185 -187 84 94 -170 -37 -290 95 -24 -62 119 -22 -10 -189 -5 -177 -57
5205e7L9p9J26q5m1M0J95mo3J9K0j1j44K37m05J25R0R9o9k12Q9R6r5o3J94r1J39
$$ -57 -18 -97 29 -56 -97 -57 138 134 71 90 110 99 -45 192 -213 -88 2 101 32 -180 -91 5 -90 -153 41 -50 89
5232H9j58J63l14O9K08o0Q5L6k32J87l0j3j63M44k79K47l13j10J5J08J88m16Q1
$$ 89 -69 94 -220 -151 57 -3 82 118 -114 73 43 30 -133 311 32 279 -34 -144 -129 -21 167 -249 -168
5255a68j75L02Nj76N46j80k30K42l17N6J2L00j05j53q5K63o3J23k39K41j74k51
$$ -168 -343 -41 -36 -212 334 154 -76 166 -151 -95 -83 217 112 -41 -126 137 74 197 -42 199 25 -226
5277b26M41k36q3M5j27J82j36J51r9lR8M3k35M3J88j27J41l00J42J85o6P3j37
$$ -226 215 -21 -104 -59 -186 -4 -140 11 -88 -91 7 50 -185 -142 46 -81 60 -240 -98 87 21 94 -43
5300d3K79m15Q1J25M6p9j4O7j46j71R5J63k0J27M5j76k53K71l3KJ27j06J73j39
$$ -43 236 -179 -98 27 73 -6 -20 47 -99 -270 -175 -12 -32 95 140 -36 -289 -18 -51 -49 78 -28 145 6
5324FOM3k10K4M7J05j29M54k11j28k4l99L41K05k64J98L6O5m54L6J34O8P2j28
$$ 6 12 55 -155 -131 -84 21 -108 346 135 7 -17 -416 -75 130 -134 64 100 165 -289 -253 -119 -51 21 -107
5348a07L8J83j00l7J49j38Q5k1k59M62k92l2J60l87L25J2J98j67k63L03k42K69
$$ -107 -69 114 14 -23 126 -12 73 52 -207 255 -37 -69 91 -296 29 41 239 72 -191 112 -130 139
5370A39j09k91L29j61K36k27K28j31J54k14j9J23j77K94j58J52k00J08J35k90
$$ 139 30 -261 68 -93 143 -84 144 13 167 -47 -66 57 -120 174 16 168 -32 76 211 -79
5390g9q8K61l27L13m44K14J56K28j90M3j96J96j23l58L46J20p0J96l20L16q1k96
$$ -79 -167 94 -233 80 -364 -150 6 234 44 87 -109 87 -36 -394 -48 72 2 198 -122 194 113 -183
5412a83L46j07o1J96j47j14L30j63KL2j18J25n9J21k23J99K3j23j69K9J72P6k45
$$ -183 163 56 -5 191 44 -70 260 97 99 131 13 138 79 200 -23 176 199 76 -93 -64 108 184 -61
5435f1J01J1J13q3Kl00J41L13n78K75q4K93k83N1j22M09p8o0N4j8nk20M0L5M5
$$ -61 40 51 164 81 83 -217 -76 237 -341 -66 -150 143 -140 -89 -211 198 120 60 114 96 91 -129 -89 -54 -9
5460iJ06N8r0j40Q7k20L10R1p3r1N2j08j2j13K92O9Q2j91p2O4k25K51p9j55J84
$$ -9 97 155 65 -75 12 -208 102 193 120 29 81 -27 -39 -152 140 209 291 100 28 92 -133 118 39 -116 68
5485F8J86l55M7q0K59j45J84k12j8m2M31l85N8j84L26k64J65k12K47r4N6l2k13
$$ 68 254 -101 -54 -134 125 -20 164 -48 -66 -108 323 -62 -4 -188 138 -126 39 -173 74 -20 36 4 -209
5508b09M24l99j19K21J80j91K19K0k12M0o1K63q9nj18J77j2j35N8r3j39m2J33
$$ -209 215 -184 -303 -82 98 -93 126 146 -66 -26 -87 176 87 82 -36 141 129 -6 52 -41 -180 -222 -89
5531h9K0J47O0k55M72l62n1J6j5J52k71J56j55M15j43j34l8ko2K5J64l30K10O9
$$ -89 -69 78 138 -117 355 -7 -58 -42 -57 95 -176 -20 -175 240 97 -37 -75 -77 -139 -114 50 -280 -70 -1
5555aL7j81J86l41M65j35r0J08R8j67n4J63j04j27J35k46M75k92k37K60l1n3R0
$$ -1 36 -145 41 -300 165 30 -60 48 146 -21 -75 88 -16 -143 -8 -254 221 -71 -308 -48 -79 -132 -42
5578d2L20l02J89l84K04j2J40l90L92l32J33J57q2q0J31J9P6P3k26J47k40P1p2
$$ -42 278 -24 165 -219 -15 -27 113 -277 115 -217 -84 73 -9 -89 42 61 137 210 -16 131 -109 -38 -110
5601a10j9J48M3J0L1j10o5M5R1J64k02j2J5J29q1m2N8r4j47M1k10J86p0J41j0
$$ -110 -129 19 62 72 103 -7 -72 -27 64 228 26 14 29 158 77 35 93 -1 -148 -107 -317 -131 -201 -60 -70
5626g0O7J1J16j55Mo9K16l08K82K66l94L3J67j10n4m9J60j38J86j77M8J42r4j47
$$ -70 -3 8 124 -31 -27 -96 120 -188 94 360 -34 -1 166 56 2 -47 113 -25 161 -16 32 174 80 -67
5650f7J54k64k5RK47OJ25l36j22M16l47K40lK7n1j05J36J39k84k9J67l2J64j49
$$ -67 87 -177 -202 -193 54 60 185 -151 -273 143 -204 36 33 60 9 -96 40 179 -105 -134 33 1 165 16
5674A6J95k88J40j92l2M9NR1R1j10J51n3j95J66M1oj64j02P8Q4N7L6K3k40q3K87
$$ 16 211 -77 63 -129 -161 -112 -107 -16 75 -35 116 63 -132 34 75 69 -95 -197 -119 -35 22 58 81 -159 -242 45
5700D5j46mL16l09J01j73K20k54J73K0j33n9R1J77j36j59K45J07J03k15P9j05
$$ 45 -101 -105 211 -98 3 -170 50 -204 -31 -11 -144 -203 -112 65 -71 -230 15 122 225 10 89 -16
5722a6o1l20N04k38J12J55r2j70J35J59jk20K89l62KL85j69l6k97M06j78j67K69
$$ -16 -77 -397 107 -131 -19 136 44 -126 9 168 167 -53 236 -126 -124 261 92 56 -241 165 -13 -180 89
5745H9K00j53j48K32j11j88o4q1L59O1j27M33m88n2o1qnK71j28k68K08r8Q3Q2
$$ 89 289 136 -12 220 109 -79 -143 -224 135 196 69 502 14 -38 -99 -107 -112 159 31 -237 -29 -127 -44 38
5769C8j95k6K7J20J46l3R0p7j94J27M9O9j38k70L09k25L04j02l38M2M01P6l19
$$ 38 -157 -183 -156 -36 110 77 167 90 -104 23 72 141 3 -267 42 -183 121 19 -319 -277 124 200 -119
5792a19R9r9K2R5j65J25J1K38j31j14KK1J00J52l74K25kr7K16l93K86j68N0m2
$$ -119 -20 -119 -97 -2 -167 -42 -31 207 76 -38 -36 -15 85 237 -137 88 86 -11 205 -188 98 -70 -20 -62
5816f2M3R4J09j59K58j86j65P2J85j09p9n7m8J13n6K45k35O4m5K1j18p3K51J30
$$ -62 -19 75 184 25 283 97 -68 4 189 80 1 -56 -104 9 -47 198 -37 27 -18 3 -115 -188 63 193
5840A93j86j36J67j58k8K10j15N2l0L6j02J61n5N3k8j61M71l30k4j59K20m4L0
$$ 193 7 -129 38 -120 -148 62 -53 -1 -31 5 -97 64 9 62 34 -127 344 14 -10 -169 51 7 37
5863C7j10N7K55l4p5L3j56Qp6r2j8J97p8K8K07l94R2J95j21O1J50k05Jq5K70N3
$$ 37 -73 -16 239 205 130 163 7 15 -61 -153 -171 26 -52 -24 183 -211 -119 76 -45 16 166 -39 -38 -123 147 200
5889B00j97Q4j58j44L61k96p8K97l74L85J42l55J08j17J00J47o8j77K28l22L62
$$ 200 3 87 -71 -215 146 -150 -228 69 -305 80 222 -133 -25 -142 -42 105 37 -140 88 -234 128
5910A28m77L54J1j83K63k69L07r4p2l5j43J20K08Q8k9l71J90o0j26K65j12J48
$$ 128 -349 5 16 -167 96 -173 134 40 -32 -67 -210 -90 118 206 177 -194 -4 -64 -190 75 -37 111
5932A11j02p2K9o5K56o7o0pj67J78J43k50K99m94O8L49P8p5q0q6p8J01q1KM9M9
$$ 111 9 -63 -34 -99 157 90 30 23 -144 34 177 -73 226 -268 -200 149 227 152 72 -14 -92 9 -72 -70 -21 28
5958B8j33J22K05l13l2J17o5J26j18P5R8J23l47J04KJ9K2o3N0J86j39J2k6k57
$$ 28 -105 17 222 -91 -123 -6 -71 55 -63 12 110 233 -114 -10 -8 11 33 -30 20 206 67 79 53 -204
5982b04K63k31K60k98J78j45J56J08k66L67j94J56l91M17j99J8k31O03l81R8J99
$$ -204 59 -172 88 -210 -32 -177 -21 87 -179 188 -6 150 -241 176 -23 -5 -236 367 -14 84 283
6003B83l02k04J55M2L6R3j32r2K67j56J10j61l27L49M6J15l00L66l25kK23P9p1
$$ 283 -19 -223 -68 -26 10 103 -29 -121 146 -10 100 -61 -388 -39 7 122 -178 188 -137 -139 84 163 92
6026I2k4o8j54l1M25k81n8Q3P9o8PL4q9j62J65J93k00K07k71J94J52j97r5J41
$$ 92 68 0 -154 -185 240 -41 -99 -16 63 -5 2 36 -53 -215 -50 143 -57 150 -121 73 225 28 -67 74
6050G4L5j62K30o8o7J55j6l98J5J96J35j10p8K6J7k07O9K11j64jj12K35j60J58
$$ 74 109 -53 177 109 42 197 181 -217 -202 -6 129 19 -59 -33 -16 -223 -154 57 -107 -108 -220 15 -145 13
6074A3J18N3j67rj72M3k15N34k00J31k93m6q7M43m0j52Q4J11j72J10J2j82K96
$$ 13 131 184 17 8 -164 -121 -336 198 -2 129 -164 -210 -297 146 106 -46 38 149 -23 87 99 -83 213
6097B13m26J37j01K32k9k39K45l03J36J36m06L30Q3J88l56p6K42j30j37K49P1
$$ 213 -213 -76 -177 55 26 -213 32 -271 -135 1 -405 -75 8 196 -160 -236 6 -124 -261 -12 59
6118E9k59PL14k18PK42r8r3O7j40J94j8k44L56j21j55N2n4RR9p5j19J42K3l0L3
$$ 59 -200 -193 121 -97 -90 152 54 -39 28 -112 82 64 -180 176 55 -100 -48 -102 -93 6 -69 -188 -46 -23 -53 -20
6144b0%j47L77k87r5K68l21K85j29K16Oj31j30L44j05j33p6P0j27n4Q9J59j27
$$ -20 -20 -167 210 -77 -172 96 -225 60 -69 147 153 22 -108 236 131 -2 -78 -8 -135 -189 -100 59 -68
6167f8J75l16Q6L8J29Nj4j1J23j63R6J5j87K15k66J89O0n2N8j74K31o8K0j32k73
$$ -68 107 -209 -123 -85 44 49 35 24 147 -16 80 95 -92 123 -143 46 106 54 112 -62 169 101 121 -11 -284
6192b84J49Q8K15j3k43J34O0r4O2L3J0k67J14J17l24J70K95l57J7P2JN7N1p6o9
$$ -284 -135 -47 168 155 -88 46 106 12 74 107 117 -150 -36 81 -243 -73 222 -135 -118 -46 -45 12 63 -13 -82
6217h2M37m50n1K70k55K27j23j27L51j54L1m2J5l64J41J25N1q9nJ30K76k89K02
$$ -82 355 -95 -146 124 -131 96 -27 -154 197 43 74 32 47 -317 -176 -51 0 -89 -94 36 312 23 225
6240B25l97L73j5m73j07N22l35J20%K4L44k07N0k87K52j42M62o81M04k85R7PJ74
$$ 225 -172 201 186 -287 -394 128 -207 -87 -87 -63 281 74 124 -163 89 -53 409 -272 132 -153 -56 -49 125
6263A25j34L1J4j32K13l40J72R6J16n04N01l6j10P2m08M17k92K39l5J6j16k9Q
$$ 125 -9 22 36 -96 117 -223 -51 45 161 -343 158 122 12 84 -324 93 -199 40 5 21 -95 -124 -116
6286a16K33K4J57k27p0K26m15J27M44l59M0o0L26j85j05j92p6K28M4L8j0m1p2
$$ -116 117 141 298 71 1 227 -188 -61 383 24 64 4 330 145 40 -152 -228 0 44 82 72 31 -41
6309d1j33L13o7l77K05J70j97K72k82K10j6j02j79L65k78K58j33j46L07L61n64
$$ -41 -174 139 72 -305 -100 70 -127 145 -137 73 57 -45 -224 141 -137 121 -12 -158 149 510 -54
6330e4j62J44j23J76j2K21j07j76K19l0q1J97l2l12ML0J58p7P6o5o4J8P1j08j06
$$ -54 -216 -72 -195 -19 -31 190 83 -93 126 96 15 212 180 -132 -128 -98 60 -17 59 -6 -70 -52 19 -89 -195
6355a95K23q1Q5j27J03PK9j88K27J5k01J10j00p1J19K09j63J23l25N6K23kN9p6
$$ -195 28 -53 32 -95 8 15 44 -144 83 98 -103 7 -93 -164 -45 164 1 124 -201 -145 78 76 135 59
6379E9J1j38m7K06k18qJ3J31n8J39j35j00P2q3j55M26j32K13j33k87L78j12m4
$$ 59 70 -68 -115 91 -127 -135 -122 9 -49 90 -45 -145 -73 -156 -311 115 -17 196 63 -224 154 42 -2
6402bJ85k22L2J33q4m1l0K26o8Jm75K80k8J95j05P6j48O6k12J80K73j64q7N6p1
$$ -2 183 -39 -7 126 42 1 -29 197 129 130 -345 -65 -93 102 -3 73 -75 -9 -221 -41 232 68 -19 37 -34
6427c4r9L57k13J34J93n28L02j36J58k34M7L9R6j32J02o5l9K78p8l05L29m27M13
$$ -34 -133 224 11 145 338 -190 112 -24 134 -100 -53 -14 82 -50 52 -13 -52 226 148 -157 172 -255 158
6450A58j61J44j27q5J72j47q9J88J44L3J23l11L1j39J56o0k61m3J78nK85l82J0
$$ 158 -3 141 14 -71 101 -46 -135 53 197 230 353 42 73 -66 90 30 -231 -274 -96 -101 184 -198 -188
6473a88J13J02j25M45m43k2L02j40k98K48K00l2j42L0l6j97J15O1P9o0J7r5k9
$$ -188 -75 27 -98 347 -96 -118 184 44 -254 -6 194 162 20 50 14 -183 -68 -7 72 12 29 -66 -95
6496i5L8J00j25j18N8K84L8m51J11P8N5n0O7j03q3J13J10j7j73J53Q7k71P4K00
$$ -95 -57 43 -82 -200 -142 142 180 -271 -160 -82 -27 -77 -10 -113 -196 -83 27 10 -163 -10 77 -194 -120 80
6520H0K5j83P8qK93j24l05P6n9j14L08p7q9MJ60j43q9P4J0r0L58J31l46k4k26
$$ 80 105 -78 0 -8 285 161 -144 -68 -127 -241 67 -10 -99 -95 65 -78 -167 -93 -83 -173 185 316 -30 -54 -280
6545b80M17l45K66m4Q2l6j73j32J74J27J69m82k2M23j13j28K86j92p1L8l9R7k09
$$ -280 137 -208 58 14 96 60 -113 -245 -71 56 225 -257 -279 144 31 -97 189 -3 -74 -36 -75 22 -187
6568a87N94m63m3J32J21k01q3l89M22K18n5K0j60k24K67O4p0J65k82J25L9R3k83
$$ -187 407 -56 -99 33 154 -47 -130 -519 -97 121 66 86 -74 -298 -31 33 -37 128 -154 -29 10 103 -180
6591a80J27j53L37q1j55j5L9K45j40M7J53j66k16J03k25J55K4K50j51j85K96l25
$$ -180 -53 -206 131 50 -105 -120 -81 164 24 71 224 58 -158 -55 -280 -125 -101 149 -2 -187 109 -216
6613b16K15j37J58r7J10M9m5N9n7J85Lk05J98j57q8K20l36j0L37k14J10J8k00
$$ -216 -1 -138 20 -77 33 82 37 96 39 224 227 22 220 63 -25 195 -141 -151 186 -28 82 100 -100
6636a00l19J44%K75q8j22l2K22o2%J03J5k07Q9m1K55j36Nj41j28K51J1L18q8j91
$$ -100 -419 -275 -275 0 -88 -210 -242 -20 -82 -82 21 36 -171 -82 -123 132 -4 1 -140 -268 -17 -6 312 224 33
6661C3k8J51j35j65K09k4J73k24L57l50m8J19j08p5J42L9j72k9L86k39l0l0R8
$$ 33 5 156 21 -144 65 41 214 -10 347 -3 -51 68 -40 -115 27 66 -106 -135 251 12 -18 -48 50
6684E0J17k04jJ69j45J41k65K02Q0K1m51K41j11J41k04J94J47l78J51J30q7k14
$$ 50 167 -37 -38 131 -14 127 -138 64 144 165 -286 -45 -156 -15 -219 -25 122 -256 -105 25 -62 -276
6706b76J57N5K88Q5k19j51J13q2k5K58l58K25r4q5J25J64k12M8k64J84P4o7l9
$$ -276 -119 -64 224 309 90 -61 52 -30 -55 203 -155 70 -24 -109 16 180 -32 16 -248 -64 10 -57 -96
6729i6m4N4K5n2J52O6j37J89k12k5q1K05K5J31m06L73j70K30k83q3N1M5O7L7r8
$$ -96 -140 -86 -61 -113 39 105 -32 157 -55 -80 -161 44 69 200 -206 167 -3 227 -56 -139 -88 -43 24 61 -37
6754c7J59Q4p6lm84M64j35Mq2p9J79J6mQ0j14QK68N6m11J53j83J37J2L60l31k40
$$ -37 122 206 130 127 -357 107 -28 -24 -106 -185 -6 10 6 86 -28 -20 248 304 -107 46 -137 0 12 372 41 -199
6780a99R8M4p0L3L93l32j00J8Q1K10l9o9p5j26J94j7q3k50K01K23k89J39J61q3
$$ -199 -101 -57 -127 -94 299 -33 -133 -115 -34 176 137 68 -7 -133 61 44 -39 -289 -88 135 -154 -15 146 63
6804F3l44K29J41k64K80R1k59L3n9M4j33J69j12J97l8rk31J32J6J28j68J27j84
$$ 63 -281 -52 89 -175 105 196 -63 -30 -89 -45 -178 -9 -121 76 38 29 -202 -70 -54 74 -94 33 -151
6827a51K87j43j2J5M1q7O5k9L3n5m7L7M1n0J81j35J50m42Q57o42M2J23m6q0J26
$$ -151 136 -7 -19 -4 37 -50 15 -14 19 -36 -83 -46 -5 -55 126 -9 141 -301 556 -86 -44 79 33 -47 79
6852G9m9p4J52j57K85k92k0NQ5r8O6K07m22K49r7JK58j32p1j15Q8N4k39K71L0
$$ 79 30 -44 108 -49 236 -56 -76 -71 14 -84 -18 189 -233 16 -81 -80 178 46 -25 -140 -52 2 -237 34 64
6877F4p1J98j82q7Q2k04K82l49K17L8k6J31l2j10N9j02J17J7j34J92j74L11p2
$$ 64 -7 191 9 -78 4 -200 82 -267 -50 -12 -38 93 61 -49 10 -92 25 42 -92 100 -74 237 165
6900A65k7J63l21J79j84J29j59L5m7j1Q4K19k05J33Q5J6k69K16l02L8Q6j03j09
$$ 165 138 301 -20 159 -25 104 -55 -20 -67 -78 6 225 20 153 238 254 -15 201 -101 -63 23 -80 -189
6923a89jK70k40Nj1K87r3j16J13nj3Q0j45M3L1Q5j07J5j37K42Rk95J13l3J32J39
$$ -189 -190 80 -160 -155 -166 121 28 -88 25 20 7 87 -58 -15 16 101 -6 9 -128 114 123 -172 -59 -92 40 179
6949A79l13J85k6j45m3K62k6j63K00j71J4K21km8J1l66M5K11k4p5o6n0L76k90
$$ 179 -134 51 25 -120 -163 99 73 -90 110 -61 -47 174 172 124 135 -231 -186 25 1 -74 -140 -190 186 -104
6973a04J89p8J94k1k41m7J60m3K14Rr6k5n4j77Q6j6J04M9j95L9K38j65Q7k8k84
$$ -104 85 7 201 180 -61 -108 52 9 223 232 136 111 57 -120 -34 -50 54 103 -92 -53 185 20 107 79 -205
6998b05M6K00L10m35JK68j81J71k55r4l5K15j98J23K00n1J34k90L02m47J45N1
$$ -205 -159 41 351 -84 -83 185 4 175 -80 -174 -209 6 -192 -69 131 80 214 -76 226 -221 -76 -25
7020b5n0J52L7nRK40j93l51L70j35J1j14L7j73K46k06K04OJ82k33l9M0r6K6M5
$$ -25 -75 77 114 109 118 358 165 -186 184 49 60 -54 -17 -190 56 -150 54 60 242 9 -30 10 -86 -60 -15
7045a5q5N7J18ll8j25J22j74J87J3P1l25L17l42J86J15j93J92o9M4j62j2M7R8
$$ -15 -100 -43 75 72 34 -91 31 -143 44 57 128 -197 120 -222 -36 79 -114 78 9 53 -109 -121 -74 24
7069B4j55M7K30J29j82J3k33J80J30o9j47K5p4J77k24N1K20k9r2r2m8R5p8J64
$$ 24 -131 -84 146 275 93 106 -127 53 183 114 -33 -8 -82 95 -129 -78 142 113 21 -71 -119 -24 -102 62
7093F2l34L72j62K1k04J86J7J39j14j33K39O9k16j04LL56j77n0K0K81k98k05J76
$$ 62 -272 100 -62 -41 -245 -59 -42 97 -17 -150 89 158 -58 -162 -159 197 20 -30 -10 271 -27 -232 -56
7116e6K40l32j27J08K39J1j77j03K77k5j87L9J13l08L29j03K36n06J38J77J46
$$ -56 184 -148 -275 -167 72 83 -94 -197 80 55 -132 -93 20 -288 41 -62 174 -332 -194 -17 129
7137A29O1k95j34K48k17L53R9l71J43k32L44j05j58j14L79o9l8j9k09M11m45O2
$$ 129 190 -105 -239 9 -208 145 244 -127 16 -216 128 23 -135 -249 130 61 23 4 -205 206 -239 -177
7159a77j34M69l17J81P2k42K08J58j67k20L7J03J30j31J18J6j97J82j72J71R0
$$ -177 -311 158 -159 22 94 -148 60 218 51 -169 -132 -29 101 -30 88 104 -93 89 -83 88 178
7180A78j50k27M1L5n2L80k16N7K3m4o8M16m68K0J53J11l9j34J60j11j63j20L74
$$ 178 28 -199 -158 -123 -175 205 -11 46 69 25 -43 373 -95 -75 78 189 150 16 176 65 -98 -218 156
7203A56j8k58k01K56j16K67O0J61n37P6J13K9N4j11n3J41P8J54l40l14M20K2Q3
$$ 156 138 -120 -321 -65 -181 86 146 307 -230 -154 -41 -12 42 -69 -122 19 97 251 -89 -403 17 39 122
7226A22j71J75k18q6K99lj55L10l12j59L02j75k8l0L31j46j39J68N3j27o9J3K11
$$ 122 -49 126 -92 -178 121 118 -37 273 -39 -198 104 -71 -99 -129 202 56 -83 85 138 11 -58 -45 166
7249A66j20K2J30k00J32O6k49Q4n4l0J94l4n5O1Qp7J14j88Q5p3K05j18m37Q7K57
$$ 166 46 68 198 -2 130 196 -53 31 -23 -53 141 107 52 113 121 44 158 -30 55 -18 187 69 -368 -281 -24
7274b4j01M8n9K7K33J2j09j26Q8mOP2N3K2k44QL0L08k52Q8l1k10K21J8N0n0J24
$$ -24 -125 -77 -136 -109 124 136 27 -99 -11 -15 -9 63 116 138 -106 -98 -68 240 -12 76 45 -165 56 74 124 74 198
7301A98k31j24k9J31M1j32M10l01j77Q3OR9N6r4p7J15L07l90J40J37J71l7k25
$$ 198 -33 -157 -186 -55 -14 -146 264 -37 -214 -131 -125 -26 30 -64 -141 -26 281 -109 31 168 339 302 77
7324G7l05J92K54jk54J00j3j75J58k7K09j05l53J57J33m76N96j52n98O43M6k03
$$ 77 -228 -36 218 217 -37 63 50 -125 33 6 215 110 -243 -86 47 -429 167 15 -583 60 106 -97
7346i7J02J01R7m02J73J8J61j40K9r4M5K17k91j05R7J00m74L56K69j59M2o0M2
$$ -97 5 106 203 -199 -26 -8 153 13 42 -52 -7 210 -81 -186 -89 11 -463 -107 162 3 45 -15 27
7369B7K4k77R2J46M0l8j69K01Oj9j79R3p4K53j22KJ04j52l2O2R8J49k55R2o8Q3
$$ 27 51 -226 -134 12 52 14 -155 46 52 33 -146 -53 -127 126 4 6 110 -42 -74 -12 86 235 -20 72 4 87
7395H7K5l4l8K9k6k16J44l1L71l06p1K3r8L9N4n1J96q2p5j06K51J45k36k45K35
$$ 87 112 78 40 69 43 -173 -29 -60 311 5 -66 -43 -141 -102 -48 -99 97 15 -60 -166 85 230 -6 -251 -16
7420a6L9j02l4L7j4pQ8l4j54J55N8j08J00k8N7k9k07J32R6j23J51L3j62P2L5m9
$$ -16 23 -79 -113 -76 -90 -97 -9 -43 -197 -42 16 -92 8 -20 37 8 -199 -67 29 -94 57 90 -72 0 35 -14
7446a4j26J26M2j82L81l69M25k85k25J83j20l8L2K14J06J17m31L60J49l70K20
$$ -14 -140 -14 28 -154 227 -142 283 -2 -227 -44 -164 -202 -170 44 150 267 -164 196 345 -25 195
7467A95k50J81N3p6j72%l6J75L5l39P6K78j22j71J37P4J36k36L7j44K95m11J11
$$ 195 -55 126 179 103 -69 -69 -105 70 105 -234 -158 120 -2 -173 -36 38 174 -62 -25 -169 126 -285 -174
7490a74J02L17l67J8r9K19n5n4J95Kj75K99l35J04NMON6J23l64j28N30l4l09O8
$$ -174 -72 245 -122 -104 -203 16 -39 -93 102 104 -71 228 -107 -3 2 6 12 68 191 -173 -301 229 195 -114 -46
7515d6J14k77L41k90K47j39J86J85m68N4K63k62J91J33k71j41K80L2j05m1J21
$$ -46 68 -209 132 -158 89 -50 136 321 -147 -93 170 -92 99 232 -39 -180 100 132 27 -14 107
7536A07j77R4o8K5l9j14J10J16q7j89L96m9j28j1k8K47l31J57l2l5r6L14j87R2
$$ 107 -70 24 -44 -19 -58 -172 -62 54 -33 -222 174 125 -3 -14 -42 205 -126 31 -1 -36 -132 182 -5 87
7560H7J50k62j59J00J59k19k42J67k37N23j51j1K3K66l6LJ89m70Q7l8J55l51K49
$$ 87 237 -25 -184 -84 75 -144 -386 -219 -456 67 -84 -95 -72 194 158 161 350 -120 -33 -71 84 -267 -18
7583a8j23J07R6j35jL34j78Mj13j60K28Mp8JJ3J50j85l6J9M1J82k34r5K40r8K55
$$ -18 -141 -34 62 -73 -74 260 82 86 -27 -187 41 45 -33 -32 -19 131 -54 -90 -71 -30 152 -82 -177 63 -35 220
7609B20j83k08N24l21p4J22j68K99l84o0K93k60J63R7j60J4j15L59l54M5J70P6
$$ 220 37 -171 353 32 -42 80 -88 211 -173 -233 60 -200 -37 60 -100 -86 -201 158 -196 -151 19 95
7631I5q7K08k99J31p0n6M04l01j53J7l2J8l5j02M17m8Q2j99J9Nk46L29Oj33J3
$$ 95 8 216 -83 48 -22 -78 326 25 -128 -111 -143 -125 -160 -262 155 107 189 -10 9 14 -232 97 103 -30 -17
7656a7k60J59N9M2JL35k85j9j58L1L6K39q2J12k93M0K03n0j26R7j97J01Q9k35
$$ -17 -277 -118 -59 -17 -16 319 34 15 -143 -112 -76 163 81 193 -100 -60 143 93 -33 64 -133 -32 57 -178
7680a78J44p3k14O12k78J8l2q6J15j89K17n4J9k23J9L40l03J84k64M49j35k39
$$ -178 -34 -107 -321 291 13 31 -1 -87 28 -161 56 2 21 -202 -183 157 -146 38 -226 223 88 -151
7702a51MJ20O3j68J39m8m1K48k95k3K35Mm9j80K77r0j77K73q4n4R0j09k82K30
$$ -151 -147 -27 36 -132 7 -41 -82 166 -129 -152 83 87 38 -142 135 45 -132 141 57 3 93 -16 -298 -68
7726f8J91l17P8J17p1k00K30p3J36J26q6r0j44j9L8K83l59J63j0K95k99M9k4J81
$$ -68 123 -194 -116 1 -70 -270 -40 -113 23 149 63 -27 -171 -190 -152 131 -228 -65 -75 220 -79 -30 -54 127
7750A27k03K7M9r9J16R1P3L5j99N9j38K8j29m0K72rQ6j69J96m21L69J8o4k75J99
$$ 127 -76 -49 0 -99 17 108 181 216 17 76 -62 -34 -163 -203 69 60 146 -23 173 -248 121 139 75 -200 -1
7775ao7M2J16K6k44J69j47LL05q9j48K34L7q4j93m5J47j13J42J7j24K28j50R0
$$ -1 -68 -26 90 116 -128 41 -106 -103 202 113 -35 199 236 152 -41 -86 61 -52 90 107 -17 211 61 151
7799A51j52k36K04Q9o5J91j62j69J98J24m48N53l8j66o0j80j10M06m22M15k58
$$ 151 -1 -237 -33 56 -9 182 20 -149 49 173 -275 278 240 74 14 -166 -276 130 -292 123 -135
7820a35O8%J33m7K75k20r3K74m86L47j06N4q7L58k54L9j73K21k35J33J52k78j24
$$ -135 -67 -67 66 19 294 74 -19 255 -231 116 10 64 -23 335 81 120 -53 168 -67 66 218 -60 -184
7843a84K28J95o4j95L05k10j66K91k09J33L3l06J62r8j30P5N56m71o5K1l2J87
$$ -184 44 239 175 -20 285 75 -91 200 -9 124 157 -149 13 -85 -215 -140 416 -55 -120 -99 -131 56
7865E6l7J8J01O9k34K21j93j78J92j89J36K48l04K95n8Q6k69J9k2M6k01L2L16
$$ 56 19 37 138 207 -27 194 1 -177 15 -174 -38 210 -94 201 143 229 -40 -21 -43 3 -198 -166 150
7888A50k2l25K24j1j7j25J91M3Jk8o0j48J65n6J23k18k07M51r6m6j20K03R2O9
$$ 150 128 -197 27 16 -1 -126 65 108 109 81 21 -127 38 -18 105 -113 -320 131 35 -11 -131 72 164 233
7912B33k47n5J89j4j07M32m20J2K32l85J28J55k94K44j34j17J00j8M8J77l25J31
$$ 233 -14 -69 120 106 -1 431 11 23 255 -130 -2 153 -141 103 -31 -148 -48 -66 -18 159 -166 -35
7934c5K0qm8J24j4J60k46p8J22K48m10L87j55j38O1J08j64J20P4j30M3K54m14
$$ -35 -15 -23 -71 53 39 199 -47 -125 -3 245 -165 222 67 -71 -10 98 -66 54 128 -2 41 295 -119
7957a19L90j53m7k08J30j5J48j20R8L4k63Q7j05J35K6J0j32K66k17N2O8N2k62
$$ -119 271 118 71 -137 -7 -22 126 6 104 138 -125 -38 -143 -8 18 28 -104 162 -55 -3 65 117 -145
7980a45L7Q4m1R9k08Q8N3P8k02J1J9J86J00k84M3J73l25K50N1n4k57K35l79M46
$$ -145 -108 -24 -65 34 -174 -86 -33 45 -157 -146 -127 59 159 -125 -82 91 -234 16 67 13 -244 -9 -388 58
8004E8j78Q0M4J2j36MJ05L61k72p8j40q6J35P5J33jL6k11J81k89R5M9Q4j60N2
$$ 58 -120 -40 4 16 -120 -116 -11 350 78 0 -140 -226 -91 -16 117 116 152 -59 122 -167 -72 -23 61 -99 -47
8029d7J20r2j55J97j09K52j92j13J97m5k78L51k30K7J89r1k7q9L4J77j42j44K81
$$ -47 73 -19 -174 23 -86 166 -26 -139 58 13 -265 86 -144 -117 72 -19 -46 -135 -101 76 -66 -210 71
8052G1j76o8L12j77p7j6m1k2L77M3j65j25J38N1K5l23J67K29l11j28J43q1K21
$$ 71 -105 -173 139 -38 -115 -131 -172 -194 183 226 61 -64 74 125 150 -173 -6 223 -88 -216 -73 -154 67
8075F7k73J24K66m3k77NJ16J84j85j84M26j83k48J89j20J09O6j06J96J73k94l4
$$ 67 -206 -82 184 141 -136 -131 -15 169 -16 -200 226 43 -205 -16 -136 -27 39 -67 129 302 8 -26
8097b6R7L2l75K27j03K27J54n25J72L73l95K00n0P9j33J06j44L76k30k11k00K80
$$ -26 71 103 -272 -45 -148 79 233 -292 -120 253 -142 58 8 87 -46 60 -84 292 62 -149 -349 -69
8119f9K98n34M05J7p6k62J23J67O5j4j92K50j99j9J4j4J84o5j51J57j70M4j49
$$ -69 229 -305 100 117 41 -221 -98 69 134 120 -72 178 -21 -40 -26 -40 144 79 -72 85 -85 -41 -190
8142a90L56j37J83j45k09K13r0J56l66J13J35K4k10K31j7P8j22J8K52k04lm02
$$ -190 166 29 212 67 -142 71 -19 137 -229 -116 19 43 -167 64 47 125 3 21 273 69 66 -336
8164c36J44J37O3P9k76J60j4Q7l0K10m8k43N5N6j31L1q7P4o7J74M8j9k5m9k4K1
$$ -336 -192 -55 8 87 -189 -29 -43 44 14 224 176 -67 -12 44 -87 -56 -143 -69 -136 38 86 67 42 -7 -31 -10
8190a0l09
$$ -10 -319
8191c19
$$ Imaginary data points
##PAGE= N=2
##DATA TABLE= (X++(I..I)), XYDATA
0@%%%%%%%%%%%qJ6j6J6j7K5l2M0m9N7p2Q8j04J20j37J61j92K20k52K88l28L75
$$ 0 0 0 0 0 0 0 0 0 0 0 0 -8 8 -8 8 -9 16 -16 24 -25 32 -40 48 -56 64 -73 88 -104 116 -136 152 -176 199
33A99m23M76n36O05o78P58q47R44j050J165j290J426j578J745j924K120k338K576
$$ 199 -224 252 -284 321 -357 401 -446 498 -552 613 -677 749 -829 916 -1008 1112 -1226 1350
51A350k837L125l448L807m209M669n193N799o511P357q384R665j1314J3525j6661
$$ 1350 -1487 1638 -1810 1997 -2212 2457 -2736 3063 -3448 3909 -4475 5190 -6124 7401 -9260
66i260K1503l0030M9475j78196k2473K59355o7854q0249q6999L4109J68663Q3403
$$ -9260 12243 -17787 31688 -146508 -168981 90374 22520 -57729 -144728 -110619 58044 141447
78A41447j71534p4774Q7369R0949M8114l5949j55065L0342K02790J0577j72749
$$ 141447 -30087 -104861 -17492 73457 121571 85622 -69443 -39101 163689 174266 1517
89A517o3456K7494P5767O6480r8854j49915O5738J26227p393n4907o0038l5990
$$ 1517 -61939 -34445 41322 107802 8948 -140967 -75229 50998 43605 -11302 -71340 -107330
101a07330J04034Q2122j08188q8480O5858P5684M5747j1210j09709j4213J50254
$$ -107330 -3296 78826 -29362 -117842 -51984 23700 69447 58237 -51472 -65685 84569
112H4569M2969j12215o0178J2165M8143P0335m5714j19303K7007R8065p395m6820
$$ 84569 127538 15323 -44855 -32690 15453 85788 40074 -79229 -52222 45843 38448 -8372
124h372m3105m0344O6203Q5162p3074q8378N2848P4098K4304q726o7615k1691
$$ -8372 -51477 -91821 -25618 59544 -13530 -101908 -49060 25038 49342 40616 -26999 -48690
136d8690R6107L9030p3863l3522J7915K0238M6993o783q4176l885P4231K612m4731
$$ -48690 47417 86447 12584 -20938 -3023 17215 64208 57425 -26751 -30636 43595 46207 1476
149A476l0136k4467L2510O0804l4911o5256K4200M4178J0078q56m0118l3475N3488
$$ 1476 -28660 -53127 -20617 40187 5276 -59980 -35780 8398 18476 17620 -22498 -55973 -2485
162b485M3765m1198l0491J3814J8406L4876M708n8990j5491N3459J2960k9035
$$ -2485 41280 82 -30409 -16595 1811 36687 41395 -17595 -33086 20373 33333 4298
174D298j8708j5880J7711M9579j2345n2152Q242L4306N216l234k4221k7789L3149
$$ 4298 -14410 -30290 -12579 37000 24655 -27497 -19255 15051 20267 17033 -7188 -34977 -1828
187a828L9926k4623k8247R163J3211J8719M890m0926k1642L3749J5279k0978j3950
$$ -1828 38098 13475 -14772 -5609 7602 26321 31211 -9715 -31357 2392 17671 -3307 -17257
200a7257q302Q634L2112j936l6883k207K4121O986j396j2779j7264J9874L3561
$$ -17257 -25559 -16925 15187 13251 -23632 -25839 -1718 5268 3872 -8907 -26171 -6297 27264
213B7264q806k0966K967R158J2045M503k5399j8634K0027J5318j1423j0854p535
$$ 27264 18458 -2508 459 9617 21662 26165 766 -17868 2159 17477 6054 -4800 -12335
226a2335K438K0545R00k8050q447J5362P298L07o764j2276J1004K6124j816j5952
$$ -12335 -9897 10648 11548 -16502 -24949 -9587 -2289 -1982 -8746 -21022 -10018 16106 14290 -1662
240a662q20P032Q626O051j4138j4656J2879J5521n525r582o529r60J1669J954
$$ -1662 -2482 4550 13176 19227 5089 -9567 3312 18833 13308 3726 -2803 -3763 7906 9860
254I860k0008j0885Q792P865L37n065q486N440J7774Q73j1819l009N293Q289O141
$$ 9860 -10148 -21033 -12241 -4376 -4039 -9104 -17590 -12150 5624 6497 -5322 -8331 -3038 5251 11392
269A1392o299r448Q073J3385Qp560o485p19P000K108j3084q892M363O281O31m637
$$ 11392 5093 -4355 3718 17103 17111 9551 3066 2347 9347 11455 -1629 -10521 -6158 123 754 -3883
285c883p961J168J0125J578r283n433L513P630N735l329n530N342J0057K366m838
$$ -3883 -11844 -10676 -551 1027 -8256 -13689 -10176 -2546 3189 -140 -5670 -328 9729 12095 7257
300G257n027o68O436K930p704o838L815N859j73m766o127p52M214J527n461n663
$$ 7257 2230 1562 7998 10928 3224 -3614 201 6060 5887 1121 -5006 -5758 -1544 -17 -5478 -11141
316a1141M49O476N566j938m769K581O809J929m155l906J207M190K270k537l344
$$ -11141 -10692 -4216 1350 -588 -5357 -2776 4033 5962 1807 -2099 -892 3298 5568 3031 -313
331c13p6M612K421l403o593j484L379K569l094m046P17M787K807j354l171q06
$$ -313 -389 4223 6644 3241 -3352 -4836 -1457 1112 -1982 -6028 -5311 -524 2283 929 -2242 -3048
347c048L965K396l200m845J210N398K378j605k429l03K621J742k408m000j818
$$ -3048 917 3313 113 -4732 -3522 1876 4254 2649 220 -83 2538 4280 1872 -2128 -3946
362c946J466L083j057m167J01N282J369l703k069M87J783K419p88j787J406L244
$$ -3946 -2480 603 -454 -4621 -4520 762 2131 -1572 -3641 -3154 -1371 1048 260 -1527 -121 3123
378C123K431P47k389k981K028K066l954l492N04N99R71j43k724j363K569N95k105
$$ 3123 5554 6301 3912 931 2959 5025 1071 -2421 -1917 -1318 -347 -490 -3214 -4577 -2008 -1413 -3518
395c518j101r74J277M358R35k621K023L269J02N51q76k951J202K350k233j822
$$ -3518 -4619 -5593 -4316 42 977 -1644 379 3648 3750 4301 3425 474 1676 4026 1793 -29
411b9J277K59R21J382l770k715K164K13k905K75m34r01M124J422l431J070K725
$$ -29 1248 1507 2428 3810 40 -2675 -511 -298 -3203 -2928 -3362 -4263 -139 1283 -2148 -1078 1647
428A647j679J93O82k881J304N038j480j828L326o22j214J808k730m660K302Q48
$$ 1647 -32 161 843 -2038 -734 4304 2824 996 4322 3700 2486 4294 1564 -3096 -794 54
444E4l953O34J327k239K589K862n162J36L798k241n38L547j726L28N508m9k346
$$ 54 -3899 -3265 -1938 -4177 -1588 1274 -3888 -3752 46 -2195 -2733 814 -912 -584 4924 4875 2529
461B529K864l46k749K220j782n161L205K349m377Q41K523l230L43K640n140j530
$$ 2529 5393 5047 2298 4518 2736 -2425 780 3129 -1248 -407 2116 -1114 -771 1869 -3271 -4801
477d801L392k158j561M692j726j847O413l91m891L856R04m523K690K203m815K446
$$ -4801 -1409 -3567 -5128 -436 -2162 -4009 2404 2013 -2878 978 1882 -2641 49 2252 -2563 -117
493a17N055l977k14M004l987j571M135m349l943N719l63l474M707J23m252M518
$$ -117 4938 961 747 4751 764 -807 3328 -1021 -4964 755 392 -3082 1625 1748 -2504 2014
509B014J844o123J647L071m972J386M271m044M87N735m050l074M489l174m003
$$ 2014 3858 -2265 -618 2453 -2519 -1133 3138 -906 -419 5316 1266 -1808 2681 -493 -4496
524d496M715j665m730N491J616m578M041J856n632K713L259o148O04N404m097
$$ -4496 219 -1446 -6176 -685 931 -3647 394 2250 -3382 -669 2590 -3558 -2954 2450 -1647
539a647M96O190l574k152O200k780m683M246j103n248N185J527o103M504L398
$$ -1647 -1151 5039 1465 -687 5513 2733 -1950 2296 1193 -4055 1130 2657 -3446 1058 4456
554D456n554Q63L077o099O16M967n220j782O784j674k333N621j836m647M963m88
$$ 4456 -1098 -235 2842 -3257 -2641 2326 -2894 -4676 2108 434 -1899 3722 1886 -2761 2202 1714
570A714n851L427J900n015L511L326n230K101M253n779j301M790m129j688N273
$$ 1714 -4137 -710 1190 -3825 -314 3012 -2218 -117 4136 -1643 -2944 1846 -2283 -3971 1302
585A302k026k222O157q05l489M470l61o008L633K286n518K333L344m791K256M515
$$ 1302 -724 -2946 3211 2406 -1083 3387 3026 -2982 651 2937 -2581 -248 3096 -1695 561 5076
601E076n493j277M528m004k935M785k073k924N823m39l828L855J560m585K312
$$ 5076 -417 -1694 2834 -1170 -4105 680 -1393 -4317 1506 1067 -2761 1094 2654 -1931 381
616C81Q25m882K643L825m796O29M974k761r15L432l123k462L909k091l282M247
$$ 381 1206 -3676 -1033 2792 -2004 -1375 3599 838 -77 3355 232 -2230 1679 -412 -3694 553
632E53ql213L867J160l689K067J609m693J078K936l518O67L966k351o69M056k893
$$ 553 545 -2668 1199 2359 -1330 737 2346 -2347 -1269 1667 -1851 -1184 2782 431 -238 3818 925
649I25j712L288k229l696L341P5k939L336M64l374K393K077m162L17K508l124
$$ 925 -787 2501 272 -3424 -83 -8 -2947 389 853 -2521 -128 1949 -2213 -1896 612 -2512
665b512K02L192k438M07M101j541k100L422j112k543K165Ll044K471J272k678
$$ -2512 -2310 882 -1556 -1149 2952 1411 -689 2733 1621 -922 1243 1246 -1798 673 1945 -733
681g33J786J548k988K39J532l232n61K555j857j451L618r01j309K602l41j899
$$ -733 1053 2601 -387 -148 1384 -1848 -2409 146 -1711 -3162 456 -445 -1754 848 507 -1392
697a392K239m35k579K802P34k092J598J928j916M71J051k124m15J234k032o38
$$ -1392 847 412 -2167 635 1369 -723 875 2803 887 1358 2409 285 -130 1104 -928 -1566
713a566J740j057o09K267p15j631K098k0k164R19L65j047J345R99j450J162J673
$$ -1566 174 -883 -1492 775 60 -1571 527 507 -1657 -738 -373 -1420 -75 924 -526 636 2309
730B309j588n88J596j271q92J042n14l70J482M45j574J204m46j647N12L50j476
$$ 2309 721 133 1729 458 -434 608 94 -276 1206 1651 77 1281 835 -812 -300 50 -1426
747a426J99P87q61M24J506q99J11P65j289k79J132l47m78J133L80l70N10N33o68
$$ -1426 -1227 -440 -1301 -877 629 -270 -159 606 -683 -962 170 -177 -655 478 858 488 998 1531 863
766H63M12m79j531P25K47o46K12O06o27J57M99l99k26L22n37p96N49j29M35P81
$$ 863 1275 796 -735 -10 237 -409 -197 409 -218 -61 438 39 -187 135 -402 -1198 -649 -778 -343 438
786D38k13m85M42K96p03J14o2l26L04q3l3Q35P39j15n73k43J75o82j27K88k80
$$ 438 225 -260 182 478 -225 -111 -173 -499 -195 -278 -311 524 1263 1148 575 332 507 -175 -302 -14 -294
807b94J06q8l3L43M56p09J08l98o08J98M41n5K22M27r3L25J25m02M10K1n51l46
$$ -294 -188 -276 -309 34 490 -219 -111 -509 -1117 -919 -478 -533 -311 116 23 348 473 71 481 502 -49 -395
829c95L87K17N32M2K99j64j68k94m16J83m41m06P3j72O0N16J26j91m86r5j1j11
$$ -395 -8 209 741 783 1082 918 750 456 40 223 -218 -624 -551 -723 -663 -147 -21 -212 -698 -793 -804 -915
851i15j92QN25L00K26N96L97M1p2m01j49N2k96K29j11N04J75j42j17l21j77o1
$$ -915 -1107 -1099 -574 -274 -48 548 945 986 914 513 364 416 120 349 238 742 917 775 658 337 160 99
873I9p08n37m6M17J51J49J10J50K20p2k77j22P4L9K76k75M67O51K93J99m65J8
$$ 99 -609 -1146 -1192 -775 -624 -475 -365 -215 5 -67 -344 -466 -392 -353 -77 -352 115 766 1059 1258 793 811
895H11l54r5l10l16K20p0j70M11J00j25L6k10n26j58j95K05j58O52M25%M61j65
$$ 811 457 362 52 -264 -44 -114 -284 127 227 102 138 -72 -598 -756 -951 -746 -904 -252 173 173 634 469
917D69N0J82o10j71j66L16k16M46L43J62J27q2r57j51J93o60m27M53K19PM68K
$$ 469 519 701 91 -80 -246 70 -146 300 643 805 932 850 -107 -258 -65 -725 -1152 -699 -480 -473 -5 -3
939cj55N63r5p08J30j43j08J83M64QL53L34l72l8J1p19j92O01m86j04Q81J82m37
$$ -3 -158 405 310 -398 -268 -411 -519 -336 128 136 489 823 451 413 424 -295 -487 114 -372 -476 405 587 150
962A50N63M7n88J86m54q68O84K98o23K46J042n48l37O96p42m99M66n06q80J101
$$ 150 713 760 172 358 -96 -964 -280 18 -605 -359 683 135 -202 494 -248 -747 -281 -787 -1667 -566
982e66K19j96J008pk88L48J93r02J86M58n50j75J160j37k34J315r32m94K61p82
$$ -566 -347 -543 465 458 170 518 711 -191 -5 453 -97 -272 888 751 517 1832 900 406 667 -115
1002a15p14L21k96j81P06J62p30Q57K19j121N2N92p57L6P99k08L42J000l33L7
$$ -115 -829 -508 -804 -985 -279 -117 -847 10 229 -892 -840 -248 -1005 -969 -170 -378 -36 964 631 668
1022F68P08o60o46P35m98q02Q18K22q51N41Q21j000j30J21j017k10P13o02j75
$$ 668 1376 716 70 805 307 -495 323 545 -306 235 1056 56 -74 47 -970 -1180 -467 -1069 -1244
1041a244J232l77l21J250K19p81P22j90r89M80N99p47P34P97q53J87L40q48m09
$$ -1244 -12 -389 -710 540 759 -22 700 510 -479 1 600 -147 587 1384 531 718 1058 210 -199
1060a99L98r03m19P99j56l64J099j57o22O59J01j173K56N98o98N39L92j56N02
$$ -199 199 -704 -1123 -324 -480 -844 255 98 -524 135 236 -937 -681 -83 -781 -242 150 -6 496
1079D96R15j002M80K30q27n70P32n18l47P30J84r04R38K40j162q9L52q15j07Q51
$$ 496 1411 409 889 1119 292 -278 454 -64 -411 319 503 -401 537 777 -385 -474 -122 -937 -1044 -193
1099a93n93J36J221n50k30Q97n86m81P00j99j315J300L99q25O89L43n87K68L28
$$ -193 -786 -650 571 21 -209 688 102 -379 321 122 -1193 107 506 -319 370 713 126 394 722
1118G22j033P5Q7j43j82J036n54j93J224l06p70K22p1j033P32j13p03P74M06n52
$$ 722 -311 -236 -149 -292 -474 562 8 -185 1039 733 -37 185 114 -919 -187 -300 -1003 -229 177 -375
1138c75M00N40q12K17K96q24k77O73j95j21R57p2n61Q75J46j199O65K8r18M09
$$ -375 25 565 -247 -30 266 -558 -835 -162 -357 -478 479 407 -154 721 867 -332 333 361 -557 -148
1158a48Q62r45M35Q50q50k29L34m21o29P54n18o98J001M05o72P12L60q67K14L15
$$ -148 714 -231 204 1054 204 -25 309 -112 -741 13 -505 -1203 -202 203 -469 243 603 -264 -50 265
1178B65n17k3M77l87J55P41m29O7K15l3q09R12o35o98L37K08n45Q35l6n51L48
$$ 265 -252 -275 202 -185 -30 711 282 349 564 531 -278 634 -1 -699 -362 -154 -699 136 100 -451 -103
1199a03L73q17K23P5m10J84N77p1Q6Q04n30m69P23l90n69L06N1q39R29Q7m65Q67
$$ -103 270 -547 -324 -249 -659 -475 102 31 117 921 391 -78 645 255 -314 -8 43 -796 133 220 -245 622
1221F22j66p33J7J46k29l23K72p3j77P35Q6k29M51m7m68R0J06l94M57O6k80J1
$$ 622 456 -277 -260 -114 -343 -666 -394 -467 -644 91 177 -52 399 352 -116 -26 80 -314 143 209 -71 -60
1243f0M98j26j69L74p33j92J24j08o5L93j38J45M9R5j18m8j7m81K36J51m61M73
$$ -60 438 312 143 517 -216 -408 -284 -392 -457 -64 -202 -57 -8 87 -31 -79 -96 -577 -341 -190 -651 -178
1265a78M24k25J87L49n78J03k49j68n0L06N8l8L06J55m78L36J20p43K73K34k69
$$ -178 246 21 208 557 -21 82 -167 -335 -385 -79 -21 -59 247 402 -76 260 380 -363 -90 144 -125
1286a25J61K28j17k11L30Pl06J20P5j62m28l8K06r9K98O4k03J29l1l12M66k23
$$ -125 36 264 147 -64 266 273 -33 87 162 0 -428 -466 -260 -359 -61 3 -200 -71 -102 -414 52 -171
1308a71l6J84l10M84K11j24QJ91k56J78R4n33J24m6M27k17Jj36MJo3l70k00M51
$$ -171 -207 -23 -333 151 362 238 246 437 181 359 453 -80 44 -2 425 208 209 73 77 78 15 -355 -555 -104
1332a04m72K22J47P6M5J77k05K48j21J69k73L1N83m18L21Oj43m9L7j69J18l71
$$ -104 -576 -354 -207 -131 -86 91 -114 134 13 182 -91 -60 523 105 426 432 289 240 277 108 226 -145
1354a45J64r4K33o10L05J93k53J33m5o0Rk00J76K15j34J30J62L38r2J9j50j31
$$ -145 19 -75 158 -452 -147 46 -207 -74 -119 -179 -170 -370 -194 21 -113 17 179 517 425 444 294 163
1376A63k04N5k67L79m12J97K73Rj96k67K88l50K59l45K23J0q2K49r9J92k1j6p1
$$ 163 -41 14 -253 126 -286 -89 184 193 -3 -270 18 -332 -73 -418 -195 -185 -267 -18 -117 75 54 38 -33
1399c3m4m5L15k14l8K95j99K40k09J17j59K61m04k20R4J48l0q0K35j01K94j17
$$ -33 -77 -122 193 -21 -59 236 37 277 68 185 26 287 -117 -337 -243 -95 -125 -205 30 -71 223 106
1421A06j42Q6o0j25J42l00L97j12N4J12k47pj0j49r5K45j1m0j3J39J92R3k34m3
$$ 106 -36 50 -10 -135 7 -293 104 -8 46 158 -89 -96 -106 -255 -350 -105 -116 -156 -169 -30 162 255 21 -22
1445b2J27%P1J89l9j29J98k64j75O4j04J61m3m5l52L34j97j49J55L9J27m79J13
$$ -22 105 105 176 365 326 197 395 131 -44 20 -84 77 34 -11 -363 -29 -226 -375 -220 -181 -54 -533 -420
1468d20N3j18M23j21J69j13K10p6P8K80j99J76k0j68l9O8J00j67M05n40J11n8
$$ -420 -367 -485 -62 -183 -14 -127 83 7 85 365 166 342 322 154 115 183 283 116 521 -19 92 34
1490C4K2l08K6J14k55J89m16K71q0K34j53L11N0K98m39K46J17k10J62J00J67k67
$$ 34 56 -252 -226 -112 -367 -178 -594 -323 -403 -169 -322 -11 39 337 -102 144 261 51 213 313 480 213
1512B13r1k42L21j10j83j59jj39J91r4r4Q9L15m17j19L78m24M93J39K0j02Q2J30
$$ 213 122 -120 201 91 -92 -251 -252 -391 -200 -294 -388 -299 16 -401 -520 -142 -566 -73 66 86 -16 66 196
1535A96J8K33k88K46k77J43L1J19l94pl4k74O5J35J60l88k32K80j09M7j52R3K98
$$ 196 214 447 159 405 128 271 302 421 27 20 -14 -288 -223 -88 72 -316 -548 -268 -377 -330 -482 -389 -91
1558i1J57l24R2J28J17j42L5J78j04L22J04m94L73O2m35K6O3j93J26M0Q3j45K11
$$ -91 66 -258 -166 -38 79 -63 -28 150 46 368 472 -22 351 413 -22 4 67 -126 0 40 123 -22 189
1581A89r8k60QL98l15P6n1k95M05k4j93Q0O6K21l50K48Ok68jJ73j59P2J42J22
$$ 189 91 -169 -161 237 -78 -2 -53 -348 57 33 -160 -80 -14 207 -143 105 111 -157 -158 15 -144 -72 70 192
1605A92m21J60p4J15L64l12m1j8J9l3J90j97j0K37j86R1p1j71P1q9L09k25J52
$$ 192 -229 -69 -143 -28 336 24 -17 -35 -16 -49 141 -56 -66 171 -15 76 5 -166 -95 -184 125 -100 52
1628E2j21O5p5K51l45L71l2k22J42j96m3M96J57l43M0J81k81k06j8k18K70j13
$$ 52 -69 -4 -79 172 -173 198 166 -56 86 -110 -153 343 500 157 197 378 97 -109 -127 -345 -75 -188
1650a88J00l28L94r6n1N2j58O5j02L75j71J32J81k37K03K32j52k03K89n0j10P7
$$ -188 -88 -416 -22 -118 -169 -117 -275 -210 -312 63 -108 24 205 -32 171 403 251 48 337 287 177 254
1672B54l21J56J60j18j10L1r9Q4k06J31k00j24K35j62J56m7J25j90m1K13l37N38
$$ 254 -67 89 249 131 21 52 -47 37 -169 -38 -238 -362 -127 -289 -133 -180 -55 -245 -286 -73 -410 128
1694A28K64l79K47P9j21R3P8j35j28k17N7j39PK51k81J76J94r2k04q2K1Mpk9k2
$$ 128 392 13 260 339 218 311 389 254 126 -91 -34 -173 -166 85 -196 -20 174 82 -122 -204 -183 -179 -186 -215 -237
1719b37J42j46M51j76L15k27O4L4k49j5L12j22p4K66k11J04L5p7k65J56m35K86
$$ -237 -95 -241 210 34 349 122 186 220 -29 -44 268 146 72 338 127 231 266 189 -76 80 -355 -69
1741f9j08O2K4j26J12j73J47m5J4M0j85J38K19j42J21Rm1M35k51O8j06j23J60
$$ -69 -177 -115 -91 -217 -105 -278 -131 -176 -162 -122 -307 -169 50 -92 29 38 -3 432 181 249 143 20 180
1764A80j99K9L1j02MJ49L9j46j04L99m58j71K83J35j14N8j61Q9L8k7k8j99L93
$$ 180 -19 10 41 -61 -57 92 131 -15 -119 280 -178 -349 -66 69 -45 13 -148 -59 -21 -48 -76 -275 118
1787A18K9j85Q3R9j72K12m9J19l81j5K09j73L42o2n2j89K82j27Ppj75J13J22k95
$$ 118 147 -38 45 144 -28 184 135 254 -127 -142 67 -106 236 174 122 -67 215 88 95 88 -87 26 148 -147
1811a47P6j55K58J10j70j34j2K1R1j51K8P7r0K69l5N0L3j11J6Q3j83J00j23J6
$$ -147 -71 -226 32 142 -28 -162 -174 -153 -62 -213 -185 -108 -198 71 36 86 119 8 24 107 -76 24 -99 -83
1835h3K33j51K2M3J40k06MJ25j50n6J60k40k36N01K2J17l81m8J00j02K39k09M31
$$ -83 150 -1 21 64 204 -2 2 127 -23 -79 81 -159 -395 106 128 245 -136 -184 -84 -186 53 -156 275
1858B75k24L12j69K29j05k0o9jk97m6M03m04K90l55n8J90l49K31l0r2j42K17M4
$$ 275 51 363 194 423 318 298 229 228 -69 -115 288 -116 174 -181 -239 -49 -398 -167 -197 -289 -431 -214 -170
1881a70j92K51J27j58J03j66L77k52L69j92Q1l0k09R7J16m0O8q5K24m45J53j30
$$ -170 -362 -111 16 -142 -39 -205 172 -80 289 97 178 148 -61 36 152 112 180 95 319 -126 27 -103
1903a03J0N4J35l54J51j31P9PJ46j03q3K08R7O3j61l5J83J38j39k84j90J39J79
$$ -103 -93 -39 96 -258 -107 -238 -159 -152 -6 -109 -192 16 113 176 15 -20 163 301 162 -122 -312 -173 6
1926FJ06J80k87j07K62k17k49N04m89K95J2l17L01n8mJ38j97J79J30Q5J28l03
$$ 6 112 292 5 -102 160 -57 -306 198 -291 4 16 -301 0 -58 -62 76 -121 58 188 273 401 98
1948I8J7m1J60j39k19J31M02q06M92N5o7j84O1J0J79l81L9J07m6RM8k78L32J60
$$ 98 115 74 234 95 -124 7 409 -397 95 150 83 -101 -40 -30 149 -232 -193 -86 -132 -123 -75 -353 -21 139
1972A39o7j54KJ86l3k32K4J0q0K70j21N5J58k03m8K39k68M3L68k61J99r7j97J85
$$ 139 72 -82 -80 106 73 -159 -135 -125 -205 65 -56 -1 157 -46 -94 145 -123 -80 288 27 226 129 -68 117
1996A17p1k56M23k32R8%j36M5K83j47l04Q6k41K9K9j8M13j96k54K58N6K0j41K3
$$ 117 46 -210 213 -19 79 79 -57 -12 271 124 -180 -94 -335 -306 -277 -295 118 -78 -332 -74 -18 2 -139 -116
2020a16Q1OJ87j21K78j19MK34k81L6P5k52j51mR2K83k25j67J60n1l13J06L70k75
$$ -116 -35 -29 158 37 315 196 200 434 153 189 264 12 -139 -143 -51 232 7 -160 0 -51 -364 -258 112 -163
2044a63O7m3m7J33J64M6m7K9m9j7k33K42J77l32J51q9K50j68l80K49Qq1L6k41
$$ -163 -96 -139 -186 -53 111 157 110 139 90 73 -160 82 259 -73 78 -11 239 71 -309 -60 -52 -133 -97 -338
2068c38J75K45r5j55L1R7R9L07n2l13MM8n5o6K90M7k34J88j64r8j85J35o3J14
$$ -338 -163 82 -13 -168 -137 -40 59 366 314 1 5 53 -2 -68 222 269 35 223 59 -39 -224 -89 -152 -38
2092c8r4J67l9k33J58K91j79P6l45O6lr0M61k54j11K15J36O3j44j31K50j76J40
$$ -38 -132 35 -4 -237 -79 212 33 109 -236 -170 -173 -263 198 -56 -167 48 184 247 103 -28 222 46 186
2115A86l39L61Pk57J12o2j27M4K48k36o9j8p8J67J18L0j6O4r8j43K42j83Pl4K58
$$ 186 -153 208 215 -42 70 8 -119 -75 173 -63 -132 -150 -228 -61 57 87 71 135 37 -106 136 -47 -40 -74 184
2140A84k56j03M27N1k61J59l50J89J13p4r3n2k4K30J85k36J10k47K36k41J56O3
$$ 184 -72 -175 252 303 42 201 -149 40 153 79 -14 -66 -90 140 325 89 199 -48 188 -53 103 166
2162A66m9m7j68J61k33J20j32l3L84r7k19L61m8j73k59L11p2N1J46pj54J15l5
$$ 166 117 70 -98 63 -170 -50 -182 -215 169 72 -147 214 166 -7 -266 45 -27 24 170 163 9 124 89
2185H9j50M08q6k2j72o9J76k07M9L9pN1m1q4k10J94N7m33L29p4J65j92K82j11
$$ 89 -61 347 261 239 67 -2 174 -33 16 55 48 99 58 -26 -236 -42 15 -418 -89 -163 2 -190 92 -19
2209a9j9K59m09L23K7q3mK95k85N3k58J84r1oj36L22k51jj18R8N4k25K48j76K29
$$ -19 -38 221 -188 135 162 79 75 370 85 138 -120 64 -27 -33 -169 153 -98 -99 -217 -119 -65 -290 -42 -218 11
2234A1j10j7RL2J32k00K34o6PR7j16M6l5j48J77o5K81k86O3r5j89N30m11K34J58
$$ 11 -99 -116 -107 -75 57 -143 91 25 32 129 13 59 24 -124 53 -12 269 -17 46 -49 -238 292 -119 115 273
2259B73k43J13j2p2j48R5j68K22m0K79m6n07M45n81N58k72K28j43p3r8J91j21
$$ 273 30 143 131 59 -89 6 -162 60 20 299 253 -254 191 -390 168 -104 124 -19 -92 -190 1 -120
2281a20L2J96p2j64K37P7l37O6K03j97R6j60K63qr3j16m8J51J20r1l84K08RL21
$$ -120 -88 108 36 -128 109 186 -151 -85 118 -79 17 -143 120 112 19 -97 -145 6 126 35 -349 -141 -132 189
2305A89k81K9m2J96M1j85K7l9M5J2p1J14J9J54j79M4P1j50J16n0J08J0k09K18
$$ 189 -92 -63 -105 91 132 -53 -26 -65 -20 -8 -79 35 54 208 29 73 144 -6 110 60 168 178 -31 187
2329A87k57j35N1O7J26j36r6J31j8o2kO17m87JK09k53p6N47l39j61J89Rj82Q0
$$ 187 -70 -205 -154 -87 39 -97 -193 -62 -80 -142 -144 473 -14 -13 196 -57 -133 414 75 -86 103 112 -70 10
2353A0k9J27O3m78N14j26J43k13L9Pj75R9Q8R6j72r5J93k1p2M0j48M27l15J54
$$ 10 -19 108 171 -307 207 81 224 11 50 57 -118 -19 69 165 -7 -102 91 70 -2 38 -110 317 2 156
2377A56M5j26k54J81n4J27J03kl6n1l15J86j53P3J14P7j82p3j4j0j4M03l05j47
$$ 156 201 75 -179 2 -52 75 178 176 140 89 -226 -40 -193 -120 -6 71 -111 -184 -198 -208 -222 181 -124 -271
2401b71N07l94K23j99R2O1l4K20p7j04l5l63L75J02o3J82k66o9LO8j16o3j89N33
$$ -271 236 -158 65 -134 -42 19 -15 205 128 24 -11 -374 1 103 40 222 -44 -113 -110 -42 -158 -221 -410 123
2425A23LJ1k26j20O0J25L5K5K1j26j56M4K88j16k20J04L45j37J30m6L7k10L20
$$ 123 126 137 -89 -209 -149 -24 11 36 57 -69 -225 -181 107 -9 -229 -125 220 83 213 167 204 -6 314
2448C14p2j99k2J31j78o3J46j29N4O2p5j29J18J43j94K96M3m13p1J08L50n15O04
$$ 314 242 43 21 152 -26 -89 57 -72 -18 44 -31 -160 -42 101 -93 203 246 -167 -238 -130 220 -295 309
2471C09k94K2j15J06J90l7J40k93j37J14q1PK47k47r4J77J25M2k68Q5p9J6L8j81
$$ 309 15 37 -78 28 218 181 321 28 -109 5 -76 -69 178 -69 -163 14 139 181 -87 -2 -81 -65 -27 -208
2495b08J65j01J84P6L8Pj44Jp8L36k92r6L33l12J68l06L77k36r3M1J69k63K84
$$ -208 -43 -144 40 116 154 161 17 18 -60 276 -16 -112 221 -91 77 -229 148 -88 -181 -140 29 -234 50
2518E0n0j8O6J45o9p0J95J5k27K5Pj84K20K68m90j6j9j22M00j82R7j8j75K55m7
$$ 50 0 -18 48 193 124 54 249 264 37 62 69 -115 105 373 -117 -133 -152 -274 126 -56 41 23 -152 103 56
2543E6n4n9L66k30r9OM9j91%K6j8Q9O1Kk1K28k68k1o1K02Rj04K07r9m18L27M3
$$ 56 2 -57 309 79 -20 -14 35 -156 -156 -130 -148 -59 2 4 -17 211 -57 -78 -139 63 72 -32 175 76 -342 -15 28
2570B8P4j76K09j88K53j73R2k4J14n4l23K24j95J42M2O5q3q8P4r4J44J08j04P2
$$ 28 102 -74 135 -53 200 27 119 95 209 155 -168 56 -139 3 45 110 27 -61 13 -81 63 171 67 139
2594A39j78K71k66J21k33M84l35p0k6J69k19L15j96J36l79K78j49M0m0K9J55j67
$$ 139 -39 232 -34 87 -146 338 3 -67 -93 76 -143 172 -24 112 -267 11 -138 -98 -138 -109 46 -121
2616a21L40k84J08L5k81J52K55k70J12J22k56k26L34r4K45k4l46J46j82M15l73
$$ -121 219 -65 43 78 -203 -51 204 -66 46 168 -88 -314 20 -74 171 147 -199 -53 -235 180 -193
2637a93K07j00K19q2k9N7j11k8j18M21j02j34K9o5p0J10m3J05K29k37L1l42r5
$$ -193 14 -86 133 51 22 79 -32 -60 -178 243 141 7 36 -29 -99 11 -32 73 302 65 96 -246 -341
2660c41M83j34J72k56o2N7j0m9J94J06j62l02P39l58k2L9m7J60j77J24k03j04
$$ -341 142 8 180 -76 -138 -81 -91 -140 54 160 -2 -304 435 77 55 94 47 207 30 154 -49 -153
2682a53M0K75J38k95Q1k89K59j04k6lL6oO9k4j71L05J9r1j38Op6N5O6J09P2j71
$$ -153 -113 162 300 5 86 -203 56 -48 -74 -77 -41 -47 22 -2 -173 132 151 60 -78 -72 -148 -93 -27 82 154 -17
2708a7L1j89K11K20k42p2r6K5J76j02Mk29M6P0R9q6K75j07j64K09l1p0K11l29
$$ -17 14 -175 36 256 14 -58 -154 -129 47 -55 -51 -280 -234 -164 -65 -151 124 17 -147 62 31 -39 172 -157
2732a57L11j78P8k8j73J45Q4j80r5K18j42r3J11M6J74q0m1Q1r8k4N3n6j25K9L66
$$ -157 154 -24 54 26 -147 -2 82 -98 -193 25 -117 -210 -99 -53 121 41 0 81 -17 -41 12 -44 -169 -140 226
2757B26l05K92K8m05J69k9M8j19K51J92P3l75mO1j30K49k93K85l1l32k6K49j69
$$ 226 -79 213 241 -164 5 -24 24 -95 156 348 421 46 42 103 -27 222 -71 214 183 -149 -175 74 -95
2780i5l3J60J73m00K12j07L04k38J97j55J8M0k1qJ62j01N0j33k17J44oK27O1P6
$$ -95 -128 32 205 -195 17 -90 214 -24 173 18 36 76 55 47 209 108 158 25 -192 -48 -54 173 234 310
2804C10l71K35j63oj59L24l59K51n6l41M57l04K15j92M4J8L34l16m3l6K37K5j68
$$ 310 -61 174 11 5 -154 170 -189 62 6 -335 122 -182 33 -159 -115 -97 237 -79 -122 -158 79 104 -64
2827f4J68j81J98l23K10m13O28j92p8k15J25K31j6K28m05L1M3j41M61k12q7k7
$$ -64 104 -77 121 -202 8 -405 223 31 -47 -262 -137 94 78 306 -99 -68 -25 -166 295 83 -4 -31
2849c1Nj14p6K85q2j30J29R9O6k57J40j36qJ35N2R0q3k79K38J32j9k86J98j02
$$ -31 -26 -140 -216 69 -13 -143 -14 85 151 -106 34 -102 -110 25 77 167 84 -195 43 175 156 -130 68 -34
2873c4K18j9k1p5k19L15l00J80K7k18J39L7KM5j2l7LK48m44K52K82j68k95K94
$$ -34 184 165 144 69 -150 165 -135 45 72 -146 -7 30 32 77 65 28 31 279 -165 87 369 201 -94 200
2897B00k46l1J67k60L32k65J44j34O4N0k39J57m7j41J58J42L4nm4Jj42j69L68
$$ 200 -46 -77 90 -170 162 -103 41 -93 -29 21 -218 -61 -108 -249 -91 51 85 80 36 37 -105 -274 94
2920I4j35N1j18J54M5j96J19nJ49k80JK84j31r7J77q3m1l7L4j90K28j03j1M35
$$ 94 -41 10 -108 46 91 -105 14 9 158 -122 -121 163 32 -65 112 29 -12 -49 -15 -205 23 -80 -91 344
2944C44l29r2q1J30R7j33J3K40k76M8P5QQ7q4j20J40k29K61Oj66J59j37q9k7K35
$$ 344 15 -77 -158 -28 69 -64 -51 189 -87 -39 36 44 131 47 -73 67 -162 99 105 -61 98 -39 -128 -155 80
2969H0J64k34J06k28K14k91N13o06L15p6j34J09%P3J09k74L66m40J73o5M6N2j23
$$ 80 244 10 116 -112 102 -189 324 -282 33 -43 -177 -68 -68 5 114 -160 206 -234 -61 -126 -80 -28 -151
2992a51L5j2J86o2J42j23j12m8P3K80m80L79R2j36L9q4j4n2O1p7r7Q1J08o5k27
$$ -151 -116 -128 58 -4 138 15 -97 -145 -72 208 -272 107 199 63 102 18 4 -48 13 -64 -161 -80 28 -37 -264
3017b64K03K71k19j65J61K8j05l7K64Kk45L15n5j06K72j46k56o3K86l26J99R7
$$ -264 -61 210 -9 -174 -13 15 -90 -127 137 139 -106 209 154 48 320 174 -82 -145 141 -185 14 111
3039A11k17J85k5J78k12j58j36J12P1Nk5N0r1J09r3K21N6l00J16q1J19O5p6k65
$$ 111 -106 79 54 232 20 -138 -274 -162 -91 -86 -111 -61 -152 -43 -136 85 141 -159 -43 -124 -5 60 -16 -281
3063b81K44J85n4Rr0L37m31J71k3j75J91Q0j20k0MJ28k33J33k65P8R3r8R6O9l0
$$ -281 -37 148 94 103 13 350 -81 90 67 -108 83 163 43 23 27 155 -78 55 -210 -132 -39 -137 -41 28 -2
3088bpj38K38J05n3k18j16J58p2N5P4J17j44l2j05l2J24m1L00l61J76K73k37r4
$$ -2 -9 -147 91 196 143 -75 -191 -33 -105 -50 24 141 -3 -35 -140 -172 -48 -89 211 -150 26 299 62 -32
3112c2m5j6j36l4K73K8%K4P1j95K9p6OJ99l49L14j5r6R8j81K58jj56J3K1K5n8
$$ -32 -77 -93 -229 -263 10 38 38 62 133 -62 -33 -109 -103 96 -253 61 46 -50 48 -133 125 124 -32 -19 2 27 -31
3139c1o4O8kL8j81M14j73J36j52J46j06M4K4k09j76L83j96N3o0m9J12O1j03q0
$$ -31 -95 -27 -29 9 -172 242 69 205 53 199 93 137 161 -48 -224 159 -37 16 -44 -93 19 80 -23 -103
3163a03J69o8k08M17j55o7j96N30k68j54K04p3l73J85Q6P8p9mj15L21k02K51l2
$$ -103 66 -2 -210 207 52 -15 -211 319 51 -103 101 28 -345 -160 -74 4 -75 -79 -194 127 -75 176 144
3186A44J4k25rj5O5Q5q6L31l02j32O0m83N61m24M85o3J7m6J9mP5k09K43n8M6j87
$$ 144 158 -67 -76 -91 -26 59 -27 304 2 -130 -70 -553 8 -416 69 6 23 -23 -4 -8 67 -142 101 43 89 -98
3212i8J11l81K13M08k14J02P0k58j09r4J2L02o6p9n4o4L35L5k02nJ26j91K9K67
$$ -98 13 -368 -155 253 39 141 211 -47 -156 -250 -238 64 -2 -81 -135 -199 136 171 -31 -36 90 -101 -72 195
3236A95k11P3R3j17j8L9q0O2j60K96K4P3j65J14k97q1L47k13J33j75q0l8K79J79
$$ 195 -16 57 150 33 15 54 -26 36 -124 172 196 269 104 218 -79 -160 187 -26 107 -68 -148 -186 93 272
3260B72k84k6k07M07pj62j24J49Q5j67n6K79j52p9L1J3o4J46K0o6pn2J67j67J86
$$ 272 -12 -38 -245 162 155 -7 -131 18 103 -64 -120 159 7 -72 -41 -28 -92 54 74 8 1 -51 116 -51 135
3285A35j43k39J83k19K57L3k27K98O8l02j07K41j15K59j6J70l13K24m6k51Q1l04
$$ 135 -8 -247 -64 -283 -26 7 -220 78 146 -156 -263 -22 -137 122 106 276 -37 187 141 -110 -29 -333
3307c33M57l85L84j04k60J87P8Q4K7N8j71n5j11K12j55J19k05J10m3KL72m58L25
$$ -333 124 -261 123 19 -241 -54 24 108 135 193 22 -33 -144 68 -87 32 -173 -63 -106 -104 268 -190 135
3330A35j19j68J33J02M9k52j9L41k24K31j49Q7J99q7j32j70n0M3R6R9j61R2j60
$$ 135 16 -152 -19 83 132 -120 -139 202 -22 209 60 147 346 259 127 -43 -93 -50 46 145 -16 76 -84
3353h4N5L09l07J23k08o7L4J05m5J36k94K66k28J33r3J78j22K56o1k65L11l76
$$ -84 -29 280 -27 96 -112 -179 -145 -40 -85 51 -243 23 -205 -72 -165 13 -109 147 86 -179 132 -244
3375b44J58K52O1n10M24J55l96Np5L5J85j72M1j29K50M5k13n5J63j04N7J11P8
$$ -244 -86 166 227 -283 141 296 -100 -95 -170 -135 50 -122 -81 -210 40 85 -128 -183 -20 -124 -67 44 122
3398A22J8k11O7j45R0J94l13l9J38J74j96l6J41l0r1J67Mj93j64J59J56L7j99
$$ 122 140 -71 -4 -149 -59 135 -178 -217 -79 95 -101 -137 4 -26 -117 50 54 -139 -303 -144 12 49 -150
3421a50J9M8k20L63l7n7nJ30L3k64K43o6l8O3J20l37J07n9J54K24k57Pk03J97
$$ -150 -131 -83 -303 60 23 -34 -39 91 124 -140 103 37 -1 62 182 -155 -48 -107 47 271 14 21 -182 15
3445A5p5J27j8K6r0j64K32j5J16l73o0J92mR0j28O0l3P0Q0k61L82j82j41J26m5
$$ 15 -60 67 49 75 -15 -179 53 38 154 -219 -279 -87 -91 -1 -129 -69 -102 -32 48 -213 169 -13 -154 -28 -73
3470g3r3J47j68M56k47q6N1n9J80l60J30k00J82j7L60j1j17k09K02o7N3j86q2
$$ -73 -166 -19 -187 269 22 -64 -13 -72 108 -252 -122 -322 -140 -157 203 192 75 -134 68 1 54 -132 -214
3493b14M6K64M6j53R0k24N0K2J14q7k5O3J52l45L83l85M43j49p4r0j27K96j46
$$ -214 -168 96 142 -11 79 -145 -95 -73 41 -46 -71 -8 144 -201 182 -203 240 91 17 -73 -200 96 -50
3516e0K05k29Jpj7j84L27n5k39K52j83J60J2l08K11K61l77N5J83N0j65J13lk71
$$ -50 155 -74 -73 -80 -97 -281 46 -9 -248 4 -179 -19 -7 -315 -104 157 -220 -165 18 68 -97 16 13 -258
3540b58L52R7n27L91J15m0n6k46M8k59N83l12J65j50M1L2n2k51L41j71Q2O9Q9
$$ -258 94 191 -336 55 170 130 74 -172 -124 -383 200 -112 53 -97 -56 -24 -76 -327 14 -157 -75 -6 83
3563H3n0m00N21j83j71L49p8k2j6q4P1p6K59J6j63Oj17K51k24j2K52m22J97M0
$$ 83 33 -367 154 -29 -200 149 71 49 33 -51 20 -56 203 219 56 62 -55 196 -28 -40 212 -210 -13 27
3587B7J12k34O9N9j0K0N1J89m54j7J57J06k34K60oj27p9J39j08K18Rj65K02j43
$$ 27 139 -95 -26 33 23 43 94 283 -171 -188 -31 75 -159 101 95 -32 -111 28 -80 138 147 -18 184 41
3611D1j32J10j33L48k38j22L95l25J42o7J01m6J63o48J40K22m2J29k44K20k05
$$ 41 -91 19 -114 234 -4 -126 269 -56 86 19 120 74 237 -411 -271 -49 -91 38 -206 14 -191
3632a91Q2J04K10k58L04m64M54j27k6k95L32k9R0l95q8M47m30L19j07J30K3K8
$$ -191 -109 -5 205 -53 251 -213 241 114 88 -207 125 96 186 -209 -297 150 -280 39 -68 62 85 113
3654A13k5j03p2J32K2O2j45j1J3M6j37J38l7J2J7j91L3Q8J15L64n39r0K49p0p7
$$ 113 88 -15 -87 45 67 129 -16 -27 -14 32 -105 33 -4 8 25 -166 -133 -45 70 434 -105 -195 54 -16 -93
3679i3J05k23M92m4l88J14J80q9K4l04J82N8K2l7p8r3Q7l2q5K17r4J65J97l76
$$ -93 12 -211 281 237 -151 -37 143 54 78 -226 -44 14 36 -1 -79 -172 -85 -117 -202 15 -79 86 283 -93
3703i3P1J64nj21o2J14o8k29J87L11k27j26J2J96j21Q5k72K19J65l68Q9m6J95
$$ -93 -22 142 137 16 -46 68 0 -229 -42 269 42 -84 -72 124 3 88 -184 35 200 -168 -79 -125 70
3726G0j35J44K9j44j0l7o4J23J32o6k54J84J49l6j07l2K5L00j01j94Q9K96k04
$$ 70 -65 79 108 -36 -46 -83 -147 -24 108 42 -212 -28 121 85 -22 -54 -29 271 170 -24 65 361 157
3749A57k23r9K9J13J14j38J63m45M1K90rj2M25o92L17J78j15j88J42K1l32J95
$$ 157 -66 -165 -136 -23 91 -47 116 -329 -288 2 -7 -19 406 -286 31 209 94 -94 48 69 -263 -68
3771f8j33J93j56R2L18l93L28m23K81K9j64J09k21R8J48Pj7k15J67K31K6l27K5
$$ -68 -201 -8 -164 -72 246 -147 181 -242 39 68 -96 13 -208 -110 38 45 28 -187 -20 211 237 -90 -65
3794f5Ro6p4j9L53j20J37r3j77K9P1Q8O4k22K53j81M9L5q0M6k5j7j1n3J00m2K9
$$ -65 -56 -122 -196 -215 138 18 155 62 -115 -86 -15 73 137 -85 168 -13 36 71 -9 37 12 -5 -16 -69 31 -11 18
3821A8n9P9J54k33j32J65j35K7pK12j77K7J53l9Q6j34Q9l13P5R0k02N18l61J37
$$ 18 -41 38 192 -41 -173 -8 -143 -116 -123 89 -88 -61 92 53 139 5 94 -219 -144 -54 -256 262 -99 38
3845C8l3j17lK13j29N8n3J97Q6m1k80m2K07p5n1l23K14K34J14k74N9m11L42j3
$$ 38 5 -112 -115 98 -31 27 -26 171 257 216 -64 -106 101 26 -25 -348 -134 100 214 -60 -1 -412 -70 -83
3869h3L9j3J67NQ5j50Q6j52j53J39q4J10j58L27j72L68m21q3J38j90L14j54J23
$$ -83 -44 -57 110 115 200 50 136 -16 -169 -30 -114 -4 -162 165 -7 361 -60 -143 -5 -195 119 -35 88
3892H8k50L9L02l38J11p9R7K29j36P1r6J21l7R1l1k05J29J69k68r9j10L63k31
$$ 88 -162 -123 179 -159 -48 -127 -30 199 63 134 38 159 122 213 182 -23 106 275 7 -92 -202 161 -70
3915g0L26j34l86L10P0o3k23J57R9K0j45j14K69m03J14J0L9K48k24p6J70J68k4
$$ -70 256 122 -264 46 116 53 -170 -13 86 106 -39 -153 116 -287 -173 -163 -124 124 -100 -176 -6 162 138
3938A38k67L35o6m02K76J00j64J03l17L11k24O7Q5K59k97j28M69j97j41K45j68
$$ 138 -129 206 140 -262 14 114 -50 53 -264 47 -177 -110 -25 234 -63 -191 278 81 -60 185 17
3959A7j60J49J36j35Q7K5J59k90J62j59J93k75p0J84j8L2q1J3j8k46J01L62k04
$$ 17 -143 6 142 7 94 119 278 -12 150 -9 184 -91 -161 23 5 37 -44 -31 -49 -295 -194 168 -36
3982c6L39l73J48J2j72NJ75j11j29K14m9l60N13j15k34M0J93j94M00n13K82k6
$$ -36 303 -70 78 90 -82 -77 98 -13 -142 72 23 -337 176 61 -173 -133 60 -134 266 -247 35 9
4004Ik1J85j56n7M5N2j38o2K3j75J33P9K53j89K32k15N2m33L94PP2j73K82m40
$$ 9 -12 173 17 -40 5 57 -81 -143 -120 -295 -162 -83 170 -19 213 -2 50 -383 11 18 90 -83 199 -241
4028b41P5Q6JO2j4J50n1Jl50J45pK93j41j70O8J46j4pl08M24j64n9K82j88rJ21
$$ -241 -166 -80 -79 -17 -31 119 68 69 -281 -136 -143 150 9 -161 -93 53 39 32 -276 148 -16 -75 207 19 10 131
4054A31k45K13j66K69J4m50J36J35n8k8L04k58j74K15k97L83R1k66r8J74m6K08
$$ 131 -114 99 -67 202 216 -234 -98 37 -21 -49 255 -3 -177 38 -259 124 215 -51 -149 25 -21 187
4076A87Q3j33k46P0O1Q3j36n7n6L1o1J41J43l04J96J53n00L69J61j78j34L05j93
$$ 187 270 137 -109 -39 22 105 -31 -88 -144 -113 -174 -33 110 -194 2 155 -345 24 185 7 -127 178 -15
4099a5J6Q2r7O5J4K52j93N3j35j85mK12j4q1J04Q3j56J28l82r4K61o7QK95m07
$$ -15 1 83 -14 51 65 317 124 177 42 -143 -147 65 51 -30 74 157 1 129 -253 -347 -86 -153 -145 150 -257
4124b57L92j05p6pK56j71j83J32R9j04%q0J30j8Rj94M43k71P2Lj84K65k07j44
$$ -257 135 30 -46 -53 203 32 -151 -19 80 -24 -24 -104 26 8 17 -177 266 -5 67 70 -114 151 -56 -200
4148b00K39J35l2k9j83J92n35M85K8j4N1L5q6K4k54r0K1N5J87R0k86R2K00l47
$$ -200 39 174 142 113 -70 122 -413 72 100 86 137 172 86 110 -144 -234 -213 -158 29 119 -167 -75 125 -222
4172b22J53K89l3j61J72j7k71J45m8j41L97m01Mj36K78j67QK78j07k40K26N4L9
$$ -222 -69 220 187 26 198 181 -90 55 7 -134 263 -138 -134 -270 8 -159 -151 127 20 -220 6 60 99
4195I9r9QJ26O7j63j87R8j34J12J0J49j76q8L56K0k15J40p3m2O0J7K1J9k10k30
$$ 99 0 8 134 201 38 -149 -51 -185 -73 -63 86 -90 -178 178 198 -17 123 50 8 68 85 106 125 -85 -315
4220c15J92K28r7R0k18J42j06J86j67J85j49k11L78k04p5jM53k93qK8o7j08K15
$$ -315 -123 105 8 98 -120 22 -84 102 -65 120 -29 -240 138 -66 -141 -142 311 18 10 38 -29 -137 78
4243G8N2j50j25q8N18l68n2K46j81L3K81r2l34K18j16J59j45n4p2M19l30R0n1
$$ 78 130 -20 -145 -233 285 -83 -135 111 -70 -37 244 152 -182 36 -80 79 -66 -120 -192 227 -103 -13 -64
4266f4L3k47L31p5J19j42j7L20l91j6J1M54n31r8J67N7l0P1j6L2o6MJ15M2k03
$$ -64 -31 -278 53 -22 97 -45 -62 258 -133 -149 -138 316 -215 -313 -146 -89 -119 -48 -64 -32 -98 -94 21 63 -140
4291a40K58l45K15J2L3q8J20p8O4j19P8J61j50j18J11L4J00j54KrK7Ml2j93L42
$$ -140 118 -227 -12 0 33 -55 65 -13 51 -68 10 171 21 -97 14 48 148 -6 -4 -13 14 18 -14 -207 135
4316A35l21K64k65L18j26O7Q0k63M73k84j83J27p3j34j58L61L7n7N7j57J39k3
$$ 135 -186 78 -187 131 5 72 152 -111 362 78 -105 22 -51 -185 -343 18 55 -2 55 -102 37 14
4338A4J07k29J20P7Q4j07P8j42j17n6J96J64m57L40k9m7j24L8QK48q8j58L41k51
$$ 14 121 -108 12 89 173 66 144 2 -115 -171 25 189 -268 72 43 -4 -128 -90 -82 166 78 -80 261 10
4362A0P3Rj50J24L3j89p3L59j66m5j50MJ19k5L61l93n5K29q4J20l0P3l13J46n5
$$ 10 83 92 -58 66 99 -90 -163 196 30 -15 -165 -161 -42 -67 294 -99 -154 75 -9 111 81 154 -159 -13 -68
4387f8P0K24Rk44l2k6rJ99j00j15K23l98K89j63J34r9K22j27K29l01N1l14M24
$$ -68 2 226 235 -9 -41 -67 -76 123 23 -92 131 -267 22 -141 -7 -106 116 -11 218 -83 -32 -346 78
4410G8K57l43J9j97k0L67q0o0ML5n2K8j56K46j86n6M6PJ12L1j86J50k7K07j81
$$ 78 335 -8 11 -186 -206 161 81 21 25 60 8 36 -120 126 -60 -116 -70 -63 49 80 -106 44 17 224 43
4435D3Q5l4r8mL0k44L31J80k56k82K15N6P8l44K90o3l5M2Po6Q6N2Kl0k56L04k16
$$ 43 128 94 -4 -8 22 -222 109 289 33 -249 -34 22 100 -244 46 -17 -52 -10 -3 -69 17 69 71 41 -215 89 -127
4462a27J04J73k0j49m7J3K20k67Q3K22k70N0j08K68k90P9K2K7k93M44j75K50l86
$$ -127 -23 150 130 -19 -66 -53 167 -100 -17 205 -65 -15 -123 145 -145 -66 -44 -17 -310 134 -41 209 -177
4485a77o7J07K90k10j39L74j92p4J55R0r0k49P4J56k45k8J04K84j20K1J5J55r6
$$ -177 -244 -137 153 -57 -196 178 -14 -88 67 157 67 -182 -108 48 -197 -225 -121 163 43 64 79 234 138
4508A38k98K49K4j98n8J83k09J31J4j39K89j23J29j56J14P0k67J99K6k23J2K15
$$ 138 -160 89 113 -85 -143 40 -169 -38 -24 -163 126 3 132 -24 90 160 -107 92 118 -105 -93 122
4530A22j79J94j45j88O4K67j47n7J11q2J06j9j20P2pj02L09m25K69p9Q3J27j62
$$ 122 -57 137 -8 -196 -132 135 -12 -69 42 -40 66 47 -73 -1 -8 -110 199 -226 43 -36 47 174 12
4553A2p4P2Q2k14J53j1J0J71k16K39l05j3M2O3q0K92j49l41O4K87J18k51q1m6
$$ 12 -62 10 92 -122 31 20 30 201 -15 224 -81 -94 -52 11 -69 223 74 -267 -203 84 202 -49 -130 -176
4577a76J3M4M2r5K9N03k47K1l33K08Lnj50%K60l22R4%L13J20j73j36N4m5k24k9
$$ -176 -163 -119 -77 -172 -143 360 113 134 -199 9 12 7 -143 -143 117 -205 -111 -111 202 322 149 13 67 22 -202 -231
4603b31K07j1K76j10J5k1j95j27L30j12j59L1L02j97K49j58R3p2m1MM5k52J76
$$ -231 -24 -35 241 131 146 125 -70 -197 133 21 -138 -107 195 -2 247 89 182 110 69 73 118 -134 42
4626D2J33J4m84K08K11p3M7ol8p4l1M7j28M18k62m9LJ47j4m15J15K12K7K12q4
$$ 42 175 189 -295 -87 124 51 98 92 54 -20 -51 -4 -132 286 24 -25 -22 125 111 -304 -189 23 50 262 178
4651A78k54J60l6j40L16k88J47n3j86J48q5J24r1K41j04ok3m6K03j18k23K92o03
$$ 178 -76 84 48 -92 224 -64 83 30 -156 -8 -93 31 -60 181 77 71 48 2 205 87 -136 156 -447
4674d47K68K05k23J70Q0j13l81Q91o23K69k56J67p3K7p7J04N1J47k45N9j80J40
$$ -447 -179 26 -197 -27 53 -60 -441 450 -173 96 -160 7 -66 -39 -116 -12 39 186 -59 0 -180 -40
4696d0M2J81mr7pl00M05j84J49k32Q9J02K5m59J79RJ49n3K3j23J31j5K12q4j81
$$ -40 2 183 179 82 75 -225 180 -4 145 -87 2 104 129 -330 -151 -142 7 -46 -23 -146 -15 -30 182 98 -83
4721h3k07J62j64K54K35j33q5j55J05j17K01M8j74j1L23j28pM8J15k80J22j40
$$ -83 -290 -128 -292 -38 197 64 -21 -176 -71 -188 13 61 -113 -124 199 71 64 112 227 -53 69 -71
4743g1O5R3k34J69M02k24l5r7j43l0J94k20M8K28p9k69K03M2k82L23k63M9J89
$$ -71 -6 87 -147 22 424 200 165 68 -75 -105 89 -131 -83 145 66 -203 0 42 -240 83 -180 -131 58
4766E8q4k16N1r0M29o4j84N2r8K30n6J12j19pQJ12J13j84q2K01Pk06nj17K73j80
$$ 58 -26 -242 -191 -281 148 84 -100 -48 -146 84 28 140 21 14 22 134 247 63 -19 182 189 -17 -22 -139 134 -46
4792d6L5l6M32j36l85J47O5m3N6%J08k04o4J30O7m6p3m8j67M17j4k29K12l74J88
$$ -46 -11 -47 385 249 -136 11 76 33 89 89 197 -7 -71 59 126 80 7 -41 -208 209 195 -34 178 -196 -8
4817hJ38k57J41Q1QJ71l59J29j81K52j36j89M23l25R6j69K81k25K68o2k17K61
$$ -8 130 -127 14 95 103 274 -85 44 -137 115 -21 -210 213 -112 -16 -185 96 -129 139 77 -140 121
4839A21j39Oj29J43J5PO9j5j48M3R6l6J35n40L36p1L05lj80Kj84R7j94L29J80
$$ 121 -18 -12 -141 2 17 24 93 78 -70 -27 69 33 168 -372 -36 -107 198 195 15 17 -167 -70 -264 65 245
4864B45k43l0M4K0j43k2R5R4j15J1p8m3Q0J30n6j18K15j71J34J52q6l36J71k48
$$ 245 2 -28 16 36 -107 -129 -34 60 -55 -44 -122 -165 -85 45 -11 -129 86 -85 49 201 115 -221 -50 -298
4888b98M69k31m1J77j48L3K42k15j82J48L41l94j66K82l53L85o4p7M4M3jj95J01
$$ -298 171 -60 -101 76 -72 -39 203 -12 -194 -46 295 -99 -265 17 -336 49 -15 -92 -48 -5 -6 -201 -100
4911a00Q7J72j85O1Jj7l1k9O5j38J28j84L38j45n5o4J5J89j66j1K13o2k59m4K46
$$ -100 -13 159 -26 35 36 19 -12 -41 24 -114 14 -170 168 23 -32 -96 -81 108 -58 -69 144 82 -177 -221 25
4936B5J6n0K9J43j34r7L55k25P1l32J90J8l95M45J79j62o8J01LO4n7m0o5n7k10
$$ 25 41 -9 20 163 29 -68 287 62 133 -199 -9 9 -386 59 238 76 8 109 112 176 119 79 14 -43 -253
4961b53K46L05l55K4J76k45J11j06R2l1J2lj18j12K15J17R5J44l56J72j12O5r1
$$ -253 -7 298 -57 -33 143 -102 9 -97 -5 -36 -24 -27 -145 -257 -42 75 170 314 -42 130 18 83 -8
4984hq1MJ01K97m91J80m7J58m7m8j00J55Q5j74l41L06q3J48q2K2Kj33o6M0Q3j30
$$ -8 -89 -85 16 313 -178 2 -45 113 66 18 -82 73 158 -16 -357 -51 -134 14 -68 -46 -44 -177 -243 -203 -120 -250
5010b50L44L1q0Q9l2j41J08j93k6K39j74Q5O7oK11l77jj24q8L23Q3k86k9J59j13
$$ -250 94 125 45 134 102 -39 69 -124 -150 89 -85 0 67 61 272 -105 -106 -230 -318 5 88 -198 -227 -68 -181
5035a81J86On8j67K74j59J73N7O0k81K87j73k69J56L09k84R2J53m56L94n3j54
$$ -181 5 11 -47 -214 60 -99 74 131 191 -90 197 24 -245 -89 220 -64 28 181 -275 119 66 -88
5057h8j9P5L02n76J22L85k18J74mk16Pj31K53j30KK57k38Rr9K22J52j09j4J3k60
$$ -88 -107 -32 270 -306 -184 201 -17 157 153 -63 -56 -187 66 -64 -62 195 -43 -34 -133 89 241 132 118 131 -129
5082a29L31J9k84K11Q8k50j96L31R2M9k06l81M11j04R6K5j62K49j07p2J12O4k19
$$ -129 202 221 -63 148 236 -14 -210 121 213 262 56 -325 86 -18 78 103 -59 190 83 11 123 187 -32
5105c2l1L27l24M6M7m9L2r3j36J16J79j12L02n15K97J51k72J0M8j55K43k94K02
$$ -32 -63 264 -60 -14 33 -16 16 -77 -213 -97 82 -30 272 -243 54 205 -67 -57 -9 -164 79 -215 -13
5128a3N7M3KJ9j95J25J14j73l01J24qJ85L1J70l8j51j5J57O2j37o5j05O7mJ05
$$ -13 44 87 89 108 -87 38 152 -21 -322 -198 -206 -21 10 180 142 -9 -24 133 195 58 -7 -112 -45 -49 56
5153E6j59K10l27J2L46p6K5o2j86j8K52k84L48j81j29K52P3j47J76K1l17Q8r0
$$ 56 -103 107 -220 -208 138 62 87 25 -161 -179 73 -211 137 -44 -173 79 152 5 181 202 -115 -27 -117
5176a17o6K43j0k47J44K58k71j03K56k49L51l51K87p9l7j81L45j51Jk5J3N8k07
$$ -117 -183 60 50 -197 -53 205 -66 -169 87 -162 189 -162 125 46 9 -172 173 22 23 -2 11 69 -138
5199a38J5J69rR7j3j73Q1K51p5j88K8l37M15m23L90j43n5J34No5J47j22j35K75
$$ -138 -123 46 37 134 121 -52 29 280 205 17 45 -292 123 -300 90 -53 -108 26 31 -34 113 -9 -144 131
5223A31l5k86M5L09K2J26m15L75k73k92J91j15j52M29j58R9q5K52m02N01r6k92
$$ 131 96 -190 -145 164 186 312 -103 272 -1 -293 -102 -217 -369 60 -98 1 -84 168 -234 267 171 -121
5245a21K2P1l8K2J41l49K52k72R5K34j14J83k41K40K1l16K28k01K39l04L83j54
$$ -121 -99 -28 -66 -44 97 -252 0 -272 -177 57 -57 126 -115 125 146 -170 58 -143 96 -208 175 21
5267B1r3j43J94P6l8O6J45m71K70j07L00l08k9K14j85l9p9J77o5J0J02J80j72
$$ 21 -72 -215 -21 55 17 83 228 -243 27 -80 220 -88 -117 97 -88 -127 -206 -29 -94 -84 18 198 26
5290B6P6j57J16j8P7j40M9j54J88j06j7K48j87Q5j14p7R2Q3K36k98q7L11l46l3
$$ 26 102 -55 61 43 120 -20 29 -125 63 -43 -60 188 1 86 -28 -105 -13 70 306 8 -79 232 -114 -147
5314a47J84j27K73Jj24Q3j96n2J9Q9J28j98J47n0nJ11k70j31J22O24l99mN5k69
$$ -147 37 -90 183 184 60 143 -53 -105 -86 3 131 -67 80 30 25 136 -134 -265 -143 481 82 78 133 -136
5338a36o4K49OJ26l45K26P1j43M5J14r9J9j73J31J4M9j31l6j42K34j0j36L41j15
$$ -136 -200 49 55 181 -164 62 133 -10 35 149 50 69 -104 27 41 90 -41 -77 -219 15 5 -131 210 95
5362I5n6k90K31q0K67j01Q2k70J48%J59k11j40L15j55j0K03k19l1J15k9j66L41
$$ 95 39 -251 -20 -100 167 66 148 -122 26 26 185 -26 -166 149 -6 -16 187 -32 -63 52 23 -143 198
5385A98k89K19P7l55M2n7K01j92J32l19M94j4l7j35P5j44N4q0k24M62j58n1L79
$$ 198 -91 128 205 -150 -108 -165 36 -156 -24 -343 151 137 100 -35 40 -104 -50 -130 -354 108 -50 -101 278
5408B78k73R3k83N11n46J95K2M1n1p1M9j78K62L3k4k24L41rn2j31L4m11N43j11
$$ 278 5 98 -185 326 -220 -25 -3 38 -13 -84 -35 -213 49 82 58 -166 175 166 114 -17 17 -394 149 38
5432C8K30l06n9lk1l3r8J90J73k52L47k32k9p0L66jk33n0k8L0%L9j73J85j84J89
$$ 38 268 -38 -97 -100 -121 -154 -252 -62 111 -141 206 -26 -55 -125 241 240 7 -43 -71 -41 -41 -2 -175 10 -174 15
5458A5k09K33R6Q1k07R3j26p8J96M1j54j27J10p8J17L1jj47R0M7R4l9q8q4J48
$$ 15 -194 39 135 216 9 102 -24 -102 94 135 -19 -146 -36 -114 3 34 33 -114 -24 23 117 78 -10 -94 54
5483E4J08k5j49j09K89k29K04O8k1j52Q7j36k50K21L53k57J02k43Q9K91k22j80
$$ 54 162 137 -12 -121 168 -61 143 211 190 38 125 -11 -261 -40 313 56 158 -85 4 295 73 -107
5505a07L5J11j58k7J94o3J1O4j94K20m01J24J51O4Q4k52Q4o9N5J32M2J62l51j01
$$ -107 -72 39 -119 -146 48 -15 -4 60 -134 86 -315 -191 -40 24 108 -144 -60 -129 -74 58 100 262 -89 -190
5529a90J79r7K52k93K32J27k97M67k40j13J41k55K27k4k06m4J39j54QJ25P9o5
$$ -190 -11 -108 144 -149 83 210 -87 380 140 27 168 -87 140 116 -90 -134 5 -149 -141 -16 63 -2
5551bl46L70k65J60M9j76O8K98k89j26K66M14l12k40L31j78N3J4m99M73k17K84
$$ -2 -348 22 -243 -83 -34 -210 -142 156 -133 -259 7 421 109 -131 200 22 75 89 -410 63 -154 130
5573A30J56l32R2j84K86j35q3P6K9j35K14r1k8rJ26k04J38n8p7n9J67P0j11j69
$$ 130 286 -46 46 -138 148 13 -70 6 35 -100 114 23 -5 -14 112 -92 46 -12 -89 -148 19 89 -22 -191
5597a91N25n33K00n8K05k46J89j52j65K83m7J48l1k90J22J58k60K04P4j74j22
$$ -191 334 -199 1 -57 148 -98 91 -61 -226 57 10 158 127 -163 -41 117 -143 61 135 -39 -161
5618a61J17L05m79N4J79j93p9Q6L73r9k65L14k27k01L54l87N51j95kL8q7k6M2
$$ -161 -44 261 -218 -164 15 -178 -257 -171 202 103 -162 152 -75 -276 78 -309 242 47 45 83 -4 -30 12
5641A2J2K76l80J24M7K23j64k5k9j72q4oJ24R0m8k09j3L12P3o2j58J7K99L3l56
$$ 12 24 300 -80 44 91 314 150 125 96 -76 -160 -166 -42 48 0 -209 -222 90 163 101 -57 -40 259 292 -64
5666f4k4J67j60L1J86j84k96K69k69M45J15k88R8k19q0N32j43M6j60K35m10K37
$$ -64 -88 79 -81 -50 136 -48 -344 -75 -344 101 216 -72 26 -193 -273 259 116 162 2 237 -173 64
5688F4j54J71K18j87o2J20q6O7k81n7M5J70l18K62k9L26n27L22j52J44n1Kn9j82
$$ 64 -90 81 299 112 50 170 84 151 -130 -187 -142 28 -290 -28 -57 269 -258 64 -88 56 5 7 -52 -234
5712b34M78k77k39L68j01J37Q4j48M4Ml33J15J17j7pm4K92j8pq8K4l03J60j79
$$ -234 244 -33 -272 96 -5 132 216 68 112 116 -217 -102 15 -2 -9 -53 239 221 214 126 150 -153 7 -172
5736a72j04J64K04j50L91m05N5J30m25n9L36J98p9k49J50p8j23kL07k22J24r1
$$ -172 -276 -112 92 -58 333 -72 -17 113 -312 -371 -35 163 84 -165 -15 -93 -216 -218 89 -133 -9 -100
5758a00N1L97l55K6n9k1j00K68j42o2K62j98r1K94j84O2l13K81mJ75k0K32m97
$$ -100 -49 348 -7 19 -40 -61 -161 107 -35 -97 165 -33 -124 170 -14 48 -265 16 12 187 167 399 -98
5781i8K85k84l8Q6j79K45k79K26j52K07j02J50k43J53r8n9K21p5j21K2nJ34k94
$$ -98 187 -97 -135 -49 -228 17 -262 -36 -188 19 -83 67 -176 -23 -121 -180 41 -34 -155 -133 -138 -4 -298
5804b98N8K36j66K40L5O9O8q0k5l14K75n1r5lK2J36j62J74k21L02o4k53J85k11
$$ -298 -240 -4 -170 70 105 174 242 162 137 -177 98 47 -48 -51 -29 107 -55 119 -102 200 136 -117 68 -143
5828a43K84n7j61M5Nk23J29J17K25j37n4j62J15J59k51K13j87R0km3M3j0J93k76
$$ -143 141 84 -77 -32 -27 -250 -121 -4 221 84 30 -132 -17 142 -109 104 -83 7 5 -38 5 -5 188 -88
5852h8P4M0q8J99j5j98p3P6J82l18M41l32N7N0j06L1J33j60J49j02L0n5Q7j43
$$ -88 -14 26 -62 137 122 -76 -149 -73 109 -209 232 -100 -43 7 -99 -68 65 -95 54 -48 -18 -73 14 -129
5876a29N5J48j76J77K6K9j41j79J42J38l21L19p6m7J82m98J47L63j28p7q4J26
$$ -129 -74 74 -102 75 101 130 -11 -190 -48 90 -231 88 12 -35 147 -351 -204 159 31 -46 -130 -4
5898d%no0J39m2J26q5k7j45L35j39K25k57k16Q2O3J24j11J45kj99k12K60J14j47
$$ -4 -4 -9 -69 70 28 154 69 42 -103 232 93 318 61 -155 -73 -10 114 3 148 146 -53 -265 -5 109 -38
5923c8k5N9k57L27m3R0l3L7o3l5R5l35L39j12k35K99j59L3K03l63K15O2M25m24
$$ -38 -63 -4 -261 66 23 113 80 117 54 19 114 -221 118 6 -229 70 -89 -56 147 -216 -1 61 486 62
5947F2m3J2j5O0l05L35j52Q6k68J96n1k17L10Q1L6O8j15j49m0J0Mp6N12n85K86
$$ 62 19 31 16 76 -229 106 -46 40 -228 -32 -83 -300 10 91 127 195 80 -69 -109 -99 -95 -171 341 -244 42
5972D2J47k67K02k08L01N6k63J94k58P1K76k09J1j04K42l49K37k34L10j06p6k00
$$ 42 189 -78 124 -84 217 273 10 204 -54 17 293 84 95 -9 233 -116 121 -113 197 91 15 -185
5994a85M12k11R5q6J05j16Q0j13j79J97j29K65m1k59J29J41q6q4j20O4J13K37
$$ -185 227 16 111 25 130 14 94 -19 -198 -1 -130 135 94 -165 -36 105 19 -65 -185 -121 -8 229
6016B29P9l06j48J99J7Ql00L71r9K15n78K69Q6K1N6j8J35j74J30l20J43j08J35
$$ 229 308 2 -146 53 70 78 -222 149 50 265 -313 -44 42 63 119 101 236 62 192 -128 15 -93 42
6039D2K61k48q9j65K63j37K62k19L14j85k10K59k46k8K5j0K89J9l06K26N7l14
$$ 42 303 55 -34 -199 64 -73 189 -30 284 99 -111 148 -98 -126 -101 -111 178 197 -109 117 174 -140
6061a40j08L36N4j35Q8n6J21o7j6j89R6J3j30Q3L44j60k23K10l53J90N4k11K45
$$ -140 -248 88 142 7 95 39 160 93 77 -112 -16 -3 -133 -50 294 134 -89 121 -232 -42 12 -199 46
6084D6j08L4M1J5J61j01Jp9K39l08%j4J23q4r6K1J17l2j59K64l81L70K2j72k40
$$ 46 -62 -28 13 28 189 88 89 10 249 -59 -59 -73 50 -34 -130 -109 8 -24 -183 81 -300 70 92 -80 -320
6109c20K86j06J80j12J89j72R9l24L77L3o7r8j74K62p9k3N1O1np3o1j7L12k05
$$ -320 -34 -140 40 -72 117 -55 44 -280 97 130 63 -35 -209 53 -26 -49 2 63 58 -15 -76 -93 219 14
6133A4k10J55K29k86k2K47N7p6k21L94m79L04Q9m57K88J25k82K68p2j7O2J56m19
$$ 14 -196 -41 188 -98 -120 127 184 108 -113 281 -198 106 195 -262 26 151 -131 137 65 48 110 266 -153
6156a53P4J18q4j75L28K15j20j15p6j3j31R6K38Rk22k81J29K77l37L96j92j16
$$ -153 -79 39 -45 -220 108 323 203 88 12 -1 -132 -36 202 211 -11 -292 -163 114 -223 173 -19 -135
6178a35L22k22J49j39j02j23K93qk59L02j11j37K44j51J41l9J18k9p3j01J21R5
$$ -135 187 -35 114 -25 -127 -250 43 35 -224 78 -33 -170 74 -77 64 25 143 114 41 -60 61 156
6200A56k94j0J49O9p0R0L7l62J37J64J59j68J35l00o7K69J01j92l0n9j64L61R6
$$ 156 -138 -148 1 70 0 90 127 -235 -98 66 225 57 192 -108 -175 94 195 3 -27 -86 -250 111 207
6223B07j72j88N6k92M23m6L80k47j43J04j27K23l23J82Ok15J08r0J07l3K63K3
$$ 207 35 -153 -97 -389 34 -12 368 121 -22 82 -45 178 -145 37 43 -172 -64 -154 -47 -80 183 206
$$ [...]
8191C2
##END NTUPLES=NMR FID
##END=
