##TITLE=1H_SR-157-k3-TFAA6
 CDCl3
 8 sc, 
 6.6.2023
##JCAMPDX= 6.0         $$ Bruker NMR JCAMP-DX V2.0
##DATA TYPE= NMR FID
##DATA CLASS= NTUPLES
##ORIGIN= UXNMR, Bruker Analytische Messtechnik GmbH
##OWNER= root
$$ XWIN-NMR		Version 3.5
$$ Tue Jun  6 16:19:59 2023 Russian Standard Time (UT+4h)  she@DPX200
##.OBSERVE FREQUENCY= 200.13135
##.OBSERVE NUCLEUS= ^1H
##.DELAY= (6, 6)
##.ACQUISITION MODE= SIMULTANEOUS
##.ACQUISITION SCHEME= undefined
##.AVERAGES= 8
##.DIGITISER RES= 18
##SPECTROMETER/DATA SYSTEM= spect
##.PULSE SEQUENCE= zg30
##.SOLVENT NAME= CDCl3
##.SHIFT REFERENCE= (INTERNAL, CDCl3, 0, 15.7039)
##AUDIT TRAIL= $$ (NUMBER, WHEN, WHO, WHERE, WHAT)
$$ ##TITLE= Audit trail, XWIN-NMR		Version 3.5
$$ ##JCAMPDX= 5.01
$$ ##ORIGIN= Bruker BioSpin GmbH
$$ ##OWNER= she
$$ F:/spectra/data/she/nmr/H-F/1/audita.txt
$$ ##AUDIT TRAIL=  $$ (NUMBER, WHEN, WHO, WHERE, WHAT)
(   1,<2023-06-06 16:18:37.45 +0400>,<she>,<DPX200>,
      <created by zg, POWCHK disabled, PULCHK disabled
       configuration hash MD5:
       00 E9 B6 7A A2 85 ED C7 34 08 36 98 17 FE 4E 26
       data hash MD5: 16K
       10 48 B1 4A E5 45 1D 31 14 FD 8C 23 A8 09 01 4A>)
$$ ##END=
$$ 
$$ hash MD5
$$ ED 73 C5 CA 45 CC 46 BA 28 34 FB 6B D7 A5 CA 7D
##$RELAX= 
##$RELAX= 
##$RELAX= 
##$RELAX= 
##$RELAX= 
##$RELAX= 
$$ Bruker specific parameters
$$ --------------------------
##$DU= <F:/spectra>
##$EXPNO= 1
##$NAME= <H-F>
##$PROCNO= 1
##$TYPE= <nmr>
##$USER= <she>
##$AMP= (0..31)
100 100 100 100 100 100 100 100 100 100 100 100 100 100 100 100 100 100 
100 100 100 100 100 100 100 100 100 100 100 100 100 100 
##$AQSEQ= 0
##$AQ_mod= 1
##$AUNM= <au_zg>
##$AUTOPOS= <>
##$BF1= 200.13
##$BF2= 200.13
##$BF3= 200.13
##$BF4= 200.13
##$BF5= 200.13
##$BF6= 200.13
##$BF7= 200.13
##$BF8= 200.13
##$BYTORDA= 1
##$CFDGTYP= 0
##$CFRGTYP= 5
##$CHEMSTR= <none>
##$CNST= (0..31)
1 1 145 1 1 1 1 1 1 1 1 1 1 1 1 1 1 1 1 1 1 1 1 1 1 1 1 1 1 1 1 1 
##$CPDPRG= <>
##$CPDPRG1= <>
##$CPDPRG2= <>
##$CPDPRG3= <>
##$CPDPRG4= <mlev>
##$CPDPRG5= <mlev>
##$CPDPRG6= <mlev>
##$CPDPRG7= <mlev>
##$CPDPRG8= <mlev>
##$CPDPRGB= <>
##$CPDPRGT= <>
##$D= (0..31)
0 1.2 0 0 0 0 0 0 0 0.06 0 0.03 0 0 0 0 0.0002 0 0 0 0 0 0 0 0 0 0 0 0 
0 0 0 
##$DATE= 1686053916
##$DBL= (0..7)
120 120 120 120 120 120 120 120 
##$DBP= (0..7)
150 150 150 150 150 150 150 150 
##$DBP07= 0
##$DBPNAM0= <>
##$DBPNAM1= <>
##$DBPNAM2= <>
##$DBPNAM3= <>
##$DBPNAM4= <>
##$DBPNAM5= <>
##$DBPNAM6= <>
##$DBPNAM7= <>
##$DBPOAL= (0..7)
0.5 0.5 0.5 0.5 0.5 0.5 0.5 0.5 
##$DBPOFFS= (0..7)
0 0 0 0 0 0 0 0 
##$DE= 6
##$DECBNUC= <off>
##$DECIM= 32
##$DECNUC= <off>
##$DECSTAT= 4
##$DIGMOD= 1
##$DIGTYP= 9
##$DL= (0..7)
0 120 120 120 120 120 120 120 
##$DP= (0..7)
150 150 150 150 150 150 150 150 
##$DP07= 0
##$DPNAME0= <>
##$DPNAME1= <>
##$DPNAME2= <>
##$DPNAME3= <>
##$DPNAME4= <>
##$DPNAME5= <>
##$DPNAME6= <>
##$DPNAME7= <>
##$DPOAL= (0..7)
0.5 0.5 0.5 0.5 0.5 0.5 0.5 0.5 
##$DPOFFS= (0..7)
0 0 0 0 0 0 0 0 
##$DQDMODE= 0
##$DR= 18
##$DS= 0
##$DSLIST= <SSSSSSSSSSSSSSS>
$$ [...]
##$SUBNAM2= <"">
##$SUBNAM3= <"">
##$SUBNAM4= <"">
##$SUBNAM5= <"">
##$SUBNAM6= <"">
##$SUBNAM7= <"">
##$SUBNAM8= <"">
##$SUBNAM9= <"">
##$SW= 18.05172834244
##$SWIBOX= (0..15)
0 0 2 0 0 0 0 0 0 0 0 0 0 0 0 0 
##$SW_h= 3612.71676300578
##$TD= 16384
##$TD0= 1
##$TE= 0
##$TE2= 300
##$TE3= 300
##$TEG= 300
##$TL= (0..7)
0 120 120 120 120 120 120 120 
##$TP= (0..7)
150 150 150 150 150 150 150 150 
##$TP07= 0
##$TPNAME0= <>
##$TPNAME1= <>
##$TPNAME2= <>
##$TPNAME3= <>
##$TPNAME4= <>
##$TPNAME5= <>
##$TPNAME6= <>
##$TPNAME7= <>
##$TPOAL= (0..7)
0.5 0.5 0.5 0.5 0.5 0.5 0.5 0.5 
##$TPOFFS= (0..7)
0 0 0 0 0 0 0 0 
##$TUNHIN= 0
##$TUNHOUT= 0
##$TUNXOUT= 0
##$USERA1= <user>
##$USERA2= <user>
##$USERA3= <user>
##$USERA4= <user>
##$USERA5= <user>
##$V9= 5
##$VALIST= <valist>
##$VCLIST= <CCCCCCCCCCCCCCC>
##$VD= 0
##$VDLIST= <DDDDDDDDDDDDDDD>
##$VPLIST= <PPPPPPPPPPPPPPP>
##$VTLIST= <TTTTTTTTTTTTTTT>
##$WBST= 1024
##$WBSW= 4
##$XGAIN= (0..3)
0 0 0 0 
##$XL= 0
##$YL= 0
##$YMAX_a= 501925
##$YMIN_a= -450385
##$ZGOPTNS= <>
##$ZL1= 120
##$ZL2= 120
##$ZL3= 120
##$ZL4= 120
##$ABSF1= 10
##$ABSF2= 0
##$ABSG= 5
##$ABSL= 3
##$ALPHA= 0
##$AQORDER= 0
##$ASSFAC= 0
##$ASSFACI= 0
##$ASSFACX= 0
##$ASSWID= 0
##$AUNMP= <proc_1d>
##$AZFE= 0.1
##$AZFW= 0.1
##$BCFW= 1
##$BC_mod= 2
##$BYTORDP= 1
##$COROFFS= 0
##$CY= 11.3945322036743
##$DATMOD= 1
##$DC= 2
##$DFILT= <>
##$DTYPP= 0
##$F1P= 15.7292609196834
##$F2P= 12.9074282941183
##$FCOR= 0.5
##$FTSIZE= 0
##$FT_mod= 4
##$GAMMA= 1
##$GB= 0.15
##$INTBC= 1
##$INTSCL= 1
##$ISEN= 128
##$LB= 0.24
##$LEV0= 0
##$LPBIN= 0
##$MAXI= 10000
##$MC2= 0
##$MEAN= 0
##$ME_mod= 0
##$MI= 1.114404
##$NCOEF= 0
##$NC_proc= 0
##$NLEV= 6
##$NOISF1= 3.799351
##$NOISF2= 2.8
##$NSP= 1
##$NTH_PI= 0
##$NZP= 0
##$OFFSET= 15.70392
##$PC= 1
##$PHC0= -19902.72
##$PHC1= 7.05272
##$PH_mod= 1
##$PKNL= yes
##$PPARMOD= 0
##$PSCAL= 0
##$PSIGN= 0
##$REVERSE= no
##$SF= 200.130013532006
##$SI= 16384
##$SIGF1= 3
##$SIGF2= 2
##$SINO= 400
##$SIOLD= 16384
##$SREGLST= <1H.CDCl3>
##$SSB= 0
##$STSI= 0
##$STSR= 0
##$SW_p= 3612.71676300578
##$SYMM= 0
##$S_DEV= 0
##$TDeff= 0
##$TDoff= 0
##$TI= <>
##$TILT= no
##$TM1= 0
##$TM2= 0
##$TOPLEV= 0
##$USERP1= <user>
##$USERP2= <user>
##$USERP3= <user>
##$USERP4= <user>
##$USERP5= <user>
##$WDW= 1
##$XDIM= 8192
##$YMAX_p= 0
##$YMIN_p= 0
$$ End of Bruker specific parameters
$$ ---------------------------------
##NTUPLES= NMR FID
##VAR_NAME=  TIME,          FID/REAL,        FID/IMAG
##SYMBOL=    X,             R,               I
##VAR_TYPE=  INDEPENDENT,   DEPENDENT,       DEPENDENT
##VAR_FORM=  AFFN,          ASDF,            ASDF
##VAR_DIM=   8192,          8192,            8192
##UNITS=     SECONDS,       ARBITRARY UNITS, ARBITRARY UNITS
##FACTOR=    0.0002768,     1,               1
##FIRST=     0,             0,               0
##LAST=      2.2672688,     0,               0
##MIN=       0,             -450385,         0
##MAX=       2.2672688,     501925,          0
$$ Real data points
##PAGE= N=1
##DATA TABLE= (X++(R..R)), XYDATA
$$ [...]
1864h0K75o5p0K91j35k17l1J77l30Q6K7o9O4NK56q6k31K06l76kJ4L98p2j12M5
1889c2L47J55k18p9j7j16l1j04N8k08jK92k01K33K0j58q0%k3j18K0K04J28L00
1913C71m64M96j79j39J34j57j00p4j20J77K13k06K25J34O8n89J5K70j87j0n45
1934f67M10K98Q3l1K8mJ39l40q3L07m19K10M1K47o7K48k25j09L8o6m33J30M58
1957A93l11o2J14j73L85j26r6r0K14j63RP6r1P8K93j45J01j97K1N8O1k30j24L44
1981A39m4l40K33J54q1lp6M4J31k15L5l2j72K45P2Q2n8P4o9m5K2j68o8J80K54
2006B94k19m9L2j83K68Q2l01j85K09L76l41o7K04r6m4M32l63k04L50l66J27p2
2028a16J26j90K79m2j70L8J79k75R5O7J08m9L0O4j8K94k91R6lq7q8K75l92P3m6
$$ y = [-80, 195, 130, 60, 351, 216, -1, -32, 145, -185, -99, -72, -141, -77, -72, 184, 98, -133, 73, -303, -305, -291, 107, 35, -77, -32, 315, 470, 252, 173, 156, 40, 9, -95, -37, -245, -246, 46, -155, 78, 98, -60, -140, -140, -163, -281, -261, -57, 71, 371, -93, 403, 224, 85, 219, 62, -38, -112, -232, -55, 158, -48, 177, 311, 379, -210, -195, 75, -112, -122, -667, -257, 41, 124, 93, 121, 117, 256, -84, -167, 140, -279, -69, -28, 219, 152, 400, 175, 66, 104, 38, -395, -265, 193, -118, -180, -66, -239, 146, 20, -76, -166, 48, -115, -106, -30, -121, -43, 250, 105, 206, 9, 30, 88, 149, -81, -205, 139, 95, -245, -12, 142, 61, 58, -18, 26, 157, -58, -23, -55, -227, 18, 90, 172, 114, 188, 119, 74, 96, -72, -140, 40, 294, 75, 26, 58, -125, 143, 225, -76, -261, -52, 324, -17, -84, 120, 24, -20, 412, 49, -155, 195, -171, -44, -116, 10, -180, 99, 57, -113, -75, 104, -171, -76, -9, 99, 50, 80, 144, 126, 420, 129, 225, 222, 135, 47, 322, -70, 3, -43]
2053d3K5k7j11L30k38n9J85l39L39k80J65j12n6M16k31L3O6o7J32j09J49j11j15
2076e8J10L3L54l34K2K51m13N51k71j97l31L16j58K14J13j94P8k9j8O5k18J66
2098E2J34k30N4R1nJ95j65j16J16k31R0m2Q9o9J54n1J36p8k25N7N1j52lJ18j57
2123a87j33M45o8k61L97j02J66j22l0r1j11rj55J35n7R2K93j84m6J40L2m18K91
2146A7m22J11K83o7j02J81J65k18J97j19M3j60k8j22L26J76j80j89j13L03o4j99
2168a81Q4k6j36M73j38k66K20K68l10J31R5j63M12o99K73mj29R6R8j46k1J61j43
2191e1j94L25N3k95J58l31M50k14O2J82p8j67J3P9k23L60l78L69m8K8J5p5k5j64
2215a49J73j53N0m1J03p1j25K67L8j07L2J44j44j06m4L2L07l7K06l86J13Q8J20
$$ y = [-43, -18, -45, -156, 174, -64, -123, 62, -277, 62, -218, -53, -165, -221, 195, -36, -3, 63, -4, 128, 19, 168, 57, -58, 52, 85, 439, 105, 127, 378, -35, 516, 245, 48, -283, 33, -125, 89, 202, 8, 86, 57, 39, 104, -114, 52, 186, -44, 10, 101, 96, 291, 126, 10, 126, -105, -15, -57, 32, -37, 117, 66, 202, 124, -101, -44, 7, -145, -148, -30, -187, -320, 125, 57, -204, 193, 91, 257, 135, 105, 14, -97, -106, -261, -126, -183, -91, 202, 18, -28, 112, 144, -274, 17, -405, -294, -11, -78, -180, 1, 166, -52, 145, 26, 69, -91, -119, -241, 85, 261, 81, -108, -221, 82, 18, -181, -97, -123, -259, 214, 76, -190, 30, 298, -12, 119, 214, 51, 463, -236, 37, 33, -96, 0, 98, -48, -69, 92, -51, -245, 80, 133, -162, -4, -335, 115, -99, -37, 145, 67, -100, -87, -8, -231, 129, -249, 120, 72, 100, 115, 40, 15, -149, 24, -129, -79, -120, -17, -88, -213, 54, 92, -15, 17, 161, 17, -89, -133, -101, 206, 169, 375, -11, 102, 190, 310]
2238C10j3k44j47n2J52ql11M06P3j13Q2l87O4J57P6j51K61q0J15P2r7k99M13l63
2262h4M3k19J66N3K46k61J73K08l21P0j29J55j06J6j9p2r9L62k29J4J44N3J66
2285C30r9l09K09j2j7q5k1J76q5L4o8j49n0n5mj33M08k44J69P8j44J55j84L44
2309B44k20j22O0J74k94L46rn4j79J39l3n3J7L6J23j96K09l27k4M4j69K92j74
2332a70k3K97l1Jp9K51J6n4k6j63J17l53K38jo0K00J9k98J31J48l60j03J69m7
2356a81m4L36n7j13J93k07K90k06J1on0M98m80J65j52l2j61K81j24PM1j04J22
2379B7j50j03L56k08Lk19J35J12J93L3j66o5Q0N1j9J09k26M10n28K75o5K07l06
2402f4L39l62m3K70k53J80K6j38O2j02K0O0P6J97j85k02K56k73K79k9n6J23k38
$$ y = [310, 297, 53, -94, -146, 6, -2, -313, 93, 166, 53, 135, -252, -188, -31, 45, -106, 155, 75, 190, 262, 165, -134, 279, -84, -41, -260, -94, -41, 205, -56, 117, 325, 4, 74, -55, 100, -6, 10, -9, -81, -180, 182, -47, -33, 111, 164, 330, 231, -78, 131, 119, 102, 17, -4, 172, 87, 121, 53, -96, -146, -201, -205, -338, 70, -174, -5, 73, -71, 84, -100, 244, 24, -98, -38, 136, -158, 188, 179, 125, -54, 85, 52, -1, 16, 52, 175, -21, 188, -139, -163, -119, -288, 4, -170, -193, 104, 73, 74, -5, 246, 262, 208, 182, 19, 136, -217, 21, 20, -40, 160, 179, -119, 12, 160, -200, -303, -134, -181, -225, 111, 54, -59, 134, -73, 217, 11, 22, 16, -34, 464, -16, 149, -3, -35, -196, 85, -39, -32, 9, -95, 27, -123, -226, 130, -78, -75, -294, -159, -47, 146, 179, 13, -52, 28, 79, 60, 169, -57, 353, -175, 100, 35, 242, -64, 275, -87, -130, 140, -113, 67, 93, -45, 17, -85, -65, -5, 71, 268, 83, -119, 137, -136, 143, 114, 58, 181, -57]
2425e7O7k2n5j37m7K89J05j31J95k37k57L58K85j46k90O3J37k68J35l7M23m55
2447h2J74rj26nr6j39K23J70J0J02m68J86m8oR3r0O0O6j41R4l03J79J43R7O9j81
2473b8j61K3k3pK62j34J66O1m31L57q6p3Q9p4J41o1P8k02J52Ok4j10j14J13L32
2498B52k15K54l20R8j24J86j54M4j43k08M56l09J35j00J59J97n7j63j64K22k38
2519a92L60l58j59O50k81j22J56m3L48k67p1P1m7j29J04M0k7j93L3J08l23J53
2541a89j3j99N43j4j47O0M1k99K14K1j90L71m72M63k0l42J18J12K26n8k20M24
2563D30l95R3j40j18J73K7j23P2n3K17j55k01K24j62L10m16K78lm6M4l4J01l59
2586b36J82k6k2K73j81j30J35p9O00n46J42k36J01P4M3l3k36L09k79J27K03k33
$$ y = [-57, 10, -12, -67, -204, -251, 38, 143, 12, 207, -30, -287, 71, 356, 210, -80, -17, 120, -148, -13, -50, 373, -82, 92, 83, -43, -48, -144, -283, -60, 110, 120, 222, -246, -60, -108, -114, -21, -111, -51, 15, -126, -32, -335, -156, -13, 84, 153, -28, -189, -166, -189, -196, 66, -68, 98, 159, -272, 85, -1, -74, 15, -59, 82, 21, 99, -103, 49, 55, 31, -79, -193, -80, 252, 37, 291, -29, 69, -55, 131, -23, 21, -122, -330, 126, -183, -48, -148, 11, 208, 151, -12, -176, 46, -192, 168, -190, -349, 301, 20, -102, 54, 11, 359, 92, 21, 92, 45, -84, 20, 60, 33, -160, -127, -19, -342, -189, -202, -401, 142, 128, -19, 41, 82, -217, -3, 18, -172, 199, -273, 190, 170, -172, -54, 58, 284, 226, 6, 430, 35, 128, -12, -130, 43, 70, -53, 19, -34, 183, 28, -173, 51, -111, 199, -217, 61, 58, 12, 56, 22, 123, -236, -54, -80, -102, 171, -10, -140, -5, -84, 516, -30, 112, -124, -23, 51, 94, 61, -175, 134, -145, -18, 185, -48]
2608d8J56k81M19k47j08K20k13K82k00J38n0q0r0K37J5k20K07j80L75pm32L34
2630B27l14J45l58L00M3J02j97J32K3j43k22N59k01r0Jj52K37j66M55l11r0J97
2652A77m94L43L27l65j22J91L7k57k6K21q5P6LK52l17k4j04L05k65L95m25L85
2674B28l61K0J62p7j8k58M00k22K05K6J42l12K44k9q9k87J48J43j71r1J43L21
2696B67k28J35R9k03M2J71j17j75K14l09J30j35JJ14O7j20k4L5j57p3L83k39J02
2719b0J53j1K03n50K89j28N1Pk02J33K36j62p4J83k93K99l11J02K39j00j71k2
2741a49L42k86Q3q9n8K53l22J85K36j77l4q5r7K87j85J12P4m1r3K49k44r1P8J09
2765E7K35j58j1j2p0j57M8r2J01J57k00J44K4m9l3L0M3j54L70m83K59K4k00K8
$$ y = [-48, 108, -173, 246, -1, -109, 111, -102, 180, -20, 118, 68, -12, -102, 135, 150, -70, 137, -43, 332, 325, -107, 227, -87, 58, -300, 0, 43, 145, -52, 80, 103, -40, -262, 297, 96, 6, 7, -145, 92, -74, 381, 70, -20, 177, -317, 26, 353, -12, -134, 57, 94, -163, -189, 32, -53, 23, 26, 278, -39, -63, -167, 138, -127, 268, -157, 228, -133, -113, 49, -28, -46, -304, 96, -126, 79, 105, 247, -65, 179, 150, 61, -226, -78, 65, -106, -197, -54, 267, 39, 174, 273, 70, 112, 283, 166, -9, 205, -104, 26, -109, -108, 6, 73, -47, -71, -36, -193, -266, 117, -122, -20, 133, 122, 325, -225, 64, -64, -13, -6, -208, -75, 161, -1, -75, 108, -185, 114, -197, -95, 144, 44, -127, -149, 193, -93, -10, -99, -157, 96, -226, -41, 195, 18, -16, -101, -198, 89, -96, 16, 90, 49, -44, 205, -39, -130, -52, 57, 292, 134, 123, 111, 41, -116, -68, -160, -59, 98, -102, 42, 66, 17, -16, 14, 57, -97, 273, -210, 49, 73, -127, -99]
2789i9j39K11P7J2l58L48j27oL57k92r0K36n9j41p2K60l64O84p01K68q0J49Mr9
2813b1L6j72J11l8O7o1K4K01l10L08m5o6j3j98M1K93j26Q1j66J63r7o0J01p8J0
2838a5R0Q4j89q4O0J23j51k82M17j4P3j05J37l27K36m1J6J35k67M62l46j08J45
2861D9l11K57J54k44j16J68r5J54J15j83L2P6P5P8k57j93J25J59o3M8J54l21L58
2884B19k04k10K66j10Q6p7PrO0P6j91r1J49J63K99l17Q7q1k12K61j24L4j33M8
2908dL89m26K63l0l15k6M22l85O9m2L21k83K32j46J29j14k11M5J50n8J08O2k53
2931a03L32j56j21j19K45l74K72J99l57O9J92l7pp1N0J69k61j4J72q3J67k09J56
2954A11P7l29j94L58o1Q6j05j2n8J3j9M49n65K45J27k93l2K44k9Pj92K27j37K23
$$ y = [-99, -238, -27, 50, 62, -296, 52, -75, -81, 276, -16, -106, 130, 71, -70, -142, 118, -246, 438, -263, 5, -75, 74, 78, -21, 15, -157, -46, -84, -17, -78, -54, 147, -163, 145, 100, 34, 21, -177, -136, 157, 31, 112, -54, 109, 12, -48, 53, -25, -15, 75, 159, -30, -114, -54, 69, -82, -364, 53, 39, 112, 7, 144, -183, 53, 12, 28, 163, -104, 358, 12, -96, 49, -262, -5, 149, -95, -211, -43, -138, 16, 131, -52, -20, 56, 131, 209, -48, -241, -116, 43, -20, 28, 182, -139, 219, 15, -195, 71, -39, 47, -30, -23, -32, 28, 104, -87, -178, -29, 134, 433, 116, 203, 122, -90, 171, 47, 81, -52, -4, 385, -41, 222, 192, -123, -149, 273, -112, -43, -85, 236, -47, 185, 39, 168, 54, -157, -112, 38, -20, 88, 150, -103, 229, 73, -48, -167, 78, -296, -24, 175, -182, -113, 79, 42, 35, -36, 14, 183, -78, -92, 80, -3, 164, -45, 111, 188, -141, -335, 23, -38, 48, -57, -69, -127, -114, -133, 316, -249, -4, 123, -170, -202, 42, 13, 20, -172, 55, -82, 141]
2978A41j54J76P6j09Q1k13p9j79K48K4j7L1j9Ol6j93Q8P2P1p7M3m8k65L37j33
3003a28R0O3j55K07L5j02k81N07k80k6K29J74m57J0L95j48k72J96P5k32Q3n9k6
3026a02R8J92j76K97p1k96j89J22J43k7l26J31L36k81K33m9j13L60k46j1j14K06
3048A17N6j04O4l1J01k54K01k07j05K73j54o4J27Q6r1k9j16J83M5M8n2j14j41
3071a61J62j17O5k29N16k86K62j60J35k05o0K43J7o5m31J30P6m2K54k02M9M01
3093C52l48j38K77kon9j93l5R9L07l12k78J28J70j7j53J00l4Q3p4K05j38p1lM64
3118C24l55J62p3R2j19j90J36J5q7l2LQ3j10RJ53O4j69J60J21k06m4J67j09J00
3142I5k20J27K3P8J03k25p7O8M4O5q5rJ67l83J18j51J93k3J90Lk22J16j19J59
$$ y = [141, -13, 163, 239, 130, 211, -2, -81, -260, -12, 12, -5, 26, 7, 13, -23, -216, -128, -56, 15, -62, -19, -67, -332, 5, -128, -38, 25, -130, 77, 112, 10, -271, 236, -44, -70, 159, 333, -124, -114, 281, 133, -139, 57, 132, -100, -17, -76, -102, -4, 188, 12, 309, 238, -58, -247, -125, 18, -9, -335, -204, 132, -149, 84, 35, -78, 282, 36, 25, -89, 117, 173, 69, 133, 102, 203, -51, 150, -57, -162, 111, -43, -107, 20, 106, 15, -14, -130, 53, 98, 146, 94, -20, -161, 1, -116, -51, -280, 236, -50, 212, 52, 187, -18, -78, 165, 182, 117, -314, -184, -108, -150, 104, -98, -49, 352, 4, -134, 143, 141, 135, 76, -117, -152, -53, 254, -58, -336, -208, -38, -55, -208, -108, -142, -59, -133, 72, -66, -137, -140, 324, -31, 131, 58, 150, 31, -159, -23, -8, -95, -127, -124, -41, -151, -142, 11, 75, -94, 66, 187, -19, -63, 104, -5, 95, -125, 2, 25, 103, 206, -19, -96, -28, 16, 81, -4, -13, 154, -229, -111, -262, -69, -92, 98, 101, -121, -5, -124, 35]
3166C5L6K05j6l88Q7K44k69J43j6j42o1J75L5r9J46l30R7K2J93q7r5L10o5K03
3190C63l48N0q3P2Q3K49k50p9k27K21K1j46J83p0m9j01NR5J73j17l8J23k66J72
3214C6Qk70K88k61L94k30l9M04j84j26j93K16r9k17J65J23l1J0K53l8k11J64o1
3237A01j78K62P3r9k58J1Q8L1k71J47J39k9l00L06J23j80LK04j12j38L36l68L54
3260B45m27NJ46K5k51L61K37r7j77P3k11j48J78k82M31k91K01r9J4j58L19k80
3282a86K58j2j13J68k54M4K3J51l2PPLj24r8M47j16l23L2K07N5l36K75j14M2J33
3307A44Km08M12j39k44M01n5lJ83n42J96j76J94N3k25P2M26l29j03L90k68J11
3329I2k00L69j14k56L63m69K53J33l4k41J36LP5j57J3N5K9J8Q7n59M42l9P6j66
$$ y = [35, 71, 276, 260, -128, -41, 203, -66, 77, 61, -81, -142, 33, 68, -31, 115, -215, -118, -96, 97, 10, -85, 225, 160, 363, 15, 65, -18, 54, 137, 386, 136, 57, -170, 51, 72, -74, 109, 39, -10, -111, -106, -11, 162, 45, 7, 130, -136, 36, 44, -226, 62, -199, 195, -35, -74, 330, 146, 20, -173, 43, -56, -273, -108, 15, -16, -6, 247, 209, -2, 162, 101, -77, 185, 258, 159, -99, -88, 0, 31, -240, -93, 46, 17, -283, 23, 146, -34, -31, 173, 61, -77, 259, -109, 245, -182, -177, -31, -6, -257, 104, 341, 244, 67, 140, -71, -219, -41, -323, 108, -183, 18, -81, -67, -225, 94, -186, 72, 60, -53, 115, -139, -95, -72, 79, 47, 54, 61, 64, -60, -158, 289, 173, -150, -118, 89, 144, -192, 83, -31, 11, 144, 146, -262, 150, 11, -233, 168, 113, 110, 293, -249, -53, -229, -35, 18, -207, -135, 291, -38, -141, 249, -19, 92, -108, 261, 147, -109, 254, -215, 38, 171, 137, -104, 32, 35, 110, -47, -34, 21, 50, 68, 155, -404, 38, -1, 75, -91]
3353i1J00p1J79j17j44J09J65o6n8K19M5m37m4J72Lj53K87l86L14K07j54k53J16
3376e8K42k73Q1oK65n08K4K72j29L13k81m7J87j5k19Q9K11k06K28l41K1K36j55
3399f9J69l15J30L07l05K5J1j42J86O3N9J22j53R2k92%r7K94j04k6Q1m4J74k91
3423a25K3J99j85Jo9l6L23q4k89J70J73p5M0j00M96o08L8K85J1j40k93K06k44
3446b83L09J22j68K25k47J28pJ95k50j49J29k3L8J64k21k3J01k47J85J3p6j36
3468b21J87K83k15j30J87k11J55pQ1j44m10L56O6j52r7K92K68m85L37j21Q5J02
3490B06j96l62J64K98l49K14j57K27L57l72j00K5J7K45k54N9k30K93j5N3P3q9
3512A07l04K12l5j99J82k38N44J14l41J05l73J98k21J93k19L23O7j74J70mj24
$$ y = [-91, 9, -62, 117, 0, -144, -35, 130, 64, 6, 225, 270, -167, -211, -39, -36, -189, 98, -288, 26, 233, 79, -174, -58, 184, -89, -8, -14, 251, -257, -233, 39, -90, 223, -58, -105, 82, 67, -152, -63, 148, -58, 170, -171, -150, 86, -69, 100, -215, -85, 222, -83, -58, -47, -189, -3, 60, 119, 241, 88, 180, -112, -112, -209, 85, -19, -45, 36, -8, 166, -125, -102, 97, -88, -87, -156, -192, 131, 47, -242, -72, 101, 26, 66, -34, 462, -146, -108, 177, 188, 48, -245, -39, -283, 26, 148, -20, 205, -42, 86, 79, 274, 24, -125, 4, -19, 19, 183, -38, -61, 40, -207, -22, -9, -85, -221, -34, 249, 34, -96, 91, -120, 35, 28, 109, -35, -445, -89, -23, -175, -272, 20, 288, -197, 140, 19, 104, 206, 10, -352, -188, 110, -239, -25, -182, 45, 402, 30, -70, -45, -28, 217, -37, 22, -208, 85, 70, 123, 196, 107, -197, 15, -20, -219, -37, -275, 269, 383, 42, 147, -226, -28, -249, -56, -275, 48, 115, -59, 111, 107, -17]
3533a7j48M6R1J95l16J78J14m49K54N9Rm8M5J06m1p6j53j02K96j1k6rk55k3L40
3558E9m0j00LK18l9j38p1K98q1q1J73j34J33k33R1j94J97J34j56J03j14j13P5
3581a0j30k4P1K74J2k93R6J14nj08j01M15k79j19J13k97K53k19M83l59J40j59
3603a32J76J63k70J34P0j53R7K93l62j57Q4J06K0n3k49K41M6n1p1l2L58k75mK59
3627B38l3k76K91k60K55k37j3M6J13O4l27K00k45L25k25J15p5j23k9K03J54p1
3649I0j64M6k2J59l2J87j84J4n0K3o5j04n4L56O7n4r7n0K16l01j08L08j82P1k29
3674a59j52L00K6J26k44K94j02J90k82J30L1k16k1j3m5N36l77m1J53k92J57J25
3696A24N2l84O4J21J3Q6j69J28j40J44J10j07J61j64P4k91oK98j22j51qO6L07
$$ y = [-17, -165, -119, -28, 167, -149, 29, 143, -306, -52, 7, 16, -32, 13, 119, 78, 2, -151, -253, 43, 32, 6, -3, -258, -281, 59, 19, -81, -78, 140, 101, -37, -108, 190, 109, 28, 201, 67, 200, -33, 58, -136, 61, 195, 39, 142, 28, -85, -10, -140, -164, -93, 181, 193, -100, -4, 110, 105, -3, -104, 311, 32, -87, 26, -271, -18, -237, 246, -113, 27, -132, 44, 207, -63, 71, 141, -12, 85, 378, 16, -141, -57, 49, 69, 16, -233, 8, 54, 3, -68, -100, 258, -17, -21, 238, 205, -71, 220, -40, 215, -22, -35, 11, 124, 188, -139, 61, -184, 141, -84, 31, -44, -167, -196, 7, 161, 90, -74, -28, -50, 109, 77, 264, 80, 94, 44, 67, 2, -102, -156, 200, 267, 213, 116, 66, 282, -19, -127, 181, -1, 70, -159, -311, -11, 15, 141, -103, 191, 89, 279, -3, 127, 158, -58, -79, -92, -137, 399, 22, -19, 134, -158, -1, 124, 176, -208, -144, -23, -10, 76, -93, 35, -105, 39, 149, 42, 203, 39, 113, -178, -184, 114, -8, -159, -167, -101, 206]
3719B06l77J83l6q1K5m3k1L91m04q8L48j62J17L5l42N72m47N2o7K17J6J04m47
3742b49M33q6l16R9J93j65K11k22K97m9l14J63M7p8K41j02k54K91k67K18J69k69
3764il0J97L1l66N2K28m13J19K78m24K62j49K81j08q3j43K89q3K9K32k63J59j66
3787h0N1J4j31J34j5K36k72K83l98l8L44n87L29L05J02n4k23J2j18K14N1j96q3
3810a20r3J17j93J16K85m8j6K56l11Ko1J87P2k01J39k35K0J90J9m4j94L14k08
3833gj21K12J1o3m2J61o2J19k52J02l3J19p9pJ55k95K9K09k46J8j35L9L68l67
3857a67P4M0J67l56J64L42l90P9J60p5m8P6j4N5Q4j87lk2J33j06r5q3J93j22L22
3882B21j39k33L13j05R1l9j07k76K65P4J21k83M2K79l82M29j56q9q8J14o6N9q2
$$ y = [206, -171, 12, -24, -105, -80, -123, -144, 247, -157, -245, 103, -59, 58, 93, -249, 323, -124, -72, -139, 78, 94, 198, -249, 184, 98, -218, -119, 74, -91, 120, -102, 195, 146, -168, -5, 42, -36, 205, 103, -151, 140, -127, 91, 260, -9, -39, 158, 189, -177, -125, 103, -310, -191, 87, -337, -75, -224, 57, -51, -134, -277, 12, -71, -42, 190, -73, 86, -80, -29, -15, -146, -12, -27, 209, -63, 220, -178, -216, 128, -459, -130, 175, 277, 223, 0, 12, -106, 108, 159, -37, -120, -213, -96, -289, -173, 112, 64, 48, 304, -7, -5, -66, 121, 193, -8, 131, -104, -84, 106, 125, 81, -113, 201, -7, -128, 84, 95, 32, -10, 151, 89, 208, -44, 58, 25, 144, 65, 58, 213, -82, -53, 156, -90, -72, -207, -168, 200, -167, -93, -53, 114, -242, -78, 264, -126, -47, 113, 38, -10, 66, 52, 107, 191, 4, 1, -21, 112, 6, -89, -172, 21, -101, 221, 82, -151, 162, 57, 148, 109, 2, -274, -9, 65, 186, -97, -55, 224, -158, 271, 115, 26, -62, 52, -14, 45, -37]
3905c7j01J04KK10l81N10j34l47K52m7Q5k91J38JK5J3J69r4k75K61rj43Kj17P9
3930a25MR5K23m52N16k25JK90j68k05%o5k24L28K4n9q6J96K17k61K4P8r5R6l6
3955I1Ok09J97K6n6J07l10nK4J5L68j82N8j89J57k10M58n55K97j12r3L31r2l24
3979b02J37QJ41J04l58J86k81J59p2n8J37J01r4K10l32J91j67L50m04J52M6J90
4001A44j63Kl6J6J52n3j43J54k04O4J52j11J14R1l44J78R7p4k30O8o8J91k17K85
4025F5k64L37p4J02j61j14K53k73j16L42L22m88%o5K47j60J83nK0l08L39k63P9
4048bj99J51J9P9K00k69Q6R4m4j45J88m9j65O4R4k76J64Q8k07O8j71M0J14J83
4072A05m8j18p5K74R6k40k41K28R8j0k34K30n3M2n8P1q8J56j09j06K3K13N9l93
$$ y = [-37, -138, -34, -32, 178, -203, 307, 173, -174, 78, 31, 116, -175, -37, -36, -11, 2, 171, 77, -198, 63, 54, -89, -87, -204, -125, -121, -26, 197, -255, 261, 36, 37, 327, 159, -46, -46, -111, -335, -7, 17, -42, -128, 68, 285, 24, 48, 126, 31, 127, 91, 97, -112, 85, 111, 55, 162, -148, -153, -129, -114, 254, 72, 130, -59, 98, -112, 346, -209, 88, -24, -117, 214, 122, -202, -65, -57, 84, 188, -170, 16, -265, -106, -178, -236, -99, 2, -92, 118, -214, -23, -190, 160, -244, -92, -46, 144, -19, -17, -53, -37, 115, 62, -81, 73, -131, -67, 85, -26, 88, 179, -165, 13, 110, 36, -194, -126, -194, -3, -220, 65, -199, 138, 64, 166, 5, -109, 144, -129, -245, 97, 419, -69, -69, -134, 113, -47, 136, 131, 151, -157, 182, -81, -2, -201, -50, -31, 48, 248, -21, 65, 159, 115, -30, 158, 109, -56, 8, 102, -174, -10, 78, -129, -61, -232, -192, -78, 105, 57, -61, -136, 138, 234, -6, -247, -19, 79, 69, -165, 65, 12, 54, -4, 67, -21, 135, 26, -80, -57, 156, 215, -178]
4096a78J39K00j26k2J32l00L07k78K33r0J59l00N7J68J44k54p6J17j37KK70r5
4118G2k53K26k6k88K12J37k04J36J00j9j23j39J43NJ2K36R8k20P6k2j48K40j79
4141G2r0J52k24L26j31r3R0MK6j1j84J07m0Q1p8j07K97k54J84J41k51k14Q2q8
4165b03J08l0L59j27lq8M3Q4j79J5P6q1j02j66O7K82k1j97O6J31K75k25o7k4Q0
4190G3j10J27j08O9J57j13O0pl09K65j52J24n1j19J25J83k09l37K99j7K32p2q2
4213B8L05k53o1J97k86J66l07L66l6Kj06M0J29k91lK4n0J93q7J32l32R2J09p7
4237a06k7Q7R3j11L21j3n17K48k72J91K10j14L11n27J77j80J38J41K49k29K35
4258C05k15j56J87l1k08K33k45J71l3j32R4j08j03L48p1j09j37L37k2j64P7L3
$$ y = [-178, -39, 161, 35, 13, 145, -155, 152, -126, 107, 17, 176, -124, -67, 101, 245, -9, -85, 32, -105, -103, 167, 72, -181, 45, 19, -269, -57, 80, -124, 12, 112, 93, -30, -169, -26, -21, -9, 227, 325, 105, 181, 159, 11, 251, 72, -18, 134, -90, 236, 105, 12, 102, 106, 132, 121, -63, 44, 4, 85, 7, -100, 197, -57, 127, 268, 17, -197, -115, -203, -95, -125, 234, 107, 104, 16, 59, 143, -36, -21, 55, -26, -128, -294, -227, 55, 34, -163, -97, 34, 309, 84, 17, -7, 73, -37, 90, -18, 51, 208, 95, 155, 148, -161, 104, -48, 76, 25, -94, 31, 214, 5, -332, -33, -50, 182, 110, 28, 333, 80, 19, 216, -70, 96, -211, 155, 119, 121, 15, 55, 184, -107, -110, -86, -136, 57, -30, 102, -230, -138, -29, -106, -133, -46, 47, -64, 257, 244, -273, -25, -297, -106, 104, -10, 301, -226, -49, -229, -91, 50, 299, 70, 305, 90, -66, 121, 90, -118, 115, -130, 41, 8, -124, -30, -138, -241, 107, 36, -73, -210, 127, 105, -59, 18, 51]
4280E1j01L3K18o75K90L5J48O2m2k6K22k49r8J83J4k27M2L45k5m00J35Q0l2P3
4304E6L2l57j01M07l1r0K3J37k45nL5K09j46K49oj91j93K7K43J93j97J20o8k72
4328a71k8L63N2k75K2m8J56k03Q3J08R1K2Jk61J27M3j62j34K05P8L3j60K8j89
4352b19J30L37m90J77J66k61K76Mj83J40l6k57K54q2l2m2R9p5J5L02r6k11j00
4375a84K08k52L45j74J80k95K34K27k96K44l12L02l18J7K40mp1j07K71l86L43
4396B12k53j86JK71p7j9K00Ql14pJ50K7R5J09r0j71J3J15L5n5J37k44Q3j11L8
4421c3L6J8j03L22m68K28P7P5j88J84l09l9O6M4K35j46K00k20J6J89k27r7nN3
4445i2K05k61R7J65j52M8J32oj60q1m3M67l48M70n6k59m0q6J7R0m1j87J72l4j12
$$ y = [51, -50, -17, 201, -474, -184, -149, -1, 61, 19, -7, 215, -34, -132, 51, 65, -162, -120, 225, 200, -200, -65, 15, -17, 56, 88, -269, -370, 37, 6, -84, -61, 76, -169, -174, -139, 70, -76, 173, 167, -24, -217, -190, 53, 246, 49, 169, 101, -171, -199, 164, 216, -59, -37, -85, 71, -132, -49, 59, 150, 172, 173, -88, 39, 82, -80, -214, -9, 69, 102, -58, -30, -219, -89, 248, -242, -65, 101, -160, 116, 120, -63, 77, 41, -216, 38, -44, -76, -118, -19, -94, -79, 223, 127, -84, -184, 24, -228, 117, -57, 123, -172, 62, 289, -7, 237, -75, 227, -91, -74, 166, 162, 91, -16, 255, -131, 212, -41, -227, -226, 45, -32, -51, 149, 157, -157, -164, -14, 13, 108, 217, 127, -44, -31, 84, 119, 64, 201, -43, 40, -71, -33, 3, 21, -82, 240, -228, 0, 77, 152, -36, 148, -161, -200, -134, -90, 145, -1, 199, -21, -5, 184, -43, -140, -145, -92, 113, -148, -51, 114, -38, 10, 142, 136, -24, -105, -148, 319, -29, 441, 385, 126, 86, 0, 17, 107, 66, -121, 51, 17, -95]
4470i5K1K08J3m11J44K42k16j1J35k09J18r7m0L34k3M3j75J28R1M9l59K52k42
4493a00J01K85k13p2J65j70Oj22L96m05J49J22j35M45l34j60K79r7k75P9j3OL2
4516c1n0J74J61l58n9J2j46L10l8j0L53m16j0J47j9k23J71J46j99K08m00K39P9
4539D1l1J6j58K5M03n51J92J72J08k44K2Q7J20j92L0j68J29n5N2k71K68k2J12
4562H5o9K36m43J05K03m6l5j66n2r8K01R8qJ81l85R0JP3M10m85J24P8q8r5l48
4587d33K31K41o8L7k5l40N26p6k14K43M8k72%K34O7j8j91K16k34J44k48J83j23
4610g2K61m43J66K75k23O6J39k19j95K78K9R0k16K44k40l4J31K27k81L6K5L7p8
4633CL2p6N7J43J67l61J00J2K09q6j09j03n1L23k20n0J54j39j11q2J52P7l5j72
$$ y = [-95, -74, 134, 147, -264, -120, 122, -94, -105, 30, -179, -61, -158, -198, 136, 113, 156, -19, 109, 200, 249, -110, 142, -100, 1, 286, 73, 1, 166, -4, 2, -120, 276, -129, 20, 142, 7, 452, 118, -42, 237, 140, -135, -56, -69, -63, -31, -81, 93, 254, -104, -163, -151, -297, 13, -25, -35, 318, -98, -108, 39, 20, -203, -32, 114, -85, 123, -277, -38, 41, 10, 26, -132, -107, 296, -255, -63, 109, 217, -27, -5, 82, 202, 10, 40, -128, 1, -54, -2, -273, -5, -27, 85, 16, 252, -191, -86, 117, 71, 36, -130, -182, -280, -79, 19, 11, 192, -193, -103, -102, -29, 381, -104, 20, 98, 10, -85, -433, -202, 39, -29, 8, -17, -357, 169, 93, -121, 122, 170, -102, -102, 132, 199, 181, -10, 206, -28, 116, -132, 51, -72, 189, -254, -88, 187, -36, 30, 169, -50, -245, 33, 62, 152, -64, 180, -60, -94, 37, 264, -17, 19, 44, 81, 3, 35, -41, 16, 159, 326, -35, 65, 77, 286, 200, 91, -12, -63, 260, 40, -10, 144, 5, -106, -188, -36, 41, 6, -166]
4657a66J45J16l29J29J51L0j80K1k46M08j6J72l22N6Jj29K38Ok17M0j28L80nJ35
4681B90k70J2m5n0R9j31oJ85j49j04K03J3K88m49J81j37J36L6K40m68J58j06N1
4704b3J25k35%N6j5J86J27j16M7j83j75J97K61j76k12j05M9J08L4J7J12j68J66
4727G7j55M8J9lj43J95k53K79N6j37K04j42K3N3p7R7l31J82k8r9J90J44q4N2L6
4752B03n18L46j01p4l3L16n0K80l76J62k75J35J92j84K5j73j62J66J32n1K62k97
4774g5K7J75j56P6r2J06k00J18k8R8j3j67J73Q4l0R3l3j33j63j41K25J87j10R9
4798A20m7K9k24J04J42j28k05M85n40J28J36K0k53K34R4p7k16L8J37J25l8j46
4820h2K96k77J4J40j49L68n34M2o7M14j49Jq6q2M18k83J34j90m4OK10k31L60l01
$$ y = [-166, -21, 95, -234, -105, 46, 76, -104, -83, -329, 79, 63, 235, -87, -31, -30, -159, 79, 85, -132, -92, -220, 160, 155, 290, 20, 32, -13, -63, 36, -95, -101, 84, -65, -169, 34, 47, 335, -114, 67, -70, 66, 102, 342, -126, 32, -74, -23, 102, -133, -133, -77, -92, 94, 221, 105, 152, -31, -206, -9, 252, 76, -136, -241, -192, -84, -50, -33, 79, -89, 77, -78, -30, -11, -14, -157, 38, -215, 64, 120, -17, 187, 45, 68, 121, 44, 141, -190, -8, -36, -135, 55, 199, 115, 167, 203, -315, 31, -70, -144, -177, 139, 89, 369, -7, 155, -120, 15, 207, 23, 48, -125, -287, -121, 11, -40, 222, -75, -48, 127, -29, 47, -45, 61, -139, -21, -49, 49, 36, -131, 42, 126, 96, 189, 156, 23, -140, -281, -56, 131, 21, 120, 73, 102, -122, -18, 124, -4, -209, 276, -264, -136, 0, 20, -233, 1, 95, 18, -198, -160, -23, 102, 64, -82, 214, -63, -49, 91, -58, 310, -224, -182, -249, 165, 16, 17, -69, -151, 267, -16, 118, -72, -116, -110, 100, -131, 229, -72]
4844g2j20j49K31k01J53L01k56J96k56K55m1j71j28J59K53qk10j81L05j30R0J23
4866A43j70p7J4o3j43R4L78j17j85l2K36j77K80q3J55l49j7j01L23q4Q0l16k23
4889d34L98P2j55Q3J9m6J62L4j70j54K52j87M42j25k69R2j39L02r2l0j70N21m97
4912i1J12j57J78J2j66Q2j45M80l06k8j34J75P0j70p6K09j00J54j91K17j62K26
4934A89K7j31n2N3k25L84k63j12J82k01k3K32l03K06n5R6J80j80k98K94J39j97
4956e8Q3j17l34N72k10k67K81J45N7j89k48N15j67k79J85o0K26j21O1m8k2j51
4978a46K23oj10J07O0j06O0O0m00J00O5k81J79J51R8p1j13O1J05K54m80J58j46
5001a78L54j54J21j38j38L62k0m67K26l6l34O51j3l05L73k53j52J93j29L5K71
$$ y = [-72, -192, -341, -110, -311, -158, 143, -113, 83, -173, 82, 41, -130, -258, -99, 154, 146, -64, -245, 60, -70, 20, 143, -27, -104, -90, -153, -296, -202, 176, 59, -126, -158, 78, -99, 181, 98, 253, -96, -113, -214, 109, 25, 105, -211, -434, -36, 36, -119, -36, -17, -63, 99, 133, -37, -191, 61, -126, 316, 191, -78, 14, -125, 177, 85, 55, -115, 406, -91, 21, -136, 42, 54, -112, -30, -175, 305, -1, -29, -163, 12, 82, -88, -164, 45, -55, 99, -92, 125, -37, 189, 216, 85, 33, 86, -139, 245, -18, -130, 52, -149, -172, 60, -243, -37, -92, 4, 184, 4, -294, 0, 139, -58, 25, -92, -426, 146, -64, -331, -50, 95, 152, -37, -285, 230, 63, -216, -31, -91, 135, 14, 75, 27, 5, -146, 77, 71, -39, 68, 128, 22, 82, 142, -258, -158, -93, -374, -195, -44, 54, -17, -130, -69, 36, 290, -190, -32, -178, 176, 22, 143, 5, -133, 229, 209, -258, -32, -68, -402, 249, 236, -69, 304, 51, -101, 92, -37, -2, 269]
5022B69k09KJ20p7K56n65K02R4J8pk41O1j11L64O1j92m9J2j71P7K4J23r9J44k08
5047a02J7J11j60J38k30L22L1M6j9k15o1P4J65k79K98J5j87J92j44L9N0K0q0J1
5071E2k29K81k42q0J89J00l1pp4L94l14k16Q6J54l24K64J29j64J78q0N3j97J58
5094H0j16m5jL59k46j85K35l7J24q9j55M8o6J83k34J32J55J64l67k01K99M9k93
5117b07J47j94K56K5L8J92l29q9L00k58L4P3j30K73j38j11j5p5L25K74m00k09
5139b18J27N5RQ9P4o1j62J69p1J71M6q2k94K96P1o9j94N3j21o2J70j2j16K1J84
5164G3j43m4K63k79oJ43k39L34k03L63k89N9J56j29J48k72J30j90J6J92k07L18
5186A94k08n3K36r4k92L79J94n98K69M4j05M7j36N0Q8p0J03O6q8Oj68J28J43l6
$$ y = [269, 60, 62, 182, 105, 361, -204, -2, 92, 110, 103, -138, -77, -188, 176, 237, 45, -4, 8, -163, -86, -62, 61, -38, 106, -102, -85, 26, -134, 4, -226, 96, 127, 173, 154, -61, -122, -48, 117, -162, 136, 151, -36, 156, 12, 51, 101, 121, 41, 52, -177, 104, -138, -218, -29, 71, 40, 33, -41, 353, 39, -177, -91, 63, -261, 3, 132, -32, 146, 66, 119, -78, 80, -36, -81, -82, 277, 31, -154, 81, 44, 168, 79, -76, -28, -94, 89, -145, -13, 142, 306, -61, -262, 37, 86, -207, -60, -254, 2, 27, 65, 257, -72, -161, 139, -119, -85, -12, -142, 131, -7, -118, -133, -208, 117, 391, -9, -218, -91, -36, -27, 62, 136, 75, -87, 82, 11, 182, 228, 146, -148, 148, 219, 150, -44, 9, -112, -174, -4, -16, -132, -111, 73, -70, -114, 149, -130, -136, 7, -232, 102, -101, 262, -27, 32, 188, 59, 207, -65, 65, -125, -109, 83, -124, 194, -14, -67, 169, 75, -217, 162, 356, -242, 27, 71, -34, 13, -123, -73, 15, -55, 48, 114, 26, 32, -136, -8, 135, 99]
5210I9k29J34k23N27k23p7j89J1R9J2K49j62l82M4J54k6O5J36j86l7L22L77l61
5233A34j05l09J75PQ7p4o5M14l31R1nJ72m48K69K60j61M5l8q0j18L08j75J41m19
5257b25L83j96J03m34N00K08k93o9k27M01j79n3PQ0j16J50j87l2R2j82K39L4J80
5280A84q9L17l68k11K79j85J20N3k05J49k46K29j63J37J15J20j56j19m6K00j71
5301e6J25Q9k17m2K22Oj09J08k01M13l07p3Q5j66r0J30L0R9j54J95o8j70J78M1
5325F8j15N7J74m36K26n4J08J27k14j17j1J29J45j89j54L98k03J45k43J7K67o1
5347F4O5k16j14K72Q8k9M8l12j06L07k99L44jk59j6K93mR3k86K53k16M9q8N5J48
5372A33k33M7P8o0rK02j36m2j8q7K93k09J31nk76J61m7R6j8k74J12K67l27L64
$$ y = [99, -130, 4, -219, 308, 85, 8, -181, -170, -71, -59, 190, 28, -354, -310, -156, -182, -117, 19, -167, -204, 118, 495, 134, 29, -280, -105, -98, -11, -85, -150, 264, -67, 24, 19, 191, -257, 12, 272, 111, 156, 118, 38, -80, 228, 53, 194, -225, 158, -38, 65, -369, 131, 339, 46, -23, -250, 151, -28, -81, -74, 6, -110, 40, -147, -179, -87, -269, -30, 4, 184, 95, 412, 44, -167, 112, -73, 47, 100, -105, 44, -202, 27, -136, 1, 116, 236, 80, -39, -85, 115, -56, 69, 158, -59, -101, 121, 127, 18, 126, -75, 338, 31, -42, 43, -123, -213, -83, -53, 46, -108, 87, 19, -151, 27, 68, -47, 10, 184, -252, -26, -80, 28, 155, -59, -176, -187, -58, 87, -102, -256, 142, -61, 84, -159, -142, 125, 64, 129, -87, -201, 71, 159, 130, 178, -134, -240, 67, -232, 112, 111, -148, -164, 129, 125, 218, -68, 185, -31, 18, -70, -15, 133, -100, -53, 25, -35, -44, 158, 22, -20, -38, -125, 168, -41, 90, 85, -191, -30, -77, 19, 1, -273, -161, 106, -221, 143]
5396A43J32l85J49k45L09r5r8J18k26J86k9K66j73M9l3j99k6J12K4O5k6j65J55
5419Hl5m8L7J3j5K34j70k13L16k67Q0j80r7K76J47k63J51M2k15O5K14k5k09K14
5443F0j56J53J6k46lL13J67j90k08J48nj23mn4J16j3k04J97r4J37J59l81L12j65
5467f8K44nL8m29K99j68K32j70R9r8J65k99R4O4Q0Q7l5j6J55l33M34k56r1k79
5491b56J20J7Q5R1jl3j36P3J75Nl54K0J81M8q8J61l5K54m43k2L11j38R4j81L23
5516B71l38J37K9l50L88rq9j14O6K37j34O7k13j63J44K65r5K4k67K45k85MJ38
5539d2R6j31K01q8l1O1K11j29l06K45L7l48K79k04J27J09j36K54l05J72j68J0
5561h6j19J14j3Q2Q7j31K37l50J31P7k22N27k38k59Q6J06L8j40J62J0J15k97J49
$$ y = [143, 275, -110, 39, -206, 103, 8, -90, 28, -198, -12, -41, 225, 52, 101, 68, -131, -157, -45, -21, 44, 18, -147, 8, -27, -75, -38, -25, -40, 194, 24, -189, 127, -140, -60, -240, -337, -61, 86, -177, -26, 16, -199, -134, 80, 55, -154, 60, -96, 57, 73, -173, -176, 137, 304, 114, -94, 54, 49, -74, -78, -132, -16, -29, -233, -36, -130, 7, 166, -215, 97, -68, 176, 171, 209, -220, 79, -89, 143, -27, 72, -26, 139, -160, -66, -2, 78, 165, 130, 114, 269, -64, 370, 114, 23, -256, -136, -119, -34, 57, 56, 23, -113, -40, 135, 140, -214, -194, -13, 35, -53, 108, 73, 327, -116, -138, 173, 35, 129, -52, 271, -67, 70, 99, -251, 137, 128, 39, -75, -9, 228, 94, 161, -52, -215, -71, 194, 99, 123, -144, 101, -184, -180, -42, 54, -77, 124, 36, 5, 66, 277, 148, -158, 87, 124, -224, 55, -149, -22, 87, -49, 205, -100, 72, -96, -86, -205, -91, -104, -22, 65, -66, 171, -179, -48, 29, -193, 334, 96, -163, -77, 29, 67, -73, 89, 99, 214, -83, 66]
5584F6K51j37k12j56P7K8L0o3L72j73n8R2J5j70K88m71K51J88k08j00K5K5K77
5607B37k48K70j40qn5M2R1l51K29k07K04q7j7l1K5j77J16L48l18R5K7o9O3k98
5631b59R0K69j19O0q8o4L4R3k13L80j27M6K12n35J99J11J09j40j95K75k85K19
5653G2j73J38j38K75j25R0J47n82J86J52j3R0J5l71J31l4J8J20J83k77l6L06k42
5676f8J19L9j61J62p0J29j14J79m06m9K58j28Q7m9M2K45p9k98M1Q0q2J27J92o9
5700A27k15j72J26n1J20q3J48J02l07R1J70J06k12j46K38k27K41MJ06j96n2K2
5722f0M4k09K24J36k37j52J31N17l52l5K46l00n0J44r8L53j53k63K10r7k00L23
5744A22r8J8J03j78k09L92Q5m21J44l7%MP6J22n4j63J88k02K71k32p2R8J48l94
$$ y = [66, 317, 180, -32, -188, -111, -83, -53, -116, 256, 83, 25, 117, 132, -38, 250, -221, 30, 218, 10, -90, -65, -40, 237, -11, 259, 119, 111, 56, 98, 189, -162, 67, -140, 64, -23, -40, -71, -46, -223, -107, 241, -77, 18, 45, -24, 39, -259, -169, 100, -19, 41, -47, -111, -77, 16, -197, 183, 56, 102, 314, -221, -22, 89, 198, 58, -137, 138, -147, 72, -101, 37, -101, 174, 49, 139, 286, -296, -110, 42, 29, 119, 134, -237, -106, -140, -122, -2, 181, -96, -132, 174, -68, 51, 90, -71, 91, 21, 150, 36, 215, -191, -240, 18, -110, -23, -72, -30, 215, 136, -162, -121, -41, -123, 4, 196, 127, -88, -260, -134, -185, -65, -148, 0, 102, -205, -114, 56, 162, -50, -196, 42, -185, 56, 60, 166, -30, -82, -60, -16, -225, -1, 135, -102, -254, -123, 394, 42, 7, 253, -47, -97, 47, -51, 302, 149, -114, 96, -1, -201, 122, 24, 42, 145, -33, -242, 150, 235, -186, -42, -79, -79, -75, 1, 123, 69, -94, 94, -108, 163, -69, -141, -43, 105, -289]
5768b89L73l14K4J78J8O0j06n9R0k04K77O6j48l4R9nJ91Jm35J34K6P9j3M9R6l41
5794a87M7K25k56K23p8k77K86j59M07k05R5n3m15K63j20K96p0Q2j21J5O1j8mq0
5818d3K2K56l33N0o1J97J7K7r9q1k00K51k68K78j08j90L58K17l78J56J36m57L20
5841F7n2J37k21K59l48K56o2M5p2j19P5j06J44J28n7L4j44R3Q6r1j00J03j72L39
5865B22l20K73k10k4j20J69q8J11L8j44J78j91M86n75K7L50j7k61P3j9J08n3k88
5888b75P9M1J75n3J76l07k4M40l78J40q2O4J75k60K4K9K3m3j67K23j02J61j23
5911f4R9N8k74J64K50p2m1j84p5K95j57M1k90M55j82J69Q7l18j20j06L84L0o4
5934H5j90k0K74j33J95j79L6l02L24k05K21o4l4P5M7l8J63j79j7k14J15J16k03
$$ y = [-289, 84, -230, -206, -28, -10, 50, -56, -115, -25, -229, 48, 114, -34, -68, 31, 26, 217, 218, -217, -83, -57, 22, 9, 58, 154, -187, -140, 85, -171, 52, -26, -303, -17, -176, 231, 26, 121, 68, -347, -84, -204, 92, 22, 104, -17, -2, 59, 41, 37, -43, -21, 235, -98, -48, -109, 88, 105, 132, 33, -48, -248, 3, -265, 13, -95, -285, 73, 290, -88, 68, 204, -253, 67, 15, 152, -69, 190, -158, 98, 36, 81, 9, -110, -35, -141, 3, 131, 74, 108, -36, 57, 143, 52, -48, 55, -117, 222, -98, 175, -35, -59, -179, -10, -98, 13, 51, -93, 85, -106, 380, -195, -168, 182, 165, -96, -23, -42, 66, 13, -275, -196, -155, 20, -33, 143, -164, -188, 252, -126, 14, -68, -4, 171, -89, -65, -36, -13, -56, -223, 0, -102, 59, -64, 35, 93, -181, -17, 233, 161, 120, -64, -139, 156, -1, 40, -250, 205, 23, 192, 279, -39, -159, -265, 119, 149, 85, -105, -125, 149, 16, 211, 32, 68, -234, 90, -115, 106, 42, 8, 83, 130, 92, 255, 76, 59, -155, -40, 76, -127]
5957a27j61J72QJ1M8J30O7l28J42J40O4k71M0m1J88j88J16k57N4K72j36K22o1
5980A04j65j88K17j22K38j2j36PJ71Q0j35j53K74j45J88j72r1K0o5K5Q8k27J63
6003c6n4nJ06K5J05k75J20m6p8J37j15N0K13m31M42k35J23N3j16j13K13l02n0
6026b69P0J49J53j37J66l05K16k02N6j28K22N5Mj43J6j08K36j39K35k57m0M56
6048C06k68P7l02K16N6k47J98q5j11K67k35J41K14k43J57j67J99P6m00L82j6l52
6070a37j40M65l16N8J32P6j59n7j82J87J04O9j08q4K41k85K93m0j63J10P7p4l60
6093b93L60l0m22L02K50k4j54J81l47OL08N2rj89j5j77K35l0J84m26j16L00l0
6116h4N8K24J7k18j02L9J62J14j45k07L2L1l8m3K04J44j24O2N8j88K34l52K42
$$ y = [-127, -288, -116, -108, -97, -49, 81, 148, -180, -38, 102, 166, -105, -65, -106, 82, -106, 10, -247, -193, 79, -57, 165, 104, -61, -249, -32, -154, 84, 72, -64, -57, 114, 194, 59, -94, 180, 35, 223, 51, -40, -20, -85, -60, 28, -199, -36, -90, -95, 11, 36, 141, -134, -14, -60, -138, -1, -116, -66, 147, -284, 158, -77, 46, 99, -17, -130, 83, -219, -269, -199, -50, 103, -34, 132, -173, 43, -159, -103, -231, -9, 46, 50, -93, -77, -185, 51, -88, 147, -110, -150, 306, 38, 115, -187, 29, 85, -162, 36, -49, -160, 107, -128, 13, 227, -16, 141, -26, 173, 249, -151, 231, 215, -137, -277, 188, -128, -70, 62, 138, -21, -78, -260, -73, 31, 100, -8, -92, 149, -136, 157, 117, -46, 64, 141, 67, -293, 67, 37, -385, -83, 167, 143, -11, 170, -177, -171, 137, 189, 180, -9, -24, -201, 34, 4, 188, -238, -354, -54, -84, -26, 198, 215, -3, -105, -66, 96, 210, 65, -142, -110, -79, -117, -160, 44, 188, 64, 126, 184, -4, 230, -122, 120]
6139A20m7L3J09l18J05J63m0k31j95O6L23Pk48L98k58n5o5M18k72p6p0j3J48j7
6163a5l9j60K79r8J03l12J47L48r4M1k94J27J65k4P2m58J71k64L25N8j46o5J80
6186D7P6k7j03J81j98o7L9N7j9J03q6J68j35J92m70L50p6j02K81k48j08Q1J72
6209A08m69M65N6J06k08q5J09m4J33q9k21K30R6P5l98J8Q6j65J71K7K77n12L90
6232A56k97l08M57P8Pj95p0j37L07j70K31k12K4P3L16%j27k71K58q9r7R4l3O6
6256F1O3QR6j48J60k47K29j89qM6Q8M9j55J14k42P6l20N51j49j61J13Q1k3j95
6280a02qM41k10p5o5M5j4m9J86k23J62J59P5n13K85k77L74l06J29q4j1K68o21
6303d34L16R7j11J60k33J47J02K1j79K28k72J32m6l5P5N2l0j29O4J45Q1k80l8
$$ y = [120, 73, 106, 215, -103, 2, 165, 125, -106, -301, -235, 88, 95, -153, 245, -13, -68, -133, 285, 13, -63, -133, -146, 2, -15, -54, -214, 65, -33, 70, -242, -95, 253, 159, 200, -94, 33, 198, 174, 246, -212, -41, -305, 20, 78, -68, -133, 47, 123, 96, -7, 174, -24, -91, -52, 5, -14, 89, 3, 171, 36, 228, -242, 108, 32, -70, 211, -37, -145, -64, 108, -361, 104, 160, 266, 58, -27, 82, 38, 171, 82, -139, 91, 187, 262, -136, -118, -32, -197, -26, 1, 278, -234, 156, -141, -449, 8, 86, 93, -102, -172, -309, -2, -172, 59, -153, -129, -56, 260, 260, 133, -138, 120, 31, -66, 28, -5, 61, 124, 132, 228, 80, 240, -7, 222, 33, 25, 71, 159, 208, 53, 167, -75, 1, -319, 232, 83, -78, 35, 116, 93, -102, -110, 331, 121, 46, -19, 26, 12, -37, 149, -74, 88, 247, 322, -191, 94, -183, 191, -115, 14, -70, -81, 187, -434, -118, -21, -132, 28, -205, -58, 44, 65, -114, 114, -158, -26, -72, -107, -32, 20, -10, -139, -75, 70, 151, -129, -167]
6326a67J43M1J84l9L3l44J35K03k70J13j89K31l73L55j48N2K85k46J13p7Q7m74
6348c52K24K35n4R1k94L2m0j1K63j25R2mN9Q5o7m05M30l09Q3M0J2k63J47K55q0
6373D4J2l1K51l38J4m4LL00k22k6K33l69J05J80N0j18N1j10K1j18J06k26M77j83
6397F2k16K97k45J89r1k2j05K87j85Q8J54k71M9K55l25r0J4K17o0L1LO5K8j28
6421AqK9J40k55J53J00j09j56K11j07k2m4J1lM4j26nK8M7L6m4J19j65nJ17L0k44
6448b27K01r3N5J09K53m88J1R3J48J53o1j16j6n7m7K23j55J84j66J98l84K63N9
6471A40j85J3k14L12l32J76j32L72L34l85j02n6rj70J73j29K33J6J86j56j36n5
6493a06r9J78R7k04K24kJ34l38J58Kk26K34k76K63j36K33r1j95K09l8K83m44L23
$$ y = [-167, -24, 17, 201, 162, 195, -149, -14, 189, -81, 32, -157, 74, -299, 56, -92, -40, 245, -1, 112, 35, 122, -352, -128, 107, 53, 144, -150, -118, -158, -169, 94, -31, 61, 57, 116, 201, 134, -271, 159, -150, -67, -27, -15, -278, -131, 124, 44, 56, 25, 276, -62, -48, -92, -89, 211, -11, -37, 196, -173, -68, 112, 162, 44, 95, -15, 6, -112, -6, -232, 245, 62, -154, 143, -102, 87, -4, -26, -131, 156, -29, 59, 213, -58, -9, 246, -79, -169, -155, 62, 2, 33, 36, 101, 129, 1, -7, 22, 162, -93, 60, 160, 51, -105, 106, -1, -23, -67, -56, -59, -15, -141, -146, -118, -71, -35, -79, 40, -125, -130, -13, 17, -227, -26, -119, -64, 45, 298, -190, -179, -86, 62, 215, 154, 38, 22, -35, -82, 141, -14, 170, 4, 202, -182, 81, 140, -45, -32, -246, 66, -266, -90, -222, 150, 484, 99, -3, -59, -68, -238, -65, -194, 39, 55, 241, 85, -51, -106, -205, -27, 70, -134, 90, 88, 222, -116, 42, 44, -182, 52, -224, 39, -97, 136, 45, -150, 59, 21, 304, -140, 183]
6516A83q2J93j96O2Q1k94j50L64l01L5J83m1L0qNk4r1R3J53m13J12r7K07r2J96
6541A08M6j43k00K85k39o3L47j95k6L09k42j92J37p8o8J79j02M7k01M27J6l31
6563a79M10k00M2M5k57J68j95J77N3q6k22K81Q2K5j58jr9L3Q9p7j6K60k86O8N3
6588A0p6J5J00r0M4N2L0j91N5K24k88J58j6J15j42J0J47n82L11Q3J2M8r6J8K9
6613b0J56k76K63r9l14L20o0o9J33J9J7r7r4J01k82L82k61J54j32p%j9K72j26
6637c9k4J80j05q3K15k72R6mPj77J73j02J8j12J39K14j14J85k61O2k16K71p0J20
6661A01m5P7o5J3j79j30L68k63j80K93j10k7J50J33j16J36q9n0J16k57K38j81
6683f7J33lP3j77J63l68K23q7K36j82J12j03Q5p2k6J82j89Ml9o5P4J34l53L33
$$ y = [183, 101, 294, 98, 160, 241, -53, -203, 161, -140, -105, 78, 37, 67, 59, 64, 40, -51, 42, 195, -218, -106, -203, 4, -88, 108, 154, 11, -189, 96, -143, -206, 141, -54, -80, 229, -13, -205, -68, -146, -214, -35, -137, -90, -291, 136, 152, -179, 231, 31, 73, 118, -139, 29, -166, 11, 64, -22, -244, 37, 119, 144, -14, -15, -114, -81, 8, -69, -85, 175, -111, -43, 10, -66, -51, 49, -41, 3, 55, 85, -106, -51, 173, -115, 43, 27, 142, 0, 10, 157, -425, -114, -31, -19, 29, -67, -49, -20, 136, -140, 123, 24, -290, 30, -30, -99, 34, 53, 70, -27, -121, -20, -302, 80, -181, -27, -159, -166, -166, -185, 87, -39, -63, 117, 12, -71, 144, -128, -32, -36, -29, -206, -33, -135, -117, -229, -90, 124, 10, 195, -66, -4, -220, 51, -19, 101, 56, 133, 68, 81, -98, -228, 140, -123, -303, -10, -120, -147, 3, 136, 20, 156, 67, 17, 133, -124, 114, -67, 66, 63, 136, -41, 122, -246, -23, -110, 126, -56, 56, -47, 38, -34, -60, 122, -67, -63, -102, -167, -93, 41, -312, 21]
6707B1j98J57nJ45j31j80J31J57m2M7j70J85k3j24K8l04N37j92P2O3k91J95j31
6730e3k3K6L6L20m46j5L89l60L13m6j78O4j72M5j8K70j92J29k34K08l12O97l03
6753A45j53j63K50J0r0L67m63L08l23M64l96J13k10J13L23l50j21N5k7K17j63
6774i4Q2k0J30j52J47j50j18L77J7j99k72K22j30K99m3J18l23j88L64n4R1n0l46
6797b92M68l20K53j03k8J2k24J19p6J1k2K99q2J55p0l99L01J1r5j9J95j23l2K04
6821A43p1r8j7O7n5L0P2k36P0r4K8K17j90L44j56j07J80M4j36J42n48N36j78j40
6845a53n5M6M04l57J69r9k6K32j69j95p7K03j82J04J39j14J96J9O5k88K82j37
6867GJ6j67L94P6l73J02k11J06N5N1r4L54j67r2j8l9K54j20k84L38l09k4j46K95
$$ y = [21, -177, -20, -25, 120, -11, -191, -60, 97, 55, 102, -68, 117, 94, -30, -2, -306, 231, 39, 111, 174, -117, 78, -53, -76, -50, -14, 306, -140, -155, 234, -126, 187, 141, -37, 27, -145, -100, -118, 152, -40, 89, -145, 63, -249, 448, 145, -8, -171, 79, 89, -1, 366, -97, 211, -112, 352, -44, 69, -141, -28, 295, -55, -176, -121, -148, 69, -94, -12, -32, 98, -54, 93, -57, -175, 202, 219, 20, -252, -30, -160, 139, 96, 214, -109, -297, 67, 13, 104, 54, -292, 176, -144, 109, 6, -22, -10, -234, -115, -191, -180, -202, 97, 15, 170, 100, -299, 2, 13, -82, -101, 94, -29, -61, 143, 72, -26, -43, 24, -31, -1, 71, -165, -95, -189, -161, 56, -134, 210, 54, -53, 127, 171, 35, 177, -371, 165, -13, -153, -208, -162, 242, -115, 54, -45, -71, 161, -8, -203, -280, -77, -259, -155, -16, -130, 66, 85, 150, -138, 144, 7, 23, -144, 250, 326, -47, 55, -156, -50, 5, 56, -38, 316, 149, 57, 39, 0, 254, 134, -150, 188, -121, -145, -291, 4]
6891DJ6L91k38p8nk38J87p2j40K59j74Q8L3J54J0q4q1O5k97J60Q9p0k8J22k5j37
6917h9MJ61J5l04J17J78J93j96J60k88k1J14r1j58N2p2mK82K22k86j07J83J56
6940B21l56L37k48L18o1k84N0J23j87K16j42K53l04J15q6J80J50m17o2K81r5l5
6962c3L34o5k66M9P3j98KJ48kk35J56J61j50J17J79m04M5M3N5k6j99M3L5j95K05
6987a28P3K94K4N0l23j24J1J36L2j62j00Q5K51J35k85j8N6M0j42K73l24J96k29
7010a79J24p3K93k57L4o3J64J60j24l63N68J14l00l96J46J93o6K9j16J22m1J34
7032A03k4P9j97J14K32l91J06k8J16j36o2K13J82m12j21L64k95J23O3p8%J23q1
7055gK72j82J78k36J26k48n6N1J59Q0k50J53k09J32j9jk3J29L3Q7k11K61j25j86
$$ y = [4, 20, 411, 173, 95, 90, -148, 39, -33, -173, 86, -88, 0, 33, 187, 197, 113, 32, 97, -200, -40, 49, -21, -49, 73, 48, -89, -85, 76, 91, -213, -96, 82, 275, 79, 239, -49, -70, 44, -47, -205, -153, -225, -229, 53, 275, -11, -118, 65, 221, -135, 202, -46, 272, 211, -73, -23, 100, -87, 129, -13, 240, -64, 51, -35, 145, 295, -122, -184, 97, 2, -33, 301, 236, -30, 19, 92, -106, -104, 44, 42, -193, -37, 124, -26, 91, 270, -134, -89, -46, 9, -17, -216, -173, -138, -333, -128, -55, 239, 263, 313, -10, -134, -123, 13, 45, -117, -217, -132, 119, 254, -31, -49, 7, 47, -95, 178, -146, 50, -179, -55, -128, 165, -92, -58, -121, 43, 203, 79, -284, 284, 398, 98, -298, -152, 41, -25, 4, -112, 10, -31, 103, 79, 158, -39, 75, 307, -84, 22, -6, 110, -26, -88, 125, 307, -105, -226, 138, -157, -34, 29, -49, -49, 74, -7, 265, 83, 261, 25, 151, -97, -153, -102, 57, 137, -113, 40, -169, -37, -56, -57, -80, 49, 82, 169, -42, 219, 94, -92]
7079i2N3j88K47Q5l93K91J66l83J26K43J74k02Q0k69L02k28n2j91K30J34k42L03
7101A94K39l33k07K62j76j88L26j42l21K10n3L29k69L8N9K07j46k4j03j19J31
7122h6J90j07J73n5j36J64j34o6L96k15j56K0o4L50l59J14k78M40j56j70K31K08
7144C04m32j6K56l2Q0n5j83K44l19m4M19l99J44J86q1R4k24J46O6j25k09K14o2
7167b8Nj45K35o5J89l59j8K70r9r5J78J05j97J9j1K58j64J0l4j05r1K9K16r4k2
7192a3K47l26Q4J18m9M9k72M50k6p6m17M86n5l90K12j8j72J97j19N1O7J83K6k86
7216d9Q9k36N8J77N7j17L7Jj2K5j07J66k34J40j15P3Pj61J48K29o5q3R7O5k76
7241h6J60k06J53m0j4o1J18k55K48Q5j9k6j79J93k12K9K67k15q6J57k27J86O0
$$ y = [-92, -39, -227, 20, 105, -288, 3, 169, -214, -88, 155, 329, 127, 207, -62, 240, 12, -40, -231, -1, 133, -109, 194, 433, 100, -107, 155, -21, -209, 117, -25, -346, -136, -189, 140, -129, -91, -32, 175, 29, 5, -98, -217, -86, 104, -3, 170, 115, -21, 143, 9, -57, 339, 124, -32, -12, -76, 274, -85, 29, -249, 191, 35, -135, 96, 304, -128, -144, 112, 80, 160, 105, -78, 166, -153, -197, 222, -177, -33, 153, 72, 166, -58, 88, 154, 29, -180, 34, -28, -23, -168, 67, 2, 191, -168, -186, 84, -15, -110, 68, 173, -24, -5, -16, 242, 78, 88, 54, -51, -142, -113, 103, 9, -13, 234, -92, -8, 110, 61, 110, -162, 288, 262, 186, -231, 255, 200, -190, 22, 4, -168, 29, -90, -39, 28, 211, 237, -49, 40, -196, -138, 39, 96, -21, 16, 17, 5, 30, -77, 89, -145, -5, -120, -47, -40, -201, -53, 176, 111, 28, 125, 190, -86, 74, -132, 21, -19, -33, -94, 24, -231, 17, 102, 83, 57, -122, 71, -141, -112, 155, -60, -146, 11, -216, -30, 30]
7264C0J91k08P8j97j45K92J47k31K22k95L7K40Q1k64N7Ml1k31L08l29K64Pj06
7287g9L1j1K33j32M1l5p5MP5j2j03Q2j57O9k76K93R0r5R8m0O0l33L53j28K88m14
7313a73K75Q6j21o2m3k1m9J65j30r0K30j73J16J35j62L5N8k76K11J68j84j5J93
7336A73n6l20J78J61j88L4J19l73L11j76M6L78j76k40L07k05O5k31J74j27k39
7357c85P03l36J0J14k61r4J59K04m08J15J15j12L24k12L67m29J83p6N9J16j7k9
7379A10k04R5M5k38K55k03j4K92j91q2Q9K41j45m8J1J31j40J29l29J85j42K64
7401A11QO0l05O2q9K36m5j40J19p2j6K11l5l97M32%j19j7J79j24k97K60K16k78
7425d0j04J90k60L39k49j44L25k53K28k82K67K43p9l13J94J10j84P4J94l24P1
$$ y = [30, 221, 13, 91, -106, -251, 41, 188, -43, 179, -116, -79, 161, 242, -22, 35, 39, 8, -223, 85, -244, 20, 27, -79, -48, -59, 174, 42, 83, 48, -27, -23, 52, 40, -63, 19, -138, -69, -345, -52, 38, -57, 41, 1, 61, -272, 81, -47, 241, -173, 102, 188, 67, 5, -38, -59, -108, 57, -73, -163, 67, -106, 10, 145, -17, 18, 76, -200, 11, 179, -5, -20, 173, 117, -203, -25, 136, -52, -18, 101, -272, 39, -137, -91, 287, 111, -129, 178, -27, 38, -193, -19, -146, -385, 318, -18, -8, 106, -155, -249, -90, 114, -294, -179, -64, -176, 148, -64, 303, -126, 57, -19, 40, 156, 139, 110, -94, 1, 46, -192, 63, -140, -154, 138, -53, -135, -46, 195, 50, 2, 13, 144, 4, 133, -196, -11, -153, 111, 119, 179, -126, -64, -153, 83, 38, -102, 17, -55, -71, 140, 105, -292, 140, 140, 21, 4, 183, 59, -238, 22, 238, -40, -144, 46, -214, 125, -124, -268, 57, -196, 32, -250, 17, 260, 181, -132, 62, 172, -12, 62, 256, -68, 3]
7446Cj00L41j86j15O1j73K50K2P3j32k6J54r4k12K86j74K0J00r1k01K11MM6j16
7470d9J08k45K25l9K00k21N6R5K3K03j95j6j16J10k3m75j2M41j39k4K41m33J81
7493a04l46M40q1J8J64P3k44J47Q2o1k66J37L29j34j81m9J23j89L16j32l57L91
7515G6J2q4k11J79O1Rm9K69r7m01N01l92J40m2M2j08J46L28k74r8j51J69j61P3
7539f3j26j9J29j37j16L10J15qM7j43l90J81J70p4OQ0R5l56N39m79K54J22k85
7562a48K44J6%j22o0rP6Q2M5k66J53j2J03k60K01j96K94j34K41k80Q4j23J35n6
7586HJ1J79k41N2P7j1j66J59J72m11J70N3j81K73k03PO9r0R5j90L75J62j87k41
7610e9n5k2J63Q6l8o2J33k74M6lm7L16n09K19J58r3L25k48j63L33m16J58j54J73
$$ y = [3, -97, 244, 58, -57, 4, -169, 81, 103, 176, 44, 18, 172, 78, -134, 152, -22, -2, 98, 7, -194, 17, 21, 67, -49, 59, -186, 39, 0, 200, -21, 35, 130, 153, 356, 161, 145, 29, 139, 116, -359, -371, 70, -69, -93, 148, -285, -104, -450, -10, -91, -73, 91, 164, -80, 67, 149, 88, -178, -41, 288, 154, -27, -76, 47, -142, 174, 42, -315, 76, 88, 4, -207, -28, 33, 42, -7, 262, 165, -236, 265, -127, 13, -29, 13, -95, 51, 379, 105, 7, -144, 25, -136, -63, -189, -208, -79, -216, -332, -22, 93, 85, 132, -11, -401, -220, -50, -124, -118, -38, 57, -299, 240, -239, 15, 137, -148, 96, 112, 112, -10, -70, -79, -3, 79, 124, -142, 11, -1, 102, -158, 43, -153, 141, 7, 248, -32, 52, -71, 64, 8, 19, 198, -43, 9, 86, 75, -91, 68, 240, -171, -1, 52, -129, 144, -59, -52, 17, -73, 22, -168, 207, 369, 182, -59, -114, -136, 27, 113, 75, 13, 146, -128, -82, -85, -132, 184, -325, -106, 52, -41, 284, 36, -127, 206, -210, -52, -206, -33]
7634c3J6K01j4k39J33k24K15K57m06L1K01j3j69j4J39j60O3J66Nk81j22M15m23
7657b56M43k65Q3L02n49L86J1p8k67J27lj75L92l36Q9L57k43J36m50N1K70Q4k42
7680a33L61j11q9q2J52k08J46j70Q6J34J26m8j4k05Q0q6k7p1K62j15r4Q9MNm3
7705e1p0k15M76o9k59j51J84K35p8p4k62M14J83l70K02k42K23Q1k37R7N4K22l29
7728c6M4m6J0J09j97K1J58L14n86J31L35k83l15K51J86k7O7k60J46K2j56K32O9
7751A89l85r5L24j58p6K57l70J8J49J73Mj30J8P4k98R9K28j89J95P8k97J97j38
7774a33K62q6l3j33K83j4j83j1j50K81l79M09J45j52n8l51L28l3k79K63r6k2L02
7797A60j69pJ62l22J75J00j55L1j56J20J09r4L03m01J83j5J65k57J87k29K46l34
$$ y = [-33, -17, 184, 170, -69, 64, -160, 55, 312, -94, -63, 138, 125, -44, -58, 81, -79, -16, 150, 155, -126, -248, 167, -256, 187, -78, 5, 307, -242, 144, 155, 77, -190, -63, -66, -241, 151, -185, -96, 261, 18, 154, -296, -245, 25, 109, -133, 228, 117, 28, -54, 98, -110, 36, -134, -48, 86, 212, 164, 150, -55, 25, -61, -88, -159, 103, -12, -106, -17, -13, -8, -51, -121, -336, 140, 71, -188, -339, -155, 80, 2, -72, -334, 80, 263, -107, 95, -147, 76, 157, -80, 17, 71, 293, -36, 8, -38, -28, 81, -116, -95, 63, 377, -209, -78, 257, -26, -341, -90, 96, 69, 136, -124, 22, 44, -112, 120, 189, -196, -291, 33, -125, -201, 56, -314, -296, -147, 26, 30, -100, -82, -8, -306, -207, 21, -168, 27, 105, -192, 5, -133, 129, 43, 10, -123, 160, 146, -37, -48, -198, 83, -296, 113, 258, 106, 48, -303, 25, -8, -287, -24, -120, -142, 160, -9, -16, 146, -176, -1, 99, -56, -25, -181, -61, 48, -46, 257, -144, 39, 24, 189, -68, 119, -110, 136, -198]
7819a98L48j70Q3J3J45k68J45k03j61M13K1j83o6N6j5n9L56k47k17L90l20k4R6
7842f5l4JN7L4j9k02M08n2J18m44p9M70j94M4j2M5M7j62R5m2J49k52J00j13L35
7867B33l7k34J10N0j29Q5n4k3j70K77j97j85K00J20m84N37j60k0L19l50L26l70
7889a56J04J11%on4KJ20r2K11k13l90M25q7j06J24j14L44k31J18J3j40k3o0M1
7913e9J95m14M98m48L58j18K09l66J10J42r7p0K6J37n20M93L8Q0O6o11K08O8O9
7936fl19J03M08k13j41K06K94j86j92J1J21k62J76k2j18J51O0k71M45l14L91m01
7958g9J60P3l22L90j86n1J20j4k04Q7P0j3mK61j46k00J69J4l01K5K36j93J45k0
7982A7j41o8L43J5N9l26J83P1k52K60j22K6r3l9P0j97L23l11K59k53K47K8J54
$$ y = [-198, 150, -20, 63, 76, 221, -47, 98, -105, -266, 147, 168, -15, -81, -25, -40, -99, 257, 10, -207, 183, -137, -161, -65, -99, -98, -41, -7, -26, -228, 180, 128, 246, -198, -277, 193, -1, 43, 31, 76, 123, -39, 56, 14, 163, -89, 11, -102, 233, 196, -38, 72, 122, -7, 78, 24, 1, -169, 108, -89, -274, -74, 46, -438, 99, -61, -81, 238, -112, 214, -156, -52, 59, 59, 53, -1, 1, 121, 29, 240, 27, -363, 62, -25, -131, -7, -121, 223, -8, 110, 123, -17, -40, -100, -59, 136, -278, 220, -228, 130, 12, 221, -145, -35, 107, 10, -60, -34, 103, -417, 76, 114, 194, 260, -351, -143, -75, -6, -325, -222, 186, -27, -168, 38, 332, 146, -46, -35, 86, -176, 0, -22, -140, 11, 71, -200, 245, -69, 322, -79, 81, 154, -168, 222, 36, -15, 105, 91, -113, -26, 44, 31, 27, 288, 142, -58, 111, 125, -176, -151, 85, -108, 37, 17, -124, -192, 151, 166, 225, -101, 82, 153, -99, 161, 39, 65, -28, -67, 3, -194, 129, -182, 77, -176, 71, 99, 253]
8005B53k76K5J76o5O9l26R9j9m4J49k8j01j73J85K25j91j2j46K77J0J2m9Q7j7
8029A20q9Q1r9o6K88pl06P5k32R4O0r5L88n4k20j33P8K30k44J02J95k51j57J12
8053a30L08l25j52J36L02k47O9j29P4K10k44J36K26k70J63j04k54K31O9j56J83
8074I6J17j02K0j10j19j76Q1K88j54j14J28j76K69j9k04P7J9J08K13l08J55O3
8096A52r6j25J44k92M5J50J97O3l73N8L15j01j14J28k92L18l07J81j06J34j36
8117e7Q9l9J35q8P4n9k64J61L2j6k05o3K71j52K45M0j77Q5M1Qk21L19k96J83R0
8142A36k51J16m0p7J0j0J31L7j81K09j00j4k9K15o1l58J60L2K10j86N1p9o2q4
8166b25J56J27L3j12K58j25Lk69N3j0J05J7R3o4j85kJ84O1k68M24n07K92k15N6
$$ y = [253, -23, 2, 178, 113, 182, -144, -45, -64, -108, 41, 13, -88, -261, -76, 149, -42, -54, -200, 77, 87, 99, 50, 137, 120, 31, 112, 13, -53, 235, 228, -78, -3, -235, -141, -81, -176, 212, 158, -62, -195, -117, 113, -131, -29, 166, -85, -242, -130, 178, -147, -299, -163, 139, -108, -39, -168, -94, 116, -128, 8, 234, -36, 127, 23, -231, 0, 69, -87, 96, 213, 111, 131, 21, -98, -274, -193, 95, -59, -173, -45, -221, 48, 29, -175, -98, -79, 29, 242, -66, 89, 152, 56, -69, 75, -217, -172, -22, 175, 238, -135, -77, 238, 137, 23, 151, -141, 177, -130, 51, -55, 79, -57, 32, -7, 128, 40, 114, 55, -209, -48, -16, -32, -237, -300, -29, -181, 64, 104, -73, 12, 53, 61, -160, 159, -137, 46, 136, -115, 1, -39, -116, -106, -116, 15, 52, -129, 80, -20, -34, -63, 152, 91, -267, -107, -75, 135, -51, 0, -79, -141, -225, -69, 58, 91, -21, 237, 112, 115, -154, -101, -111, -6, 11, 104, 40, -145, -147, 37, 98, -170, 254, -253, 39, -176, -120]
8190a20P8
$$ y = [-120, -42]
8191d2
$$ Imaginary data points
##PAGE= N=2
##DATA TABLE= (X++(I..I)), XYDATA
0@%%%%%%Pj5J6j6J6k4L2m0N6p2Q8j10J34j60J92k32K80l31L88m55N32o15P08q15
30d36R37j068J213j377J557j755J972k213K476k764L080l426L804m216M665n156
46b707N693o280O922p627Q402r254J0199j1250J2423j3741J5237j6946J8920k1234
60a1243K3989k7335L1504l6861M4034n4191O9776r6984J57873n32975J07997Q26341
72E01925p08755k43555M20125K87076j48646k21148j20166M86144J73953n81930
82a54977j12935O46262n4188m65303J45127L04752j47990k10334j10714Q7361
92g2939J36675k16709k23579L26051J66221l40294m5380L33355L2247j68883m5099
103a18334P7212J48257k4986k32426J06045L38888j00332k64153J41909J71711
$$ y = [0, 0, 0, 0, 0, 0, 0, 7, -8, 8, -8, 8, -16, 16, -24, 32, -40, 48, -62, 72, -88, 104, -128, 152, -179, 209, -246, 286, -329, 379, -436, 501, -567, 646, -731, 826, -929, 1043, -1170, 1306, -1458, 1622, -1804, 2000, -2216, 2449, -2707, 2986, -3294, 3628, -3999, 4403, -4851, 5348, -5902, 6521, -7220, 8017, -8929, 9991, -11243, 12746, -14589, 16915, -19946, 24088, -30103, 39673, -57311, 100562, -432413, -324416, 501925, -206830, -450385, -30260, 256816, 108170, -112978, -233144, 253000, 426953, -154977, -267912, 378350, 324162, -141141, 3986, 308738, 160748, -49586, -160300, -72939, 63736, -152973, -376552, -50501, 115720, -224574, -269954, 63401, 95648, -73235, -118334, -41122, 107135, 82149, -150277, -44232, 294656, 194324, -69829, 72080, 243791]
113B43791j24920j43512k6530N6721O3881j37457j53591J66833J45593j87053
123i6244r1890J80360M3249j46935l0163R5001M7071l2104k3803O9459R8960j4844
135I8117o8312L9839Q1983m7068j09622J6608Q1069m9000j07295K6984P9112l3305
147I110p7546p809L9576O422o7739m5895P6067O4194n8956j3399R7116M1523l2749
160B9915p75K7147L0515N90o0743p294P5383k3045q6865L5953M8267o6248m5619
173d2819J2126j1194o529j8522m0417M3644N6555n9643j4523R9671J0261n8073
185b9463L5574M2001j4539Q580k71r481M7561J076p0446K0402M8499o8248m9806
198c8561L9975q071m1311L081l834M99K7131k3905k6150N5184J7158n3146J9732
$$ y = [243791, 118871, -24641, -51171, 5550, 69431, -68026, -221617, -54784, 90809, -96244, -188134, -7774, 35475, -111460, -141623, -46622, 449, -31655, -55458, 14001, 112961, 98117, 29805, 69644, 151627, 104559, -5063, 11545, 92614, 43614, -63681, -36697, 42415, 9110, -68436, -76245, -36669, -30247, -97986, -143881, -67814, -3620, -62576, -75975, 21141, 62664, 29915, 29140, 56287, 86802, 87392, 26649, 19355, 94738, 71693, -15172, 20781, 69048, 2800, -42819, -30693, -41887, -48416, -66938, -107355, -63711, -7156, -66799, -81322, 18349, 28610, -29463, 6111, 48112, 33573, 42153, 41882, 32401, 79962, 81038, 10592, 30994, 79493, 11245, -38561, 1414, -6657, -47968, -44887, -48721, -48222, -21091, -44996, -71146, -15962, 1196, -51950, -32218]
211c2218N6456j1386o680L0577P205R005R638l0438m170L0764l1853m2777K9029
224A3152Q948m1362j672J6207j5337p945n475j9537J2178J4062k6935O432M8426
237A142J958j4515L0934K0891r267N93k782o165J2662o274k3409J4691J8743k4197
251A5005j3544J1855j1604k2200q399j2663n160Q998m617K73K7116J3563p267
264h644J2731J4660q171m285N730j740L903P251q13P774J2048q244j2809J378
278B0769j0157k3768j1119l642n068P72L425M690J2689P677n044J016P136n232
292e856p521M210P200O210J0082R627Q059O459l365j0116o530q729j4515q989
306a3774k279j809j09M858N947L125q43l548n345m159n532j546O827J0374Q657
$$ y = [-32218, 24238, 12852, 6172, 36749, 43954, 52959, 62597, 32159, 27989, 58753, 26900, -15877, 13152, 22100, -19262, -20934, -4727, -20064, -28009, -33484, -53021, -40843, -26781, -53716, -47284, 1142, 3100, -11415, 19519, 40410, 31143, 31736, 28954, 22789, 35451, 29177, 5768, 20459, 39202, 15005, 1461, 13316, 1712, -20488, -28887, -41550, -46710, -37712, -42329, -42056, -14940, -1377, -8644, 4087, 18747, 10576, 6291, 12021, 10281, 14184, 21435, 20622, 28396, 40444, 32200, 19391, 20769, 10612, -13156, -24275, -27917, -32985, -32213, -28788, -24098, -11409, -3732, -8776, -7760, -624, -5856, -13377, -9167, -1967, 4243, 14325, 23952, 32011, 38470, 35105, 24989, 18459, 9730, -4785, -13774, -16053, -17862, -17971, -13113, -7166, -4041, -4884, -8432, -13777, -17936, -23468, -25014, -18187, -7813, 844]
321H44J0042J1261P746J099k851l774o408j0274r352m124K82J702J461K937K783
336C374m129q156o344l917o095l511L845O488P695R660R781J0004P005k780m367
351A8553j418n577r399j527L871J316R85J014m88j436n793j1196n455q22o920
366b4292m193N863P362O506R034P197M108K572k910n850k38J105l221J660N348
381A0051L55j28K407k073m367l990p591p393k938k742m52M875O774K676K440L234
397A138l34j664k69k38p60K458K437J272K856N115K131j443j806l609n925l980
413b621l431k826K057K592k374L70L466j256l148J009l88j163J220j39K254P192
429B814K574j167N703K758n834k079J450l611j172M57l537J624K980o710k616
$$ y = [844, 10886, 22147, 29893, 30992, 28141, 24367, 17959, 7685, -1667, -5791, -5509, -3807, -2346, 591, 3374, -755, -8911, -15255, -19172, -25267, -28778, -24933, -18445, -10750, -1090, 8691, 18695, 25700, 22920, 18553, 17135, 11558, 2159, 632, 4503, 5819, 6804, 7818, 7330, 5894, 101, -11095, -16550, -17372, -24292, -28485, -22622, -15260, -8754, 280, 7477, 11585, 14157, 11247, 5397, 5159, 6264, 3043, 4703, 10051, 10406, 10278, 12685, 10612, 6245, 2255, -5336, -12729, -15667, -18409, -18861, -13986, -7212, -4536, -2096, 1138, 804, -860, -1129, -1367, -2127, 331, 2768, 4040, 6896, 12011, 14142, 12699, 10893, 7284, 1359, -2621, -6052, -8878, -6821, -4229, -6603, -6233, -2767, -4023, -7171, -6162, -6550, -7713, -6493, -6632, -4378, 2814, 5388, 4221, 9924, 12682, 6848, 4769, 6219, 2608, 1436, 1893, -1644, -20, 2960, -3750, -6366]
444f366N691m271p088L966Q76l875M916L650j282O841L507o240L500N226q160
459H91j538Q526l776m918P012n82o275L918k650r081M354J300j0417L116R122
474i98n056M06R799l002k898P720l847p616P720K043p262O326M877p121M787M186
490A0064j2631j527Q503r827p847R236j106l326J0427j329n677J1566l14j4515
504h303O117O855j1627L400R839r100M019J4205j0102o117J1514q684j0099R720
518A637o871j0194J7700J658j6135J3306J1312j6013J713P634j5522K759J3096
531F080j5497j978K3495n367j0228J5577j700j1885R973m369j8200J1058Q492
544E451j5698M280J3577o746R81N878j1996j123R957j1672p201J2612L99k956
$$ y = [-6366, -675, -4946, -12034, -8068, -7192, -11067, -6151, -2501, -3783, 3058, 6565, 325, 3825, 9051, 891, -647, 7879, 4103, -815, 6197, 5615, -660, 3258, 608, -8473, -4119, -2819, -13236, -10120, -998, -6054, -5648, 4151, 1149, -1749, 5971, 2124, -5492, 2228, 4271, -2991, 3335, 8212, 1091, 5878, 10064, -2567, -4094, 4409, -5418, -13265, -4029, -5135, -8461, 1966, 637, -5040, 6526, 6212, -8303, -2186, 4669, -6958, -3558, 6281, -2819, 1200, 15405, 5303, -814, 10700, 2016, -8083, 1637, -5234, -15428, 2272, 3930, -12205, 1101, 12413, -3600, -1887, 5747, -9775, -7016, 6080, -9417, -11395, 12100, 6733, -3495, 12082, 10382, -1503, 8470, 4101, -14099, -3041, 5451, -10247, -5967, 7610, 864, 1845, 7723, -4273, -5396, 4561, -7111, -14312, -1700, -1301, -4257]
558d257R740M47k912Q518l592j0510M261p57q566M981K792o573P774P971q527
573G90j475N678n830m205J593n577R44R094j610k870Q948N003n130k307l26j668
589A052j979k625p82J461K490K642P78j293K634J8p550j624K535n329K99O955
605c18k524o00J0839k07o390N254p54p806K246K54o187N629M746p435M601P101
621H449p226k441M070o875l437N045m343o95Q537k878j046J0449l241p326Q146
636E188o85j0243N440L329p202O410M751q352M947O276j2147k079R235r544o303
651a0979R817k038n403R149Q8n163P332P49q786N516L983q683K607P582m757K38
667A252O492l978j627L910n507l687M127l259m671N471n2l769L957J483l846K159
$$ y = [-4257, 5483, 5930, 3018, 11536, 7944, -2566, 1695, 938, -7628, -2647, 145, -6428, 1346, 9317, 790, -685, 4993, -837, -5042, -3449, -9026, -8082, 1012, -598, -3468, 5480, 10483, 5353, 3046, 2720, 1052, -927, -3552, -4334, -2873, -383, 2259, 3037, 1744, 4378, 4396, -3154, -4778, -2243, -7572, -7273, -318, -2842, -3442, 7397, 7190, 800, 6054, 5300, -2506, -260, -6, -6193, -564, 4182, -3253, 1348, 8449, 1223, -1218, 2852, -4023, -7460, -2415, -6758, -7453, 1084, -1794, -2840, 7609, 4368, -2958, 5188, 4503, -5740, -300, 3029, -4173, 2237, 6988, -1364, 3583, 9859, -2288, -4367, 4868, -4676, -10979, -1162, -3200, -8603, 546, 634, -4529, 2803, 3552, -5234, 282, 4265, -4418, -1811, 5771, 1014, 1252, 7744, 3766, 2139, 6049, 542, -3145, 982, -2277, -6948, -1477, -1529, -5298, -1341, 142, -3704, -1545]
683a545J941m040J451K988k616J562M447j774j24L440k026k952K399j283l172
698a304J099L86k016J142P19k121Q13J28k500J21J326p06j39K149J285K64J104
715A750M10M9N26p70j151N33o9m36M99P39k2j057j206j005J4p80j428lR00j12
735b619M17J387R93N22J48k42o10J71J72N21O02P91L76K15N01o48q74j163j367
754g07j488q73o66L80R67J073J40L40K98k72j35o05N23N75N23K59J440J905J009
773D686J60k75j337j449j646j656l32J77l17o89O91Q93J51n85q7n02o93k45k27
792c282J316K162J308J088J423R88m84o21p87j143j021j233o70J91M12J11K96
809E4K87j041j194j091r09l14K8L05J271J813J364J157J198P33j44j067r04l97
$$ y = [-1545, 396, -3644, -2193, 795, -1821, -259, 4188, 2414, 2290, 5730, 3704, 752, 3151, 1868, -1304, -205, 181, -1835, -693, 26, -2095, -1282, -1154, -3654, -3533, -2207, -2913, -3052, -903, 382, 646, 1750, 2160, 2209, 2735, 1965, 814, 1347, 1278, 842, 1341, 2080, 2058, 1001, -205, -1210, -1196, -1976, -3404, -3407, -2507, -2619, -2202, -815, 178, 700, 848, 606, -4, 167, 339, 860, 1462, 2253, 2629, 2844, 3345, 2697, 1823, 660, -707, -2195, -3068, -3734, -3354, -2387, -1314, -1174, -834, -536, -808, -943, -1548, -1025, -450, 73, 332, 1772, 3677, 4686, 4846, 4571, 3234, 1785, 139, -1517, -1849, -1672, -1989, -2678, -1987, -1094, -943, -1528, -1615, -2117, -2810, -3055, -3282, -1966, 196, 1504, 2592, 4015, 5003, 4519, 3898, 3111, 1968, 947, -286, -956, -765, -353, -242, 54, 341, -700, -1894, -2985, -3894, -4208, -4180, -3875, -2604, -791, 573, 1730, 2928, 3661, 3517, 2450, 1546, 1149]
827A149O6m52M14K34P83L85n21j048p98j446k073q45k30m24R73J015J372J517
845G1M76L44j08N24q91n21N97K78O02J136P28L27L64o64j440j053j299j967n44
864c040j57k5O19N50Q37L83O07q46J03J66l21J6Q03J082J294J123J89K46K16q42
884C003j384p22j112j395J64j99m3O65j10K5M18m56j039kP6l60J320Q68O82J449
904A848J100m66M31L83j337o82m5j229l53R82j333R5J222j256j203R67o72j365
922b913M10R9l22J547J068n13J822J349j136m3J231j200o06R51p61k3R92r78o14
941C60Q38r99k113O71k07j860Q73K93l04J210P22l65R18Q38o37j78J496O2p85
960H33J281R6p74J061j18j507k93K4j568n75N34q88j77O46k81o8M06P87r14L25
$$ y = [1149, 1215, 763, 1177, 1411, 2194, 2579, 2058, 1010, 212, -1234, -3307, -4152, -4382, -4806, -3833, -2818, -1446, 71, 547, 891, 783, 1307, 416, -105, 492, 770, 1372, 2508, 3236, 3563, 3927, 3263, 1823, 770, -529, -2496, -3040, -3197, -3222, -2603, -2053, -1216, -833, -226, -1072, -969, -803, -1124, -1108, -305, 777, 2071, 3194, 3383, 3629, 3845, 3003, 1619, 897, -215, -1610, -1446, -1645, -1688, -1023, -1133, -1108, -690, -1146, -2185, -2187, -2111, -2471, -1151, -283, 399, 1848, 2948, 2482, 2913, 3296, 1959, 1277, 1232, 3, -350, 632, -701, -606, 616, -640, -1843, -876, -1548, -2913, -2503, -2404, -2726, -1179, -111, -624, 1198, 2547, 1411, 1368, 2599, 1399, 793, 1744, 983, 960, 1952, 974, 360, 1198, 199, -1914, -1243, -1450, -3310, -2437, -2144, -2448, -1238, -516, -881, 37, 875, 238, 60, 1556, 1618, 833, 2114, 2210, 1436, 2497, 2379, 872, 579, 603, -965, -1540, -1006, -1894, -2071, -1425, -1706, -1774, -1368, -581, -1495, -1170]
980a170P25k84J15J624K91J81P50N2l99R1l90j099K97l08j156k89J159p30o88
999a228M72k38p18L33j021r6J778J27j077J920J311q68P86L19q84N33K39j579
1017A09K70J393j519k66J425p42j117P47p82j802P73j30j120J267R60j095J739
1034A10Q89r73K85R72j223j71Q07m12J08J463n02p46J316n31j406j59o47j064
1052a884K88K3m81P69R16l15K07Q87m35POm94K33Q82N00m57O67R91m76o82J56
1073A308m75j153p60j47j20j76O07O4J42J201j117o80J085l52o34P22O13q77J574
1092H25J215p27M02P99j643n62P61j597n15Q92m31o63J305k07j025Q66L12k050
1110b043P41R53j859R70J584p92J077J426o83m23J383j478q05J245q29r97J430
$$ y = [-1170, -445, -729, -614, 1010, 1301, 1482, 2232, 2284, 1885, 1976, 1586, 487, 784, 476, -680, -969, 190, -540, -1228, -756, -994, -1712, -1379, -2400, -2496, -718, -591, -1668, 252, 1563, 695, 1481, 1800, 916, 1449, 1688, 109, 379, 1772, 253, -13, 1412, 670, -447, 300, -482, -2284, -1511, -1641, -2761, -1494, -534, -1629, 110, 999, 26, 311, 1283, 60, -111, 696, 284, 392, 1855, 1353, 607, 1923, 1392, -14, -173, -820, -1884, -1596, -1573, -2054, -1285, -369, -684, -477, 410, -25, -18, -12, -506, -273, 609, 1109, 652, 1319, 2310, 1834, 1152, 1308, 833, -320, -1080, -1227, -1347, -1523, -916, -852, -710, 491, -626, -1306, -221, -573, -1207, -485, 128, -749, 825, 2040, 1313, 1715, 2514, 871, 309, 1070, -527, -1042, -150, -581, -1244, 61, -146, -1171, -305, 7, -2043, -1302, -349, -2208, -1238, 346, -446, 631, 2057, 1374, 951, 2334, 856, 51, 1296, 467, -530, 900]
1127I00l70q37P51Q4j132J84J62k053L46P45q46O22J316m09Q66P74p88M7J358
1146A720q08q66O62K38o50Q10M67r95P18l10j358k55L59j547N5R73n83R7R00R2
1166b81j33O44k4n76N77k68J81L32N57j72P09J83l89j74k57j027k7J90o47j61
1186g63R6R9J15LLQ0J01k33l01K27P01j72N02N94p4n3K23j43m30rj84p87K18K02
1210A5l16Q1K37l51l14J90m98n7M36l39P4P56N26j39J87M25J68m08K59m36j89
1231C07L4k25J37N53p15rN7j46p37J06k93j69K47J56L5K52N31j43N41j00j2j3
1253C94M79m82o8Q43n78J03N7m4m05k7k9q61M6p74M8M06M52k54L49J44L0K42m33
1276c62L96m2k1K59K89L62K93J58k22j53j85k00q80mj39k34k0J29J9Q0J16p4k32
$$ y = [900, 530, -307, 444, 528, -604, -420, -258, -2311, -1965, -1220, -2066, -1444, -128, -537, 329, 1103, 315, 362, 1720, 912, 46, 708, 946, 296, 1106, 1573, 578, 1296, 986, -372, -627, -268, -1815, -1760, -787, -1370, -1273, -373, -281, -414, 230, 206, -370, 207, -61, 120, 452, 1009, 837, 1546, 1729, 1340, 1166, 909, -118, -145, 45, -602, -763, -667, -568, -453, -450, -447, -367, -266, -499, -800, -573, 128, -44, 458, 1052, 978, 925, 1148, 1005, 575, 566, 382, -405, -187, 15, -301, -220, 17, -334, -648, -458, -956, -1013, -577, -916, -842, -86, 440, 301, 488, 913, 1081, 673, 932, 496, 307, 341, 116, 253, 806, 91, 82, 139, -7, -744, -638, -931, -1100, -853, -697, -662, -410, 121, -22, 519, 419, 407, 394, 873, 391, 323, 1166, 588, 691, 748, 704, 299, 272, 243, -618, -572, -1346, -1298, -892, -440, -694, -345, -201, -171, 71, -362, 34, -8, -29, 230, 519, 881, 1174, 1332, 1110, 957, 772, 572, -308, -312, -451, -685, -705, -576, -557, -477, -361, -435, -667]
1299f67L2oK02j04L23N43K27J26L29R9j90J94k95m99k49J13N2k13K52l95J69k49
1321b06k20j15j22m28rK85K45K04K87Q1L49M06j01j55Mj3k26j09K38J55m7J84
1343F87l98j84M9k84o43l0J2o6k6J76N79K16K85m53L59L12n26m0J32J83k59M80
1365E61p9L16K2k99m01K11m23n52J4n9l1J08K63L71O3k53j13L44j07j26m7N47
1387C30j57L69O2J67O7k00O0n54j82l69P3k48J64j89L39j21K21nj16k75K26J20
1409b18K8K64J45K26R1K89kq9J34o34n5P8k66l56K99K16n46K77r6k21R0m02n0
1432g98j61L39L23PM09j03M02K38l9m4N6k54J9P9j65Q1L48l06k86N0k75l13j65
1455e58J52o8l74K48J62J09L63n7j43M64l07J45K02K28k24l1J58O7n9M49m38l58
$$ y = [-667, -635, -641, -439, -543, -220, 323, 550, 676, 1005, 1104, 914, 1108, 813, 314, 65, 178, 230, 17, 269, -126, 43, -206, -426, -541, -663, -1091, -1100, -815, -570, -366, -79, 2, 351, 757, 656, 501, 505, 492, 266, 157, 395, 550, 503, 687, 289, 105, 154, -130, -773, -803, -791, -857, -883, -707, -128, 88, 373, -80, 279, 591, 65, 25, 157, 340, 81, 561, 482, 798, 820, 521, 120, 331, -92, -644, -630, -689, -720, -612, -349, 22, 85, -168, -281, 63, -44, -170, -217, 330, 173, 542, 604, 771, 838, 638, 698, 144, -38, -407, -334, -582, -418, -607, -268, -389, -168, -173, -289, -564, -338, -218, -190, 74, 219, 445, 536, 825, 823, 734, 868, 234, 179, 257, -9, -365, -66, 150, -396, -119, -215, -436, -346, -748, -798, -959, -620, -297, -290, 119, 16, 418, 656, 617, 573, 629, 375, 394, 473, 308, 389, 737, 431, 145, 195, -80, -393, -558, -406, -474, -848, -600, -438, -329, 34, -23, -166, 298, -9, 136, 338, 566, 342, 311, 469, 536, 477, 926, 488, 130]
1477A30j57p4l95K9J4m14J63O49k57P0P4kkO9l42p8Q58O3m84O91k48J81n8j56
1501C24l73L0J4l26R9J29l24N42j16q5n24L81k54j12J20j37J01Q64N5j71K08j47
1523B98L07k40j36k15J11k2%p3J9k16L02o8k13j24k40j18RL26K10k18K43KM46
1546C90j15n4N5O7m54M16p3j15J08M20o06L9J10m65j45M33o41j27M72k99J08N42
1568F6J85m18L54j42k13M72K4j30j2K07q0Q6K81n52j42M24m16k59P6k05J69j49
1590c74J24j46J78N3k55L69K9j70J98M3m04O03M54m95L79k0j85k38J91j69n67
1611d02M14J2l03L97j82l63L95m3l74R3J88m57L5O11J6J78L04k56J46r3J72q4
1633D04k9j82m73P00k72q2R0j14k89J53j21k33O1j50j30L23K82N3J96j90J54R6
$$ y = [130, -27, -101, -496, -467, -453, -867, -704, -55, -312, -242, -168, -170, -172, -103, -445, -523, 335, 398, -86, 605, 357, 538, 480, 324, -49, -19, -5, -331, -232, -103, -427, 115, -1, -86, -610, -229, -483, -595, -475, -612, -511, 353, 408, 237, 445, 298, 605, 365, 229, 14, 125, 103, 103, 30, 49, -167, 135, 67, -146, -270, -510, -628, -619, -293, -83, -301, -58, -56, 390, 275, 221, 276, 343, -111, 305, 232, 117, 225, 645, 39, 78, 188, -277, -422, 11, -630, -757, -285, -584, -476, 66, 251, -167, 187, 45, -168, 304, 328, 198, 186, 393, 313, 399, 680, 128, -14, 410, -6, -265, -189, -394, -225, -374, -250, -396, -218, -165, -420, -51, -22, -192, 6, 49, -355, 248, 702, 207, 586, 566, 381, 143, 334, 165, -402, 12, 24, -279, 118, -64, -427, -32, -75, -449, -356, -168, -625, -590, 21, 37, 215, 519, 263, 409, 316, 488, 404, 375, 193, -280, 420, 148, 66, 156, 42, -247, -94, -215, -448, -387, -537, -667, -344, -62, -9, 187, -3, 151, 247]
1655B47K64l56l43O51m24M2P1p0m7K41j79k86J39O5k52l62L56P2j04L63j48j16
1677a76n8K49j18j0J52K53m31M41L9j68K9J81j32k64J8R8l45O5r1K48L2l0j3j51
1701a82J00k91L63j79j19M5L12M0K37K63j27j8k04q3k7j43J43j49j64K01j58L7
1723a03l3L22n66r6J63J81k05K44K6q1J94J92Q4j49J22M8l11J8q0N98n01j27K17
1746A57nRj88j26j18j26R6M5J01k63M79j85R7j3K57k20J31p4J17J13O2q4n9K74
1770D77k54J00q5k5m73P5k26NL4J58l0M21k01j25j89N6J49k00R8K29M34n07M14
1793C35L7j98O1n5K03n02J42j28j75N18k27k06RJ57J56Qk05k46P4J96J0Q3J19
1816A66j13lR3O8Q7k14MJ70p3Mj59K87k81J56j53q5j35j80J27J38o6j10J52K73
$$ y = [247, 511, 155, -188, 463, 39, 81, 152, 82, 35, 276, 97, -189, -50, 15, -237, -599, -243, -171, -275, 88, -60, -176, -234, 15, -103, -113, 39, 292, -139, 302, 341, 173, 202, 383, 251, -13, 5, 103, -242, -177, -268, -20, 12, -18, -31, -182, -82, -373, -10, -189, -308, -263, 49, 89, 326, 589, 462, 444, 240, 157, 130, -13, 130, -19, -183, 18, -140, -103, -136, 186, -380, -476, -313, -132, -337, -93, -67, -148, 46, 238, 322, 173, 295, 343, 32, 50, -30, 568, 67, -60, 157, 152, 161, -27, -153, -271, -397, -301, -256, -155, -418, 61, -124, -27, -40, 217, -3, 128, 54, 171, 284, 346, 262, 203, 477, 223, 323, 238, 213, -260, -185, -411, -406, -372, -214, -244, 177, -24, -149, -338, -282, -133, -333, -235, -6, 428, -79, 335, 372, 174, 235, 180, 383, -119, 23, -105, -280, 238, 11, -195, -186, -29, 127, 135, -70, -316, -242, -46, -36, 47, 166, 53, 50, 143, 211, 298, 84, 88, 258, 185, 189, 30, 317, 36, 192, 39, -46, -181, -361, -234, -96, -162, -272, -120, 153]
1840A53J15k44K31l73J0M1j50J18q8L07N2N3j61l29J2M12q7n5l26J22K05j23K01
1863I6k7J19l4k56J94j03Q2k84K18J22Qj10L3N5l22K85K7k6j96n1k43J73J7L14
1887I1j79K71L5m47K70l41L22m24L98L3qo4R7L7K4j83j6r3J77K7m0qK3Q9j57p7
1913a43L26P7k76r7k27J80MK71K05n9k49n8K2Q3R2n30M97mk31J30j5J42n5m6j43
1938a04K00J36p66J98J94J63M4j98L07k20K89J05j2j73M5k34q0J23J27J72p5j64
1960G7J67k89k14M12j35j57j10K14O9pJ31J22l40J8Q5k99L20m42K71L49L0l75
1982a03K07l2k0j90J20j42K81j07Q1n7J65o5j87L27k22K46m44J55k09M22l1m14
2004b19M60m05Rp5K48j64N2K0o4j7MJ08rK08k48K11j13Q7j19j4K91k21o1J73j03
$$ y = [153, 268, 24, 255, -118, -108, -67, -217, -99, -187, 120, 172, 225, 64, -265, -253, 159, 72, 17, -309, -187, 18, -105, 96, 69, 188, 154, -102, 92, -11, 71, -213, 5, 127, 135, 25, 58, 113, -209, 76, 103, 77, -119, -170, -413, -240, -223, 91, -88, 183, 218, -229, 41, -300, 22, -402, -4, 29, 21, -43, 54, 91, 115, -68, -84, -177, 0, 27, -13, -21, 2, 91, -66, -143, 183, 260, -16, -113, -340, -160, -156, 115, 320, 261, 12, -46, -24, 59, 151, -379, 118, 114, -117, 13, -2, 140, 85, 39, -104, 96, 232, -534, -336, -142, 21, 65, -133, 174, -46, 243, 348, 336, 163, 208, -26, -106, 17, 144, 316, 241, 77, 244, -45, -259, 153, 18, -139, -249, -35, 34, 27, 158, 280, -60, -42, 43, -256, 64, -378, -107, 242, 272, -103, 104, 72, 52, -138, -18, -160, 121, 14, 95, 38, 203, 138, -49, 278, 56, 302, -142, 13, -196, 226, 195, -219, 241, -164, -155, -230, 18, -146, -94, -74, -138, -155, -151, -43, -52, 156, -92, 119, 6, 93, -26, -40, 251, 30, -31, 142, 39]
2029C9n4NK09j99K3j97k61L98L9P0m05M87j84PR2j73Q3Q1p1L9p0J41J55J15l07
2054F2j0R1k82J64k6J45j64J06R7N8mj86p3r7J02k05K23N5l44J30K28k62J10N2
2078c0J50J6o1q4J01J01k99J30j81M38l41J11j55k9J89j46k15M48k57J49j98K76
2100A13M0j90K39K9l25K9Q3k29M39j25O4k0j83L1N0j94L33M9m2k74M1k49K77k8
2124d2k32L60r8k39J72j89N14l24n8K24o0J46pj58K36k03l48R7M72l36j09j33
2146c15R8K35Mo0k20L54k92K70J00l09K02J98l20q3K83R4j20Q5m67Q0L82j57m0
2169Bl55M50j02j15oJ45j6o6J14R4k88N7P3j08K33K55k88l2l19L52Rk8j11m4K03
2194A09l24L96M5k90j76J13K8N3Q3j31j39J37j3K68j77L0K9r6p1J99k97M47q5
$$ y = [39, -15, -10, 199, 0, 23, -174, -435, -37, 2, 72, -333, 154, -30, -23, 69, -104, -21, 60, -11, 28, -42, 99, 254, 369, 62, 52, 143, -139, 25, -1, 144, -20, 86, 183, 241, 237, 51, -22, -119, -17, -222, 1, 56, -288, -158, 70, -192, -82, -30, 120, 136, 75, -9, 92, 193, -106, 24, -157, 281, -60, 51, -104, -133, 56, -90, -305, 143, -114, 35, -163, 113, 153, -37, 202, 231, -94, -65, 18, -211, 228, 103, 167, 147, -36, -5, 45, -149, 184, 233, 191, -83, -42, -291, -14, -42, -274, 86, -12, -251, -79, -268, 246, -78, -136, 88, 28, 174, 167, 9, 245, 42, -306, -209, 263, -73, -182, -315, -217, 18, 22, -38, -258, 96, -196, 74, 174, -135, 67, 265, -55, -138, 145, 239, 119, 204, -263, -183, 199, 42, 2, -353, 97, -5, -120, -126, 19, 3, -63, 51, 145, -143, -86, -13, -121, 112, 367, 79, 47, -272, 80, 89, 61, -50, -94, 109, -215, 181, 226, -64, -240, -127, -99, -46, 37, -94, -233, -96, -109, 159, -18, 12, 41, -55, -126, 73, -224, 223, 138]
2217A38P0k35P8P2k38m0PK19k1n1j77J04J64k87K09J06N3l13J93j47mK49k61J57
2241D5j42M38m4j03kj20j34j88N6K50j69m9K16k03J90r1k2J3j30K29r8m8O0k05
2265b51N20j7p4j49j82P8L23l69r3K71m52K46j4J14J65k37J53N1k70J58J06O5
2287A42j48p4K96j70K29k08J11j27J96j82j33Q7J27j63L9j24K35l54L03m19L79
2308D2k79OL67p3k02N00k96Mk19L31j46O3j17l1L05l08j90O3J29k7K52k29R2k96
2332b59M75j35k70Q6q0J66J52j77k20P9K62k70J78o8L77l38L68k36j0k61L86m66
2354b61M24m71L20k29K38r9L2l7J34o6J84l79L36j34PQ6n8K0LJ32k34J16J1L8
2378A13j38J48k88L91m4m14o9L73k96J7L23k59Q2n9K75o0j23q0%K43k47M6N93
$$ y = [138, 208, -27, 51, 123, -115, -155, -148, 71, 50, -1, -178, -74, 90, -197, 12, 118, 171, -142, 51, -96, -100, 149, -112, 45, -97, 341, 297, 194, 192, 72, -62, -250, -194, 56, -113, -162, 54, -149, 41, -50, -72, -59, -189, 40, -58, -106, -46, -251, 269, 252, 178, 29, -153, -75, 248, -121, -214, 57, -395, -149, -163, -49, 116, -121, 32, 83, -187, -29, 77, 142, -6, -80, 216, 46, 275, 67, 178, 51, 247, 65, -68, 19, 146, -17, 22, -102, 133, -221, 82, -337, 42, -237, -231, 136, 63, -139, 361, 65, 69, -150, 181, 35, 98, -19, -50, 255, -53, -243, -180, -51, -78, 174, -55, 37, -259, 216, 81, -189, -103, -183, -17, 135, -42, -262, -183, 79, -191, -13, -81, 296, -42, 326, 90, 80, -181, 205, -261, 163, -308, 12, -217, 21, -78, -46, -83, 51, -15, 169, -210, 126, -8, -1, 85, 27, 47, 50, 182, -52, 64, 75, 113, -25, 123, -165, 226, 182, -232, -301, 72, -224, -207, 116, -143, -61, -120, 155, 95, -28, -108, -108, 135, -112, -66, 527]
2401E27m14j53q1Q8N0j25j6J87j07R4m79P25j72K0n0J60l41R0l2Q2m3PR9pK0k69
2427a40J08p8j50K79j59M1j24L44J51k18K42l87k3L58k01m84M23J9o7J38j87J71
2449E6K8N9m8j57J04o4j92R7l0L12l47J77N1j40K52k12j68m1k7N66m52q3K9j08
2473c38J75O3J14j45J29Q3Q7p1k35K83n2J3j45J17l3K35m06K51L9m25M52j30l67
2496c06K40P2k1M2J38J09k77k27J90l6K08j58J88j92m8J07j85L04N9j67J21N2
2518B13l85L52k98J54n3j99M04k92K87l90J90O4j06L15m21J37L2K08l12J42K27
2539B69l9k08k91L79L8j26l30P8K21j31J50J84k80L25l62J09l4J61j5j83J63N3
2561A31j50J70R6m72O55k09k09L53k09K0j25mj27j45L5L49n7rj53K72j44Q0M8
$$ y = [527, 113, -40, -121, -33, 17, -108, -124, 63, -44, 50, -429, 296, 124, 144, 94, 254, -87, 3, -29, 53, 10, 17, 116, 109, 129, -140, -32, -110, -260, 19, -140, -99, -223, 121, 272, 54, 296, -91, -114, 244, 43, -441, -18, 1, -66, 72, -115, 56, 84, 143, 95, -62, 42, -22, -214, -117, -147, 165, -182, -5, 46, -94, 158, -54, -222, -263, -290, 276, -176, -259, -230, -338, -163, -100, 14, -131, -2, 81, 168, 97, -138, 145, 93, 106, -39, 78, 45, 280, -126, 125, 164, -261, 191, 61, -306, -66, 6, -15, 27, 165, 274, -3, -230, -40, -76, 132, -26, 162, -30, -78, 29, -156, 148, 207, 40, 161, 213, -172, 180, -118, 36, -17, -216, 188, -104, 183, -207, -17, 47, -59, 256, -165, -28, 4, 212, -100, 42, 269, 230, 22, -269, 110, 148, 22, -308, -230, -9, -140, 10, 194, -86, 239, -123, -14, -48, 113, 98, -85, 78, 131, -19, 151, 247, -225, 430, 221, 12, 365, 156, 176, 51, 47, -80, -225, -190, 159, 102, 93, -60, 212, 68, 148, 196]
2584A96Nk81j77K21J93k88K0O0p2l5O1K14K21j97k58l5k07J53j49K53p3n1L23
2607I7j00N1J57m15K81L1J9j01Ll6R1j50J41r1L28l95M7k6qK27j45J54r3nj47
2632h5O6q5K12j17k19J97n8o1J80j66K3n7K92l13M58K5l67r1k5K07m05K48M15
2655B74k24J16l0jk85L11j84J03k67K97k38O3J09j42K4J83L5k25O8N2k33%K77
2678H3Nj21J23O5j56L21k39k18O0J92j63N7j74K51N2J12k37M9j61k15K59O3N7
2701F5j68o9J34N3M9j08j61L74j23k98K87p6k27J36j9J92k03L45Q3j63k82K37
2723E8MJp1m9p9K85q4k23K30n1j54J97O7m0k32K79n9q0oj46L04l42p2L19k07q1
2749b32M25N0k71J88p3M5l9j18R6j23J52j21Rm1mM8K67l17j4K32r2kp9Q1k0J10
$$ y = [196, 201, -80, -257, -36, 157, -131, -111, -51, -123, -158, -97, 117, 338, 141, -117, -152, -359, -206, -355, -102, -175, -226, 97, -3, 48, 205, -210, 71, 102, 121, 20, 23, -13, 78, -72, 69, -22, 306, -89, -42, -68, -76, 151, 6, 160, 67, 62, -85, -19, -104, 108, -9, -228, -31, -89, -150, 30, -136, -113, -170, 122, -191, 267, 292, -75, -166, -191, 16, -389, -141, 274, 50, 166, 136, 135, -150, 161, -23, 80, -187, 110, -128, -65, 44, -98, -74, 109, 144, -81, -13, 39, -194, -194, 83, 88, -33, 90, 155, -1, 320, 81, -137, -77, 115, -48, 9, -165, 86, 138, 250, 13, 62, -99, -314, -55, 8, 65, -103, -172, -38, 15, 64, -44, -205, 169, 46, -252, 35, -41, -268, -132, -151, 41, -162, 183, 266, 103, -179, 58, 62, 63, -8, -57, -136, 149, 65, -158, 72, 21, -133, 64, 131, 91, -141, 138, 79, -1, -7, -153, 151, -191, -263, 56, -151, -232, 193, 243, -28, 160, 87, 132, 93, -25, 71, -52, 100, -21, -12, -53, -57, -9, 258, -59, -73, 159, 67, 65, -14, 67, 47, 157]
2775A57j47j90L12m81K56qL9o2K40j7j82rJ43n04N38j26P0N2j14j41Q7K34J3l34
2799a74Q3K99k83O4K19k07M3P8k7p9n2J78k9Qk45J28p3J64j50O9j58K18l27L77
2823A24j28L27l49N4k3P2p4l02N26k75j7K31j79m0L78k91m7L16k90k22J36j6M44
2846C55j94j69J48J57l49J20j61K06k24J45o6J18k27J27k13M48k40j48J37L3K
2867Ej6P7k32J47J05J54k59m1J12q7k2R7N7M0k30K70l08K18j89J22J41k90L01
2890A72k62j86L00k74K68l2r2j4J48j76J20j37J61M5K01k10k38J10J68k0K55j85
2912A22l94L44l23K55j92J28l3m2J97R8j60O8j18q8O1J60n8J43n6j43L3N0j03
2935e1J17Np8n9K2j23R9R8L7P6O5m28L31k72n1J9K07n3k36K15K66n03K89L7l16
$$ y = [157, 10, -180, 132, -349, -93, -101, -62, -124, 116, 99, -83, -92, 51, -453, 85, -41, 29, 81, -33, -174, -87, 147, 160, -174, -91, 208, -75, -11, 208, 1, 44, 122, 95, 16, -36, 142, 113, 121, -124, 4, -69, 95, -55, 14, -144, 74, -253, 124, -4, 323, -26, 28, 5, 77, 3, -299, 227, -48, -65, 166, -13, -53, 325, 34, -13, 303, 13, -209, -73, -89, 355, 161, -8, 140, 297, -52, 68, -93, 113, -111, 34, -32, 86, -141, -14, -227, 221, -19, -167, -30, 3, 5, -11, 66, -166, -19, 86, 240, -19, -60, 52, -35, -57, 40, 97, 137, -93, 177, -131, 87, -102, 20, 161, -129, 172, -90, -276, 24, -250, 18, -14, -106, -120, 28, -148, -28, -165, -4, 41, 242, 32, -206, -96, 72, 52, 307, 122, -272, 72, -251, 4, -188, -60, -93, -135, 62, 160, 0, 68, -50, -138, -77, 83, 25, 168, 112, -31, 2, 52, -51, 66, 71, -7, -66, -44, -167, -68, 30, 67, 143, 208, -220, 111, -161, -212, -193, 14, -39, -275, -60, 206, -297, -8, 29, -287]
2960b87P6J06J61k70J64J88k77J80j29O3K79j71p8j91q2L70Jl44L98k09l6L2J59
2983A03k36N9q4J68pj92J11n7Pn5Q0N6kJ94l9j97l4M09j94j00K25n8J7m18L46
3008A02l4r6K9j46q1L96j88J15j02K01l07L71k87m1K0Q3k82K36J88j07NKK3j04
3032dj69K18J12k68N4p8R1K01N0m23K35J63q2M7k08N2j06K4K74k58R7k22K71N5
3056A26k72K95l30M52j36N1j51J64k78J50L5k61R1P5J02J6q4k80K93Q0o0j27Q
3079d1Q5O9L34n68N0O7ok5J35m0LQl78L01L1j18M5J6j89M43k41K1O2Q7j04L6l14
3106b31J26J55j09J1J10J06k75J49j21K81l69K87o9k0K57k70j52j5K44j02n7K03
3128A39K4l1k5j85J89j43j51K10j00K21j81M3o6J59k77J52N3l76M93j20K38k50
$$ y = [-287, -211, -105, 56, -214, -50, 138, -139, 41, -88, -25, 254, 83, 5, -186, -268, 102, 103, -241, 157, -52, -88, -56, 103, -133, -74, -158, 10, 3, -189, -78, -135, -128, -183, -103, -47, -49, 145, 106, -91, -125, 284, 90, -10, 215, 157, 174, -244, 102, 68, -28, 1, -145, -226, 170, -18, 97, -5, 196, -111, 260, -27, -68, -48, 35, -247, -11, 177, 70, 75, 77, 100, -4, -173, 45, 157, -111, -57, -135, -44, 157, 207, -216, 19, 182, 100, 147, -61, -9, -115, -91, 183, -75, 22, -200, 71, 126, -146, 149, -181, 271, 135, 186, 35, 199, -79, 71, 106, -155, -64, 11, 113, 129, 45, -235, 58, 138, 78, -49, -41, 44, 113, 447, -121, -71, -4, -10, -35, 100, 60, 63, 71, -307, -6, 25, -93, -48, -32, -221, 222, -19, 2, 64, 151, 47, 83, -231, -105, 50, -59, -48, 62, 168, -107, 42, -79, 202, -167, 120, 51, 31, 288, 18, -134, -149, 95, -7, -64, 139, 163, 132, 107, -78, 111, -32, -183, 27, -73, 148, -33, 10, -56, 103, -174, -22, 31, -345, 148, 28, 266, 16]
3150A6K33l76M06m92K73P3K82k00m2l3k39J55rJ1k91P1J83j10J44q1J15j7J27
3173A99m12J48P3R9J20l31K60j03o1L2J18p9Q0j58l0L02l15JJ19k16L28j24j65
3196a15J43k09L43j55j72M93j73l32O8p6K51k07j55L12J58k28m4Q4n0M0q4K0j
3219h9K96P0j6n53K98j10j68M54o3K67m94K75k06J50k2n9j78j76M73q5J0j20K12
3242A66k56J9j18K49J0j15J42P2n14L49pJ28j97MK36p4j74nJ34m8j81K4L23j09
3266E8Np0K47l75NM29n19M15M5J1o0m03L09p5K29l34N7Q7J34j53K9LO2j40o8R9
3292B7k78K93j71L69j82Mq6Ml9j04J41Q8R1j54k9M3l32J73J23O2P9l49p4L00L01
3317C00m22L0j2p1L44m06K18j68k8K72k3J9l26M62k42J3L35k20J30k2k7l52K50
$$ y = [16, 249, -127, 279, -213, 60, 133, 415, 215, 173, 140, -99, 56, 47, 58, -233, -162, 21, -89, 55, -26, 89, 72, 199, -213, -65, 8, 107, 227, -104, 156, 53, -8, 24, 142, 63, 143, -15, -45, 257, -58, -57, 62, -154, 174, 50, -115, 28, -181, 162, 7, -165, 328, 155, -177, -109, -185, 66, -141, -296, 16, 174, -54, -98, -14, -64, -24, -108, -88, -89, 207, 277, 261, -292, 6, -104, -272, 182, 119, 386, -108, 167, -39, 111, 89, 30, -148, -324, 149, 64, 74, -46, 166, -90, -71, -189, 60, 70, -45, 97, 169, -345, 4, -3, 125, -72, -68, 168, 94, -80, -85, 49, 1, -180, -156, 167, 58, 63, -7, 240, -135, -130, 299, -220, 195, 240, 251, 191, -212, 97, 22, 251, -83, -26, 61, 195, 42, 71, 74, 136, -4, -72, 27, -251, 42, -129, 240, 58, 62, -24, -20, -59, -163, -22, 66, 157, 3, -26, 17, -315, -142, -19, 43, 122, -227, -301, -1, 300, -122, -92, -104, -175, 169, -237, -19, -187, -215, 57, 34, 53, -273, 189, -53, -40, 295, 75, 205, 183, 156, -196, 54]
3340E4k36l9J6K09j28J05J12q8j96oK11J48k59J02K1j10K8N8J27j27k9k01K52
3363B4r3L98k30R7o7l28L5M11l28j48K84J81m34J23R2o7P7o3O8j05k83K85J45
3386G4j73J32k41M62k23J5r2k21M10k32J82l09K64p7q3k1J61n4N3j41R9Q6l10
3409b39j1J79J96N8Kj26K39k97k2N1k94L01k2k0N2k95J76K7K46j22r6o7k4K9J63
3434H4K24k51j16L5P1n6k6M0Lmj38J47l6K72j77J00j59J3k6K05j47j64k45O04
3458B53j02j70L6q9K46k63N2l6LK8N8Q9j55n9p3J23j81J66K7J48j01K28k17k13
3482b02L93m74M04N1k38J98k59J81j58K6J26o9j04n7K60l99M99k79J09O1J71k10
3504C0m6r0lK21l25N3J30K9j4J29m0j66K91k26L47l40J30J95n6k48k16J40q2K63
$$ y = [54, -182, -221, -205, 4, -124, -19, 93, 5, -191, -197, 14, 162, -97, 5, 26, -84, -56, 2, 129, 2, -27, -228, 24, -69, 329, 99, 196, 129, -199, -164, 247, -81, -229, 55, 236, -198, -75, 17, -50, 27, -36, 32, -73, -356, -71, 74, -99, 33, -208, 254, 31, 46, -46, -267, 143, -89, 93, -216, 48, -29, -112, -133, 28, -26, 27, -114, -15, 71, -239, -250, -71, 125, 183, 185, 59, 298, 1, -21, 30, -264, 37, 15, -5, 47, -248, -72, -45, 201, 79, -17, -84, -108, -79, 84, 308, 57, -59, -24, 47, -9, -35, 5, 8, 4, -134, 13, -23, 249, 72, 172, 13, 26, 0, 205, 58, -106, -351, 253, 151, -19, 17, -72, 174, -89, -37, -73, -70, -42, 16, 105, -50, -109, -182, -59, -240, -74, -47, 101, 0, 228, 11, -202, 191, -283, 121, 172, -66, 132, -127, 54, -104, -78, 48, -21, -125, -182, 78, -321, 178, -101, 8, 69, 240, 30, -16, -106, -109, 112, -213, -160, -30, -1, -15, 114, 74, -92, 199, -27, 320, -20, 110, 305, 249, 1, -215, -75, -157, 106]
3528A06j84rmJ93j49q0L94j47j41j47j00L45j37k4K46l51K00K28j26q0N6q9j94
3551a94n0K44J35l09N4K62O1j55J25k97J13l7n4Qj2J98J30j43k42M85k08Rk25
3574a02j3L54l14K25j92m4J80k13J28K00j56p5j4k25K76K6o3Q0j68K51m09K09
3596e9K48j8j72j13L46m9k41K4J21J15k33M9R0j67P2j36K8j74L20K2k35K23k48
3619a87R0K07k37J21j00J11j94K88n7p9j57j8J48L4J25j43K2J6n4J98k13K09J45
3642B75k60Mo3K15o4J64m61Pm8J88L5j9J24k15J16p9k1K93l13K23j85J8K14j98
3666e0M0%p5J17Qk27N6K52J05k00q3n7L25n3k03K2Q4j22P6k28N3K96j20J54M6
3691B16n4L2j15m9J47m84N3J4L18L8q0l7j3K77m39R1J98j2r7o0J2j22K09J21q2
$$ y = [106, -78, -87, -91, 102, -47, -127, 267, 120, -21, -168, -268, 77, -60, -84, 162, -189, 11, 239, 113, 33, 89, 0, -194, -244, 0, 135, -174, -120, 142, 203, 48, 173, -124, -11, -48, -102, -94, -106, 92, 222, 79, -163, 322, 114, 123, -102, -115, 239, -75, 150, -42, -86, 94, -119, 9, 209, 53, -22, -36, -261, 15, 41, -22, 58, -110, 141, -268, -59, 189, 171, -1, -114, 232, 183, -58, -34, 87, 202, -31, 18, 108, -59, 13, -123, -95, -269, 51, 73, -162, 61, -187, -97, 110, -127, -6, -106, 5, -189, 99, 42, -37, -194, -212, -64, -30, 95, -48, -26, -10, -64, 134, -79, 130, 275, 15, 19, -44, 171, 107, 271, -190, -183, -231, -43, -8, -27, 97, -118, -2, -81, -102, 191, -122, 101, -84, -66, 148, -50, -10, -10, -85, 32, 40, -187, -131, 121, 226, 26, -57, -114, 211, 158, -45, -23, 61, -61, 15, -213, -160, 136, 16, 170, 216, 162, 194, 79, 30, 177, -307, -254, -240, 78, 116, 36, -1, -14, 263, -176, -85, 113, 101, 4, -56, -44, -166, 43, 164, 82]
3716H2j37M1Q0k7J03p7p1j12J77J52m4m42M2L07q7L4k74L12J2K65k68Oq6K91p3
3741B06m15L87l9j98J03J49p6j79k04L32l37N73n00j17M55k79K20J7j57J7p9J91
3763G0k01J51N9j47P0j63J56J97m28L47m66L28J22j66q9k08N68j36K4q7J52j71
3785a8R6K4j80J64K9J01l22J43j05j46J08JJ24K98k56Q7k11Qk0J65n6K32l12j85
3809b31K28j58J30K5n6J71l1l2j72N0j73J91OJ21j68Q2K8j39jj47K64J82j75o
3833a1QQ0L09k72M9l16J61j24j10J6J67R4k02K56p7m6N0O8l05J95M6j06j19J35
3857e4J28r4K59k85q3K42k1l51M09L7k57R6k19K36m4J44r2j08M30k98n4l3k2J24
3881I0k15K24k33K03j17Q1j64J5k9K03k31J64j02L7J51j23M0k85K14J68L4j79
$$ y = [82, -55, -14, 66, 39, 142, 65, -6, -118, 59, 211, 167, -275, -233, 74, -13, 21, -253, 59, 71, 336, 68, 74, -12, 279, 206, -209, 178, 139, -59, 44, 193, 117, -62, -266, 66, -271, 302, -198, -315, 140, -139, 81, 98, -59, -42, -121, 70, -131, 20, 79, -68, 2, -161, -5, 192, -236, 111, -355, -27, 95, -71, -160, -368, 200, 64, 88, 1, 153, -18, 78, 102, -78, 86, 115, 216, -106, 37, -68, -214, -106, -105, 19, 317, 61, 148, -63, -55, -75, 90, 34, 266, -46, -231, -3, -161, -31, -6, -62, 109, 78, 46, -126, -76, -249, -58, -52, 69, -99, -17, 11, -128, -129, -276, -12, 170, -5, -11, -3, 77, 386, 114, 163, -153, 8, -116, -226, -210, -43, 51, -151, 105, 28, -18, 32, 100, -205, -10, 36, -70, -189, -54, 74, -20, 239, -46, -129, 113, 92, -259, 150, 187, -70, 26, -193, 43, -1, 143, 51, -57, 373, 75, 21, -12, -34, 90, -125, 99, -134, 69, -48, 33, -131, -116, -145, 58, -173, -9, -111, -74, 77, -46, -6, -291, -77, 91, 125, -54]
3903e4lJ45J11j50k74O0l9L11j59J33R5j00l10K19O7j29N1J24j47K07m4m6oo9
3927gK0j28J22J1Q0l2n4L5k17K52N5L0m54K50J63m4jm4j0m4L09m67J98k93L33
3952F3R1o6p5j66oL04j64j95K22j30L09j75j0J43p3l3j75L31j8j58k39L89L7l08
3976a02n7J74j02m6J58P9Q7k01j69K4J18J63j53L3n5r8L43k65j94Q0kJ91j49J92
4000D9j8j13M4J11q0J65r3o4O9n5K61j56k27lR8J30k99o5N82n44M22J0o3j50n3
4025d2K01q6n17P14jj73qj77K22m8K5O8j24j95L5J78j0j17K18k32J41j5k3j26
4049i2o6J47l3k4Q1J9j25M6K81l40N4j75m2M68l66o8K9O4j1J51kP1On25K81K63
4075I2j71N7p4P0K05q3m30L15j85M24l4j53k18K12k47J09K07m4k03n8J01j05L95
$$ y = [-54, -57, 88, 199, 49, -225, -165, -204, 107, -52, 81, 176, 76, -234, -15, 52, -77, -26, 98, -49, 158, 114, 68, 62, -7, 13, -115, 7, 18, 98, 66, 12, 47, -170, 82, 137, 167, -287, -37, 126, 82, 81, 37, 27, -17, 292, -175, 23, -270, 63, 154, 88, 13, -153, -159, 145, -19, -214, 8, -122, 187, 12, 2, 145, 72, 39, -136, 195, 177, 19, -220, 169, 206, -102, -159, 15, -87, -133, 25, 104, 191, -10, -179, -155, -37, 126, -27, 6, -49, -147, 196, -69, -263, -183, -185, 6, -143, 49, 31, -82, -38, 73, -7, 158, 65, 1, 70, 15, 276, 120, -107, -110, -12, 118, -181, -246, 336, -208, 214, 224, 161, 11, -42, 159, 73, -444, 270, 269, 96, 88, -89, 133, 85, 110, 178, 54, -141, -106, 72, 62, -55, 163, -69, 72, 57, 34, -92, -158, -11, -44, -68, 13, 32, -93, -47, 234, -106, -52, -227, -269, 199, -167, -235, -206, -142, -153, -2, -4, 67, 73, -452, -171, 92, -79, -22, -96, -26, 179, 96, -334, -19, -204, 220, 186, 33, -185, 27, -220, -111, 96, 52, -151, -209, -108, -213, 182]
4098A82j42j93L62j49O3j99j55M49j36K02k44K9k03n9L08j81J5k29L02m33M99
4119H8k01l5M72k35j41J93n4k97K32m16L92K3j43K92o3l73J84L54m19m7K50j1
4141D5j15J34k15K33Kk68J00n4J61J82j38j12j8J77l22J03J46O7j19q0p8o2K90
4164E9j63R1J42j18j3O2o0k27L54o0n6j08L56k99n1J88j57j68P1r2K95rj16l7
4188a16K4K56j91L10j82j28J49k20K9J24j08l6KJ26J5m6L3l29J30K50J30q5J19
4211B56p7j19j05J46J47j27j05j75j81K84L9j71J71p8P5L13o72M42J64j93J21
4232A55p2k82L11m1j05J58j20J06l5P0j41M9j76J22l73L66p5K13J04l00K7R7k6
4255C2J70k37j91r2L58r6k4L66k66l4k17L67k38P4Q6k22L74j12r5k62K55J5o7
$$ y = [182, 40, -153, 209, 60, 123, -76, -231, 218, 82, 284, 40, 69, -134, -193, 115, -66, -51, -280, 22, -411, 88, -113, -148, 324, 89, -52, 141, 87, -210, 22, -394, -2, 21, -122, 170, 107, -266, -82, 272, -147, -194, 56, 45, -70, 64, -151, 82, 84, -184, -84, -138, 23, 205, 67, -45, -63, 114, -208, -105, 41, 108, -11, -91, -169, -231, 59, -104, -13, 129, 11, -2, 60, 0, -227, 127, 67, 11, -97, 259, -40, -91, 97, -60, -228, -157, -249, 46, 37, -79, -116, -92, 164, -27, 283, 101, -27, 122, -98, -69, 55, -53, -89, -87, 39, 54, 8, 41, -288, -158, 92, 222, 137, 256, 179, 60, -45, 101, 248, 121, 16, -159, -340, -56, -17, -188, -17, -95, -20, 293, -379, 63, 227, 34, 155, 83, -199, 112, 71, -34, 124, 4, 110, 75, 145, 4, 53, -123, -1, -374, -8, -83, 130, 234, -66, -39, 58, 32, 202, -35, -226, -318, 40, -56, -80, 286, 20, -14, -231, 136, -102, -28, 58, -164, 210, 98, 3, -259, -4, 11, -56]
4278e6J38j86K71k08K22k82J64k05J13K35m57M65k24k25K54KN0j9Kl0j12J76J92
4301B80n4k07j41J55j43J75J04k03K70j36j73j95J53J74rj29k71L12K29k39J61
4322A13p4l1q0J63q3L2k01j58L54L3J62K10l99N2p4m9K06j16j18K27l68L81j37
4345D5j16j04j43L29N8j08NL4j13J10j94M51j68o0j22P3j02K31j83K00j40N9j47
4368a05mR1p1K18k82J53qJ7j10J9L3Q0m9j73L27L6m30K55J14p7j96K26j57J4K39
4393A60k40j10K55n8n8LJ34l52J83K5L01m51R6J58j00J70j91J69K56l83j04K26
4415H9J00k26m7P7k6r6J30K5k3R8Q5k76j26J22l08L71j30J29qK43k60K1J49K7
4439A40M5N9n83N87k23L3k35J29J86j72j1j01J48k7J0K11k29R4Pl30M30k55j21
$$ y = [-56, 82, -104, 167, -41, 181, -101, 63, -142, -29, 206, -251, 214, -10, -235, 19, 21, 71, 52, 54, 24, -88, 88, 280, 226, 19, -122, 33, -110, 65, 169, -34, 236, 100, -73, -268, -115, 59, 50, -79, -350, -38, 191, -48, 113, 39, 8, -72, 91, 8, 40, -161, -319, 35, 68, 230, 440, 41, 93, 19, -30, 176, 60, -58, 169, -199, 182, 45, -71, -175, -318, 11, 69, -39, -34, 0, -113, -3, -197, 254, 86, 26, -96, -23, -125, 106, -77, 123, -17, 42, -105, -109, -18, -89, 129, -153, 0, -8, 9, -101, -82, -49, 31, -18, -191, 136, 172, -258, -3, 111, 34, -162, 64, -93, -79, 160, -80, -190, 65, 7, -51, -48, 86, -266, -83, -58, 243, -208, -112, 46, -54, 116, -75, 94, 350, -33, -137, 89, 189, -37, -84, -7, -33, -129, 1, 26, 3, 101, 186, -90, -216, -94, -402, -31, -161, -32, -40, 203, -57, -36, 113, 140, 185, 244, -339, 248, 25, 58, -177, -48, 138, -34, -45, -146, 2, -25, -15, 196, -33, 61, 68, -262, 168, -87, -208]
4462b08Q7K36k71K02j5q0kj45Q7J91p6k35L04l4k2Lj36J52j97K58j72K73o12M84
4486G2k55M35l09l0J19o0J39Q9k15j3K20k16J84m57L10R3k11K73n8l5J5J45j57
4509G8j7J7K34m77L21n4J35j52o6J04l61K89N8k64MJ55m1p6K04K04k33j01j23
4532a62p5P6k2M08j92J03J69m26Q4j3K26k97l5O5j1J44j21J00j55k65K11L9L11
4555A62l65R8J66j63l2P2K07mk62J91k41L10J6k36R3oJ03q7O9k58K97j95K77r2
4579A20j72R9M5l07K50o2j19Q1q4J67k44K48M5k81K32k72J58k64L39K57k31Q4
4601H9q9N1j24J24k30Q4J6M8p0J98J1l85M4R5J72m37L02L08l79J54J84M8j53l25
4625b64L92J41j74l71K18J38m1K7k8q3M7R9j63J99p2n0r2j82L23L13m47J0j89
$$ y = [-208, -121, 115, -156, 46, 31, -49, -51, -196, -109, 82, 6, -229, 75, 41, 19, 22, -114, 38, -159, 99, -73, 200, -412, 72, -183, 252, -57, -87, 32, -28, 111, 200, -15, -28, 192, -24, 160, -297, 13, 106, -105, 168, 110, 75, 90, 235, 78, 61, 78, 312, -165, 156, 102, 237, 85, 19, 123, -238, 51, 109, -155, -151, 4, -37, -113, 91, 295, 62, -39, -162, -237, -161, -183, 225, 33, 136, 305, -121, -37, -50, 176, -121, -156, -91, -102, 42, -79, 21, -134, -399, -188, -149, 162, -203, -105, 61, -102, -134, -62, 145, 141, -121, 70, -171, 139, 155, -81, 12, 6, 109, 22, 91, -167, 130, -65, 212, 120, -52, 47, 92, -215, 35, -27, -146, -65, -149, 18, -226, 22, 67, -214, 18, -254, -96, -360, -21, 236, 5, 89, 0, 51, -73, 51, -179, -95, -79, -31, -101, 97, 108, -277, -233, -138, 34, -403, -101, 207, -172, -18, 166, 214, 61, -264, 128, 269, 95, -276, -58, 80, 39, 66, 38, -45, 2, 101, -62, 137, 65, 15, -77, -259, 64, 377, -70, -60, -249]
4648b49L52k72J51N3m0q0k36L14O6j79K33j31Q8O4j65O9J21l43L85j44N2k21K44
4671A32j72P3j29L2J7J32k76K34q6L17k9k41k1J54L5k10J35l53M8R6L26l45J36
4694Ej66q0J16j28L81k20j7J63J26k11J58m6j39J2l0m9j25M59k69J64j89k2m6
4717a53J81l6k04L1J74N2n4J16k81L04o0p6K90m60K47J13j44j89K5K95j00j34
4739f3l9R4o9J65J20k22l0n0K24j06q7j17K25j82L33m23p5N37k44N4m3J47N1J3
4763B13j41r3l5L86k78k35K22j76J88j50J03K77p4j12j76k03L25j14J67P8l18
4784a46J63j52J75k0Q0l3j61L17j9l57K57j23j24K10j95P7K5j40J4J60k35J90
4806c7J11j45P4J0k55J88J63l22K54k93kM53m12j76L31j22J92q7J65J1k01J83
$$ y = [-249, 103, -169, -18, 35, -5, -85, -321, -7, 59, -120, 113, -18, 70, 134, -31, 38, 159, -184, 201, 57, 109, -112, 132, -40, 33, -96, -64, -47, 85, -191, 43, -43, 274, 245, 4, -17, 137, 172, -38, 97, -256, -208, -112, 214, -131, 5, -161, -241, -125, -253, 128, -92, -109, 54, 180, -31, 127, 81, -58, -46, -76, -125, -250, 209, -60, 104, -85, -107, -153, 28, -8, -212, -181, -7, 45, -9, 107, -174, 130, 70, -6, 284, -176, 71, 184, 40, -149, -124, 171, 71, -63, -102, -8, -77, 88, 208, -14, -44, -94, 130, 24, -63, -180, 45, -137, 196, -227, -302, 235, -9, 45, 2, 149, 200, 213, 72, -21, -56, 330, 52, -183, 39, -137, 51, -99, 4, 281, 207, 95, -81, -284, 41, -73, 94, 172, -146, 17, -135, 40, 20, 100, 67, -94, 223, 204, -153, 104, -19, -143, 67, -128, -51, -26, -166, -152, 8, -227, -37, 74, -71, 3, 13, -242, -54, 109, -213, 41, -252, -254, 199, -213, -389, -58, -180, 12, -75, 90, 101, -100, 83]
4828H3j45j16J15K37j75q6K56j81l44J61P1L0L73p0P1o4l92K89j25L6O4Pj02p4
4852h1J14O1l42Q2K39n07J13N5l3K09j7K66j52j86K35q6Q3J04k31K56j43l7k40
4875b38J47N0J38j50Q3P2K0P3l77j42N04l63L16j34O7j42P4k82K01K58L8N8J07
4898C78l92q6K54j99J99j11j71j01L52j74Q7l46K26J45j40k76K03J24R2j9j34
4919h9J69j41k4J57j68MJ42l6J14p4n4J40K1r7j1J9J8%j43L0PJ76J05l87J80K25
4945B83m75L48l52J68l89N00J14m00K56l28M93j34M8J7j92k02L43j57J26k62Q9
4966a06k38L40n6QK7rJ3m0K17l35J16J49J0j83l7J9R5k3k8l5O3P8n3r4j6p2m1
4993b31J67r0J5J16J5k65L13p7p0L37j12j46Oj10J2L21L8j83L39k30k79L47k01
$$ y = [83, -62, -178, -63, 174, -1, -87, 169, -12, -356, -195, -124, -94, 279, 209, 280, 216, -176, 113, -12, 24, 88, 95, -7, -81, 33, 94, -248, -166, 73, -434, -321, -266, -299, -90, -107, 159, 7, -179, 56, -30, 53, 157, -74, 182, 39, 2, -238, -91, -41, 97, -53, 30, 102, 122, 195, -182, -324, 180, -183, 133, -1, 66, -76, -2, -284, -83, 175, 213, 271, 378, -14, -100, 154, -45, 154, 43, -128, -229, 123, -51, 36, -310, -84, 61, -79, -355, -152, -28, 64, 45, -89, 80, -61, -85, 72, -96, -92, 50, 14, 128, 54, 0, 140, 161, 64, 53, 72, 90, 90, -53, -23, -16, 160, 265, -122, 58, 283, -192, 156, -196, -28, -417, 83, 197, -203, 53, -275, 218, 84, 132, 149, -43, -245, 98, -59, 67, -195, -106, -344, -4, -60, -52, -25, -34, -21, -61, 156, -179, -63, 86, 96, -87, -124, -105, -10, -33, -61, -96, -33, 45, -8, -102, -118, -190, -231, -64, -154, -139, -23, -8, -273, 40, -37, -107, 230, 118, -28, -22, -132, -120, 201, 239, 56, 395, 165, -114, 233, 32]
5016C2J83n4j51j40P0jk05J76N6K22m22K16O4l16K80o4j39K90p9j50K21o5J6k66
5040b26L51j7k42L38j19j74l4L70n14K38L49n34LP5q4K68K3k09K43p5Q9n5p6j96
5064b08K02K26l93K15m6j79L36j21q1j13l7M16k62k03K99m0p3j5J0KP4k16K9L95
5088B17k68n2L53m56L36j51J02K53o69K83J04n2K94j92l91K05M7R8M3R6r0P8k7
5111A61j83p8j06L85k16L1p2N7j20P1KM57n42J87q4P4J37l8k43J08Q8j67j6J1
5135i6J78k26J66L4k6l39K74J42J0l24M70j27j09M4k37P7K01l3K7k32K22k93M9
5158a48J20K7L1j21N78l68k68K55k14K11Q9l03M79l41j99J89K71k12k6m9N1K18
5180B70k82J22jl2j00L38m50L32j33kl00K88L6r0J34o8m20M49k5j82j0J93N7j25
$$ y = [32, 215, 161, 10, -130, -60, -61, -266, -90, -34, 188, -234, -18, 46, -270, 10, -54, -193, 97, 18, -132, 89, 24, 40, -226, 125, 108, -134, 204, 85, -89, -123, 247, -267, -29, 320, -214, -211, -136, -220, 48, 71, -138, 105, 30, 119, 64, -12, -208, -6, 220, -173, 42, -4, -183, 153, 32, -49, -162, -199, 217, -45, -248, 51, 11, -62, -77, -67, -65, 9, -207, -178, 217, -51, -103, 250, -206, 130, -21, 81, 334, -335, -52, 52, 0, 294, 102, -289, -84, -37, 61, 104, 200, 110, 188, 161, -22, -100, -206, 179, -37, -6, -78, -21, -141, -70, -68, 389, -153, 34, -50, 24, 161, 123, -120, -12, 76, -91, -107, -96, 82, -144, 22, 56, 30, -309, -35, 107, 117, -207, 263, 136, 27, 71, -166, -89, 112, 79, 106, -126, 96, -197, -148, -28, -1, 30, -91, 487, 119, -149, 106, -108, 103, 192, -111, 368, 27, -172, 17, 288, 76, 50, 1, 52, 270, -12, 110, 109, 77, -23, 315, -135, 197, 64, 62, -238, 50, 86, -4, 130, 62, -358, 91, 66, -116, -126, 67, 124, -1]
5204aj00k7Q9j65K44K58j62l66L49k64J05K1J48j48l05K93R9J71L3r7l7l0j4J1
5228A05l1P1pk73R0J93k12J04j01O8O8k97Q9J57J9k0J31o6m0j26K26k22P6k18
5252b16K85j02j46J77j60K33J86j84K6k97K40k2J05j22J02r1J5n4J16p8p1N1m28
5275d35N61k3Kr8Q3r7P3K3l1j49j2J01q5o9K06J81k86j31L76k28J58k40Q5J09
5299G4L9l81L49K55j74J7l1j63L81m77j37J55J89j03N6L0j15j33L02k61J67M7
5321H6j48J87l74K34m9J1q3m3K05j72k88M70j64J89m3p4m4J40K7j44J20l06o5
5344c28M35k44O5K26k62K74m7LoQ6l07K3R3K21j64m6m2L6k00J95k3p4L3L4j01
5369a20K17j49k55O00l62qJ64N7l9k52J85r5n6J76k01R8J4J64p9j32q4J63m4o4
$$ y = [-1, -101, -128, -39, -204, 40, 298, 136, -230, 119, -145, -40, -19, 129, -19, -324, -31, 68, 239, 272, 175, 138, 108, 94, 105, 74, 145, 138, -135, -45, 148, -64, 40, -61, 7, 75, -222, -133, 24, 43, 23, 154, 88, 48, -78, 148, -74, 2, -216, 69, -33, -179, -2, -162, 71, 257, 73, 99, -198, 42, 20, 125, 3, 105, 14, 29, -25, 91, 13, -58, -7, -435, 126, 103, 105, 7, 90, -7, 66, 89, 58, -91, -103, -2, -87, -156, 50, 231, -55, -186, 190, -38, 120, -120, -35, 74, 113, -268, 81, 336, 162, 179, 148, -15, 366, -111, -248, -93, 96, -7, 49, 79, -36, -169, 133, -128, 39, 86, -62, 125, -249, -15, -64, -53, -136, -179, 26, -146, -434, 36, -128, 61, 18, -56, -100, 40, 67, -77, 43, -263, -328, 107, -137, -72, 154, -108, 166, 119, 122, 116, 202, -105, -82, 11, 232, 68, 22, -20, 16, -184, 11, -12, -86, -53, -19, -120, 97, -52, -307, 293, -69, -77, 87, 144, 105, -147, 38, -57, -113, 63, -138, -40, -26, 138, 59, -73, -157, 6, -38, -102]
5393a02j09K07o7o4%oL04m9j51R6j60J52l4PR9l99K63K3n6L8M0M5j79J01m19O47
5419B27k39p3O5K16l73K2K26j85M5J74j50M4j83K74j0j60L4J93k04K13L3l12r
5442a32J42P6j76j39K91J66j14j94K15k16L50l90M5K32j65K50q9lm78M90r2p2
5464ck26K63j02L7P8L0j33J55k64L44j40l5K48j93J39k20j97J99M14n72K17J24
5486A63k11R4R7k68n8L53j89j55K63j33K9Pr2K5j56L97o0j16j8M1J41r4l37J61
5510a16J15O8Mq9K82j08K8k30K34k94K55j67M7j04Rk4L33l49r3K17M2k73J80J19
5534H6K41l57R1j34M0k8OM27l42q2K29m5Qk16R5l09J83K7P3RR3J9M9l8j99J24
5560E0k61L42M9N2k88J79m2j31n0J48n1N7j30K08k42M2j06k5L21m6R5k01j2k81
$$ y = [-102, -211, -4, -71, -135, -135, -141, 163, 114, -37, 59, -101, 51, 17, 24, 123, -276, -13, 10, -46, -8, 32, 77, -102, -1, -420, 227, -12, -85, -20, 196, -177, -155, 71, -114, -69, 105, -45, -1, -184, 90, 80, -80, -46, 147, -57, 156, 189, -123, -132, 10, 86, -90, -229, 62, 228, 114, -80, 135, -81, 269, -121, -76, 156, -9, 241, 152, 149, -329, 161, 69, -3, -229, 34, -68, -31, 47, 77, -56, 99, -165, 179, 39, 4, 252, 59, 198, -22, -219, -20, 394, -178, 39, 163, -48, 46, 143, -125, -183, 170, -19, -174, 89, -44, -15, -8, -100, -75, -231, 166, 106, -10, -28, 13, 154, 60, -277, -116, -1, 67, 71, -18, 264, 156, 184, -46, 188, -106, 149, -18, 29, -75, -66, -90, 243, -106, -199, 18, 60, -213, -33, 86, 327, -30, 61, -73, -33, -61, -55, 372, 30, -52, 177, 132, 140, -76, 19, -290, -107, -80, -7, 2, 95, 114, 163, 125, -74, 50, -211, 131, 180, 232, -56, 123, 81, -50, -100, 48, -3, 54, -76, 132, -110, -68, -174, -199, 122, 76, 171, -30, -42, -323]
5584c23L29k7M5J90m10L24j37M5J18j60J7J05O6l23J2J2J3r2R7L82j50Q9m06K13
5608B9m5R9j3K05j97j56m9Q4J14j24J18j14n4K08K40n05K98j30p1R3j66J14J11
5631H9J71l01J90k71J97q0P7j86l3J62j69J84l7j27J16R8j72K47j40k1j45K56
5653A05Q2j31m54K81l1K54k00J18J71j42j81M5J21j11n8J0K27o7K54k92j4O9j0
5676D6l53L74k77L7Q7J11k90K68J34l76M31k64j28L39P3m49K10k32L37p4pm9J09
5699E7j96L6J10m3J72l23L47p6q0k3j1L34n19L52M0j74k05J03M1M18k21j96M8
5722ik03j17QQ3J69J38R5j8j36j27M7N1J07n5j04L07m43J21M4j0K32j00n8m8j85
5747b11J74Q1j9k29K91j10J73j4j2j37k47J77j2J91l46L31%R2l72L20N6j06JM7
$$ y = [-323, 6, -21, 24, 214, -196, 128, -9, 36, 154, -6, 11, 116, 182, -141, -129, -117, -104, -196, -99, 283, 133, 222, -184, 29, -16, 83, 70, 275, 78, -78, -127, -43, 71, -53, 65, -49, -103, 105, 345, -160, 138, 8, -63, 30, -136, -22, 89, 260, -41, 149, -122, 75, -5, 72, -114, -147, 15, -154, 30, -7, -134, -18, 80, -92, 155, 15, -6, -151, 105, 187, 56, -398, -117, -148, 106, -94, 24, 195, 53, -128, -83, 38, -73, -131, -121, 106, 39, 293, 1, -13, 56, 46, -307, 67, -210, -173, -86, 25, -265, 3, 137, -239, 192, -72, -200, 139, 212, -237, -27, -259, 78, 4, -3, -52, 57, -139, -103, 7, -36, 136, -187, 160, 84, 4, -19, -30, 304, -215, 137, 177, 3, -202, -99, -58, 360, 139, -57, -9, -212, -329, -321, -238, -69, 69, 164, 146, 10, -117, -70, -19, 88, 33, -71, 236, -207, -86, -42, -52, 180, 80, 22, -26, -211, -37, 44, 25, -204, 87, -23, 150, 136, 124, -13, -260, -83, -95, 96, -250, 81, 81, 173, -199, 121, 177, 71, 72, 119]
5771A19p3k31L28m5k38J24k17Q9J41P4n2K84n91L44k46J34K05j77k5K38k00K55
5793B40l94o8J72J03j84J74o8l8J89j46K09k72J28j96K17r9l33N28J4l26J83K68
5815C01k75J62q5k37p4L78k38j2q1M30k86J21K21k99J67k34l1K23l0l86L24Q2
5837A41j13l94L44J82j8l14P7j30K23K9Mpj11k65L73j8P3oj64k30N84q1l7l53
5861b11J76k76NM11L6L6j62m2jMj33J60N9L00j29j46K0j9K4k13K30j06j30K21
5885A14j24j17Q2k00K55k60J33J74k65P1j6L89j44J31j51j8K7j81K5N1P3K00j94
5908E5L3j44L0K61k91j03J15Q3K1k16N5J77j48P1N1n7l72M00K08k67o3K23n8n
5932E9m7L35l30O0jk13L64k41R7Q8j41m26O32l69J38L3k3L30k86L9L3k37J22p2
$$ y = [119, 46, -185, 143, 98, -140, -16, -233, -144, -3, 71, 19, 303, -288, 56, -190, -56, 149, -28, -53, 185, -15, 240, -154, -222, -50, 53, -131, 43, -25, -63, 126, -20, 189, -83, 45, -151, 66, -33, -366, 162, 176, -150, 33, 301, 26, 188, 103, -134, -208, 170, -68, -80, -161, 269, -17, 104, 325, 26, 193, -41, -72, 151, 121, -265, 59, 141, 28, -366, -22, 160, 142, -172, -95, -225, -2, 27, 31, 24, -87, -352, 21, 3, 76, 70, -94, -324, 260, 179, 142, -211, -35, -311, -306, 105, 141, 177, 15, -27, -28, -24, -157, 3, 62, 362, 233, 87, 107, 88, 112, -101, 129, 23, -107, 114, -10, -127, -45, -245, 10, -250, -117, 57, -208, -137, -153, 236, 92, 223, 72, 54, 81, -100, -75, -24, 49, 249, 55, 88, -56, -26, 235, -56, -159, -44, 39, 60, -156, -101, 76, -72, -1, 50, -7, -379, 21, 229, -38, -101, 122, 64, 59, 12, 347, 17, 77, 76, -137, 227, -14, 83, 171, 30, -396, 236, -133, 5, 38, 15, 345, 59, 98, 131, -106, 16, -56]
5956e6J95j91P6L22k98j0q2m5J47L7j17q9K19L4l14J12J45J14j73o9J21k04M33
5979C07k85N7kk19J00J6j21j24L37j10n7q7J30k0P2K5k14K43j33J49N7r7l8L2
6003A8n3L69k35k62J97j96K8K17o0J0j84Q2K14K9k87K09j13J77Rl52J57r6K93
6026A71j48MJ10j77K15r2p2J91l36j9L79j29j9j17J8j25J00j67L8j1N1L41m98
6049b92K98j26K2j01J13L1J3K97m08K20o7O5k79K06K69m37J75j10M1J34M7k4j51
6072f4j06L1J78J25m6j73j0J26J75m20O3m8j00K07K81m95J66K70j63q6O3j5k95
$$ y = [-56, 139, -52, 24, 346, 48, 38, -44, -89, 58, 95, -22, -111, 108, 142, -172, -60, 85, 199, 26, -43, 78, -126, 307, 22, 79, 77, -142, -42, -26, -147, -271, 66, -44, -101, -188, -58, -78, -6, 19, -195, 48, -85, 64, 121, 24, -14, 18, -35, 334, 99, -163, 34, -162, -134, 83, 23, 33, -151, -69, 145, 174, -113, 96, -17, 160, 169, -183, -26, -122, 171, 23, 27, 137, -40, 175, 83, 11, 202, -134, -153, 226, 97, 78, -39, -21, -146, -46, -213, -175, -186, -135, 206, -292, 6, -120, -98, -199, -86, -55, -42, 255, -153, 67, 0, 65, -214, -8, 261, -176, -1, -111, -70, 64, 111, 87, -64, -170, -139, 39, 164, 118, -55, -65, 61, 236, -184, -121, -169, -269, -62, 219, -276, -110, 160, -3, -89, -26, -41, -336]
$$ [...]
8191A15
##END NTUPLES=NMR FID
##END=
