##TITLE=1H_SR-157-K3-TFAA4
 CDCl3
 8 sc, 
 7.7.2023
##JCAMPDX= 6.0         $$ Bruker NMR JCAMP-DX V2.0
##DATA TYPE= NMR FID
##DATA CLASS= NTUPLES
##ORIGIN= UXNMR, Bruker Analytische Messtechnik GmbH
##OWNER= root
$$ XWIN-NMR		Version 3.5
$$ Fri Jul  7 16:22:38 2023 Russian Standard Time (UT+4h)  she@DPX200
##.OBSERVE FREQUENCY= 200.13135
##.OBSERVE NUCLEUS= ^1H
##.DELAY= (6, 6)
##.ACQUISITION MODE= SIMULTANEOUS
##.ACQUISITION SCHEME= undefined
##.AVERAGES= 8
##.DIGITISER RES= 18
##SPECTROMETER/DATA SYSTEM= spect
##.PULSE SEQUENCE= zg30
##.SOLVENT NAME= CDCl3
##.SHIFT REFERENCE= (INTERNAL, CDCl3, 0, 15.7039)
##AUDIT TRAIL= $$ (NUMBER, WHEN, WHO, WHERE, WHAT)
$$ ##TITLE= Audit trail, XWIN-NMR		Version 3.5
$$ ##JCAMPDX= 5.01
$$ ##ORIGIN= Bruker BioSpin GmbH
$$ ##OWNER= she
$$ F:/spectra/data/she/nmr/H-F/1/audita.txt
$$ ##AUDIT TRAIL=  $$ (NUMBER, WHEN, WHO, WHERE, WHAT)
(   1,<2023-07-07 16:20:57.87 +0400>,<she>,<DPX200>,
      <created by zg, POWCHK disabled, PULCHK disabled
       configuration hash MD5:
       00 E9 B6 7A A2 85 ED C7 34 08 36 98 17 FE 4E 26
       data hash MD5: 16K
       CF F8 87 D3 07 4C 76 06 F4 09 19 35 C3 08 42 DA>)
$$ ##END=
$$ 
$$ hash MD5
$$ F6 4A AE 4D A8 19 90 E6 C4 FB 95 3B E3 DE C2 14
##$RELAX= 
##$RELAX= 
##$RELAX= 
##$RELAX= 
##$RELAX= 
##$RELAX= 
$$ Bruker specific parameters
$$ --------------------------
##$DU= <F:/spectra>
##$EXPNO= 1
##$NAME= <H-F>
##$PROCNO= 1
##$TYPE= <nmr>
##$USER= <she>
##$AMP= (0..31)
100 100 100 100 100 100 100 100 100 100 100 100 100 100 100 100 100 100 
100 100 100 100 100 100 100 100 100 100 100 100 100 100 
##$AQSEQ= 0
##$AQ_mod= 1
##$AUNM= <au_zg>
##$AUTOPOS= <>
##$BF1= 200.13
##$BF2= 200.13
##$BF3= 200.13
##$BF4= 200.13
##$BF5= 200.13
##$BF6= 200.13
##$BF7= 200.13
##$BF8= 200.13
##$BYTORDA= 1
##$CFDGTYP= 0
##$CFRGTYP= 5
##$CHEMSTR= <none>
##$CNST= (0..31)
1 1 145 1 1 1 1 1 1 1 1 1 1 1 1 1 1 1 1 1 1 1 1 1 1 1 1 1 1 1 1 1 
##$CPDPRG= <>
##$CPDPRG1= <>
##$CPDPRG2= <>
##$CPDPRG3= <>
##$CPDPRG4= <mlev>
##$CPDPRG5= <mlev>
##$CPDPRG6= <mlev>
##$CPDPRG7= <mlev>
##$CPDPRG8= <mlev>
##$CPDPRGB= <>
##$CPDPRGT= <>
##$D= (0..31)
0 1.2 0 0 0 0 0 0 0 0.06 0 0.03 0 0 0 0 0.0002 0 0 0 0 0 0 0 0 0 0 0 0 
0 0 0 
##$DATE= 1688732457
##$DBL= (0..7)
120 120 120 120 120 120 120 120 
##$DBP= (0..7)
150 150 150 150 150 150 150 150 
##$DBP07= 0
##$DBPNAM0= <>
##$DBPNAM1= <>
##$DBPNAM2= <>
##$DBPNAM3= <>
##$DBPNAM4= <>
##$DBPNAM5= <>
##$DBPNAM6= <>
##$DBPNAM7= <>
##$DBPOAL= (0..7)
0.5 0.5 0.5 0.5 0.5 0.5 0.5 0.5 
##$DBPOFFS= (0..7)
0 0 0 0 0 0 0 0 
##$DE= 6
##$DECBNUC= <off>
##$DECIM= 32
##$DECNUC= <off>
##$DECSTAT= 4
##$DIGMOD= 1
##$DIGTYP= 9
##$DL= (0..7)
0 120 120 120 120 120 120 120 
##$DP= (0..7)
150 150 150 150 150 150 150 150 
##$DP07= 0
##$DPNAME0= <>
##$DPNAME1= <>
##$DPNAME2= <>
##$DPNAME3= <>
##$DPNAME4= <>
##$DPNAME5= <>
##$DPNAME6= <>
##$DPNAME7= <>
##$DPOAL= (0..7)
0.5 0.5 0.5 0.5 0.5 0.5 0.5 0.5 
##$DPOFFS= (0..7)
0 0 0 0 0 0 0 0 
##$DQDMODE= 0
##$DR= 18
##$DS= 0
##$DSLIST= <SSSSSSSSSSSSSSS>
$$ [...]
##$SUBNAM2= <"">
##$SUBNAM3= <"">
##$SUBNAM4= <"">
##$SUBNAM5= <"">
##$SUBNAM6= <"">
##$SUBNAM7= <"">
##$SUBNAM8= <"">
##$SUBNAM9= <"">
##$SW= 18.05172834244
##$SWIBOX= (0..15)
0 0 2 0 0 0 0 0 0 0 0 0 0 0 0 0 
##$SW_h= 3612.71676300578
##$TD= 16384
##$TD0= 1
##$TE= 0
##$TE2= 300
##$TE3= 300
##$TEG= 300
##$TL= (0..7)
0 120 120 120 120 120 120 120 
##$TP= (0..7)
150 150 150 150 150 150 150 150 
##$TP07= 0
##$TPNAME0= <>
##$TPNAME1= <>
##$TPNAME2= <>
##$TPNAME3= <>
##$TPNAME4= <>
##$TPNAME5= <>
##$TPNAME6= <>
##$TPNAME7= <>
##$TPOAL= (0..7)
0.5 0.5 0.5 0.5 0.5 0.5 0.5 0.5 
##$TPOFFS= (0..7)
0 0 0 0 0 0 0 0 
##$TUNHIN= 0
##$TUNHOUT= 0
##$TUNXOUT= 0
##$USERA1= <user>
##$USERA2= <user>
##$USERA3= <user>
##$USERA4= <user>
##$USERA5= <user>
##$V9= 5
##$VALIST= <valist>
##$VCLIST= <CCCCCCCCCCCCCCC>
##$VD= 0
##$VDLIST= <DDDDDDDDDDDDDDD>
##$VPLIST= <PPPPPPPPPPPPPPP>
##$VTLIST= <TTTTTTTTTTTTTTT>
##$WBST= 1024
##$WBSW= 4
##$XGAIN= (0..3)
0 0 0 0 
##$XL= 0
##$YL= 0
##$YMAX_a= 266930
##$YMIN_a= -312447
##$ZGOPTNS= <>
##$ZL1= 120
##$ZL2= 120
##$ZL3= 120
##$ZL4= 120
##$ABSF1= 10
##$ABSF2= 0
##$ABSG= 5
##$ABSL= 3
##$ALPHA= 0
##$AQORDER= 0
##$ASSFAC= 0
##$ASSFACI= 0
##$ASSFACX= 0
##$ASSWID= 0
##$AUNMP= <proc_1d>
##$AZFE= 0.1
##$AZFW= 0.1
##$BCFW= 1
##$BC_mod= 2
##$BYTORDP= 1
##$COROFFS= 0
##$CY= 11.3945322036743
##$DATMOD= 1
##$DC= 2
##$DFILT= <>
##$DTYPP= 0
##$F1P= 15.7292609196834
##$F2P= 12.9074282941183
##$FCOR= 0.5
##$FTSIZE= 0
##$FT_mod= 4
##$GAMMA= 1
##$GB= 0.15
##$INTBC= 1
##$INTSCL= 1
##$ISEN= 128
##$LB= 0.24
##$LEV0= 0
##$LPBIN= 0
##$MAXI= 10000
##$MC2= 0
##$MEAN= 0
##$ME_mod= 0
##$MI= 1.114404
##$NCOEF= 0
##$NC_proc= 0
##$NLEV= 6
##$NOISF1= 3.799351
##$NOISF2= 2.8
##$NSP= 1
##$NTH_PI= 0
##$NZP= 0
##$OFFSET= 15.70392
##$PC= 1
##$PHC0= -20991.82
##$PHC1= 12.65272
##$PH_mod= 1
##$PKNL= yes
##$PPARMOD= 0
##$PSCAL= 0
##$PSIGN= 0
##$REVERSE= no
##$SF= 200.130013532006
##$SI= 16384
##$SIGF1= 3
##$SIGF2= 2
##$SINO= 400
##$SIOLD= 16384
##$SREGLST= <1H.CDCl3>
##$SSB= 0
##$STSI= 0
##$STSR= 0
##$SW_p= 3612.71676300578
##$SYMM= 0
##$S_DEV= 0
##$TDeff= 0
##$TDoff= 0
##$TI= <>
##$TILT= no
##$TM1= 0
##$TM2= 0
##$TOPLEV= 0
##$USERP1= <user>
##$USERP2= <user>
##$USERP3= <user>
##$USERP4= <user>
##$USERP5= <user>
##$WDW= 1
##$XDIM= 8192
##$YMAX_p= 0
##$YMIN_p= 0
$$ End of Bruker specific parameters
$$ ---------------------------------
##NTUPLES= NMR FID
##VAR_NAME=  TIME,          FID/REAL,        FID/IMAG
##SYMBOL=    X,             R,               I
##VAR_TYPE=  INDEPENDENT,   DEPENDENT,       DEPENDENT
##VAR_FORM=  AFFN,          ASDF,            ASDF
##VAR_DIM=   8192,          8192,            8192
##UNITS=     SECONDS,       ARBITRARY UNITS, ARBITRARY UNITS
##FACTOR=    0.0002768,     1,               1
##FIRST=     0,             0,               0
##LAST=      2.2672688,     0,               0
##MIN=       0,             -312447,         0
##MAX=       2.2672688,     266930,          0
$$ Real data points
##PAGE= N=1
##DATA TABLE= (X++(R..R)), XYDATA
$$ [...]
$$ plain form
1485 -341 86 -565 -420 278 -237 -294 431 278 138 451 576 38 417 769 23 137 332 -143 -270 58
1505 58 -603 -607 -67 -200 -558 42 21 -93 -38 -173 -462 -136 96 -322 -25 240 165 301 848 315 315 344 12
1528 12 -416 -243 -242 -531 -320 164 -207 135 289 43 5 -221 -332 -320 -42 -153 -135 321 554 504 422 212 283
1551 283 -234 -611 -262 -323 -549 -186 10 -170 68 105 -432 53 210 -621 -410 64 71 4 573 548 336 785
1573 785 489 -337 12 121 -756 -173 117 -353 -158 376 -275 -54 234 -801 -746 -184 -566 -598 154 357
1593 357 117 693 765 223 721 486 -449 0 421 -221 -148 479 305 250 441 3 -361 1 -566 -1332 -477
1614 -477 -243 -780 -98 275 21 414 396 -29 130 343 -321 -142 421 227 178 409 438 426 507 204 -116 -75
1636 -75 -145 -749 -408 -14 -210 -209 151 -100 -83 61 -214 -365 152 -45 -201 -7 335 298 288 210 127 204 56
$$ packed form
1485c41M27o51J45O98n15n7P25j53j40L13J25n38L79L52p46J14J95m75j27L28
1505E8o61mN40j33l58O00k1j14N5j35k89L26K32m18K97K65p5J36N47n33%K9l32
1528A2m28J73Jk89K11M84l71L42J54k46l8k26j11J2K78j11J8M56K33n0q2k10P1
1551B83n17l77L49o1k26L63J96j80K38L7n37M85J57q31K11M74Po7N69k5k12M49
1573G85k96q26L49J09q77N83K90m70J95N34o51K21K88j035N5N62l82l2P52K03
1593C57k40N76P2n42M98k35r35M49M21o42P3O27j74n5J91m38l64L62n67p66Q55
1614d77K34n37O82L73k54L93j8m25J59K13o64J79N63j94m9K31K9j2Q1l03l20M1
1636g5p0o04L41L94j96JL60k51J7J44k75j51N17j97j56J94L42l7j0p8q3P7j48
$$ plain form
1659 56 -472 25 218 28 -215 -126 100 200 -105 -296 -230 107 -126 -203 21 326 217 313 102 183 244 -267
1681 -267 -310 -173 -129 -204 -175 286 363 90 -41 -63 44 -64 -382 -278 76 -158 44 269 340 400 502 263 128
1704 128 382 -64 -482 -309 172 -379 -36 235 89 75 340 -405 -337 196 -558 -640 45 -36 -55 458 296 180
1726 180 473 423 -167 174 285 -326 -181 -8 -209 -164 402 30 -200 150 -38 -494 40 -107 -540 -241 158
1747 158 -24 -57 293 277 37 312 -103 -9 201 153 -241 39 111 -143 87 238 -123 -65 137 -203 -115 138
1769 138 -128 -241 220 86 -119 2 35 -20 -25 287 108 -160 153 -8 54 -143 -52 -306 -102 -122 -211 -27 170
1792 170 -67 157 441 -31 -105 223 75 -77 150 86 -19 249 377 136 17 103 -152 -239 -181 -513 -263 -264
1814 -264 -148 -208 107 271 -28 67 17 110 19 181 79 137 497 308 149 472 208 17 160 13 -163 -232
$$ packed form
1659E6n28M97J93j90k43Q9K26J00l05j91O6L37k33p7K24L05j09R6k11Q1O1n11
1681b67m3J37M4p5K9M61P7k73j31k2J07j08l18J04L54k34K02K25P1O0J02k39j35
1704A28K54m46m18J73M81n51L43K71j46j4K65p45O8N33p54q2O85q1j9N13j62j16
1726A80K93n0n90L41J11o11J45J73k01M5N66l72k30L50j88m56N34j47m33K99L99
1747A58j82l3L50j6k40K75m15R4K10m8l94K80P2k54K30J51l61N8K02l40Q8K53
1769A38k66j13M61j34k05J21L3n5nL12j79k68L13j61O2j97R1k54K04k0q9J84J97
1792A70k37K24K84m72p4L28j48j52K27o4j05K68J28k41j19Q6k55q7N8l32K50j
1814b64J16o0L15J64k99R5n0R3r1J62j02N8L60j89j59L23k64j91J43j47j76o9
$$ plain form
1836 -232 -102 -413 -297 -98 -490 -399 -147 -390 -424 -91 -279 -218 135 228 202 494 462 258 281 506 85 86 92 -71
1860 -71 -14 204 32 -211 -129 -181 -178 -309 -545 -485 -24 -287 -192 120 467 130 231 219 219 238 389 112 294 451
1884 451 154 5 153 289 133 -162 -192 -131 -436 -531 -500 -169 -313 -272 -226 -105 73 271 17 195 474 325
1906 325 164 171 289 183 98 165 70 161 94 -294 -393 -266 -301 -586 -306 -207 -324 -149 -186 -122 98 324 89 348
1930 348 466 219 308 317 303 94 83 4 15 112 63 -363 -54 -162 -374 -747 -485 -437 -355 -244 -452 -18 208 334
1954 334 99 375 351 395 367 422 350 322 257 106 175 195 -73 -29 12 -238 -524 -597 -464 -381 -365 -276 -465 -235 115
1979 115 52 -25 326 384 320 438 508 265 320 365 -6 326 285 -22 -356 -65 -141 -480 -542 -454 -264 -445 -373 -551
2003 -551 -316 -87 -217 -146 93 236 165 338 613 173 311 439 268 327 370 -11 -74 403 -37 -533 -72 -278
$$ packed form
1836b32J30l11J16J99l92R1K52k43l4L33j88O1L53R3k6K92l2k04K3K25m21JOj63
1860g1N7K18j72k43Q2n2Lj31k36O0M61k63R5L12L47l37J01j2%J9J51k77J82J57
1884D51k97j49J48J36j56k95l0O1l05r5L1L31j44M1M6J21J78J98k54J78K79j49
1906C25j61PJ18j06q5O7r5R1o7l88r9J27l5k85K80R9j17J75l7O4K20K26k35K59
1930C48J18k47Q9Rj4k09j1p9J1R7m9m26L09j08k12l73K62M8Q2J11k08M34K26J26
1954C34k35K76k4M4k8N5p2k8o5j51O9K0k68M4M1k50k86p3J33Q3J6Q9j89K30L50
1979A15o3p7L51N8o4J18P0k43N5M5l71L32m1l07l34K91p6l39o2Q8J90j81P2j78
2003e51K35K29j30P1K39J43p1J73K75m40J38J28j71N9M3l81o3M77m40m96M61k06
$$ plain form
2025 -278 -324 -506 -189 -519 -280 -108 -476 -355 199 22 -59 305 182 -43 339 416 -26 248 401 -42 99
2046 99 229 -156 -235 -179 -421 -446 -365 -428 -486 -75 -170 -118 163 140 66 301 229 201 108 293 39 25 362 283 22
2071 22 76 45 -201 -4 -35 -331 -173 -232 -384 -210 49 -265 -26 67 48 39 353 153 238 279 325 176 391 440
2095 440 210 222 133 -204 -49 -141 -217 -222 -201 -231 -324 -228 -63 -89 -116 75 -108 -45 132 209 98 349 358 509 360
2120 360 389 55 86 144 -62 -134 31 -66 -233 -240 -160 -247 -96 -289 -209 -201 -275 -214 -52 122 262 121 218 192 267 314
2146 314 17 154 178 145 131 157 182 123 14 16 -79 -272 -100 -341 -234 -216 -214 -116 -75 5 -8 253 83 235 93
2171 93 6 204 418 95 82 5 242 277 -93 11 -44 46 12 -12 1 -167 -111 -180 31 -17 -228 -77 75 101 64
2196 64 -92 49 -40 -16 117 -74 133 183 12 -133 -33 257 26 57 105 69 -38 -13 -57 -96 221 -190 -116 141
$$ packed form
2025b78m6j82L17l30K39J72l68J21N54j77q1L64j23k25L82P7m42K74J53m43J41
2046I9J30l85p9N6k42k5Q1o3n8M11r5N2K81k3p4K35p2k8r3J85k54j4L37p9k61
2071B2N4l1k46J97l1k96J58n9j52J74K59l14K39R3j9rL14k00Q5M1M6j49K15M9
2095D40k30J2q9l37J55r2p6nK1l0r3R6J65k6k7J91j83O3J77P7j11K51RJ51j49
2120C60K9l34L1N8k06p2J65r7j67pQ0q7J51j93Q0Qp4O1J62J74J40j41R7k6P5M7
2146C14k97J37K4l3j4K6K5n9j09Kr5j93J72k41J07J8KR8M1Q0j3K61j70J52j42
2171I3q7J98K14l23j3p7K37L5l70J04n5R0l4k4J3j68N6o9K11m8k11J51J52K6l7
2196F4j56J41q9K4J33j91K07N0j71j45J00K90k31L1M8l6j07K5m4l9L17m11P4K57
$$ plain form
2220 141 -14 -43 -82 47 211 131 -95 0 8 116 -47 -92 42 31 105 -115 -12 -92 -55 86 -52 130 -4 34
2244 34 -9 12 193 206 171 -43 -24 179 -147 -22 -39 -72 -254 -95 -108 30 142 68 -5 112 63 -39 4 53 106
2269 106 -38 -71 69 230 61 96 -31 109 42 -134 21 92 -171 -172 -7 -91 40 -108 -107 -218 110 -66 -100
2292 -100 49 -11 -105 -51 83 43 -91 78 22 147 11 69 -236 -36 -57 94 -160 -107 47 -170 64 -26 183
2315 183 62 125 -62 22 78 -27 -74 154 5 -1 -115 -56 -166 154 99 -42 -178 -28 -224 -302 -146 81 17
2338 17 -45 180 43 272 -60 40 253 50 47 -111 10 133 83 -115 29 73 -62 -16 -24 -124 -315 -235 -153 -82
2362 -82 -210 -149 77 -94 56 118 -32 200 112 40 246 103 129 132 145 -3 -30 23 -92 -98 -210 -118 -178 7 -124
2387 -124 -135 -107 -67 29 -180 -189 58 -47 76 80 127 86 245 220 239 117 116 34 0 56 7 -111 -95 79 -195 -205 -21
$$ packed form
2220A41j55k9l9J29J64q0k26R5QJ08j63m5J34j1P4k20J03q0L7J41j38J82j34L8
2244C4m3K1J81J3l5k14J9K03l26J25j7l3j82J59j3J38J12p4p3J17m9j02M3M9N3
2269A06j44l3J40J61j69L5j27J40o7j76J55P1k63jJ65q4J31j48Jj11L28j76l4
2292a00J49o0r4N4J34m0j34J69n6J25j36N8l05K00k1J51k54N3J54k17K34r0K09
2315A83j21O3j87Q4N6j05m7K28j49oj14N9j10L20n5j41j36J50j96p8J56K27o4
2338A7o2K25j37K29l32J00K13k03lj58J21J23n0j98J44M4j35M6qj00j91Q0Q2P1
2362h2j28O1K26j71J50O2j50K32q8p2K06j43K6LJ3j48k7N3j15oj12R2o0J85j31
2387a24j1K8M0R6k09rK47j05J23MM7m1J59k5J9j22jq2l4N6m9j18J6J74k74j0J84
$$ plain form
2414 -21 -46 -94 -79 -60 37 131 -41 201 90 186 -76 9 -37 -7 -142 -51 -43 -165 63 94 4 16 78 -85 -80 -98 -50
2441 -50 95 -14 74 5 -61 19 207 89 131 31 6 3 137 83 -87 -275 -98 -57 -213 -12 -2 -118 82 -182
2465 -182 -86 -131 -65 -71 1 21 52 108 110 -82 24 80 119 178 86 -13 101 -118 -58 -24 106 22 -206 -142 -132 13 -9
2492 -9 -104 -228 -175 13 33 59 177 -29 47 334 159 64 99 144 158 -216 -41 26 23 -40 -43 -129 -149 141 -142 -195 -258
2519 -258 -114 -157 -156 -54 -16 -85 -125 153 9 -121 173 1 -67 174 167 208 138 117 -163 183 214 0 65 -109 56
2544 56 -75 112 -113 -32 118 -102 -45 2 -136 -116 -37 -17 -75 67 68 -78 -2 -31 107 61 109 95 -24 156 39
2569 39 -104 86 160 -56 -33 84 -41 107 -168 -20 -12 98 59 -114 10 88 -182 23 -32 0 -134 -101 -72 17
2593 17 119 86 -84 -49 163 -42 69 4 -79 104 11 -85 14 -1 25 -9 40 -28 -121 -17 -62 6 -150 19 18 -63
$$ packed form
2414b1k5m8J5J9R7R4j72K42j11R6k62Q5m6L0j35R1Qj22K28L1r0J2O2j63Nj8M8
2441e0J45j09Q8o9o6Q0J88j18M2j00k5lJ34n4j70j88J77M1j56K01J0j16K00k64
2465a82R6m5O6oP2K0L1N6Kj92J06N6L9N9r2r9J14k19O0L4J30q4k28O4J0J45k2
2492ir5j24N3J88K0K6J18k06P6K87j75r5L5M5J4l74J75O7lo3lq6k0K90k83n3o3
2519b58J44m3JJ02L8o9m0K78j44j30K94j72o8K41pM1p0k1k80L46L1k14O5j74J65
2544E6j31J87k25Q1J50k20N7M7j38K0P9K0n8J42Jj46P6k9J38m6M8j4j19J80j17
2569C9j43J90P4k16K3J17j25J48k75J48QJ10l9j73J24P8k70K05n5L2j34L3K9Q9
2593A7J02l3j70L5K12k05J11o5q3J83r3r6R9j5K6l4M9o8r3J04m5O8j56J69jq1
$$ plain form
2619 -63 74 -208 -166 34 -167 92 -77 82 -84 85 60 -133 -5 49 -115 95 -118 50 56 83 37 -155 8
2642 8 -153 -100 39 -143 -271 -108 12 -38 40 18 80 23 93 -102 -107 11 82 -39 35 128 52 -164 -11 -44 94
2667 94 -63 136 -67 -59 -58 -96 -112 -107 -31 -79 60 48 102 -39 38 79 120 47 21 -30 -112 -125 68 154 -9 142 -91
2694 -91 -59 -111 82 -62 -194 169 0 184 175 64 -82 68 17 -19 367 -36 -59 23 139 67 -127 71 -222
2717 -222 75 27 -41 -207 -114 24 -111 0 -135 3 86 -6 187 130 152 8 -29 273 27 -66 196 36 -64
2740 -64 -119 -9 -38 -112 -193 -64 -71 -93 -98 -71 -52 96 21 -73 -17 22 -13 119 -82 191 92 79 184 142 95 -71 153
2767 153 -89 -68 -152 -64 -175 74 42 39 -49 16 -239 -184 78 59 -29 -6 70 -73 12 2 122 -63 -53 -27 151 -29
2793 -29 -136 -93 97 -70 -31 103 41 -114 -20 -11 -156 -86 84 77 -35 103 77 111 68 -128 -52 24 21 -101 -107 -38 -119
$$ packed form
2619f3J37k82M2K00k01K59j69J59j66J69k5j93J28N4j64K10k13J68OK7m6j92J63
2642Hj61N3J39j82j28J63J20n0P8k2O2n7P0j95nJ18P1j21P4R3p6k16J53l3J38
2667I4j57J99k03QJl8j6NP6m8J39j2N4j41P7M1M1p3k6n1q2j3J93Q6j63J51k33
2694i1L2n2J93j44j32L63j69J84rj11j46J50n1l6L86m03k3Q2J16p2j94J98k93
2717b22K97m8o8j66R3J38j35J11j35J38Q3r2J93n7K2j44l7L02k46r3K62j60j00
2740f4n5J10k9p4q1J29pk2nK7J9J48p5r4N6L9l5J32k01K73r9j3J05m2m7j66K24
2767A53k42K1q4Q8j11K49l2lq8O5k55N5K62j9q8K3P6j43Q5j0J20j85J0K6J78j80
2793b9j07M3J90j67L9J34o2j55R4Rj45P0J70pj12J38k6L4m3j96P6P6lj22oO9q1
$$ plain form
2820 -119 -71 -116 50 -195 40 38 -31 -53 -9 208 26 73 -108 2 121 130 137 81 -60 121 8 12 -103 -30 -73 119
2846 119 -58 -156 -37 -131 56 -181 -53 18 37 7 78 -53 -105 60 71 197 251 202 61 42 35 104 -51 -98 -70
2871 -70 -40 -137 41 -95 -59 4 -118 18 -108 -10 25 -82 -65 134 167 105 287 68 -63 177 33 -93 -40 -68
2895 -68 73 65 19 -277 35 -48 -89 -140 25 -163 -10 -167 -118 56 -28 -103 -80 84 101 310 42 133 70 26 -141
2920 -141 140 52 147 130 -16 -163 -18 -51 2 38 138 -129 4 -136 77 98 16 51 39 85 -194 130 -25 67
2944 67 32 -26 89 74 -131 50 -26 29 -6 -97 -131 -10 -58 71 -99 130 94 85 -147 53 -39 -82 116 124 -54 147
2970 147 126 -53 -8 2 146 -79 34 -245 71 -148 -149 56 102 27 83 -50 -172 126 18 -66 81 247 -31
2993 -31 77 169 -81 44 175 -172 -126 64 -164 -15 -96 -88 4 -216 -76 -102 -39 -103 90 59 151 50 -86 166
$$ packed form
2820a19M8m5J66k45K35ko9k2M4K17j82M7j81J10J19RPn6j41J81j13Mj15P3m3J92
2846A19j77r8J19r4J87k37J28P1J9l0P1j31n2J65J1J26N4m9j41j9pO9j55m7K8
2871g0L0r7J78j36L6O3j22J36j26R8L5j07J7J99L3o2J82k19j31K40j44j26N3k8
2895f8J41qm6k96L12q3m1n1J65j88J53j57M9J74q4p5K3J64J7K09k68R1o3m4j67
2920a41K81q8R5j7j46j47J45l3N3L6J00k67J33j40K13K1q2L5j2M6k79L24j55R2
2944F7l5n8J15j5k05J81p6N5l5r1l4J21m8J29j70K29l6rk32K00r2m3J98Qj78K01
2970A47k1j79M5J0J44k25J13k79L16k19jK05M6p5N6j33j22K98j08q4J47J66k78
2993c1J08R2k50J25J31l47M6J90k28J49q1QR2k20J40k6O3o4J93l1R2j01j36K52
$$ plain form
3017 166 45 187 16 198 56 64 69 107 38 53 2 5 -65 55 55 -198 -93 -51 -47 -298 22 -1 56 -47 104 77
3043 77 -195 47 42 30 144 -97 -42 56 9 6 -154 21 -7 -83 124 -38 69 -106 -179 -68 58 -129 -18 -11 -10
3068 -10 132 -53 -21 126 -5 116 -17 -86 -10 28 22 -58 -20 -126 -331 144 5 -31 -27 -4 76 49 -72 -9 1 -25
3094 -25 80 -29 110 120 -116 170 27 -104 19 44 -151 -78 -79 -155 -76 -48 -76 -62 -67 63 106 -5 -13 13 168 -17
3120 -17 43 161 -18 8 9 31 -50 26 25 -89 -2 6 -53 -118 20 -106 -60 -21 -46 -98 18 -47 -68 5 -15 72 34 170
3148 170 -82 130 233 147 56 64 8 -117 -44 -8 42 -75 -150 49 -58 -103 -14 -73 58 -99 58 39 -8 -8 69 27
3174 27 117 157 37 -160 37 -86 -115 -8 -69 131 -35 -122 -51 -66 -101 66 -1 79 -35 -55 -30 61 65 103 190 147
3200 147 106 -134 -42 123 -83 -122 -110 161 232 -110 -35 -41 77 38 -142 -55 -66 -88 21 120 153 61 40 99 88 162
$$ packed form
3017A66j21J42j71J82j42QNL8o9J5n1Lp0J20%k53J05M2Mk51L20k3N7j03J51k7
3043G7k72K42nj2J14k41N5R8m7lj60J75k8p6K07j62J07j75p3J11J26j87J11PJ
3068a0J42j85L2J47j31J21j33o9P6L8oq0L8j06k05M75j39l6MK3Q0k7j21O3J0k6
3094b5J05j09J39J0k36K86j43j31J23K5j95P3jp6P9K8k8J4nJ30M3j11qK6J55j85
3120a7O0J18j79K6JK2q1P6jj14Q7Qn9o5J38j26M6L9k5n2J16o5k1P3k0Q7l8J36
3148A70k52K12J03q6r1Qn6j25P3L6N0j17p5J99j07m5Q9n9J31j57J57j9m7%P7m2
3174B7R0M0j20j97J97j23k9J07o1K00j66q7P1j5l5J67o7Q0j14k0K5R1ML8Q7m3
3200A47m1k40R2J65k06l9J2K71P1l42P5oJ18l9j80Q7j1k2J09R9L3r2k1N9j1P4
$$ plain form
3226 162 27 -64 63 -104 132 21 26 1 -41 -178 -222 24 -132 9 -100 -144 102 31 140 178 200 125 -12 39
3250 39 136 99 122 -43 -113 9 -80 -72 -29 -134 35 -275 -96 -156 159 -41 -60 16 75 -15 -58 252 131 65 -42
3275 -42 64 -42 54 -51 75 -48 -113 31 -22 -23 -102 30 4 19 -79 -45 -134 -148 -115 -101 49 54 -4 -155 -269 -43
3301 -43 10 13 52 -34 74 59 192 60 102 78 11 107 -1 63 9 18 -66 -104 4 -112 -116 64 -43 -81 90 -82 -67
3328 -67 139 32 49 57 52 92 -31 158 23 -20 1 -118 -116 -44 -111 152 -167 -3 114 -18 -80 28 149 -36 54
3353 54 -9 -126 15 -109 50 3 -224 78 10 259 -186 -48 -139 66 44 -241 -13 -135 38 129 64 -75 94
3376 94 180 -118 -57 -6 118 -48 57 20 -72 132 -110 -19 -72 7 -100 10 -22 -45 105 -174 152 57 0 87 18
3401 18 162 96 12 -50 -85 4 74 51 172 32 66 101 159 -75 -118 63 -175 -10 96 -121 113 -54 -48 82 33
$$ packed form
3226A62j35r1J27j67K36j11Nk5m2j37m4K46j56J41j09m4K46p1J09L8K2p5j37N1
3250C9R7l7K3j65p0J22q9QM3j05J69l10J79o0L15k00j9P6N9r0m3L10j21o6j07
3275d2J06j06R6j05J26j23o5J44n3jp9J32k6J5r8L4q9j4L3J4J50Nn8j51j14K26
3301d3N3LL9q6J08j5J33j32M2k4o7R6j08O4n4Rq4l8J08j16mJ80j07l8J71j72J5
3328f7K06j07J7QnM0j23J89j35m3K1j19KP2o7K63l19J64J17j32o2J08J21j85R0
3353E4o3j17J41j24J59m7k27L02o8K49m45J38r1K05k2k85K28j22J73R1o5j39J69
3376I4Q6k98O1N1J24j66J05l7r2K04k42R1n3P9j07J10l2k3J50k79L26r5n7Q7o9
3401A8J44o6q4o2l5Q9P0k3J21j40L4L5N8k34m3J81k38J65J06k17K34j67OJ30m9
$$ plain form
3426 33 -194 75 60 47 7 -34 38 -87 -147 58 78 5 -17 7 47 -4 83 6 -96 -57 -5 26 65 -48 -99 -22 72
3453 72 46 86 -24 34 35 -117 118 -84 -16 166 82 -192 112 123 -93 175 -4 148 59 -187 -138 -88 10 134
3477 134 -54 203 14 -111 95 -37 142 -90 -135 105 -52 4 9 144 -78 -5 -144 -40 -92 -95 -10 -24 36 62
3501 62 -75 110 97 -43 -73 -3 155 98 -170 -23 78 -129 15 -105 41 -12 -136 -155 11 49 177 -171 -60
3524 -60 -75 24 -74 20 17 74 103 24 -26 -9 -12 57 16 97 123 -81 9 58 2 101 -99 23 -160 -150 -7 48 -87 -110
3552 -110 14 -6 -46 62 -49 126 -133 54 186 71 -16 93 176 42 117 115 43 -82 9 -109 30 -81 -58
3575 -58 11 -54 0 -59 28 68 -36 -129 -50 -20 106 72 -40 -27 2 -80 -112 135 1 16 -80 -115 -14 152 -82 -159
3601 -159 -136 135 -59 117 5 -82 106 -31 -115 56 -44 36 142 53 178 -38 -72 115 -170 -97 52 21 1
$$ packed form
3426C3k27K69j5j3m0m1P2j25o0K05K0p3k2K4M0n1Q7p7j02L9N2L1L9j13n1P7R4
3453G2k6M0j10N8Jj52K35k02O8J82q4k74L04J1k16K68j79J52q9k46M9N0R8J24
3477A34j88K57j89j25K06j32J79k32m5K40j57N6NJ35k22P3j39J04n2lQ5j4O0K6
3501F2j37J85j3j40l0P0J58n7k68J47J01k07J44j20J46n3j24j9J66L8J28l48J11
3524f0j5R9r8R4lN7K9p9n0J7lO9m1Q1K6k04R0M9n6R9k00J22j83J0J43N5j35k3
3552a10J24k0m0J08j11J75k59J87J32j15q7J09Q3j34P5kp2j25R1j18J39j11K3
3575e8O9o5N4n9Q7M0j04r3P9L0J26l4j12J3K9q2l2K47j34J5r6l5J01J66k34p7
3601a59K3K71j94J76j12q7J88j37q4J71j00Q0J06q9J25k16l4J87k85P3J49l1k0
$$ plain form
3624 1 -28 -36 45 53 -27 135 -30 127 79 -105 99 72 37 155 2 315 -29 139 162 -15 81 97 93 39 28 11 -51
3651 -51 -30 -87 -15 -124 -152 56 43 -49 59 38 108 50 95 107 47 2 -7 -79 39 24 -36 85 -104 -38 5 -136 20
3678 20 -83 -93 -15 -245 35 -7 -74 -70 28 -49 103 90 25 69 99 -50 -47 99 5 78 89 -95 76 31 -96 38
3704 38 -165 118 8 13 -59 -100 -20 55 5 -62 -11 17 -44 -47 187 -45 -68 -5 3 -16 -38 -175 118 96 69 -58 -4 -28
3732 -28 -147 24 124 -45 -8 86 -35 -68 119 174 -30 -16 36 125 -26 -88 -28 17 97 -14 -114 38 -93 -68
3756 -68 -47 34 156 -29 29 -93 2 10 251 29 17 177 39 173 -55 -12 23 -3 99 18 -74 -49 7 60 -66
3781 -66 51 -80 17 26 -14 -60 56 12 -142 92 98 -186 150 -149 -97 88 127 108 -1 -56 -46 107 -58 120 -21
3806 -21 -101 -85 -140 27 -191 -8 6 -52 108 -56 -5 -15 183 97 16 181 40 -54 -40 -70 177 -82 -44 -46 76
$$ packed form
3624Ak9qQ1Qq0J62j65J57m8j84K04k7l5J18j53L13l44J68K3j77R6J6mn4j1j7o2
3651e1K1n7P2j09k8K08j3r2J08k1P0n8M5J2o0m5rp2J18j5o0J21j89O6M3j41J56
3678B0j03j0P8k30K80m2o7MR8p7J52j3o5M4L0j49LJ46r4P3J1j84J71m5j27J34
3704C8k03K83j10Np2m1Q0P5n0o7N1K8o1lK34k32k3O3Qj9k2j37K93k2k7j27N4k4
3732b8j19J71J00j69L7R4j21l3J87N5k04J4N2Q9j51o2O0M5Q0j11j00J52j31K5
3756f8K1Q1J22j85N8j22R5QK41k22j2J60j38J34k28M3L5k6J02q1r2K5N6N3j26
3781f6J17j31R7Rm0m6J16m4j54K34Ok84L36k99N2J85L9j9j09n5J0J53j65J78j41
3806b1q0J6n5J67k18J83J4n8J60j64N1j0J98q6q1J65j41r4J4l0K47k59L8kJ22
$$ plain form
3831 76 -115 -17 52 -2 -73 22 -248 -98 -37 -8 -107 -5 16 -129 216 4 25 24 134 13 28 73 -60 16 -84
3856 -84 -9 163 10 -43 -51 75 -3 -150 -38 178 87 95 -21 120 -33 -27 -127 -84 -42 52 7 -187 -42 -29 18 55
3882 55 -38 43 13 -123 -37 -37 -75 39 32 23 -40 -115 4 73 19 24 1 114 12 -21 19 184 -36 -81 45 -12 51 -21
3910 -21 -80 195 87 71 -127 -134 130 -91 -115 106 -38 103 59 -55 43 -116 -27 -28 58 69 37 -85 89 -33 63
3935 63 -49 -72 147 -50 -59 -115 -15 -60 97 -7 -110 80 -40 77 100 68 30 41 -45 -58 55 -92 25 33 15
3960 15 117 1 76 -35 -68 -62 52 69 40 -128 51 -153 14 -74 142 83 -153 15 -95 -46 51 311 140 113
3984 113 251 -53 -27 15 13 157 19 -81 -56 -54 -77 -170 57 -144 4 27 21 16 -92 -41 13 136 -27 -84 159 -47
4010 -47 -36 87 -142 -21 94 -22 26 48 112 -229 72 53 -2 46 -108 0 55 22 -23 11 -99 -25 186 -77
$$ packed form
3831G6j91R8O9n4p1R5k70J50O1K9r9J02K1j45L45k12K1jJ10j21J5M5j33P6j00
3856h4P5J72j53n3qJ26p8j47J12K16r1Qj16J41j53Oj00M3M2R4m5j94J45J3M7L7
3882E5r3Q1l0j36Q6%l8J14pro3p5J19O9n4Nk3J13j02l3M0J65k20m5J26n7O3p2
3910b1n9K75j08j6j98pK64k21k4K21j44J41m4j14R8j59Q9jQ6J1l2j22J74j22R6
3935F3j12k3K19j97rn6J00m5J57j04j03J90j20J17K3l2l8J1q6j3J13j47J17Qj8
3960A5J02j16P5j11l3OJ14J7k9j68J79k04J67q8K16n9k36J68j10M9R7K60j71k7
3984A13J38l04K6M2kJ44j38j00K5Kk3r3K27k01J48K3onj08N1N4J23j63n7K43k06
4010d7J1J23k29J21J15j16M8K2O4l41L01j9n5M8j54J08N5l3m5L4j10P4K11k63
$$ plain form
4034 -77 4 -17 54 -23 110 85 82 75 38 139 74 -79 5 -74 -15 93 35 -122 -4 -43 71 33 -78 212 85 -36
4060 -36 -9 72 72 47 92 6 -59 43 59 -129 -12 191 -57 30 -89 118 -22 101 81 146 136 50 105 113 48 48 107
4087 107 6 72 -128 -107 26 11 97 -53 24 -91 11 17 1 86 84 -30 -48 45 -19 -100 -143 -4 83 96 91 -88 -184
4114 -184 -172 28 -114 119 123 67 -79 28 18 15 -103 239 96 -151 172 73 78 -52 -104 -8 -24 -50 -13 67 -88
4139 -88 13 64 69 -47 132 124 1 99 14 -78 -122 56 -28 54 -31 -2 81 146 86 172 -7 137 -120 39 48 90 99 -21
4167 -21 28 -127 -39 -12 -70 167 270 -26 -8 16 149 191 19 -2 22 6 -59 -137 -113 126 95 -157 3 49 -95
4192 -95 -47 57 -131 -141 -130 40 43 -15 -86 27 -4 4 142 -85 -62 -14 -48 -144 -7 -81 6 186 31 24 147 57 45
4219 45 -96 -26 -145 -20 -43 -34 177 -176 23 -54 31 -58 25 144 9 152 43 -84 -49 -41 47 -58 44 94 17
$$ packed form
4034g7Q1k1P1p7J33k5lpl7J01o5j53Q4p9N9J08n8j57J18l9J14l8j11K90j27j21
4060c6K7Q1%k5M5q6o5J02J6j88J17K03k48Q7j19K07j40J23k0O5j0q6N5Qo5%N9
4087A07j01O6k00K1J33j5Q6j50P7j15J02Oj6Q5kj14j8R3o4q1m3J39Q7J3nj79r6
4114a84J2K00j42K33Mn6j46J07j0lj18L42j43k47L23r9Nj30n2R6j6k6L7Q0j55
4139h8J01N1Nj16J79qj23R8q5r2m4J78q4Q2q5K9Q3O5o0Q6j79J44k57J59RM2Rj20
4167b1M9j55Q8K7n8K37J03k96J8K4J33M2j72k1K4j6o5p8K4K39l1k52J60M6j44
4192i5M8J04j88j0J1J70Ln8p1J13l1QJ38k27K3M8l4r6J37p4Q7J80j55pJ23r0j2
4219D5j41P0j19J25k3RK11l53J99p7Q5q9Q3J19j35J43j09j27L5QQ8j05J02N0p7
$$ plain form
4244 17 69 143 24 78 0 97 -27 -58 -1 -50 102 -13 -25 -1 130 163 171 97 -86 -58 -67 -182 -63 -92 23 -55 135
4271 135 -75 -79 -44 -48 -21 -62 -10 -179 -92 81 -98 111 33 -114 54 43 87 -21 42 -5 -11 -77 91 -27 98 -141
4297 -141 190 -10 61 -73 -99 -50 24 -46 -70 133 72 51 -116 34 54 -18 -23 -73 247 -52 -191 -80 83 -150
4321 -150 33 -22 12 -28 25 61 -41 122 52 105 66 -134 45 -140 227 199 -9 152 34 30 65 76 49 -121 -123
4346 -123 14 -18 130 -21 64 -83 50 69 -26 -74 -26 65 -20 -52 -29 -115 -13 60 -39 14 -8 33 44 193 -20 10
4372 10 58 -102 47 126 2 131 60 62 55 69 30 -86 -51 66 72 30 -14 39 -65 6 -177 -12 -29 8 160 -166
4398 -166 104 -108 185 -37 39 90 17 -270 -68 -135 74 -21 -57 -114 -72 108 -16 -17 113 18 -98 87 92 4 -6
4423 -6 -21 -131 2 120 29 16 50 -98 -61 -115 -70 44 -58 -3 35 3 68 -161 -50 -23 158 -65 72 216 106
$$ packed form
4244A7N2P4j19N4p8R7j24l1N7m9J52j15j2K4J31L3Qp4j83K8rj15J19k9J15p8J90
4271A35k10mL5mK7m1N2j69Q7J73j79K09p8j47J68j1M4j08O3m7oo6J68j18J25k39
4297a41L31k00P1j34k6M9P4p0k4K03o1k1j67J50K0p2nn0L20k99j39J11J63k33
4321a50J83n5L4m0N3L6j02J63p0N3l9k00J79j85L67k8k08J61j18mL5J1k7j70k
4346a23J37l2J48j51Q5j47J33J9r5m8M8R1q5l2K3q6J02P3r9N3k2M1J1J49k13L0
4372A0M8j60J49P9j24J29p1KpJ4l9j16L5J17Om2m4N3j04P1j83J65j7L7J52l26
4398a66K70k12K93k22P6N1p3k87K02o7K09r5l6n7M2J80j24jJ30r5j16J85Nq8j0
4423fj5j10J33J18r1j3L4j48L7n4M5J14j02N5L8l2O5k29J11K7J81k23J37J44j10
$$ plain form
4448 106 -96 41 14 67 -92 -3 229 103 174 -37 39 -60 -67 145 101 -104 -38 -95 -203 42 -36 39 -218 144
4472 144 -17 -141 84 211 91 -69 -84 -165 32 116 -62 92 -150 76 -1 -75 -41 166 50 -73 -56 -126 17
4495 17 146 14 154 95 43 131 -63 -100 -37 26 33 -100 134 -95 -15 -54 71 16 -49 102 -45 136 1 -40 30
4520 30 161 118 -39 -34 -71 37 26 77 152 -65 66 100 22 129 -110 -13 -4 -156 -8 48 141 32 -58 28 6 -124
4546 -124 103 15 13 -16 44 -128 -19 13 -20 64 9 -124 -47 18 -128 -198 21 -107 133 8 -12 -36 -81 32 45
4571 45 -120 4 -16 70 -39 -84 146 -77 55 -54 -58 67 10 -126 -59 81 163 -34 -24 -4 -41 -99 -27 70 11
4596 11 -14 4 -69 51 -35 58 -138 12 -23 -52 -11 100 -14 -94 -95 -47 -97 -115 -47 -77 89 -4 -150 53 -165 -86
4622 -86 -25 -80 94 27 -157 -98 -189 -12 66 64 241 26 91 122 62 4 -65 63 -39 -31 146 -32 -41 -28 -32 -77 -165 55
$$ packed form
4448A06k02J37k7N3j59Q9K32j26P1k11P6r9pK12m4k05O6n7j08K45p8P5k57L62
4472A44j61j24K25J27j20j60j5q1J97Q4j78J54k42K26p7p4L4K07j16j23J7p0J43
4495A7J29j32J40n9n2Q8j94l7O3O3Pj33K34k29Q0l9J25n5o5J51j47J81j35m1P0
4520C0J31m3j57Nl7J08j1N1P5k17J31L4p8J07k39R7Rj52J48N6R3j09r0Q6k2j30
4546a24K27q8kk9O0j72J09L2l3Q4n5j33P7O5j46p0K19j28K40j25k0k4m5J13J3
4571D5j65J24k0Q6j09m5K30k23J32j09mJ25n7j36O7J40Q2j97J0K0l7n8P2R7n9
4596A1k5J8p3J20q6R3j96J50l5k9M1J11j14q0jM8n0j8O8l0J66r3j46K03k18P9
4622h6O1n5J74o7j84N9r1J77P8kJ77k15O5L1o0n8o9J28j02QJ77j78rJ3mm5q8K20
$$ plain form
4650 55 -25 184 -63 74 -122 148 -43 7 -27 11 -98 120 -52 -215 -46 -19 -11 -23 90 -15 29 21 51 2 -154
4675 -154 -85 -4 -148 104 -37 -117 63 -18 56 -126 3 -1 -45 -104 -70 -103 -57 41 32 -96 -48 80 2 76 -20 27 23
4702 23 -113 82 301 -75 -9 54 86 107 -73 -37 -70 74 -112 -34 82 -100 127 -136 7 5 -99 157 -160
4725 -160 96 -44 -95 94 80 -63 -19 -140 72 4 98 -29 91 112 -130 124 -77 -80 86 58 -134 -40 21 184
4749 184 -27 42 58 -79 7 44 21 96 -4 -140 -89 85 -103 8 -121 -12 45 -40 139 79 43 75 -109 -13
4773 -13 -69 14 8 -132 -18 99 12 -58 -24 120 63 17 0 171 23 17 101 53 116 84 77 -10 -70 56 83 -126 -146 10
4801 10 -1 68 -114 -46 -161 23 -17 -62 -6 -29 117 -76 -108 -164 17 -127 78 142 -43 -55 -68 -16 25 -79 -20
4826 -20 -13 39 33 -52 68 -78 -135 -106 -60 -2 54 20 28 -43 -22 -73 -95 -51 146 -133 -71 10 0 18 -79 -104 37 43 36 -31
$$ packed form
4650E5q0K09k47J37j96K70j91N0l4L8j09K18j72j63J69K7Qj2J13j05M4qL0m9j56
4675a54O9Q1j44K52j41q0J80q1P4j82J29mm4n9L4l3M6R8rj28M8J28p8P4r6M7m
4702B3j36J95K19l76O6O3L2K1j80L6l3J44j86P8J16j82K27k63J43kj04K56l17
4725a60K56j40n1J89j4j43M4j21K12o8R4j27J20K1k42K54k01lJ66k8j92R4O1J63
4749A84k11O9J6j37Q6L7k3P5j00j36N1J74j88J11j29J09N7q5J79o0l6L2j84R6
4773a3n6Q3oj40J14J17q7p0L4J44n7m6j7J71j48oQ4m8O3l2pq7o0J26K7k09k0J56
4801A0j1O9j82O8j15J84m0m5N6k3J46j93l2n6J81j44K05O4j85j2j3N2M1j04N9
4826b0PN2oq5J20j46n7K9M6N8N6l4Qp1K1n1k2M4J97k79O2Q1j0J8r7k5J41Opo7
$$ plain form
4856 -31 277 -76 23 66 -7 -42 -54 -67 24 -70 -129 -35 11 -5 -19 -19 30 5 -36 -97 73 -101 59 -18 -44 -28 37 108
4884 108 100 6 -2 111 -72 153 -34 4 -24 27 -47 32 3 63 26 -6 19 -18 -16 -224 -63 -38 -60 104 2 -37 -142
4911 -142 -87 25 -17 119 -47 169 -10 67 -35 -129 -51 175 -25 -153 -20 -199 -11 38 -170 81 32 -40 -4
4934 -4 28 -68 32 -93 -15 140 -21 29 -63 -71 -90 81 -20 -25 -181 -73 64 141 37 -24 -61 106 103 -35 178 -186
4960 -186 -147 94 -52 -23 43 79 37 10 149 47 -47 -135 -82 9 56 -92 -29 42 127 126 -147 -39 -11 129 10 -31
4986 -31 -81 -95 -13 107 -90 -98 47 249 -105 -34 143 131 -15 102 -14 29 -77 57 81 -71 -116 -20 -134 -25
5010 -25 -63 -12 69 199 -42 4 -36 -38 -195 -221 29 198 -117 1 81 8 -87 -173 98 20 -9 -69 71 79 -224 -28
5036 -28 151 11 -49 -100 78 29 -14 44 -103 36 -135 -66 -112 -24 75 201 63 -20 62 -154 5 8 115 65 44
$$ packed form
4856c1L08l53R9M3p3l5j2j3R1r4n9R4M6j6j4%M9k5m1o1J70j74J60p7k6J6O5P1
4884A08qr4qJ13j83K25j87L8k8N1p4P9k9O0l7l2K5l7Kk08J61K5k2J64j02l9j05
4911a42N5J12m2J36j66K16j79P7j02r4P8K26k00j28J33j79J88M9k08K51m9p2L6
4934dL2r6J00j25P8J55j61N0r2qj9J71j01nj56J08J37P7j04o1l7J67lj38K13l64
4960a86L9K41j46K9O6L6m2k7J39j02r4q8N3R1M7j48O3P1Q5jk73J08K8J40j19m1
4986c1n0j4Q2J20j97qJ45K02l54P1J77j2j46J17j16M3j06J34K4j52m5R6j14J09
5010b5l8N1Q1J30k41M6m0kj57k6K50J69l15J18Q0p3r5q6K71p8k9o0J40Ql03J96
5036b8J79j40o0n1J78m9m3N8j47J39j71O9m6Q8R9J26j38q3Q2k16J59LJ07n0k1
$$ plain form
5061 44 -77 -113 -78 -67 89 -142 -42 27 -9 -69 82 48 4 -53 13 -156 100 27 52 124 83 -60 13 25 -114 -44
5087 -44 -106 79 119 -136 33 -108 -114 39 94 -74 40 55 12 1 5 99 -58 -36 51 19 81 -69 80 89 -71 100
5113 100 -65 3 2 -31 -101 59 -33 -4 105 24 49 -205 -48 -74 -149 22 -17 25 -158 -117 -80 194 -13 91 -142
5138 -142 114 -133 132 -96 -147 49 118 -76 49 -34 -97 109 8 97 54 178 22 121 -137 -51 12 -18 -56 -132
5162 -132 -4 -30 -167 -44 75 152 99 49 -75 11 -48 34 -9 -283 66 15 -8 -198 12 138 30 192 41
5185 41 52 -69 31 -56 37 152 -43 -39 -52 25 47 -85 -98 -47 78 83 -177 149 -118 0 -125 120 -7 -30 82
5210 82 -64 -31 -137 47 108 57 -175 8 -70 -134 90 -86 113 -51 -2 87 30 70 8 44 73 41 149 78 -49
5235 -49 80 -132 32 -26 169 17 85 -140 -11 -78 100 -63 71 61 -10 5 -16 158 61 31 12 -48 85 -12
$$ packed form
5061D4j21l6L5J1J56k31J00O9l6o0J51l4m4n7O6j69K56p3K5P2m1j43P3J2j39P0
5087d4o2J85M0k55J69j41oJ53N5j68J14J5m3j1MR4j57K2Q7l2O2j50J49Rj60J71
5113A00j65O8jl3p0J60r2K9J09q1K5k54J57k6p5J71l9M2j83M1L7K74k07J04k33
5138a42K56k47K65k28n1J96O9j94J25q3o3K06j01Q9m3J24j56R9k58Q6O3l0l8p6
5162a32J28k6j37J23J19P7n3n0j24Q6n9Q2m3k74L49n1k3j90K10J26j08J62j51
5185D1J1j21J00q7R3J15j95Mj3P7K2j32j3N1J25Nk60L26k67J18j25K45j27k3J12
5210H2j46L3j06J84O1n1k32J83p8o4K24j76J99j64M9Q9n7M0o2L6K9l2J08p1j27
5235d9J29k12J64n8J95j52O8k25J29o7J78j63J34j0p1J5k1J74r7l0j9o0J33r7
$$ plain form
5259 -12 -82 25 -70 150 103 -125 39 215 -19 -45 89 91 -105 44 44 9 62 45 13 218 -55 91 49 -105 -137
5284 -137 -173 -40 112 156 -57 102 43 -23 -23 -43 -148 19 29 -147 -92 -145 -25 2 46 88 -42 -86 32 121 -67
5309 -67 5 -76 20 -136 -8 -21 122 36 169 -7 -60 -32 45 9 -50 -48 109 30 -67 127 -121 -154 -73 -136 -60 56
5335 56 61 25 -101 -206 -18 120 -71 -22 75 -81 49 -101 26 -224 73 -28 -95 50 -64 140 -193 -25
5357 -25 -70 -127 82 -75 95 -123 28 -17 8 -12 3 14 -92 104 -135 -107 191 71 159 47 -37 -74 14 -87
5381 -87 -111 126 68 -64 154 70 27 34 43 190 -67 -87 -6 28 12 11 83 13 -85 129 -2 -59 -59 -47 129 120 -166 -11
5409 -11 -122 43 -114 109 158 -61 109 74 111 111 71 -6 34 35 -74 26 44 -18 9 67 -81 121 -3 -168 -77
5434 -77 -37 -120 -22 -117 79 15 -33 114 -3 11 105 36 -145 -71 -177 -38 56 37 -26 -186 55 -13 168 32 17
$$ packed form
5259a2p0J07r5K20m7k28J64J76k34k6J34Kj96J49%l5N3j7l2K05k73J46m2j54l2
5284a37l6J33J52M4k13J59n9o6%k0j05J67J0j76N5n3J20K7M4M2j30m4J18Q9j88
5309f7P2q1R6j56J28j3J43q6J33j76n3K8P7l6n9KJ57p9r7J94k48l3Q1o3P6J16
5335E6Nl6j26j05J88J38j91M9R7j56J30j50J27k50K97j01o7J45j14K04l33J68
5357b5m5n7K09j57J70k18J51m5K5k0J5J1j06J96k39K8K98j20Q8j12q4l7Q8j01
5381h7k4K37n8j32K18q4m3PRJ47k57k0Q1L4j6jP2p0r8K14j31n7%J2J76rk86J55
5409a1j11J65j57K23M9k19J70l5L7%m0p7M0Jj09J00J8o2K7N8j48K02j24j65R1
5434g7M0q3R8r5J96o4m8J47j17J4R4o9j81P4j06J39R4j9o3j60K41o8J81j36j5
$$ plain form
5459 17 62 -54 151 42 76 -4 -35 156 -192 192 58 -63 63 45 1 -39 -83 48 -77 -120 152 -13 -111 163
5483 163 3 69 -22 -185 -150 14 -66 62 65 64 162 -43 -142 -19 130 156 97 49 -60 -83 89 -57 -113 -26 47 25
5509 25 108 -15 29 -15 149 85 -107 -51 -34 52 -46 -109 -106 40 -110 5 -56 141 -14 0 -11 40 53 -71 -42 118
5535 118 -2 162 22 21 -16 -13 167 -44 -65 44 -125 -118 11 -117 -18 -44 -139 -18 155 -20 5 -58 44 -106
5559 -106 -26 124 -44 1 -124 4 14 -5 -94 61 -50 -216 -73 3 -62 91 3 -101 -67 -81 -5 -196 -36 -102
5583 -102 7 -36 -78 -50 -196 -38 -148 75 -13 -24 85 -41 -166 -26 125 -85 -177 -104 29 -106 57 -91
5605 -91 68 -4 94 88 7 142 32 -13 -1 37 -84 30 -65 7 11 16 40 -8 -13 103 15 -33 -43 90 -104 -48 -62 1
5633 1 -22 -26 36 -80 14 -327 -77 -68 74 121 -15 123 -74 69 4 -101 14 -83 -87 -93 19 97 118 117 -10 -63 -94
$$ packed form
5459A7M5j16K05j09L4q0l1J91l48L84j34j21J26j8m4m0m4J31j25m3K72j65r8K74
5483A63j60O6r1j63L5J64q0J28LjR8k05r9J23J49K6n9m8j09k3J72j46n6Q7P3k2
5509B5Q3j23M4m4J64o4j92N6J7Q6r8o3LJ46j50J15o1J97j55J4j1N1J3j24K9J60
5535A18j20J64j40jl7LJ80k11k1J09j69PJ29j28R9k6r5J21J73j75K5o3J02j50
5559a06Q0J50j68M5j25J28J0j9q9J55j11j66J43P6o5J53q8j04L4j4P6j91J60o6
5583a02J09m3m2K8j46J58j10K23q8j1J09j26j25J40J51k10r2P3J33j35J63j48
5605i1J59p2R8oq1J35j10m5J2L8j21J14r5P2MNK4m8nJ16q8m8j0J33j94N6j4O3
5633Ak3mO2j16R4l41K50RJ42M7j36J38j97J43o5j05J15r7moJ12P8K1jj27n3l1
$$ plain form
5660 -94 52 218 26 63 -132 183 8 -140 64 -121 -15 -18 113 65 133 -53 -27 -162 -48 171 -78 61
5682 61 55 144 46 134 16 130 91 -152 5 173 -33 142 -58 -174 39 -1 100 -65 -164 -167 100 -30 -29 -119 -137
5707 -137 72 101 -199 -182 -36 -17 14 -89 -80 106 1 -13 -34 -150 119 -19 102 -84 123 -16 -112 11 -92
5730 -92 215 4 126 108 -5 127 16 -133 171 0 -35 -23 -72 22 -13 -45 -3 85 82 -36 75 95 47 -159 -25
5755 -25 -106 -7 -135 -149 -61 -133 7 51 -53 -55 -53 24 -97 -60 -4 9 51 22 -88 46 49 148 -5 28 -108 -94 -95 106
5783 106 56 38 193 -102 139 -6 -86 -105 17 -135 5 -252 -31 -55 37 -44 -29 85 -4 129 39 131 32 -131
5807 -131 -96 -37 133 -156 15 -11 -118 74 51 92 -41 67 -127 -21 -113 235 -16 53 -4 130 -48 -181 74
5830 74 75 -6 163 43 -53 -49 28 -84 -78 180 -22 86 -11 192 96 -29 72 -119 -62 183 -81 -88 57 -45 43
$$ packed form
5660i4J46J66j92L7j95L15j75j48K04j85J06lJ31m8O8j86K6j35J14K19k49J39
5682F1oQ9r8Q8j18J14l9k43J57J68k06J75k00j16K13m0J01j65r9lK67j30Jr0j8
5707a37K09K9l00J7J46J9L1j03RJ86j05j4k1j16K69j38J21j86K07j39r6J23j03
5730i2L07k11J22j8j13J32j11j49L04j71l5J2m9R4l5l2M2Q8lj18J11K0m8k06J34
5755b5q1R9j28j4Q8p2J40M4j04kKP7j21L7N6J3M2k9j10J34LR9j53L3j36J4jK01
5783A06n0j8J55k95K41j45q0j9J22j52J40k57K21k4R2q1J5J14q9J33r0R2r9j63
5807a31L5N9J70k89J71k6j07J92k3M1j33J08j94J06r2L48k51O9n7J34j78j33K55
5830G4Jq1J69j20r6MP7j12OK58k02J08r7K03r6j25J01j91N7K45k64pJ45j02Q8
$$ plain form
5855 43 34 -67 52 -90 -101 80 -26 106 62 149 -68 -77 -37 -1 108 26 54 -29 -46 82 -59 -10 109 26 -139
5880 -139 -5 -26 -78 -154 59 111 -61 36 82 -19 -28 12 -3 7 -43 137 -108 28 -107 102 -175 -153 64 -163
5904 -163 16 -95 -17 61 -106 -63 -8 -64 -73 -131 -32 82 -6 104 -94 -101 76 -45 61 -36 -21 -110 102 -132 99
5929 99 72 -72 -142 40 105 -98 20 104 -111 -115 -73 -64 -47 -48 95 -37 -30 103 -28 -170 -133 37 -27 166 119 49
5955 49 -65 -137 144 -168 -60 26 30 67 -98 -19 -34 -86 85 -105 -4 -47 -5 11 -153 -58 -88 -24 213 37 -24
5980 -24 45 -224 -16 -13 -9 9 25 -63 -73 126 -99 66 68 51 -70 -178 75 172 96 -58 23 -54 65 40 -43 111
6006 111 74 85 88 107 37 -37 -148 -48 47 60 221 -102 146 -22 -121 -124 -22 42 -85 -84 -47 216 -208 148 -58
6031 -58 35 -104 -118 -52 -87 85 6 -117 27 -202 39 -19 122 -134 -12 68 25 -41 -46 -163 2 74 1 59 49
$$ packed form
5855D3rj01J19j42j1J81j06J32m4Q7k17rM0L6J09q2K8q3j7J28j41M9J19q3j65
5880a39J34k1n2p6K13N2j72R7M6j01rM0j5J0n0J80k45J36j35K09k77K2K17k27
5904a63J79j11P8P8j67M3N5n6rn8R9J14q8J10j98pJ77j21J06r7J5q9K12k34K31
5929I9k7j44p0J82O5k03J18Q4k15mM2RJ7jJ43j32PJ33j31j42L7J70o4J93m7p0
5955D9j14p2K81l12J08Q6ML7j65P9j5n2J71j90J01m3M2J6j64R5l0O4K37j76o1
5980b4O9k69K08LMJ8J6q8j0J99k25J65Kj7j21j08K53R7p6j54Q1p7J19k5q3J54
6006A11l7J1LJ9p0p4j11J00R5J3J61l23K48j68r9lJ02O4j27JL7K63m24L56k06
6031e8R3j39j4O6l5J72p9j23J44k29K41n8J41k56J22Q0m3o6nj17J65P2p3N8j0
$$ plain form
6056 49 83 26 154 -6 -103 13 -25 32 -93 86 -25 -213 -80 -33 -20 37 -30 34 -188 -31 -26 120 151 -140 19
6081 19 97 179 -27 145 -162 -18 35 -46 -42 -183 91 29 32 39 -121 52 56 -100 -172 77 -67 -47 -53 116 -45 -83
6107 -83 -4 81 110 71 79 1 -35 -92 -82 -42 110 -126 -14 -133 183 163 13 -15 -28 13 123 -66 -56 108 23 -9
6133 -9 169 -4 22 -89 70 66 2 44 14 -33 -27 -99 51 -121 -8 -56 -148 51 67 -38 -1 -57 -32 181 34 -114
6159 -114 -42 197 -94 -66 8 -147 55 -113 -76 0 -88 8 77 30 -34 -81 -17 -11 -6 88 -61 -99 158 106 -66 23 181
6186 181 75 -110 20 0 95 73 -95 -46 106 -56 -196 -57 -116 -85 -5 -194 93 -22 -84 6 -6 236 100
6209 100 84 -58 -21 -11 23 -38 -58 -122 -134 -118 53 -53 33 -15 63 71 -49 -76 -87 -63 -28 -70 35 106 73 67 -73 30
6237 30 62 65 47 148 -20 4 0 -80 -113 8 -190 -24 -173 41 120 -153 178 -146 -110 30 -40 134 21 -70 40
$$ packed form
6056D9L4n7J28j60r7J16l8N7j25J79j11j88J33M7J3N7o7O4k22J57NJ46L1k91J59
6081A9P8Q2k06J72l07J44N3q1Mj41K74o2LPj60J73Mj56p2K49j44K0oJ69j61l8
6107h3P9Q5K9l9Qp8l6n7J0M0J52k36J12j19L16k0j50k8j3M1J10j89J0J64q5l2
6133iJ78j73K6j11J59mo4M2l0m7Op2J50j72J13m8r2J99J6j05L7n6K5K13j47j48
6159a14P2K39k91K8P4j55K02j68L7P6q8R6O9m7o4m7O4ONR4j49l8K57n2j72Q9J58
6186A81j06j85J30k0R5k2j68M9J52j62j40J39n9L1Q0j89K87j15o2R0j2K42j36
6209A00j6j42L7J0L4o1k0o4j2J6J71j06Q6m8P8Qj20k7j1K4L5m2J05P1l3oj40J03
6237C0L2Lj8J01j68K4mq0l3J21j98J66j49K14P9k73L31l24L6J40p0J74j13r1J10
$$ plain form
6262 40 -54 -119 -62 42 37 -33 -10 -21 -2 185 39 29 63 132 115 -113 50 -75 4 96 -51 -109 -73 71 -121 133
6288 133 -90 13 17 36 -146 85 64 -24 3 -51 22 -52 112 94 -162 -14 6 25 82 84 93 -42 173 -60 37 -156
6314 -156 30 -35 42 -25 100 105 29 -9 30 -96 -53 92 -142 -54 97 -45 234 -17 -116 -87 -72 24 105 -21 -63
6339 -63 -17 24 33 -172 -32 142 -137 -5 -64 -74 14 69 -182 97 -69 -36 -47 24 96 -130 -55 -31 -103 57 32 -125
6365 -125 -28 -104 58 -78 80 93 22 4 -200 40 -31 23 -19 -18 47 90 -53 -122 -21 -18 97 -150 -31 58 154 173
6391 173 103 74 -54 115 144 -81 200 70 57 119 -7 -78 -99 -68 -2 72 -49 -14 -100 -86 59 92 -83 91 50
6416 50 -179 3 -4 64 -36 -90 26 -81 12 52 96 138 29 -39 40 125 147 68 38 -106 57 -138 -16 -101 30
6441 30 -58 -31 120 11 113 -125 61 94 -4 -43 48 -52 84 37 102 -128 -122 36 -45 12 -38 53 -45 -99 11 -37
$$ packed form
6262D0r4o5N7J04np0K3j1J9J87j46j0L4O9j7k28J63j25P9R2j47n8L6J44j92K54
6288A33k23J03MJ9j82K31k1q8K7n4P3p4J64j8k56J48K0J9N7KRj35K15k33R7j93
6314a56J86o5P7o7J25Np6l8L9j26M3J45k34Q8J51j42K79k51r9K9J5R6Q1j26m2
6339f3M6M1Rk05J40J74k79J32n9j0Q8N5k51K79j66L3j1P1P2k26P5K4p2J60k5j57
6365a25R7p6J62j36J58J3p1j8k04K40p1N4m2JO5M3j43o9J01LJ15k47J19Q9R6J9
6391A73p0k9j28J69K9k25K81j30j3O2j26p1k1L1O6P4j21L5q6J4J45L3j75J74m1
6416E0k29J82pO8j00n4J16j07R3M0M4M2j09o8P9Q5K2p9l0j44J63j95J22q5J31
6441C0q8K7J51j09J02k38J86L3r8l9R1j00J36m7O5k30OJ58q1N7n0R1r8n4J10m8
$$ plain form
6467 -37 82 -4 131 123 180 -99 -168 152 -10 20 139 -128 15 26 -139 79 -71 -155 -10 95 48 43 -86 -32
6491 -32 23 -15 15 -71 152 -70 -24 149 -89 37 -89 19 -257 -126 195 -52 42 -75 21 -6 -40 32 -47 129
6515 129 256 49 -159 54 -64 -92 -46 -56 -55 -86 8 32 13 -13 -23 1 33 33 36 27 -96 -168 -33 14 -99 46 -177
6542 -177 -3 -35 -17 21 -54 35 64 -9 -45 106 101 -1 -56 -16 61 -39 2 -81 163 47 34 19 31 -100 -78 -27 40
6569 40 -63 119 52 77 -13 -36 -50 -140 -150 84 -27 -1 -67 -117 8 -92 30 33 -65 -223 36 -103 187 27 56
6594 56 67 -34 -109 11 -33 46 -39 -37 104 -209 -21 -79 57 -9 100 -175 -157 -116 127 -66 -128 76 -125 33
6618 33 -17 74 23 -35 105 -11 -59 -136 -144 59 -38 -17 -26 -114 51 -65 -85 -138 45 -115 -114 -13 110 -115 42 172
6644 172 89 -28 116 -24 71 -55 28 44 -219 88 -82 -143 28 95 21 30 0 0 -25 46 -79 48 -203 59 -211
$$ packed form
6467c7J19q6J35qN7k79o9L20j62L0J19k67J43J1j65K18j50q4J45J05m7nj29N4
6491c2N5l8L0q6K23k22M6J73k38J26j26J08k76J31L21k47R4j17R6k7l4P2p9J76
6515A29J27k07k08K13j18k8M6j0Jl1R4K4j9k6j0K4L2%Lrj23p2J35M7j13J45k23
6542a77J74l2J8L8p5Q9K9p3l6J51nj02n5M0P7j00M1q3K44j16j3j5J2j31K2N1O7
6569D0j03J82o7K5r0k3j4r0j0K34j11K6o6n0J25j00J22Lr8j58K59j39K90j60K9
6594E6J1j01p5J20m4P9q5KJ41l13J88n8J36o6J09k75J8M1K43j93o2K04k01J58
6618C3n0R1n1n8J40j16m8p7qK03r7K1rq8J65j16k0n3J83j60JJ01J23k25J57J30
6644A72q3j17J44j40R5j26Q3J6k63L07j70o1J71O7p4Rl0%k5P1j25J27k51K62k70
$$ plain form
6669 -211 32 34 -183 110 128 32 74 26 35 -40 -105 -18 48 59 56 -38 4 30 59 68 5 13 -16 -38 61 71 110 -20 -78 -10
6699 -10 -106 -48 12 -131 -5 58 81 -50 -30 -68 14 -76 98 -1 -19 12 -170 -24 17 -40 31 -27 153 103 69 3 101
6726 101 11 125 -120 87 41 -38 2 42 -65 58 54 144 40 -53 -48 33 -126 -95 -153 59 -161 -224 150 -117 -25
6751 -25 -109 -159 193 -86 -96 -27 157 103 -33 -77 45 18 39 42 -119 35 -54 -22 140 -99 -218 -40 -42 50 89 -17
6777 -17 -61 -4 68 -98 -95 63 67 78 -106 -113 -113 -74 -3 -51 80 -6 -140 -34 -49 135 -162 71 70 34 112 89 30 -36
6805 -36 84 82 145 -91 -6 -85 38 -19 75 87 -91 -58 -31 101 101 -112 40 30 22 10 -41 139 316 75 40 -112
6831 -112 -102 13 -63 28 -48 36 18 20 78 -75 -282 34 -150 -166 129 -3 -75 162 -147 2 -94 106 53 -150
6855 -150 75 -11 -53 31 31 -167 43 -79 86 78 -72 -122 18 -109 51 108 -20 -2 -36 -12 175 120 -74 -66 43
$$ packed form
6669b11K43Kk17K93J8r6M2m8Rp5o5Q7O6J1lr4M2K6K9Ro3Qk9k2R9J0L9j30n8O8
6699a0r6N8O0j43J26O3K3j31K0l8Q2r0J74r9j8L1j82J46M1n7P1n8J80n0l4o6R8
6726A01r0J14k45K07m6p9M0M0j07J23mR0j04r3NQ1j59L1n8K12k20o3L74k67R2
6751b5q4n0L52k79j0O9J84n4j36m4J22k7K1Lj61J54q9L2J62k39j19J78kR2L9j06
6777a7m4N7P2j66LJ58MJ1j84p%L9P1m8J31q6j34J06j5J84k97K33jl6P8k3n9o6
6805c6J20kO3k36Q5p9J23n7R4J2j78L3K7J32%k13J52j0qj2n1J80J77k41l5j52
6831a12J0J15p6R1p6Q4j8KN8j53k07L16j84j6K95j32p2K37l09J49r6K00n3k03
6855a50K25q6m2Q4%j98K10j22J65qj50n0J40j27J60N7j28J8l4K4J87n5j94QJ09
$$ plain form
6880 43 -76 -4 34 -100 -127 45 55 -55 14 152 -138 44 181 -14 -49 -45 -48 -93 -130 105 -2 93 19 57 53 33
6906 33 -262 -146 91 91 74 -36 49 33 -63 106 -133 -48 25 -148 -56 -124 -39 1 102 -78 39 38 46 -6 -128 2
6932 2 34 -115 -12 -77 59 50 -31 91 -61 11 6 160 69 -63 -44 24 -164 9 -55 178 30 -6 85 -32 -62 -54
6958 -54 47 -240 -36 150 4 72 10 172 -38 176 -129 17 11 -14 -31 -80 26 40 -39 -20 114 118 -9 18 -163
6983 -163 60 -195 11 -66 -136 -49 127 28 -91 -6 46 52 -40 -5 32 1 -8 -45 -138 -185 12 42 31 12 49 -72 4
7010 4 -102 168 -14 -11 219 130 -33 41 -37 -95 -94 23 92 17 73 -76 -25 -58 77 -13 -45 139 -36 124 54 -118
7036 -118 -70 70 174 23 111 25 -6 -4 34 -84 22 -45 -159 70 65 13 2 37 -11 -125 43 134 7 -72 -68 -40
7062 -40 -96 -169 88 83 -22 -238 -36 -21 -10 -66 49 -98 -17 -136 -16 26 24 -65 -29 -114 78 118 -16 -3 54 -58
$$ packed form
6880D3j19P2L8j34k7J72J0j10O9J38k90J82J37j95l5Mlm5l7K35j07R5p4L8mk0
6906C3k95J16K37%j7j10Q5j6r6J69k39Q5P3j73R2o8Q5M0J01j80J17jQn2j22J30
6932BL2j49J03o5J36rq1J22j52P2nJ54r1j32J9O8j88J73o4K33j48l6R1j17l0Q
6958e4J01k87K04J86j46O8o2J62k10K14l05J46ok5j7m9J06J4p9J9J34Mj27K7j81
6983a63K23k55K06p7p0Q7J76r9j19Q5N2Or2L5L7l1rl7r3m7J97L0j1j9L7j21P6
7010Dj06K70j82LK30q9j63P4p8n8JJ17O9p5N6j49N1l3J35r0l2J84j75J60p0j72
7036a18M8J40J04j51Q8q6l1KL8j18J06o7j14K29nn2j1L5m8j14J68R1j27p9MK8
7062d0n6p3K57nj05k16K02J5J1n6J15j47Q1j19J20M2kq9L6q5J92M0j34J3N7j12
$$ plain form
7088 -58 87 47 17 -22 -104 189 141 -97 -4 -73 -21 101 -148 -13 -34 -108 -91 -84 -70 13 -100 -122 -18 104 -16 17
7114 17 43 238 -24 71 106 -56 43 -108 67 -53 89 -108 53 -70 -32 -105 -12 173 64 98 -87 -117 -72 -45
7138 -45 71 70 -45 60 -131 74 176 171 14 4 85 146 -24 -131 -93 24 213 207 -7 27 -87 8 -21 -59 -124
7163 -124 -65 5 -7 36 -24 -88 -138 -2 -33 -23 113 46 10 -60 -43 52 26 -28 -17 14 -49 -30 119 55 44 180 -80
7190 -80 66 -23 -69 56 50 -68 37 139 -220 46 -82 -27 -57 -96 85 1 83 -64 176 -15 219 -49 -105 38
7214 38 -135 18 -107 -131 131 -1 -60 43 14 28 62 -29 38 -103 -162 6 50 -61 -71 12 109 74 115 83 149 19
7240 19 -35 -59 149 8 105 61 -51 45 -69 -104 -119 32 -14 -6 -56 24 100 -27 -203 29 10 -33 75 33 -130 -62
7266 -62 -118 -50 82 -101 -19 -153 46 -54 61 53 15 30 -102 -4 0 -82 33 2 -60 -80 30 -49 36 79 -145 -12
$$ packed form
7088e8J45m0l0l9q2K93m8k38R3o9N2J22k49J35k1p4J7PJ4Q3j13k2J04J22j20L3
7114A7K6J95k62R5L5j62R9j51J75j20J42j97J61j23L8p3R3J85j09L4j85l0M5K7
7138d5J16jj15J05j91K05J02nj57j0Q1O1j70j07L8J17J89ok14L4j14R5k9l8o5
7163a24N9P0j2M3o0o4n0J36l1J0J36o7l6p0J7R5k6n4J1L1o3J9J49o4j1J36k60
7190h0J46q9m6J25oj18J05J02l59K66j28N5l0l9J81q4Q2j47K40j91K34k68n6J43
7214C8j73J53j25k4K62j32n9J03k9J4L4r1O7j41n9J68M4j11j0Q3R7l5M1l2O6j30
7240A9n4k4K08j41R7m4j12R6j14l5j5J51m6Qn0Q0P6j27j76K32j9m3J08m2j63O8
7266f2n6O8J32j83Q2j34J99j00J15ql8J5j32R8Mq2J15l1o2k0J10p9Q5M3k24J33
$$ plain form
7292 -12 -188 -37 -4 92 15 -117 154 -21 78 40 -53 109 139 -20 -185 73 -35 -115 163 -74 86 -21 104
7315 104 -70 -36 53 32 -161 -48 -203 58 -120 -12 -115 63 -161 140 22 -169 59 25 40 114 -96 -28
7337 -28 103 39 -68 -41 79 93 23 -195 -16 82 -33 71 110 -25 21 79 -17 -69 -17 -37 -92 -110 12 -80 -132 99
7363 99 -46 77 88 86 91 15 -79 -6 -33 26 -35 -17 -45 -33 0 -66 -124 -203 185 65 100 128 86 131 31 200 45 -101
7391 -101 -148 138 170 -61 -78 -69 127 -17 0 5 -104 119 -75 23 -93 81 -92 -27 -33 88 200 136 -122 -12
7415 -12 187 10 -46 36 -4 91 -2 -13 -132 44 -36 -28 66 15 15 -131 55 -33 17 -33 112 -156 -89 -12 13 6 94 -39
7443 -39 -48 -34 -103 39 -148 -85 45 143 -188 40 -65 -69 55 -127 42 114 -19 19 162 17 -89 2 -160 -67
7467 -67 -14 32 53 89 149 -82 76 20 11 121 62 72 197 -57 -15 -17 -64 -143 -41 95 103 137 37 -8 -33 -152 27
$$ packed form
7292a2j76J51L3R6p7j32K71j75R9l8r3J62L0j59j65K58j08q0K78k37J60j07J25
7315A04j74L4Q9k1j93J13j55K61j78J08j03J78k24L01j18j91K28l4J5P4k10O8
7337b8J31o4j07K7J20J4p0k18J79R8j15J04L9j35M6N8r6n2N2k0n5j8J22r2n2K31
7363I9j45J23J1kNp6r4P3k7N9o1J8k8J2L3o6n8p9L88j20L5K8m2M5j00J69j55j46
7391a01m7K86L2k31j7RJ96j44J7Nj09K23j94R8j16J74j73O5oJ21J12o4k58J10
7415a2J99j77n6Q2m0R5r3j1j19J76q0QR4n1%j46J86q8N0n0J45k68O7P7K5pQ8j33
7443c9rJ4o9J42j87O3J30R8l31K28j05mJ24j82J69P2j33L8J43j45j06R1j62R3
7467f7N3M6K1L6O0k31J58n6rJ10n9J0J25k54M2km7p9J02J36QL4j00m5k5j19J79
$$ plain form
7494 27 -6 -37 134 -163 -109 -128 -63 147 -16 82 107 -19 -214 -1 -142 62 29 18 42 115 36 -106 -198 9 -67
7519 -67 149 25 4 -85 26 -74 40 25 97 38 53 30 143 -57 68 27 119 114 -145 -15 -25 37 -143 -42 -75
7544 -75 173 -26 90 35 125 38 -68 -69 101 -187 -3 111 -146 -158 -64 161 -103 -79 0 -88 42 67 -29 -113 58
7569 58 -15 -46 -18 2 -80 28 52 55 -21 -79 -42 173 0 -146 136 -31 83 110 30 -4 42 -110 0 -120 5
7594 5 -200 81 85 131 -93 -46 -91 73 17 26 26 -11 -47 66 154 -108 -60 8 -118 54 -104 -18 -137 128 -56 -73
7620 -73 183 -48 97 -96 99 149 62 34 -26 -64 15 -98 -122 -39 -18 2 65 48 141 -44 -41 49 -36 27 -46 -56 -80
7647 -80 -37 -22 -78 -85 -85 -100 66 -62 -3 -57 -61 -43 58 95 -9 183 127 -97 5 -82 -61 92 -161 4 88 84 95
7674 95 47 -145 -29 26 33 143 -40 -44 -62 -85 -5 15 118 111 9 57 -226 124 -107 42 146 7 -21 -65 -24 42
$$ packed form
7494B7l3l1J71k97N4j9O5K10j63R8K5j26j95K13j41K04l3j1K4P3p9j42r2K07p6
7519f7K16j24k1q9J11j00J14j5P2n9J5k3J13k00J25m1R2nk59J30j0O2j80J01l3
7544g5K48j99J16n5R0q7j06jJ70k88J84J14k57j2R4K25k64K4P9q8J30K5r6q4J71
7569E8p3l1K8K0q2J08K4Lp6n8L7K15j73j46K82j67J14K7q0l4M6j52J10j20J25
7594Ek05K81MM6k24M7m5J64n6R%l7l6J13Q8k62M8O8j26J72j58Q6j19K65j84j7
7620g3K56k31J45j93J95N0q7k8o0l8P9j13k4Q3K1K0O3j7R3j85LR0q5O3p3j0k4
7647h0M3J5n6p%j5J66j28N9n4mJ8J01L7j04J92n6k24J02q7K1J53k53J65Q4mJ1
7674I5m8j92J16N5PJ10j83mj8k3Q0K0J03pj02M8k83L50k31J49J04j39k8m4M1O6
$$ plain form
7700 42 80 -168 -29 -73 54 75 88 -88 -38 15 102 4 52 -85 16 55 54 -136 72 46 136 33 -189 -120 -56 -156
7726 -156 107 -7 -87 130 -29 95 -167 -46 94 159 -3 106 29 -57 -106 59 -21 90 11 76 75 -5 140 -44
7750 -44 -94 46 -126 -110 -131 33 -19 50 -13 36 67 158 16 93 66 210 -199 -105 -23 62 24 -102 155 -129 46
7775 46 -10 35 49 -41 -64 86 54 27 -89 -173 117 74 4 -66 -5 143 -46 -46 15 -81 -114 46 124 75 48 -15 -49 -36
7803 -36 88 72 200 166 95 24 3 64 -8 -60 34 150 176 -112 -100 60 -92 55 -142 -34 16 87 -177 -32 11
7828 11 -199 -13 -97 -31 -56 -34 -95 -81 8 -55 50 54 196 -85 -236 -42 18 68 -55 135 -49 -57 -13 33 11 -180
7854 -180 -22 -84 -64 -24 8 114 -16 -126 111 50 -37 -36 65 -95 -20 -117 121 111 98 -59 32 21 78 25 -42 89
7880 89 43 0 -111 46 -129 55 43 80 -90 -145 -58 -103 -30 -143 31 -78 162 78 5 142 153 -46 30 -155
$$ packed form
7700D2L8k48J39m4J27K1J3j76N0N3Q7r8M8j37J01L9jj90K08k6R0j03k22O9O4j00
7726a56K63j14q0K17j59J24k62J21J40O5j62J09p7q6m9J65q0J11p9O5jq0J45j84
7750d4n0J40j72J6k1J64n2O9o3M9L1R1j42P7k7J44m09R4Q2Q5l8j26K57k84J75
7775D6n6M5J4r0k3J50l2k7j16q4K90m3p0p0O1J48j89%O1r6l3J60P8m9k7o3l4J3
7803c6J24j6J28l4p1p1k1O1p2n2R4J16K6k88J2J60j52J47j97J08N0P1k64J45M3
7828A1k10J86q4O6k5K2o1J4Q9o3J05MJ42k81j51J94O0N0j23J90j84qM4M6k2j91
7854a80J58o2K0M0L2J06j30j10K37o1q7JJ01j60P5r7K38j0j3j57R1j1N7n3o7J31
7880H9m6m3j11J57j75J84j2L7j70n5Q7m5P3j13J74j09K40q4p3J37J1j99P6j85
$$ plain form
7904 -155 39 85 -13 -72 -71 2 63 126 -46 -49 235 -39 -27 114 -7 66 181 -11 23 0 -131 38 43 82 77 -163
7930 -163 85 25 -3 57 180 103 -33 52 -71 128 -80 -57 -64 -79 -7 184 -77 112 -139 -131 68 -124 79 149
7954 149 32 83 65 -36 88 -42 8 43 1 29 -124 34 -147 -74 121 -25 -198 168 85 47 -88 -57 -3 62
7978 62 165 -18 7 -114 -55 -56 32 -90 31 74 -51 -158 67 36 17 3 80 -91 10 -37 91 11 -99 -62 -111
8003 -111 -42 -23 -88 -230 -89 -39 94 52 50 -116 40 10 -49 89 -62 0 -51 47 58 -2 -52 -25 -65 99 75 97
8029 97 16 29 -1 163 -131 -76 9 -70 -74 109 -13 -84 9 141 -24 45 41 -19 -85 -106 -143 116 88 31 -88 110 14
8056 14 151 -31 -61 17 119 94 -48 -11 17 2 -45 52 218 24 -103 31 71 6 113 53 -70 -39 -91 -10 -11 -45
8082 -45 59 -39 -135 -141 -194 92 17 97 -98 -102 -108 -115 5 -29 10 29 100 76 67 148 9 121 -47 26 -17 -59 -68 -122 -1
$$ packed form
7904a55J94M6r8n9JP3O1O3j72lK84k74J2J41j21P3J15j92L4k3j31J69NL9nk40
7930a63K48o0k8O0J23p7j36Q5j23J99k08K3pj5P2J91k61J89k51QJ99j92K03P0
7954A49j17N1j8j01J24j30N0L5m2K8j53J58j81P3J95j46j73L66q3l8j35L1N4O5
7978F2J03j83K5j21N9jQ8j22J21M3j25j07K25l1j9j4P7j71J01m7J28q0j10L7m9
8003a11O9J9o5j42J41N0J33m2kj66J56l0n9J38j51O2n1R8J1o0n0K7m0J64k4K2
8029I7q1J3l0J64k94N5Q5p9mJ83j22p1R3J32j65O9mo0o6k1l7K59k8n7j19J98r6
8056A4J37j82l0P8J02k5j42L7K8j5m7R7J66j94j27J34M0o5J07o0j23L1n2Q1jl4
8082d5J04r8r6on3K86p5Q0j95mopJ20l4L9J9P1k4rQ1j39J12j68P3m3m2rn4J21
$$ plain form
8111 -1 15 129 46 11 -110 107 -79 33 -24 76 79 52 7 -34 7 44 58 -82 -90 -78 52 -114 -158 63 -52 -21
8137 -21 -89 24 -18 80 -68 -25 4 17 61 9 -140 207 67 -13 107 62 109 131 25 118 -80 182 44 55 -36
8162 -36 -155 26 -23 46 141 97 3 -109 8 161 -47 64 -57 37 -49 159 96 -68 -90 45 -57 28 152 -69
8186 -69 23 130 -86 69 95
$$ packed form
8111aJ6J14q3l5j21K17j86J12n7J00Lk7m5m1M1L7J4j40qJ2J30j66m4K21j15L1
8137b1o8J13m2R8j48M3K9J3M4n2j49L47j40q0J20m5M7K2j06R3j98K62j38J1r1
8162c6j19J81m9O9R5m4r4j12J17J53k08J11j21R4q6K08o3j64k2J35j02Q5J24k21
8186f9R2J07k16J55K6
8191I5
$$ Imaginary data points
##PAGE= N=2
##DATA TABLE= (X++(I..I)), XYDATA
$$ plain form
0 0 0 0 0 0 0 0 0 0 8 -8 8 -8 16 -16 22 -24 32 -40 48 -56 65 -80 96 -112 134 -154 181 -208 241 -277 318
31 318 -359 410 -463 524 -591 663 -743 830 -924 1030 -1144 1270 -1406 1555 -1717 1896 -2091
48 -2091 2304 -2538 2795 -3080 3395 -3745 4139 -4581 5086 -5662 6334 -7125 8074 -9236
62 -9236 10698 -12599 15191 -18935 24859 -35679 61882 -262922 -162453 178421 -312447 -125999
74 -125999 132332 -73085 -28236 191508 -105381 -53240 266930 62839 -86166 232050
84 232050 146520 -34183 192682 197107 -38063 68942 61106 -137497 -51129 -27031 -240174
95 -240174 -131629 14677 -144465 -125396 27327 -82801 -81108 60331 -53812 -105332 87090
106 87090 72945 -7772 121998 140140 63816 153634 142870 17379 74855 88801 -60002
$$ packed form
0@%%%%%%%%Qj6J6j6K4l2L8m6N6p2Q8j04J21j45J76k08K46k88L35l89M49n18N95
31C18o77P69q73R87j115J254j406J573j754J954k174K414k676K961l272L613l987
48b091M395m842N333n875O475p140P884q720R667j0748J1996j3459J5199j7310
62i236J9934k3297K7790l4126M3794o0538R7561l24804J00469L40874m90868J86448
74a25999K58331k05417M4849K19744k96889N2141L20170k04091j49005L18216
84B32050q5530j80703K26865M425k35170J07005p836j98603Q6368K4098k13143
95b40174J08545J46306j59142J9069J52723j10128J693J41439j14143n1520J92422
106H7090j4145q0717J29770J8142p6324Q9818j0764j25491N7476J3946j48803
$$ plain form
117 -60002 -43525 20164 -92710 -112900 -15224 -59841 -114938 -63048 -68249 -89628 -45344 -53953
129 -53953 -72566 812 44271 21968 44576 90147 98568 86585 63105 56706 68738 44541
141 44541 15409 25751 18786 -7661 -11120 -29415 -56073 -51693 -65091 -93311 -74277 -58928 -75192
154 -75192 -51610 -15036 -11636 13671 44851 36611 50732 75029 45234 35426 66441 51424 33045
167 33045 57148 42465 9524 20335 -237 -47555 -36251 -33008 -73846 -65738 -40731 -61622
179 -61622 -50179 -13301 -24263 -17628 20502 6271 -6101 33069 33690 12874 44997 58925 34450
192 34450 48833 57748 23244 20228 27877 -11914 -29917 -13169 -34726 -53887 -31236 -32670 -48226
205 -48226 -28196 -22680 -37721 -20042 -5374 -17574 -2451 23038 17159 23730 47375 42086 35371
$$ packed form
117f0002J6477O3689j12874k0190R7676m4617n5097N1890n201k1379M4284q609
129e3953j8613P3378M3459k2303K2608M5571Q421j1983k3480o399J2032k4197
141D4541k9132J0342o965k6447l459j8295k6658M380j3398k8220J9034J5349j6264
154g5192K3582L6574L400K5307L1180q240J4121K4297k9795r808L1015j5017j8379
167C3045K4103j4683l2941J0811k0572m7318J1304L243m0838Q108K5007k0891
179f1622J1443L6878j0962O635L8130j4231j2372L9170O21k0816L2123J3928k4475
192C4450J4383Q915l4504l016P649l9791j8003J6748k1557j9161K2651j434j5556
205d8226K0030N516j5041J7679J4668j2200J5123K5489n879O571K3645n289o715
$$ plain form
218 35371 46278 33595 15257 21432 11956 -10764 -5165 -2232 -21570 -21617 -13729 -27747 -32215 -23471
232 -23471 -32819 -36137 -19325 -16887 -17528 3284 15643 12719 23616 32112 22948 23339 27493 15763
246 15763 12503 19756 11956 4659 11110 5177 -7587 -6851 -12272 -26576 -26021 -23152 -30791 -26050 -13217
261 -13217 -12521 -7818 5774 6464 5243 13490 12650 6814 12540 14858 11578 17075 19717 14015 14710 13539
277 13539 1225 -4621 -5489 -15224 -20166 -15530 -17485 -17677 -9221 -7971 -8931 -2241 -1219 -5368 -920
292 -920 2378 -498 3866 9997 9910 12909 16056 11706 10515 9968 1747 -3203 -1860 -5635 -7535 -2992
308 -2992 -3593 -5107 -546 -2808 -9122 -7149 -6862 -12006 -9521 -4297 -4111 850 7882 7577 9301 13017
324 13017 8633 4309 5163 1722 -2344 98 774 -343 3476 3856 154 1367 166 -7033 -8692 -6896
$$ packed form
218C5371J0907j2683j8338O175r476k2720N599K933j9338m7P888j4018m468Q744
232b3471r348l318J6812K438o41K0812J2359k924J0897Q496r164L91M154j1730
246A5763l260P253p800p297O451n933j2764P36n421j4304N55K869p639M741J2833
261a3217O96M703J3592O90j221Q247q40n836N726K318l280N497K642n702O95j171
277A3539j2314n846q68r735m942M636j955j92Q456J250r60O690J022m149M448
292i20L298k876M364O131q7K999L147m350j191n47q221m950J343l775j900M543
308b992o01j514M561k262o314J973K87n144K485N224J86M961P032l05J724L716
324A3017m384m324Q54l441m066K442O76j117L819L80l702J213j201p199j659J796
$$ plain form
340 -6896 -10073 -9814 -4420 -2548 336 5892 5030 3083 5211 2828 -3580 -4093 -3011 -3859 -1266 2058
356 2058 3731 8069 9556 5315 4142 4276 -1640 -5935 -5121 -6587 -6558 -2329 -1585 -739 4736 3674 -995
373 -995 69 -808 -6977 -7583 -5421 -6037 -2215 2592 2588 6900 11757 7085 4041 6504 2743 -1520 622
390 622 -70 -281 4892 3817 776 5709 4670 -4332 -5249 -5097 -12199 -13063 -10449 -11839 -6071 1990 822
407 822 3758 11527 7257 2415 6165 3607 -495 3865 3987 2018 8821 9430 2639 5964 6665 -3437
423 -3437 -5386 -3814 -10687 -11268 -7335 -11207 -8948 -320 -3110 -4790 2355 511 -4770 -80 302 -1549
439 -1549 6017 9861 7495 13104 16134 9711 9649 10030 1268 -2326 -1222 -6938 -8913 -5193 -7967 -8998
455 -8998 -4162 -6971 -11295 -7343 -6559 -8100 -3842 -1697 -1485 5849 10511 8821 11515 13941 10230 8500
$$ packed form
340f896l177K59N394J872K884N556q62j947K128k383o408n13J082q48K593L324
356B058J673M338J487m241j173J34n916m295Q14j466K9M229P44Q46N475j062m669
373i95J064q77o169o06K162o16L822M807mM312M857m672l044K463l761m263K142
390F22o92k11N173j075l041M933j039r002r17J52p102q64K614j390N768Q061j168
407H22K936P769m270m842L750k558m102M360J22j969O803O09o791L325P01j0102
423c437j949J572o873n81L933l872K259Q628k790j680P145j844n281M690L82j851
439a549P566L844k366N609L030o423o2L81q762l594J104n716j975L720k774j031
455h998M836k809m324L952P84j541M258K145K12P334M662j690K694K426l711j730
$$ plain form
471 8500 7837 2813 911 2955 1374 -674 -690 -3156 -4623 -4805 -9347 -13972 -12514 -11120 -11711 -9347
487 -9347 -5316 -1194 3218 5651 6430 8559 10086 8431 7241 8228 6905 4957 6283 7664 5537 3331
503 3331 1344 -2637 -6359 -8101 -11642 -13813 -10861 -8997 -9432 -6267 -2676 -1750 773 3642 1794 2228
519 2228 6285 6128 5111 8678 10097 9535 11829 9725 4447 3793 1526 -5354 -7540 -7772 -10314 -9804
535 -9804 -7844 -9552 -8430 -4786 -5974 -6010 -2372 -1521 -1189 2806 4515 6097 11295 12575 11147 12457
551 12457 10580 5109 3262 1454 -2870 -3343 -2840 -6408 -6557 -3791 -6375 -8771 -6632 -7336 -10264 -7930
567 -7930 -5532 -5703 -1337 4872 5709 7334 11944 11817 8593 8838 8017 3015 2758 4280 156 -953 2931
584 2931 -210 -5205 -2635 -4943 -11902 -10478 -8802 -13097 -9735 -3088 -4851 -1452 7064 5636 3837
$$ packed form
471H500o63n024j902K044j581k048j6k466j467j82m542m625J458J394n91K364
487i347M031M122M412K433P79K129J527j655j190R87j323j948J326J381k127k206
503C331j987l981l722j742l541k171K952J864m35L165L591R26K523K869j848M34
519B228M057j57j017L567J419n62K294k104n278o54k267o880k186k32k542N10
535i804J960j708J122L644j188l6L638Q51L32L995J709J582N198J280j428J310
551A2457j877n471j847j808m324m73N03l568j49K766k584k396K139p04k928K334
567g930K398j71M366O209Q37J625M610j27l224K45q21n002k57J522m124j109L884
584B931l141m995K570k308o959J424J676m295L362O647j763L399Q516j428j799
$$ plain form
599 3837 9555 7748 2977 7042 6901 2259 6710 8203 2578 4458 5685 -1635 -3145 -2782 -9761 -10460
615 -10460 -6692 -11419 -10436 -2244 -4309 -5908 2934 2519 -2932 3491 5002 -1124 4592 8751 2572
630 2572 6767 13183 5064 2288 8212 2051 -5468 -1241 -2775 -8362 -4114 -3385 -8281 -4078 -798
645 -798 -6517 -5464 -550 -3786 -4735 483 671 1397 6884 7038 5649 9018 7758 2419 3033 2847 -1808
662 -1808 -1264 474 -2432 -2172 505 -2861 -4746 -1484 -4091 -8284 -5376 -3527 -5207 -1721 2008 1406
678 1406 4794 7663 4197 3007 6118 2261 -1563 1832 2044 -1037 1783 3707 454 839 1434 -3571
694 -3571 -4291 -2748 -6937 -7997 -3056 -2826 -3771 1021 2918 1591 3916 3541 35 1234 2855 26
710 26 693 4117 2188 2002 4437 1960 136 1730 -906 -4884 -3305 -3697 -6225 -3249 -407 -1928
$$ packed form
599C837N718j807m771M065j41m642M451J493n625J880J227p320j510L63o979o99
615a0460L768m727R83Q192k065j599Q842m15n451O423J511o126N716M159o179
630B572M195O416q119k776N924o161p519M227j534n587M248P29m896M203L280
645g98n719J053M914l236r49N218J88P26N487J54j389L369j260n339O14j86m655
662a808N44J738k906K60K677l366j885L262k607m193K908J849j680L486L729o02
678A406L388K869l466j190L111l857l824L395K12l081K820J924l253L85N95n005
694c571p20J543m189j060M941K30r45M792J897j327K325l75l506J199J621k829
710B6O67L424j929j86K435k477j824J594k636l978J579l92k528K976K842j521
$$ plain form
726 -1928 24 2181 -727 -968 1393 -934 -1620 2051 1717 572 3871 4134 2010 3833 4062 220
742 220 213 944 -2995 -3377 -879 -2133 -2768 416 -187 -2130 -616 -1412 -3778 -1647 -511 -2342 -262
759 -262 3003 1636 1635 3945 2581 1221 2103 70 -1594 239 151 -1939 407 2408 391 727 1691
776 1691 -574 -1485 -957 -3106 -3535 -1049 -1475 -2095 728 1619 218 401 1140 -362 -473 89 -913 -328
794 -328 1534 1412 1456 3209 2820 899 1073 685 -1527 -1550 -1148 -1453 -998 -11 -663 -250 1461 30 -1731
813 -1731 -945 -941 -2288 -1911 -1079 -728 656 1815 1270 1268 2283 1053 112 755 508 -83 590 1411 880 1077
833 1077 1019 -70 -204 -392 -2215 -2810 -1975 -1865 -1884 -699 -26 101 692 492 -440 -11 -92 -634 70 1124
853 1124 1187 1319 2645 3134 2095 1277 313 -75 -945 -2060 -2645 -1872 -847 -661 -771 -609 -238 -285 -1523
$$ packed form
726a928J952K157k908k41K361k327o86L671l34j145L299K63k124J823K29l842
742B20pP31l939l82K498j254o35L184o03j943J514p96k366K131J136j831K080
759b62L265j367jK310j364j360Q82k033j664J833q8k090K346K001k017L36R64
776A691k265r11N28k149m29K486m26o20K823Q91j401J83P39j502j11N62j002N85
794c28J862j22M4J753l89j921J74l88k212k3M02l05M55R87o52M13J711j431j761
813a731P86Mj347L77Q32L51J384J159n45kJ015j230r41O43k47n91O73Q21n31J97
833A077n8j089j34j88j823n95Q35J10j9J185O73J27N91k00r32M29q1n42P04J054
853A124O3J32J326M89j039q18r64l88q70j115n85P73J025J86j10J62L71m7j238
$$ plain form
872 -1523 -1763 -1372 -1178 -727 198 1064 1957 2967 3119 2748 2766 1571 -228 -321 -803 -1535 -1753 -960 -547 85
892 85 302 -878 -973 -265 -1987 -3339 -2022 -1195 -1541 -75 1537 1795 3082 3427 2342 2145 2477 437
910 437 -557 459 38 -1105 -89 259 -326 128 -815 -2690 -1888 -1949 -3832 -3384 -1184 -1184 -811 1605 1622
929 1622 1724 3189 2386 993 2181 2330 234 466 1966 1272 642 833 9 -479 -647 -2755 -3437 -2331
947 -2331 -2798 -3449 -2119 -955 -489 136 254 521 1584 1405 368 1085 2484 2310 1963 2536 3083 2780
965 2780 1332 133 -61 -758 -2131 -3017 -2651 -2182 -1757 -2094 -1972 -479 -568 -1919 -1213 -289 -633 -1 859
984 859 1014 2789 4042 2362 2536 4130 1997 -194 910 -248 -2413 -570 -1182 -2889 -515 274
1000 274 -3219 -1764 150 -3236 -3486 -449 -1643 -1618 2160 1038 381 4253 3166 107 2878 3314
$$ packed form
872a523k40L91J94M51R25Q66Q93J010J52l71J8j195j799r3m82p32k18P93M13O32
892H5K17j180r5P08j722j352J317Q27l46J466J612K58J287L45j085j97L32k040
910D37r94J016m21j143J016L48n85M54r43j875Q02o1j883M48K200%L73K416J7
929A622J02J465q03j393J188J49k096K32J500o94o30J91q24m88j68k108o82J106
947b331m67o51J330J164M66O25J18K67J063j79j037P17J399j74l47N73N47l03
965B780j448j199j94o97j373q86L66M69M25l37J22J493q9j351P06R24l44O32Q60
984H59J55J775J253j680J74J594k133k191J104j158k165J843o12j707K374P89
1000B74l493J455J914l386k50L037j194K5L778j122o57L872j087l059K771M36
$$ plain form
1016 3314 -555 625 1706 -1083 22 1416 -1805 -1142 1261 -2101 -3436 -464 -2375 -3880 -603
1031 -603 -876 -1786 1569 1675 -637 2289 2953 -437 968 2835 280 939 2549 539 425 2007 -526
1048 -526 -2222 157 -1276 -3246 -2262 -1977 -2626 -865 -733 -1056 921 1385 139 293 760 612 911 935
1066 935 1447 2647 2204 1482 2111 1470 -371 -682 -1093 -2176 -1475 -1510 -3179 -1455 -25 -2114 -1497 992
1084 992 -256 -786 715 -430 -645 1810 890 610 3789 3281 894 2570 1884 -1141 270 507 -2763
1101 -2763 -1066 664 -2729 -2188 802 -1786 -2614 370 -1550 -2682 730 -274 -2535 1431 2217 -822
1117 -822 1968 4035 480 1006 3324 71 -162 2348 -708 -1361 2114 -123 -2629 206 -327 -3389
1133 -3389 -1333 -421 -3217 -1191 765 -1721 -373 2282 -125 -482 2518 939 -533 2139 1471 -176
$$ packed form
1016C314l869J180J081k789J105J394l221O63K403l362j335K972j911j505L277
1031f03k73r10L355J06k312K926O64l390J405J867k555O59J610k010j14J582k533
1048e26j696K379j433j970R84K85o49J761J32l23J977M64j246J54M67j48K99K4
1066I35N12J200m43p22O29o41j841l11m11j083P01l5j669J724J430k089O17K489
1084I92j248n30J501j145k15K455r20k80L179n08k387J676o86l025J411K37l270
1101b763J697J730l393N41K990k588q28K984j920j132L412j004k261L966P86l039
1117h22K790K067l555N26K318l253k33K510l056o53L475k237k506K835n33l062
1133c389K056R12k796K026J956k486J348K655k407l57L000j579j472K672o68j647
$$ plain form
1149 -176 1566 1719 -580 1022 1642 -1189 -992 333 -1881 -2449 -263 -1166 -1568 908 483 -1282 330
1166 330 571 -1023 -372 701 -131 398 1645 543 574 1997 1175 4 722 457 -1278 -1196 -694 -1560
1184 -1560 -1036 20 -305 -54 966 42 -898 -99 -420 -1259 -136 644 26 328 1738 1051 579 1520
1202 1520 487 -549 108 -385 -1750 -544 412 -785 -259 968 -175 -657 237 -600 -1286 -84 -316
1219 -316 -1053 736 1151 -36 1224 1968 265 317 1140 -572 -959 461 -422 -848 585 362 -976 331
1237 331 158 -1232 -655 -138 -1278 -546 383 -631 -114 1523 478 226 1182 623 -550 249 248 -505 302
1256 302 488 -472 522 908 -641 -582 318 -699 -1236 -539 -712 -690 41 -281 -522 817 507 -407 249 489
1276 489 -304 -356 181 -133 423 760 112 319 1129 324 -411 336 74 -525 -638 -131 -444 81 199 -387
$$ packed form
1149a76J742J53k299J602O20k831J97J325k214n68K186r03m02K476m25j765J612
1166C30K41j594O51J073q32N29J247j102L1J423q22j171P18k65j735Q2N02q66
1184a560N24J056l25K51J020r24r40P99l21q39J123P80o18L02J410o87m72R41
1202A520j033j036O57m93j365J206R56j197N26J227j143m82Q94q37o86J202k32
1219c16p37J789M15j187J260P44j703N2Q23j712l87J420q83m26J433k23j338J307
1237C31j73j390N77N17j140P32R29j014N17J637j045k52R56n59j173P99jp53Q07
1256C02J86r60R94L86j549N9R00j017n37O97j73K2P31l22k41J339l10r14O56K40
1276D89p93n2N37l14N56L37o48K07Q10q05p35P47k62n99j13N07l13N25J18n86
$$ plain form
1296 -387 95 590 -385 -581 141 -227 -472 -156 -126 -59 305 88 -73 637 761 -60 -62 251 35 -60 -123 -167
1318 -167 301 309 69 119 562 196 -56 -249 -240 -175 -577 -549 -442 164 -77 -38 -4 228 133 -175 -464 -75 190
1341 190 117 -133 194 490 345 386 120 362 336 -179 -216 10 -54 -378 -231 87 -48 -64 -221 -244 180 -13
1363 -13 -468 -365 256 265 96 42 141 324 476 -50 -116 492 427 -117 203 245 74 -109 -157 -289 -278 -260 -570 -288
1387 -288 211 88 -303 270 288 56 47 -189 7 143 -105 -209 179 245 172 150 207 184 -65 -436 -368 -250 -257 -668
1411 -668 -266 60 45 179 393 414 547 212 -48 -21 -59 -158 -132 198 141 87 444 208 -2 414 -518 -863 -365
1434 -365 -367 -924 -346 106 -259 248 362 189 349 592 -56 -196 479 33 83 658 371 104 605 469 -130
1455 -130 312 18 -588 -208 -185 -854 -600 -76 -484 -468 194 -226 -198 494 49 -256 343 390 -144 549 808
$$ packed form
1296c87M82M95r75j96P22l68k45L16L0O7L64k17j61P10J24q21kL13k16r5o3m4
1318a67M68Qk40N0M43l66k52j93RO5m02K8J07O06k41L9L4K32r5l08k89L89K65
1341A90p3k50L27K96j45M1k66K42k6n15l7K26o4l24J47L18j35j6j57k3M24j93
1363a3m55J03O21Rj69n4R9J83J52n26o6O08o5n44L20M2j71j83m8j32J1J8l10K82
1387b88M99j23l91N73J8k32rk36J96J36k48j04L88O6p3k2N7k3k49l71O8J18pm11
1411f68M02L26j5J34K14K1J33l35k60K7l8r9K6L30n7n4L57k36k10M16r32l45M98
1434c65kn57N78M52l65N07J14j73J60K43o48j40O75m46N0N75k87k67N01j36n99
1455a30M42k94o06L80K3o69K54N24m08J6O62m20K8O92m45l05N99M7n34O93K59
$$ plain form
1476 808 235 523 849 130 170 422 -364 -256 234 -435 -774 -9 -369 -987 -80 113 -583 127 302 -224
1496 -224 55 500 -47 -135 473 -7 22 336 103 118 437 503 -137 251 195 -438 -204 -141 -609 -589 -146 -347
1518 -347 -294 202 98 -118 460 147 -247 97 54 -145 71 283 108 152 707 160 -94 218 -42 -515 -487
1539 -487 -534 -446 -131 -61 85 65 434 263 191 43 68 -45 -149 166 281 36 81 643 23 57 10 -663 -436
1562 -436 -223 -678 -726 78 67 -172 174 173 -235 -38 -77 -586 95 408 -144 253 864 418 446 761 185 -161
1584 -161 158 -565 -739 -69 -172 -568 78 307 -321 9 45 -607 -421 -233 -715 -369 616 114 386 1107
1604 1107 718 347 656 161 -386 209 -158 -619 88 515 -226 -87 510 -28 -323 -144 -770 -482 -294 -514
1624 -514 -669 272 377 27 384 611 321 361 174 -172 -3 162 -44 77 487 280 -44 240 88 -115
$$ packed form
1476H08n73K88L26p19M0K52p86J08M90o69l39P65l60o18R07J93o96P10J75n26
1496b24K79M45n47q8O08m80K9L14k33J5L19O6o40L88n6o33K34O3m68K0M43k01
1518c47N3M96j04k16N78l13l94L44m3j99K16K12j75M4N55n47k54L12k60m73K8
1539d87m7Q8L15P0J46k0L69j71p2j48K5j13j04L15J15k45M5N62o20L4m7o73K27
1562d36K13m55m8Q04j1k39L46jm08J97l9n09O81L13n52L97O11m46K8L15n76l46
1584a61L19p23j74O70j03l96O46K29o28L30L6o52J86J88m82L46R85n02K72P21
1604A107l89l71L09m95n47N95l67m61P07M27p41J39N97n38k95J79o26K88J88k20
1624e14j55R41J05l50L57K27k90M0j87l46J69J65k06J21M10k07l24K84j52k03
$$ plain form
1644 -115 -60 -459 -349 -169 -68 -238 -82 145 53 -44 128 19 -19 140 32 117 296 174 -135 55 154 161 -138
1667 -138 -185 -79 -5 -82 69 104 98 248 -169 -55 -38 7 -239 -257 167 325 116 154 473 83 184 -184 -428
1690 -428 -187 -227 -612 -314 66 71 115 125 188 -110 80 -92 -109 33 -181 -100 27 340 181 382 394 169 125
1713 125 242 -300 -461 -275 -588 -546 6 79 -5 282 38 -237 12 67 -535 -257 78 -255 -237 357 319 296
1735 296 680 214 -58 302 24 -392 -104 70 -290 -198 100 75 -268 93 -232 -295 37 -133 -144 124 75 -235
1757 -235 145 283 -19 151 295 -110 -48 138 78 -165 201 18 -136 42 -138 -43 -41 137 -137 61 257 102
1779 102 74 22 159 -125 45 -99 -181 8 164 -142 48 86 -210 -192 101 -237 -275 -182 -138 -101 101 291 48
1802 48 409 525 235 243 425 247 91 143 131 -68 115 61 -157 59 -42 -301 -232 -140 -467 -561 -138 -321 -203
$$ packed form
1644a15N5l99J10J80J01j70J56K27r2r7J72j09l8J59j08Q5J79j22l09J90R9Pk99
1667a38m7J06P4p7J51L5oJ50m17J14J7M5k46j8M24J58k09L8L19l90J01l68k44
1690d28K41m0l85K98L80NM4J0O3k98J90j72j7J42k14Q1J27L13j59K01J2k25m4
1713A25J17n42j61J86l13M2N52P3q4K87k44k75K49N5o02K78L35l33J8N94l8k3
1735B96L84m66k72L60k78m16K88J74l60R2K98k5l43L61l25o3L32j70j1K68m9l10
1757b35L80J38l02J70J44m05O2J86o0k43L66j83j54J78j80R5KJ78k74J98J96j55
1779A02k8n2J37k84J70j44q2J89J56l06J90L8k96J8K93l38l8R3M4L7K02J90k43
1802D8L61J16k90QJ82j78j56N2j2j99J83n4k18K16j01k59O9R2l27r4M23j83J18
$$ plain form
1825 -203 188 24 46 146 256 123 362 247 282 354 394 158 201 382 105 53 -28 -242 -384 -203 -337 -519
1847 -519 -220 -323 -372 -221 -276 -292 -217 119 59 74 349 328 306 613 449 241 338 273 76 10 -152 -170 29 -91
1871 -91 -310 -289 -222 -293 -416 -158 -538 -492 -163 -185 100 73 240 264 488 558 301 323 316 282 123 80 161 34 21
1896 21 -224 -189 -5 -226 -298 -257 -393 -301 -221 -357 -271 128 130 163 364 380 379 412 189 124 378 85 -279 -38 46
1921 46 -88 -94 -329 -273 -146 -126 -358 -557 -111 -313 -270 25 268 44 224 384 308 521 454 227 213 462 189
1944 189 46 131 -192 -252 -204 -168 -262 -255 -396 -704 -248 -233 -320 -361 -17 183 84 324 297 415 697 449 414 337 465
1969 465 244 60 5 19 -198 -64 -176 -225 -196 -455 -535 -451 -315 -532 -504 -146 137 -58 84 222 471 443 419
1992 419 258 573 603 151 245 435 189 -52 -30 -281 -149 -256 -445 -499 -275 -298 -660 -387 -129 -146 -20 -81
$$ packed form
1825b03L91j64K2J00J10j33K39j15L5P2M0k36M3J81k77n2q1k14j42J81j34j82
1847e19K99j03m9J51n5j6P5L36o0J5K75k1k2L07j64k08R7o5j97o6j62j8J99j20
1871i1k19K1O7p1j23K58l80M6L29k2K85k7J67K4K24P0k57K2pl4j59m3Q1j27j3
1896B1k45L5J84k21p2M1j36R2Q0j36Q6L99KL3K01J6jL3k23o5K54k93l64K41Q4
1921D6j34ok35N6J27K0k32j99M46k02M3K95K43k24J80J60p6K13o7k27j4K49k73
1944A89j43Q5l23o0M8L6r4Pj41l08M56J5q7m1L44K00r9K40k7J18K82k48l5p7J28
1969D65k21j84n5J4k17J34j12m9K9k59q0Q4J36k17K8L58K83j95J42J38K49k8k4
1992D19j61L15L0m52R4J90k46k41K2k51J32j07j89n4K24k3l62K73K58j7J26o1
$$ plain form
2014 -81 -29 173 407 356 352 534 371 137 352 512 -40 109 -7 -96 -3 -38 -266 -227 20 -403 -562 -377 -334
2037 -334 -452 -146 1 12 182 177 206 230 342 91 157 427 306 -57 129 27 -136 -121 208 -210 -199 -115 -349
2060 -349 -341 -96 -159 -117 122 -174 -110 327 70 -39 305 330 -2 236 165 -89 107 131 -47 98 42 -201 -202 -167
2084 -167 -203 -337 -164 -248 -312 -9 -59 -59 56 356 99 196 362 252 177 434 313 242 338 241 -48 63 50 -415
2108 -415 -317 -235 -245 -396 -131 -104 -242 -52 20 6 34 84 4 170 351 250 130 313 435 353 288 126 14 14
2132 14 -22 -249 -98 -87 -161 -189 -150 -221 -197 -150 -116 -162 -228 -45 -18 50 114 308 421 483 289 99 268 1 107
2157 107 92 -1 24 47 -188 -78 -79 -313 -168 -338 -236 -217 -18 -274 -41 94 203 131 15 287 -54 117 71
2180 71 188 82 -79 135 113 235 -20 -84 -96 21 83 -48 -28 -93 -43 -115 -6 -44 -13 92 -63 -70 157 -9
$$ packed form
2014h1N2K02K34n1mJ82j63k34K15J60n52J49j16q9R3l5k28L9K47m23j59J85M3
2037c34j18L06J47J1J70nK9K4J12k51O6K70j21l63J86j02j63J5L29m18J1Q4k34
2060c49QK45o3M2K39k96O4M37k57j09L44K5l32K38p1k54J96K4j78J45n6k43jL5
2084a67l6j34J73q4o4L03n0%J15L00k57R7J66j10p5K57j21p1R6r7k89J11j3m65
2108d15R8Q2j0j51K65K7j38J90P2j4K8N0q0J66J81j01j20J83J22q2o5j62j12%
2132A4l6k27J51J1p4k8L9p1K4M7L4m6o6J83K7O8O4J94J13O2j94j90J69k67J06
2157A07j5r3K5K3k35J10jk34J45j70J02J9J99k56K33J35J09p2j16K72l41J71m6
2180G1J17j06j61K14k2J22k55o4j2J17O2j31K0o5N0p2J09l8L1J05j55pK27j66
$$ plain form
2204 -9 -162 -68 133 -19 82 109 -19 -52 -117 -154 -13 -26 9 -65 230 185 -18 23 15 -60 11 96 -85 12 136 63
2230 63 43 94 83 -183 -139 9 -60 74 -150 -163 -171 -23 -135 -66 -104 97 271 12 -25 -6 181 -79 103 -49
2254 -49 105 -4 44 160 117 39 -72 -141 -16 10 -196 -117 -10 -67 -216 27 -27 29 228 27 -46 111 10 -18
2278 -18 -19 48 11 85 4 135 40 17 -36 63 -15 -71 -191 -155 -77 -43 -291 61 8 1 109 -60 -23 -139 -13 -44 -3
2305 -3 121 33 -22 9 92 59 -23 161 43 86 131 -75 36 7 106 -161 221 138 55 108 168 -42 97 101 -96 -50
2331 -50 -9 -102 -178 -123 -78 14 -100 -135 -192 -55 -3 50 -69 23 -111 -116 148 130 177 195 163 265 263 14 75 -29 143
2358 143 124 -146 -53 -12 -205 -82 -179 -306 -108 -263 -216 -162 -83 28 113 45 105 182 160 67 123 250 100 141 52
2383 52 -71 111 -65 80 -2 -80 -19 -148 -81 -21 -199 -134 -301 -15 -31 -166 -42 -19 98 -167 -17 225 85
$$ packed form
2204ij53R4K01j52J01K7j28l3o5l7J41j3L5p4K95m5k03M1qp5P1Q5j81R7J24p3
2230F3k0N1j1k66M4J48o9J34k24j3qJ48j12O9l8K01J74k59l7J9J87k60J82j52
2254d9J54j09M8J16m3p8j11o9J25K6k06P9J07n7j49K43n4N6J99k01p3J57j01k8
2278a8jO7l7P4q1J31r5k3n3R9p8n6j20L6P8L4k48L52n3pJ08j69L7j16J26l1M1
2305cJ24q8n5L1Q3l3q2J84j18M3M5k06J11k9R9k67L82q3q3N3O0k10J39Mj97M6
2331e0M1r3p6N5M5R2j14l5n7J37N2N3j19R2j34nK64j8M7J8l2J02kk49O1j04J72
2358A43j9k70R3M1j93J23r7j27J98j55M7N4P9J11Q5o8O0P7k2r3N6J27j50M1q9
2383E2j23J82j76J45q2p8O1j29O7O0j78O5j67K86j6j35J24K3J17k65J50K42j40
$$ plain form
2406 85 84 111 170 9 -25 107 94 -15 112 -54 51 -151 31 -48 71 38 -178 -121 -31 102 -137 -109 85 73
2430 73 -107 12 227 -31 185 47 1 95 -42 16 -157 -233 -40 64 -132 -191 -159 -131 106 -105 131 46 -72
2453 -72 106 -27 -48 31 79 83 125 -8 47 49 -70 46 -197 74 -86 -68 -106 42 -94 -102 15 204 210 -100 -177 161
2479 161 162 -20 152 324 241 29 115 134 -80 -80 -72 -55 -124 -154 -80 -21 -185 120 0 -294 -244 -52 -81 32 2 81
2505 81 170 43 201 52 177 120 79 174 30 81 185 -27 39 37 127 -222 48 21 -53 -156 -62 25 25 -39 235 -172
2531 -172 -30 -6 -70 115 250 -51 -164 174 119 182 306 121 4 47 79 -108 -29 59 -165 108 -73 -27 -25 72
2555 72 -99 -37 19 -183 -155 22 92 -23 -60 49 141 107 23 -96 -8 -23 117 249 68 0 25 67 71 4 129 -92
2581 -92 -148 -13 80 -62 34 71 -28 -113 -212 -194 72 65 -97 -157 196 -20 -39 -17 -70 186 -77 -166 34 8 61 34
$$ packed form
2406H5jK7N9j61l4J32j3j09J27j66J05k02J82p9J19l3k16N7R0J33k39K8J94j2
2430G3j80J19K15k58K16j38m6R4j37N8j73p6J93J04j96n9L2K8K37k11K36q5j18
2453g2J78j33k1P9M8MM2j33N5Kj19J16k43K71j60J8l8J48j36qJ17J89Ol10p7L38
2479A61Jj82J72J72q3k12Q6J9k14%QJ7o9l0P4N9j64L05j20k94N0J92k9J13l0P9
2505H1Q9j27J58j49J25n7m1R5j44N1J04k12O6kR0l49K70k7p4j03R4Q7%o4K74m07
2531a72J42K4o4J85J35l01j13L38n5O3J24j85j17M3L2j87P9Q8k24K73j81M6KR7
2555G2j71O2N6k02K8J77P0j15l7J09R2l4q4j19Q8j5J40J32j81o8K5M2Mo7J25k21
2581i2n6J35R3j42R6L7r9q5r9J8K66pj62o0L53k16j9K2n3K56k63q9K00k6N3k7
$$ plain form
2607 34 -51 307 74 189 107 90 205 55 52 93 -127 -86 -33 -139 106 -29 -90 -14 -93 70 111 -229 -146 -46 -3
2632 -3 -32 -5 256 190 19 121 101 102 2 5 -54 -30 125 -120 4 -135 -56 -42 -7 -163 2 127 -18 29 161
2657 161 18 -48 3 93 -203 -64 -28 32 33 -28 -113 29 -1 84 -62 152 151 -23 -96 20 18 7 63 20 0 -1 82 5
2685 5 -17 100 16 178 76 8 70 84 -104 95 12 8 -112 62 0 -102 21 -138 53 -47 23 -163 -23 136
2709 136 125 146 170 -1 46 79 9 -58 -10 -70 -154 -108 -98 -41 -25 -24 -14 -325 -140 -79 -8 -30 -96 -114 66 237 148 147
2737 147 227 129 57 111 205 -29 -22 -96 -128 56 169 37 35 -104 -122 -78 31 -124 -164 -18 -77 -27 29 -57 -124 154
2763 154 251 22 270 26 74 211 239 27 -134 65 88 101 -43 -85 -14 59 -37 -72 -116 -45 79 -76 75 -96
2787 -96 14 -138 -98 -48 80 -80 48 40 231 26 -42 221 -14 20 -83 -55 -109 66 -100 -103 -117 59 -142 115
$$ packed form
2607C4q5L58k33J15q2j7J15j50lM1k20M1N3j06K45j35o1P6p9J63M1l40Q3J00M3
2632ck9K7K61o6j71J02k0Jj00Ln9K4J55k45J24j39P9J4L5j56J65J25j45M7J32
2657A61j43o6N1R0k96J39L6O0Jo1q5J42l0Q5j46K14jj74p3J16kj1N6m3k0jQ3p7
2685Ek2J17q4J62j02o8O2J4j88J99q3mj20J74o2j02J23j59J91j00P0j86J40J59
2709A36j1K1K4j71M7L3p0o7M8o0q4M6J0N7J6JJ0l11J85O1P1k2o6j8J80J71q9j
2737A47Q0r8p2N4R4k34Pp4l2J84J13j32kj39j8M4J09j55m0J46n9N0N6q6o7K78
2763A54R7k29K48k44M8J37K8k12j61J99K3J3j44m2P1P3r6l5m4P1J24j55J51j71
2787i6J10j52M0N0J28j60J28qJ91k05o8K63k35L4j03K8n4J75j66lj4J76k01K57
$$ plain form
2811 115 7 -26 -51 -91 -95 120 140 130 177 153 -2 -59 -78 -8 -115 -44 -125 -214 1 43 -69 -174 -2 -33 92 171
2837 171 -143 -6 126 -111 76 239 66 -26 156 -18 -116 -6 -75 -71 -143 3 -62 -71 -134 -18 -159 -182 24 123
2861 123 72 68 122 262 96 54 300 297 -53 146 22 104 115 -72 -80 -293 -78 73 -95 -168 -283 -134 -146 -231 -7
2886 -7 10 -104 -62 152 123 17 -41 -6 48 205 22 -28 221 111 257 27 29 237 51 -28 -134 -42 -10 -94 -216
2911 -216 9 -84 -215 -13 -181 130 122 -7 59 -1 66 24 53 -56 25 101 26 51 -81 35 -110 109 -73 -111
2935 -111 19 23 -73 -227 -7 -44 70 -58 -3 62 104 87 -68 79 -22 107 52 55 -132 39 -14 -69 34 65 -20
2960 -20 56 -61 -89 -23 35 -78 -210 89 172 139 212 77 127 93 38 -94 21 130 -42 -167 -105 62 -60 -57 -153
2985 -153 41 -256 92 -127 -79 64 -117 5 71 113 25 219 80 178 129 -70 -19 174 120 -80 -121 25 9
$$ packed form
2811A15j08l3k5m0mK15K0j0M7k4j55n7j9P0j07P1q1q9K15M2j12j05J72l1J25P9
2837A71l14J37J32k37J87J63j73r2J82j74r8J10o9Mp2J46o5ro3J16j41k3K06R9
2861A23n1mN4J40j66m2K46ll50J99j24Q2J1j87qk13K15J51j68p3j15J49j2q5K24
2886gJ7j14M2K14k9j06n8L5N4J57j83n0K49j10J46k30KK08j86p9j06R2L2q4j22
2911b16K25r3j31K02j68L11qj29O6o0O7m2K9j09Q1P6p5K5j32J16j45K19j82l8
2935a11J30Mr6j54K20l7J14j28N5O5M2j7j55J47j01J29n5Lj87J71n3n5J03L1q5
2960b0P6j17k8O6N8j13j32K99Q3l3P3j35N0l4n5j32J15J09j72j25O2J67j22Lr6
2985a53J94k97L48k19M8J43j81J22O6M2q8J94j39R8m9j99N1J93n4k00m1J46j6
$$ plain form
3008 9 138 -113 -148 -72 -170 -198 -70 -284 -152 -107 -73 -97 48 142 149 237 -10 90 176 -72 -21 -26 65 -9 84 -25 -90
3035 -90 -86 11 53 6 102 -132 -95 -187 -141 -8 -23 -77 -128 -51 -104 348 58 124 244 55 -89 90 -29 27 17 180
3061 180 112 -16 214 30 -116 80 -107 -165 -198 14 78 55 156 21 113 265 -165 65 148 15 37 -1 -184
3084 -184 27 74 -19 9 15 -9 -28 -81 -139 -55 -68 40 -40 -42 -38 35 179 159 -31 -180 101 10 -34 9 62 -161 162
3111 162 -88 39 -119 -137 139 -170 -25 -100 127 143 5 160 -189 236 -1 122 19 225 239 34 147
3132 147 110 -28 -109 15 14 -105 -14 -101 -72 -34 -96 -91 -63 78 89 -10 -4 62 33 2 -27 195 -148 30 146 141 136 137 57
3161 57 -128 -63 26 -160 -60 -206 -84 -65 -54 -6 5 -64 4 -195 93 -43 -22 4 -26 41 -105 7 162 123 -62
3186 -62 105 37 134 -63 20 0 14 63 4 4 -135 61 -197 -175 -66 49 59 -51 12 -18 23 -110 -84 76 103 64
$$ packed form
3008IJ29k51l5P6r8k8J28k14J32M5L4k4J45R4PQ8k47J00Q6k48N1nR1p4R3j09o5
3035i0MR7M2m7R6k34L7r2M6J33j5n4n1P7n3M52k90O6J20j89j44J79j19N6j0J63
3061A80o8j28K30j84j46J96j87n8l3K12O4k3J01j35R2J52m30K30Q3j33K2l8j83
3084a84K11M7r3K8Ok4j9n3n8Q4j3J08q0kMP3J44k0j90j49K81r1m4M3N3k23L23
3111A62k50J27j58j8K76l09J45p5K27J6j38J55l49M25k37J23j03K06J4k05J13
3132A47l7j38q1J24jj19R1q7K9L8o2NK8J41J1r9OO6k9l1k9K22l43J78J16nnJq0
3161E7j85O5Q9j86J00j46J22J9J1M8J1o9O8j99K88j36K1K6l0O7j46J12J55l9j85
3186f2J67o8R7j97Q3k0J4M9n9%j39J96k58K2J09J15J0j10O3l0M1j33K6J60K7l9
$$ plain form
3212 64 -180 -79 145 -109 71 -17 -148 -10 -123 -170 3 -17 -9 0 -2 121 39 -53 69 83 -15 64 27 -81 111
3237 111 112 -161 -20 -9 -51 -104 -165 -146 -27 -294 -53 130 111 -90 1 69 -42 -72 54 -42 104 85 108 24 127
3262 127 90 -31 11 -11 -39 -55 -153 23 -190 128 -1 -181 -167 -63 23 -1 158 -41 184 19 42 -4 -81 82
3286 82 50 306 75 163 -49 -159 30 -107 51 -198 -89 75 -95 -48 -77 -164 90 -203 36 70 -78 -58 148
3309 148 -17 28 -28 232 152 158 -22 65 -21 49 -179 -51 -45 -64 -64 105 -197 -60 -73 -18 -75 36 13 -79 105 -62
3335 -62 -129 -93 -11 -45 66 -60 -2 -112 113 -8 -53 -66 -74 8 94 -19 -56 66 -111 178 23 -60 -11 -22 25 69
3361 69 5 -61 -16 155 53 14 98 72 -98 -44 15 132 -101 156 -75 -40 -32 -107 -158 18 -9 132 65 58 -83 -12
3387 -12 102 4 22 269 102 -49 22 -95 -21 -56 -94 81 -85 -105 32 35 -62 -122 57 24 -17 -13 93 17 12 -36 82
$$ packed form
3212F4k44J01K24k54J80q8j31J38j13m7J73k0QRkJ23q2r2J22J4r8P9l7j08J92
3237A11Jk73J41J1m2n3o1J9J19k67K41J83j9k01R1O8j11l0J26r6J46j9K3q4J03
3262A27l7j21M2k2k8j6r8J76k13L18j29j80J4J04Q6k4J59j99K25j65K3m6p7J63
3286H2l2K56k31Q8k12j10J89j37J58k49J09J64j70M7k9q7K54k93K39L4j48K0K06
3309A48j65M5n6K60q0Oj80Q7q6P0k28J28Oj9%J69l02J37j3N5n7J11k3r2J84j67
3335f2o7L6Q2l4J11j26N8j10K25j21m5j3qQ2Q6j13l7J22j77K89j55q3M9j1M7M4
3361F9o4o6M5J71j02l9Q4k6j70N4N9J17k33K57k31L5Qp5n1J76k7J41o7pj41P1
3387a2J14r8J8K47j67j51P1j17P4l5l8J75j66k0J37Lr7o0J79l3m1MJ06p6nm8J18
$$ plain form
3414 82 -38 76 101 148 -58 113 108 -12 128 9 176 -239 -64 -28 -79 -60 -89 -182 -33 -29 78 42 12 -210 99
3439 99 28 -67 -11 103 73 -103 42 14 17 -35 11 14 98 -236 82 9 -32 -67 38 27 81 -44 12 59 98 -15 124
3466 124 150 64 -120 88 -39 135 10 -13 -101 17 -41 -112 -31 -78 54 75 47 -67 -214 -143 22 -12 75 27 28
3491 28 -13 21 90 -81 148 -179 37 56 61 163 -128 -145 -33 71 -155 3 -95 -50 67 58 -150 14 49 168
3515 168 98 20 69 114 151 -94 27 4 -87 -43 -37 50 -59 -69 -34 -33 -73 43 -122 -47 26 59 -7 128 2 125 -48
3542 -48 78 20 62 177 110 -115 82 121 115 17 -171 96 54 -14 -72 -91 11 -126 -33 80 -62 -83 -43 61 166
3567 166 -53 126 -32 1 59 139 -8 79 16 -83 153 -42 60 116 150 9 -163 21 127 130 -58 33 -32 29
3591 29 161 0 -10 -62 -43 73 37 -168 -82 111 22 -85 -101 65 -140 -8 39 -59 233 34 29 206 -2 -77
$$ packed form
3414H2j20J14K5M7k06J71nj20J40j19J67m15J75L6n1J9k9r3J49MJ07l6l0k22L09
3439I9p1r5N6J14l0j76J45k8Ln2M6LQ4l34L18p3m1l5J05j1N4j25N6M7L9j13J39
3466A24K6q6j84K08j27J74j25k3q8J18n8p1Q1m7J32K1k8j14j47P1J65l4Q7m8J
3491B8m1L4O9j71K29l27K16J9NJ02k91j7J12J04k26J58r8M5J17rk08J64L5J19
3515A68p0p8M9M5L7k45J21k3r1M4OQ7j09j0L5Jm0J16j65P5P3L3o6J35j26J23j73
3542d8J26n8M2J15o7k25J97L9or8j88K67m2o8n8j9J02j37R3J13j42k1M0J04J05
3567A66k19J79j58L3N8Q0j47Q7o3r9K36j95J02N6L4j41j72J84J06Lj88R1o5O1
3591B9J32j61j0n2J9J16l6k05Q6J93q9j07j6J66k05J32M7r8K92j99nJ77k08p5
$$ plain form
3615 -77 154 55 -75 10 79 -61 183 -70 10 39 -30 -71 8 -72 -55 -72 -17 -65 29 -101 23 155 61 -44 93
3640 93 -131 251 -23 7 164 246 48 -5 -114 144 -30 128 26 81 -72 -51 31 -157 -20 -31 -166 -38 116
3663 116 -123 -5 -45 -27 -55 61 4 174 -177 -81 100 59 19 111 -62 160 160 -75 -33 60 -100 142 43 -138
3687 -138 -79 -100 -99 51 -173 -10 19 110 -67 -85 21 -63 4 47 61 37 78 115 -32 73 -73 -178 -10 -155 -110
3712 -110 92 -92 -16 140 -32 26 -149 -86 153 120 -82 -145 72 -114 33 77 -114 33 88 77 -39 -112 -67
3735 -67 80 49 -231 7 -67 69 7 -69 74 -30 138 65 108 -107 7 148 58 143 -172 45 162 27 13
3758 13 285 -40 148 -101 -120 -57 109 183 7 84 -115 11 -61 88 -183 21 -43 -92 -235 8 1 -88 56 -29
3782 -29 -38 149 -185 -168 77 -11 56 0 31 -173 171 66 59 0 -30 -59 56 6 81 167 27 71 2 74 143 -86 88
$$ packed form
3615g7K31r9j30Q5O9j40K44k53Q0K9o9m1P9q0J7j7N5m8R4j30J24J32r4j05J37
3640I3k24L82k74L0J57Q2j98n3j09K58j74J58j02N5j53K1Q2j88J37j1j35J28J54
3663A16k39J18m0J8k8J16n7J70l51R6J81m1m0R2j73K22%k35M2R3j60K42r9j81
3687a38N9k1JJ50k24J63K9R1j77j8J06q4O7M3J4k4M1L7j47J05j46j05J68j45M5
3712a10K02j84P6J56j72N8j75O3K39l3k02o3K17j86J47M4j91J47N5j1j16p3M5
3735f7J47l1k80K38p4J36o2p6J43j04J68p3M3k15J14J41r0Q5l15K17J17j35j4
3758A3K72l25J88k49j9O3J66P4j76P7j99J26p2J49k71K04o4m9j43K43pq9J44q5
3782b9rJ87l34J7K45q8O7n6L1k04L44j05pn9l0k9J15n0P5Q6j40M4o9P2O9k29J74
$$ plain form
3809 88 109 93 66 -37 -61 -78 -84 55 75 -20 70 -58 150 -88 161 200 188 0 -18 -144 -132 59 -67 -40 -56 -20
3835 -20 -26 -2 -18 -114 -155 -93 -20 104 -5 -26 -22 72 -1 -20 30 -94 -145 131 33 -13 -22 -94 54 -16 105 49 73 6 -127
3864 -127 -165 35 -120 -23 -48 -14 -41 -50 -166 -12 0 -45 -85 238 -26 -228 -118 -34 7 -14 175 33 -77 -105 -75
3889 -75 -50 -32 -34 -78 -58 -83 138 189 91 91 179 -62 -14 132 -14 11 -184 180 77 -117 47 -116 -102 -66 -141 10
3915 10 -45 29 -70 69 -124 -12 -96 56 -46 -205 95 116 126 87 23 69 -38 162 -43 40 68 -256 29 33 86
3940 86 -21 81 31 27 -65 -70 41 -61 -277 -76 -9 -99 -6 -157 148 111 111 176 -158 -11 121 -27 6 -2 4 117
3966 117 57 -11 169 114 -105 -4 -32 -41 35 -77 25 -29 -122 46 137 -6 -75 89 -47 41 -14 -151 20 99 -46
3991 -46 -82 32 -7 -20 -3 -32 -53 -66 -52 101 -112 -81 -124 -123 10 -158 19 -34 138 -7 -20 76 29 138 82 -82
$$ packed form
3809H8K1j6k7j03k4j7oJ39K0r5R0j28K08k38K49L9j2j88j8j26J2J91j26K7j6L6
3835b0oK4j6r6m1O2P3J24j09k1MR4p3j9N0j24n1K76r8m6rp2J48p0J21n6K4o7j33
3864a27l8K00j55R7k5L4k7rj16J54J2m5m0L23k64k02J10Q4M1k1J89j42j10k8L0
3889g5K5J8km4K0k5K21N1r8%Q8k41M8J46j46K5j95L64j03j94J64j63J4L6p5J51
3915A0n5P4r9J39j93J12q4J52j02j59L00K1J0l9o4M6j07K00k05Q3K8l24K85MN3
3940H6j07J02n0mr2nJ11j02k16K01O7r0R3j51L05l7%O5l34J47J32j48L3qOJ13
3966A17o0o8J80n5k19J01k8rP6j12J02n4r3J68R1j43o9J64j36Q8n5j37J71P9j45
3991d6l6J14l9j3J7k9k1j3J4J53k13L1m3JJ33j68J77n3J72j45j3R6m7J09n6j64
$$ plain form
4017 -82 -61 -75 35 92 -78 -86 6 89 81 0 111 57 -73 31 -229 46 36 -111 25 127 -176 11 36 -60 -36
4042 -36 -183 -27 -153 47 126 -9 -107 108 -55 -41 141 -121 31 -50 125 118 -3 -17 9 11 62 137 -86 120
4066 120 49 -179 -194 135 -8 -13 -157 2 -47 1 -31 -20 4 -137 11 214 -22 -106 -68 84 13 133 17 -112
4090 -112 39 195 -10 15 34 27 77 71 59 122 0 96 -74 6 -116 69 142 -33 104 55 43 55 -90 9 104 30
4116 30 54 41 6 1 -68 -46 -22 13 -37 13 -82 -35 -39 -55 -73 3 -39 141 -70 -46 -23 -129 -9 -16 84 49 145 133 30
4145 30 -10 -9 175 41 116 -134 -48 37 166 -60 20 -28 -17 -3 -119 69 -22 28 -133 84 -157 -30 95 -104
4169 -104 62 -146 -35 -120 -5 120 -149 5 38 102 103 -15 -165 -50 -5 79 -62 83 23 61 -67 -8 -35 -78
4193 -78 142 81 157 70 -47 9 16 -48 -86 -5 -59 77 -18 121 -25 128 -6 9 51 -124 85 -25 123 3 48
$$ packed form
4017h2K1j4J10N7j70qR2Q3qq1J11n4j30J04k60K75j0j47J36J02l03J87K5r6K4
4042c6j47J56j26K00P9j35r8K15j63J4J82k62J52q1J75pj21j4K6KN1P5k23K06
4066A20p1k28j5L29j43nj44J59m9M8l2J1K4j41J48K03k36q4L8J52p1J20j16j29
4090a12J51J56k05K5J9pN0oj2O3j22R6j70Q0j22J85P3j75J37m9j2J2j45R9R5p4
4116C0K4j3l5no9K2K4L5n0N0r5M7mj6j8P6m2J80k11K4K3j06J20pJ00l5R6j2j03
4145C0m0JJ84j34P5k50Q6Q5J29k26Q0m8J1J4j16J88r1N0j61K17k41J27J25j99
4169a04J66k08J11q5J15J25k69J54L3O4Jj18j50J15M5Q4j41J45o0L8j28N9k7m3
4193g8K20o1P6q7j17N6Po4l8Q1n4J36r5J39j46J53j34J5M2j75K09j10J48j20M5
$$ plain form
4218 48 -42 -97 24 79 -188 11 -132 -59 -51 96 -55 92 -11 3 15 -47 27 182 -89 205 -144 25 35 -33
4242 -33 -9 60 -133 142 17 17 -148 185 169 -216 -109 -99 119 45 -47 -20 21 -55 26 1 109 -103 -23 -46 -112 39
4268 39 24 -32 75 -15 23 47 128 33 32 -175 141 64 11 86 -143 0 112 87 -97 85 12 -26 -69 53 -27 -32 -59
4295 -59 231 -81 -60 179 22 37 25 -20 -109 -81 -15 11 161 124 -156 -134 49 103 127 68 -97 86 62 -149 -72
4320 -72 116 43 15 -26 -14 88 50 -63 124 67 -90 86 32 71 6 21 -53 -13 -17 -24 -83 143 149 47 -80 62 -10
4347 -10 -42 33 25 20 -6 -59 73 58 -63 99 -136 124 56 104 -86 157 135 62 109 -37 83 -11 72 45 126 -27
4373 -27 -12 -36 -117 48 110 -27 13 -95 -54 -79 -5 151 -93 -123 -96 13 25 51 49 -14 -10 -44 70 -7 2 -79 9 60
4401 60 63 9 95 -92 -40 -4 -35 -1 100 -82 -12 18 30 -93 -128 -77 -79 199 5 140 -22 55 55 -46 -9 50 20
$$ packed form
4218D8r0n5J21N5k67J99j43P3QJ47j51J47j03J4J2o2P4J55k71K94l49J69J0o8
4242c3K4O9j93K75j25%j65L33j6l85J07J0K18p4r2K7M1p6Q1k5J08k12Q0k3o6J51
4268C9j5n6J07r0L8K4Q1r5jk07L16p7n3P5k29J43J12k5j84J82p3l8m3J22q0nk7
4295e9K90l12K1K39j57J5j2m5q9K8O6K6J50l7k80K2J83N4K4n9j65J83k4k11P7
4320g2J88p3k8m1J2J02l8j13J87n7j57J76n4L9o5J5p4M0mpn9K26Oj02j27J42p2
4347a0l2P5qnk6n3J32j5j21J62k35K60o8M8j90K43k2p3M7j46J20r4Q3k7Q1j53
4373b7J5k4q1J65O2j37M0j08M1k5P4J56k44l0K7J09J2K6ko3Ml4J14p7Rq1Q8N1
4401F0Ln4Q6j87N2L6l1L4J01j82P0L0J2j23l5N1kK78j94J35j62P7%j01L7N9l0
$$ plain form
4428 20 69 -95 -42 -69 -35 47 -33 -229 -33 103 87 -14 63 68 -82 125 122 49 9 39 18 50 -44 -44 164 64 -25
4455 -25 206 14 8 126 -8 -54 28 73 94 71 33 -10 -61 23 -20 -153 14 -48 -58 -89 -20 -95 -81 -130 80 -217 -35
4482 -35 6 71 218 89 -51 209 28 198 -109 -93 18 51 34 -84 183 111 81 -44 -135 -6 -152 -242 -50
4505 -50 173 262 95 150 -146 -26 -49 120 2 45 120 -57 -106 174 -28 -83 -4 123 -13 -24 -47 -34 -56 -146 33
4530 33 119 -36 40 -116 119 33 121 -24 132 140 57 -136 23 -99 62 -134 -8 21 73 17 -30 105 -158 -108
4554 -108 -119 -1 95 -17 -183 -9 -50 -60 64 -114 101 39 25 -29 28 17 36 106 -37 30 -3 62 131 12 21 16
4580 16 41 41 -1 152 -17 54 -50 98 43 -130 -7 -80 24 -131 45 -141 28 56 60 -182 -17 -91 172 -18
4604 -18 6 -61 -8 -58 86 -113 -212 -5 -7 11 58 126 72 44 -69 17 -42 -30 -54 18 -57 -14 -5 87 -60 -79 1 88 -64
$$ packed form
4428B0M9j64N3k7L4Q2q0j96J96J36j6j01P7Nj50K07lp3m0L0k1L2r4%K08j00q9
4455b5K31j92oJ18j34m6Q2M5K1k3l8m3n1Q4m3j33J67o2j0l1O9p5J4m9K10k97J82
4482c5M1O5J47j29j40K60j81J70l07J6J11L3j7j18K67p2l0j25r1J29j46r0J92
4505e0K23Q9j67N5k96J20k3J69j18M3P5j77m9K80k02n5P9J27j36j1k3J3k2r0J79
4530C3Q6j55P6j56K35q6Q8j45J56Qq3j93J59j22J61j96J26K9N2n6m7J35k63N0
4554a08j1J18R6j12j66J74m1j0J24j78K15o2j4n4N7j1J9P0j43O7l3O5O9j19Rn
4580A6K5%m2J53j69P1j04J48n5j73J23p3J04j55J76j86J69K8Mk42J65p4K63j90
4604a8K4o7N3n0J44j99r9K07kJ8M7O8n4k8j13Q6n9J2k4P2p5M3RR2j47j9Q0Q7j52
$$ plain form
4633 -64 -145 2 -73 -121 57 -24 -12 111 34 -211 69 -38 25 -105 -84 0 105 47 113 -30 90 291 -82 -46
4657 -46 -37 -43 -137 8 16 -82 76 -63 -56 -153 -86 -7 -62 17 -64 114 73 81 34 -7 125 -7 100 29 -60 -55 -99 -121 -176 195
4687 195 -21 -68 -22 -54 118 -77 38 42 -52 47 -164 -21 53 154 -46 -37 -4 -2 28 135 99 -35 -167 -42 -57
4712 -57 56 23 46 -106 147 -27 -65 46 -56 -30 55 -29 109 39 -22 140 79 5 4 -60 154 34 68 -74 21
4737 21 36 35 -84 -27 116 41 -33 48 -110 9 60 -52 27 -45 77 -15 26 -33 73 30 170 151 -52 110 89 -61
4763 -61 -57 -62 -70 12 -9 67 8 -5 130 -123 -1 77 -20 92 -65 -71 -47 -15 -41 71 -85 132 -165 -76 115 136 75
4790 75 -6 -18 -11 52 94 -44 72 19 48 19 88 79 -119 -60 95 -1 86 -72 -2 8 -3 129 -117 -58 36 97 -16
4817 -16 28 102 -49 -55 -103 3 -67 51 -101 136 -18 -7 34 -25 -55 7 -60 113 66 99 -2 93 173 29 0 87
$$ packed form
4633f4q1J47p5m8J78q1J2J23p7k45K80j07O3j30K1Q4J05n8O6j43J20K01l73L6
4657d6Ror4J45Qr8J58j39Pr7O7P9n5P9q1J78m1Qm7m1J32j32J07p1q9Nm4k2n5L71
4687A95k16m7M6l2J72j95J15Mr4R9k11J43P4J01k00RL3KL0J07l6j34j32J25j5
4712e7J13l3K3j52K53j74l8J11j02K6Q5q4J38p0o1J62o1p4jo4K14j20L4j42R5
4737B1J5jj19N7J43p5p4Q1j58J19N1j12P9p2J22r2M1n9J06m3J40j9k03J62k1j50
4763f1MnqQ2k1P6n9j3J35k53J22P8r7J12j57oK4L2k6J12j56K17k97Q9J91K1o1
4790G5q1j2PO3M2j38J16n3K9k9O9rj98N9J55r6Q7j58P0J0j1J32k46N9R4O1j13
4817a6M4P4j51om8J06p0J18j52K37j54J1M1n9l0O2o7J73m7L3j01R5Q0j44k9Q7
$$ plain form
4843 87 64 53 4 -71 35 84 -98 -23 18 -42 5 -65 119 -73 -56 -159 19 -10 118 59 153 19 53 30 67 91
4869 91 -126 44 14 8 -200 -75 85 70 -52 92 -127 153 -89 128 -87 -5 -58 -103 65 59 3 -113 57 48
4893 48 -14 99 -7 38 105 111 45 42 80 -34 -82 123 43 -21 -116 -2 -5 -39 -8 9 -14 84 -124 -32 -36 13 66 49 80
4922 80 -63 142 12 -81 18 42 -16 32 -106 4 216 32 135 82 -11 -70 8 114 -179 96 -94 -84 92 -20
4946 -20 -124 -82 -45 -168 121 -21 147 129 -82 -18 86 -163 156 -120 82 -130 45 126 56 27 62 -76 6
4969 6 98 121 -106 -7 50 53 -15 99 -8 -77 -93 -58 -128 -113 79 -45 144 3 -96 -133 14 19 108 12 -51 37 51 -178
4997 -178 -88 86 -80 24 -58 165 16 -130 -2 -23 185 -2 72 101 -65 4 61 65 -31 -28 61 54 20 122 -32
5022 -32 -70 44 -17 15 -29 -122 69 -9 -154 -20 76 15 78 156 109 172 -5 -28 -14 -8 49 93 65 -77 18 -103 -44
$$ packed form
4843H7k3j1m9p5J06M9j82P5M1o0M7p0J84j92J7j03J78k9J28n9R4j34L4k3L7K4
4869I1k17J70l0ok08J25J60j5j22J44k19K80k42K17k15Q2n3m5J68on6j16J70r
4893D8o2J13j06M5O7Oo6lL8j14m8K05q0o4r5J14ll4L1J7k3R8k08R2mM9N3j7L1
4922H0j43K05j30r3R9K4n8M8j38J10K12j84J03n3r3n9P8J06k93K75j90J0J76j12
4946b0j04M2L7j23K89j42J68j8k11O4J04k49L19k76K02k12J75Q1p0k9L5j38Q2
4969FR2K3k27R9N7Lo8J14j07o9j6L5p0J5J92j24J89j41r9l7J47NQ9r6o3Q8J4k29
4997a78R0J74j66J04q2K23j49j46J28k1K08j87P4K9j66O9N7Mr6LQ9pl4J02j54
5022c2l8J14o1L2m4r3J91p8j45J34R6o1O3P8m7O3j77k3J4ON7M4k8j42R5j21N9
$$ plain form
5049 -44 -78 -88 -108 15 41 -5 -148 -74 -65 79 94 30 -91 -35 -88 -61 -2 -146 13 163 -42 -111 217 15 -38 -76
5075 -76 52 -34 -5 88 -37 -30 34 69 -72 76 -91 -96 18 76 36 67 34 23 42 81 -28 -96 -48 92 -2 186 -7
5102 -7 -20 -66 -31 -124 -76 -102 147 -76 39 -18 -27 12 67 27 -44 -94 16 23 -39 -139 -180 -155 11 83 20 236 -209 2
5130 2 -86 12 -49 15 -71 9 -19 -23 -74 -115 -59 160 83 -258 9 9 41 28 -36 79 142 93 -34 34 8 -92 -32 -11 79
5159 79 -5 -23 -30 3 -2 -61 -60 -170 147 54 34 133 -93 -29 -17 -68 -18 -31 -28 -35 -42 71 89 -27 -78 209 -36 67 23
5188 23 74 1 44 -100 -39 -195 -136 -11 39 95 3 -42 -164 -42 86 53 -70 -31 83 -101 -34 68 -83 -28 -47
5213 -47 -165 -134 -31 127 -12 -167 -62 100 -72 -157 49 47 -19 3 -75 -33 82 -27 -25 22 39 -22 -61 -11 -12 14
5239 14 -3 -136 -136 -50 -31 9 -66 -4 -19 -5 72 -78 -99 104 -75 46 144 -139 61 -49 195 75 38 -32 83
$$ packed form
5049d4l4j0k0J23K6m6j43P4RJ44J5o4j21N6n3K7N9j44J59J50k05o9L28k02n3l8
5075g6J28q6K9R3j25PO4L5j41J48j67nJ14N8m0L1l3j1J9L9j09o8M8J40r4J88j93
5102gj3m6L5r3M8k6K49k23J15n7rL9N5m0p1n0J10Po2j00m1K5J66P2o3K16m45K11
5130Bq8R8o1O4q6Q0k8mn1m1N6K19p7l41K67%L2j3o4J15O3m9j27O8k6j00O0K1R0
5159G9q4j8pL3nn9Jj10L17r3k0R9k26O4J2n1N0j3LppJ13J8j16n1K87k45J03m4
5188B3N1p3M3j44O1j56N9J25N0N6r2m5j22J22J28l3j23L9J14j84O7J02j51N5j9
5213d7j18L1J03J58j39j55J05J62j72q5K06ko6K2p8M2J15j09KM7J7o1l9N0jK6
5239A4j7j33%Q6J9M0p5O2j5J4P7j50k1K03j79J21R8k83K00j10K44j20l7p0J15
$$ plain form
5264 83 -116 74 10 -40 107 -104 74 -126 20 -59 59 17 11 204 142 90 -205 27 35 -34 -6 -78 -25 -18 78 -6
5290 -6 -61 3 7 -109 -63 12 91 194 147 7 38 -91 -115 24 -44 -31 52 31 96 194 -17 -8 -26 123 50 -53 109
5317 109 -60 155 -52 31 87 -25 -192 -122 -75 108 -96 -24 -143 -121 4 -103 -130 -138 84 -82 50 -7 -94 -56
5341 -56 5 -95 102 -6 -30 13 45 25 -11 -65 92 77 -169 28 -25 -27 -34 -8 -28 -155 154 1 -97 -46 96 23
5367 23 -32 -85 -53 22 -2 59 -83 165 66 -1 -93 70 16 -4 76 165 -105 138 121 68 -106 -45 66 50 -156 89
5393 89 -161 -100 85 -10 -14 -101 28 125 -42 -106 -162 -94 113 -167 80 20 -60 22 -86 -5 -139 -42 51 111 197 -24
5419 -24 157 -16 107 -46 125 137 -41 55 -50 103 61 234 116 28 44 -94 157 133 99 12 -151 11 -287
5442 -287 118 114 42 177 137 46 70 157 -59 62 28 156 24 -49 -133 -113 -128 -22 87 -16 -48 -42 47 -12 98 137
$$ packed form
5264H3j99J90o4n0J47k11J78k00J46p9J18m2oJ93o2n2k95K32Qo9K8p2N3PR6q4
5290fn5O4Mj16M6P5P9J03m7j40L1j29k4J39o8J3Q3k1O5R8k11Rj8J49p3j03J62
5317A09j69K15k07Q3N6j12j67P0M7J83k04P2j19K2J25j07k7qK22j66J32n7q7L8
5341e6O1j00J97j08k4M3L2k0l6n4J57j5k46J97n3kpK6k0j27L09j53r8N1J42p3
5367B3n5n3L2P5k4O1j42K48r9o7r2J63n4k0Q0Q9k70K43j7n3j74O1J11j6k06K45
5393H9k50O1J85r5mq7J29R7j67o4n6O8K07k80K47o0q0Q2j08Q1j34R7R3O0Q6k21
5419b4J81j73J23j53J71J2j78R6j05J53m2J73j18q8J6j38K51k4l4q7j63J62k98
5442b87M05mp2J35m0r1K4Q7k16J21l4J28j32p3q4K0j5J06J09j03l2OQ9n9J10L9
$$ plain form
5468 137 -26 -135 -128 6 -11 -47 15 57 -51 -13 -122 140 -10 -50 31 -61 -75 14 139 -130 -72 -107 10 -113 180
5493 180 64 109 19 -27 93 22 -84 -106 6 33 74 -24 -45 50 8 37 114 -105 -18 53 136 27 59 -14 -17 -110 85
5520 85 -53 -144 -11 -93 -9 -129 -76 76 -3 9 82 1 8 -39 -77 101 34 -139 10 -63 -129 100 -144 -27 -2 86
5546 86 -42 -30 -12 24 -58 -89 65 -13 59 144 -14 2 -2 138 48 -60 78 -15 121 -33 86 105 -120 19 53
5571 53 -150 37 158 -44 19 6 5 24 -119 120 -84 72 -5 -17 -21 24 -20 -9 -67 18 -63 7 -30 -146 -62 -69 16
5598 16 38 -26 -37 180 -163 -124 180 103 -53 28 54 60 49 -97 28 -52 -219 119 -14 -36 228 -17 -25 16 -144
5623 -144 -118 -21 -17 -165 82 67 108 28 -167 42 126 123 -193 1 1 -134 79 -44 -26 191 138 -75 -27 -149 -63
5648 -63 20 -39 71 -31 -12 -79 -198 -91 -55 61 55 53 -145 114 -29 -4 38 72 -29 67 42 63 136 36 81 46
$$ packed form
5468A37j63j09PJ34j7l6O2M2j08L8j09K62j50m0Q1r2j4Q9J25k69N8l5J17j23K93
5493A80j16M5r0m6J20p1j06k2J12K7M1r8k1R5m2K9P7k19Q7P1Q3j09L2p3lr3J95
5520H5j38r1J33q2Q4j20N3J52p9J2P3q1Pm7l8J78o7j73J49p3o6K29k44J17K5Q8
5546H6j28J2J8L6q2l1J54p8P2Q5j58J6mJ40r0j08J38r3J36j54J19J9k25J39L4
5571E3k03J87J21k02O3j3jJ9j43K39k04J56p7j2mM5m4J1n8Q5q1P0l7j16Q4pQ5
5598A6K2o4j1K17l43L9L04p7j56Q1K6Oj1j46J25q0j67L38j33k2K64k45qM1j60
5623a44K6R7Mj48K47j5M1q0j95K09Q4ll16J94%j35K13j23J8K17n3k13M8j22Q6
5648f3Q3n9J10j02J9o7j19J07L6J16okj98K59j43K5M2L4j01R6k5K1P3j00M5l5
$$ plain form
5674 46 34 5 106 -183 -188 -31 -81 -118 -38 39 -112 -8 -1 -96 41 219 15 56 12 115 -79 103 17 -41 6 125
5700 125 223 71 -18 -148 18 -20 89 -161 91 75 -66 29 141 44 152 79 71 29 -12 73 23 263 115 -122
5724 -122 227 -182 -64 50 88 55 -120 -176 -26 16 39 108 42 24 -157 154 -63 -85 20 54 -39 21 -25 -82 -167
5749 -167 22 114 30 -18 29 188 18 -73 29 78 157 -77 -23 65 -178 4 3 125 46 61 58 10 25 -124 -158 -72
5775 -72 15 103 75 198 36 7 -97 -127 72 -14 50 93 -79 -2 -100 120 10 -203 71 -45 -104 98 -26 -43
5799 -43 43 -107 -51 96 4 -63 133 82 -81 51 44 -105 178 -8 -57 155 -48 28 -137 24 142 -55 40 -106
5823 -106 -77 60 46 171 -80 10 -28 -69 -131 55 72 90 -101 -87 70 -8 -38 -72 -228 -182 43 -79 -139 101 -113
5848 -113 -88 -84 68 170 -23 75 -15 -125 57 -7 17 77 -124 125 231 -97 11 56 -98 -55 57 -123 -131 -58
$$ packed form
5674D6j2k9J01k89nJ57n0l7Q0P7j51J04Pr5J37J78k04M1m4J03j94J82q6n8M7J19
5700A25R8j52q9j30J66l8J09k50K52j6j41R5J12r7J08p3qm2m1Q5n0K40j48k37
5724a22L49m09J18J14L8l3j75n6J50M2K3O9o6j8j81L11k17k2J05L4r3O0m6n7q5
5749a67J89R2q4m8M7J59j70r1J02M9P9k34N4Q8k43J82jJ22p9J5lm8J5j49l4Q6
5775g2Q7Q8k8J23j62k9j04l0J99q6O4M3j72P7r8K20j10k13K74j16n9K02j24j7
5799d3Q6j50N6J47r2o7J96n1j63J32pj49K83j86m9K12k03P6j65J61J18j97R5j46
5823a06K9J37j4J25k51R0l8m1o2J86J7J8j91J4J57p8l0l4j56M6K25j22o0K40k14
5848a13K5MJ52J02j93R8r0j10J82o4K4O0k01K49J06l28J08M5j54M3J12j80qP3
$$ plain form
5872 -58 -37 9 -149 -19 -157 5 -13 120 -176 5 26 -93 -53 -142 -39 166 -63 -32 17 23 -8 59 90 46 -115
5897 -115 -118 -17 -77 101 50 -33 -61 -67 57 -117 -61 -128 34 52 96 134 108 7 -39 57 -3 -3 -59 -24 -184 46 -30
5924 -30 -33 -102 -32 -73 -27 -94 -17 -54 42 82 -139 27 -40 -27 54 37 13 72 -1 125 -49 3 -26 3 68 -106 143 -23
5952 -23 156 104 77 20 -32 175 -30 219 209 40 -16 69 -17 51 39 88 81 244 18 -8 117 -15 47 29 -53 -7
5978 -7 9 81 -123 -201 97 -82 -94 -91 -98 -74 52 6 -77 85 -97 -72 82 8 4 2 -36 30 -35 36 -70 3 -110 89
6006 89 50 -70 62 -13 -48 -71 59 83 -25 15 73 85 97 -120 77 -88 28 122 -88 -63 -46 172 85 -64 70
6031 70 37 -96 95 147 77 -75 -78 150 -60 8 157 -32 -36 -92 1 58 -4 -5 -60 113 9 -133 23 -23 3 -86
6057 -86 78 -90 -103 188 -14 84 139 1 100 -141 -121 -22 -22 -52 34 -33 43 36 36 137 -137 123 -53 5 172 49
$$ packed form
5872e8K1M6j58J30j38J62j8J33k96J81K1j19M0q9J03K05k29L1M9Ol1O7L1m4j61
5897a15lJ01o0J78n1q3k8oJ24j74N6o7J62J8M4L8k6j01m6R6o0%n6L5j60K30p6
5924c0lo9P0m1M6o7P7l7R6M0k21J66o7J3Q1j7k4N9p3J26j74N2k9K9O5j74K49j66
5952b3J79n2k7n7n2K07k05K49j0j69n6Q5q6O8j2M9pJ63k26k6J25j32O2j8q2M6
5978gJ6P2k04p8K98j79j2LpK4J26m6q3J62j82K5J54p4mkl8O6o5P1j06P3j13J99
6006H9l9j20J32p5l5k3J30K4j08M0N8J2J2k17J97j65J16R4k10K5J7K18q7j49J34
6031G0l3j33J91N2p0j52lK28k10O8J49j89mn6R3N7o2jn5J73j04j42J56m6K6q9
6057h6J64j68j3K91k02R8N5j38R9k41K0R9%l0Q6o7P6p%J01k74K60j76N8J67j23
$$ plain form
6083 49 61 -21 8 -166 -118 0 36 91 165 -40 -161 -42 27 20 -45 -205 150 20 -21 -38 -152 -88 -1 -1 120 -150
6109 -150 263 -18 -180 -67 -14 4 -6 -15 36 27 43 7 90 -20 47 186 19 -85 -51 -1 -128 -4 108 100 16 -36
6135 -36 -10 74 -22 -29 42 -14 -165 -32 -78 -24 -145 124 -39 -79 -62 24 20 85 81 -13 50 66 207 -38 -136 89 17 9
6163 9 -64 -124 -55 12 -51 -26 -105 -7 76 -146 129 35 6 31 -83 107 96 -1 -119 66 8 109 64 54 210 16
6189 16 111 -31 186 60 112 48 -1 59 121 -49 90 10 -46 -8 64 -128 -137 -14 69 -12 76 -7 -48 150 36 -52
6215 -52 97 -62 38 -148 -34 9 4 60 -109 27 83 -82 -73 93 -176 26 -44 -133 -37 4 173 37 23 -8 48
6240 48 205 -136 -10 -36 25 37 58 -97 -65 77 -114 -75 161 -132 -23 -40 22 30 72 -89 -46 53 56 14 -2 155
6266 155 -30 65 68 62 61 -35 -16 37 -36 -2 -6 24 99 70 204 -41 -21 133 22 -3 -71 -25 -141 -39 4 -83 153 51
$$ packed form
6083D9J2q2K9j74M8J18L6N5P4k05j21J19O9po5j60L55j30m1j7j14O4Q7%J21k70
6109a50M13k81j62J13N3J8j0rN1rJ6l6Q3j10O7J39j67j04L4N0j27J24J12qq4n2
6135c6K6Q4r6pP1n6j51J33m6N4j21K69j63m0J7Q6mO5mr4O3J6J41k45r8K25p2q
6163Ip3o0O9O7o3K5p9R8Q3k22K75r4k9K5j14J90j1r7j18J85n8J01m5j0J56j94
6189A6R5j42K17j26N2o4m9O0O2j70J39q0n6L8P2j92rJ23Q3q1Q8q3m1J98j14q8
6215e2J49j59J00j86J14M3nN6j69J36N6j65RJ66k69K02p0q9R6M1J69j36j4l1N6
6240D8J57l41J26k6O1J2K1j55L2J42j91L9K36k93J09j7O2QM2j61M3R9Lm2j6J57
6266A55j85R5Lojr6J9N3p3L4mL0P5k9J34k45K0J54j11k5o8M6j16J02M3q7K36j02
$$ plain form
6294 51 137 71 115 -96 14 -7 72 24 44 -91 -83 6 149 148 -16 -41 36 50 -92 59 -40 -40 -211 225 -36 -65 2
6321 2 102 2 -37 31 14 -117 191 -21 -86 -19 -1 -40 -45 55 -71 53 -24 -83 -74 19 -14 -77 21 16 190 -16 22
6348 22 77 -83 55 -36 14 -7 -156 41 101 -78 -46 -37 19 -74 -46 31 36 52 26 9 71 -158 110 43 127 1 55
6375 55 125 -9 162 -30 20 59 -93 -107 -45 -128 -46 -95 70 -108 -17 -165 -148 -16 -16 17 -107 -52 105 -70 -2
6400 -2 72 -177 -39 -11 29 32 76 47 -91 -37 -17 53 -14 106 74 -252 26 38 -75 -76 -53 11 -20 -22 -222 -30 -236
$$ packed form
6294E1Q6o6M4k11J10k1P9m8K0j35QQ9J43jj64k5P7J4j42J51r9%j71M36k61k9O7
6321BJ00j00l9O8j7j31L08k12o5O7J8l9nJ00j26J24p7n9RR3l3o3R8nJ74k06L8
6348B2N5j60J38r1N0k1j49J97O0j79L2RN6r3K8P7NJ6k6j7O2k29K68o7Q4j26N4
6375E5P0j34J71j92N0L9j52j4O2q3Q2m9J65j78R1j48J7J32%L3j24N5J57j75O8
6400bP4k49J38K8M0LM4k9j38N4K0P0o7J20l2l26K78J2j13jK3O4l1kk00J92k06
$$ [...]
8191g1
##END NTUPLES=NMR FID
##END=
