##TITLE=1H_SR 159_k TFA
 DMSO-d6
 8 sc, 
 27.1.2023
##JCAMPDX= 6.0         $$ Bruker NMR JCAMP-DX V2.0
##DATA TYPE= NMR FID
##DATA CLASS= NTUPLES
##ORIGIN= UXNMR, Bruker Analytische Messtechnik GmbH
##OWNER= root
$$ XWIN-NMR		Version 3.5
$$ Fri Jan 27 15:55:00 2023 Russian Standard Time (UT+4h)  she@DPX200
##.OBSERVE FREQUENCY= 200.13135
##.OBSERVE NUCLEUS= ^1H
##.DELAY= (6, 6)
##.ACQUISITION MODE= SIMULTANEOUS
##.ACQUISITION SCHEME= undefined
##.AVERAGES= 8
##.DIGITISER RES= 18
##SPECTROMETER/DATA SYSTEM= spect
##.PULSE SEQUENCE= zg30
##.SOLVENT NAME= DMSO
##.SHIFT REFERENCE= (INTERNAL, DMSO, 0, 15.7039)
##AUDIT TRAIL= $$ (NUMBER, WHEN, WHO, WHERE, WHAT)
$$ ##TITLE= Audit trail, XWIN-NMR		Version 3.5
$$ ##JCAMPDX= 5.01
$$ ##ORIGIN= Bruker BioSpin GmbH
$$ ##OWNER= she
$$ F:/spectra/data/she/nmr/H-F/1/audita.txt
$$ ##AUDIT TRAIL=  $$ (NUMBER, WHEN, WHO, WHERE, WHAT)
(   1,<2023-01-27 15:54:04.06 +0400>,<she>,<DPX200>,
      <created by zg, POWCHK disabled, PULCHK disabled
       configuration hash MD5:
       00 E9 B6 7A A2 85 ED C7 34 08 36 98 17 FE 4E 26
       data hash MD5: 16K
       2D A9 80 8F 2A BB 2F A1 91 CF FE A2 7F F6 59 D4>)
$$ ##END=
$$ 
$$ hash MD5
$$ 60 68 00 97 1E 6B 78 D9 47 59 15 04 66 BB 58 26
##$RELAX= 
##$RELAX= 
##$RELAX= 
##$RELAX= 
##$RELAX= 
##$RELAX= 
$$ Bruker specific parameters
$$ --------------------------
##$DU= <F:/spectra>
##$EXPNO= 1
##$NAME= <H-F>
##$PROCNO= 1
##$TYPE= <nmr>
##$USER= <she>
##$AMP= (0..31)
100 100 100 100 100 100 100 100 100 100 100 100 100 100 100 100 100 100 
100 100 100 100 100 100 100 100 100 100 100 100 100 100 
##$AQSEQ= 0
##$AQ_mod= 1
##$AUNM= <au_zg>
##$AUTOPOS= <>
##$BF1= 200.13
##$BF2= 200.13
##$BF3= 200.13
##$BF4= 200.13
##$BF5= 200.13
##$BF6= 200.13
##$BF7= 200.13
##$BF8= 200.13
##$BYTORDA= 1
##$CFDGTYP= 0
##$CFRGTYP= 5
##$CHEMSTR= <none>
##$CNST= (0..31)
1 1 145 1 1 1 1 1 1 1 1 1 1 1 1 1 1 1 1 1 1 1 1 1 1 1 1 1 1 1 1 1 
##$CPDPRG= <>
##$CPDPRG1= <>
##$CPDPRG2= <>
##$CPDPRG3= <>
##$CPDPRG4= <mlev>
##$CPDPRG5= <mlev>
##$CPDPRG6= <mlev>
##$CPDPRG7= <mlev>
##$CPDPRG8= <mlev>
##$CPDPRGB= <>
##$CPDPRGT= <>
##$D= (0..31)
0 1.2 0 0 0 0 0 0 0 0.06 0 0.03 0 0 0 0 0.0002 0 0 0 0 0 0 0 0 0 0 0 0 
0 0 0 
##$DATE= 1674820443
##$DBL= (0..7)
120 120 120 120 120 120 120 120 
##$DBP= (0..7)
150 150 150 150 150 150 150 150 
##$DBP07= 0
##$DBPNAM0= <>
##$DBPNAM1= <>
##$DBPNAM2= <>
##$DBPNAM3= <>
##$DBPNAM4= <>
##$DBPNAM5= <>
##$DBPNAM6= <>
##$DBPNAM7= <>
##$DBPOAL= (0..7)
0.5 0.5 0.5 0.5 0.5 0.5 0.5 0.5 
##$DBPOFFS= (0..7)
0 0 0 0 0 0 0 0 
##$DE= 6
##$DECBNUC= <off>
##$DECIM= 32
##$DECNUC= <off>
##$DECSTAT= 4
##$DIGMOD= 1
##$DIGTYP= 9
##$DL= (0..7)
0 120 120 120 120 120 120 120 
##$DP= (0..7)
150 150 150 150 150 150 150 150 
##$DP07= 0
##$DPNAME0= <>
##$DPNAME1= <>
##$DPNAME2= <>
##$DPNAME3= <>
##$DPNAME4= <>
##$DPNAME5= <>
##$DPNAME6= <>
##$DPNAME7= <>
##$DPOAL= (0..7)
0.5 0.5 0.5 0.5 0.5 0.5 0.5 0.5 
##$DPOFFS= (0..7)
0 0 0 0 0 0 0 0 
##$DQDMODE= 0
##$DR= 18
##$DS= 0
##$DSLIST= <SSSSSSSSSSSSSSS>
$$ [...]
##$SUBNAM2= <"">
##$SUBNAM3= <"">
##$SUBNAM4= <"">
##$SUBNAM5= <"">
##$SUBNAM6= <"">
##$SUBNAM7= <"">
##$SUBNAM8= <"">
##$SUBNAM9= <"">
##$SW= 18.05172834244
##$SWIBOX= (0..15)
0 0 2 0 0 0 0 0 0 0 0 0 0 0 0 0 
##$SW_h= 3612.71676300578
##$TD= 16384
##$TD0= 1
##$TE= 0
##$TE2= 300
##$TE3= 300
##$TEG= 300
##$TL= (0..7)
0 120 120 120 120 120 120 120 
##$TP= (0..7)
150 150 150 150 150 150 150 150 
##$TP07= 0
##$TPNAME0= <>
##$TPNAME1= <>
##$TPNAME2= <>
##$TPNAME3= <>
##$TPNAME4= <>
##$TPNAME5= <>
##$TPNAME6= <>
##$TPNAME7= <>
##$TPOAL= (0..7)
0.5 0.5 0.5 0.5 0.5 0.5 0.5 0.5 
##$TPOFFS= (0..7)
0 0 0 0 0 0 0 0 
##$TUNHIN= 0
##$TUNHOUT= 0
##$TUNXOUT= 0
##$USERA1= <user>
##$USERA2= <user>
##$USERA3= <user>
##$USERA4= <user>
##$USERA5= <user>
##$V9= 5
##$VALIST= <valist>
##$VCLIST= <CCCCCCCCCCCCCCC>
##$VD= 0
##$VDLIST= <DDDDDDDDDDDDDDD>
##$VPLIST= <PPPPPPPPPPPPPPP>
##$VTLIST= <TTTTTTTTTTTTTTT>
##$WBST= 1024
##$WBSW= 4
##$XGAIN= (0..3)
0 0 0 0 
##$XL= 0
##$YL= 0
##$YMAX_a= 284154
##$YMIN_a= -445727
##$ZGOPTNS= <>
##$ZL1= 120
##$ZL2= 120
##$ZL3= 120
##$ZL4= 120
##$ABSF1= 10
##$ABSF2= 0
##$ABSG= 5
##$ABSL= 3
##$ALPHA= 0
##$AQORDER= 0
##$ASSFAC= 0
##$ASSFACI= 0
##$ASSFACX= 0
##$ASSWID= 0
##$AUNMP= <proc_1d>
##$AZFE= 0.1
##$AZFW= 0.1
##$BCFW= 1
##$BC_mod= 2
##$BYTORDP= 1
##$COROFFS= 0
##$CY= 11.3945322036743
##$DATMOD= 1
##$DC= 2
##$DFILT= <>
##$DTYPP= 0
##$F1P= 2.36226072786647
##$F2P= -0.459571619588291
##$FCOR= 0.5
##$FTSIZE= 0
##$FT_mod= 4
##$GAMMA= 1
##$GB= 0.15
##$INTBC= 1
##$INTSCL= 1
##$ISEN= 128
##$LB= 0.24
##$LEV0= 0
##$LPBIN= 0
##$MAXI= 10000
##$MC2= 0
##$MEAN= 0
##$ME_mod= 0
##$MI= 1.114404
##$NCOEF= 0
##$NC_proc= 0
##$NLEV= 6
##$NOISF1= 3.799351
##$NOISF2= 2.8
##$NSP= 1
##$NTH_PI= 0
##$NZP= 0
##$OFFSET= 15.70392
##$PC= 1
##$PHC0= -19115.52
##$PHC1= 15.20079
##$PH_mod= 1
##$PKNL= yes
##$PPARMOD= 0
##$PSCAL= 0
##$PSIGN= 0
##$REVERSE= no
##$SF= 200.130013532006
##$SI= 16384
##$SIGF1= 3
##$SIGF2= 2
##$SINO= 400
##$SIOLD= 16384
##$SREGLST= <1H.CDCl3>
##$SSB= 0
##$STSI= 0
##$STSR= 0
##$SW_p= 3612.71676300578
##$SYMM= 0
##$S_DEV= 0
##$TDeff= 0
##$TDoff= 0
##$TI= <>
##$TILT= no
##$TM1= 0
##$TM2= 0
##$TOPLEV= 0
##$USERP1= <user>
##$USERP2= <user>
##$USERP3= <user>
##$USERP4= <user>
##$USERP5= <user>
##$WDW= 1
##$XDIM= 8192
##$YMAX_p= 0
##$YMIN_p= 0
$$ End of Bruker specific parameters
$$ ---------------------------------
##NTUPLES= NMR FID
##VAR_NAME=  TIME,          FID/REAL,        FID/IMAG
##SYMBOL=    X,             R,               I
##VAR_TYPE=  INDEPENDENT,   DEPENDENT,       DEPENDENT
##VAR_FORM=  AFFN,          ASDF,            ASDF
##VAR_DIM=   8192,          8192,            8192
##UNITS=     SECONDS,       ARBITRARY UNITS, ARBITRARY UNITS
##FACTOR=    0.0002768,     1,               1
##FIRST=     0,             0,               0
##LAST=      2.2672688,     0,               0
##MIN=       0,             -445727,         0
##MAX=       2.2672688,     284154,          0
$$ Real data points
##PAGE= N=1
##DATA TABLE= (X++(R..R)), XYDATA
0@%%%%%%%%%%qJ6j6K4l2M0n4O2p2R2j16J36j60J92k24K62l06L54m08M69n37O12
32C26o97P91q93J005j127J261j412J580j762J957k170K407k664K941l246L581
48A878l947M348m790N278n817O415p086P841q693R671j0807J2138j3722J5651
62H358j8061K1168k5340L1264m0390N6349r1947L04441j14349n77220O09011J20870
74B84154m45305R8575K29272k17930N5286M7582j44544J32085R7843k84802O1586
85h6198K33202j68706j10304J82367l8892q5555P3829r176k3153O6419p3735k8955
97f8857J34719l2144j26385R5017O4403q9702J3951N0181n2122J1411L8670l4679
109D463Q700J7351n1327K3734N3671o0821k5825P0648j7694o4970L4820M1776
$$ y = [0, 0, 0, 0, 0, 0, 0, 0, 0, 0, 0, -8, 8, -8, 16, -16, 24, -30, 32, -40, 52, -64, 72, -88, 104, -120, 142, -164, 190, -218, 251, -286, 326, -371, 420, -473, 532, -595, 666, -746, 834, -928, 1029, -1141, 1266, -1398, 1543, -1703, 1878, -2069, 2279, -2511, 2767, -3050, 3365, -3721, 4120, -4573, 5098, -5709, 6429, -7293, 8358, -9703, 11465, -13875, 17389, -23001, 33348, -58599, 245842, 131493, -445727, 163284, 284154, -161151, -62576, 166696, -51234, 4052, 51634, -92910, 39175, 137018, -147784, -86198, 147004, -21702, -132006, 50361, 11469, -74086, -257, -9433, -32586, 33833, -39902, -68857, 65862, 33718, -92667, 2350, 66753, -22949, -8998, 41183, -10939, 472, 39142, 4463, 13163, 30514, -20813, 2921, 56592, -4229, -30054, 40594, 22900, -42070, -7250, 34526]
121C4526k3914l1176k0157K8512N7574m4307p1723O1276N3567o5789k0857N2704
133A0236J398k5299n010N790L3721J817n8634J4666O8869l3420m7660M6263J2232
146B4969l5245J3943R342j0174J4479k0550k0208N0188M591n7425J5592K9527
158A9029k8817J0218K0211m0656Q85L9820k2751j4479K5948j3980p614K0864k0708
171a2030k085M0883k7031l9708M4675K4627l5621p848R935N303J5512j5713k3573
184b2674L3042J1974m0763Q198L5915j8862k0645J0763P590Q730n313k4565J0400
197f210K5813j8062j4386K0066K80j5815L800N768L464K219j6405o475K3472N133
211A2662j8254k438M389K219Q252n507j1268R683O678j1219l29J0654r70n873
$$ y = [34526, 10612, -20564, -40721, -12209, 45365, 1058, -70665, -9389, 44178, -21611, -42468, 10236, 11634, -13665, -18675, -12885, 20836, 22653, -35981, -21315, 47554, 14134, -33526, 12737, 24969, -10276, 3667, 13009, 2835, 17314, -3236, -23444, 26744, 31335, -26090, -10498, 19029, -9788, 430, 20641, -20015, -19130, 20690, -2061, -16540, 9408, -4572, -12186, 8678, -12030, -14115, 26768, -263, -39971, 4704, 29331, -6290, -14138, -4203, 1100, 16612, 899, -22674, 10368, 22342, -18421, -10223, 25692, 6830, -13815, -3052, 4538, 13268, 7955, -16610, -6210, 19603, 1541, -12845, 7221, 7501, -8314, -4514, 1254, 4718, 6937, -9468, -15943, 7529, 12662, -5592, -8030, -3641, -1422, 6830, 1323, -9945, -262, 6416, -4803, -5132, 5522, 4552, -1321]
225a321m740J83J4845M946k2514o272K3304N151j6276k731O190L353p85p231K257
240a641J2449r096j7335J4400J8385j5184j4165Q517P189J678l745r599N037J1090
254G980j1500o470J8188o95j7592L461R909N79J582q822r861J6366J0717j7514
268c672l425J1556l927j969N147m526J283N049j1472k20J7357l884j5824M065
282d462O590J500K196r110o045J3477K025j2727M790P933q395l940N716M048J533
297E129p415r314J1198J1790j0675r005P496M124k201j746N6K824L70p682J305
312c746J1840k049j1816n4P800M128k199q312n26Q387M57o699J353L963l125k820
328c418K346L441J066m741n966N512Q835m551q270K067N522O96j745j931M44J849
$$ y = [-1321, -6061, -5878, 8967, 13913, -8601, -14873, 8431, 13582, -2694, -5425, 765, 4118, 3333, -3898, -1641, 10808, 1712, -15623, -1223, 17162, 1978, -12187, -3670, 3519, 5197, 1452, -8147, -3110, 7980, -3520, -9990, 8198, 7503, -10089, -6628, 3281, 3860, 5442, -3380, -13241, 3125, 13842, -3672, -7097, 4459, 532, -1437, 3710, -816, 467, 5516, -5956, -6176, 11181, 7297, -8527, -4462, 2128, 3628, 5824, -3286, -9331, 4146, 6171, -6556, -1766, 6167, -2228, -6168, -452, 3596, 5129, -2286, -11600, -402, 11388, 713, -8292, -796, 3328, 1127, -619, -563, 2261, 2631, -5051, -3746, 8094, 6045, -5771, -5825, 1975, 6103, 3904, -4408, -4934, 3453, 3910, -2789, -1436, 2527, -598, -3418, -1072, 2369, 3435, -1306, -7272, -1760, 7075, 2524, -5746, -3679, 1843, 2539, 794, -1137, -693, 1156]
344A156j985j895N131L303p332m795O735O056k932o254j896N181M739m371m973
359d132M932J556n108L53N791Mn397l149L345O514j155q295n90P032J650m374
375a023p72J709P24j273j588K937L239m260n097M871N992k536n262q47M149L026
391C989k506l609K026J944j958j026K152J719k544l539J290M892L73n540k707
406e044M461L572k411l576J488K305j165j776J851K325j826l770J210N551O22
421C817n627j732M394K993k604k596Q03K200K1k847J102L147j401m436J581M331
437C146m4m037k746K958L421j587l497O61K613q65j610O19J576n73k837N50L437
454A185P81l257j865K149L378k71l402r73L619K89k107M94J761n08k034m69K888
$$ y = [1156, -829, -2724, 2407, 5710, -1622, -6417, 318, 6374, 3442, -2812, -4708, 473, 5212, 841, -4132, 800, 2356, -2752, -2399, 3392, 3396, -2001, -5150, -1805, 4709, 3554, -4741, -5331, 1701, 3351, -1023, -1795, -86, 638, -635, -2223, 714, 3953, -307, -5404, -533, 5459, 2923, -2339, -3186, 963, 3989, 1483, -2126, -100, 1844, -114, -1140, 1012, 2731, 187, -3352, -2062, 2830, 3203, -2337, -5044, -583, 2989, 578, -2998, -1510, 795, -370, -2146, -295, 2030, 204, -3566, -2356, 3195, 3817, -1810, -3542, 852, 3845, 1241, -1355, -552, 1648, 1669, -1178, -76, 3071, 1670, -2766, -1185, 3146, 3102, -935, -3681, -723, 2698, 1111, -2386, -1725, 888, 23, -1587, -968, 608, 35, -2802, -2252, 1185, 1966, -1291, -3156, -1007, 2371, 2100, -1302, -2275, 1344, 1633, -474, 20, 1781, 1273, -761, -1230, 1658]
471A658K212l083l985K778L915j859l077J84J657R89j524j327J813O38k409j248
487b668K975J781k883k623J783L001J31l194p54J982J421j146p95R86Q64j443
503e82q40L134J062k492j698J412J961J467k946k605K289K316j685j046J095n08
519C34r32M1K98J420l82l265k32M238J24l419r46J765J316M03k391K15K220j126
537c19j058J627R17j131j294K13K345J721l095k132K451J654p83n46p73l15K218
554A700j550n35K356r76l379J690J876r43k5j280j217L132N32l562P16K225j803
571a043l7J362j056N94O36k063J119K543k228j950K421P60l93J21j868O86K349
588A953j156j689J904j33j630Q79M08J01K74j937m79K713k9k260M10O21k96R19
$$ y = [1658, 3870, 787, -3198, -420, 3495, 1636, -1441, -1257, 400, 1389, -135, -1462, 351, 989, -1420, -2668, 307, 2088, -795, -3418, -1635, 1366, 1497, -1697, -2451, -469, 952, -194, -989, -3, 861, -582, -1422, 1712, 2774, 282, -1416, -4, 1957, 3424, 478, -2127, 162, 2478, 793, -253, 842, 334, -598, -557, -259, 1161, 779, -2486, -2718, 1520, 1644, -1775, -2721, -956, 360, 763, -1628, -1413, 807, -319, -1377, 250, 1167, 36, -1258, -1045, 1300, 3021, -74, -2206, 245, 1899, 1116, 570, -203, -518, 1700, 150, -385, 1971, 995, -2384, -694, 1182, 239, 214, -1066, -2283, 849, 1381, -2181, -1465, 760, -1043, -1080, 282, -774, -180, 456, -1607, -488, 2055, -173, -2123, 298, 1058, 665, 786, -1082, -396, 1953, 797, -892, 1012, 879, -751, 128, 536, 637, 911, -1026, -1505, 1208, 1179, -1081, -671, -50, -346, 573]
606E73o32j373K182m66k060J614J353j738j48P02p12J443m89j839Q36K447j786
623i3o38J294p26K29M78o95L38R46j366p87J802K57j289JoO59Q18j064q74J033
643C17j13p02N00L80k41L09j118J92J456j044m40l1K28K82R6l28l88J185m81p16
663f57J066po47L79j41l13J002o94o86R94P78j117k76M45J90J63k88n54O54K25
683E16r22M7Q01j40k26n02n6O56qp43m4M49L65m51j05J69M09O6j074N87Q07n43
705E8m59N14p5K33q8m80K73Q80n69l68M44K16n87M8j18q3P94m87o91N29J91j70
727El60R2J10J83l60l73Q61Q3p54J97K72J65l23j08N7O58l47l49N1M38J32l54
749b4n04N06O65q33K7m4Q41n59j84p2M53K64q42PM13K53n98j30K45L00j82l98
$$ y = [573, -59, -1432, 750, 284, -1776, -162, 1191, -547, -695, 7, -705, 738, 249, -1590, -754, 1693, -93, -731, 563, -163, 66, 544, -151, 187, 1133, -233, -1020, 782, 1039, -250, -249, -255, 404, 1222, 158, -716, 317, 204, -498, 2, 382, 141, 450, -668, -476, 980, -64, -504, -535, -307, -25, 71, -257, -645, 540, 59, -657, 409, 402, -245, 134, -7, -320, 682, -12, -698, 296, 1074, -43, -319, 126, 316, 479, 191, -363, 291, 516, -406, -359, 442, 302, 76, -426, -482, 174, 166, -577, -621, -172, 193, -258, -363, -194, 215, 281, -793, -206, 601, 58, -401, 113, 38, 271, 183, -297, -24, 856, 287, -81, 363, 579, -8, 40, -78, -161, 633, 146, -545, -16, 175, 5, -355, -263, -153, 30, -330, -703, 158, 241, -513, -316, -44, 121, -202, -310, -253, 405, 58, -291, -240, 198, 330, -24, -528, -22, 643, -190, -163, -207, 634, 75, -109, -181, 272, 536, -306, -299, 114, 367, -231, -361, -116, 184, 2, -396]
771c96K5R4K84k78k39O25k47l1m23M34R15m67p12L45N40l37o6j59P8O71j23q10
793b77J25R19r03o4M27mj42l32m18Q22M44q67l22O42K36m02j40k19M32Q1n18N9
815d21O36k10n81L11N13j93ml63n0O35L60r13K9L97Q6r8j91J4R4L02m41K73M7
838B32k24o17L57P09p3l41k30Q7M91k69m85J29N32l54J12l73RM37k56j06N68L75
860G10m24m21K27K13j75m6l91M65K88l80J55j85J20j99j9M82q5l73k36j99P10
881B37J02k93q20P75L53m96Po0J5J38n65N35O02n62j36j06N84K53n75r1j12K05
903a0O16k86o00K43L65k72l14K11L4q2O5K0M46j3q21J10M73K65o39p6L20Q9k06
926f2j57L76o0J6l01J3M86o9l93J8K83M32l38n65j19Q24q3l30J12k27M71n67J14
$$ y = [-396, -371, -277, 7, -271, -510, 115, -132, -163, -586, -152, 763, 296, -416, -71, 469, 132, 66, -93, -15, 656, 533, -277, -152, 767, -136, -200, 227, 223, 81, -251, -669, 153, 597, -270, -592, 50, 286, -116, -256, -475, -43, 38, -480, -421, 215, 5, -576, -265, 248, 55, 51, -312, -362, 273, 633, -280, -251, 146, 232, 134, -57, -43, 51, 353, -88, 185, 232, 8, -609, -252, 457, 384, 43, -187, -100, 391, 122, -363, -234, 298, -56, 56, -317, -308, 129, -127, -233, 335, 710, 286, -135, 92, 305, 130, 84, -307, 158, 446, 66, 221, 36, 156, -43, -62, 420, 335, -38, -274, -473, 237, 339, 46, -774, 1, 354, -142, -135, -195, -180, -42, -607, -72, 530, -32, -168, -274, 310, 563, -12, -103, -215, -10, 606, 320, -280, -37, 328, 56, -258, -47, -13, -95, -30, -10, 436, 423, -398, -288, 185, 450, -189, -265, 55, 144, -62, -219, 157, 97, 113, -188, -175, 311, 242, -151, -133, 150, 582, 244, -321, -440, 384, 301, -29, 83, -144, 327, -240, -126]
949a26M53j12n14l27O18J80j93n36J33M70K58o70P8J78Q0j41j11N56l10q2l01
970d19J02O54j21p58L0Q20l4l13j83K29L69k69m8l34K15K61o37J46P21O4n55l81
992d41K92M83k36m04P6N48l55j8L2P9K9m77L2P99r7l19o05M90O94k25q46J28P44
1015D03J19m33l82O30ql95n0N0K67k63m99M68N88N6q33J11N42k02k00j90j49M15
1037D5J64n95R2N95k70p02M40N12L41p92j80J12P72l81m84J62P30o40k65K75J07
1058C8n3k22K45L97N9m22n78L07N82m08m12K48M79m08K34j59J70N07o80r3N94
1079D25j1l98l20N3R26m62m20j66L76R2k36nL2K44l15r9J18N14j63n62P4M01R8
1102A96k97m2J60L51k04k06k12O12m71j29L88K74m54j96Q9K72P2l32k29N4P93
$$ y = [-126, 327, 215, -299, -626, -8, 172, -21, -557, -424, 46, 304, -366, -288, -110, -30, -171, -282, 274, -36, -118, -419, -317, 337, 216, -542, -512, 308, 274, -39, -222, 7, 376, 107, 59, -275, -60, 201, -436, -290, 431, 495, -60, -441, -149, 334, 98, -306, -230, 318, -37, -55, -23, 56, 85, -392, -360, 439, 342, 23, -582, -92, 602, 377, -469, -341, 403, 522, 89, -293, 337, 329, -66, -116, -66, 201, -62, -561, -93, 495, 551, -282, -171, 371, 169, -31, -221, -370, 45, 209, -386, -294, 301, 31, -671, -231, 281, 622, -170, -350, -238, 534, 153, -331, -169, 561, -79, -344, -69, 38, -15, -237, 8, 405, 464, 42, -536, -229, 353, -55, -467, -219, 260, -148, 86, -73, 97, 604, -76, -169, 425, 414, 16, -304, -251, 675, 213, -207, -373, 3, 95, -141, -146, -114, 130, -185, -284, -166, 348, 185, -377, -303, 98, 196, -101, -143, 17, 368, 164, -42, -254, 358, -113, -242, 146, 420, -34, -230, -141, 131, 203, -129, -358, -304, 489]
1123D89m12n05J52L62j0p0k43L65J3k71l78Q56J17k92n12L18J27K0j53k82M38
1144A29M1n03PK31ok02R8K94M29o00o8j0L26K58m28k33K38K81j74j51K4J34j13
1167BK2K4K18l42j0m87P70Q9m52J7J47J11J60l67j17K77qk13k05N97l7j48k08
1190a60J42K69k95j75K24J59J16j99l86L44J00k91J8O0O0l4m21N06J4L65l80m2
1212fK14K44k96m10N26m48O0P1K09j1j30j78J80J91J62p10L35q0K31n6l98l1N02
1235A71J45l03k04J1J52O7n3J09Q6m28O7K20M17m48J89n72J21L41r3j27k6M92
1257C34j28j97K55l42J04r9j12M37J2l38l48L64K49J23k56L2q4K43j86j73L54
1278B44q3l12j71N85p6j00m05L98J41k40j13J77r2J29R2l00K48j49P3j72L70j20
$$ y = [489, 77, -428, -276, 86, 76, 6, -237, 128, 141, -130, -508, 348, 465, 173, -339, -21, 106, 126, -27, -309, 129, 170, -333, -326, -95, -101, -303, -205, 89, 518, -82, -150, -160, 166, 424, -4, -237, 1, 282, 108, -43, -19, 115, 2, 24, 48, 266, -76, -86, -573, 197, 286, -166, -149, -2, 109, 269, -98, -215, 62, 54, -159, -364, 233, 196, 48, -160, -18, 251, -44, -219, 5, 164, 280, 81, -305, 39, 139, -152, -134, -74, -14, -48, -469, 37, 51, 416, 36, -6, 208, 452, 156, -254, 272, -176, -116, -45, 164, 153, 23, -155, 25, 216, 378, -332, 3, -77, 154, 98, -300, -331, 171, 316, 13, -191, -180, -28, 39, -14, 95, 181, -247, -180, 40, 457, 9, 198, -374, -253, 88, -5, -132, -158, 334, 206, 9, 264, -78, 26, -73, -185, 252, 264, -74, -422, -58, 191, 314, 58, 90, 6, 249, 63, -110, 244, 161, -151, -322, 263, 187, 87, -318, 80, 221, -19, -132, 45, -47, 82, 174, -126, 122, -27, 46, -126, 244, 124]
1300A24p8j48P6J24J02m12j96L01K97p2j12p9J26k07J01K1K11n0n76K53L03q7
1322B2j51L0j12O60l85j04j4J72O9k50P8K59k41n2O0J37J61l13k30j45L57Q6k88
1345a94j03M92n9q8M7j81L27j95r2Qok10j19J27K51J06n6m8M4l2p1P2J04l7j11
1370b4l53M84J59l22M0J70j18L12l27l16K3L64k00k10M57j66J35r1l54K59J18
1391D0j45m6R0L49l9k83j29N33l67m2k77M58J33j23m96M32J51l59k42L57K7K19
1413B41n57K24J80R5n2k40K62p6J46k69p9L9K20n2j82K95j49j68k5j46N05k20
1435hL8j22p0lJ12J00M6l07J50k2J58j21Qp8k2J57j42j42J39J90j2Q9l45L03Q6
1460A82r7j9j10K56k65k55J12N05Q0n75k90L59J56K77n11o9K83J28j24l82L43
$$ y = [124, 46, -102, -26, 98, 200, -212, -408, -107, 190, 118, 6, -73, 53, -154, -53, -32, 179, 129, -447, -194, 109, 22, -129, -99, -211, 449, 64, -40, -54, 118, 187, -63, 15, 274, 33, -19, 41, 178, 339, 26, -204, -349, 8, 94, -194, -297, 195, 136, 48, 95, -86, 241, 46, -46, -38, -44, -254, -373, -246, 5, 111, 55, 7, 51, 19, -52, 20, 124, 87, -24, -377, 107, 266, -56, -16, 154, 36, 348, 21, -295, -272, 92, -108, -318, 139, -27, 108, 17, -337, -78, 40, -105, -151, -61, 288, 249, -34, -163, 370, 3, -39, -316, 142, 275, 152, -344, 88, 239, -120, -362, -5, 22, 241, -316, -92, 88, 183, 131, -109, 153, 77, 223, -46, -125, -86, 134, 82, -100, 195, 46, -122, -147, -293, 212, -8, 30, -92, -162, -165, -53, 47, 93, -214, -64, -86, 72, -49, -41, -119, -141, 16, -126, -268, -129, 61, 49, 138, -207, 96, 182, 85, 66, -44, 212, -53, -308, -196, 309, 389, -186, -476, -117, 39, 316, -195, -264, 19, 147, 23, -359, -16]
1481a6qP1m76O21j07l33J19p4N28q8l25q3m5N21k48j91K62j10j79k73L60O02n34
1504fk35J30j06L44j33k86K23P0J52l69K82J01l53J20l10O05J14n23L2J02K72
1525B26M2p31N47K90j2o52K51J82p4j73N4K69J34m24l29O73J1k93k39J58PO6k79
1548b96L05N9p1rl05M50n7k44m2K01K85k5n44jN25K03o09j56J77N04l09j52J54
1571D3J06m29M6L88M7j93k89%M36N2m82K5K80j2O4k91J22M96m00l65K00M40j70
1594A14l16o4L92k2Lm47k8O31j49m28K0O31j53n21J96M79j89k61j18K08N92m41
1616A29k01O2J93J15n89l7M90J65n24n5M19N8l27o3J90M03k36k39O0J33K96o04
1638a62K49R9r9k90QJ31N38k26n57R6N58j62o68N88R4q6l7j03k5L02l48l16N10
$$ y = [-16, -24, 47, -429, 192, 85, -248, -129, -203, 325, 237, -88, -171, -216, 305, 57, -134, 128, 18, -161, -434, -74, 528, -6, -241, -111, -217, 127, -6, -292, -69, 1, 153, -216, 66, 167, -186, -66, -376, 229, 343, -180, -148, -46, 226, 268, -463, 84, 374, 362, -290, -39, 143, 69, -104, -50, 219, 353, -71, -400, 273, 284, -9, -248, -90, -83, -17, -296, 9, 68, -3, -12, -317, 133, 76, -168, -210, -9, 276, 251, -293, -294, 231, 434, -175, -331, -154, 350, 41, -111, 43, 149, -280, -234, 154, 201, 8, -281, -281, 155, 207, -275, -250, 30, 18, 82, -209, -87, 409, 9, -356, -156, 284, 114, -202, -266, 126, 104, 107, -340, -368, 263, 114, -314, -294, 337, 184, -337, -141, 338, 149, -112, -230, -22, 570, 129, -72, -10, 183, 298, -291, -328, 162, 327, -197, -252, 167, 225, -102, -165, 25, 428, 192, -47, 13, 146, 442, -162, 87, 186, 87, -203, -195, -64, 474, 248, -309, -213, 345, 183, -485, 103, 197, 111, 74, -29, -54, 248, -100, -416, 94]
1661I4K24l04j26p9M13j19m56l8K85M61n04k17K20M91j96m70J34K06K4l80J80
1682a57L45K12m70k18K59K70j61k14J61J19j66j74J25P3J03m96J08O90P3m17l36
1703b71K33K81j42k55K5K13P2l22J3L38K8q0j01j23K90k97j17L8M90k00l43J22
1725a08M60r8o58K04N37k13j1n22M57L48o36J08M1M49k55m51L34K49j76o31M65
1746a07P9M74o34o9M35L5k02n9J79J09j59l61p3O14l4j89K28j49k01o5j32M45
1768A64P3l71j91K23L72q0m52J22J11L00k70k57L96J17j85k05M93l01K0k12J08
1789b5K74p1m9k54K92Rm43K05K40j42j34mJ26K35j73l56M31j29K2j68J12K7n0
1812b5m5p3k9K57J8l74K88J5J11m64M44k89K42j47k79M14K21k06l31K45J39Q8
$$ y = [94, 318, 14, -112, -191, 222, 103, -353, -391, -106, 355, -149, -366, -146, 345, 149, -321, -187, 19, 43, -337, -157, 188, 400, -70, -288, -29, 241, 80, -134, 27, 146, -20, -194, -69, 4, 107, -389, -281, 409, 482, 65, -271, -38, 243, 101, -154, -129, 84, 156, -166, -153, 185, 213, 133, 32, -91, 199, -98, -215, -177, 313, 113, -230, -108, 352, 254, -404, -200, 337, 124, 113, -409, 48, 396, -240, -132, -91, 358, 103, -348, -14, 235, 59, -572, -107, -28, 446, -188, -257, 178, 213, 11, -48, 131, 240, 81, -280, -353, 261, 227, 38, 266, 117, -84, -149, -281, 164, 237, -134, -325, -102, 270, 190, -262, -140, -29, 271, 1, -256, 140, 257, 72, -133, 360, 59, 79, -133, -25, 249, 178, 129, -125, 167, 176, -267, -62, 178, 36, -98, -102, 24, 259, 86, -270, 161, 32, 54, -114, -2, 25, -25, -70, -143, -172, 85, 103, -271, 17, 32, 143, -321, 123, -166, 76, -71, -350, 64, 285, 79, -252, -7, 132, 220]
1834B20k96K24K97o88k0L38K20J27l44m42L76J83j56l96K43L51l42k27K56N51
1854D75l12l57r0L97M10q47K72J19J50k93n8J76N82l71m88J52Q7L35l73k62M71
1875A75K77l01n73N58K10l22j68j3N22l47m01L80N54m42k46l45N63K9k36m30N22
1896c4L32l02n02M17M33jo54p4M37K44o12j44P18J97l89k24j86N75Q4n31n4M78
1918B08J11m59K1P7P04q84k29M13L84k66m13K14N98j21m40k86L50O4l55R6K53
1939D0M46l64l35M08Q2j39m14Q2M85j93k44j36K98M45k14n82M10J25rm15K01N42
1961E19j62o42O7K41M27n78o2K52L09r8n49J37N64j42n89K25L87l0k82l83K91
1982i8P29p49k68O14K01l28m37L46J07R1o95K91N91J29n46n47O28M54m47l83J36
$$ y = [220, -76, 148, 445, -243, -263, 75, 295, 422, 78, -364, 12, 195, 39, -357, -114, 237, -105, -332, -76, 475, 163, -194, -284, 113, 523, -324, -52, 67, 217, -76, -134, 42, 624, 253, -235, -83, 4, 339, -34, -296, 175, 452, 151, -422, 136, 346, 24, -144, -157, 365, 18, -383, -3, 551, 109, -137, -482, 81, 110, -126, -556, -34, 298, -4, -506, -89, 344, 343, -311, -385, 52, 296, -316, -460, 258, 455, 66, -158, -344, 231, 315, -216, -270, 208, 319, -140, -119, -42, 662, -222, -451, -38, 346, 80, -333, -119, 479, 358, -82, -368, -18, 46, -309, -213, 40, 486, 122, -213, 195, 277, 138, -276, -194, 291, 98, -146, -282, 16, 461, 247, -335, 75, 200, 191, -224, -23, 519, 357, -285, -218, 23, 450, -128, -190, 62, 371, 273, -276, -139, 425, 283, -306, -81, 306, 276, -6, -389, -98, 631, -118, -386, 228, 429, 101, -336, 10, 117, 208, -487, -196, 395, 524, -22, -569, 59, 513, 66, -317, -181]
2003a81N83m14k90r0N93J14m95j57J81J09r3q3J55O57n70m46K80N02lq31Q9P73
2025C83Q5o14m55Q08q4j1l41J31O21m38l18K44K94k45l4n24N50K68l43k36O2O06
2047D09m04k94j06P94K4p77J01M91j15k49l8P8L95m24k23l4O22k57l41J16K70
2068C8K50k52l64L79N0o0n76P73j71J84m71L7P5N07n91l3M20O8k37k22k8O92m52
2091A6l59J30O85o49l9j23O82O6p73J58J67L16l91M6r5M42n7o66L72M87k10m60
2113b55N3J95M77o80k35L84L06j79l74J60K84l4k69N8L59J9n15M0L36m0j15r9
2135a24M9K71r2l23N1L81J11l74k30J54n9J69J00k05L34k04j74J33J96n7l0l15
2157b38N40q5k20j74L35J50k03k68R9M09n05j66K84J56J33n87K36J84J11k68q1
$$ y = [-181, 402, -12, -302, -392, 201, 315, -180, -337, -156, -47, -140, -223, -68, 589, 19, -427, -147, 355, 352, -479, -390, 383, 468, -146, -601, 207, 123, 112, -229, -98, 523, 85, -233, 11, 305, 60, 26, -498, 52, 320, -23, -259, -197, 409, 5, -289, -395, 399, 423, -354, -253, 238, 123, -126, -164, -86, 309, -115, -338, -372, 250, -7, -348, -232, 38, 288, 36, -328, 51, 101, 41, -535, 238, 67, 251, -220, -183, -108, 399, -192, -225, 195, 263, 26, -196, -224, 468, 16, -343, -213, 472, -177, -216, -339, 343, 409, -364, -206, -39, 277, -114, -68, -163, 279, 222, -444, -72, 415, 205, -255, -202, -7, 470, -210, -445, -61, 245, 66, -308, -148, 136, 102, -167, -109, 250, 269, -246, -206, 130, 90, -25, -124, -75, 196, 104, -219, -168, 213, 324, -50, -280, -126, -185, -16, 84, -121, 213, 9, -165, -32, 164, 107, 77, -238, 302, 217, -3, -177, 158, 308, 105, -163, -64, 345, -160, -326, -42, 114, 247, -340, -104, 80, 191, -77, -158]
2178a58k6L20M7m19L04J48j28k08J03L79q8o05j31O32K1j21j99L20R9k73k33Q8
2200a28K71j33K11k36J09o0j56o5K85q3m6k07J80J30j95Q4lK44K0k31p4J67Jk31
2224a46k5L60l3K8j89J7J42j46j23J30n7l1N0M5k0M22n60j65L48m2P7l56K74L00
2248C00p7j36j37r4K87k56RK04M3k59q6J84K34R2l73k5J28j75J33J69j76M5m4
2271a0k36K41J21Mm05J75J62r7m8p4K60K08j90J49r9k79K3%K14J74l35N4j19K73
2295A66N7k79K4M38p98M63J73j18j06n5k91O50om70L2J65J70m04J73j55K74J79
2317B82k31j50rK74m15J30L2P0J06qj89K70q9N9q9J79O5r9j31J37j2j11o9n2Q3
2342C3lp1jJ10J45o5j33r3j43j52K91P6J05j98J04K2J66m18J32l4Q6Q6%n4J84
$$ y = [-158, -184, 136, 183, -236, 68, 216, 88, -120, -17, 362, 274, -331, -462, 170, 191, 70, -129, 191, 290, 17, -216, -128, 143, 10, 221, -15, 94, 34, -122, -187, 98, 15, -31, -238, -58, 72, -123, -39, -42, 202, 222, -9, -83, 84, 85, -146, -171, 189, 156, 184, -5, 12, 154, 8, -115, 15, -42, -73, -23, 22, 2, 424, -136, -301, 47, 5, 82, -274, 0, 300, 223, 87, -50, -144, 143, -113, -104, 100, 143, -116, -202, -18, 216, 308, -65, -90, 38, -137, -4, 165, -11, 34, -10, -246, -5, 116, 120, -285, -110, 52, -45, -93, -167, 93, 301, 111, 260, 161, -118, -95, -95, 119, 293, -42, 12, -107, 166, 223, -56, -32, 406, -392, 71, 244, 126, 20, -35, -326, 324, 318, -152, -120, 45, 215, -189, -16, -171, 103, 282, 51, -99, -108, 166, -249, -119, -87, -17, 89, 81, -108, 162, 73, 132, 43, 222, 287, 188, 57, 194, 182, 71, 2, -50, 33, 30, -41, -42, 68, 213, 148, 15, -78, -221, -373, -82, -6, 99, -99, 5, 27, 193, -225, -93, -127, -41, 45, 45, -9, 175]
2367A75k37J73r0j20MQ9j03N0nJ61k02K35Q7J03k33qP8l18O4l34L52J13n0J26
2391A10L3j39J39o3r6J07j51P8k27L45J44n78Q7Q9J98L5k57Q6k9m6o5K61P3K37
2415C71m49Nk70N06p4j87J88J70l5k65K05k82J47k71L58J55k72N0j7j33K18j16
2437BM6q4J48J59j92Nk08L07m8j8k14M30n02P6j2m0J90NJ29q2J32m44J73J3J87
2462A58q6J30m29J02N6O7j55J11L5j8o4K30k13J15P0j40L96m57j50K47l2K10l56
2485a73L08j68K42j28j8p5J79k88j12J75L05j90Q4k27L27j49m79M36j92N1J33
2506D1k81J79K44j29m44M59j5l11K79j42J19j34J14p6K1oJ33k10p0MM06l55j98
2529c72J09K87l3j3R7Q4q0n7j06q1J10j4RP0j5m0l5J73J78m9j27k74K03O1r9l9
$$ y = [175, -62, 111, 21, -99, -95, -6, -109, -59, -64, 97, -105, 130, 217, 320, 87, 79, 157, -161, -97, -431, -79, 34, -16, 110, 143, 4, 143, 80, -16, 91, -60, 18, -209, 136, 280, -298, -211, -122, 76, 111, -146, -60, -89, -135, -200, 61, 134, 371, -78, -73, -343, 163, 89, -98, 90, 260, 225, -40, 165, -117, 30, -241, 117, 272, 0, 50, 33, -100, 118, 2, 48, -36, 112, 271, 79, 84, -124, 183, 135, 117, -97, 333, -169, -93, -105, -145, 45, 50, 179, 97, 229, -215, -42, -29, 158, 72, 202, -227, -125, -69, -2, -157, -46, -11, -29, -93, 137, -76, 39, 109, -31, 365, -92, -242, 5, -27, 183, -173, 135, -33, 209, 81, 63, -12, 167, -121, -233, -58, 247, 57, 141, -86, 241, 92, -387, 49, -143, -92, 41, -240, -61, 183, 54, -390, 69, 54, -257, 22, -120, -1, -135, -21, -97, -76, -82, 51, -159, -229, -225, 181, -174, -372, -263, 24, -9, -22, 75, 159, 79, 22, -84, -165, -55, -69, -60, 10, -5, -45, -80, 93, 271, 222, 95, -179, 24, 85, -14, -53]
2555e3oL76l81M4J60j69k8j47K60O5n9j29K38J19m42J40j90K12k36K61j16OK49
2578A74j12j83L99l76K47j82j75L23o0k1n6J88k7M9k52L15j80j62K66p9kl80M72
2601A86j35k9K53k96N1N1j28Q7no4R3N1J19o59M01K75m07J69o4J18o1q1j65K06
2625c4J39M6m05J14K88l99J93K6j12J18J03R3k12j07J61k55L22J62j13p5j34p9
2647a60j39L25l55K00M1L63k17N3L92l41k48K15L3j69K20l2l39O2P4L65l25l5
2669a7Q1k33J75q7j38J33RK39k8k79L34n3j95j99N38l34L5o7K32o7j23N7k3N7
2693D7JK39l32J52L9j5N9j55PK7M3j87J62k32K24j65M2J63k1Jl13K35K51k29M5
2718H8j79J80M4q6O7j40Q0q7N8Qr1M9k23K05l0J78r4r5L51l32J42k11J86mj45
$$ y = [-53, -59, 317, -64, -20, 140, -29, -57, -204, 56, 121, 62, -67, 171, 290, -152, -12, -202, 10, -226, 35, -81, -75, 174, 62, -121, 278, -98, 149, -33, -208, 115, 55, 34, -22, 166, 139, 188, -64, 251, 71, -91, 175, 96, 94, -286, 186, 51, 22, 275, -21, 30, 81, -47, 40, 35, -29, 64, 115, 234, -425, -24, 251, -156, 13, -51, 67, 6, -75, -240, -34, 105, 151, -254, -140, 148, -251, -58, -32, -144, -26, 77, 170, -42, -149, 12, -243, 79, 241, 128, 53, -81, -160, -299, 26, -329, -129, -88, 275, 58, 111, 503, 162, -86, 129, 162, -7, 213, 181, -158, -96, -22, 343, 18, -17, 64, -169, 6, -81, -219, -86, -77, 162, 134, -145, 189, 136, -59, -258, 280, -54, -19, -86, 146, 79, -44, 13, -10, 47, 48, 287, -45, 107, 146, 131, 190, 35, 42, 69, 112, -75, 87, -145, 79, -86, -44, 119, 98, 99, -214, 21, 272, 43, 88, -91, 89, 133, 47, 114, -26, 54, -33, 25, 33, -58, -9, -232, -27, -57, 121, 27, -68, 283, -49, 93, -118, 68, 64, -81]
2743h1O9P4P2K15k62k08k03J35K42M6KJ20j53R0k53J18K75l30q1J92K34j04k55
2766d6j77K19j39j3K11m3J10k80J24J00J28j70k84J42L46l68K52l02N00j33j62
2787A5o4J8q7J67P1k27R2j23K61l45J04J82j08j47J20K57j59k68R5K14k19K54
2809A03Q4k16l15L56l40K23P1l8j40M8K33l29K05J70o0K80m01J77j25j1j44L8
2831a31kJ28K04l53L54j73K28l64L80l02K43J06k13k14J08j43K76m9K5J8j86J25
2853F5r0k52K31j14L18N3l34j03K63K04j79j64R3J34r9J20j19k4l1K49k42k50
2875b71K11K73l51J44%P3m06J07K62m8n8N3Q8J97l87j43L87j95o1M8k6K12k8K3
2899A04p3j8k00J28q5K27j91Q8L7n0k9J34K8l10L36j04K05k24K30k37n9N6p8K33
$$ y = [-81, -12, 62, 134, 349, 87, -121, -324, -189, 53, 99, 101, 221, 68, 158, -95, 23, 298, -32, -113, 79, 313, 209, -46, -223, -4, -143, -156, 55, 12, 122, -158, -34, 66, 194, 24, -260, -118, 228, -140, 112, -190, 310, 177, 15, -49, -31, -118, 49, 120, -107, -15, -138, 123, -222, -118, 64, -44, -191, -71, 186, 27, -241, -146, 68, -151, 103, 187, -29, -344, 12, -328, -105, -34, -72, -212, -164, 69, -260, -55, 115, 55, 335, -66, 111, -14, -25, -169, -131, -133, -5, 199, -154, 200, 27, 255, -109, 271, -31, 212, 318, 105, -109, -1, -144, 132, 83, 108, 126, -60, 65, -25, -277, -46, -160, 158, 211, -123, -226, 37, 241, 62, -102, -9, 125, 26, 146, 27, 3, -28, 221, -21, -271, -60, 213, -138, 6, 6, 79, -327, -220, 42, -6, -64, -11, 77, 274, -113, -256, 131, -64, -125, -77, -103, 109, 81, 104, 31, 13, -187, -59, -144, 83, -108, -20, 17, -33, -62, 72, 100, -210, 126, 22, 227, 3, 233, -4, -63, -7, -85, 148]
2923A48l37P0PN1J25J59l24L67p5j35j29J68j19O9k73K85K2K99o14K6j6L0J66
2946c0j66L00M8j57J68j47K08k68J1l0K38j1k69Nq2L76j77j54R9m1L7j03K44m9
2970E0j39Q7r9l3J96j64K94m25J64K16j03j62J67j9q0j72K14j85j21K76Q3J1k27
2993a71J66K2P3j27k76M94j60q1J36l0k87K52n0k5J42k6p1l2N5j98K24Q6p6k01
3017a61J87K82k06j00o6J26Q3p8r1J05l8K6k19K91nq0r6o4L99k47k18J13j22K19
3041D0J49m35P9M42r4k36k68L65j70k61L24r2RJ39j97K57p4J63R3l78Q4J22k1
3064D0j11K34k52K25q5q5J84o1k29J71qN1L6j81L49k14p7K17j13k32o4K06J32
3087A33j08K85l64k5L68k17J94l57J59P6p6J00j85J85j46j50J70N2p5j87J43J12
$$ y = [148, -189, -119, -112, -61, 64, 223, -101, 266, 191, 56, -73, 95, -24, 45, -228, 57, 79, 378, -236, -210, -226, -196, -30, -196, 104, 152, -5, 163, 16, 224, -44, -33, -63, 175, 164, -105, -100, -182, 194, 17, -137, -38, -79, -42, -145, 99, 50, -89, -2, -101, -134, 62, -102, 192, -233, -69, 147, 44, -118, 49, 30, -50, -222, -8, -193, -314, -38, 45, 56, -171, -5, 17, 90, -37, -313, 181, 21, -60, 76, 46, -241, 11, -39, -64, 78, 52, -19, -51, 4, -194, 30, 116, 40, -161, 26, 308, 102, 2, -64, 62, 145, 67, -24, 81, 43, 69, -150, 141, 136, 56, -40, -104, 295, 48, -170, -57, -179, 40, 189, -246, -167, 275, 181, -55, -323, 42, -128, -389, -65, -157, -148, -9, -206, 51, -23, 140, 233, -145, -61, 61, 40, -71, 163, -89, 136, 51, -34, 150, 89, -140, 31, 23, 74, 110, -71, 278, 64, -13, 204, 91, -141, -205, 1, 133, 25, 310, -54, -79, 289, 72, 266, -91, 68, 144, 68, 168, -17, 168, 22, -128, 42, 94, 19, -168, -25, 87]
3109H7k6J7J4n6m1J66j16J49l37L05o5l7j22NK07k29Q9J92l41k08M69p1j38n9
3133a46J84Q5k69K03j18J00O5k94K15J06j47k16J3K01j64K54k19K25M6J3j53J52
3155A36l66L04k35j1K80K2j39J3RJ97m4L3P9k79J63n4N9l66K65j90L44k64j42
3178a86l0L25N7k55P0K1l3j30R7K22k66K08k09m2k6J86R2j43M02l22m8K52j57
3201H5kj52p3K24q0J39k69J05j29L07k13k9J66j39J21l31K71j4n0M3P5Q2q9j68
3225a20M19l90Q7o9O0J01r4N0k40K54j27q0K70L6No9N6p1R5k16K8k71N18Q6n34
3250b16R8J45K07l09q0K4J55J15k49m5L77k69n3r0K22j24l7P0P8J86k18j58K14
3273D3l5j78J05J93j25l43N65l23O0J3J20j84O6R2j00K49l64O0J54j89K09J29
$$ y = [87, 61, 78, 92, 36, -5, 161, 45, 194, -143, 162, 97, 60, -62, -57, 150, -79, 10, 202, -139, -347, 122, 51, -87, -146, 38, 123, -146, 57, -61, 39, 104, -190, 25, 131, -16, -232, -219, -18, -182, 72, -147, 78, 124, 137, -16, 136, -230, 74, -161, -172, 108, 130, -9, 4, 13, 210, 166, 199, 278, -1, 162, 108, 167, -199, 66, -124, 220, -44, -186, -216, 109, 166, -89, -19, 2, -31, -161, -64, 158, -108, 100, -109, -151, -177, 9, 101, -42, 360, 38, -10, 242, 85, 83, -69, -142, 82, 2, 141, -128, -23, -152, 155, -58, -87, 79, -60, 61, -270, 1, -13, -63, -20, 55, 137, 48, -120, 299, -91, -4, -73, -13, 88, -6, 44, -196, 58, -69, -149, 121, 157, 162, 93, 149, 78, 173, -43, -15, -286, 232, 318, -216, -118, 27, 234, -75, -155, -131, 24, 139, -110, -155, 222, -47, -100, -190, 32, -92, -129, -59, 19, 205, -13, -171, 43, 8, -170, -65, 128, 3, -340, 225, -98, -38, -25, 95, -89, -23, 69, -31, 218, -146, -86, 68, -121, 88, 217]
3295B17l61K34j92kJ21j92J05J72q8j5J39l74M68k54J21J29p3n5j83J88J31k51
3317a5J56k15k2K47L7k41q6p1J39L9O2k5j41J1J95q9J69k58Q2J73j91j96R5J44
3341ar4L58l01l8L87l86L58l92q8q3M25j92K21j12j53O4q1N6k92K25j4J73J9N5
3365A14k39j4J86l35N03l27K00l48K88k71M04r8J50k29J03L9o7Qj02J13k8j51
3387a01J80J1N1k90J11oj03k0k27J91M2L51j68r4R7J22l57J07P4J21j52k52K84
3410b8J66m6J23k03J33m1J0Q7%j04l82J63o9M13j49n4k10K9K38j25l02J38M16
3433B03j17j32o4R7J03K32m32J54j81L6j26R3j15J25l6J55o4j14M86o09L39o9
3455c6q4K32k8l17M63l3j44J25l78J95K32j58N2P3k3k00n5q4J51jK0j62J71j5
$$ y = [217, -144, 90, -102, -104, 17, -175, -70, 102, 14, -1, 138, -236, 232, -22, 99, 228, 155, 100, -83, 105, 236, -15, 141, -74, -96, 151, 188, -53, -139, -210, -71, -32, 30, 5, -136, -125, 70, -19, 150, -108, -26, 147, -44, -240, -145, -1, -95, 263, -38, -76, 311, -75, 283, -109, -197, -280, 145, -47, 174, 62, -91, -27, -108, -52, -344, -119, -133, 40, 59, 114, -125, -139, 47, -288, 215, -112, 88, -260, 28, -243, 161, 63, 213, -16, 87, 126, 59, 67, -35, 78, 50, -101, 79, 90, 141, -149, -38, -44, -147, -167, -394, -203, -161, 190, 22, -72, 25, 147, -210, -103, -29, 92, -60, -312, -28, 138, 92, 215, 12, 145, 104, 114, 201, 201, 97, -285, -122, -191, 222, 73, 19, -191, -162, 76, -49, -351, -213, 203, 86, -46, -110, -13, 90, 322, -110, 44, -137, -101, -227, -134, -249, -124, -160, -5, -69, -183, 303, -306, 33, -36, -120, 112, 84, -233, 230, 197, 53, 178, -200, -5, 227, 69, 121, 194, 171, -29, -84, -168, -17, -18, 2, -160, 11, -4]
3479dl3Q4J64j46q4K52m9m7p2k07K8K1K26O8l92P5l4J46K10k04K9L14n68K43j52
3504a32N6pJ19q2K10o4o2J27lk22k30N20l57J42M09l10l38K33R4P0j66J39l34
3527a88N20k93j32K78j23k37Q3J2n9L51l96L54r7j86J2j36L14J92k17J5J23n28
3549c38L93K9l52K89j23K07l59K52q3K11q5J21j70j04L30l00R9o9j91J06K58j6
3571A05k97J36q2M59o88M84j51Q1m6J72j32m8Q4j83K27k30M4k13L13p7k28L96
3593A26j7l39M51l33J79k23J94p8J89j13l0J21k68J30j02J88J81k63J10Q3q3k69
3615a66J06p7J57j24p9J01J84O5o0Q5j61l8j45j64K59L3J8q1mL09J1j80lJ26p3
3640I9m6Nm5K24l22K23j88L1K54k05k7K56m09K17k25j94K72J06m53N37k36p7J24
$$ y = [-4, -37, 47, 211, 65, -19, 233, 184, 137, 65, -142, -114, -93, 133, 201, -191, -116, -150, -4, 206, 2, 31, 345, -223, 20, -132, -76, -83, 36, -46, 164, 100, 38, 165, 162, -60, -290, 230, -127, 15, 424, 114, -224, 9, 103, 173, 7, 146, -188, 332, 39, -93, 185, 62, -175, -92, -80, -139, 212, -184, 170, 73, -113, -101, -237, 77, 269, 52, 67, 190, -338, 55, 84, -268, 21, -102, 105, -254, -2, -85, 126, 41, 162, -8, -112, 218, -82, 17, -52, -243, -137, 121, 105, -192, -56, -138, 321, -367, 117, -34, 47, 1, 173, 41, -7, 77, -106, 121, -109, -65, -278, 35, -42, -270, 126, 109, -230, 221, -112, 67, -156, 38, -40, 149, 36, 6, 127, -141, -11, -113, 75, 256, -7, 103, 186, 103, -166, -60, -137, 20, -104, -183, -82, 102, 167, 107, 192, 31, -7, -152, -316, -57, -24, -6, -87, -91, 218, 229, 49, 46, 172, 99, 53, 58, 13, 237, -85, 138, -50, -19, 235, 30, 3, 259, -150, 67, -158, -352, -80, 26, -427, 110, -126, -203, -79]
3663g9J07k30Lk3L97J69l71r6NQ7J13q0R1o3R1l08J8J26j53J82M07m46J76l19
3687a96J70L0m3J13o8L6J84j9j97N2K41o08J25L19j38J8n5J86l35J93Q5j38J31
3710H6k35J30M02j85j24K21k77j86P4N9L2O0j21P3j40K27m1j47J21K5J5k98L06
3733G7j27o7N4L5P8j77j87N5M74m84Q1J63l4M6r6j05K76J2k79K65k18R4M2m7q3
3758a52r9M76j59k26J72p1j8M2k01L10R1j03j15L33k35j29J10P6o5k47j55L49
3780a6L83l77r6J8L79l18r4j03K84k49J29L08k44O0j38N6J08n8JJ4n8J02k9R8
3804A60j66J23L8M0j11k01J90k04J97J5J15k37j8nj9j7L69l92o5K12J64J00k53
3827C5L1j65l0K28j99J20P5k96M75k83J13j48j33N2K7j43L11Q6j23LO7k5k25J98
$$ y = [-79, 28, -202, -199, -222, 175, 344, -27, -123, -118, -31, 82, 2, 93, 30, 121, -187, -169, -43, -196, -14, 393, -53, 123, -196, -26, 4, -39, 74, 6, 42, 226, 207, 10, 62, 303, -305, -180, 139, 1, 19, -36, 150, -185, 8, 93, -45, 86, -149, -19, 383, 198, 74, 295, 18, -168, -94, -35, -3, 57, -64, 9, -131, 96, 55, -92, 29, 54, 69, -229, 77, -50, -117, -63, -28, 50, -127, -314, -259, 215, -269, -188, -25, -59, -13, -109, -214, 62, 74, -205, 60, -158, -64, -22, -69, -152, -251, 225, 66, -160, 12, -59, -77, -35, -236, 74, 165, 62, -53, 280, 45, -84, 26, 102, 37, -210, -365, -16, 367, -10, -106, -88, 291, -27, -121, -224, 60, -189, -60, 248, 4, 64, -74, -18, 90, 32, 33, 47, -11, 91, 62, 160, -6, 117, 155, 195, 84, -117, 73, -131, 66, 81, 196, -41, -59, -64, -83, -100, 269, -123, -188, 24, 188, 288, 35, 66, -99, -129, 99, -100, 20, 95, -201, 274, -9, 104, -44, -177, -125, -98, -241, 70, 156, 33, 36, 103, 78, -147, 51]
3851E1j17L11m8j61M8l42J23J96o8K18m06J95J96k09J53k16K9R7K0jo5R4l5J17
3875A80l62J01J95l27K64K5n1n7Q2jr5J02p0K14k05J27J3l04J75j26J79o0J18
3898A17m8j14k31K09J51j22J34r1N9kK4J93k44l46K03P4MK37j97j50P7J34K60
3921C31n21L18J40j12m09L07J63k41r0K7j83K57K7j23J12P2L5q8r8K2J62n12N07
3944A03j15J00m2j30j4p8K32j79p7K89J43k06J3q5J97j40J65k88m8J81Q5q8R5
3967A13l75K13j89L80n6j03J65j6m29L62l7L4j47P5J5p6j7J16J4j1j28J53N7k67
3991a54M1J19j72j10N02m65L87J65k52j3J24l6l00J13j00n0J15K01j57K72l0l35
4013a35J33r5M0J10o8j07J85j71ORJ5j40j2N39l57M9k68K87j28J02j27n7K89j61
$$ y = [51, -66, 245, 197, 36, 84, -258, -135, 61, -7, 211, -195, 0, 196, -13, 140, -76, -47, 50, 70, 69, 4, 98, 63, 180, -182, -81, 114, -213, 51, 76, 25, -32, 50, 49, -46, 56, -14, 200, -5, 122, 135, -169, 6, -120, 59, -1, 117, 69, -45, -276, -67, 84, -38, 96, 5, 64, 62, 86, 279, 35, -311, -108, -34, -30, 207, 10, -140, -63, 71, 331, -190, 128, 268, 156, -253, 54, 217, -24, -114, -87, -270, -13, 14, -109, 3, 75, 110, 22, -76, -54, 108, -404, 103, -12, 88, 46, -84, -98, -176, 56, -123, -200, 89, 232, 26, 39, -46, 151, 11, 176, -112, -160, 21, 106, 18, 113, -262, -49, -238, 142, 86, -17, 148, 132, -297, 65, 28, 62, -85, -10, 5, -71, -88, 28, 42, 31, -97, 56, 113, -154, -113, 6, -166, -276, 226, -239, 148, 313, 61, 48, 172, 136, -164, -51, -151, -201, -86, 115, -42, 230, 200, -135, -2, -97, -57, 53, -15, -122, 63, -108, -102, -93, -78, -218, -230, 309, -48, 1, -267, 20, -108, -6, -133, -190, 99, -62]
4037f2q9K2J16K03j29n9J64j02m01M24j58J66j01l9j01O8J21j04j23K61l5j51
4059a09J84l08J28L3K33j80m3J07j96L94q4j26Q9q5J56j52M3p6p1j48K75k41R4
4082h3K36Q2l7l34J31j40L62k70L48k97J29j96J47n0l52M37k18l12L76K6M0r6
4104g1q0J76P0l81K91J40j03P6k16K79j33k06J27m0J44l72J72J01j17J46K95k72
4126B6J68k78L2M2j05J49K4j93J60lj17O0R1Q1l44M46m10mL89j23j35J87k7j29
4150a3r0J04M9j14K78Q9k65J06j60j39L64k74j28J60k9L9O2O7l08J62K28j26R5
4173A57K07k99k05k92L43k24L94L3k29K13l67R1Q8M02j79j00J7m4j64O4J18J96
4195B20J57n43J48J37l8j64j0p9K78j97N5j04K94l15J87r8j08r4M28j07j52L26
$$ y = [-62, -151, -129, -13, 190, 61, 2, 166, 64, -337, 87, -71, 95, -6, -45, -146, -78, 43, -61, -184, 77, 42, -109, 75, -233, -105, -72, 161, -19, -62, 45, -151, 243, 159, 33, 122, 37, 193, 41, 84, 8, -63, -211, 64, -177, -83, 153, 235, 198, -136, -5, -145, 217, -53, 295, -2, 127, -69, 78, 28, -324, 113, -105, -417, -41, -15, 25, -71, -151, 25, 95, -286, 5, 145, 42, 118, -98, 181, 48, -158, -31, -71, 73, -299, -127, -26, -143, 3, 298, 26, 194, -84, -52, -10, -115, 34, 58, -135, 25, 22, -95, -35, 56, 137, -207, 239, -171, -175, 214, 91, -44, 143, 116, -13, -103, 1, 50, -64, 214, 303, 38, 144, -16, -155, 209, -65, -193, -33, -62, -23, 39, 106, -202, -40, 188, 62, 157, 364, 65, -140, -432, -89, -313, 81, 114, -115, 98, -269, -178, -90, 312, 133, 33, 50, 6, -158, -94, 24, 220, 377, -166, -18, 119, 81, -83, -93, -172, 106, -91, -36, -140, 154, -161, 26, -72, -180, -274, 154, 47, -105, 221]
4217B21N5l89K59j19k80L92n4j32j7J48r1K29j44j15P4j86l7L16nj14j6m3R1p0
4241b7j14J62K3j08m0J69l9O1k02K37r8O7L5R5lj54N1k58l2J26j21rk4K08j18
4266a13K86j49p8J83j05Ll2p3L4J99n8k55K49K06q8k20p9J22m7M0Mj92J22K59
4290B18j65R1k16P7k24L06p1j28J0j23L59j21k47L25J14k24K71j35J27k46k25
4311b27K29j1k3j86J78K29o8j22lk20K7M11r6k44k4K16j07j62J24MJ46j36J93
4334A28l2l41K63M32n74J51r6Q8L5m68L45K80q9k44J20j78J73k58J29m0Q8J03
4356A5J65k05j93L63j28J42M7j84j91K51k05P4K17m70L66r6j42M0J11K14k36K20
4378A75o9M8p3n1l0j73K07r9L6O1K21k5l01OJ50K3q8K21k19j9%j60J69j9R5K98
$$ y = [221, 276, -113, 146, 27, -253, 139, 85, -47, -64, 84, -7, 222, 78, -37, 37, -149, -186, 130, 125, 11, -5, -48, 43, -27, -141, 21, 44, -64, -104, 65, 26, 87, -115, 122, 24, 91, 126, 221, 218, 64, 115, -143, -175, -49, -170, -179, -203, 5, -113, 173, 24, -54, 129, 24, 27, -5, -78, -44, 155, 97, -158, 91, 297, 209, -11, -90, 32, -15, 25, 29, -163, -41, 218, 53, 144, -72, 5, -219, 87, 16, -112, -102, -225, 134, 13, -234, 91, 205, -19, 252, 117, 244, -2, -227, 2, -9, -32, -218, -40, 189, 121, -1, -4, -224, -197, 214, 118, -126, -150, 66, -41, -203, -79, -75, 71, -65, 128, 96, -245, 18, 450, -124, 27, -69, 19, 54, -414, -69, 211, 122, -122, -2, -180, -7, -265, -136, -176, -88, 15, 180, -25, -218, 145, 17, 159, 206, 22, -169, 82, -123, -49, 168, -302, 64, -32, -174, -134, -23, 191, -45, 175, 106, 154, 81, 30, 0, -173, 34, -65, -29, 32, 253, 228, -73, -67, 83, 106, 18, 239, 20, 1, 1, -159, 10, -9, 86, 384]
4404C84o26L91j60k3o0J3j34N22k96j51K90r5Q7j23l1j27J46K45n73J52N24k12
4426A43o7j53j9Q7r1K50ok70J22j70J07J63k98J86pJ6j28R8O0K6j89J14n1L6j22
4451a63K25k56J07K92n8J29l50N4K57m02J92j15J48K3k62K34J89l16R5Q5m7l07
4473b46J42j13L25j05M2L3k21k4O1M4M6j30n8J57k30L98k11K00j09J21q9k8j44
4496a39K19o4o9ML6J7K9j5Oq5J59l96K91J37j29n4LM28k39k46L47j43j14j29l4
4521a80R5J09l8P5N6j99J51r5J8J90k4l02O8Q8J02L0j07k06L66k56l9K31o0j46
4545g3L44n08M1J65K35J15m28KJ98l3k80L40j32rM6J22r0j4m8J51p9l3K7k24J06
4570e9L0mq2O0l49M01L6J08NO8k49N3j14J61k51K4N1J04j19M4J66J24j91M0L5
$$ y = [384, -242, 149, -11, -34, -94, -81, -215, 307, 11, -140, 150, 55, 142, 19, -12, -139, 7, 252, -321, -169, 355, 143, 76, -77, -96, -9, -100, 150, 144, -126, -4, -174, -67, 96, -202, -16, -23, -7, -135, -37, 23, 49, -140, -26, -77, -41, -163, 62, -194, -87, 205, 147, 276, -74, -20, 237, -165, 27, -88, 60, 83, -179, 55, 244, -72, 23, 108, 61, -246, -104, -217, 108, 3, 45, 78, -143, -167, -106, -62, -16, -146, -204, -47, -277, 121, -90, 110, 1, 122, 33, 5, -139, 80, 16, -53, -49, -13, 4, 33, 18, 24, -61, 98, -298, -7, 130, 1, -53, -50, 378, 139, -107, 240, 97, -17, -146, -180, -85, 24, -14, 61, 117, -82, 69, -26, -8, 182, 158, -144, -76, 12, 114, 144, 37, -169, 197, -59, -98, 133, 73, -73, 271, -237, -196, -31, 204, 319, -109, -107, 91, 58, -222, 118, -14, -23, 23, 145, 55, 41, -7, 144, 65, 32, 59, -165, -59, -29, -33, -115, -55, -404, -3, 33, 141, 146, 214, -35, 18, -96, 65, -186, -162, -111, -7, -126, -82, 84, 208, 17, 57, 92]
4595I2J49k06jN8O2O1j85j33K31j74r7N2J55k00J09rj0J64p4k64J11K47j02j8
4619A8j37o3K65O4j9K00k47j09K46j15P8r3Q5r7J46m25J90L9j67J01l21N98m19
4642a82J60j06K98L2l2j13m5j84j6K31K05m17N6K01k68K65j85l7L54k82R9l8L2
4665B8m6J0L14l91P4o8K86k77J53Kj80L03k10J77k92jJ95k69J61KJ6L40k73j10
4689e6J75j72K11j53J6n7j87J07J23L42l65L8J31k63p3K03p0J82j58K1J02j96
4711i9j30K15k8L1L26l30j02J28j7k7j29P8Q9P6j27l3q0k9R1K3M00k82j02qR5
4736B9K9j1L2q0k77K35K54k52J12oJ31n09N0L66j26k4k4O2j26K31J0k03J12O5
4760H0q6J74%l24RK67p0Ql56L61qj10J52l06K12J75j53n2K5J67l97J48o6K70o0
$$ y = [92, 241, 35, 34, 92, 154, 215, 30, -103, 128, -46, -143, -91, 64, -136, -27, -36, -46, 118, 44, -220, -109, 138, 36, 18, -119, -182, 83, 147, 128, 328, 81, -28, 218, 103, 181, 88, 173, 76, 222, -203, -13, 26, -141, -40, -361, 237, -182, -22, -128, 170, 202, 170, 57, 12, -172, -188, 43, 248, -169, -113, 88, -180, 85, -100, -137, 217, -65, 34, -4, 28, -18, -8, 306, -85, -11, -79, 207, -70, 83, 85, -95, 208, -2, 175, -117, -118, 77, -192, -31, -29, -13, 327, 54, -56, 119, -53, 158, 5, 21, -36, -223, -116, 7, 349, -16, 22, 153, -110, -183, 20, -50, 132, -26, -5, 97, -99, -229, -14, -42, -11, 315, -15, -117, 11, -6, -33, -162, -84, 5, 81, -46, -79, -159, -188, -97, -74, 326, 44, -58, -66, 29, 58, 47, 79, -1, -278, -43, 211, -41, 71, 65, 196, -313, -263, 103, -23, -47, -71, -9, -135, 96, 106, -97, 15, 80, -6, 168, 168, -156, -147, 120, 50, 58, -298, 63, 55, -55, 97, -209, 3, 178, 25, -27, -2, 165, -232, -84, -150, 120, 60]
4785F0j53J99j91K9n1K19j27rqn3q2Q5M02j60j04Q6k4J09l80K55j56q7J18o4J21
4810C4l20K21K08j73J37J25o28L20J16k85M18M4l67J69k2K07k72l7j15Q0K39o4
4832C5J3p4m4J58L1j29j28J38K8M4j78P1J54J30n73J84K67q4J53l90M51k54J61
4855A64k35j9J87j58J0j55J98J74j11k14O0J87l51R3L07J33k08O9j75J31k07J43
4877B3J85j85o5J2J79j91j96J04m4J64R5M3J20m86L33k18K34l67J67J70j74n7
4899a54L80q2j25m2r1l9L52k48Q8k32M28k81n2o0J52O2j52J33j33L7pQ8%J2J86
4924B20j85M7O0L7J56l37l14J46K10j65J68J80k11N5j05J36k30K0q5J52K61j80
4946C6p8j78L22jj83N5j23K10k7R1l3M0q0j9m4L3O1j88J38K08j03j54M4O2J1j79
$$ y = [60, -93, 106, -85, -56, -107, 112, -15, -24, -32, -85, -167, -82, 320, 160, 56, 142, 118, 227, -153, 102, -54, -141, -23, -87, 34, -286, -65, 143, -30, 107, 232, -396, -76, 40, -245, 173, 217, -150, 19, -3, 204, -68, -105, -220, -140, 99, 35, 48, -26, -70, 88, 119, -10, -138, 0, 28, 72, -106, -35, 119, 249, -324, -140, 127, 43, 196, -194, 257, 3, 164, -71, -90, 97, -61, -51, -206, -8, 166, 55, -159, -99, 88, -263, -170, 137, 270, 62, 131, -44, 87, -120, 23, 208, 23, -42, -30, 149, -42, -238, -134, -178, -14, 81, 124, 244, -242, 91, -127, 107, -260, -93, 77, -97, -154, 226, 144, 19, -23, -114, -153, 199, -49, 39, -193, 235, -46, -98, -158, -6, 56, -96, 37, -96, -59, -66, 22, 22, 34, 220, 35, 82, 142, 179, 335, -2, -316, -170, 40, -125, 43, 223, 12, 67, -38, 98, -132, -112, -197, -45, 216, 36, -42, -220, 102, 101, -82, -27, -150, 60, 33, 124, 91, 131, 51, 32, -12, 21, 82, -106, 32, 240, 137, -17, 27, 89, 100, -79]
4972g9o5KK1K63j66l0p7q3k1J49J91j76J23k36K9L14P4j54k72J07L7L45j31j42
4996B3n2J97l36K4p9K33LP1Nj27J36k15K10Q5k28j33j1L72j98M9J74j70N8m2j57
5021a08J51j44o4r4J49J42L16j64m94K46K12J5L5j63j41J72j88J11lj0J2j8O6
5044C6J64k82L6L04np8o6R1k32K1j73J57l0J4L7N6r7J27o0o9O1M2j73J30K00k31
5070b0kl12M52o2n7K4P7k10M82n97J29P8O4K03l53M3J10m0r3k6k8J82k15k4K12
5095A7qj31M9K93j77j76PK2L03n7m95M67j32L4N9l9M10n10J0K25K37m39K8j61
5119a64kL23k15p7j00R1J10J61q0Ol1j62L63k16q5K63m46K59O3O2o6J32l03J12
5143bJ55j69R6l86P9N5K06N3j35k61J33J46J11j09O4M9R6k56J39rj61K67p7Q8
$$ y = [-79, -144, -142, -121, 142, -24, -54, -131, -214, -235, -86, 105, -71, 52, -184, -155, 159, 233, 79, -193, -86, -49, 296, 165, 23, -29, 168, -168, -144, -223, 10, 13, 84, 89, -38, 98, -117, 93, 178, -50, -183, -194, 178, -20, 29, 203, 33, 91, 49, -108, 43, -101, -165, -259, -110, 32, 348, 184, -310, -64, 148, 163, 198, 35, -106, 66, -122, -11, -14, -24, -12, -30, 36, 200, -82, -46, 258, 253, 175, 109, 200, -32, -11, -184, -27, -57, -43, -6, 50, -47, 80, 20, -49, 12, 54, -119, 11, 211, -20, -22, -334, 118, 56, -1, 23, 100, -110, 372, -225, -96, -18, 46, 249, -104, -61, 49, 9, -84, -110, -138, 44, -171, -195, 17, 9, -122, -73, 220, 43, -133, -126, -104, 199, 142, -353, 114, -18, 16, 75, 36, 446, -64, -54, 171, 408, -31, -3, -164, -166, 157, -58, -135, -235, -144, -34, 127, 47, 53, 22, -140, 223, 7, -78, 185, -261, -2, 61, 123, 57, 189, -114, -2, 153, -16, 80, -306, -227, -172, 34, 87, -48, -309, -176, -30, 81, -28, 36, 85, 181, -75, 64, 55, -106, 161, 84, 172]
5167A72j73j59J37J88K4j23j94K46N9l44J85p0Q4l94N14k61L97r7pk69qNP8K40
5191B30l03O5n7O8o8JL1O4r8m6J79m8n3r1J03j59J40J25K9J15j84o3p6L54n7l30
5217a29L3k2K91j18j00J89m56J82K12l5M8J14j21k60j88L98jO2j82k0J03j21J34
5240A3m12M54k20K12k43K44L6k35N15n05j42P4M7J18J35k24K20r3j71n0K14M70
5262D57k49m7M7j74q0O8P4k56l1L02j62j2r9R8K04m16L71K7n3n5oO7J24j33l29
5287b63L65mk53R8p8Q2L7N4P3k50n2j5O9R8j67M68l44q6J51q0k27K37J9K18j34
5312A6J07j48K64l95J71o0J28K8l1j9p4j60J69m14M11O0l14K49k3r6J0J45K58
5335B82j94k41J60J54j9j2k06J9K86j51q8j48J71r9P4j30K43j55M0r9j12J14K92
$$ y = [172, -1, -160, -23, 165, 189, 66, -128, 118, 177, -167, 18, -52, 32, -362, 152, -109, 288, 191, 184, -85, -93, -88, -10, 230, -73, -8, -65, 3, -65, -64, -33, 31, -67, -113, 66, 18, -35, -126, -23, -182, -42, 83, 112, 227, 43, -20, -96, 258, 201, -129, -96, -118, 173, 55, -45, 144, -312, -130, 82, 47, 95, 209, 88, -172, -360, 38, 37, 99, -83, -103, 0, -121, 13, -399, 55, -165, 47, -196, 48, 84, -151, 364, -141, -283, -209, -162, -44, 91, -133, 87, -6, -177, -227, -13, 457, 208, 161, 208, 34, -46, 22, 96, -160, -191, 111, -51, -63, -162, -64, 140, -276, 95, 122, 69, 14, 8, 75, 199, 66, -263, 102, 98, -155, -57, -135, -53, -16, 38, 111, -139, -191, -206, -137, -39, -206, 262, -82, -168, -17, -97, -324, -87, -68, 150, 16, 123, -25, 239, -156, 15, -45, 83, 111, 80, 61, -13, -173, -4, -418, -7, 53, -261, -12, -35, -131, -121, 24, 282, 88, -153, 7, 161, 142, 130, -76, -57, 229, 78, -10, -158, 13, -86, -12, -142, 101, -54, -14, -113, -225, -111, 181]
5358A81j58J04l39J28J0K43n3j27m1j52RL06l4o6m0R4J67n30L65j08O8mn0Q2K9
5383H4P1j8o4K32l75j8K00l32K69p6j92J33M5J57J02l51J00K21l2r2j86K2K22
5406A22j74J93k94K94pr5j24J38k9l13L42l8R1k7k30P0m8k7J01J81P4l69R1Q3
5430EK00k10l00L02o8M7j67K59l35K60j49K88l2Mk7J34p6l1j55J60j46R8m5J59
5454A75j8q8k41J52J37l57L03o6N4k72K65k5J72k26K6j42M2MN4K49l47L08Q0k56
5478a7j38N84m21k66K40R1j16J55j73K30mj17j90L49j45K19n44L23j97R7k9L08
5500B39k73mO6J70l44K45j83rM65m60K34k55M1J81j07M3N4L2k02J48j11R3P3J67
5524C03j65k05j09M08m24K39k49K22J08l49J43J79n1p5M6J15l9O2j93J94jj11
$$ y = [181, 23, 127, -212, -84, -74, 169, 116, -11, -52, -204, -195, 111, 77, 11, -29, 65, 232, -298, 67, -41, 27, 23, -27, 55, 84, 155, 137, 73, 305, -70, -88, 112, -220, 49, -27, -219, -86, -41, 116, 218, -133, -33, 188, 156, 64, -122, -100, 122, -52, 141, -153, 141, 134, 39, -85, 53, 24, -289, 53, 15, 106, 79, -151, -81, -129, -156, -55, 126, 200, -169, -78, 5, 205, -5, -305, -3, -71, -24, -191, 68, -267, -7, -156, 132, 100, 104, 77, 211, 135, 104, -51, 109, -37, 61, 16, 175, 157, 69, -172, -20, 117, -240, 63, -3, 51, -221, 44, 19, 191, -35, -9, -151, -109, -105, -51, 198, -149, 159, 239, -17, -155, 429, 8, -258, -18, 73, -43, 112, -61, 169, 165, 48, -142, 207, 62, 281, -263, 60, -137, -40, -69, 239, -34, -38, 28, 198, -146, 99, -84, -93, 372, -88, 146, -109, -68, 113, 6, 49, 103, 135, -67, 81, -30, 63, 136, 303, 138, -67, -176, 232, -192, 47, -202, 20, 128, -221, -78, 101, 50, -25, 21, 136, 97, 159, -34, 160, 159, 48]
5546D8k20K53k00j7L89m13M01m23J68P7j28Q8k0o1p6J01M6k30L75j95l4m5L36
5569B20l45J11R7k22J03j17N4J62j31K07N6j26k6k66R3j44L61j67K91j83M2n9
5591A1k36J44k3N9O1n6j36M50m65K46L1M%j75N2L61j77l71M46m51L48l53K39K9
5615C8J18j87J55j57L33n14P3r4K13J56k13J66o0j13J1Pn7k0O0J22j2j9j15J99
5639I0l30M94l77J76j56J00q0J38K37j62j41L6j88J60r0N26m33J4j33o1J34j05
5661a51K91k19K3Qq4J20J22j50L35l00j00Q3K92J33n31Nr3K69k37L8KMJ18M4J22
5686A44K73l18L2j96K2l65L99L5j29o8Q4K72m10J23P4p5O5L80m57M8J20j46K19
5709A26m14N95l51J17m4L1l41J95L59r2l10M22k60K4p3m2N9r7J9Q4K1j02K49k66
$$ y = [48, -172, 81, -119, -136, 253, -160, 241, -182, -14, 63, -65, 23, 3, -58, -134, -33, 13, -217, 158, -37, -71, -116, 220, -125, -14, 83, -139, -36, -153, -99, 63, -68, 139, 195, 69, 43, -223, -130, -274, 87, -80, 211, 28, 70, 11, -225, -81, -104, -45, 16, -40, -176, 274, -191, 55, 86, 90, 90, -85, -33, 328, 151, -220, 226, -225, 123, -230, 9, 38, 156, -31, 124, -33, 300, -214, -141, -235, -22, 134, -79, 87, 27, -86, -75, -68, -125, -145, -85, 37, 25, 6, -109, 90, -240, 254, -123, 53, -103, -3, -83, 55, 292, 130, -11, 25, -163, -3, -93, 433, 0, 14, -119, -180, -46, -151, 140, -79, -56, -48, -132, -12, 110, -40, 295, -5, -105, -22, 270, 403, -128, -123, -216, 53, -184, -146, -144, -140, -22, 22, 144, 417, 99, 131, -65, -43, -408, -9, 26, -103, -171, -87, 185, -225, -102, -28, -103, -38, 342, -115, -67, 53, -93, 126, -288, 307, -44, 73, 29, 60, -281, -86, 273, 181, -129, 293, 33, 57, -16, -58, 1, -96, -77, 7, 28, -74, 175, -91]
5733i1P4P5k89L46k84K88n5L6m3J8Q7n8j95p6J16J13K4j43l5J37K33l19j64q0
5757b85L14R5J46k14k0k86J77o5K25J09j75J33l58J75o8M7n7J3PQ8L9j20o0L09
5781A69k67K01J18k58M5O3pO8k22J09j55L1l0k4N2M0r1K91k38K03l57J43K07m09
5805c18M04q5m2j09L99l17J17%Qr5lJ09j31p2K29k54J45j10J96k9KM5k02K7P8
5830hq1J51n1L4j66j03J99J24Pk49NM4J58k27O7j4J26J9q3j6O8j30q4L2L28k77
5856a27J47m0R6L6n9q2r5Q3q4j9K08j66PK58k60n3J26q5R0L65k22j7Q0k87K1K47
5882A68k08O3l5J08P5p2j01K56k71J65j95L0M0j07k34K43j07J09J07k35J50q3
5904a34J09J31k20J12L5J87j79o2L0J56p5k33K23N8j05r5N3O0l09L15j0k09L94
$$ y = [-91, -17, 58, -231, 115, -169, 119, 64, 100, 57, 75, 162, 104, -91, -167, -51, 62, 86, -57, -92, 45, 278, -41, -205, -285, 29, 124, 270, 56, 36, -250, -73, -138, 87, 196, 21, 154, -204, -29, -97, -50, -107, -94, -87, 1, 40, -80, -140, 169, -98, 103, 221, -37, 8, 71, 64, 132, -90, 19, -136, -105, -135, -159, -107, -67, -158, 133, -105, 98, -259, -116, 91, -318, 86, 1, -41, -150, 249, -68, 49, 49, 57, -38, -41, 68, -63, -135, 94, -160, -15, -125, 71, 42, 44, 89, -113, -86, -8, -89, 62, 11, 45, -121, -224, -25, 99, 106, -143, -138, -94, 64, -163, -96, -110, 16, 35, -48, -64, 4, -126, -210, -178, 150, -127, 20, -20, 76, 112, 53, -29, -124, -41, -125, -144, 64, -102, -95, 163, -97, -150, -24, -109, -19, 346, 124, 107, 187, -100, -79, 168, -40, 23, -12, 96, 171, 99, -2, 254, -17, 148, -47, -17, 23, -84, -318, -75, -182, -73, 34, -201, -51, -134, -25, 106, -114, -2, 33, 220, 41, -21, 9, 165, 90, -143, 80, 138, 33, -62, -9, 51, -258, 57, 47, -162, 232]
5927B32m04J02N7J71j51L19l36J43j40J45m4o3m4k66L33j10Q4p9K82k96J91O6
5949A92l51O6M8K75l42M40m15M9L7Nj80L58k44Pj37K28k20Q4q5J88j72K1M50j70
5973A32l12K91J54m93K61N7k02k0M5j71J88J91R9j74j30N9k13K6L97k76K24k25
5995i2Q1K30o4k90J33r5j78M18j98k35L13K7j7p9R6k82J29M9l1j13K44Jj23M5
6019c1J79L0l45K25j19P6K5J80K6k49l5j06J34J06j51K24k75Q2J32q6K79k73q4
6042e6q0J74J3m6n7L3j32L35j75L1o4r9K60m8k27m1J04K87k90j11R1M0J1k9J4
6067f2j30Q2J18K2j50K68j47k39L02R2l02J26j07J45j28K95k37j11J26J5j54L20
6089A44m62K84j52K53k3q2L68k48J16k11n0K0J11q9J32k50q8J74n5j01n4K32M8
$$ y = [232, -172, -70, -13, 158, 7, 326, -10, 133, -7, 138, 94, 31, -13, -279, 54, -56, 28, -51, 231, -65, 126, 192, -159, -93, -45, 230, -112, 328, -87, -38, -1, 4, -176, 182, -62, -55, -192, 36, -184, -100, -185, 3, -169, -148, 302, 132, -180, 111, 265, -228, 33, 90, -112, -132, -87, -258, -70, 121, 220, 46, -84, -25, -238, -212, 185, -91, 133, -92, -11, 219, 155, -135, -2, -97, -275, 143, -55, -290, 23, 50, 33, -46, 50, -232, -103, -54, -85, -198, 46, 47, -76, -31, 148, 178, -167, 58, -61, 15, 40, 220, 246, -3, -38, -144, -10, 96, -55, 169, -106, -24, 108, 22, 301, 28, -56, -136, 38, 51, 5, -52, -19, -151, 184, 9, 40, -24, -123, 137, 89, -138, -179, -75, 212, -78, -189, -98, -58, -47, -76, -62, -192, -110, 8, 30, -120, 148, 1, -238, 64, 156, -146, -20, -127, 18, -110, 185, -52, -163, -37, -22, -176, 144, -318, -34, -186, 67, 44, -38, 330, 82, 198, -13, -63, -43, 68, -21, 111, -139, -227, -53, -108, -209, -263, -31, 17]
6112A7j64R9J42m7N5j07O3P8M6J41k15l50O08o80J64J85O2j50J19r7p7L56l66
6135a18M9L3j8j26L11k73NJ57K15j15j41J7K25j96j60N3j3M01n16N4N1K25j20
6158@r9j43P5K69m7J03l4j73l7m2J81j99K06n9o5m7J28K9J89k61l3m0J55K4k27
6183a47J53J7J09k93J96j04K78m07J38K33k93j7OR2o2J45P7o7J13l00N4Q4K02
6206B07k2k29j03L79j64k4j51k7J66l04K74o0J18k62L13L5l25K63J93k20R1j59
6228a1K17j74o0J12k12J68j44R6Qj83Q5J77Q9r3k60L10p4r3N8j05J83l61M92q6
6252A39j93j3K13K5M3l46L73k5l90J00k28K18J69m7L2l52L36j98M84l64M7j02
6274g9m1K68N3J09l23J07O9l01j7J77J27j36r4J77k12M28k80j3J98j75p9J41Q8
$$ y = [17, -147, -48, 94, 47, 102, -5, 58, 136, 182, 323, 108, -242, 366, -314, -150, 35, 97, -53, 66, -31, -108, 248, -118, -69, -36, -54, -180, 131, -142, -137, 20, 235, 120, -21, -4, 221, 25, -135, -82, -95, 306, -210, -156, -105, 120, 0, -99, -242, -167, 102, 55, 158, 124, -49, -86, -128, 53, -146, 60, 1, -64, -111, 17, 46, 235, -26, -59, -99, 56, 80, -147, 6, 23, 132, -161, 35, -69, 209, -198, -60, 173, -120, -137, -131, -39, -101, 44, 121, 54, 167, -133, -79, 5, 207, 185, -44, -147, 232, 68, 44, -107, -134, 32, -272, 2, -58, 60, -202, 111, 146, -179, 84, 277, 57, 148, -11, 206, 32, -28, 84, -128, 40, -104, -8, 0, -183, -98, 79, 168, 75, -185, 125, 51, -42, 16, -89, 94, -267, 225, 139, -54, -67, 146, 171, 214, -132, 241, 216, -174, -74, -302, -84, 85, 38, 70, -282, 54, -144, 340, -24, 23, -79, -120, 148, 201, 310, -13, 94, 163, -138, -155, 22, 149, 13, -81, 96, -116, 312, 32, 19, 217, 42, -37, 104, 192]
6297A92j15ql1j36j44J97P7Mj84J56J3Q8r5l4N5j6J38k08J18k33K77j17M3j55
6321a18M40l36j55K07n9J08o4M0K38l64J67j53K81k50M3j79L69P9k59L9q9O2j04
6344e7O8R5L0l01J64j40K44jj0j00K78j81k53L5J58k09M05j94J87j85k91L50j98
6367a06K01j34N3J82j24J25J41o80L34K90n59J56Q1R9j55m3J82K58l60K67j69
6388C9R1j40P9k00K10K9j33P7n9L83m99P8J42K5k67j60K71R3j94L21O9k72P4N
6412F2r1l9P2j69L94j75O9j91K26l57J19J32j87j4K13j59j76r0L95q3RL99l87
6435b8K60o3j30j06P5J03q2M5j18J20N9m86L96J22J37k50r1q3J25L6j29J03K7
6458D2ml56K20p5M6N5j0QL3o0P5J05j83R8j50J54l9m6P3Jj15J34j4l38L16j52
$$ y = [192, 77, 69, 38, -98, -242, -45, 32, 36, -148, 8, 21, 109, 14, -20, 35, 19, 157, -51, 67, -166, 111, -6, 37, -118, 322, -14, -169, 38, -21, 87, 23, 63, 301, -63, 104, -49, 232, -18, 25, -154, 215, 294, 35, 74, -15, 47, -57, 11, 106, 136, -165, -1, -141, 103, 102, 92, -8, 270, 89, -164, -129, 29, -180, 225, 31, 218, 33, -258, 92, -106, 95, -39, 14, 196, 72, 197, 338, -342, -8, 282, -277, -121, -40, 59, -96, -139, 43, 301, -59, 208, 39, 130, -10, 69, -131, 79, 108, -25, 52, -7, 376, -123, -45, 97, 122, -145, -305, -34, 59, -135, 186, 255, -17, 57, 62, -29, -68, 4, -165, 229, 54, 123, -68, 158, -199, -80, 52, -135, -149, 64, -95, -271, -361, 34, -49, -40, 359, -28, 232, 169, 39, -67, 8, 111, 29, 74, -44, 76, 135, -351, 45, 167, 304, 54, -37, -120, 5, 41, -88, 15, 42, 38, -318, -98, -173, -127, -72, -82, -74, -41, -101, -26, 79, -104, -6, -156, -2, -41, -87, -14, -13, -128, 6, -8, -346, -30, -182]
6484a82j18J08O1K21r2j55L87k36l45K81P8L11l09o8K64l00n9K31j78O4p9N4j00
6507a61J79n9p9J61k73L15r0OJ55k06j27K18k5K7RJ80j74k68L30n3r0K83k57N
6531FJ16l68L57k65K19p4p1j61J93M9j40J87Lr1J3J67J18k88j40L40k82K28k32
6554a16K37j86j10M06j98M9j69M4J32j7k46j3L2K38L2j59N8j52J99j84j13K25
6576a1N9l1K59j37j18k7J75l58L18j67J01j61J9J13J8m82M90j08n5K26k82J5p0
6599b14J14J76j55j59K96j66R3K03k82j23k5K09p0L9J81l67L69j12O6k26K75K6
6621A48m3j49J3J77j31M0K9j43J12K08j63J41j65l54L60k92L01j79o0J18j45R5
6643h2p2M8j47P9L45K8l48o1O9J51p9n4R0j15L26k44j17K57J8n2J19j5j61K91
$$ y = [-182, -300, -192, -131, 90, -2, -157, 230, -6, -351, -70, 8, 319, 10, -58, 206, -94, -153, 78, -100, -36, -115, -61, -161, 18, -41, -120, 41, -232, 83, -7, -1, 154, -52, -179, 39, 14, 41, 50, 230, 56, -212, 118, 65, -25, 258, 1, 6, 122, -246, 111, -154, 65, -9, -80, -241, -48, 1, -139, 48, 51, -40, -27, 140, 258, -30, -170, 170, -112, 116, -116, 121, -65, -175, 231, 33, 82, -87, -43, 89, 72, -174, -187, -155, 83, 115, -44, 14, -138, 61, -123, -236, -11, 48, 17, 276, 139, 21, -6, 169, -189, 129, -38, 63, -98, -79, 34, 52, -430, 60, -48, -103, 123, -159, -144, -214, -100, 76, -79, -238, 58, -108, -15, 188, -94, -217, -242, -33, -103, -64, 117, -250, 119, 7, 73, -153, 122, 148, 105, -44, -31, 146, 15, 55, 84, -59, 53, 261, 98, 239, 74, -280, 80, -212, 89, -90, -150, -32, -177, -82, -154, -106, -253, -174, 171, 199, -149, -210, -141, 10, -69, -123, -33, -148, 178, -66, -183, 74, 92, 40, 159, 144, -17, 274]
6667B74l62K6j83j51M32l0j32r8J28K7j2j56r0R3K15R4Q1l05J73j46K8r1K86k28
6691a27K11j28K02l39J54J87r5o0L3n47L28K56j68K00l00K89j51j31J61J37j61
6712d9M9MO8j00k00K09PmJ13K05n14M92k42J42J2k92r2J29L9o0RJ8J5k26L77J75
6738B84k7k71k73K80j23J2K6J07M0j29O2mJ16p6j04P1P4K20l92K33m30K58K10
6761A64k84K93m35J64N2L03J71l64L6J16J12l07J51k28J27k4N0O1j87L31j84j70
6783e2K16l49L43k52K72l35K17l7J67m1k07j30j57K19n7K15j05L29p0K0j09n4
6805D3m23O58q7N9k10k01K4R3Q3K14k27j52K14j90J12K18l57j2M8n5J99j53R1
6828a1J1k09N7J03K40K51m85q5R6R0M2k29l8K02l21J51J99M6j16K3k96J0K02N9
$$ y = [274, -88, -62, -245, -396, 36, 6, -126, -224, -96, -69, -81, -237, -327, -234, -19, 75, 156, -149, 24, -122, -94, -185, 101, -127, 84, -44, 158, -181, -27, 160, 65, 5, 38, -509, -181, 75, -93, 107, -193, 96, -55, -186, -25, 112, -49, 0, 4, 72, -28, -228, -19, -12, -16, 97, 302, -212, 280, 38, 180, 192, -100, -192, -63, -24, -84, -75, -57, -42, -268, 109, 284, 257, -14, -287, -7, -130, -118, -92, 15, 55, -74, -12, -16, 100, 24, -80, -9, 65, 285, -107, 126, -304, -46, 164, -120, 173, -262, -98, -46, 257, 428, 64, 100, 216, 328, 21, 172, -56, 71, 47, 97, 158, -29, 302, 118, -52, 164, -185, 158, -94, 178, -157, 60, 23, 190, 149, -58, -188, -345, -126, -183, 32, -73, 256, 186, 206, 97, 43, -380, 278, 191, 250, 40, -161, -137, -44, 39, 253, 26, -126, 88, -102, 10, 228, -129, -141, -93, -148, 51, -102, -11, 0, -209, -152, -49, 191, 442, -43, -128, -32, 58, 100, -129, -167, 35, -286, -135, 64, 110, -6, 17, -279, -269, -67, -8]
6852hJ95m4n8p2O3n0m3KM6J18j04K2j5j40l3p3K68Ok84M61j91R7l21K66m14J49
6878a57L83n52J61L92j63j62r4J40J17j22j3J63n9r2J3j37j20J76J02r4M2L2j25
6901a69L13n9j36N1RJ90l07J02j59m1J95j72K12j69M45j50j15Q6k94Q4j48K07
6923b5j33K20r3p3J67l0j84j0l6j91K07J25J13m9j94J77N5R3j93K18j52k7J47
6946A32r7J20l39J08J77j5j75J32k25K93k68J29j6R0k65L14k00j27L5M3K14l63
6968c03M48j71J09j31p8LJ51p0J70k97q4N16n14J07K61j22k25Q1J40j16J58Mr4
6991e7Q7qK38l94l07L53J30m7K42k07L0l3j98L01j30%J45k05J77j46M2O6P1J45
7015B95l02l5MK49n47L16j6J8K38l14J19j03K3Q8m6j64L85j25R8o4l48N65m54
$$ y = [-8, 187, 143, 85, 13, 76, 26, -17, -15, 31, 149, 45, 67, 52, -88, -121, -194, 74, 80, -204, 257, 66, 163, -158, 108, -306, -157, 226, -326, -165, 227, 64, -98, -192, -52, 65, -57, -70, 93, 34, -58, -45, -182, -302, -126, -24, -118, -76, -44, -169, 144, 85, -51, 0, 9, 199, -108, -6, -165, -206, -11, -183, 29, -140, 305, 155, 40, 126, -168, -84, -232, -25, -158, 62, -31, -104, 63, 33, -151, -161, -197, -388, -181, -56, 57, 8, -186, -9, 46, 139, -54, 164, 12, -15, 132, 35, 155, -184, -76, 101, 86, -89, 43, -182, 111, -157, -28, -44, 46, -219, 95, -105, -232, -197, -154, 60, -303, 145, -26, 83, -48, -126, -123, 28, -42, 128, -169, -253, 263, -251, -144, 117, -5, -230, -149, -9, -125, 33, 37, -57, 30, 22, 260, -134, -441, -88, 42, -5, 237, 30, 60, 27, -171, 130, 0, 0, 145, -60, 117, -29, 13, 79, 150, 295, -7, -42, -38, 211, -336, -20, -36, -18, 220, -94, 25, -78, -55, 33, -13, -177, 208, 83, 181, 117, -231, 334, -120]
7038a20o2j11L34r0O2k1N7r2l57M67q5m1P4L08j27j46m8R0k72J44R6k04J02o7
7062a09J77Q2j27r3J75j61J61j56J05J50j58k5K9j96K52p5j6j45J54l7L4kj83
7085a64K60q9K64l92K60l15K14k82K20K4P5j16k91M15n6p2R8j05L56l46Q6j52
7107a08J13N4j19J20j03qL00o0k2O3j46m5J93k62M3L25k71j41p9K97k45K1J03
7130B3O4r7r6J57p5J88k54Q4l2J16P5l19K99M0K7qm31L31K60k58k95K15L4M2J3
7155A03k10M09j42k39N9J29m46K48L09j15r0k09K06K9N3j0k17J99O8k19K00j66
7177e1k45L96Rj99K8m8K06j50p4J45p5K9J93j38R6K20n0k74J69k33m5P1oL18n82
7202b90J70j98M22J9r2n8k0K0j2J50l36ML83m3pr5K49m06K44k36R6n8J26K0j82
$$ y = [-120, -182, -293, 41, -49, 13, -8, 49, -43, -400, 67, -18, -59, 15, 323, 196, 50, 2, 92, -180, -36, 60, -144, -42, -109, 68, 150, 23, -70, 105, -56, 105, -51, 54, 204, 46, 21, 50, -146, 106, 31, 15, -130, 24, -13, 21, 19, -164, 96, 7, 271, -121, 139, -176, 38, -244, -24, 0, 75, -41, -332, 83, 27, -45, 53, -52, 304, -42, 44, -108, 5, 59, -60, 60, -43, -51, 249, 189, 167, 230, 84, 39, 232, -30, 13, 338, 67, -74, -153, 144, -101, -80, 23, 87, -10, -106, 51, -24, 164, -90, -6, -38, 78, 153, -166, 133, 173, 200, 192, -239, 92, 352, 94, -201, 14, 48, 90, 103, -107, 302, 160, -79, -20, 109, -337, -89, 220, 105, 15, -194, 12, 41, 94, 84, -133, 66, 134, -85, 115, -51, -296, 100, 109, -90, -62, -110, 96, -54, -128, 17, -58, -29, 164, 26, 122, 342, 292, 18, 187, -46, -91, -20, -26, 292, -290, -120, -318, 104, 123, 31, -27, -47, -27, -39, 111, -225, -221, 162, 119, 112, 17, 266, -140, 104, -132, -36, -94, 32, 52, -130]
7227a30K22j42KR4N6r6J25J07k55KO4K2P7k05J18j98R9m7K05j90Q1j85J64j87
7251a97K12L5j56j66L29k3k54J8L20j88qJ35l70L01j5jQ4j69J14J17j3j66J92
7274A31k12K72l46o9J82K21j05M5k69L3L37r4m5o5j48R2N3J92m08K86n6J0l11
7297b74K70qj57J02N7j14P1J54J52k92K06j83j23K09o6J46k3j52J46l02K66K1
7319A06o3j59J26k29L18L7Q7l77p5P0L61l22J31J10l19K07L5l41J56N7QJ84j23
7342a5j4j41K29o8p3L2K36q1P0j91j13L2m8J86P8l4l18L30p2J07j35J4L23j87
7366A47r6j87K19j18P8J05L6k37K71k1j88N6k01j02K26L10l61J56l8R3k04J18
7388F2j05J09K3P5N5j80l05L44j96K6L4Q2k12L48k11j39L12j66J09j73J67j70
$$ y = [-130, 92, -50, -48, 46, 102, 6, 131, 238, -17, -15, 49, 71, 148, -57, 61, -137, -38, -85, 120, -70, 11, -174, -10, -197, 15, 50, -106, -272, 57, 34, -220, -202, 118, -70, -78, 57, -313, -12, -27, -28, 56, -113, 1, 118, 105, -61, 131, -81, 191, -155, -224, -42, 179, 74, 119, -150, -117, 220, 126, 81, 16, -132, -40, 13, 205, -203, 83, 27, 37, -274, -4, -12, -169, -67, -10, -124, -53, 101, 253, -39, 167, -16, -139, 70, 4, 150, 127, -25, 121, -181, 85, 106, 43, -116, 10, -219, 99, 136, 223, -154, -229, -159, 202, -120, 11, 121, -198, 9, 44, -297, -141, -84, -76, 108, -15, -29, -170, 59, -9, -82, -50, 186, 105, 175, -16, -129, -97, -145, 41, 119, 85, -233, 97, 25, 132, -3, 11, 334, 147, 51, -136, 83, -35, 43, 148, 184, -53, 218, 197, 9, 65, -136, -238, -12, 298, -63, 93, 55, 148, -56, 62, -43, 66, 89, 164, 219, 39, -266, 78, -118, -92, -58, 24, -188, 160, -51, -190, 122, -44, 65, -108, 59, -111]
7410a11K15j44J1N2Q1K07k11l55L39j06J37J79j02L9l28j67M52j61J45l05J60
7431B7N9k43M3p8L03l74K28K30k52J15J94k01J23j59J39j91K87l26k58K92m9J24
7453C3R1m1k06J09N4o6J92j19j00nJ24l2M1j29j12K86k47L0J69j54K68m05J9L53
7477A53m45L80J35k35oJ03m2j83K42r6J95l46K14J1j30K01L9j33j74K16k59J0
7499a50J56J50k52J86j31j86P1L89o0k73J69k73L58j42j58J89Q1k43m8J76K29
7520B38p06N58J4l16M37m70L7J55J98l10K82j47j87J98j34J03jJ73l79L83k69
7541a43J37k03K84NRl43L45j60Q9R0M8k2Kj12p1j5o4K75k98k0L2L28l25R0kOk0
7568e8J99l09J91K23l86L42o5k58K68k80m9J24J82K7p4o5J02l32J41J21J19l04
$$ y = [-111, 104, -40, -29, 23, 104, 311, 100, -255, 84, -22, 115, 294, 192, 231, -97, -264, 188, 27, 172, -133, 27, 86, -157, -114, -192, 111, -263, -35, 195, -57, 58, 252, 51, 174, 15, 154, -37, 250, -76, -334, -42, -91, 33, 124, 83, -123, -14, 40, -26, 166, 47, -53, -58, 66, 34, 75, -54, -166, 120, -127, -97, 72, -82, 186, -219, -200, 153, -292, 88, 223, -12, -18, 85, 43, -140, 102, 6, 201, -145, 69, 80, -50, 151, 190, 57, -117, 99, -160, -150, 6, 156, -96, 90, -41, -227, -156, 233, 173, -100, 69, -204, 154, 12, -146, 43, 124, -119, -167, 9, 238, -468, 90, 104, -212, 225, -245, -208, -53, 145, -165, 117, -30, -217, -19, -153, -50, -51, 122, -257, 126, -143, -6, -209, 75, 80, 89, -254, 91, -69, 20, 110, 158, 136, 138, 26, -45, -60, -124, 151, -147, -167, -135, 193, -132, -42, -44, -38, -58, 141, -168, 23, 246, -140, 202, 137, -121, 147, -133, -182, -58, 124, 151, 77, 12, 114, -218, -77, 44, 163, -141]
7590a41N03n59L77J3j49N3j12J74N2l9j83O1L3q3J87l46J23J18J92k45J96j56
7612F9r7M2l4R0j54RJ81j98K99q6m58L01O8P2k97K24k05K39j35K28j99N8n3L11
7636B75j42l03Ok9L66J74k62M9l37J78m5PJ27j08K52o0J23j24j81NJ96k68J82
7659H1j88J32l6K50l18J01M0j03j34L6J6K70k53J36O1n3M8k8P5r2O4j13k3q8J7
7684a02k39M47M8j46n6MJ82l5jp4%o2K40m08K93J00j83J57j96K03j38M03m09j58
7708a30MJ57J24j41j27O6L06k5m6n03M10o0R5o2l27L69j34N8J46m13J23L2K8q5
7732a35Q2L17k15j66j51L21P5k1j72j28K53n0J14o1r2J63N9k82J80N8J60m77K51
7755H3j42J45j16m6r1K03l32L26l0L3J06k58m1L1J67j19k05K15J63J10j0m2j47
$$ y = [-141, 362, -197, 180, 193, 44, 97, -15, 159, 211, 172, -11, 50, 83, 0, 187, -159, -36, 82, 274, 29, 225, 69, -28, 14, -20, 70, -84, -75, 106, -92, 207, 121, -337, -36, 32, 104, -193, 31, -174, 65, -70, 158, -41, 17, -36, 275, 133, -170, -164, -193, 173, 347, 85, 134, -203, -25, -70, -63, 64, -44, 208, 148, 271, 147, -34, -29, 167, -101, 81, -107, 25, -11, 239, -79, 22, 62, -41, -175, -139, -123, 147, -106, 30, 91, 38, 86, 58, 133, 41, 105, -8, -31, -119, -102, -341, 106, 154, 8, -48, -44, 138, 103, 102, 28, 28, -34, 206, -202, 91, 191, 8, 165, -31, 172, 34, 437, 28, -130, -126, 31, 155, 14, -113, -47, 259, 234, 188, -315, 95, 35, 130, 68, -259, 110, -24, 34, 180, -233, -110, -78, -50, -135, -53, 264, 49, -117, -268, 53, 128, 107, -65, -193, 60, 10, 124, 63, -29, 134, 193, -89, 91, 149, 309, -168, 83, -59, 86, -30, -76, -167, 36, -296, 30, 0, 33, 139, -119, -160, -129, 38, -81, -286, -71, 92, 202, 192, 150, 3]
7778CJ83J33n8k52K4J13j35j68J47k4m2J42J08j78j0N4J53n4l2K35n52K81J4J34
7802B19l84J47K00p9M0k63mJ55o6J05j70L1N0o7n0K34j68K08K3j70j32l1J13J01
7826D2pr3P1J77l39P6J57K6qk27J68J0%QM5n1M9M9j29J26k62K18k82K10n9l8J39
7853G6k38J09k5p4K24j09M2n9P6J41l4rj87J10pm4N9l05K7N90k33k90n4K16j3
7878a1k34K99m6k5n0J98l51k09N55n8q4p4L62l03r0Q1R9R3k21J27M1P0j10l1J4
7903D2J21M8j80J09k45R1l2L05j46%k6l20J05Q4j63K98l31K76j23m0J43m4N6J33
7927A61j14j77J92J8j44n4K57k05Kk6O6K5J04k63K68j8N3l83J90N3l2J26m02M75
7951A72j52jk27J55M2M7j60p0L67m06J42n8K0Q0p2K1k8K01K8k71J48rmJ68j61
$$ y = [3, 186, 319, 261, 9, 33, 146, 11, -157, -10, -34, -76, 66, 174, -4, -14, 40, 193, 139, 107, 342, -210, 71, 85, 219, -165, -18, 182, 103, 143, -120, -124, 31, -35, 70, -100, -69, -19, -86, -136, 98, -70, 138, 161, -9, -141, -172, -59, 42, 35, -58, 13, 190, -149, -73, 84, 110, 102, -125, 43, 53, 53, 61, 106, 55, 104, 153, 24, 150, -112, 106, -176, 34, -25, -63, 76, -162, -53, -78, -152, 72, -37, 5, -54, 22, 163, 129, 120, -67, 43, 36, -8, 51, -254, -227, 363, 130, -160, -214, 2, -11, -245, 54, 8, -17, -67, 131, -220, -429, 126, 68, -16, -90, 272, -31, -121, -40, 59, 152, -69, 58, 99, 169, 59, 28, 42, 163, 211, 31, 140, -105, -14, -46, 259, 113, 113, 87, -233, -128, -44, -207, 91, -240, 36, -87, -127, 16, -28, 28, 161, 47, -130, 62, 80, -64, -118, 139, -66, -64, -90, -24, 1, 105, -158, 110, 92, 145, -238, -48, 5, -27, 99, -303, 172, 20, 19, -208, -53, -11, 36, -124, -194, 173, -233, -91, -149, -129, -49, -121, -100, -128, 73, 101, -170, -22, -31, -35, 133, -28]
7976b8J57k09O0j86K05k08K79l33J87R0R1k39K96j80k4J1j90K88J3j01k20L77
7998A36j81k33J08K58P6j44k1J75k04q4M0J87j55j49R0J99K25l94J29k83j57L46
8020c6M2j50J10mK19l04K5J4K90j1j26r1p2K40k47K71K6m09L31P6k52KJ70n8l37
8045b81L93l87K93m9P8J24j98Q6J1p0k9P9j36J65j01j4K24o5l15K07r9J01j55
8068a38K07o5k81J87J10k10M18j01j86J48J12k88K12j14O9m2j3p6K06m18J40k0
8090a43J34L81l08l8R8j97J58J50j07k33L03j04j27J71L2j81O4k41P0L54j19k46
8112a29Jo9J81p8L45l46k00L53J15l07J7M27n78j28N8K75L9j86K51j21L42k95
8134c3M2J66j69J92k79K25j92J5j1o2J60p6P2K58J28n10nj8j6rR7J1l2J25p4l19
$$ y = [-28, 129, -80, -20, -206, -1, -209, 70, -263, -76, 14, 105, -134, 162, -18, -42, -31, -221, 67, 80, -21, -241, 136, -45, -278, -170, 88, 164, 20, -1, 174, -30, -114, -74, 113, -42, -191, -101, 98, 323, -71, 58, -225, -382, -36, 6, -144, -34, -38, 181, -123, -98, -84, 206, 195, 69, -22, -94, 146, -101, 170, 196, -213, 118, 194, -58, -56, 114, 56, -281, 112, -275, 18, -31, 47, 171, -27, 59, 70, 0, -29, 50, -86, 79, -22, -36, 188, 123, -192, 15, -84, 17, -138, 69, 4, -277, -90, 20, -190, 228, 127, -59, 89, 201, -87, 125, 11, 80, 38, 25, -51, 155, -263, -123, -143, -9, 372, 64, 26, 124, -73, 85, 235, 128, -105, 198, 94, -33, 138, 170, -11, 53, -188, -118, 236, 117, -129, -128, -197, -16, -94, 251, -95, -295, 58, 173, -134, -117, 310, -268, -396, -338, -63, -24, -210, 41, -80, 262, -33, 9, 175, 6, 198, -81, 144, -48, -33, -44, -106, 54, -22, 50, 308, 436, -74, -79, -97, -113, -122, -25, -14, -46, 79, 5, -314]
8160c14K32L43j33k10K97r6k33J87j71K08l1j30J13j26J32jp5J25j58O2o5j10
8182a54K14P3j72J97J10l49p0L14k07
$$ y = [-314, -82, 261, 128, -82, 215, 119, -114, 73, -98, 110, 79, -51, 62, -64, 68, 67, -8, 117, -41, 21, -44, -154, 60, 133, -39, 158, 268, -81, -151, 163, -44]
8191d4
$$ Imaginary data points
##PAGE= N=2
##DATA TABLE= (X++(I..I)), XYDATA
0@%%%%%%%%%%%%Qj6J6j6K4l2L5m3N6o4P2q8J06j27J49j72J99k30K64l02L43l89
34b07M41m98N60o30P08p91Q82r83J093j213J342j483J639j809J996k201K425k669
52a398K939l239L573l947M367m846N397o033O779p675Q769j0137J1909j4306J7747
67I899k3157L3210q1590K93364j70315l55868M41818L5474l56549J42091J79885
78A48262j89887O2467M9426j36195J16877O6027k35682J10850J98801k41652q4981
89a35687K47415n9855j34210R5216j3617l6879Q7684q9891m5665J64113p0975
100G649j47474J70591N5313j78781L3758J03918m8200Q060q209n9639J01067L4494
112G2547j48460N3494J26666j14167m8819J03439j7132k1455K8361o3495J3889
$$ y = [0, 0, 0, 0, 0, 0, 0, 0, 0, 0, 0, 0, 0, 8, -8, 8, -8, 16, -16, 19, -24, 32, -32, 40, -48, 58, -69, 80, -92, 107, -123, 141, -161, 182, -207, 234, -264, 296, -334, 374, -417, 465, -518, 575, -638, 704, -779, 860, -949, 1047, -1154, 1271, -1398, 1541, -1698, 1875, -2072, 2295, -2551, 2846, -3187, 3592, -4083, 4686, -5451, 6458, -7848, 9899, -13258, 19952, -61638, 231726, 61411, -294457, 147361, 182835, -173714, -31623, 148262, -41625, 20842, 70268, -65927, 50950, 116977, -118705, -7855, 190946, -50706, -135687, 111728, 51873, -82337, 12879, -738, -37617, 50067, -39824, -85489, 78624, 7649, -139825, 30766, 86079, -92702, -58944, 44974, -3226, 4834, -3375, -63014, 38053, 72547, -75913, -22419, 104247, -9920, -58739, 44700, 27568, 6113, 34474, -29021, -15132]
123a5132Q7368p1164m3410Q5662l6430n4396Q2428j0430p3530N3190J5216n3370
135c3998L6014Q663m5337L8030L874n1309N3443K6123q1295J8920O6509m1612
147a975k1249L4561j2837k142J5747k3891J8167L1060n7786j4002P6859q319o1412
160b7219J5862K5516l444k02k1412q01L8938k0023m2250M0294K8425m4531j2048
173b2895K4498J070L581k614k4343J2583K5745k1578q826K0379j0465q930J8819
186G024n902r743J5871p046j5281K0990R289k0300r86O980k414J1832j534k2525
200a3745J1729J9260k1176n517K3571n812j8846M053R530R330l156k5740J450
213a5069L4277n955l0132J0049J6527r442n611J138N099Q674j4095j4837K4262
$$ y = [-15132, 72236, 1072, -42338, 43324, 6894, -47502, 34926, 24496, -49034, 4156, 19372, -33998, 2016, 10679, -34658, 3372, 7246, -44063, 9380, 35503, -45792, -26872, 39637, -1975, -23224, 11337, -1500, -3642, 12105, -11786, 6381, 37441, -20345, -34347, 42512, 34193, -27219, -11357, 14159, 10715, 10513, -10899, -11700, 27238, 7215, -35035, 5259, 33684, -10847, -22895, 1603, 2673, 6254, 3640, -20703, -8120, 17625, -3953, -12779, 7600, -2865, -11795, 7024, 1122, -8621, 7250, 204, -15077, 5913, 15202, -5098, -6084, 896, -1518, 10314, 8780, -13745, -2016, 17244, -3932, -9449, 14122, 8310, -10536, -6483, 3047, 12377, 9221, -16519, -15069, 19208, 13253, -16879, -6830, 9697, 255, -5356, -4218, 881, 9555, -4540, -19377, 4885]
226D885J3603k4651o834J3132K768K396l120j2042Q282J1022j3690K65J4340j0050
240C06p773R924r62Q21O687j4889o059K1853O71j6519L677L782l472O353k667
255A733p640R918M2j6027Q683J7274j1617j3911N649Q765N204o065j3660O066
269e586J5182p552j1108J0055O129r864m228P562O974l073j0784j976J3093O265
283A1089j1232p794P703N958m332l144K901Q38k983k282L121N352j370r806j458
298g439J0830M110q688m880L168M294J627l779k589M491L54n922L174O901k647
313C005p221j234O101P298l989j1073K432J0456j261o378K16K918n6j788j750
328b324N121K965q862m758J0560N184p800n854J989N599K746n316m055N737J119
$$ y = [4885, 18488, -6163, -12997, 135, 2903, 5299, 2179, -9863, -1581, 9441, -4249, -3984, 10356, 306, -7467, 2457, 1495, 2316, 9003, -5886, -11945, 9908, 10579, -5940, -2263, 1519, -1953, 4400, 1733, -5907, 4011, 4053, -11974, -3291, 13983, 2366, -11545, -5896, 2869, 8073, 2008, -11652, -5586, 9596, 2044, -9064, 991, 7120, -2744, -6972, 590, 7564, 4491, -6293, -8269, 4824, 11089, -143, -7937, -234, 5724, 1392, -1752, 1149, 1987, -996, -3278, -157, 5195, 3825, -5981, -7439, 3391, 7501, -1187, -6067, -2899, 1395, 3022, -757, -3346, 1145, 1499, -4423, -1249, 5652, 3005, -4216, -5450, 651, 7949, 3960, -7113, -4681, 5775, 4514, -1864, -1648, 1270, 1214, -574, -2324, 2797, 5762, -3100, -7858, 2702, 7886, 86, -5768, -3779, 1820, 4566, -750, -4805, 932, 2051]
343B051n988K293N896k582n425m70M399N540k387r022R47R232K25o086l2K225
359H16l91Po46J250K582m377m472N980N913m980o212J380M380K117k263m721J281
376b356N168k859l233M330J897n203k450M195L913r92n901k139P345L847o570
391a008k826M675J006k092j8J341Q36j138l702J849O300j517p412O96N465J069
407C524k710k959M74L421o48k586J471K258l289k563K724L375j151m339j188M591
423D05K499k815k797J158K356N0j700k85K629l28l695J364M531m33l541j751K822
440D69L693j832m723J203L848r03k982J203J679j253j761k30K938J100m190k155
456c896L704L043k680k825N39K402N23j966k58J813j80k007O8L639O17l734j540
$$ y = [2051, -3937, -1644, 4252, 1670, -3755, -4225, 174, 5714, 3327, -5695, -4748, 4484, 4709, -1377, -1409, 816, 425, 432, -214, 1036, 3618, -759, -5231, 749, 6662, 1682, -4530, -3150, 1230, 3347, 1084, -3637, -2356, 2812, -47, -3280, 1050, 2947, -2256, -4706, -511, 3402, 2410, -3491, -5630, 1715, 5562, -1008, -3834, 841, 1847, -245, -263, 1078, 1914, 776, -2926, -1077, 5223, 3706, -3706, -3010, 2455, 3524, 814, -2145, -1671, 1750, 1102, -1484, -13, 2245, -1044, -3607, -883, 2492, 1341, -2998, -4186, 405, 2904, 89, -2708, -1550, 806, 856, -844, -1129, 1500, 1172, -2523, -1159, 3372, 2939, -602, -2353, 469, 4162, 2330, -2393, -1190, 2658, 1755, -1227, -24, 1655, 402, -1359, -1589, 1349, 2449, -1741, -3896, -192, 2851, 171, -2654, -2115, 287, 810, -1156, -1414, 399, 219, -1788, -1720, 1919, 2536, -1198, -2738]
473b738K681L228j530k779j38K566O80j438p74J670J33k017j86K177N47k200k418
490b536J470L344n29l824n29K676J294j353j909K42J885j077j678K806J341l236
506a613j368K733J698M63k399k545L285K886l017j055K336m66j015J247m6L97
522A521N67l381l37M778o08m484P82J581L44L05k050j305K825J01k861J676J824
539A278k857k44J133O89J391j795k913K538L415k181j809J142J18Q98N91j863
555d69J190J018k813K77L284o46k615Q3L75J367J264l151o16K392k92j813J267
572A02K29o51k70p02R06J684j443k191J715J660q00q95p16J002J520q06j419J097
590B2M77p85N14q7P95n2j812O1K604m07k114N16O57k82J095r21j391K065j96k365
$$ y = [-2738, -57, 3171, 1641, -1138, -1276, 1290, 1970, 532, -242, 1428, 1561, -456, -642, 1535, 2082, -118, -2536, -1066, 2278, 1749, -2075, -2604, 72, 1366, 13, -1896, -1654, 231, -846, -2524, 282, 1623, -1613, -2981, -248, 1450, 1913, -486, -3031, 254, 3140, 123, -932, 1404, 938, -77, 1170, 1124, 1521, 2088, -1293, -1630, 3148, 2540, -1944, -1162, 419, 763, 1068, -982, -2287, 538, 639, -2222, -546, 1278, -1579, -1823, -690, -1, 1390, -405, -3318, -780, 2635, 454, -1355, -213, -95, 803, 1394, -469, 721, 1739, -1074, -797, 2487, 1841, -774, -691, -316, 1051, 2315, -836, -1452, 940, 648, -1165, 102, 331, -320, -590, -1292, -386, 1298, -145, -2336, -621, 1039, 239, -656, -1372, -370, 1150, 344, -1075, 22, 499, -286, 228, 141, 936, 884, -928, -867, 1737, 1330, -784, -268, 389, 107, 1202, 281, -1110, 955, 759, -1606]
610a606J786J329k235m9J163o96O96Mk169J180J808j781p43J744q14m91J071q70
628f73R0J677j795o77K150Jj446P08k82M24J082j245q45J209J85q97N95J34l42
647E3N91q29k66J486n51j440Q65O55m55K1k69o06J232O6j517Q23Q47j350n4R61
667B63m45L44J61j145M55J373j210m94J053J29k49o6l86K54M01l35l58Q98k55
686C88k43l18J14O05p4p00j85J126l27n82j70K73j9J09n70K54O53k94n16N56Q0
707A60n1r5k83j97O76J84q65M64N57n09l04K14K55L07k94k88M08nn1n08N28O4
729C67j71m26k23M64lO0J7p9M8rn35q9Q04n97n02N88L63o9K05n67K78L75P1r94
753f24N84O02p30j02P30j04Kk36n36N46K03l85k76O98k1l84J34l67L55K78m41
$$ y = [-1606, 180, 1509, -726, -775, 388, -308, 388, 392, -1777, -597, 1211, -570, -1313, 431, -383, -874, 197, -673, -583, 1094, -701, -1378, 772, 773, -673, 35, -247, 177, 1259, 14, -831, 378, 563, -334, 261, 395, 53, 644, -185, -451, 1035, 484, -956, -91, 564, 109, 130, -139, -745, 487, 553, -964, -141, 706, -644, -698, 263, -182, 162, 323, -822, -367, 1006, -204, -698, 355, 484, 235, 169, -217, 37, 438, 103, -255, 643, 388, 145, -173, -59, 546, 472, -228, -413, 713, 386, -196, -366, -93, -112, -3, -573, -319, 334, 40, -476, 80, 160, 109, 14, -269, -466, 210, 394, -471, -7, 550, 41, -263, -49, 206, 513, 219, -69, 339, 334, 283, -225, 303, 367, 196, -230, -453, 11, 8, 68, 85, 6, 54, 45, -490, -579, 225, -372, -874, -286, 77, 8, 213, -354, -76, 299, 370, -624, -40, 562, -168, -270, 460, 356, 358, 122, -414, 132, 335, -50, -326, 372, 351, -33, 101, -266, 89, 367, -74]
774g4n00P10K32p15P2K77Q9p2m64M0P42j63o22K12J18K3P8k14L56q7J90k66o9
797a07N50j50m40J23J97K20m19l44L68K17k0l14J3M08r3m37j27K74Rk32L15L29
819C40k24O9n65J35L78J42n83Q4M00j9j01k65M64q6j56o4K55L00n65q4p5M27M31
842F38m69n84O95p6j66j88J75j85L63m1m08J71M5l24K5L84K82p92l5L11K52L31
864D04o61j15N10L60o58L00M5j04r0K21m0n0j32L3Q7M56p1o11l58K73O08l77k67
887b37j1L24J7j95L77k43j34k15Q8K07K56k94n50L76M59P9m24k50R9O33o7l94
909i9N7K33l15j02O15K02n20k40jN26J56q53j44L39M88k39n22M31p2k76K31j83
931b88K75j16k86n8L83L40k99k23J08L60l8j57j94K50J20l93L93J38j70m54J40
$$ y = [-74, -574, 136, 368, -347, -275, 2, 91, 19, -445, -405, 337, 174, -448, -236, -118, -95, -17, -231, 125, 38, 228, -38, -107, 443, 293, -147, -24, 173, 393, -26, -370, -2, 215, 195, -119, -106, 302, 209, -228, -355, -81, -72, -304, 11, 340, 116, 185, -380, -245, 133, 275, -308, -224, 176, 157, 56, -209, 255, 169, 13, -51, 204, 504, -61, -145, -220, 207, 638, 169, -415, 280, 204, 38, -150, 25, -160, 203, 162, -246, -75, -30, -354, -329, 55, 337, -455, -490, -179, 73, 404, -257, -372, 138, 498, -160, 140, 185, 81, -9, 212, 172, 122, -10, 23, 110, 566, 495, -116, -474, -201, 407, 30, -237, -248, 76, 93, -102, 275, 32, -102, -317, -229, -22, 234, -60, -610, -234, 225, 304, -120, -370, -271, 362, 295, -99, -42, 191, -124, -226, 389, 591, 71, -169, -170, 356, 512, -341, -485, -146, 342, 103, -419, 12, -60, -336, -105, -288, -13, -129, -415, -473, -90, 250, -49, -272, -164, 196, 158, 1, -193, 57, 177, -216, 177, 315, 145, -309, -169]
952a69L78M08o56n11P8P54L39j049n3L71J29o9k95L71M09p11j05K67L75j61k44
973a44l57Q37J38p83k07N90K85l27J63l01J35L02l08j75K65K94q77J9O66J56k16
994A55n07L03M81p0q78J43M28R4n45L92K09k23l1l38O21J11j60n27q0O15M01p34
1016a40j24K48j18Q4l31L26K38k01k19J49P12k34j005K74N95R8n88j52P4L62J03
1037A51m24N19j6j15l18M2N97l54l86r5M64L74k94l67J17O9Q4l94M42J07Mn96
1059c89K10N86j74l60k23J58P18l98p22K55N46k90j06K37j55L6L8k40N28K44p31
1080b32k17P06K09m68l44L66p0L61k45l78K03L69m82j14N79K47m63l38J88N12
1100C89k02o05j40M49L82l00j31m4O17l83j44p9K93j62j91J5N25Q2o04k78N51
$$ y = [-169, 209, 617, -39, -550, -472, 282, 621, -428, -481, -110, 19, -50, -345, 26, 435, -276, -381, -114, 261, 100, -144, -501, 336, 474, -309, -516, 74, 359, 32, 195, -106, 29, 331, 23, -152, 113, 407, -470, -451, 215, 371, 155, -352, -49, 432, 362, -516, -373, 55, 149, -396, -4, 205, -18, -49, -387, 234, 345, 185, -342, -422, 193, 594, -140, -264, -16, -134, -50, -381, -55, 183, -18, -237, -88, 624, 390, -615, -341, 254, 352, -236, -388, -314, 48, 151, -273, 246, 230, 115, -203, -161, 436, 82, -304, -399, 65, 439, 145, -222, -105, -36, 48, -346, 96, 203, 207, -389, -179, 407, 233, -127, -350, -192, 526, 128, -594, -339, 207, -83, -189, 48, -107, -71, -33, -273, 255, 499, -232, -449, 257, 466, -2, -346, 20, -50, 311, 66, -312, -109, 260, -222, -336, 243, 490, 27, -311, -123, 389, 187, -418, -558, -109, 273, -27, -158, -202, 415, 32, -112, -191, 102, -60, -251, -236, 289, 371, -233, -511, 40]
1121D0N77m96m82J18L41k19K50m70N74jo49n5O69K82q67K5K64J69J84k09m28N73
1143A90J52l61j96K31J77k03k2L41N6o18o8m1O66J09n98l4O4O05j92o67M57nj45
1166a02P3p8K60K5m57k39P03K52k25m45J42K55P4l44o3R0K82k11p1L42k54n08
1188d99L20K12K98j69l80K08M54k71k18k4qJ50J14l36J55O4j82j41j2L65Q6k72
1210h6m32M18N97o76j3J36M24o15M25l7m41K74j7k33K64N5j66O2K7J12j45l28
1232c95L2N61Rq6l58K07O8l24J85P0j8p3JK51N0l44m6N6J70J20j0k04p2L06q2
1257G4o4r5J55k09p2J52K93J05o09J70J20N34l15l73mJ64J25k12J31j64nl12K28
1280a83J66N2k71M7M8J56J93n04R0K90J44j54m8j96R5nj37K52J87j28l53K85J08
$$ y = [40, 617, 121, -361, -243, 98, -121, 129, -341, 233, 232, -417, -472, 197, 479, -388, -363, -99, 70, 254, 45, -383, 190, 342, -19, -215, 16, 193, -10, -32, 309, 365, -253, -321, -362, 304, 413, -185, -219, -155, 450, 258, -409, 48, 43, -102, -29, -107, 153, 178, -279, -518, 185, 437, 212, -233, -91, 164, 238, -106, -169, -79, 203, -8, -79, 263, 9, -499, -179, 33, 331, 162, -218, -10, 444, 173, -45, -69, -77, 73, 187, -149, 6, 70, -112, -253, -265, 100, 186, -86, -518, -100, 497, -179, -192, -56, 368, -247, 178, 141, -300, -26, -43, -276, -12, 43, -123, -61, -34, 78, -67, -395, -363, 198, 207, 121, -237, -30, 38, -286, -101, -31, -49, -122, -121, 130, 180, -164, -210, -154, 16, 136, 126, -78, -150, 156, 74, 10, -85, 70, -139, -211, -59, 234, 339, -270, -100, 20, 554, 239, -134, -138, 26, 151, -61, 70, -94, -99, -411, -183, -17, 35, -236, -189, -141, 15, 208, -296, -206, 84, 228, 74, 26, -170, -75, -80, -217, 35, 222, 94, -259, 26, 134]
1303A34Jp4j51J67O9q0k95L8K08J90l9j6j6r2j42jPK39m71P4K69L00j79l25K30
1328D5j66K23n8n9L5L5m77N58J96k0j32m80L75J19n2k49j70R4K21p0M4J40j04
1351D8K4j54O0M29k61l23j6K4L81k62j94L78o6j81K41k46o5mJ87j3K40m5m51L9
1375b30RL67k68K39l85O07j35r7l20n0M02m15M29J34m0k50m73N64j1q5k69O0L12
1398I5j5k5j92J22Q4N7l09N7J6k63J99M30j42o7j49k35J09O86m47r8j84K36J10
1421G5m2l3K33m58M0K68L8pm23L78M9J93k41p6P3q3K00n00J23J32j10J5J66k56
1445b46L47r5j93K30K57Jn35J14K72q9J0k27K7K48n3k01Qn8K08j61J8K17K0j18
1469Aj55K27K49j90l11m6J55L25j93m4J34j08k84J94K85j09l9l81K13M78m54j16
$$ y = [134, 135, 61, -90, 77, 146, 66, -229, -191, 17, 207, 168, 152, 136, 44, -98, -99, -92, 147, -324, -250, 19, 319, 140, -185, 45, -121, 102, 44, -15, 20, 55, -422, 136, 332, 312, 180, -300, 75, 194, 142, -107, -277, -183, 38, -32, 12, 152, 48, 72, -82, -22, 407, 146, -177, -193, -169, 212, -50, -244, 134, 68, -113, 128, -118, -183, -187, 0, -13, 227, 182, -269, -230, -221, 146, -122, 117, -268, 339, 204, 107, -213, -263, 139, -276, 153, 287, 247, -3, -476, 88, 77, -8, -277, -217, 95, 80, 55, -137, -15, 69, 126, -183, -126, -110, -373, -174, 256, 114, 47, -102, -337, -228, 458, 11, -87, -271, -35, 75, 33, 0, 233, -225, -185, 83, 121, 114, -309, 69, 118, 311, 70, -6, 67, -16, 184, -316, -193, -61, -171, -156, 10, -246, 101, 6, -187, 43, 300, 301, -234, -120, 152, 63, 73, -154, -127, 121, 68, -133, -125, -183, 25, -136, -118, 99, 119, 1, -154, 73, 322, 132, -179, -225, -70, 255, 62, 18, 152, 44, -240, -46, 239, 130, 91, -290, -77, 401, -53, -169]
1491a69J99R7Jl28k22J90L95o5j71K44j72J72k51K8L41J39m57k04l7J79O3j55
1513a83J66K39m14J97k9m7R3o7qJ09j15J05j97J41N33n03m06L12K22j01q7o2J51
1536D9K0l8k24L82J87m95j79K14j09Q6j66k00K13M42k29PJ99O3l11j99M08J76
1558B96j00m23k97N79K47n60q4O56k45j25l68K40K71k19j01K50n0L36o10O0J55
1579i2L47o33j11L70K36k14k15L74K12j57j91j06M50k07n57K67K83K75l32j33
1599a34K01J85k39k25RJ41K54m48J41L85k19k21M8K85J37n04J49k90Q29l00m75
1620b91K09K47J0j95N6j2o4j98k11M20j33J73l52j0K91K28l08Q1J4p6J15o2j19
1643a87K65o2l66L29L01k70l43P4L32J45k75j82M1J76J12m89K46L95k90k65L39
$$ y = [-169, 30, 127, 128, -200, -422, -232, 163, 98, -73, 171, -1, 171, -80, -52, 289, 428, -29, -233, -270, -91, -28, -183, -17, 222, -192, 5, -24, -71, 22, -45, -53, 56, -59, 46, -151, -10, 523, 20, -386, -74, 148, 47, -40, -102, 49, 69, 31, -193, 189, 376, -119, -298, -84, -193, -107, -273, -473, -260, 182, -47, -40, 159, 222, -89, -288, 120, 296, 196, -227, -524, 55, 302, -258, -342, 314, 69, -56, -424, -184, 87, -132, -233, 17, -33, 303, -307, -247, -92, 255, -378, -489, -119, 117, -97, -312, 62, 274, 117, -74, -180, 270, 63, -494, -227, 56, 331, -1, -134, 67, 252, 13, -212, -203, -62, 192, -256, -115, 270, 51, -170, -122, 163, 300, -204, -55, -345, 484, 184, -291, -82, 165, 175, -20, 36, 24, -40, -238, -449, -29, -162, 11, -341, -351, -60, 168, -140, -59, -45, -121, -6, -68, -187, 78, 16, -350, -21, 280, 10, -333, -259, 73, 218, -57, -239, -198, -22, 90, -399, -153, 242, -48, -313, 26]
1664B6J59k99J28l35N41M9j43l77O39M9j81m90K20K33l50p6K39K31N6m18m4K26
1686H3N1l29J03R8J68l53J15K59N7k90k2M5L31m00j69R8K45O41o04m26K37J15
1708E3l9j61K77J07j29l05n4J81N25o14j21M04m8j91k23J29M08j28l28j18Q08
1729D33l81k26K1K02j6k83J08J37N88n42k74R4K05l8m2j67J51N5k26j34M84o7
1751H2m3j12k4m8R5o0j11M45m0m58J21L4L22k71j80N13j04n6n31J97N47k86k87
1774b55J28L01j55J05j94L13j55L6j69K79P6j53n54M44N04l88m12L25J03p7l91
1795b89K02K62j3n15L78j57O38n54k10L10P5K74p03K07K41J64k88j40O8L89k50
1816H9l76M49J70q8n57J10M04O5l14j80K13J21k00j42K15N90m83j93J00J81M8
$$ y = [26, 185, -114, 14, -321, 220, 269, 126, -251, 388, 437, 256, -234, -14, 219, -131, -207, 32, 263, 319, -99, -143, 83, 134, -195, -92, 6, 174, -179, -64, 195, 252, -38, -60, -15, 316, -84, -253, -155, 90, 731, 127, -299, -62, 53, 14, -147, 130, 237, 108, -197, -251, -70, 455, -159, -280, 124, 76, -115, -338, -209, 199, 71, -257, -375, 433, 52, -174, -153, 49, 33, -250, -142, -5, 583, 41, -233, -139, 66, 28, -14, -181, -30, 25, -201, -335, 149, 82, 39, -73, -97, -145, -50, -110, -221, 224, 184, -274, -153, -119, 203, -68, -248, 265, 161, 105, -426, -229, 318, 32, -255, -127, 174, 19, 124, -70, 243, 88, 124, -45, 234, 310, 157, -397, 47, 551, 163, -249, 76, 179, 102, -289, -87, 175, 162, -353, 25, -132, 506, -48, -258, 52, 127, 401, -302, -95, 146, 310, 22, -118, -50, 339, 89, -287, 162, 332, 244, -313, -203, 201, 266, -48, -228, -15, 106, -94, -236, -21, 569, 86, -107, -7, 174, 222]
1837B22o48K38L59Mn56O4N86K37k64p27O00K73m46q1j70Q16n97M0k5L77J88n93
1859a03k64K59L84l57p1K04K03o7l98L38J26O7o16n5M50J82p4o31L11M01l34o46
1881f91Q29K32j41n89L2O81j28m44k88J029J37p49j23J90L80k13m61J03K94J3
1901I3l68J95J56J50j47l16J60M61n45n8K01O35l11p73M21J07n4j73j3K45L27
1922C93q29J32L11M28n06l94L39N40k18m36K2N06j09j89l36M12L32m97l81L74
1942a06N12l18m11NO21R8o99J02L23l1k32l64N08L81k43m07J94N66k02n91K78
1963a6L09J77o27p4K66L54n40j13J13N35P8o94R9K95K98n22j70L85L35o46o66
1984h24P47M05n20l01K79L53Q1m46J56L10P9p76j3L21O67l90o07K18M60Q6m35
$$ y = [222, -426, -188, 171, 175, -381, -317, 269, 506, 242, -485, 115, 388, -58, -139, -309, 507, -90, -50, -75, 302, 490, -103, -367, -108, 276, -81, -152, 52, 255, 188, -210, 128, 254, 321, -295, -350, 100, 282, 208, -423, -112, 289, -45, -691, 138, 370, 229, -360, -328, 353, 225, -219, -507, 522, 659, -90, -213, -23, 357, 144, -317, -214, 80, 93, -275, -80, 76, 226, 79, -237, -77, 384, -161, -219, -18, 617, 306, -467, -46, 61, 7, -166, -179, 66, 393, -436, -304, 7, 435, -71, -465, -126, 414, 196, -240, -218, 288, 179, -10, -346, 66, 398, -99, -480, -106, 406, 88, -323, -318, 303, 401, -298, -196, 127, 96, -136, -500, 8, 389, 146, -261, -67, 499, 297, -294, -16, 293, 470, -157, -231, 35, 389, -151, -264, -151, 384, 462, -232, -133, 162, 460, -62, -232, 153, 488, -158, -824, -77, 328, -192, -493, -214, 139, 220, -226, -70, 240, 319, -457, -470, -149, 518, 128, -479, -261, 199, 285, -150]
2005a50P3M53p5p24O2P98j81p10j06L34Q90o00k85J27O58j38o07j81O97l2k00
2026A03n54N43L70l51k90j11O33j23p04L1P51j80l62N0M71k00m6n63L49M80k83
2047A4j13l05P73k07n40J40M71j16k55k62N09K09k63m20K06O58k01l40l73O12
2067A97P8l43o2L81J31l73k16J90J36k39l54K31K77L46p72L57L22n9k67k55J52
2088a42M31l31l31K23M78k97l01N3N27l0n55K78J66J07m04k15J46P87o63l64J47
2109b90M01j75j88J0L60k81L76p49O65K87j72l65Q2k9J21l04J20K50J12k40l29
2130c38L91J73j91k99N8L13n5j87k50N71j95k81o3N17J44l87m3K77J44j63m30
2151b94L62J95k77j44J55J12j37J13l78J42M10l37l07L30L24L5n18L2L92j04m55
$$ y = [-150, -77, 376, 301, -423, -361, 437, 256, -454, -560, -226, 664, 64, -221, -94, 564, 426, -181, -362, 335, 303, 103, -451, 92, 462, 111, -179, -290, 343, 220, -484, -453, 298, 118, -244, -194, 277, 77, 31, -532, -183, 297, 14, -99, -404, 369, 162, -378, -238, 233, 117, -138, -400, 109, 318, 55, -365, -159, 499, 298, -42, -415, 197, 275, -68, -130, 251, 382, 9, -207, -17, 119, -120, -474, -243, 34, 380, -392, -35, 287, 228, -39, -294, -142, 289, -42, -373, -150, 328, 31, -270, -217, 310, 280, -275, 3, 169, 276, -128, -343, -197, 590, -73, -437, -290, 111, -64, -252, -242, 118, -163, 213, -536, 129, 416, 244, -121, -39, -68, 53, -251, -131, 119, 231, -9, -338, 53, 226, 35, -264, -206, 107, 52, -135, -385, 186, -9, -290, -353, 164, 308, -79, -122, 155, 299, 136, -294, 68, 263, -14, -158, -3, 109, -28, 85, -293, -151, 259, -78, -385, -55, 269, 304, -214, -182, 210, 106, -349]
2172c49M15R9K1k88j07L3N52j67l46J56J27j88K2n4M25m58j27P8L26n3j87m80
2194e50N37K68P1n50L04L9j24J42l88M25ll94J39J38L1j38k05N7K27K1k43R4K40
2217A38Lj94l2M8M6J22Po8j76J11k51kN22j89k23OM02j40j22l53M02j79J15j70
2241a77L15j38K8q8j54L3J22M2j61J79j30L65k04j78M94j15k99K01nK5k60L8R7
2264C0J92n16L87j55Q8M4j09N7J2L1P8j81J98k53l7L04k85J72l29K33p9K33l73
2287b58K96j40J25L9j31m3j78M48k00l5L74k17j28k30J42L52k62K34N0Kj23k20
2309a03J37O7k2k7J58j44l08J55j6J68R5k3j11J93L0m73J24J45j72J9P8k0j38
2332a88L66n47L77Q3J90l16m5p0K83J06m34N8RK75m25K82K22J30l59j57K13J50
$$ y = [-349, 66, 165, 186, -102, -209, -176, 376, 209, -137, 19, 146, -42, -20, -74, 351, -107, -234, -156, 170, 117, -70, -550, -13, 255, 326, -224, 80, 119, -5, 137, -251, 174, 171, -223, -84, 54, 85, -53, -258, -201, 26, 47, -196, -102, 138, 141, -53, -85, -37, 9, 131, 138, 70, -106, 5, -246, -248, 274, 85, -138, -132, 270, 130, 8, -345, 57, -122, -7, -177, 138, 0, 28, -60, -214, -181, -59, -17, -178, 1, -129, 236, 32, -146, 348, 233, -66, 135, 130, 155, -105, -67, 30, 222, -294, 93, -62, 26, 70, -39, 18, 30, 61, 139, -42, 156, -97, -134, 170, -115, 57, -272, -39, -118, 115, -258, 38, -102, 23, 62, -69, -112, -290, 158, -42, -77, 297, 80, -48, -278, -136, 216, -46, 188, 238, 240, 117, -103, 34, 101, 79, 52, 210, 66, -242, -87, -103, 65, 160, 137, 26, 219, 249, -224, -100, 45, -127, -108, -30, -50, -188, 178, -369, 8, 91, 281, -35, -80, -150, 133, 239, -195, -137, -128, 147, -278, 4, 226, 356, -3, -160, 53, 203]
2354B03m45J54L80l70K73l55J32K17j96J7k58L65j77Q7o1l5J76J7k92K33K6l13
2376b22K45l34L77K1l50O2J98j66r8K06P7K51k41M5k72L18m2l7R7J5k5j37j14
2399a26K49K50l41j28P3J91k10n2K27J0l01L7M3J02J25n5j13J8K07k32j37L3L54
2422B24k09ko1M1M10m47p5L23P1j9j00l4j22Nk88J62K23q4k16J04O8m1J96k3j7
2447H9j00N5p1P0J27l26J67m7J67k60K91m2j47J54k64p7J61L08k30j26J42P5J54
2470B70k98n2M2L11j85O1k50K8K28j47J59n0k09J04p8n0j9l05N27K37k96r6n2
2493a20J83K32m94L05n42O02j80K18p6k7j8R5k10N5J34q2j42J45J88n31K97k0
2515A2m0R0Nj14J21j65J0J45k50J06P4Q5k95O1L65l31lL21j80m0j32J75j94J20
$$ y = [203, -242, -88, 292, -78, 195, -160, -28, 189, -7, 10, -248, 117, -60, 27, -34, -69, 107, 124, -168, 65, 91, -222, 23, -311, 66, 87, -263, -201, -3, -169, -267, -61, 16, 267, 26, 71, -201, 117, 75, 38, 135, 150, 125, -12, -126, 123, 373, 32, -96, -23, 168, -42, -94, 133, 143, -158, -121, -78, 24, 149, 94, -19, -1, 206, -26, -163, -130, 224, 15, 13, -48, -7, 403, -44, -119, 204, 275, 256, 156, 122, 0, 5, -283, -121, 102, 18, -198, -94, -26, -67, 129, 106, 89, -11, 44, -27, 43, 170, -156, 11, -36, 131, -129, 162, 120, -27, 127, -137, -214, -53, 255, 25, -101, 41, 116, 270, -28, -80, -38, 273, 88, 149, -101, -73, 155, 8, 167, 117, -92, 12, -66, -116, -135, -440, 87, 324, 28, -68, -120, 63, 295, -199, 106, -436, 166, -14, 204, 128, 101, 83, 178, -32, 23, 157, 75, -67, 78, 266, -265, 32, 12, -28, 62, 67, -47, 74, -91, -81, 64, -186, -80, -6, 79, -216, -155, 210, -121, -124, 197, 17, -23, -155, 20, -174, -54]
2539e4J6J1k22J83L09j63J83j01j00j01j32K24k49K25P2k93J88o9K01O9j32j35
2561g0j4K70O6m01J63j94L10m4k31J10N8K04l98K51Q7l76m3J87j09J84K15l00
2583g5J39L8j03j86R8K10k84K22P2o6J07k87m9K27k30L67k14l24M40j24Ro6J01
2606B2o8J51k79K32o3J21j96N7J97l7j38j14J76M6J17l92RL43rn5j88J9M1k5k28
2631b61J15L98k38QJ20N7m01L38j0k0j74K5J91L3j04r3Q9p9J21q4L31j62l52L51
2655A99r8O2P5k64NJ26l30J88P2k17l7J73oJ15o2j98k0K32m6o7J25M7K41n06J83
2680hJ31mm71K74L20l30K57r5o2k29M20j74R2n0Pk55J35N7j42K68k97L17k87J24
2704brp3J91Q2j58j09k2O3q7O8K29L1k23j31L30j33J3m0r6J6k24K81m6j3J83k22
$$ y = [-54, -38, -27, -249, -66, 243, 80, 263, 162, 62, -39, -171, 53, -196, 29, 101, -192, -4, -73, 128, 197, 65, -70, -84, 186, 252, -149, 14, -180, 130, 86, -145, -35, 23, 227, -171, 80, 167, -209, -252, -65, -174, 10, 225, -75, 64, 102, -1, -187, -89, 121, -163, 59, 131, 65, 172, -115, -164, 63, -167, 200, -14, -338, 102, -22, -13, -79, 22, -46, 105, -174, 58, -5, 116, -80, -23, 174, 137, -1, -115, 61, 107, 224, -168, -159, 184, 175, 120, -68, -49, -8, -33, -261, -146, 252, 14, 22, 142, 199, -202, 136, 126, 106, -68, -43, 148, 181, 77, -16, 73, -6, 115, 31, 362, 200, -152, 199, 101, 163, 238, -26, -21, 105, -225, -37, 35, -182, -219, -46, -52, 63, 1, -197, -217, 15, -31, -98, 27, 74, 315, -191, -8, 123, 119, -352, -78, 242, -88, 169, 74, 12, -217, 203, 29, 121, 71, 78, -177, -42, 15, -127, 141, -156, 161, -126, -2, -11, -84, 107, 189, 31, -78, -100, -37, -124, -56, 173, 204, -19, -150, 180, 47, 60, 20, -76, -60, -284, -3, -49, -62, 121, -101]
2730a01J83m8k05K19k05M4L22k56j69K1L41o3M0jj2l09J4Q0p1K45j78N5k0o0J88
2755E4j92Q0K74j57m3k3N4l8J38k03M9j8p8r1K95q3K4r0p1L5J45Q8j89K6J65l71
2781b20K48Q0M5n02K60R5PR4j96j2K0M7R9r0k86J93K73k10K13M5l82J66p4J16
2805B9j2m8r0K19p8j93L38j84R0K8K4j43o1Q4rk90J83R8J35J51j49Rj27J12j84
2830f8K67q6j34k50L28k53K95k64nR0k8j65qL46J31l93L71j80j03q0L10n0o4J25
2854A32p0o3m4J48k69J15J93p1j89p8L97Kj23j68kN7r8J42K46k26N8j00M32k89
2878A32L0P9k84J43j71j09R3R5j16J82l9n6N0R5j52N9p8J53o9l0k34L86p0MJ0
2903A03l18J56j1OJ11n8n2J62J6L1k29R7l06M56L7l57K10L3mk96L03k08J53o0
$$ y = [-101, 82, 34, -171, 48, -157, -113, 209, -47, -216, -195, 146, 83, 123, 122, 110, -199, -185, -105, -176, 69, -109, -54, -74, -134, 54, -138, -58, 216, 59, 16, -7, 47, 9, 147, -56, -7, -25, -103, -194, 101, 18, 42, -48, -119, -84, 61, 149, -40, -14, 151, -220, 28, 108, 153, -349, -89, 6, 13, 107, -89, -101, -81, -34, 65, -25, -311, -118, 155, -55, 158, 203, -179, -13, -87, 29, 17, -31, -121, 98, 20, -173, 165, -19, 71, 99, 123, -20, -81, 3, -6, -296, -113, -15, 120, 271, 122, 131, 4, 116, -68, 199, 113, -21, -271, 57, -196, 99, -165, -170, -80, -108, -273, -281, 65, 196, -197, 174, -6, -109, -189, 121, 71, 7, 132, 62, -1, -45, 103, -166, -51, 142, 71, -118, -196, 201, 203, 80, -88, -90, -33, -131, 11, 257, 31, 89, -11, 421, 132, 162, 241, -43, 100, -71, -180, -87, 8, -108, 74, 35, -21, 29, 124, -28, 31, -47, 106, 37, 7, -227, 159, 89, 93, 103, -215, -59, -70, -64, 47, -11, -63, 99, 115, 146, -83, 14, -292, 164, 201, -156, 54, 87, 83, -213, 90, -118, 35, -25]
2927b5J4o6J85k38jL54j72j94L18k32M4k7L0j59L33p7r5p2J14k04J18m4n5J82
2951C1J40k00J33K1J85j60k02j29J10R3J01j34L4mj17J64mj53K58k20q4Q1L41
2974B85l90J06L16m76J7j4K55j08J93n09J50K50Q2l3p8p5JQ9J04J18m88m6L97
2997A46j62j63N39r4j79k77p5L75k53J29J05n2j5L9k26J69k23L29K0Jj37j82L89
3020B03k07J45j53q7qK21j78K29j25Qj38k18L43J84m01Q6J34k10P5N19n27L34
3042B29l09L33n9j30J05k43j17K49J79j57j84L50l07l2K66m55J97K3o4j7J30L4
3064B1J1j19K58l02J61p9j45J80K16k09jj90K9K73K5J71r9l39o8K66l8m7J9j31
3088a37K71j28o2Q8Q6j50j20j2N4K32j19K0j33P6J96l52K47k16M8k2R0k13L01
$$ y = [-25, -11, -77, 108, -130, -131, 223, 51, -143, 175, -57, -13, -40, -10, -169, 164, 87, -8, -80, 34, -170, -52, -96, -151, 31, 171, -29, 104, 125, 310, 150, -52, -181, -71, 22, 123, -11, 23, 19, -98, 66, 62, -91, 167, -53, -137, -56, 285, -105, 1, 317, -159, -142, -156, 99, -9, 184, -325, -175, 75, 157, 124, 46, -29, -28, 61, 165, 283, -205, -251, 146, -16, -179, 360, 266, 87, -190, -265, 110, -143, -14, 91, 39, 24, 63, -163, 6, -217, 112, 132, 133, -4, -186, 203, -4, 141, -12, -99, -107, 114, -64, 165, 40, 48, -90, -308, 35, 219, -182, -96, 38, -172, -97, 422, -105, 229, -80, 253, 194, 64, 169, -74, -191, 58, 237, 80, -104, 246, -61, -93, 173, -282, -85, -62, -126, -143, -13, 21, 32, -87, 171, -131, 30, -49, -194, -14, 202, -7, -8, -198, -169, 104, 129, 300, 201, -138, -206, 60, 22, -25, -6, -137, 134, 6, -56, 32, 118, -32, -152, -164, -110, 122, 3, 23, -110, -34, 162, -190, 57, -159, -111, -133, -43, -256, 45]
3111D5P4j61j72J86L6p9l0K85l40J47k0N4J93j26J72j72j01J15k35K7J71j09O
3134c4k5j1j92O04n27J15J53k0l6k6P5o1J61k30l3K20k4j07j20J99j03j20K18
3157G6j70K79j01l32o2K13K89m31K65q2j1J62mk2J36l40L2K81l69K88k04q8R9
3180i6j1k9L92k04j11J85p1k13N7J02j22P8l15L51m7J36k36K3L14p3n28N59pO
3204A40o7l06J36N4J34j11n7n1J21R9l98K63JJ05p1j62J05j12J05J2J19j48j19
3227b08J34J27p6K6o9M9j24O1Lk05R8k5J03L71k50N2Qj8r8j5M5k26J13K06j11
3252b9L4K1N6j32m0K52q1k02K92q6j99M3J55j37O6Ok62K03K8Q6j27k3J23m9J02
3277A00r7k58K46j17J57q9r6L9L74j46r7m32M88k62j74J97J64J39k06QL63m26
$$ y = [45, 119, -42, -214, -28, 8, -71, -101, 184, -156, -9, -29, 25, 218, 92, 264, 92, -9, 106, -129, -102, 69, -40, -34, -59, -70, -262, 342, -185, -70, 83, 63, 27, 1, 76, 15, 176, -54, -87, 133, 109, 2, -118, 81, -22, -142, 76, -94, 185, 84, -248, -310, -97, 192, -239, 26, -56, -67, 95, 91, 69, 205, -135, -103, 178, -191, 97, -107, -195, -96, -107, -136, 256, 52, -59, 126, 55, -158, -101, 1, -121, -43, -358, -7, -54, 82, -154, -131, 183, 110, -418, 141, 134, 140, 73, -233, -97, -43, 91, -20, -77, -128, -7, 92, -306, -43, -42, 63, -8, -170, -65, -177, -72, -60, 59, -89, -208, -74, 53, -23, 3, -66, -17, -141, -80, -77, -282, -184, -209, -106, 265, 15, 67, 75, 57, -41, -56, -11, -237, -124, 82, -29, 5, 26, 82, -50, -90, 162, 81, -121, 171, 85, -114, -71, 84, -53, 13, 19, -243, -40, -12, 74, -53, -76, 47, -2, 100, 3, -255, -9, -126, 31, -58, -154, -115, 259, 113, 16, -416, 72, -190, -364, -167, -3, 136, -70, -62, 301, -125]
3299a25L1ll25K97j20N11m72L32m5M5O3n70K89L26k36J00k77o1K80p7l7k05L76
3322I7n9N1J47k92J51Qj32j3J87j70l99K49P2J74j51R5L8j5Lj71O8K5l5K64j32
3347F0j70l3M59m33r8K72r6J6J1KJ80k50K37l60J17J3J8k55j5L21k21J28L3J30
3371F6j3j3jk37J34OK8j38J62J00k43j60N20O7m39K86j27J53O6j75L30m27rn9
3395a23Q6j76K55J30j36K02j89P5j78k3L22l31o1P1K23l76J58o7l1r3M32k84J48
3418C4J79j14j94J15m0l2K92j35R0k30K76l48jj35K88Mk84n2J95J67j15M0j12
3441a12n1R1J20o0N0q3p2J79j51L93n17K93p6M6k55M50j87k22l29K81M34j44k81
3464b03Q1j41K6K21p2L83n18L51j85RL5l35M58q8J25n8j22m7j10K33N1k1j80r3
$$ y = [-125, -94, -97, -422, -125, -245, 266, -206, 126, 81, 126, 189, -381, -92, 234, -2, 98, -179, -240, 40, -37, -74, -279, 97, 38, 89, 236, -56, 95, 103, -29, -42, 145, -25, -424, -175, -103, 71, -80, 15, 53, 38, 41, -130, -62, -37, -72, 192, 60, -110, -143, 316, -117, -215, 57, -39, -23, -12, -10, 170, -80, 157, -203, -86, -73, -55, -310, -325, -4, -225, -97, -64, 66, 53, 40, 39, -198, -64, -58, -30, -168, -6, 94, -149, -309, 211, 278, -161, 125, -2, 151, 217, 42, 372, -55, -64, -123, -37, -213, 42, 172, 36, 238, 49, 124, -54, -77, 245, -86, -147, -76, 147, -229, -71, -138, -169, -262, 170, -114, 34, 213, 99, -95, 20, -20, -52, 240, 105, 195, -35, 241, -107, -108, -243, 45, 49, -235, -287, -92, 75, -40, 0, -112, -163, -72, 48, -12, 38, -45, -117, 62, -89, 304, -213, 80, 4, 50, -205, 245, 58, -164, -493, -212, 222, 78, -203, -122, -263, -237, -16, -88, 295, -223, 128, -57, -48, -13, -348, 110, 22, 147, 89, -33, -80, -190, 43, 94, 73, -107, -200]
3488b00J90J12k5J13l50J19J63j13Q6k03K39M7k83K31k06m1J90j87K11j79Q3k9
3510c2k18L58k60K62N5q1j35J28j13J0j1q5L31l82L10l09K03J21l3j07j64K24
3532G2J2j99K86J73l37o2qJ84l81J85K98k73R8j1K11j86J2k64KL1j90N38q7k30
3556a26j06K55j42K48k16k8O2N9NJ08JL6j46k05j32L83l18J02M39k97p4J47m9
3579Fj18J0M70l57k12L60j54j9m2J82j63J69k3Q1j85k07L62l16P8o0J07L8j79
3602a72M57O2o73K64M7J64j02j88J45K57l25P0J09K35l07Q5o1o2j4j18J43K16
3624B32k32O4L70m74oJ9qk18M24m7r1j7r6l8J6K69p6O6j21o5O0l7m4J46k60N9
3650a05L00k6k79J34J17J22l89J19n1K8J38l5j09K20j97J48k05N9k13L82j74J10
$$ y = [-200, -10, 102, 77, 190, -160, -41, 122, 9, 95, -108, 131, 178, -105, 126, -80, -121, 69, -118, 93, -86, -3, -32, -250, 108, -152, 110, 165, 84, -51, 77, -36, -26, -37, -122, 209, -173, 137, -172, 31, 152, 119, 12, -152, 72, 84, -115, 171, 344, 7, -55, -63, 121, -260, -75, 223, -50, 48, 37, 248, 62, 74, -190, -188, -157, -347, 191, 104, -126, -232, 23, -119, 129, -87, -115, -53, 6, 11, 119, 120, 156, 10, -195, -327, 56, -262, -160, 279, -18, -92, 55, 6, -112, -102, 368, 11, -201, 159, 5, -14, -56, 126, -37, 132, 109, 190, 5, -202, 160, -156, -78, -138, -31, 7, -172, 285, 347, -326, -62, -15, 149, 47, -141, 4, 261, -64, 6, 115, 350, 43, 128, 67, 5, -9, -127, 16, 232, 0, 64, 434, -40, -46, -27, -35, -253, 171, 124, 33, 16, -80, -118, -102, 167, 91, 157, 36, -29, 31, -6, -50, 96, -164, -105, 195, 169, -110, 24, 141, 263, -126, -7, -58, -30, 108, 73, -36, 184, -13, 135, -70, -11, -224, 158, -16, 94]
3672I4r7mj05J29j1k90J10L45j63r3L41j61M6l4O1L0j87p0n2JL8K54l5m25K91
3697A3L03j85j32j36M3J36j5J76o74M09O4k3O0j73k2J74K26o7k33O0k51K58O3
3720G4j30j83K55j6J83l35K26j46J46Q0q0j97K90k66J4l2M5P2K7J57O1N4j80k54
3744a35K59j28r0K0j01Q6j54L75o6J83l78J75r2K1ok76L55j86L88l97J99JJ15
3767A68j57k66M90k26l6j35J49k8m8L12K1l66J12M4J39k62Q0K78k73J32k43R4
3789b1o8j08K30j14JP6J61k4j75j31J31O7J63l93J02O7k02L24J38j18k41J79K4
3812F8J21j63M6K31m22L0L78m39L70j26k19J3K35j17j03Q9J27q9l98J78L61j5
3834A56k33R4k21K1J40k16L84Q1K2k65K04k70J77q1j66K96j70M31k97k57P2O7
$$ y = [94, -3, -7, -112, 17, 6, -284, -174, 171, 8, -85, 256, 95, 141, 107, 168, 198, 11, -59, -111, -110, -72, 182, 147, -278, 13, 316, 131, -1, -137, -94, 42, 27, 203, -471, -62, 2, -21, 39, -134, -156, 18, 244, 177, -56, 4, -247, 11, 74, -56, -239, 16, 0, 183, -152, 74, -72, 74, 154, 74, -123, 167, -99, -85, -117, -72, 0, 27, 184, 245, 299, 119, -135, 124, -4, -94, -74, -175, -89, -243, 132, 66, 249, -129, 46, -46, -25, -31, -307, 48, -138, 250, -147, 52, 53, 168, 11, -255, 235, 9, -27, -162, -13, -41, -89, 223, 244, -122, -10, 34, 173, -89, -9, 269, -4, 128, -115, -21, -89, -197, 33, -81, -80, -4, 157, 133, -42, -173, -42, 25, 188, -205, -103, -36, -238, 86, 224, 106, -135, 44, 68, 189, 26, 72, 303, -119, -89, 289, -150, 220, 94, -125, -112, 123, 6, -97, -8, 119, 30, -368, -190, 171, 156, -77, 17, -204, -183, -43, -259, 125, 206, 228, -37, 167, -103, 74, -7, -173, 123, -47, 384, 87, -170, -98, -31]
3856c1k3o9K23o1k6q7n1K97k92L0l48M48K9j02J14j23r5K26J32l18j51M37j45
3879A4K36j89j8J75k55K79l3l95N5J76Q0J71m22Q6J31K5N2j51%j45N2J04j14j4
3903a00p4J89J7p5K6k0Q4J5M9q8J52J31j19l24K99l71M93m10L66j36p7q1r0J59
3927A5j81K31j81J64K04r5k32r3m4K83J34l47J91N6k59P5J42J22j55p3o8j01J32
3950h0J78j24K96j53k22n7J17p6J87Q5l07K26j47J29j66J92j02J03m5J06Q0j61
3972E9k66J28J83J01j0j67K04q0k70Q7l4O8J45m8j11J08o7K46l71J0J53l12L50
3995A06Q2q7j05R0j84J11q3N7m0J33j01k13K86k12L06l76L97j25j66K78q9M1p9
4018B7J65p8k7J55n85L14J0P5K79k47j15o0K42j21m8K03j71J42k61p6N4r0R5O2
$$ y = [-31, -54, -123, 100, 39, 13, -74, -125, 172, -120, -90, -438, 10, 39, -63, 51, -72, -167, 59, 191, -127, -278, 159, 14, 250, 61, 43, 218, -37, 242, 209, -186, -131, 45, 125, 296, -126, -40, 91, 116, 168, 17, 17, -128, -76, 28, -86, -100, -174, 15, 32, -43, -17, -37, 47, 62, 111, 23, 175, 306, 187, -137, 162, -209, 284, -126, 240, 104, 27, -54, -144, 15, -166, 65, -116, 48, 252, 157, -75, -168, -212, 71, 205, -142, 49, 105, -154, -79, 63, 185, 30, -43, -111, -212, -80, 98, -26, 270, 117, -105, -162, -45, -121, 66, 151, -156, 70, -77, 52, -114, 78, -24, 79, 34, 140, 220, 59, -207, -79, 104, 205, 195, 28, 232, 152, -118, -31, -65, 3, 148, 100, -11, 97, 30, 276, -95, -85, 68, -244, 106, 188, 101, -4, 86, -98, 13, -70, -13, -53, 80, -21, -234, 52, -160, 146, -230, 167, 42, -124, 154, 65, 106, 27, 192, 114, 87, 242, -343, -29, -19, 56, 335, 88, -27, -87, 155, 34, -14, 189, 18, 160, -101, -177, -123, -213, -118, -56]
$$ [...]
8191g8
##END NTUPLES=NMR FID
##END=
