##TITLE=1H_SR 156_k TFA
 DMSO-d6
 8 sc, 
 27.1.2023
##JCAMPDX= 6.0         $$ Bruker NMR JCAMP-DX V2.0
##DATA TYPE= NMR FID
##DATA CLASS= NTUPLES
##ORIGIN= UXNMR, Bruker Analytische Messtechnik GmbH
##OWNER= root
$$ XWIN-NMR		Version 3.5
$$ Fri Jan 27 15:42:55 2023 Russian Standard Time (UT+4h)  she@DPX200
##.OBSERVE FREQUENCY= 200.13135
##.OBSERVE NUCLEUS= ^1H
##.DELAY= (6, 6)
##.ACQUISITION MODE= SIMULTANEOUS
##.ACQUISITION SCHEME= undefined
##.AVERAGES= 8
##.DIGITISER RES= 18
##SPECTROMETER/DATA SYSTEM= spect
##.PULSE SEQUENCE= zg30
##.SOLVENT NAME= DMSO
##.SHIFT REFERENCE= (INTERNAL, DMSO, 0, 15.7039)
##AUDIT TRAIL= $$ (NUMBER, WHEN, WHO, WHERE, WHAT)
$$ ##TITLE= Audit trail, XWIN-NMR		Version 3.5
$$ ##JCAMPDX= 5.01
$$ ##ORIGIN= Bruker BioSpin GmbH
$$ ##OWNER= she
$$ F:/spectra/data/she/nmr/H-F/1/audita.txt
$$ ##AUDIT TRAIL=  $$ (NUMBER, WHEN, WHO, WHERE, WHAT)
(   1,<2023-01-27 15:41:58.43 +0400>,<she>,<DPX200>,
      <created by zg, POWCHK disabled, PULCHK disabled
       configuration hash MD5:
       00 E9 B6 7A A2 85 ED C7 34 08 36 98 17 FE 4E 26
       data hash MD5: 16K
       96 EF 6C 9A 1D 46 56 F5 E8 97 78 11 8F B4 72 C4>)
$$ ##END=
$$ 
$$ hash MD5
$$ C2 E1 26 A9 C7 03 CA 68 F5 B9 30 96 BD 0B EE B6
##$RELAX= 
##$RELAX= 
##$RELAX= 
##$RELAX= 
##$RELAX= 
##$RELAX= 
$$ Bruker specific parameters
$$ --------------------------
##$DU= <F:/spectra>
##$EXPNO= 1
##$NAME= <H-F>
##$PROCNO= 1
##$TYPE= <nmr>
##$USER= <she>
##$AMP= (0..31)
100 100 100 100 100 100 100 100 100 100 100 100 100 100 100 100 100 100 
100 100 100 100 100 100 100 100 100 100 100 100 100 100 
##$AQSEQ= 0
##$AQ_mod= 1
##$AUNM= <au_zg>
##$AUTOPOS= <>
##$BF1= 200.13
##$BF2= 200.13
##$BF3= 200.13
##$BF4= 200.13
##$BF5= 200.13
##$BF6= 200.13
##$BF7= 200.13
##$BF8= 200.13
##$BYTORDA= 1
##$CFDGTYP= 0
##$CFRGTYP= 5
##$CHEMSTR= <none>
##$CNST= (0..31)
1 1 145 1 1 1 1 1 1 1 1 1 1 1 1 1 1 1 1 1 1 1 1 1 1 1 1 1 1 1 1 1 
##$CPDPRG= <>
##$CPDPRG1= <>
##$CPDPRG2= <>
##$CPDPRG3= <>
##$CPDPRG4= <mlev>
##$CPDPRG5= <mlev>
##$CPDPRG6= <mlev>
##$CPDPRG7= <mlev>
##$CPDPRG8= <mlev>
##$CPDPRGB= <>
##$CPDPRGT= <>
##$D= (0..31)
0 1.2 0 0 0 0 0 0 0 0.06 0 0.03 0 0 0 0 0.0002 0 0 0 0 0 0 0 0 0 0 0 0 
0 0 0 
##$DATE= 1674819717
##$DBL= (0..7)
120 120 120 120 120 120 120 120 
##$DBP= (0..7)
150 150 150 150 150 150 150 150 
##$DBP07= 0
##$DBPNAM0= <>
##$DBPNAM1= <>
##$DBPNAM2= <>
##$DBPNAM3= <>
##$DBPNAM4= <>
##$DBPNAM5= <>
##$DBPNAM6= <>
##$DBPNAM7= <>
##$DBPOAL= (0..7)
0.5 0.5 0.5 0.5 0.5 0.5 0.5 0.5 
##$DBPOFFS= (0..7)
0 0 0 0 0 0 0 0 
##$DE= 6
##$DECBNUC= <off>
##$DECIM= 32
##$DECNUC= <off>
##$DECSTAT= 4
##$DIGMOD= 1
##$DIGTYP= 9
##$DL= (0..7)
0 120 120 120 120 120 120 120 
##$DP= (0..7)
150 150 150 150 150 150 150 150 
##$DP07= 0
##$DPNAME0= <>
##$DPNAME1= <>
##$DPNAME2= <>
##$DPNAME3= <>
##$DPNAME4= <>
##$DPNAME5= <>
##$DPNAME6= <>
##$DPNAME7= <>
##$DPOAL= (0..7)
0.5 0.5 0.5 0.5 0.5 0.5 0.5 0.5 
##$DPOFFS= (0..7)
0 0 0 0 0 0 0 0 
##$DQDMODE= 0
##$DR= 18
##$DS= 0
##$DSLIST= <SSSSSSSSSSSSSSS>
$$ [...]
##$SUBNAM2= <"">
##$SUBNAM3= <"">
##$SUBNAM4= <"">
##$SUBNAM5= <"">
##$SUBNAM6= <"">
##$SUBNAM7= <"">
##$SUBNAM8= <"">
##$SUBNAM9= <"">
##$SW= 18.05172834244
##$SWIBOX= (0..15)
0 0 2 0 0 0 0 0 0 0 0 0 0 0 0 0 
##$SW_h= 3612.71676300578
##$TD= 16384
##$TD0= 1
##$TE= 0
##$TE2= 300
##$TE3= 300
##$TEG= 300
##$TL= (0..7)
0 120 120 120 120 120 120 120 
##$TP= (0..7)
150 150 150 150 150 150 150 150 
##$TP07= 0
##$TPNAME0= <>
##$TPNAME1= <>
##$TPNAME2= <>
##$TPNAME3= <>
##$TPNAME4= <>
##$TPNAME5= <>
##$TPNAME6= <>
##$TPNAME7= <>
##$TPOAL= (0..7)
0.5 0.5 0.5 0.5 0.5 0.5 0.5 0.5 
##$TPOFFS= (0..7)
0 0 0 0 0 0 0 0 
##$TUNHIN= 0
##$TUNHOUT= 0
##$TUNXOUT= 0
##$USERA1= <user>
##$USERA2= <user>
##$USERA3= <user>
##$USERA4= <user>
##$USERA5= <user>
##$V9= 5
##$VALIST= <valist>
##$VCLIST= <CCCCCCCCCCCCCCC>
##$VD= 0
##$VDLIST= <DDDDDDDDDDDDDDD>
##$VPLIST= <PPPPPPPPPPPPPPP>
##$VTLIST= <TTTTTTTTTTTTTTT>
##$WBST= 1024
##$WBSW= 4
##$XGAIN= (0..3)
0 0 0 0 
##$XL= 0
##$YL= 0
##$YMAX_a= 252137
##$YMIN_a= -154270
##$ZGOPTNS= <>
##$ZL1= 120
##$ZL2= 120
##$ZL3= 120
##$ZL4= 120
##$ABSF1= 10
##$ABSF2= 0
##$ABSG= 5
##$ABSL= 3
##$ALPHA= 0
##$AQORDER= 0
##$ASSFAC= 0
##$ASSFACI= 0
##$ASSFACX= 0
##$ASSWID= 0
##$AUNMP= <proc_1d>
##$AZFE= 0.1
##$AZFW= 0.1
##$BCFW= 1
##$BC_mod= 2
##$BYTORDP= 1
##$COROFFS= 0
##$CY= 11.3945322036743
##$DATMOD= 1
##$DC= 2
##$DFILT= <>
##$DTYPP= 0
##$F1P= 2.36226072786647
##$F2P= -0.459571619588291
##$FCOR= 0.5
##$FTSIZE= 0
##$FT_mod= 4
##$GAMMA= 1
##$GB= 0.15
##$INTBC= 1
##$INTSCL= 1
##$ISEN= 128
##$LB= 0.24
##$LEV0= 0
##$LPBIN= 0
##$MAXI= 10000
##$MC2= 0
##$MEAN= 0
##$ME_mod= 0
##$MI= 1.114404
##$NCOEF= 0
##$NC_proc= 0
##$NLEV= 6
##$NOISF1= 3.799351
##$NOISF2= 2.8
##$NSP= 1
##$NTH_PI= 0
##$NZP= 0
##$OFFSET= 15.70392
##$PC= 1
##$PHC0= -19115.04
##$PHC1= 12.40079
##$PH_mod= 1
##$PKNL= yes
##$PPARMOD= 0
##$PSCAL= 0
##$PSIGN= 0
##$REVERSE= no
##$SF= 200.130013532006
##$SI= 16384
##$SIGF1= 3
##$SIGF2= 2
##$SINO= 400
##$SIOLD= 16384
##$SREGLST= <1H.CDCl3>
##$SSB= 0
##$STSI= 0
##$STSR= 0
##$SW_p= 3612.71676300578
##$SYMM= 0
##$S_DEV= 0
##$TDeff= 0
##$TDoff= 0
##$TI= <>
##$TILT= no
##$TM1= 0
##$TM2= 0
##$TOPLEV= 0
##$USERP1= <user>
##$USERP2= <user>
##$USERP3= <user>
##$USERP4= <user>
##$USERP5= <user>
##$WDW= 1
##$XDIM= 8192
##$YMAX_p= 0
##$YMIN_p= 0
$$ End of Bruker specific parameters
$$ ---------------------------------
##NTUPLES= NMR FID
##VAR_NAME=  TIME,          FID/REAL,        FID/IMAG
##SYMBOL=    X,             R,               I
##VAR_TYPE=  INDEPENDENT,   DEPENDENT,       DEPENDENT
##VAR_FORM=  AFFN,          ASDF,            ASDF
##VAR_DIM=   8192,          8192,            8192
##UNITS=     SECONDS,       ARBITRARY UNITS, ARBITRARY UNITS
##FACTOR=    0.0002768,     1,               1
##FIRST=     0,             0,               0
##LAST=      2.2672688,     0,               0
##MIN=       0,             -154270,         0
##MAX=       2.2672688,     252137,          0
$$ Real data points
##PAGE= N=1
##DATA TABLE= (X++(R..R)), XYDATA
$$ [...]
1845B65p6l03k41L90K69l93j72j9N84l4l23l1M96m3n69l50N71L14j39n48K09M01
1867B58m34k95M18L31j41n48M81L23j81l89j95M93M36n04o46M80L49j03k90j11
1887b68M55K08n67r8K85L62n36r0K73N74l58n85P8O27j37m88O2J75K64k57j86
1908b07K06J57k59m92N87J65J02q59L44N79J01p02r7O24J65k79o77N84J19P4o25
1929c90J99N27j83m34J77M80K8n22l14M06M42j02p20J09Q61m78n28J28N14l7k85
1950a22j24M29J5j15o25N19M90j94p05M03L59j33l08m24Q18J06m01l64N66K05
1970C95l64m71L60M43k39m75J87L72J03n61l36R29J76m43m67K10O43m62m64J07
1990c57M67n1j65m6L80j02n87K3N89K23k82n13J79O40J46n68k87J75N26m28j34
$$ y = [265, 189, -114, -355, 35, 304, -89, -261, -280, 304, 270, -53, -84, 412, 369, -200, -550, 21, 335, 196, -352, -143, 258, -176, -471, -53, 278, 137, -411, 70, 393, 212, -177, -372, 121, 557, 53, -593, -113, 236, 133, -157, -268, 187, 395, -172, -270, 15, 377, -159, -249, 24, 598, 240, -345, -267, 360, 223, -265, -203, -28, 236, -21, -207, -1, 156, -103, -595, -8, 157, 259, -600, -256, 323, 424, -278, -375, 249, 414, 135, -542, 42, 161, 235, -390, -191, 336, 153, -281, -104, 376, 404, -118, -432, -26, 416, 314, -406, -297, 564, 86, -442, -314, 200, 163, -122, -246, 183, 198, 83, -542, -23, 467, 273, -432, -29, 330, 197, -111, -535, 283, 389, -12, -376, 190, 395, 31, -440, -80, 363, 124, -351, -164, 208, 311, -250, -586, 343, 519, 76, -391, -181, 462, 0, -464, -357, 110, 59, -106, -152, 228, 126, -461, -438, 151, 374, 92, -421, -242, 398, 544, -24, -311, -136, 390, -38, -172]
2011a72M57j35l48m1K73L47m09n89P11R1J80m14l36K62L79k49l07L51K56l23k85
2032c01M9L80k9m12L00k9J99l98k6M43K50m07l42M33R7P5l73j58N08l46J12M2
2054F7j78J39k65J19J25L27l71l42L43M75m73l58R9N12l6l07JqJ64q4J02j8M55
2077D88o08j04M82j2%k49m10P22m8j57n20N64j22l32k45P43N1k80m5j3K59k6l11
2100a73p4M09L34p06j38K84L20m09k2P1J62o9j17J55J45j0l64K49k0J90j83l82
2122c48K29L09p2m61K32J14O3q2j42L99p1l21j98M27P2k11j78L19j14J4j10o9
2144a99L74j23j60j43K13L06k67k49J80K56l13j8J1K20j8m24P6M04Mn23OK11M50
2167B74K0k07q3N0M4r3J39k60Q1J19r4N6Q0k35j29K03K95j49j98Q4K63j77j56
$$ y = [-172, 285, 150, -198, -239, 34, 381, -28, -617, 94, 185, 365, -49, -385, -123, 256, 7, -300, 51, 307, -16, -301, -252, 128, 99, -313, -13, -42, 157, -241, -267, 176, 426, 19, -323, 110, 207, 282, -91, -249, 259, -87, 25, 67, -111, 28, -237, -118, 7, 334, -37, -379, -36, 439, -34, -392, -293, 219, 183, -124, -123, -131, 33, -51, 51, 33, 488, -120, -224, 258, 246, 246, -3, -413, 309, 261, 104, -416, 148, 26, -306, -551, 192, 243, -37, -82, -95, 164, 138, -173, -247, 162, 496, -210, -348, -64, 256, -153, -175, -104, 58, -11, -128, 27, 172, 162, -202, 47, 27, 217, 34, -348, -119, 190, 118, -343, -111, 3, 66, -16, -158, 241, 170, -151, -349, 78, 150, -61, -239, 80, -34, -20, -130, -199, 175, 52, -108, -251, -38, 268, 1, -248, -68, 188, -125, -143, -132, 88, 70, -354, -278, 126, 130, -393, -387, -176, 274, 294, 87, 4, 54, 98, 5, 144, -116, -35, 84, -10, 46, 126, -109, -238, -35, 260, 111, -87, -3, 260, 83, -73]
2190g3r4R9J68j40j02J80J44k77j78J20L45l05m4J99J77j42j9j34L9K85j96n0
2212Bk77L16j72j65N50k14J30o98Q27k10M62p84J80L87l4m32K97j15P1j09j29
2233a17L97l04j13L11j65J94k40j95q5L27k0R1m03L31K23j27m04L13n4J0m6J53
2255G7J37k57j68J06J65O5k05n9L66m0p9l48K17J20j5m4j2K58k92J23j0J26l78
2278a47K30j57L63O3m63k4p1L03Q8l85j18K08L3K74k85J14J99l17oK89q2K3l25
2301a93p7L35o9j90j13J25N32m45j7q5K18j69J49Q9j36L2J52l29K58k77J80j55
2323a85J41K3j28J19J18j08K63j16m2j59L25k66r8P3J12M6k13K11j09k72Q6J68
2345a1K84n49J25K4L1L59l16j18K15n0K99l45j52ML72l75N1K97l7J31j05l0J62
$$ y = [-73, -167, -68, 100, -40, -142, 38, 182, -95, -273, -153, 192, -113, -157, 42, 219, 77, 58, -76, -37, 248, 52, 2, -275, 41, -131, -296, 254, 40, 170, -528, 299, 89, 551, -233, -53, 334, 300, -132, 165, 50, 121, 12, -117, 280, -24, -137, 174, 9, 203, -37, -232, -317, 10, -10, 81, -322, 9, 232, 105, -299, 14, -40, -30, -76, 77, 214, -43, -211, -105, 60, 125, -80, -139, 227, 187, 108, -240, -23, 97, 82, 38, 26, 284, -8, 115, 105, 231, -147, 83, -74, 289, 352, -111, -135, -206, 97, 185, -200, -318, -110, -77, 197, -88, 26, 225, -92, -98, 191, 109, 132, -193, -270, 65, -4, -194, -307, -182, 350, -95, -112, -197, 21, -148, 1, 90, -46, -14, 138, -191, 67, -210, -30, -185, -44, -21, -149, -30, 88, -20, 243, 127, 85, -74, 251, -15, -113, -40, 72, 118, -95, 116, 7, -265, -179, -11, 273, -276, -151, -127, -96, 263, -53, -171, 44, -6, 293, -52, -204, -200, 172, -203, -152, 145, 108, 239, 134, 104, 266]
2368B66m49J04J35k27K09M5l07K72Q4p8j35K79k59J03j56O3L30l63J1q4L53j85
2390A1M4k27m8J25L4P8r1L31k93m6L10j67J33m13N63j21O3k87j01K09K0k7K13
2413C13j8k18j72J47J21Kj96J12r4K61k47j73J86O0m7l02L85j79K91O2k25j50
2435h1K43q0j05K8L3l8J23j29N5Q4j22l8LKJ09l85J78M11j37r0j16M3j26j18L65
2460A12k20J13j21l1N7J02j02j88N6M32j18p5p2pL9L16l69J03K35o3j59j00L3
2483b7K39k62o8M08n0j49lk02R2J71j86nJ56K2Ok1k47J36K32k65L50l88K55n9
2507A35j89L56l18J07O8l49K62j60K21K38n22J98j25L3J68j49o6K3NK16j96K73
2529B29j42Q9l4m21K07J51l39K10n6k81L71L16n94M50J68l96P8N3k20J89k32K29
$$ y = [266, -183, -79, 56, -171, 38, 83, -224, 48, 132, 54, -81, 198, -61, 42, -114, -51, 279, -84, -73, -157, 196, 11, 55, -172, -220, -95, -61, 17, -74, 257, -36, -82, 228, 61, 194, -219, 344, 223, 286, -1, -102, 107, 127, 100, 313, 295, 77, -95, 52, 173, 175, -21, 91, -3, 258, 11, -162, 24, 84, 37, -265, 120, -59, 232, 294, 69, -81, 162, 82, -23, 5, 38, 0, 123, -6, 49, 133, 11, -27, -24, -22, 87, -298, -120, 291, 154, 64, -52, -9, -135, -253, 112, -108, 5, -116, -147, -90, 12, -90, -278, -222, 210, 92, 17, -55, -62, -23, 293, -76, 27, 262, 199, 40, -60, -27, 212, -50, -118, 290, 240, 91, 88, -114, -22, 149, -37, -42, 114, 136, 142, 121, -126, 10, 242, -23, 327, -61, 194, 135, -54, 302, -16, 91, 159, -190, 72, -88, 133, 371, -151, 47, -78, -45, 123, -26, -92, -69, -64, 152, -44, 229, 87, 176, 142, -279, -72, 79, -260, -50, -106, -387, -16, 300, -294, 156, 324, -72, 6, 59, -161, 28, -204, 25]
2551B5K1J03j02j78q3J94j83O1r2L76l0Rq6RP8n8j41Q9j6J9j29K15L1k69P2K64
2577A99l94K88j02K7j77J70k34J88j48O2O5L21l99K29J10j65J12o2N4P2l00J73
2599H9m1K72k05m69M53j54J48k43J91j99J02n9J45j07K31j70L8j16L29k93K10
2620A52J66l15K42j53o2R8l67P5P6l7L79k85J79j78K67m07J79j15k1M44n30J5
2642a98J80j27L61j9j34j00j57L27M0l65P3K01Pk0p5k17K00l0J79k09Q2m4J34
2665H9o7k94L03J27k65K29L9j19L5J9j33K68l20K9m8L04j61j14n7n3L32j08j95
2688a60L9J47R7NJ10j25r7k53Q8K55k31J71j54j8J03J01O8k41J85l7j37p4P3K38
2712A53O5k51j74K91o8j23K16k28K01j35J23r8M8r9k27J17J18J8K26k78J21j32
$$ y = [25, 46, 149, 47, -131, -214, -20, -203, -142, -234, 142, 112, 121, 35, 44, 122, 64, -77, 12, -4, 15, -114, 101, 132, -137, -65, 199, -195, 93, -9, 18, -159, 11, -223, -35, -183, -121, -56, 265, -134, 95, 205, 40, 152, 90, 144, 216, -84, 89, 48, 320, 115, -354, 99, -55, 93, -150, 41, -158, -56, -115, 30, -77, 154, -16, 22, -94, 235, -58, 152, 318, 3, 245, 92, 30, 128, -239, -164, -88, -125, 254, -31, 148, -30, 237, -170, 9, -106, -127, 317, -213, -198, -18, -145, 216, 197, 63, -37, -194, 133, 173, -192, -119, 82, 89, 69, -6, -223, -23, -53, 126, -83, -1, -45, 89, 22, -272, 31, 158, -107, 122, 161, 42, 77, 96, -37, 231, -89, -60, -108, 196, 35, -79, -136, -189, 143, 35, -160, -121, 26, 123, 128, 238, 113, 16, -237, -149, 106, -125, 46, -108, -126, -23, 78, 146, -95, 90, 53, -84, -158, -85, 153, 218, -33, -207, 84, 16, -107, 109, -119, 82, -53, 70, -28, 20, -79, -306, -189, -71, -53, 173, -105, 16, -116]
2734a16Q2j2k43L95Kj79P6P8k41K8K63j40J61lk19j6OJ95k79O3K82j02K1J16j44
2759G4k98L64j78K6k41J1K80k21J79O4j01m6K27n3j56N1n9L20k50J2j48K51j4
2782I4j17j04K30R2l95J76J98k81K63j23l78L62j52L52l61K32m51M89p8j72J97
2803G3q3J4J21K1m4l39J73J19l0R6j19j40J79l5R4k10N9%K2j05P5q8J93j83J13
2828b4J76k2r3N4k13mJ08PJ72k54j50J92l56L60J28p8J51m14K56k12J26L70j20
2851A60l69K37j36K45n7j08N0J03l63K92J39l40R0L2m3K94o0j16kl53L23k13j14
2874c09L24j41J17k27L58jk4K9j08L8l30M66l26J16J87l30K30j4q1K68j53m18
2896c29M20j78J85l7j49J05j9J12k73J29K48l07J00L3j60Q4J40j19l06J96l8J78
$$ y = [-116, -34, -46, -289, 106, 108, -71, 5, 83, -158, -130, 133, -7, 154, 151, -68, -84, -78, 117, -162, -99, 183, 81, 102, 218, 74, -224, 140, -38, -12, -253, -242, 38, -183, -4, 60, -41, -87, 140, 87, -69, -18, -77, 243, -7, 5, -143, 108, 94, -23, -127, 103, 195, -200, -24, 174, -107, 156, 33, -345, 17, -135, 217, -144, 88, -363, 126, 48, -124, 73, -10, 4, 125, 146, 102, -237, -64, 55, 25, 121, 2, -138, 41, 6, 100, -110, -51, -51, -29, -134, -59, -147, 46, -137, -24, 152, 130, 37, 91, -122, -126, -18, -11, 161, -93, -243, -51, -407, -47, 81, 3, 154, -260, -4, -216, -90, 280, 160, -209, 28, -108, 137, 80, -28, 22, 125, -238, 54, 193, -147, -57, -25, -68, 226, 166, 50, 48, -305, 18, -195, -309, 15, -126, -9, -236, 122, 121, 97, 126, 18, 56, -274, 192, -134, -18, 169, -161, 69, 55, -26, 242, 89, -329, 91, -87, 98, 61, -88, 17, -2, 110, -163, -34, 214, -93, 7, 40, -120, -36, 104, -15, -321, -125, -163, 15]
2918A5L2J36j30J9l61M33N4j67m2r1J80K2j32j87L49k80J3L73m32N17j42n06K28
2941i9q5k0O0J93R9j13MK53l38K22k52K13j99N9p7m3J23J8j64K45l21L22O2l70
2965b08J4K90l3j1J48l63J17J26j65R5j50l3M01l53J18j7L3K6k4j14L22l65K52
2988A06l25J53K28k86K56l79K59q6K62j96J48p2l69M77n23M14Q0m1j73Q8P6p8
3010A9m7J09k1oK24q8k14o3P3J40l35J5J07J05L20k16r1J01M7L7k38J09l1j05
3034d9O6o8J09o4J22k4O2j17K11o4p4n5l03K89K22m58L21k84k23L02J05k0l0K28
3058B04j98j20J95J8lp0J39k49K6K08n06L69n7N5m1N2l4J92Mm00N02l85pJ27p8
3083e7K09k48j06J6K94j93J67k0p7j10J56j31K55k21m8M30n40L34m61M63J27m09
$$ y = [15, 47, 183, 53, 72, -289, 144, 198, 31, -11, -102, 78, 100, -32, -219, 130, -150, -137, 236, -196, 321, 179, -327, -99, -184, -204, -144, 49, 148, 35, 39, 292, -46, 176, -76, 137, -62, -3, -80, -123, 0, 18, -146, 99, -222, 100, 162, -208, -194, 96, 63, 52, 200, -163, -46, 80, -85, 10, -140, -173, 228, -125, -7, -24, 9, 35, 11, -103, 219, -146, 106, -219, -66, 162, -124, 132, -247, 12, -74, 188, -8, 140, 68, -301, 176, -347, 67, 147, 106, -67, 21, 97, 19, -28, 81, 60, 54, 278, 190, -24, -87, -14, 126, -209, -194, -87, 18, 338, 122, 31, 132, 179, 216, -22, 87, 56, -49, 17, -51, 58, -6, 116, 92, 154, 37, 248, 184, 110, 55, -248, 41, 263, -195, 126, -158, -381, -79, 26, 6, -24, 204, 6, -114, 81, 99, 96, 26, 165, -84, -58, 150, -356, 13, -44, 11, -30, 22, -12, 180, 184, -216, 286, -99, -106, 21, -57, 152, -96, -202, -186, 108, -85, 82, 62, -15, -125, 31, -100, 155, -66, -114, 316, -224, 110, -351, 112, 239, -170]
3105a70J37k3J86k56J90rk20J87o9Q1k3j63j11K42K32k15N2J12l64k1M14k41j89
3128b41R6J52j06J14N4K2k71J18p6n5J87J26J23k21q7j43K56mJ78K5j92J78k27
3151Fo5J36o3Rk77L93j80J01j58J46J31k74m2k4K04Q2k39K23j76L37m84LK01L2
3175B2j1K02m4k52l52M69J09j73o7R3k9r5K30%j31K37k3k84K48l49N1J25m2j67
3199b33l0J70j39m3J97L13j94R6k45m4j21K59k0K33M8m63P5l7J93J06n6K5j79
3222h9K40q1m5J46k11J51l62K64k3K0J32j39pm6n2j1J82j7p3j88J42O2L32n77
3246b50%J30j23L63r0n4j15J59m2P7p7o2J14p3l9j35J19M2Q3J18r4n9J11n2L23
3271C74m15J00k9J25j59j77K52k53L55l93J59j08M5J44j23J42j9k33k3Q8K09l4
$$ y = [-170, -33, -56, 130, -126, 64, 55, -165, 22, -47, 34, 11, -152, -263, -21, 211, -4, 48, 160, -204, -225, 189, -52, -241, -145, 7, -99, 15, 69, 91, -180, -62, -138, -193, -6, 120, 243, 22, -65, -208, 48, 44, 222, 247, 55, 233, 6, -59, 77, 14, 23, -254, 139, -41, 60, -98, 48, 179, -95, -137, -161, 43, 125, -114, 109, -67, 270, -214, -211, -10, 22, 11, 213, 169, -83, -435, 34, 143, -30, -97, -4, -33, -128, 102, 102, -29, 208, 185, -99, 149, -200, -149, -24, -66, -233, -263, -93, -232, -275, -78, 235, 41, 137, -108, -152, -273, -14, -34, 199, 247, -216, -141, -178, 15, 121, 65, 90, -89, 151, 70, 25, 171, -40, 111, -251, 13, -10, 10, 142, 3, -4, -50, -102, -113, 69, 52, -21, -209, -67, -5, 327, -250, -250, -120, -243, 120, 30, -24, -139, 20, -22, 55, -22, -84, 30, -43, -82, -217, -98, -56, 27, 145, 51, -8, 103, 51, 374, -41, 59, 30, 155, -4, -181, 71, -182, 173, -220, -61, -169, -124, 20, -103, 39, 20, -213, -236, -148, 61, 27]
3293B7j47nK9J87p3O3k2Q1j44j2L8l09L21k08J83r2k95L68M9O2j94J57R8l5l16
3318a89K07N1p7M52n25K9J95k37K76l08J05K39j64q6J03J36km00P8j9J98k14k3
3341a75K75o6J27j69lJ33m6k02N14m55q9r6K00P5L7q6Q3P2j36n9L1K47q2k78J17
3366c1L8k05P6K19k82K49K5n1k55L55j33J46j98Pj8J78Q5k13o6P8J1m8j7J59O4
3391A73k62p2J93M4l77L45K5j35L81k95K3m9K14k08M3P7l1J90m60P7N9R9P9j37
3415dk19J68J29j88j87M33j38L0j69K56r1K2j11J8P5j90K97q0j46j3J23Ro3k13
3439b52J24Q8K0q3J49J16l6K93l68j98L56l14R5p6L3K18j79j39j39L48p7P4p4
3462b1J44l07K91J64l72L04j92J77k54L6j06J61j99J18l3J54j51N4j20Q7J96k23
$$ y = [27, -120, -125, -96, 91, 18, 81, 59, 140, -4, -16, 22, -287, 34, -174, 9, -83, -378, -10, 39, 101, -93, 64, 162, 127, -189, 18, 69, -8, 444, -81, -52, 143, -94, 182, -126, -21, 218, 54, -32, 71, 207, 205, -195, -117, -136, 62, -152, -175, 100, 34, 161, -8, -11, 122, 76, -126, 388, -67, -156, -252, -52, 23, 60, -26, 57, 129, -7, -66, -35, 212, 130, -148, -31, 7, -198, -122, 97, -185, 64, 89, 38, -217, 138, 5, 151, -47, -40, -58, 120, 205, -8, -74, 4, 15, -33, -50, 109, 173, -89, -161, 32, 76, -301, 44, 69, -66, 315, 20, 43, -6, 208, 0, 43, 120, 89, 279, -181, -104, -45, 54, 133, -4, -223, -55, 74, -114, -301, 132, -6, 24, -145, 111, 20, 42, -69, -51, 24, -166, 131, 51, -95, -108, 15, 24, -39, -252, -128, -40, -20, -103, 46, 162, 126, 419, 51, -147, 209, -105, -10, -86, -53, 165, -14, -153, -292, 56, -21, 53, -21, 123, -184, 107, 271, -101, 203, 11, 188, -66, -30, -136, 25, -174, -56, -89, 65, -86, -32, -152, -65, 131, -92]
3484i2J13J48p6j6m5j16J52j43J7k5J38L1l5k68J40K20j98P4j3Q0r6K43j82j38
3508h7K3n6L93j32k30M18j76j84J56l06J99l51K56K78k22K05l91J25J26J92k33
3529CJ57k35K5J1r0O7n4J9j13J23J89L1N5r4o7J12k44L64j88q8l79O74l43j15
3553a80L22n6j91J14K30k22j63k9K67p6J08l27l4L83k74Q3L3j49J61j0M7q6J5
3576c4K35L6l8j78J94l84J66pj46K28J8j1j99K66q8j83M35n14K76m66L57l07L14
3599c0R2j21K85j51R0l42K75M5O3k61q0J23k21K10K56j07k00J15J70l02L9J34
3621H2k88J80J46k52J6O6j37M5m6J22K49j50j80J9J7K24J20p9k44J3k7L4l4J43
3645C9K7k31K82m96K05l0Q9O4K25l20J97J14%k31J08k5j65R7K19l5k27R5o0q1
$$ y = [-92, 21, 169, 93, 77, 32, -84, 68, -75, -58, -83, 55, 86, 51, -217, -77, 143, -55, 19, 6, 86, -10, 233, 51, -87, -64, -120, 273, 141, -89, 329, 153, -31, 125, -181, 18, -333, -77, 201, -21, 184, -207, -82, 44, 236, 3, 160, -75, -50, -39, -129, -62, -116, -97, -210, -87, 102, 133, 188, 94, 27, 139, -105, 259, 71, -17, -396, 278, -65, -180, 142, 86, -105, 9, 239, 17, -146, -175, 92, 16, 124, -203, -237, 146, -128, -45, -12, -161, 0, -10, 37, -49, -34, 201, 237, 199, 21, 215, -169, -3, -10, -156, 72, 90, 79, -120, 146, 58, -125, 310, -204, 72, -394, -37, -344, -30, 62, -59, 226, 75, 165, -177, 98, 143, 206, -55, -135, -12, -233, -23, 233, 126, -74, 41, 211, -91, -52, 82, -206, -26, 120, -132, -116, -50, -187, -142, -188, -66, 183, 33, -147, -128, -111, 113, 233, 154, -90, -77, -104, -70, -104, 39, 66, -165, 117, -379, -174, -204, -115, -51, 174, -146, 51, 165, 165, -66, 42, 17, -148, -51, 168, 133, -94, 1, -59, -140]
3669a40j3J84j62J03k0J19k56L47q1K51k54k49K25k80L25j26K96j64o6m2K10j44
3691F3m6j75L93k01l47J44J08K85q9q6p8k83M84j83K17k20j0j19J0K47m24J86
3713a24J7K35j45lQo5K65k97L74o7k46K42j05J39j32nj11J29p0K22p8j43l24L32
3737D8j94MP0Q4N0j02l2j17J43j91M12j47Q9l51P9R6J42l15r2L72k48K98m51L26
3761b7K8M7k28L0K76k10K17k86L86J8l14j72M68k88K71l12j20M05l74J73OO7j51
3784i0k4J15l3PJ68j31N3o3j23L65j82q0o1J59k51J08n1J26J10o9k18J87J97l35
3808a16K28j42q6K65l13J65Kl63M10r9k2J11Q7j37M7J43k46m0K37k00l6M9q2J75
3832C7Q7N3k71J15r5R6j36J60J95l70K18n6O3o2j77K81k11J17m21K00K07Q8l10
$$ y = [-140, -153, 31, -131, -28, -48, 71, -185, 162, 81, 332, 78, -171, 54, -226, 99, -27, 269, 105, 39, -3, 207, 63, 17, -158, 235, 34, -313, -169, -61, 224, 135, 49, -29, -312, 172, -11, 206, -14, -24, -143, -133, 114, -310, -124, -107, 128, -17, -20, -12, -77, 188, -109, 265, 198, -48, 194, 89, 228, 96, 91, -20, 109, 39, 261, 183, 40, -284, 48, -146, -142, -72, 12, 62, -40, -72, -189, -46, -237, 175, 28, 117, -234, -155, -59, 83, -232, -324, 48, -200, 98, -353, -27, 1, 48, -180, -150, 126, -84, 133, -153, 233, 251, -63, -235, 233, -55, 216, -96, -216, 189, -185, -12, -6, 61, -90, -114, 1, -32, -25, 143, 12, 65, 2, -121, 244, 62, -18, -79, 80, -171, -63, -114, 12, 122, 53, -165, 22, 219, -116, 112, -30, -116, 149, -164, 1, 3, -360, 50, -49, -71, 40, 127, -10, 37, 180, -66, -106, 131, -69, -105, -56, -138, 37, 124, 177, -94, 21, -74, 22, -114, 46, 241, -129, 89, 33, 96, 34, -143, 138, -73, 44, -377, -177, 30, 118, -192]
3855a92J62J07k62R0l8L74k39PJ9R8j61k12M69k79%l33L95j67MN28l17pq6M24
3879C84n87L0L24l55J53J85j92j13K21j02J00j39R3j26M6J23k8J60k41Q1Q0M2
3901A39o1o4J51j92R8l3n4K6j5J90m62K67rP5j48J10p8m4k6K32L6k06L6m2p1L41
3927A96l35o0n7L79Q6l13R0J68k88PL83l41m0K83m7q5L8J6l78K32J41n9P1j77
3951i0N8Q8j57N8j04J86J0r9mo1L3Qo2M00l99M3K2L39l54K94J36l98L01l68j92
3976c12K36J3k5j35K67l31L16k5J17n8k78K71j12R1j20J01PJ21n4j63kO6k71J99
4000h1lj11L22P1p1j05k3J75j33r8K36j25k86L01J21kj77k17N9K56k70M9J58k05
4024a59L19N0j71k02j3J24l0L01n70L46j97K36j20J87P2k93K15l02J61jJ14l14
$$ y = [-192, -30, 77, -185, -95, -133, 241, 2, 9, 28, 126, -35, -247, 222, -57, -57, -390, 5, -162, -158, 370, 53, 46, -40, 384, -203, -173, 151, -204, -51, 134, -58, -171, 50, -52, 48, -91, 2, -124, -78, 45, 17, 177, -64, 17, 97, 139, 78, 14, 165, -27, 71, 38, -16, 10, -5, 185, -277, -10, -19, 56, -92, 18, -60, -104, -130, 102, 138, -68, -32, -74, -145, 196, -139, -199, -256, 123, 209, -104, -14, 154, -134, -127, 256, -85, -125, 158, 111, 26, 64, 80, -298, -66, 75, 16, 87, -90, -32, 56, -101, -43, -147, 39, 49, -50, -54, -115, -82, -74, -136, 264, -135, -92, -70, 269, -85, 209, 345, -53, 248, -120, -312, -76, -63, -88, -223, 44, -287, 29, 4, 121, 63, -215, 56, -56, 35, -85, 16, 23, 144, 90, -73, -75, -9, -280, -81, -84, -195, 127, 198, 127, 22, -1, 174, 41, -57, 179, 54, -232, 69, 190, 188, 11, -206, -147, 109, -161, -112, 46, -159, 160, 210, 39, -163, -176, -52, -82, 219, -351, -5, -202, 34, -86, 101, 173, -120, 95, -207, -46, -47, 67, -247]
4046b47J10J39J26m16L22K2J57j90r2J42k02J33r8J3L86k56M0Km7j07j00J78o
4069Ij03J25n3j45L98l75J82m0O9J82r1q7j46M52m78Q5k6q5L46j70J41j26M5j07
4093Bk32J66k39J47J36J93kj85m8k4L34k52p9K88k48R7N6k05L1K59k60N6n8J89
4117A22j28r9O8m4J58l46J57J89n3p4J37j55J38j48J97j4j10J37l59L02k47m9
4139b21O4J60r3N2J87k86M4K5j06J32o8O0J95J24j45p2k79K43K5j29j02K33j32
4162h9q2J32O7J5L36n37k3N01m26N8J76k10j03K16J17k41j9J02K8pJ45j33l7N1
4186C7j35J35q9j76n7J04M04m3k33J5J29R8k70r0Q9J04qK00nm8k59K8J20n3j40
4211a43K33j62k3p5J79n3j08K52q4q0J17o7OJ5J10j39L56o09J24J21J23j26J31
$$ y = [-247, -137, 2, 128, -288, 34, 56, 213, 23, -69, 73, -129, 4, -94, -81, 305, 49, 89, 91, 44, -63, -163, 15, 9, -94, 31, -22, -167, 231, -144, 38, -2, 67, 249, 158, 71, -75, 377, -101, -16, -42, -127, 219, 49, 190, 64, 109, 2, -230, -64, -303, -156, -20, 173, 171, -14, -62, -86, 248, -4, -83, 205, -43, 54, 110, -95, -64, 195, -65, -9, -67, 122, -6, -105, -37, -81, 77, -269, -112, 77, 24, -50, 87, -68, 70, -78, 119, 105, -5, 132, -227, 75, -172, -221, -157, 3, -90, -38, 149, -137, -93, -68, -174, -42, -110, -50, 145, 269, 124, 52, -227, 16, 41, -88, -190, 43, -89, -171, -39, 28, 43, 379, -158, -181, 320, -106, -48, 128, -82, -185, 31, 148, -93, -112, -10, 18, 11, 156, 23, -14, 37, -98, 37, -52, -228, -285, -181, 223, 180, -53, -38, 91, 189, -81, -171, -82, 22, 14, 214, 209, 161, -98, -70, 50, -3, -143, 90, -72, -95, -170, 9, -44, -152, 100, 16, -64, 53, -14, -8, 7, 117, -22, 334, -275, -151, -30, 93, -33, 98]
4234I8j10J40m69O3L69k71M50m68J63R8l80K61j16M6K68k29n4n6P9K86k63L10
4256B15J7k3n8k26J11PJ33m03L8L13o4k00L55l85K13j14L02m46J81J55j44P4O4
4279A15k64L40j56j42M0qQ4j84L18j48K6l78K68M9j49J47M2J54m06J55j9J53M6
4302H3j43J57k39J09M9k59O0K64O9j95J72m8r4q5P2j93J48n8J84j00O0K5m5O7
4326F0j43J87L5j1k49L75m29J37K19l47O2N3J21K5l89K47J10J75k25q5K5k53J62
4349a38QJ90k19J64n6J8J39Q2k71j69k57N26j5j56N3R8k08L51O4m2l32n9N45k15
4373A01N3m65M01j25K2R4l4k4m5q6K66n2J2k32q2N77k86m0o2J0m9J28p8j02j48
4398b46K20J66j71K3K0k41M00j32j69k0L11o6j58k9J86Pk14j08N6J27k09K90j1
$$ y = [98, -12, 128, -341, -278, 91, -180, 270, -198, -35, 63, -317, -56, -172, -126, 142, -87, -141, -197, -118, 168, -95, 215, 232, 209, 151, -75, 36, 43, 176, -227, -189, 124, 60, -140, 215, -170, 43, -71, 231, -215, -34, 121, -23, 51, 115, -149, 191, 35, -107, -67, -75, 9, -175, 143, -5, 21, -357, -89, -40, -189, -42, 0, 154, -252, -97, -116, 37, 83, -60, 97, -142, -33, 16, -243, -183, 81, 150, -45, 127, 79, -15, -100, -28, -221, -73, -131, 53, -47, 13, 38, -7, 60, -83, 104, 139, 128, -121, 254, -175, -38, 181, -166, -104, -51, 70, 95, -294, -47, 63, 238, 13, -72, -47, -300, -138, -130, 60, -159, 5, -51, -33, 106, 188, -83, -252, -509, 17, 2, -154, -101, -3, -211, 140, 204, 162, -170, -229, 316, 101, 154, -311, 90, -35, -13, 81, 47, 23, -22, -108, 158, 106, 118, -114, -196, 381, 95, 55, -7, 3, -46, 82, 4, -98, -246, -26, 140, -31, -8, 12, -229, 171, 39, -130, -150, 161, 95, -63, -92, 94, 101, -113, -221, -165, -38, -247, 43, 32]
4421C2k4l9j4m9K22k54JJ00J41k17j57K01J39l08N70j57k62J69m7N3k43L22l47
4444a68K13N7l92L97J27l04N6J33p7o0J80m17R1J82K1J24J74l72J78j20K2K02
4466B47k20k54M70m91K19n4k3K87k40N2j49J59j93K43Ql03K44k20J43j14L79k87
4488i7L53j77o7K89k85kj76J07J08N0K2nO0j86l9K05k21R6k35K89j30K5oj00J89
4513F7j23K14K30j37l14J11l62M04n2jk54J90O2OJ22J8j7l39J56j82j12K92K96
4536B75l53n0r4K28J61k55J17o4o2m43P35k62j24L43J05j70m9k20K44k03J00L6
4558eK16k92j43K66N3j48P1Q0j73j96r2L95Po9J5l1k17K15j33L23k18j2j08K67
4582G1J35j97k44L70j29n2j5J93J17m54K38R5j36j33K28j23pK4j87L69k44K81
$$ y = [32, 8, -31, -45, -94, 128, -126, -125, -25, 116, -101, -258, -57, 82, -226, 344, 187, -75, 94, 47, 100, -143, 179, -168, 45, 102, -290, 107, 234, -70, -14, 119, 42, -18, 162, -255, -164, 18, 39, 163, 337, -35, 143, 23, 45, 247, 27, -227, 243, -248, -29, -83, -106, 181, -59, -7, -156, 3, -190, 53, 61, -242, 2, -218, -75, -189, 190, -97, 256, 79, 12, 301, 16, 14, -162, -55, 53, 103, 125, 120, 180, -6, -45, 160, -61, 35, -200, 89, -41, -16, -22, -122, 67, -56, 158, 388, 251, -63, 48, -314, 90, 38, 37, -217, -27, 35, 41, 163, 181, 164, -175, -19, -201, -313, -21, 275, -78, -128, -222, 6, 167, -88, 29, -35, -97, -540, 195, -67, -191, 152, 257, 87, 38, -182, 62, -141, -41, -5, 211, -81, -224, 42, 95, -53, 18, 98, -75, -271, -363, 32, 39, -30, -15, -46, -263, -48, -181, 142, -76, -88, -196, 71, 206, 9, -235, 135, 6, -46, -61, 132, 249, -205, 33, 128, -8, -141, 87, -36, -43, -19, -206, 163, -81, 200]
4604B00j86Q8M5j28M4j71K73k31j9J60j61L59m83P8J30l32N00k22Kj27L63k02
4626b0q6p1L69r3l06L77p6K1l91K05J74k5R8l32J95l34K10L8j47J72k57L17j83
4649a45M4k6J5J00k2q8J70j43J60J0k4pj4k29K20K33j75j01K1K61j96r5nj48K60
4674G6PM1J60nl28J3P%K13j12j18o0R5n0R9l0J40l05K03N1k00J22L5q0R2ln8K69
4702B74j59L0j55j07K43j73J18j63J1J08q4o5J69Om4o6P6j02J58O4j74K06l48
4725a77P8N8J98k02l1J86j50j63R3k2K62O6j75L2O8r5N5K09m41K57J23m0n5j09
4749B5kM9j9k6qm7R5n11N74l08L11j85J37k63K98l04K59p7j5K15j61R0k55J48
4773B0K93l69k44K7K57m8L1J43l05R4q5J37J21J6k49J98k66L86p8k03J19J1n7
$$ y = [200, 14, 102, 147, 19, 63, -108, 165, -66, -85, 75, -86, 273, -210, -132, -2, -334, 166, -56, -54, -181, 182, -20, -106, -177, 192, 99, -207, 170, 94, 115, -276, -71, 103, 78, 176, -156, 39, -295, -85, -47, -194, -22, -279, 38, -145, -101, -127, -112, -12, -34, -122, 48, -95, 65, 75, 51, 44, 30, -199, 21, 254, 79, -22, -1, 260, 64, -31, -36, -184, 76, 83, 124, 284, 279, -49, -36, -29, -29, 184, 72, -46, -106, -11, -61, 38, 8, 148, -157, 46, 97, -103, 19, 54, -26, 66, 63, 5, 274, 115, 145, -10, -117, 126, -47, 71, -92, -81, 27, -57, -122, 47, 53, 9, -57, 19, -83, 75, 139, -35, 171, -177, -99, -41, 157, -45, -76, 110, -40, -203, -110, -132, 130, 196, 21, 53, 121, 26, 81, 290, -151, 106, 229, 189, 134, 25, 23, 72, 53, 27, 19, -28, 67, -444, 130, -178, 133, -52, 85, -178, 120, -184, 75, -2, -17, 198, 37, 127, -128, 20, 313, -56, -300, -273, -16, -64, -33, 110, -195, -101, -186, -49, 72, 88, -161, 37, -229, 157, 79, -124, -5, 6, -51]
4796e1O2r3J92j82m1K59Jn4k44L78l48l9L01q9R3J09j85j73J47j46O1K04j9j19
4820B4N2m07L46M3j92J4Q2K66j25o5k59K38l23K53K00j05j76J73L8k74J81M1K08
4843B33k57j9k88J76J74jJ06J77k77N8j78K31k23J10kJ33j50j40K95r8o3p6O4
4866a5j9j24j5L59q7k06J01j11J59J68k48Lj1J33j06L19j30k98r0J60L1j6j23
4889a66l5M98k23JQ3k95J41k12J86K0j63K01R6k64N2j73M21j72L92m67L8N10n16
4912d7l1L64j23l76K83k02P8N9j42j40K51l5j25n1J39L53m28J86K6J42j8K6j10
4935G9j38j95M55j66j75M35k24j35L9j37l9K55m9L4Mk03j18L39J23j76%k9r5K76
4959A60n5j09j70J50K04j15K00k39J07j82J48k4R1l13j9J53M1J00j07o0J16p6
$$ y = [-51, 11, -82, 110, -72, -113, 146, 147, 93, -151, 227, -121, -160, 141, 52, 145, 254, 69, -104, 43, -103, -42, 162, 143, 24, 76, -331, 15, 58, -134, -120, -38, 228, 103, 38, -221, 17, -306, -53, 147, 42, -134, 39, 77, -197, -16, 25, 233, -24, -43, -331, -155, 19, 18, 124, 301, 24, 82, -96, 135, -88, 22, 20, 153, 3, -137, 158, 60, -3, -79, -15, -34, -158, -173, 186, 99, -107, -6, -117, 42, 210, -38, -35, -46, 87, -19, 300, 170, -128, -218, -58, -27, -43, -166, -201, 297, 74, 75, 158, -137, 4, -208, -22, -2, -165, 36, 132, -132, -80, -253, 168, -4, 388, -79, -41, 469, -47, -78, 286, 163, -213, 70, -132, -54, 5, -137, -277, -26, -61, -186, -237, -98, 255, -173, 13, 39, 181, 163, 189, 79, -59, -254, 201, 35, -140, 295, 71, -64, -25, -162, -201, 54, 5, 39, 43, -160, -278, 61, 184, 8, 8, -21, -116, 160, 105, -4, -174, -24, 180, 65, 265, 26, 133, -49, 99, 75, 166, -147, -166, -13, 28, 128, 21, -39, 77, 1]
4981AO4L3j99k07J03L70l19J77l58J47K19l7r0j01J6J44L2J84pm5r6K84l92R2
5005A5oj91K74O8j03K0k79K63oK20j58k79J74J29n4p2M6m3M8P3j40J3j03K2K76
5030B07k52RO0j19J48q1j79mLM06j45j16k10N53k70L5j89J65k4N5K6j50j5L01
5054B14m31N5J07N1J38j38k51L1K14J25k97N07j97l18K29L51k70m35J84K19j99
5075a11k32L00j21M5M1K18j30p0N7n0n0J01j9J91J16l54Q3J18l30L62k14P4P9
5098A04m32L92o6q3K51m44K16Rp6K68j76m7J14Q8R2l37J49J34q6j11l7J59R8k75
5122i6J18k1p6R8J1LM9M1j48j28P7j86J75K71J43m52M44l70j84L15j09J96k64
5145i3J23jJ39j89m2KJ52l2k10J57j24J5rJ19o0n4J6K27n2K16k46N9q7N7R2l40
$$ y = [1, 65, 98, -101, -308, -205, 165, -154, 23, -335, -188, 31, -6, -96, -197, -181, -37, -5, 179, 172, 127, 31, 315, -77, 15, 9, -182, 92, 160, 57, 77, -202, 61, 55, 275, 117, -162, 12, 141, 87, 15, 61, 18, 66, 139, -1, 12, -91, -69, 207, -45, -36, 24, -95, 53, -28, -207, -211, -208, 198, 53, -63, -273, 280, 10, 45, -144, 21, -3, 52, 78, -72, -87, 214, -217, -162, -55, -4, 134, -4, -255, -224, -10, 115, -182, 325, 128, -190, 39, 390, 120, -315, -131, 88, -111, -343, -43, -164, -119, -78, 140, 10, -60, -3, -53, -103, -2, -21, 170, 286, -68, 15, 133, -197, 165, -49, 25, 104, -328, 64, -2, -85, 166, -278, -62, -53, -129, 139, -37, -84, 30, 118, 210, -127, 22, 156, 70, -41, -78, 81, 179, -96, 22, 1, -75, 23, 34, 37, 86, 127, -21, -149, -72, -258, -83, 188, 331, -121, 323, -47, -231, 84, -25, 171, -93, 30, 29, 168, -21, -63, -61, 91, 59, -151, 6, -118, -103, -112, 7, -53, -107, -91, 136, 84, 300, 54, 113, 26, 83, 175, -165]
5171a65K6J14O2j82K16J46k35R2J05k30Mj86P2J67j2j15R0L65k50N4P5n26J92
5194a21K7K30l9j30n0j06j13J13Q7J88J67k79j37P5J06q9k16K73N2l0k59P0K37
5217E6k37J99j93K07j41J10K5j07J47o4p7q2L8K73k09J33k13j1oJ14J87j03k36
5240a90K89r7J24k45J62k52K19J50J21k27j03Q6J2Q0m43L17K03k55m2K1J58r9
5262a1K49k64n7J37l64L25rJ26l16L20k19m9J21j09O5N1o3%p8O6J64k88K93l4
5286E6r9J06l08J87l8J7K08p3j06J00J75j12j99K05k87J99l0r2pK33p5j86J29
5309CJ87j46J7j59m2K05j21j3q8k12K49j29k3M76l03K7J79m70J41R1N9J3P9j50
5333a30K4J19j82Q1J73o3j65J41o8j42J86K37m14K96j40J48q5J00m96K90L14k38
$$ y = [-165, -139, -25, 37, -145, 71, 217, -18, 74, 179, -51, -47, -233, -161, 6, -6, -121, -31, 334, 84, 138, 213, -313, -121, -94, 136, 97, -33, -83, -189, -302, -189, -102, 86, 253, -26, -163, -88, 18, -71, -287, -14, 38, 8, -251, -181, 56, -181, 18, -175, 32, -109, 1, 26, -81, 66, 2, -75, -157, -119, 154, -55, 78, -135, -146, -152, -38, 149, 46, -190, 99, 2, 126, -119, 43, -209, 10, 160, 281, 54, -49, 37, 49, 129, -314, 3, 206, -49, -91, -70, 88, -11, 238, -26, -83, 54, -310, 15, 6, 132, -184, 136, -83, -132, -11, -120, -55, -4, -67, -67, -145, -79, 85, -203, 90, 56, -43, 63, -245, -58, -96, -79, 129, 56, -50, 50, 225, 113, -86, 119, -168, 31, 1, -91, -98, 135, 60, -126, 3, 190, 44, 61, -98, -140, 65, -56, -69, -157, -369, -120, -249, -272, 204, -99, -72, 107, -363, -222, -131, -72, -59, 20, -130, -106, 13, -169, -88, 85, 22, -143, -2, -70, -212, -26, 211, -203, 93, -47, 101, 16, 116, -380, -90, 224, -14]
5355a4L7J98k13j35J47o9J42J3k31K26J9k35K07P2q1k0m63L11K28j17R0k1j03
5378a2K71m97J22J72M8k87J63K89j11J5j23o4o8P2J61j50l3j02J92q2rlj78K03
5402a1j63%K67k9k32J02j64K53oK70n45l1L29K4J66l64M7J61J14m84J76L3O2J64
5426A39j61k81K02oP2Q1K95m70J75P8j25k4p8j40K83p9OL07r3l29R9K14j25k06
5450a66J36L0K07j43k03J75r7J32j94K60K0k16N0K41l11K0k0K23m12M87j86k18
5472a85J45L0k4j74L30k24J90k12L41k12j31L01j97P3n9o4r8L16k88K33l08K44
5494B7q4P8o7Q5k6J24j65J37m1K53k43k69Q9L73j28n7j34Q7l19K60K04l37J66
5517A3l9j48M8J24k40M40j02j70J10N0j19l95M87J87oj79k83R8O8M6Pj05Q0J53
$$ y = [-14, 23, 221, 8, -127, 20, -49, 93, 106, -125, 101, 120, -115, 92, 164, 83, 63, -400, -89, 139, 22, 112, 91, -12, 259, -238, -116, 56, 104, -183, -20, 269, 158, 173, 50, -14, -82, -10, 151, 1, -32, -134, 58, -24, -33, -36, -214, -11, -174, -174, 93, 64, -168, -66, -230, 23, 17, 287, -258, -289, 40, 64, 230, -134, -87, 74, 188, -296, -120, -87, -25, 139, -22, -303, -101, -107, -35, 46, 341, -129, 46, 124, -1, -25, -103, -243, 40, -39, -33, 274, 181, -148, -49, 165, 40, -166, -30, 0, 207, 64, -139, 36, -61, 71, -123, 137, 157, -59, -9, 232, -79, -59, -79, 144, -268, 219, 33, -185, -40, -10, -34, -208, 122, -102, 88, -124, 217, 5, -126, 175, -22, 51, -8, -72, -170, 146, -142, 91, -217, 27, -57, 21, -46, 39, 13, 137, -28, 109, 68, 321, 78, -191, -102, 271, 143, 86, -48, 39, -280, -20, 184, -153, 13, -26, -174, -126, -2, -242, 198, 96, -74, 36, 86, -33, -428, 59, 246, 240, 61, -222, -124, -56, -10, -3, -108, -28, 125]
5541A25k14J36p5P5j71K3J49o8k15K84j3k34J76nR8O3j18O5j34K55p5k15J26j07
5565f9p1J98J20k18P9l14M13k37OJ43J55j82k18L51k37M87l54N1M1j54j32M51
5587C09j14l46R6p5K00m3j39j43K38n2j1J60j74J74l4k68M94m69jL3K91o7Q9l71
5611b23J37K21O7K4l41K31o9j40K62k99K53l93L37j40j24J39n1L12j69l59L84
5632E9k66J65K85k5l4k64q4L49l64j03K50L28k51j56J16l16J80K21j0j30J4j63
5654a99Q5K92l92M5kK13J01k8l3k4%k69L75j49L8j9j20J15j10P6J24l9k5k3J47
5679A79J5j72j09R3N9j55J73M2p8m35J76J08P8o5K14j87N9K4O5J86n36K70k7J1
5703a2J62k42K02j9m8j75J30l1n4K15j56l50K30Jq3L86k70J78j79J81j9L9Pj21
$$ y = [125, -89, 47, -28, 47, -124, -101, 48, -20, -235, 49, 36, -198, -22, -27, 71, 134, 16, 81, -53, 202, 127, -88, 38, -69, -140, 58, 178, -40, 39, -275, 138, -99, -93, 50, 205, 23, -195, 156, -81, 406, 52, 103, 144, -10, -142, 309, 195, -151, -55, -130, 70, 27, -112, -255, -17, -69, -80, 80, -94, 80, 46, -222, 272, -197, -198, -165, 126, 59, 148, -223, -86, 135, 202, 226, -115, 116, 47, -93, 169, -130, 123, -270, 67, -73, -197, -58, -109, 203, 34, -325, 59, -207, -42, 243, 218, 184, -80, -164, 185, -179, -282, -32, 296, 45, -111, 5, -311, -131, 90, 80, -50, -36, -199, -114, 178, -214, -169, -171, 42, 143, 115, 82, 58, 58, -211, 164, 15, 53, 34, -86, 29, -81, -5, 119, 80, 55, 32, 179, 194, 22, -87, 6, 65, -90, 83, 125, 47, -388, -212, -104, -26, -91, 123, -64, -5, 19, 84, 270, -266, 4, -23, -12, 150, -92, 110, 91, 43, -132, -2, -33, -87, 128, -28, -378, -148, -147, -230, 156, -114, 64, -115, 66, 47, 86, 93, -28]
5727b8K19k37P5m1P8k9p6l5J81k92J70N4K91l17o3J22k61j83M10j90J80l8N4J91
5751B35k14l9J05k45J14J31k38J22j4J66N5k37O6K15j34r8k68K55r2J58J12n2
5773A03L5l58J44j55M72l44k46M34n5j96J76P9m20K15K36l67J78J14K6J3l96J17
5795a95K33J70j97j39J97l1J01j15k21J70J85j08j13K81j58k99J42o0P1n0K82
5816A46k49L21N6j76O5k30P8p6R7j4o3J57N7k28R7K0k36J49n2M9Q5l4Q7j51j51
5841a96R5J39J56k53j0L4R7j28L1Q4J5J00M3J46n66J62j92K41m2J2J7J76j70J67
5865A58l22L39j50k8L84n55K17J40k92k4O4l3K71J1k10R9O5r9r9K1J7J67r9or2
5890e6L8O2k05K52p5j45Mr5J11J10JK04k17l8J8j4J37k75J28K48r8m7n9j14K2
$$ y = [-28, 191, -46, 29, -12, 66, 37, -39, -74, 107, -185, -15, 39, 330, 13, -50, 72, -189, -372, 38, -152, 28, -10, 44, 235, 21, -18, 87, -158, -44, 87, -151, -29, -43, 123, 178, -59, 7, 222, 88, -10, -278, -23, -115, 43, 155, 103, 138, -220, -76, -231, 241, -103, -349, 85, 30, -166, 10, 89, -331, -116, 120, -247, -69, 45, 71, 84, -312, -195, 38, 208, 11, -128, 69, 38, 139, 24, -197, -27, 158, 50, -63, 218, 60, -239, -97, -157, -86, -136, 146, -103, 218, 274, 98, 163, -67, 11, -65, 32, 18, -45, 112, 169, -59, 38, 58, -178, -29, -81, -32, 53, 19, 106, -45, -196, -101, 38, 194, -59, -69, -35, 62, -66, -35, 49, 64, 164, 207, 353, -213, -51, -243, -2, -44, -32, -15, 161, -9, 158, -164, 175, 25, -3, 381, -174, 43, 183, -109, -133, -69, -102, 169, 180, -30, 69, 134, 35, -64, -43, -26, 141, 42, 36, -56, -18, 44, -161, 91, 16, -129, -125, -220, -109, 1, 2, 206, -11, -49, -31, -45, 92, -183, -55, 193, 95, 48, -11, -125, -103]
5915a03L32j79J62l08M3O2J15N9O4k60J09J92m27J22rk9m9P3j01j51L50Lo6jl5
5940c2N6j03O5n6p8M07k44k1j29J53j31l1lL39j70J0q9K85o1l1o6j73K08k25j06
5965b26L15j54kJ56J08j16q3k13P7K39J49j44j03J60P3m4k44J37j32J45q3j97
5987a82j06L79j36R2j45m9M00k48L7q5j5J08L8j05j33J63j57L56l49L50j74j50
6009a11K50K1j35J14q6j36J86j95O8J67k36K2o2n1o9L29R2j11JK03m23J16k99
6032c45K50j8J3J02J3J51o9k80J85k39L54l94M09j07n2J61l08L52j81N7q5J76
6054A45j11j14l7L48j28n7j73K14J78l11o1J96j54K00k67K6N7J85j03%k10K22
6076D5R0j16Q7k54K16j05L5q4P0N3n5J89k71J38r1m1J34N6j23j08O0J61L7l0m6
$$ y = [-103, 229, 50, 212, -96, -53, 9, 124, 183, 247, -13, 96, 288, -139, -17, -26, -55, -104, -31, -132, -283, 67, 70, 4, 3, -32, 24, -79, -14, -70, -148, 259, 15, -6, -135, 18, -113, -144, -147, 192, 22, 32, -57, 228, 167, 136, 70, -103, 105, -120, -226, 89, -65, -67, 89, 197, 81, -2, -215, -138, 101, 250, 106, 3, 163, 236, 192, -52, 85, -47, 98, 15, -182, -288, 91, -45, 47, -98, -147, 253, 5, 42, -43, -58, 50, 88, -17, -150, 13, -144, 212, -137, 213, 39, -111, 139, 160, 25, 139, 53, -83, 103, -92, -24, 143, -93, -71, -133, -184, -253, 76, 168, 57, 58, 261, -162, -46, -345, -95, -113, -100, 2, 15, 166, 97, -183, 2, -237, 117, -277, 132, 25, -27, 134, -174, 178, -3, 54, -31, 145, 34, -80, -117, 231, 103, 46, -127, 87, 265, -46, -107, 89, -65, 135, -132, -106, -49, 136, 33, 33, -177, 45, 135, 19, 106, -148, 68, -37, -2, -86, -16, 37, -18, 171, -100, 38, -53, -94, 40, 96, -27, -135, -75, 86, 123, 93, 47]
6101D7j65q3J79j8j36K02J13M4l60K63n3q6K08k50j09K98o5o3Q3mm5p3K50l9k48
6126a10K62m3k02l4K03Nn3k35N5K62J2k39Q9L06j65j05L00k86k9q4j93M55l05
6149a34K17p2j14K30j15J00q6%j54q7K42p3k86K92k2j5L0l7J79j87k6M3K10r6
6173C9J20k38J40m7j82j41N41O3l42J4k28J70J8M8O9j44Q0J12J17j40J7k58L20
6196A48l10kOl1J18M6J58k94M8J37K11k05j08q2r5L85J68l62Q0m2L6Q0j61K6J36
6221I1o5r6L43k87j74J42P7j73L35jk26j95R4K10k17PK10l04R9L69J78o04R1L28
6245B32j95k3p8j10J7J44k1O0k7m2k47J66L58l42P4J62k59M78m82O1K13j36J61
6268A64k37k9J0j15J45J24m6j28L07r6j39J28q8j11Q7J29R0n04p7L90j15K75k66
$$ y = [47, -118, -201, -22, -40, -176, 26, 139, 183, -177, 86, 33, -53, 155, -95, -204, 94, 29, -34, 49, 45, 0, -73, 177, 138, -110, 152, 109, -93, -127, 76, 81, 28, -207, -152, 110, 122, -117, -28, 278, 113, 8, 308, 22, -7, -91, -284, 171, -134, 83, 11, -103, 127, 12, 112, 26, 26, -128, -215, 27, -46, -332, -40, -62, -77, -47, -84, 95, -92, -118, -75, 135, 39, 159, -79, 61, 14, -168, -309, 232, 295, -47, -33, -261, -91, -73, -25, 44, -100, -20, 92, 209, 69, 86, -172, 148, -162, -164, -158, -189, -71, -25, 133, -161, -113, 24, 235, 30, -78, -160, -255, 130, 298, -64, 16, -26, 10, 90, -71, -45, 91, 26, -70, 273, -14, -188, -46, 31, -142, 193, 192, -34, -229, -135, 75, -142, -135, 75, -229, -130, 239, 417, -187, -96, 232, 37, 14, -64, -174, -157, -13, -34, 26, -1, -43, -290, -124, 234, -108, -34, 128, -131, 347, -135, -74, 139, 3, 164, -73, -102, -92, -207, -62, 62, 16, -112, 195, 99, -40, 88, 0, -111, -24, 105, 195, -309, -386, 4, -111, 164, -102]
6291a02j4L93o9j16k99J24J9p2J73M0j29K15l5O7k65K82k39J20l2q7L7o9K05J38
6315B85l15K0m2k9K22p7j7J32p5q2pRo9L4r9R4PJ04k74K1J86J50k75K6J50r4n7
6342g2j19O7L58q8m5q4l19N15j42O5k76L95j55j45mj80J48p8K05l40L55L8k26
6365a27mK38k6l4J47k25M0Q3k09k5J98J01J12Q0m52L0NJ10k79J56k1o9J52j59
6389a78L00rj76J9qK91k72J69M0k33j18J61J96j02N6m7k38K5L7K94m43J11K21
6412I6j53mR8j9J23m5J2j35jK2k08M24k01Jl33K06J75P5k64J73Lk7J25m45K83
6437a9N8qj17O7j7k20K95q9j08K35l1j14j13P7K2M0j99j6M87l39N3j76mlK99N1
6463A11m13K76K01l02M3n9L37K13l94R6N5l89J57j48K09K46l67m3K64J5k52K41
$$ y = [-102, -116, 277, 208, 92, -207, -83, -64, -136, 37, 77, -52, 163, 128, 195, -70, 212, -27, 93, 61, -26, 11, -58, 147, 285, -30, -10, -52, -81, 141, 64, 47, 179, 104, 22, 15, 24, -45, -11, -110, -16, -9, 95, -179, -158, 28, 178, -97, -71, 79, -15, -72, -191, -124, 234, 146, 101, 17, -302, 213, 71, 136, -140, 255, 100, -45, -49, -229, -81, -159, 46, -294, 61, 99, -127, -131, 107, 81, 47, 194, -31, 9, 92, -117, -142, 56, 157, 269, 349, -103, -73, -68, 42, -237, -81, -102, -171, -19, -178, 122, 113, -63, -44, -52, 239, -33, 136, 176, -57, -175, -14, 182, 80, 136, 89, -149, -124, -87, 207, -236, -125, 96, -57, -61, 37, 18, 141, 96, 108, -27, -28, -6, -214, 210, 9, 10, -323, -117, 58, 133, -131, 42, 45, 18, 143, -302, -19, 39, 31, -86, -19, -36, -256, 39, -50, -158, 77, 46, -68, -181, -104, -82, -42, -241, -257, 230, -109, -56, -232, -236, -239, 60, 111, -302, -26, 175, -127, -84, -143, 194, 407, 13, 109, 164, -225, -68, -216, -7, 239, -128, -171, 93, 108, -144, 97]
6485I7j36N5J41j55L35k33J6K28m27PR2k4L75k59k93K09mk88J38J82j76R4m9m4
6509a19J01j22J74l95M48j7l4rl7K19m9k27J98q9J4q8J92j00j99J49J35r5l3j27
6533a10J22j61K46j16j73K05k94N91k65p3o8J29N8k5k00p0M58m11L68j43l0L18
6555C56m16l3j21L7R8j5J14l9j10P4j1N1O3J18l83L04P5j46Q8j36J73j82l06K13
6579a34J69M4j5j19M40l40l0l36K19Q7P0n6k62M09N9j93K83k96J87q8R6k25q4
6602a15K14k58MJ53J66k07k2oq4L9J78J73l55L8M47m44L29k47j55mJ26m9L56l27
6626e0K85p8k13l0j24K1J86j12K55pJ9j91l7P6j52L50l03m2J7L32j94J09jK6o7
6651G5m3j49M2J3K27k76L75l15j13K58k72J83R5qk31M55j23j28J77l85NL27lm73
$$ y = [97, -39, 16, 157, 2, 337, 104, 120, 348, -79, -72, 20, -4, 371, 112, -181, 28, 24, -264, -126, 56, -120, -26, -75, -119, -18, -140, 34, -361, 87, 70, 36, 27, -10, 209, 160, -67, 131, 42, 56, -32, 160, 60, -139, 10, 145, 50, 17, -110, 12, -149, 97, -19, -192, 13, -281, 310, 45, -28, -96, 33, 91, 66, -134, -204, 254, -157, 211, 68, 38, 356, -60, -93, -214, -177, -79, -94, 20, -19, -129, -55, -66, -15, 48, 166, -217, 87, 162, 16, 104, -32, 141, -41, -347, -134, 35, 79, 64, -55, 385, 45, 15, -321, -102, -15, 55, -1, -263, 146, 205, 12, 295, -1, 186, 98, 194, -31, -115, 99, -159, -155, -2, 164, -43, -65, -71, -155, -116, 62, 235, -120, -82, 365, -79, 250, 3, -152, -156, -30, -79, 277, -50, 235, 157, -56, -86, -210, -189, -3, -115, 140, 133, 152, -39, -76, 0, -152, 198, -105, -147, -130, 202, 8, 117, 116, 142, 75, 32, -117, -75, -62, 165, -111, 264, -51, -164, 94, -178, 5, 100, 92, -139, 316, 193, 65, 242, -143, -138, 189, 186, -287]
6675b87L19J6n2J74l2j7l34J12j66L74q6j30j81L68J13j79L9l62K38o5J23N6J7
6698E8k54k2L88k28Q6j31J90o0J65j52j95J35K10k63J66l8r0o5N3K0J3J49j81
6721d6L22n6k15j2j67J29p7J19K50j47Jm0j7l5K61l69K16k17j6K23k43J22J28
6744A14l9p4j38Q5J80rK0j71pM9J19N9l10J75l05J56j20K98k58K08k8m6j54j8
6768b14L70j46m0L9J01k32n8K20j54M6Q4P3l82K29k71M09K8j08j89K47k31L88
6790B09l12K85n73L18K0q9K28N8j03j36R7N8k43L25m56M85J50m87J81O2o0j8Q5
6813H4j47J51k75L20k22j40K82O0j41k33J14J32N1R5j4k4P9N1j34J7m04K32L3
6836c3P9K1j05O4j63pM6j18L00K7k12J53q6j31L63j89j99K30j6J53l46R7J10l7
$$ y = [-287, 32, 48, -4, 170, 138, 121, -213, -101, -267, 107, 21, -109, -290, 78, 191, 12, 51, -311, -73, -138, -15, 41, 58, -196, -218, 170, -58, 28, -103, 87, 27, 192, 40, -155, -20, 190, -73, 93, 55, -35, -100, -47, -27, -14, 135, -46, 276, 220, 5, -7, -174, -45, -122, -3, 247, 100, 101, 61, 44, 9, 270, -99, 117, -100, -116, 107, -136, -14, 114, 75, 1, -137, -52, 128, 119, 139, -32, -39, 10, 129, 188, -122, 53, -252, -96, -216, 82, -176, 32, 4, -42, -196, -214, 156, 10, -30, 9, 110, -122, -180, 40, -114, -68, 16, 89, -293, -64, -335, 74, 102, -6, -195, 52, -179, 209, -103, 182, -391, -73, -53, -142, 86, 144, 41, -95, 2, 60, -183, 142, -314, 171, 321, -166, 15, 77, 17, -1, 84, -63, 88, -187, 133, -89, -229, 53, 113, -28, -261, -147, -15, 36, 131, 117, 93, 172, 223, 89, 106, -298, -66, -33, 46, 67, -38, 26, -137, -144, -98, -216, 84, 111, -101, 52, -34, -165, 198, 9, -190, 40, 24, 177, -169, -72, 38, 1]
6860AJ55M0l06K80m32M22J36j56j84N1j01O3O1L6m3j38K57l26K76k31J81J27l96
6883b27M03l42K73J4j48j27J42o4L0J58q0M8k20K32k43J91l0j0k0J9K6K12l55
6906a18J56K4j89L17k00R8r6L07N1k89n4k2K45l19K15j98J16J57j59J56j14m29
6928c45K83R2j71K5K57k69m2J52j02K20j06p6J75j29P0o5j53L01K6J62k55pj60
6951a17R0q3M7r3L82P4m66K84l06L99j49k06K93j21j7O8j60R5j10K16J25l02Q
6974d9K26k98O4k15K0L81j19M0J74j11J7j00k72M59j47j88J78j01l5K03j40j05
6996a18M11j25j02j50L8J58l23N6L57k02r4J99rl20N21k16j32J28L1N7j15j11
7018f1q1K14j72J16q2j03J84n1Ql3j50M74k72M2J00l8j01j82JK10j60O5K19k92
$$ y = [1, 156, 196, -110, 170, -262, 160, 296, 140, -44, 7, -94, -31, 30, 66, 23, -115, 142, -184, 92, -139, 42, 169, -227, 176, -166, 107, 121, -27, -154, -12, -76, -46, 112, 32, 80, -140, 92, -151, 40, 10, 0, -20, -1, 25, 237, -118, 38, 62, -127, 190, -10, 88, -8, 299, 350, 61, 7, -15, 230, -89, 126, -72, 44, 201, 42, 198, 84, -345, -62, 30, -141, -116, 141, -128, -170, -18, -120, 100, -6, -82, 93, -36, 34, -31, -184, 117, 143, 305, 50, 43, -117, -27, -110, -63, -156, 226, 300, -166, 118, -188, 211, 62, -144, 149, 28, 11, 79, -81, 14, -96, 120, 245, -57, -49, 177, -121, -57, -272, -252, 129, 10, 50, 224, 113, 130, 30, -242, 217, 70, -118, 60, -41, -76, 127, -13, -118, 293, 168, 66, -84, -46, 112, -211, -155, 202, 0, -94, 105, 96, -224, 297, 81, -51, 77, 108, 165, 50, -61, -142, 72, -100, 16, -66, -169, 15, -36, -28, -61, -211, 263, -9, 33, 133, 95, -6, -188, -187, 23, -137, -72, 147, -145]
7042a45K24j02J4j61K95k03J8j81K03j95J37k8p6K45O8J18k65P5j50L25k95o8
7064a47K91k73J71j72J11lq4k6K77M0k81J75k4N5R3k55n3J91j43JR6j75L59N9
7088B83k98L4j76k1J16R1J08m4l15L77j22k5o4L31l50J45o1J40p3r8Q6l45J56
7111a25J38j33J8k8M25k09j98K74m5j91q0J79j9o3J56KM0j2k73K24k27K54j72
7134f5J29m8q0J05J12j61K30l97L24P4l98J20Q6P3M3j77j6j04J97j64k9J90Q9
7157A33k27j01M19j59P5j80R5j62J17Q6j94J31l7J08k32k33L77q1J0j57K62Kl33
7180b81L71k16J07N5l64K30K20k07J44J45k79L69j91k1k53K19j14M6r3R8j85L18
7202A18j19r2K6j1P6J15k35p7M08j94n5OJ30j14p1r8K65J11r8J38j57r4j23K73
$$ y = [-145, 79, -23, -9, -170, 125, -78, -60, -241, -38, -233, -96, -124, -200, 45, 113, 231, -34, 41, -109, 216, -79, -147, 144, -129, 42, -130, -19, -22, -106, -132, 145, 185, -96, 79, 55, 110, 203, -52, -105, 86, -57, -56, 40, -135, 224, 283, -15, 19, -157, -178, -62, 29, 137, 93, -222, 155, 33, 8, -56, 275, -75, 70, 9, 149, 76, -22, 64, -281, -125, 13, -120, -102, -130, 295, 86, -112, 162, 117, -74, -154, 25, 6, -57, 99, 101, 141, 129, -144, 80, -147, 107, -65, 64, 16, -64, 41, 153, -8, 222, -175, 149, 223, -175, -55, 31, 104, 147, -30, -46, -150, 47, -117, -146, 44, 133, -94, -195, 224, 65, 140, -40, 55, -107, 10, 96, -98, 33, -4, 104, -128, -361, 16, -65, -55, -212, 50, 52, -281, 90, -126, -19, 36, -328, -98, 122, -85, 59, 204, -75, 294, 103, 82, -171, 48, -66, -20, -113, -15, -200, 118, -1, -93, -67, -78, -2, 113, -122, -199, 209, 15, -40, -34, 96, -18, -89, -187, 78, 189, 91, 229, 72, -22, -145, 128]
7226A28k18L39l23L3P0M2O9k5l07N18q6n1k08Q8l45L05j05Q4j99L92j86k65L87
7249A37k14K06j16K1m8j17P4J51r1%k08M30o1k59L6j4n4k0l0J9J68J1j00j4P3
7274b0J15j32j37P3L06k20m9j28J72r0L43j8p1j58K09k92k1J35J89j62Q1m0m2
7297D3J94m86K66l2K31l11N0k6o7L4n9K84O2M7m18K91L8m12J44q8K63J29l17p
7321a47J14M5K1j86K32m6j52O5R9Rj91J91j78l1K66j24LJ03j16m0k23L96k45j8
7345a53j14L83j4j52J27o8j14K15j3p5j7L0Q4k71K80J68m57K43j90O8RJ63j54
7368b2j61Q1J96l1Pk43N3K45k33Pn8L5P9q3j62K20J05J03k78N4J49k1O2j62j61
7393b19KJ18L77k67j6l4k3J05Q8j68L26j50q3J72j10j0j35r6J46L7j0J08j65K13
$$ y = [128, -90, 249, -74, -41, 29, 71, 140, 115, -192, 326, 240, 189, -19, 69, -276, 29, -76, 8, -191, 201, 15, -250, 137, -77, 129, 13, 34, -14, -131, -57, 94, 3, 3, -205, 225, 164, -95, -59, -73, -127, -147, -177, -158, 10, 21, -79, -93, -20, 95, -37, -174, -101, 205, -15, -64, -192, -20, -110, 233, 215, 144, -14, 195, -97, -118, 17, 206, 44, 125, 85, 43, 237, -249, 17, -15, 216, -95, -45, -71, -138, -104, -163, 121, 183, 230, -188, 103, 141, -271, -127, -215, 48, 177, -140, -147, -33, 12, 33, -153, 79, 33, -119, -54, 45, 54, -137, 54, -124, -155, 111, -13, -10, 93, -23, -63, -286, 110, -135, -153, -267, 116, 102, -50, 77, 9, -105, 110, 97, 22, 5, 35, 119, -152, 128, 296, -161, 82, -108, -40, -31, 132, -22, -183, -102, 94, 63, 70, -173, -120, 125, -108, -101, -159, -124, -45, -128, -290, -70, 35, 138, -140, -86, 63, 42, 104, -58, -219, -217, -99, 278, 11, -5, -39, -62, 43, 131, -37, 289, 139, 56, 228, 118, 108, -27, -123, 23, 60, 50, 158, -7, 206]
7417B06k13K28j07l13J93j9J33k5J7k34K58K7j63j76K63k6k3%j34J86k13K24J71
7440B60j44O7k84N9R6r1J04pmR5m0K01l81K55q8K02l75q4J6K83k51J22P2K7l26
7465b16M20n3m52M35k01lO8Lk04M52k33p4J5p5J68r2P9k06L18l88L04j37QJ62
7489I8j5j9j12N6j29mK54j52K31k57J12k66J34K07Ok51j04p2J13K4L32j42j76
7512a32J61j77L79m1l40J35nK5j19O9P3l3J07k58K63l17M47k97J26j89l3N2J07
7535CO4K61m84L2J11J99k41M31j91k20M8j47k3L62j46P2j05j06M4k2J20j83K33
7558A12k89J65j82lK85j42L6k81M2J67l9K38j1q0j8kJ80p3j47J09k01J42J1j7
7582Bj36J26kj94L07k56K66n3l10M55j32J2k8j06j13n4J30O8o7K30m1m21L13P
$$ y = [206, -7, 221, 114, -199, -6, -25, 108, 83, 100, -134, 124, 151, -12, -188, 75, 49, 26, 26, -108, 78, -135, 89, 260, 116, 183, -101, -42, 54, -37, 67, 60, 56, 151, 111, 312, -69, 186, 98, 300, -75, -159, -143, 140, -111, 11, 83, 110, -216, 204, 151, -301, 134, -67, -70, -2, 1, -203, 249, 16, -58, -43, -118, 50, -42, 37, -169, 149, -239, 65, -72, -64, 98, 83, 64, -48, 8, -121, -125, 129, -23, 208, -49, 63, -203, -69, 138, 144, -107, -211, -283, -170, -146, 186, 44, -132, 29, -148, 231, 190, -150, -15, -20, 5, -114, -45, 28, -5, 102, -156, 107, -210, 237, -60, 66, -123, -156, -104, 3, 67, 328, -156, -124, -13, 186, -55, 376, 185, -35, 13, -134, -157, 205, 59, 131, 26, -80, -36, -58, 62, -121, 112, -177, -12, -194, -197, 88, -54, -18, -299, -257, -90, -129, 109, 98, 18, 0, -2, 178, 105, -42, 67, -134, 8, 19, 2, -134, -8, -10, -204, 103, -153, 113, 60, -250, 205, 73, 85, 57, -49, -162, -216, -86, -18, -85, 145, 104, -317, -4, 3]
7606CP3q1j15J76J13l84L87m9J6q5j59N7j68Q5P2K19k71j82L14Q8j9j03J01m3
7630D5n9j11r3M12k06j34j98M10j21oK87k72J25r3Q8j79J02j30K25k27M5Jl5J72
7654D8L68m21O7r5q0J78o3J51m07K49q4k8J06k3j73L15O0l75M33j11m9k10J44
7677@J28n1o5j08M54m71L08j00j46J8L08k87j69N6L91j54l13L43L4j65J43j21
7699C3%K55k99K79J12l26J65k43J98q1p2J9K31j78p8L8j51J59K2k43K95N9j35
7722E9r4J79k3k35OJ55j35L4J14l7ro6O5ML11k31k60J80p4r4R5j16J03J48k25
7747a46M90m79J43m7k8m1M2J21p1L35m24M3M11l73P1j11j37L54K6j25j73K0K6
7770g3L56k31l06K67J13l84L90j17J88j35j92K61p6j62J21N0k87K94K50m28J45
$$ y = [3, 76, -5, -120, 56, 169, -215, 172, 123, 139, 54, -105, -48, -216, -131, -59, 160, -111, -293, 21, 109, 90, -13, 88, 45, -14, -125, -218, 194, -12, -146, -344, 66, -55, -61, 226, -46, 79, -14, 74, -105, -3, -133, 92, -135, -90, -89, -124, 48, 416, -5, 62, -33, -113, 65, 2, 153, -254, -5, -89, -117, -11, -34, -207, 108, 168, -207, 226, 115, 66, -144, 0, 128, 77, 12, -96, 358, -113, 195, 95, -51, -33, 275, -12, -181, -125, 266, 112, -201, 142, 176, 11, 154, 33, 33, 288, -11, 268, 380, 54, 219, -24, 174, 93, 21, 40, 271, 93, 15, 53, -98, 61, 83, -160, 135, 194, 59, -35, 144, 121, -114, -108, 47, -88, -54, 60, 23, 14, -52, 13, 17, 328, 97, -163, 17, -57, -151, -56, -172, -69, 79, -146, 344, -135, 8, -39, -67, -108, -66, 55, -16, 319, -105, -62, 349, -24, 47, -64, -201, 153, 179, 54, -119, -99, -73, 283, 52, -254, 13, 126, -258, 132, 15, 203, 68, -124, 137, 61, -101, 20, 70, -217, 77, 327, -101, 44]
7791D4O9k0k13Q6k1L0J90N9k53J86j90L5J29p9j78R9K20ql29J82j44J79j44K03
7815A32L1R1j22L7j04OJ88k77j8K37k41J63k06P8K99q3l46L19k37J34l1p4L6q4
7839g2o5K58k04L46j1j55l6K25k35J40k35K37k40O8J14N7k02J18k46j1J88l92
7861c53L22N6j2J20J85k38n6j15OK62l00R3l2m3L3J81q2j78J62k43L03j39j37
7884b05K70j56J21R2o3j9l2m5o5J13K47j97j07J75l44J63k78K36J25Q0n1j43Q1
7907bM1j73J29k0j36J07O7N2O3l75L05L0l50K22m8K68m45J88K63j81O1J5J62l07
7931f4K70k26l6l8J74l1Q5k59L62k99J61L3k69K72p2J7q2J36J00j24L1L9o4k55
7955a39J92M9j79O1O2M3j78L32j27Rk62J4K17m1j85K25j67J53K8r8L08m06O8j19
$$ y = [44, 113, 93, -120, -34, -55, -25, 165, 224, -29, 157, -33, 2, 131, 52, -126, -27, 193, 185, -144, 38, -106, 73, -71, 132, 163, 254, 132, 169, 65, 71, 259, -18, -36, 201, -40, 123, -83, -5, 294, 211, -135, 184, -53, 81, 50, -24, 12, -72, -137, 121, -83, 263, 252, 97, 61, 286, 51, 191, -44, 193, -47, 21, 135, 192, -10, 108, -138, -149, 39, -353, -31, 25, 13, 133, 318, 80, 24, -91, -85, 177, -123, -30, -62, -105, -72, 109, 27, -151, 11, -232, 71, -68, -205, 65, -91, 30, 122, 59, 40, 8, -37, -102, 11, 258, 61, -46, 129, -215, -52, -330, -94, 31, 111, 60, -83, -2, 39, -134, -5, -25, -161, -54, 13, 65, 128, -247, 58, 88, -262, -40, -88, 180, -265, -77, 186, 5, 66, 81, 243, -64, 206, -20, -56, -94, 80, 49, 134, -125, 237, -62, 99, 132, -137, 135, 63, 80, -2, 134, 234, 110, 141, 180, 116, -139, 53, 102, -77, -16, 46, 89, -89, 243, 116, 125, -137, -123, 94, 53, -132, 93, -74, 79, 107, 9, 317, -89, -21, -140]
7979a40J88J23j37j51K18k52J24K4p3k25L65R9j58J73k07O8N5L6k93K95j23k80
8001b71K28m6j1QL43k14m9m0L30j65p8P9r1J25k81J11r0J14k07J75J72l21J08
8024g1J74k00j3J16l6J78k36K38l83k1L15k00K00j72J45k5j39M2L4K05j81j74
8046b04K78j08N7l6K42l19J68J17l43K60j12J35j75J97kj68J72l34J27nj96M60
8068B11k10J30j25J72k01J38J20m07J69j88K55qL3j99L77k16l01K60M4j20K06
8089A40r8k41K50Q8j58K92j50k78K83k60k52N08l04J59lj25R8Q4J25j13J71k42
8111b6j50M30K3j22k14J23k2R7j29k0J51j21r7L47l53J42j18j01n7J77J93k44
8133i1J61j56k16L81K6l15K99l6l3j36J21N3J08N1k66K10k48k32M22m6J41k82
$$ y = [-140, 48, 171, 34, -117, 101, -151, -27, -3, -76, -301, 64, 163, 5, 178, -29, 39, 94, 130, -163, 132, 9, -271, -43, -89, -100, -92, 251, 37, -12, -52, 278, 113, 35, 114, 23, 148, -133, -22, -112, 2, -205, -30, 142, -179, -71, 103, -97, -110, 6, -30, 148, -88, 150, -233, -254, 61, -139, 61, -111, 34, 9, -130, -88, -54, 151, -30, -204, 74, -34, 23, -13, 229, -90, 78, 195, -148, 112, 0, 135, -40, 157, 155, -13, 159, -175, -48, -53, -249, 211, 1, 131, 6, 178, -23, 115, 235, -172, -3, -191, 64, 56, 89, -110, 267, 51, -250, 10, 54, -66, 140, 42, -199, 51, 139, -19, 273, 123, -155, 128, -132, -384, 124, -180, -21, -24, -149, -51, 33, 158, 45, 216, -26, -176, 254, 277, 155, -59, 64, 42, 139, 10, -10, 141, 20, -77, 270, -83, 59, -59, -160, -217, -40, 153, -91, 70, -86, -302, 79, 105, -210, 89, 53, 20, -116, 5, 58, 166, 217, -49, 161, -87, -319, 103, 57, 198, -84]
8155h4K04k42K54j01J84m4l07J5K77j47lL25m37J05J9l4R6J26n06K60J41j49M8
8178@P2k8Nm0l7L1p7J37K64q6K7l25O8
$$ y = [-84, 120, -122, 132, 31, 215, 171, -136, -121, 156, 9, 6, 331, -106, -1, 18, -16, 80, 206, -300, -40, 101, -48, 0, 72, 44, 49, 9, -28, 3, -74, 63, 327, 241, 268, -57, 11]
8191A1
$$ Imaginary data points
##PAGE= N=2
##DATA TABLE= (X++(I..I)), XYDATA
0@%%%%%%%%%%%%%qJ6j6J6j6J9k7L2m0M8n5O3p2Q8j02J17j34J51j72J96k22K52
35A34k84L20l59M00m46M98n53O12o81P56q34R20j016J119j232J356j494J650j820
54i54K009k220K461k741L061l435L882m425N103n977P146q804J1357j5815K5730
69A6378q4353P5390K44722j59745k46662J8014J66222Q2831J963j17835o2896
80f5971Q8247N0446o5326j1286K6812J0632q476m5124j3902O7036r224o9444K0343
93b5237L8793k1195o76j5732k4059N3114K1428o6813Q793M7505l4588r539M2558
106A4352j0903j2776J0853j4894J9643L4489m1650j9824M4504l483j5662K4478
118B9127j4227j8132K2555j0843p377L3834k8008m4646M1856K1706l6700k100
$$ y = [0, 0, 0, 0, 0, 0, 0, 0, 0, 0, 0, 0, 0, 0, -8, 8, -8, 8, -8, 11, -16, 16, -24, 24, -31, 32, -40, 48, -54, 63, -71, 80, -92, 104, -118, 134, -150, 170, -189, 211, -235, 263, -290, 322, -359, 397, -437, 483, -533, 586, -646, 710, -784, 866, -954, 1055, -1165, 1296, -1445, 1616, -1819, 2063, -2362, 2741, -3236, 3910, -4894, 6463, -9352, 16378, -67975, 7415, 252137, 92392, -154270, -136256, 29966, 112797, 114760, -3075, -65971, 22276, 72722, 7396, -3890, 22922, 33554, 25078, -20046, -33948, 33088, 23864, -45580, -25237, 13556, -7639, -8315, -24047, -48106, 5008, 26436, -40377, -31584, 15921, -18667, -28206, 14352, 3449, -9327, 1526, -13368, 6275, 40764, -886, -20710, 23794, 20311, 4649, 29127, 14900, -3232, 19323, 8480, 1103, 34937, 6929, -37717, 4139, 25845, -10855, -12955]
130a2955O61r352L3179o870n3943K5108M6793k9802j9132J9493J086O464L740
143D470j6034J7641J7429l5160l649M0139j374j9391l595o849J9925K0692l5309
156a065j6674L4432l707k2295J4999J287j3080O678p751k486K6768j6620l6625
169c6139K6968K7592k3146j3201L066L569K1647m245l1603J5534K6058j9928p580
182a1408K0103j513n620K65m400J7122J2032l0877r819L1330M181j8546n388j651
196d189P948J0762j8113j0016J8540l922j6986J1617P915j1487m161j109P388
209e813J6931j2538k3564J7790K2657j1005j1686J760N042J1595j759j4238Q694
222C866J0553j4819j861J6953k899j3386j960L927J1036J888k2012o441K1525
$$ y = [-12955, -12294, -21646, 11533, 4663, -49280, -24172, 22621, -7181, -26313, -6820, -5734, 730, 4470, -11564, 6077, 23506, -11654, -15303, 24836, 23462, 4071, 476, -6373, 13552, 34244, -1065, -17739, 16693, 12986, -9309, 5690, 6977, -6103, 575, -7176, -9662, 17106, 486, -36139, -9171, 18421, -4725, -17926, -14860, -11291, 10356, 6111, -25492, -9958, 16100, -3828, -11408, 8695, 7182, 1562, 1827, -2573, 14549, 26581, -4296, -14115, 17215, 21396, 2850, -2538, -4189, 3759, 14521, -3592, -13608, 4932, 1010, -15976, -4359, 3556, -7931, -12092, -13201, -5813, 11118, -1420, -24984, -7194, 15463, 4458, -7228, -5468, -426, 11169, 9410, -4828, 3866, 14419, -400, -2261, 14692, 11793, -1593, -3553, 374, 11410, 13298, -8714, -15155, 6370]
235F370M482j5808n225M183M005K008p402l60Q913n392r002J1132J0131q441r400
250i806J547J2691J0297j2567j4875J2542J5408p116q502J524K747K755k055m459
264A31M697J410j1248M22J3623j079j4187m445Q195R113l940j4012j451J3809
278A038L480j0432j587N669K063l230j040M606L639o175n684R274J0294n567j2084
293e736J728J1541M049q823q059N214P396k766m527N13J257k181k375K766M295
308D292n287q915L356J1473j66j1115m254Q009P492l760q473M89P604J414m215
323b056J221L046j877k480K908N288m43o758l189P562P630n209r753J888Q268
338F046%o230j907K640l22k363M16K022q61n180j620P119M739p291p613N292R130
$$ y = [6370, 10852, -4956, -10181, -5998, -1993, 15, -7387, -7747, 1166, -4226, -13228, -2096, 8035, -406, -9806, -8259, 4432, 14729, 2162, -12713, -171, 15237, 8121, -381, 1143, 3890, 6645, 4590, 131, 4828, 6238, -5010, -4588, 9035, 7956, -6231, -10676, -2481, 6632, 2692, -11320, -12771, 1038, 4518, -5914, -7501, -1832, 231, -2999, -4039, 567, 4206, -1969, -7653, 1621, 11915, 6348, -5736, -4008, 7533, 11582, 2759, -5300, -86, 7310, 4544, 17, 530, 1787, -394, -2769, -3, 4292, -995, -9910, -6554, 4919, 4753, -6362, -10616, -2607, 4885, 1125, -7348, -6859, 745, 2159, -2056, -835, 2211, 334, -2146, 762, 6050, 5607, -1151, -4340, 3222, 10852, 5643, -4110, -2222, 6046, 6046, -184, -2091, 549, 227, -2136, -1720, 302, -559, -5739, -7359, -240, 4499, -2792, -10405, -5113, 4017]
355D017j45p530k418N452N417j237m269Q53K372o64r46L229J422m987m330M746
371I82O828j995q532k772O505N602m770o772J119N003m04k789l7J399j353k600
387d586K567M409l036o192Q51P199L781o045n046L884O724O21m942j924L029K618
403C912o43o74Q33p7m018P02N813m00q178k787M212M574n76o967l475N796M826
420B873m671l152K270O47N6J097R98J18j716j900L839N441l707o196K145N483
436C625J492l196m951J442O212o13m273N89Q63j826R86J897l72j619l474L10O393
453C485P00p597k453M157K778J2l591l630M012L948l490p2K780l190o01M577M66
470B291q78o34l347L202P794m525p011L138L984j023p29l315j363L842R4l393
$$ y = [4017, 3872, -3658, -6076, -624, 4793, 3556, -713, 140, 2512, 1848, 902, 4131, 5553, 566, -3764, 982, 7810, 5815, -2717, -5489, 1016, 6618, 1848, -4924, -3805, 1198, 794, -1995, -2032, -633, -1986, -4586, -2019, 2390, -646, -6838, -5987, 1212, 4993, -1052, -6098, -2214, 4510, 5131, 189, -1735, 1294, 3912, 3269, 2595, 3428, 3351, -667, 35, 5848, 5448, -2730, -5517, -1305, 3269, 2693, -4274, -7749, -1953, 2873, -1798, -4950, -2680, -2033, -1977, -880, 118, 236, -1480, -3380, 459, 5900, 2193, -4003, -1858, 3625, 5117, 1921, -3030, -1588, 4624, 4011, -262, 327, 1190, -636, 350, 2247, 1875, 256, -3218, -2908, 3485, 4185, -3412, -5865, -1708, 1070, 1082, -2509, -6139, -2127, 1821, -1669, -1741, 1039, -2151, -2752, 1825, 2291, 1413, 779, -2568, 634, 8428, 3903, -3108, 30, 4014, 2991, 2262, -1053, -2416, 1426, 1520, -1873]
486a873K415l73m287J654L614q29j520k594j022P032K067p531r82M498J86R01
502A356L74m828J920M186l398N72L970m485k539O045Q22k246k63m047J981O927
518F347l362o498L141J598j415K543k931l860M091o08l234N008k39p404K989N561
534A727k361p0r73l267N953M578o530j287M844r96P59K564m245p97L398k494L84
551A187M169n706l635N692N05k221Q08m592q57Q047j971p252L601J170k676M583
567H52k32m848K837J691k833M148J191o971J976N910k270o9Q89m305L060N165
583F191m706k115L070k562Q94M028m330k426L335k658J70M568m991m707N700J060
599E21k450J892k911k603O816K62n489L305N20l370M708K285n139J473J672k066
$$ y = [-1873, 542, 169, -4118, -2464, 1150, 321, -1199, -3793, -4815, 2217, 4284, -3247, -4229, 269, 455, 1356, 1730, -3098, -1178, 3008, -390, 182, 4152, -333, -2872, 3173, 3995, 1749, 1486, -2561, -580, 6347, 2985, -3513, -372, 1226, -189, 2354, -577, -4437, -346, -954, -4188, 820, 581, -6823, -3834, 1727, -634, -704, -1677, -4944, 1009, 5587, -943, -2230, 2614, 1618, 2377, 4941, 696, -101, 3297, 803, 1187, 5356, -350, -3985, 1707, 2212, -9, 799, -3793, -4650, 3397, 1426, -5826, -2225, -1055, -3731, 852, 620, -4228, -1391, 300, -2533, 1615, 2806, -4165, -2189, 3721, 1451, 1382, 2271, -2034, 1026, 6191, 1485, -630, 2440, -122, 772, 4800, 470, -1956, 1379, -1279, -1109, 3459, -1532, -6239, -539, 521, -1929, -37, -2948, -5551, 1265, 1527, -3962, -657, -137, -3507, 1201, 3486, -1653, -180, 1492, -574]
615e74L905J593p137J368M698j953K96L68n196K288N391m322k578L197k860r03
631b419M413k360l076K715j523k17M896l079m698M071J817j757K087k211k717
646d058N523J661m015J778L19k683L813J654m274R30J476l046L626K230o180m25
662a671L782j859M15J373n239J08M642j608j869J873k592p58M520j314k890K068
678a019o58q36M807j106l972K088K213p64J827j282k948K762K262k170O19k46
694A577k826K745J998l103o23Q00k549J731K715l879j459K207p53J068J185l900
710c066l13L636q22o00J240j642p38L909m03j698J290r58r85L926L59l769O20
727a4J259k45J812q04l340R70K392j251l72k32k082J076K013j903J8k06j834J101
$$ y = [-574, 3331, 4924, -2213, -845, 3853, 1900, 2196, 2564, -2632, -344, 5047, 725, -1853, 1344, -1516, -2419, 1994, -366, -3442, -727, -2250, -2467, 2429, -650, -5348, -1277, 540, -1217, 870, -1341, -4058, 1465, 3126, -889, 889, 1208, -1475, 2338, 3992, -282, 648, 2124, -922, 2704, 4934, -1246, -1671, 2111, 252, 667, 2040, -3199, -3091, 1551, -57, -1926, -53, -2645, -3403, 1117, -197, -3087, -1019, -1677, -2513, 2294, 1188, -2784, -696, 1517, 753, 2580, 1298, -1650, 1112, 3374, 1204, 1823, 1577, -1249, 1496, 3494, 391, -232, 568, -1981, -250, 2465, -1414, -2873, -666, -1419, -351, 834, -3066, -3379, 257, -565, -1165, 75, -1567, -2305, 1604, 1201, -497, 793, -165, -1150, 2776, 3135, -634, -14, 1245, 1000, 2812, 2008, -1332, -362, 2030, 779, 407, 175, -1907, -831, 1182, -721, -703, -909, -2743, -1642]
745a642K816j635k167O43N82J551J375k155j229K266L88ON27j456r12K274J083
762B315j078K33j131r78K201J254k548j141M58M22J181j96k384j31J434K00l5
779G6n92j609O36J520J76m91k54j241O05K212l27j554k21N52J363R39j306j174
797f90M29J283O91p1q31q87M53P96n2l6j487q61J597Q11j109j171r24P54J406
816A01l5j561n16J091O62P32r19m80j89R01P69N2k82j034M96J458Q13j115j208
835b64J40J176O31m35j312l76O06Q34nj173l68J08K62Q09n69j285n69J056P36
854Bo0q77q29M91J357M72r28q61N23J012L66j67m62k43K47J117P85q09q01l03
874C2L41J450m13j682m81R38P25m36q89p57J48R34M1k54p73j83L63R12N8m87o39
$$ y = [-1642, 1174, -461, -2628, -1985, -1403, 148, 1523, -632, -1861, 405, 793, 799, 1326, -130, -1042, 1232, 2315, 1237, 1470, 339, -639, 1562, 2816, 268, -873, -415, 7, 1188, 992, -1392, -1523, -89, 111, 76, -516, -2125, -1489, 31, 207, -284, -538, -1779, -1174, 1038, 711, -843, -1064, -512, 851, 1790, 484, -690, -261, 1022, 1713, 1642, 811, -76, 377, 1173, 1121, 1085, -402, -1263, 334, 1145, 36, -1135, -2059, -1305, 101, 66, -1495, -2011, -920, -258, 474, -445, -925, -1114, -213, 556, 608, 326, -708, -212, 1246, 2059, 944, -264, -124, 1052, 1683, 1248, -64, -440, 166, 1000, 995, -178, -546, -438, -176, 633, 64, -1221, -1790, -734, 2, -58, -935, -1764, -1273, 84, 556, -372, -1233, -710, 302, 668, 501, 39, -204, 43, 1160, 1945, 1136, 335, 32, 373, 1823, 1410, -272, -753, 185, 910, 474, -415, -1172, -1024, -90, -49, -303, -1076, -1259, -896, 16, 74, -413, -1052]
895a052k32J187J111n22j534M77J021M73J08j199l02J022K72J72n43l0o51Q03
913E81N31N9j451o44N99J096P5j076j169M14J099N75j025j005J28R57L0J3j9q21
933a053J64J137R41q16p63l97J379P78l49j155l31P02Q26l6r35j76K07M71k5l05
953B64o04n74L53O36M77m68j498K17J477L12o15j235N9J062O52o11m14P9K38M33
973B40K27j43o59R6J52R22J58j009q80J136R59J28j242p97M89J121l33n34n12
992d81n8M15J59K78q84K49o40N27J135l70j646N80P13Q02o5j032l59P78P51l70
1012D82m20J17o16P57P74m17m24l72l28J073M93j080j086P04O72L15m01j337K9
1031a065J418L5q58L20j60o33J042K20k06k9n37k04J549J12j574J8R21L00M10
$$ y = [-1052, -1284, -97, 1014, 492, -1042, -565, 456, 929, 1037, -162, -464, 558, 830, 1002, 459, 429, -222, 581, 1112, 1171, -280, -924, -325, 771, 846, -230, -1399, -985, 114, 689, -336, -1341, -1213, -256, -226, -213, -232, -1053, -889, 248, 1189, 373, -390, -787, 592, 1370, 1021, -134, -465, 237, 1063, 1027, 92, -84, 123, 594, 569, 264, -340, -914, -561, 75, 552, 84, -1414, -1197, 280, 592, -23, -1258, -1199, -137, 515, -96, -510, -431, -193, 240, 467, 324, -335, -239, -87, 835, 993, -16, -896, 240, 1199, 1327, 85, -712, -223, 898, 565, 31, -481, -539, -124, 35, 313, -571, -322, -962, -435, 700, 330, -1316, -736, -23, 779, 714, -318, -677, 101, 852, 482, 62, 179, -437, 320, 1094, 677, 253, -119, -447, 626, 1119, 39, -1047, -343, 329, 644, 243, -1094, -1065, 353, 388, -470, -150, -310, -943, 99, 319, 113, 84, -453, -657, 892, 1004, -570, -552, 369, 669, 1079]
1050A079p59r38Q07O60m74Q0K03j239M96N80l62j66l64q05P82J680j286j301Q35
1069d92l5P26K19r03n21J411k07k36K26k76p95P28Q01n69j20j27k49J442M45j516
1089d8k41R5O54M44o25q56N07M60o85N16M89j520K17Q02l8rm08r70P38J429j023
1110g2p38N35J03L44P70r85o89P64J83n19O98n9r55O55N95l47L77p22r18J471
1130D91R38j489l12M44l96Q65k41j033O7P65k92L22K54j226QJ204j89j09J60j164
1150i33K10J508O8j127J51R7J78J099q97p14N65P6k83R36l32j580R89M49l05M23
1170E78j010o76J064P89r78k58l9r2Q43O19j303k65Q44o64O18K83p45k11J166
1189E63k32R4R0q87JR35Q4o49J28k04m5Q99j11r39L53j47j54O99j54j124J60L81
$$ y = [1079, 320, -618, 189, 849, 375, 455, 658, -581, -85, 495, 133, -33, -397, -1202, -420, 1260, -26, -1327, -492, -527, 199, 418, -485, -1006, 405, 198, -38, 188, -88, -883, -155, 646, 77, -43, -170, -419, 1023, 1468, -48, -289, -194, 460, 904, 279, -577, -70, 390, -295, 221, 710, -810, -593, 209, 171, 162, -246, -1216, -478, 951, -72, -810, -275, -172, 172, 942, -43, -732, 32, 215, -304, 394, 335, -620, 35, 630, 283, 660, -62, -980, 491, 1429, -60, -372, 72, -324, 541, 300, -733, -666, 99, -193, 129, 383, -843, -835, 369, 180, 71, 231, -933, -723, 785, 853, -274, -123, -26, 152, 1251, 354, -360, 205, 281, -2, 934, 602, -978, 11, 460, 155, 578, -432, -1108, -44, 745, -233, -491, -530, -622, 221, 840, -463, -728, 116, -548, 70, 353, -392, -603, 563, 331, 425, 515, -372, -371, 564, 648, -1, 127, -77, -122, 777, 666, -273, 80, -67, -221, 478, 324, -800, -640, -259]
1211b59j41P06m83o88P45O73o15q3l20j01M75R12p77k57M05m46K11P42r31o5Q19
1232E22l71J12L80m39q32J172K12r96L46n25n0J050l09o41J76j53J46N83M3j061
1252f35L15K04p3N28l17o28L9Q86J36k70l27m03N37O42j63p28O53m99K85O53n20
1273C15n00K70r9M74K23o56m93K59M82q9L9n42j26M77N1m96K90j72k02M07P91
1294G03q57k29j47N23N22J14j106j91P47L52J38o67j28K80L74n9m33k09K7M68
1314B22Q8k3l74k15nL06M65n87o09M97L89Q7l41l47J67M96p8O3l53Q4J6K64R3
1337C05l17J13n0J26K83L01n28o82M15J05Q3m5n71L47J66K45m27m3o1r3K54J64
1359I0j43l38O5N07L60l54m93L0M75L9K1o28J60J30J14O11m24j17j99R4J02J40
$$ y = [-259, -400, 306, -177, -865, -120, 553, -62, -145, -465, -566, -91, 821, 44, -213, 192, -254, -43, 699, -232, -297, 522, 151, 263, 643, 204, -628, 544, 756, -240, 106, -419, -469, 581, 272, -369, -193, -346, -200, 383, 426, -635, -320, -116, -189, 339, 22, -606, -567, 319, 455, 185, -142, -545, -8, 634, 471, -257, 396, -103, 182, 835, 315, -185, 85, -14, 460, 683, 27, -466, -207, 275, 186, 225, -317, -443, 34, 85, -411, -121, -293, -495, -88, 703, -154, -383, -530, -7, 515, 629, -477, -668, 79, 431, 569, -98, -226, 54, 428, 369, -64, -273, -246, 222, 310, 287, -87, -302, -307, -1, 464, -123, -732, -235, 154, 241, -100, -447, -280, 216, 138, 201, -152, -68, -52, 212, 305, -12, 101, 51, 177, 460, 761, 233, -449, -34, 71, 154, 109, -462, -115, 51, 296, -131, -174, -235, -328, -74, 90, -53, -391, -326, 181, 541, 187, -306, -276, 199, 238, 259, -369, -209, -79, 35, 646, 222, 105, -94, 0, 102, 242]
1381B42l28l21L61L60Oj43n46Q1P16l00j28l08K74j06L17p6k59Q5r0J19L01J04
1403C61m61l25L04N10J12n89l12M69M84j03l05k72M6J19L4K02k66j09q5J15O54
1424E83m45l99k23L91K59j60k37q1K91M08l19l81K2N28r4j18J24k02Q8L5K09M59
1446G38j33r66K49L01J74k48m26J09K30K43l47q3J98k54J27k30J27K07m95J64
1466c15P25l60n85p2L57N53j7n40l15P51%j8j23P4K5Oj83J58N3l91K04J20j2k11
1490a16l76kO76j08J57m35j31L94j14L9k57o2k20M73J42k0M2n26K10L23R9p2l05
1513a89k8P95k36m13n7j40M94j31J02K08k88j45L5M0O1m55L3M1P28j31o73r2K23
1536b18R36o99m43K15L14k9j20l6Q4l88K09L06l7L09o86J3N66L31r9p55J85R1
$$ y = [242, -86, -407, -46, 314, 320, 177, -369, -288, 428, 128, 0, -308, -34, -140, 177, 101, -158, -73, -163, -44, 257, 361, -100, -425, -121, 389, 501, -88, -400, 69, 553, 450, 145, -127, -81, 38, 72, 274, 8, -101, -186, -71, 583, 138, -261, -484, -93, 166, 6, -231, -312, -21, 387, 68, -313, -291, 237, 143, 25, 149, -53, 35, 70, 279, 738, 605, -361, -112, 189, 363, 115, -311, -202, 28, 271, -76, -159, 39, -215, -88, -318, -191, 16, -479, -315, 410, 50, -535, -607, -250, 303, 286, -254, -569, 182, 182, 164, 41, 115, 140, 146, -37, 121, 174, -217, -13, 107, 95, -116, -492, -494, 182, 74, 231, -204, -335, 59, -55, -16, -273, -335, -555, -82, 60, 40, 82, -444, -234, 89, 188, 116, -189, -217, 578, 342, -71, -128, -268, 226, 95, 197, 405, 117, -28, 7, 47, 108, -347, -314, -273, 455, 324, -349, -441, -218, 718, 19, -424, -209, 105, 76, -44, -80, 4, -384, -175, 131, 94, 403, -283, -270, 296, 627, 528, -227, -42, 49]
1558D9L25l88j91J77j19L36j91J18j25k1k74M64n9J44p12J58N78L3m01l96M88
1579gL94l49o0j86J45J26K81k19p6O8m13J19Q33l66m44P4L67J83m34l98L5M32
1601A05K23l23p8O6j43J71J09p0j25j86j54M08M09k99m24J34M55J93l80l52J06
1622a55M31l65J16K47j80o9J96j98J13j59l33M04K50nl20j33L5L35K99p21j88
1643d00N88k41Q7j38NJ3p0K38L2P2m51O1M50K85l10j84j84M38j09k10K6J05j2
1666I1p0RL7j94j70L92J09J1k75l18K6K96Q7k27J15J38j2j02k88K64Q4M4j31M68
1690C84m7k63k37K49J97j25j42k42L36K88n60j17N71m73K04K37l02j82L5lK57
1711F5J70l83j47J27L48j07k46j06K13N04l59k61L63k95n9K99J03pl62l96N65
$$ y = [49, 374, -14, -205, -28, -147, 189, -2, 116, -9, -30, -304, 160, 101, 245, -467, -309, 269, 302, -99, -495, -7, 387, 38, -22, -208, -63, 63, 344, 125, 49, 117, -296, -177, 656, 290, -154, -80, 287, 470, 36, -362, -327, 105, 328, 5, -73, -7, -150, 21, 130, 60, -65, -251, -405, 3, 412, 113, -311, -177, 278, 471, 91, -261, -155, 276, -89, 27, 274, 94, 25, 221, 23, 136, -23, -356, 48, 298, 293, -27, -160, -125, 210, 509, -212, -400, 188, -53, 34, -104, -99, -86, -156, 82, 114, 186, -265, -204, 246, 531, 221, 37, -147, 291, 182, -28, -2, 103, 91, 21, 30, 67, -127, -297, 95, 204, 215, -60, -378, -352, -56, 31, -196, -81, 57, 45, -57, -345, -81, 3, 47, -84, 384, 337, 74, -163, 86, 283, 158, 16, -226, 110, 398, -162, -279, 292, -181, 23, 260, -42, -224, -189, -192, 65, 235, -148, -295, -168, 180, 73, -173, -279, -66, 438, 79, -182, 181, -114, -173, 126, 229, 222, -140, -536, 29]
1732B9K5K14p99L28M59M1l12k52RK99l0q4j87J53j91Nl5L97l1k79mN85j26j56
1756E8n03L81J74j13j14K9J75J89k52k62J89Q6j97J67K25l0m18l16M44M70k37
1777A45m45O5K78K70p5n13K94K09m18O8L55km24k76N61L4m4n41L03K85Q9m42j9
1800b43M37m5j44J6J02M0J62l82k44N97j60k74J77N03j87m74k50K60O47m38m24
1821c24J01M78k54l52K23M07j55o06K38O48k20l80k37O88K94n55m13L77M02n2
1841C08o85r6N73J19n85N5M44R6j16m61M08K41l41m19K47N61J42p54k91P28J07
1862B81m71NO2L06M9j77L4M2j29j17m5M61p5n27l67Q45M76n80m13K08K88j18l25
1885b87J0L67J62m77j4L87L33p73J34J36L85k19k92p1N67o0k04k18K22L39o77
$$ y = [29, 54, 268, -531, -203, 256, 297, -15, -267, -258, 41, 11, -73, -260, -107, -298, -293, -328, 69, 38, -241, -245, 340, 214, 58, -445, -64, 110, -3, -117, -88, 87, 276, 24, -238, -49, 37, -160, 7, 232, 202, -216, -532, -88, 382, 145, -300, -235, 43, 313, 238, -275, 19, 228, -190, -122, 233, 231, -193, -469, 92, 126, 82, -459, -156, 129, 218, -224, -243, 194, 149, 5, 21, 123, 163, 325, -57, -301, 296, 136, -138, 39, 542, 355, -119, -369, -109, 538, 100, -324, -223, 255, 1, -351, -128, 279, 124, -482, -244, 404, 184, -196, -433, 255, 549, -6, -419, -42, 360, 308, -377, -473, 100, 219, -366, -311, 133, 229, 113, -348, 60, 301, -40, -459, -212, 349, 491, -263, -554, 174, 281, -190, -185, -123, 183, 232, 55, 89, 131, 2, -115, -160, 301, 226, -301, -668, 177, 653, 73, -340, -132, 156, 38, -287, -277, 90, 252, -225, -239, 148, 481, -292, -158, -22, 363, 144, -148, -219, 348, 288, 84, -134, 88, 427, -250]
1906b50k34N55M5j78k17L11K44k03k76j6Q97p35k84l0N82J93o48k58K47O71j18
1927B98n62K65J15Mn36J1N64K14r08K47M88L27q23j46O28K90k33n20O4L47N2m71
1949b85j06O41K39n84n51O07O54n45q81O66Q15m23l36l98O52L04n34j58J17L96
1969B90m09m15N97q0j12m10N26K32l7n07m7M91K6j61l62J47O41L9n81K7L50j33
1991A12l77J07N88l75k73j34N91J49l33o25L69M38P4k93j85K35J90k88k88M27
2011A09J22l32JM01N1m86r5J98K16j58n90K12N35M4j83j91L3M23m39l8J44K04
2033A81k67l60L13O66n40l61K88J91M73n07j93R3rK00j60m49M11N56o97j52L70
2054D7J3j67J2K28J02m83k27M24L86m42l28L36L18j61r8J11P8K5r7k59L5K28k08
$$ y = [-250, -484, 71, 116, -62, -279, 32, 276, 73, -203, -219, 678, -57, -341, -371, 211, 404, -244, -502, -255, 416, 298, -264, 1, 116, 120, -416, -405, 159, 373, -535, -288, 200, 527, -296, -442, 186, 476, 243, -277, -213, 134, 186, -285, -391, 250, 489, -95, -646, -39, 615, 70, -811, -145, 670, 247, -89, -487, 165, 469, -65, -223, -106, 290, -119, -534, 63, -17, -129, -539, -13, 219, 182, -325, -372, 119, 145, -16, -378, -231, 410, 449, -132, -105, 245, 112, -265, -158, 430, 55, -218, -352, 239, 388, 55, -570, -201, 237, 311, 18, -167, 68, 258, -30, -318, 109, 231, -101, -100, 301, 352, -134, -229, -31, 185, 27, -563, -351, 184, 228, 45, -146, -113, 310, -129, -167, -23, 181, -86, -446, -133, 533, -7, -368, -80, 111, 584, 77, -116, -23, -32, 168, 8, -441, -30, 526, -171, -323, 47, 60, -107, -95, 133, 235, -248, -475, -51, 335, -107, -435, -99, 219, 58, -40, 71, 149, 174, 77, -182, -147, 81, -127]
2077a27k90L41K29M6o38Q2M43J33j85j20N3J86j27k9m9J79j53k12K37lK2l32K90
2100b4K27M17q06l86O24K40k71q6r1K18j25J3k60K14J42r7k97N04J27l18j11J13
2122c3L03N4o80J67M28J40l03j19J99j9k48J0L85j13j11l72J17L26l09q6KL59
2144I7M8p1j68r1J02J46JJ6k15Q9l3L19%k21k70J19J99L7k52j12M17o6j59j40
2168b08R4L37m7l75M8J44k82N54l86K61l16l3j19K71O7j46O8J83J0n2l63oL82
2191H6k4P4r4k12J89n2m3K05J38m64K6J66O4j37l23L49Q3j2o9j59K08oJ05j96
2215i8k8L79m08R6J70k56J80n5J6N4k4m3j31J19M34l48o9N1M2J41r8n4k05L75
2239B40l79m3L06k19Qm6M20l60N7k82J49K55j35P3l11R8K14k90J19L18j95k42
$$ y = [-127, -417, -76, 153, 199, -439, -357, 86, 219, 34, -86, -33, 153, 26, -3, -52, 127, -26, -238, -1, -4, 18, -314, -24, 203, 620, -186, -572, 52, 292, 21, -65, -156, 62, -63, -50, -310, -96, 46, -51, -348, 156, 283, -35, -146, -33, 270, 324, -356, -189, 239, 379, 76, -43, 156, 137, -111, -101, 284, 171, 60, -312, -195, 131, -178, -264, -262, 97, 145, 74, -94, -185, -83, 63, 64, 80, -135, -46, -79, 240, 240, 19, -251, -132, 67, 104, -148, -260, 157, 91, -68, -208, -114, 223, 176, -199, -151, -7, -289, 265, -121, 140, -176, -209, -328, -57, 10, -136, -68, 115, 125, 73, -290, -296, 86, 62, 136, 42, -170, 19, -33, -76, 129, 267, -197, -171, -5, 59, -78, -401, -52, 31, 19, -50, -209, -1, -7, 98, -98, -126, 253, -155, -59, 111, -145, 35, -20, -4, 50, 26, -17, -148, -29, 405, 57, -12, 39, 81, 222, 124, 70, -135, 240, -139, -182, 124, -95, -87, -133, 287, -73, -16, -298, -149, 106, -29, 44, -267, -169, 45, -245, -126, 192, -3, -245]
2261b45j69M27K09l3m58N3K78N6r3K1J12r2J69l45K2N5NK8K75k51k91L5K29l1
2285c4J15j23k95Q8K58J30k11k01N42m63n3L83k17qj49L05J40q5k60J79j66J42
2307A7j39m7o3R3N4o3M6o9J46l2M2K50l37n4k00O25l12o9o8J70K60k72K23l37
2331a36O3R9n0J92l24K18m00K04N23l7l98q7M04q1n9j99j9K93j91k0L46k56l03
2354b18l8R4K37l22J82j05j8K84J00j96k38L03J33L5j59l8J41o4m8P7k7r5J12
2377A32j62N6n9L8O4j05K33rj63Q4Kl10J34o3J67J84k01P5Kj13j19N5J2J28K00
2402B62l70L16j19o1O7m13K59N1j61l40K98L76l62L01o7J62j98J76p1J43j6j00
2424A33k47O5K19m33J29J73L42q3k57j66M1RK28k50K45r0j96K06k06J02R5j6k19
$$ y = [-245, -414, 13, 222, 189, -269, -216, 62, 118, 25, 46, 158, 66, 235, -110, -88, -33, -28, 0, 275, 24, -267, -232, -3, -34, 81, -42, -337, -249, 9, 139, -72, -273, 269, -194, -247, 136, -81, -89, -238, 67, 207, 122, -138, 41, -125, 17, -122, -169, -232, -139, -85, -148, -102, -171, -25, -57, -15, 235, -102, -156, -356, 269, -43, -112, -180, -10, 250, -22, 201, -136, -73, 26, -24, 168, -156, 62, -338, -134, 389, 352, -46, -133, 271, 190, 131, -68, -87, 206, 15, -5, 341, 85, -218, -256, -162, 75, -247, -65, -170, -188, 96, 196, 0, -238, 65, 198, 233, 74, 36, 177, 113, 65, 142, 115, 20, 132, -30, 26, -33, 5, 69, -36, 197, 188, 25, 109, 111, -199, -65, -128, 39, 223, 22, 97, 99, -14, -133, -78, -66, 62, 262, -108, 208, 89, 28, 95, -318, -59, -8, -169, -509, -211, 165, -197, 104, 37, 199, 1, 177, 106, 249, 233, 133, -114, -49, 170, -263, -134, 39, 381, 298, 41, -125, -84, -75, 153, -97, 148, 58, -138, 68, -138, -36, 59, 43, -176]
2447a76N7J69j5j1j42N1O1m9j0L82k57k9J8Lmn3L3J9M6J20k34OO6K5k33K62N6
2474A61j45k5k17Q3r2K93M3k02Q5k5rQ4N5j41j25K68L5m3r8N6j35lQ4O2ok46L77
2501A74j16L8l87J66J72M3L7M0k08p3j50L77j04N9J78k38M1k21Q0mJ06q1K15r3
2525E1r0K36j64j75K05J30k02j31p2L62j69n2K75j29k06R1l0K58j03k97J67Q6
2547D1r1K17k88O1j59L22o0m0j38K9j17R9Q9J62m0Q1M4l50M0P3l8j36J38o3M4
2572h0K30m38M03m63N31m2k46J35l19K33K34k26k9k30K80L16q0l52J21l7J56K13
2594C10%k30l32J97M14k05j04j59J60M42k29r5j48k29K36j22r7L50o8k44m0J90
2616ck46K28N1j62J97l5j45L06j54k01K41j30j35Q8L52o7m28M57l25J55k44K74
$$ y = [-176, -119, 50, 35, 24, -118, -67, -6, -55, -65, 317, 60, 31, 49, 52, 48, -5, 28, 47, 93, 213, -21, -15, 51, 76, -157, 105, 161, 16, -9, -226, -143, -235, 58, 101, -101, -16, -41, -50, 34, 89, -52, -177, 91, 126, 83, -15, 41, -94, -97, -13, 49, 43, -203, 174, 58, 96, -291, -125, 47, 90, 127, 167, -41, -114, -264, 113, 9, 68, 246, 8, 49, -172, -92, -96, 10, -71, 144, 51, -39, 197, 33, -142, 63, 193, -9, -140, -212, 150, -19, -71, 204, 75, -131, -40, -70, 188, 85, -212, -45, 41, -50, 167, -121, -60, -219, 103, 43, 3, -135, -106, -223, -124, -35, 127, 87, 168, 212, -138, -98, -25, -63, -199, -61, -124, -80, 150, -288, 115, -348, 183, 141, -105, 30, -289, -56, 178, -48, -77, -307, -27, 289, 209, -143, -22, -59, 97, 310, 310, 80, -252, -55, 359, 154, 50, -109, 51, 493, 264, 169, 21, -208, 28, -94, -191, 159, 91, -153, -193, -3, -249, -21, 30, -132, 65, 30, -115, 191, 37, -164, 77, -53, -188, -100, 252, 185, -243, 214, -111, 44, -200, 74]
2638G4M8k45Q8R8m7J16j61K61o6l9k63J52K5K99l69N8r2prK8J10K81m29PK3K36
2664A77k04K40j29k19L60n06M01K4l7j42J6Q6j59J84j90p1J25M00l41M2K6K77
2686C60m63M5j8M07m89j6M2K5K03k64J97k23K51q4n0J46j39J34P8j05l4m3K05
2709A65o7M3q5o4m4J58m95L39o0L25k69MJ77k83K25m6j27L07q9kL1j94j22J46
2733b7J85j97k08J69J70j26k3J52l02L88l87L33j13j0K01l78J18P0o8MP3O9k31
2756a38K58r1P9M2n6j65n8K39k25Q0J21Q8k2l47J9K40j16LK27k64K67k46K45o
2780A74j90J67l65l9J69Q7K23L4n8l55k06M58j34J3K57n4n17L76p4n1M29n42J65
2803c3J66n11M56n8q4J50j34o3R5L54j92k67M6J67j43J36J31j30k26K19o5nn3
$$ y = [74, 122, -123, -35, 63, 16, 132, -29, 232, 166, 127, -136, 16, 41, 340, -29, 29, -63, -70, -79, -51, 59, 340, -89, -82, -59, 177, -27, 213, 84, -135, 225, -281, 120, 144, 107, -35, -19, 67, -92, 92, -98, -169, -44, 356, 15, 57, 83, 360, -103, -58, -76, 331, -158, -174, -132, -107, 96, -168, 29, -194, 57, -27, -77, 69, -70, 64, 142, 37, 3, -40, 165, 98, 141, 56, -8, -52, 106, -389, -50, -110, 215, -54, -50, 127, -156, 69, 23, -104, 203, 114, 112, 143, -51, -173, -27, 158, -39, -247, -78, 92, -34, -57, 95, -207, 181, -206, 127, 14, 4, 205, -173, -55, 15, -53, -49, 24, 93, -138, 120, 29, 108, 150, 94, -71, -129, 110, -115, -35, 86, 174, 152, -195, -176, 64, -52, -49, 178, -86, 181, -65, 180, 174, -16, 151, -214, -253, -84, 3, 226, 260, 202, -153, -359, 99, -35, -22, 235, 181, -336, 40, -34, -85, 344, -198, -33, 133, -378, 78, 20, -64, 86, -48, -111, -16, 338, 146, -121, -75, 92, -51, 85, 216, 86, -140, 79, 14, 9, -44]
2826d4J14l03N81k81m92N01L%j12j66N9N7K12j16Q3k60J71j18j51L29k52LL83
2849B01n41M21rj46J74k65L09l18M31k61L25k80Ko0N8j1n1p1J34l62N95k46m3
2872a4P6j82M38n43K16k98L88Q0j17L6N5k05J72L5j33J16J09j45K2m30N63k6l67
2895a54q7L73Q6m47K38n7N6K30l44J08p3j16K52j83n5L04k29j9K35m9j10J8l1
2918e4Mn5J8O6O4O5j13N8j33k5L7J6j49J18J02k27J67L31j59j48N6N0j36J3J36
2943A02J45l26J73P0k45O4Q5k62L55j21k48K44N0k43K32p1m9j73K31J26m6j1j96
2966a14J31o3r0K31n7j82J61k52J77nm43M06K43k64K80k46J46j64j45K72K9jj60
2989a10J76J14k76j53K85o1m7L13l72l5K63p6l59N54l26o1p7J46Q0J20J10j43
$$ y = [-44, 70, -233, 348, 67, -425, 76, 79, 79, -33, -199, -140, -83, 129, 13, 96, -164, 7, -111, -262, 67, -185, -182, 201, -340, 81, 72, -74, 100, -165, 144, -174, 257, -4, 321, 41, 43, -17, 41, 30, -21, -92, 42, -320, 275, 29, -14, 62, -120, 318, -225, -9, -307, 81, 161, 44, 80, 135, -70, 102, 137, 4, 120, 229, 84, 106, -324, 239, 213, -154, -241, 132, 218, -229, 9, -48, 8, 238, -106, 2, -71, -187, 65, -118, -173, 131, -98, -117, 118, 69, -41, -23, -54, -50, -105, -87, -21, 43, 108, -5, 53, -80, -105, -68, -52, -201, -83, 19, -208, -41, 290, 131, -17, 39, 89, -47, -34, 102, 247, -79, 94, 164, -81, -17, 68, -194, 161, 40, -208, 36, 86, -157, 75, 4, -45, -218, 13, 139, 93, 82, -114, 17, -46, -136, 95, 38, -144, 17, -235, -58, -63, -506, -100, 143, -121, 159, -87, 59, -105, -250, 22, 51, 50, -110, 66, 180, -96, -249, 36, -25, -72, 241, -131, -166, 97, 21, -338, 216, -110, -171, -248, -102, -22, 98, 208, 65]
3011F5R4q8r0J99j94p7M4Q6j68Q5O2r8J42M4l1L5j01j43n1J46K70j32j53P1j3
3036Dn1L48m92J13oJ31k67M68j43l87L94R8j53k8k17J00J40k85M60o4j80n6J29
3059E6j34n9K43k30K04J18k78R6l9j0P2r2j55J78K67l74j20J06K03j77K41l61
3081b45NK67J50k41Q5k6j73J32J12j05J06m3j05j02J90K8J7j78L03j74p6J18%
3104D5k31K50j07J63l59L03p2J76j19j04R6j28J59j81n2J84k34P5MK58j58Q6K32
3127B86l66J09j2Q3k05J25J81p1j9k64K38j92o6O6J05O4p6K57j97O0J4j67N3j5
3151iK2K4j56m7N2P9L3j56k3K00J23N9j03j39j67J61N6M0J49k44J82r9l2j0n1
3176e6J56j81N8Q8J10j10j3l9k6j16L2J1J17n5N3j07j48M72n9k41j08L19l65L03
$$ y = [65, 159, 71, -19, 180, -14, -91, -47, 39, -129, -44, 18, -80, 62, 106, 75, 110, 9, -134, -185, -39, 231, 99, -54, 17, 4, -47, 301, -191, -78, -84, 47, -220, 248, 105, -282, 112, 210, 57, 29, -188, -88, 52, -233, 227, 163, -17, -73, 56, -78, -137, 106, -124, 80, 198, -80, 16, -23, -33, 39, -53, -208, -30, 237, -137, -257, -151, 52, -125, 116, -245, -240, 27, 177, -64, 21, -5, -178, -46, 66, -39, 67, 24, -81, -183, 7, 35, 52, -126, 177, 3, -73, 45, 45, -186, 64, -43, 120, -239, 64, -8, 168, 49, -55, 41, -87, 72, -109, -161, 23, -211, -136, -132, 126, -32, 54, 286, -80, 29, 17, 100, -105, 20, 201, 130, 111, -153, 85, -107, -173, -107, -2, 62, -14, 243, 46, 106, 120, -47, 6, -9, 13, 37, -119, -166, -114, -35, -2, -158, -181, 19, 142, 201, 98, -41, -208, -47, 9, 49, 198, -46, 136, 37, 5, -5, -56, 100, -81, -23, 65, 175, 65, 52, 13, -13, -129, -97, -86, 31, -24, 29, -78, -226, 246, 187, -54, -162, 157, -208, 95]
3200I5l1k23J96M7J71l98L74k55l8j48L60J64l99K47k51L38j49k08K4J22P0Jp3
3223C6J57j02n0q8nK83J67n09l6J3j06K09nJ92l0j40k27L59k07k1J86l29M52O8
3247B67j31k64L34q5q4J16k74Q8O7N6r5J44r6k03K86k93J00j01J59l58K46K34
3269A13L0j61Q1j29K47l43O4K18J56k04k27K36J18k24l3J36k38L30j71j70J01
3290g0j35qJ69j68K70k57J53K0J6p2O7L1j11J6J4J22j27J33j17J13J3J06k22K5
3314a9q7J80n7R1k48K04p2J3j34L17j78k5O6r9K49k02K85l34K51n2l18P8J26O6
3338A01j89J25J34l94L90k40K28p7j26l5l2J42K94m93K13q6j90K99j89R1j86L78
3360A58M2l23K52k14j78K08J96n1O0k02j3J2Q0J12j95R7r6L09k45J40l72j54K98
$$ y = [95, 64, -159, 37, 84, 255, -143, 231, -24, -62, -210, 150, 314, -85, 162, -89, 249, 100, -108, -84, 38, 108, 109, 36, 193, 91, 41, -47, -52, 231, 398, -111, -147, -134, -240, -31, -36, 156, 126, -14, -241, 118, -89, -110, 76, -253, 199, 267, 136, -128, 206, 121, 37, 153, -121, -33, 34, 90, -5, 139, 43, -160, 126, -167, -67, -168, -9, -367, -121, 113, 143, -18, 63, -66, 181, -162, -98, 120, 276, 72, -155, 81, 199, -25, -58, 78, -160, 170, -1, -171, -70, -205, -213, -44, -212, 58, -199, -46, -26, -10, -82, -15, 16, -95, -79, -65, 57, -70, 63, -54, 59, 72, 178, -44, -19, -106, 74, 17, 108, -140, 64, -8, 5, -129, 188, 10, -15, 51, -48, 201, -1, 284, -50, 201, 149, -169, -91, 35, 101, -88, 37, 171, -223, 167, -73, 155, 78, -48, -83, -115, 27, 321, -172, 41, -45, -235, 64, -125, -34, -220, 158, 200, -123, 129, -85, -263, -55, 141, 90, 150, -52, -65, -53, 27, 139, -56, 41, -55, 254, 9, 149, -223, -377, -79]
3383g9o5K23k98K65j46M9k4J33M6m7k51L15O6m20K04j67j8K98j33J57j19Q9k49
3406a71J52j5k75Q3J84M88n14J39p6n1j51J82K2q0Q9j24J68m7o9J61j31J9J87
3429A70N3l28K77k12Mm6j03K19j6l9l8l3J17Q3j46O0J62k54M6J53o0l63K86J6
3453HJ83k69qp4J74l1k6j30Q9J36k3K1m1J40n6l72K10J02N0o2l8j25P3j1J90k76
3479a66K03J79j72j82M4J67j48J50J51K3l35M51l23j1J60k52J81o1L1R9q6J2j53
3502c8q3K7J1J26J30l42J98j37J65j82r9M8K45o0K2j46K5J39R6Kmk17k0M1R0N
3528D2L0Q8P9j45k77l4M83k61j67L0R9J39m22K43m7o8m6O9J42J84j3j44k60J73
3552h3j73K10K39j25j7k13P6n7K57k91K03j24m2K46l1r6j8P4k92L29k16J03K21
$$ y = [-79, -144, 79, -219, 46, -100, -51, -75, 58, 104, 57, -194, 121, 187, -233, -29, -196, -214, 84, -49, 108, -11, 78, -171, -19, -34, -309, -226, -42, 446, -68, 71, -5, -56, -207, -25, -3, -83, 6, -118, 50, 3, -66, 95, -36, -17, 170, 223, -105, 172, -40, -36, -82, -185, 34, 18, -21, -59, -92, 25, 108, -38, 22, 184, -70, -24, 129, 69, -294, -8, 8, 191, -78, -86, -160, 14, -17, -43, -173, -84, 52, 29, 50, 9, 149, 93, -279, -69, 33, 83, 21, -17, -142, -69, -80, 110, -166, 37, 216, 44, -138, -94, 73, -75, 75, 226, 249, -86, 365, 42, 31, 191, -61, 120, 59, 90, 189, 103, 115, -38, -121, -94, -83, 43, 173, -169, 29, -108, 57, -125, -224, -176, 69, 9, 31, -115, -90, 49, 145, 147, 143, -74, -94, -53, 37, 42, 72, 160, 239, 94, -183, -217, 266, 5, -162, -132, -33, 106, -316, -73, -120, -188, -234, -165, -23, 161, 148, 4, -256, -83, -256, -46, 193, 68, 51, -162, -86, -143, 114, -177, 26, -98, -140, 106, 75, -21, -39, 35, -257, 72, -144, -41, 180]
3575A80k69j47L85l0j94j92K36K18k35K24k84L49j70q2r5r2L59k21J35Rj16J41
3597A09l2k77o9K26J85k41J04J29k47J61p8l06K49R5J14l41M00k43o2J61J19K0
3619A76J49l22K99q4l11M3J94j40k50N2K69K2K36m15J66j95K58k76J51l9O3N6
3641A02k92J57J70k54p1K55P0J1k33Q3j50K27r5j27L07j47P9p8l0m6L28l19N3
3664@j50J67k9o9p5K69j99L9R7n6m1r1K33lN2k35Q3k5J3r2J02r0j73J74k22L83
3690F2J8k6j7p2J14k72J29J20J65j13k14M50l80l8j69K91j4j43J47J52l62J53
3712a9J61j27k45L60j14j85K47j14n9K9J8l4o2J62l06N93j58o6j15m2Q9j3k3q8
3736a11r9n5K43n0K76l06L36n9K89k99k26O6K02j22L7r5O2q8N3R5j11k46R8J31
$$ y = [180, -89, -236, 149, 119, -75, -267, -31, 187, -48, 176, -108, 241, 71, -11, -106, -198, 161, -60, 75, 84, -32, 109, 77, -200, -269, -43, 142, -99, 5, 134, -113, 48, -30, -336, -87, 8, 122, -219, 181, -62, -124, 37, 156, 176, 325, 3, 302, 218, -93, -50, 144, 4, -246, -194, 75, 97, 333, -82, 84, -111, 147, -129, 22, -17, 46, 102, -190, -33, 137, -117, -188, 67, 137, 148, -85, -2, -152, 75, -20, -147, 160, 13, 92, 14, -16, -62, 266, -53, 0, -150, 17, -12, -81, -156, 113, -86, -47, 50, -6, -47, -138, 95, 92, 144, -91, -8, -33, -20, -112, -10, -100, -273, -99, -321, 62, 80, 54, 37, -35, 79, -193, -64, 56, 221, 108, -106, 344, -36, -74, -243, 48, 34, -109, 38, 190, -172, -19, 142, 15, -230, 130, 16, -169, 78, -36, -95, -66, -48, -82, -144, 18, -288, 305, 147, 81, -34, -76, 13, 0, -23, -111, -210, -265, -22, -72, 204, -102, 234, 175, 464, 165, -61, 5, 207, 85, 122, 27, 89, 1, 54, 149, 38, -208, -110, 21]
3760B1K68p2J06l61J92j85k9J26k04q1J14n3J33K50k97K08j99J23KK13r0j03K72
3783C54k97N0Q6j42N5k9j28K61j69k9K13k54M5L25j46Ol33J85J49l26K31k5j14
3806c2k07PJ97r1J02j01M01k62J3j11K35k15j09J68j41P0J29R5q1m3j98n6K49
3829A9J89l70R4M67m73K73l80K12j53J01k6O2j60J99j43q6K53k30L68j50m3J79
3851B02j69n5k29K22Q2j5k6r6L4j10J07J73q9j95K34J07j08j40P0j36J67Q0r5
3874A5Q2j33J27P5J47l11L5J59j08l14J21J59k72K20L18m16R9K52l93J68n1k24
3896b45J75p5j82L99j42M27n55K37K63q5m58MK6J26J3j89L55J83l58J5K04k1J6
3919A33J12j08j09r5n1J88j11K00k3l38J8J92J62j97K80l04K13j05n0j73K2J47
$$ y = [21, 289, 217, 323, -38, 154, -31, -60, 66, -138, -219, -105, -158, -25, 225, -72, 136, -63, 60, 62, 275, 185, 82, 354, 57, 107, 193, 51, 106, 77, -51, 210, 41, 12, 225, -29, 16, 341, 195, 201, -132, 53, 202, -124, 107, 82, -32, -239, -232, -35, -126, -24, -125, 276, 14, 27, -84, 151, -64, -173, -5, -146, -76, 53, 148, 67, 24, -174, -230, 19, 208, -162, -68, 399, -74, 199, -181, 31, -122, -21, -47, 15, -145, 54, -89, -175, 78, -152, 216, 66, 23, 202, 33, -22, -251, -29, 53, 38, 12, -84, -50, -160, -53, 120, 31, -164, 70, 177, 69, -71, -1, -137, 30, 110, 15, 97, -36, 91, 166, 313, 2, 37, 196, 88, -226, -105, 54, -218, 2, 320, -96, 3, 255, -138, 30, -21, -245, -70, -145, -327, 72, -70, 357, -198, 39, 302, 217, -241, -237, -211, -85, -72, -261, 94, 277, -81, -66, 138, 117, 133, 245, 137, 28, -67, -118, 70, -41, 159, 136, -202, -184, 8, 170, -27, 253, -51, 162, 57, 7, -166, -144, 3]
3941Cj84J62l2N4k38o9l1L94q0l8K2j6K04j24q0K7j59L98l15J31k37k7K37MJ21
3966A27p4L4L2k75j24L65L2j49k8q9K33k35O%J19J32k22L87m41L09m36M21k54
3989a30p4J12L9PN7r8j76M16q7M9k47K07Pj7o68O42l20K66K1K21p0P7l54Q9O1
4014C0r2j04K71j21k7m5j2L22l30L00k76K13R1k65L13q4l79M24j36j79K1j84L75
4037A26j51k17J20nl0L16k78J65o0K4j09L4L39j16K29m80J96l7l78J58J23n3l0
4060a14K77j10J5o6P3j31m4K15n26L33R0K42j59l67O5K13m6k0o7J76O3l03K78
4083H7O2j61K8m9l5J50l22J00L53n26K47K70k0j26q6J23k10L66j94j47%M6l9M4
4107c9k11L06J7J62j64q2j09J41nK4m0NN1O6qj47q7RJ22O6j78K33J10m73M00j84
$$ y = [3, -181, -19, -51, 3, -235, -304, -335, 59, -21, -59, -37, -53, 151, 27, -53, -26, -185, 213, -102, 29, -208, -235, 2, 6, 127, 53, 87, 119, -156, -280, 85, 117, -32, -60, -149, 84, -151, -145, -145, -26, 106, -116, 271, -170, 139, -297, 124, -130, -204, -92, -53, -46, 11, -87, -263, 153, 66, 115, -132, 75, 82, 65, -603, 39, -281, -15, 6, 227, 157, 234, -120, -31, 30, -62, -166, 105, -16, -43, -88, -100, 222, -108, 192, -84, 129, 220, -45, 268, 184, -195, 229, 93, -86, -65, -249, 126, -25, -242, -122, -127, -157, 159, -119, 46, -14, 10, -99, -65, 274, 158, 387, -93, 103, 66, -312, -154, -31, -84, -114, 163, 53, 68, 2, 75, -56, -100, 115, -411, -78, 12, 254, 95, -272, -207, 6, -40, -60, -127, 49, 112, -191, 87, 149, -12, 16, -33, -68, 82, -240, -140, 213, -313, -66, 204, 184, 58, -28, 95, -115, 251, 57, -90, -90, -44, -83, -39, -250, 56, 73, 235, 71, -11, -120, 21, 16, 40, 0, 5, 56, 122, 114, -33, -120, -111, 11, 77, -101, 132, 242, -231, 169, -15]
4133a5O3j13N4L6R8j62L90o36M08j24k2L32n6l17l7m8K13k29K69k10J51O1Qr8
4157A6j04J66j16J33K1J4k0k63J06k24K29P6o4K61j35k18k92K41J33j2K01k45
4179i6J71j18p2N0J40m22L52p9r9m8M17m01mR8r9K10k58K12L2N8j91J40k1J0n2
4204g0o2R4L6m4J13K6J66j42k81n3L04q0j87j4kK04l9O0j62K60j03n5O5Rj48L71
4230B66k39j53K01O6j7k7k27JK13K5r8j2q3J05k78L85j26m9p5J07n8m0K45j71
4254c9r9J76o9J02r0n0rJ89nk85K17l28M20j28j50j2n5Q2K14N1j16m7J12O4l86
4279b41LK69k28J28K03k47K10k81K57l07K13R5k69J93j37R1J08j5l3J81j24q3
4301a4qK12J2k03k19Q7J31M0K1l6n8%K49k74K34k44L89q2j30o1k36R6K36j27m03
$$ y = [-15, 48, -65, -11, 25, 123, -39, 351, -285, 123, -1, -23, 309, 253, -64, -101, -149, 64, -165, 104, -106, 45, 106, 114, 16, -88, 78, -38, 95, 116, 130, 110, -153, -47, -271, -42, 34, -30, 231, 96, -122, -414, -173, -40, -52, 149, -96, 75, -43, -115, -65, 75, -347, 5, -74, -173, -221, 196, -205, -209, -111, -210, 0, -258, -46, -14, 44, -147, -7, -28, -18, -70, -132, -38, -2, -46, 67, 93, 259, 117, -164, -217, 87, 7, -180, -194, -196, 8, -31, 29, -133, 127, 24, -31, 34, 43, -105, 266, 27, -126, 75, 141, 124, 97, -130, -129, 84, 109, 11, -1, -84, 21, -257, 128, 2, -47, -122, -15, -73, -113, 132, -39, -138, 38, -31, 71, -19, -69, -78, 111, 106, -179, 38, -290, 130, 2, -148, -160, -215, -133, 81, 132, 16, -31, 81, 145, -241, -238, 31, -197, -69, 134, -113, 97, -184, 73, -234, -21, 74, -195, -2, -139, -48, 60, 45, 12, 193, 69, -14, -22, 190, 202, -1, -220, -133, -2, 38, 59, 23, -35, -35, 214, -60, 174, -70, 319, 237, 107, 46, -190, -94, 142, 15, -388]
4326c88M04k9R1j66J12n8m9K66k2Q8q7p5l44JK72j74Q4O3K33j61k6j92L49Nl7
4351A60O9j32p0P9k57J52N5j79J16o7J17R5k66q7K05O7k70L00j47j02M89m94J54
4374a3N9k70L30p0k89O8P8J58j70K92pl3N5r8J1R2pj73R8J61j75k3m4J37j60j58
4400a51K28m7j15l2RJ43k59J64kJ08J12o7k66j03K09J3J5O1QO6K0l4r0j98J79
4425b9K20k65O6r8jJ91l1J11k49J55j47L13k93K68j72j33N6j80J43M1J57l30M81
4448B74k43L5O8m0j87o9L4l9J66M9o3P3j77l0N1N2K63k92p2L81m16L51j48J54
4472A75l20m8J37j32K08P2l21K65J49l83K03j71K06J13j31M4J00r1K5j19M5M3
4494F9l24L56k62L28K6k00J0r6J03j78K5LK58m19M26k9m0J55l19M5J09n3J01l1
$$ y = [-388, 16, -13, 78, -88, 24, -34, -83, 183, 161, 249, 162, 87, -257, -256, 16, -158, -74, -11, 222, 61, 35, -157, 192, 197, 160, 229, 97, 27, 106, -151, 1, 56, -123, -7, -74, 43, 138, -128, -215, -10, 57, -213, 87, -60, -162, 327, -167, -13, 46, -224, 106, 36, -253, -185, -107, 51, -119, 173, 166, 133, 188, 90, 101, 193, 186, 13, 111, 272, 97, 74, 30, 167, 7, -151, 77, 30, -85, -117, -108, 35, -224, -60, -62, 46, 158, 91, -175, -278, -69, -56, -41, 20, 28, 94, 114, 80, -10, -208, -29, 191, -74, -8, -106, -107, 84, 53, 164, -85, 70, -77, 236, -57, 211, 39, -94, -38, -218, -75, -34, 123, -207, 274, 31, 66, 134, 94, -93, -162, -128, -167, -1, 48, -15, 58, -119, -149, -98, -46, 217, -75, -147, 234, -182, 169, 21, 175, -145, -193, -56, -188, 20, 92, -229, 36, 185, -198, 5, -166, 40, 153, 22, 66, 166, 75, 100, -19, 26, 69, -255, 101, -161, 167, 193, -7, 3, -93, 10, -168, -143, -140, 118, -301, 125, 96, 56, 211, -108, -63, 46, -7, 94, 63]
4518F3Q4J40k61k1K6K0j6k34J40K45m8k8k02K6N4L4k3Mn6j33RK46r9j5k03M80
4544B32l25J27j05K09k41k9L20k03o6J90k41K60m26M45j14K4m7j73M12r9j8k35
4566a03J75j61J32j70N0O5J93l77L88l42P8K29j39j19J38j4lj68J0M36m62J53
4588a1O5ql37L66L0k59L26R2n03L18q8K73m23K0R0j2K09j90K1K26op6k43P8p4
4613a16O3L7N0n1m7O3R2r3J91o1j68K15j70p3K43j87k51rK75j57J28r1J76P1j22
4638HJ07lj37k15J44k5N0L9J55j98J62k36J82P5j93J69Nr0L6J07j82J52R9l57
4662a46K55k46K99j07j02L88j34p0p3J61k64R7j50p1M58q19K73M18l16K65l86
4683b70M68k60j0K20o3k70J97O0KQ5k23K15j30K14o6j41j55J24O4J96j96j06N2
$$ y = [63, 147, 287, 26, 5, 31, 51, 35, -199, -59, 186, 138, 110, -92, -66, -12, 22, -1, 3, -53, -186, -177, 69, -30, -45, -248, 232, -93, 34, -71, 138, -103, -132, 188, -15, -81, 109, -132, 128, -298, 147, 33, 57, 10, -163, 249, 150, 132, -103, 72, -89, 43, -127, -77, -12, 181, -196, 192, -150, -72, 157, 18, -101, 37, 23, 20, -148, -138, 298, -164, -11, 54, 46, -291, 75, 105, -154, 172, 264, -239, 79, -9, 264, -159, -139, -49, -61, 148, -42, -21, 205, 199, 123, -120, -42, -116, -53, -16, 34, -17, -64, -1, 91, -2, 189, 128, -40, 175, 5, -68, 175, -12, -263, -272, 3, -154, -26, -117, 59, 130, 8, 115, 112, -25, -240, -96, -121, -71, -32, 123, -75, 87, -149, 33, 108, -85, 84, 89, -1, 35, 142, -40, 112, 211, -146, 109, -137, 162, 55, -47, 341, 207, 137, 64, 225, -39, 58, -92, -163, 295, -524, -251, 167, -149, 116, -270, 198, -62, -72, 148, 85, -185, 12, 72, 74, 159, -64, 151, 21, 235, 169, 28, -127, -3, 61, 257, 61, -45, 7]
4706Gj2j00K78k92K50J25k09R3j62R5p4k06N37m59P1J56N7Kq4J37k82J6j3J11
4730D2K22j76j40J59N3j39J97l97l4K44j34O1O0O5k63J08J27O6J00l05j56J16
4752a24Q5K55o9J0k02L59l58j86L33r2J65l16Q3k2J51L4j36K8j9Q7j32m7L02o9
4776A20j96J78K4r3nK35j45j67J89o0j02j10Q3J88n3n5p5l3o9k9J83j31K37j66
4800e2J25k02K16j96J00J90m12K70j21J38N9p5Pj22J02l4R7O3k05Q2j00K69j70
4823B9JJ4o5J40j60J48q8j30j19K26j60J31N7J63j04k60M26k86n7K05om20J41
4846a74L9J8J65K3k80J44p9K88l47J6N3J61RN7j26P3R4k62J24j15J5K98j31L2
4870I5q9k88L72k08J83j9j4k7L0j32K06ok82q4K20J12j00r0Q3J06n7J98j76p4
$$ y = [7, -5, -105, 173, -119, 131, 256, 47, 140, -22, 73, -1, -207, 330, -129, -58, 98, 155, 157, 73, 210, -72, -56, -69, 42, 264, 88, -52, 107, 160, 21, 218, -179, -213, 31, -103, -42, 18, 83, -180, -72, 55, 121, 221, -84, -240, -124, -39, 216, 147, 157, -45, 314, -44, -230, 103, 11, 176, -140, -57, -79, 72, 106, -30, -2, -21, 66, -66, -113, 189, 120, -76, 102, 126, 33, 28, 263, 118, -49, 140, 80, -22, -132, -49, 139, 86, 31, -44, -77, -146, -175, 8, -123, 114, -52, 73, -129, 87, -109, -9, 181, -231, 39, -82, 56, 115, 40, 47, -75, 27, -7, 90, 153, -52, 30, -70, 199, 29, 30, 44, -21, 119, -41, 107, 19, -111, -230, -4, -164, -33, 24, 187, 83, -177, 249, -37, -94, 111, 105, -315, -174, -135, -117, 48, 71, -209, -65, -144, 144, -203, -187, -134, 27, 36, 93, -33, 40, 134, -128, -4, -119, -104, 194, 63, 95, 6, -282, 90, -118, 65, 46, 32, 5, 35, -97, 109, 103, -179, -263, -43, 69, -31, -121, -38, 68, 11, 209, 33, -41]
4894d1l5J2k30M59j22j92K6J07R1r8K9m1J34J43k46K26k44J12o2q9M2N7L0R9l87
4919b20M04lk74J77q6j94J17K69j68o6Q3J17l2J1j91L3j48K10j99J06K96k25J14
4942A31k1J38k48J82k02l8j15K01o7kM8J13j69J67O7k52J9Q2J05j96K0J10J00
4965A73j64j75J20q0j13J75K95l96k12O69l01K14l49Q5k2nR5k8J4j28p1K57m1
4988A2j20r1J53k30M33J0k76MJ21P1k48J44K01r0J65m50K34n5mP9J6J34k32J27
5012A08mJ44j36m6O6n9K31j17p7k76J71Q8k38K05kK5l32L44l62M31j64r0K75k03
5036a8r3o1J53N7K22j91j86L57k78R9k79J93o4rL72j99o1j75M58m37J33%k69L7
5060b39Q3j28Q7J58O7N0p9j00K87l98L73k8j20J69n1k91J99j45R0J64j67j72J04
$$ y = [-41, -76, -64, -294, 165, 43, -149, -123, -16, 75, -23, 6, -35, 99, 242, -4, 222, -22, 90, 28, -61, -19, 38, 68, 167, -220, 184, 181, -93, 84, -2, -196, -79, 190, 22, -44, 39, 156, 124, 135, -56, -23, -171, 39, -160, -54, 242, 17, 131, 110, 248, 0, 182, -20, -58, -173, 28, -39, -41, 7, 120, -49, 118, 185, -67, -48, 34, 139, -57, -37, 73, 173, 9, -166, -46, -126, -239, -64, 231, -165, -377, 292, -9, 205, -144, -59, -81, -86, 9, -19, -5, -133, -204, 53, 12, -108, -199, -46, -276, 157, 167, -109, -105, 16, 87, -161, -17, 184, 94, 259, -191, 43, -12, -16, 63, 79, 213, -19, 108, 104, 248, 112, 66, 132, 73, 304, 187, 110, -166, 5, 93, -145, 60, 58, 83, -249, 95, -267, 164, 0, -90, 185, -18, -111, -172, -19, 38, 260, 69, -117, 240, -38, 61, -218, -25, -89, -98, 274, 75, 14, -161, 297, -140, -7, -7, -276, -239, -156, -284, -197, -39, 28, 78, -1, -101, 186, -212, 161, 133, 13, 182, 131, -160, 39, -106, -16, 148, -19, -191, -87]
5083h7J24L51n29K31j79J99j33n6K29k09%R2L22n47L05j92K71n0n5L2n4o4L6L4
5107G1Q6j38J05j00j71J70J69l38M07j91k1Q7Kk14m7Q4J01k5q5L02r7l11j40K34
5131f0K26j33J27j08k98J17K32m71K93J44j55K51k13o5K95j72J74r6j06L9j06
5152h5n2J35K14k6k85J9j89L50k33J28M0r8l4M26k84l3N5j21m5k17L04Q8l9J44
5176A62n6J18l73M1l6O3J33j15k5o6K08r2j2o7j6J5J57j11K99m65M70l5l15Q0
5200c8R6pk51M85l34l31N92m31k06N96j14j44J42J69j24j3j39P3L9Pj08R0k61
5223b12P7J36r1rO7M5J97j23om4Q9R3L3j49k18j07K28J91j07k89N13k65N0n3J08
5248A54k47K57j87J35k38M2K82k03J52l2J7P7j71J14j94l0j96M35l1m7o8r9n6
$$ y = [-87, 37, 388, -141, 90, -89, 110, -23, -79, 150, -59, -59, 33, 355, -192, 113, -79, 192, 142, 87, 119, 65, 1, 37, 71, 157, 19, 124, 24, -147, 23, 192, -146, 261, 70, 49, 136, 138, -76, -123, -39, 62, 37, -48, 254, 157, -154, -294, -60, 166, 33, 160, 52, -246, -129, 103, -368, -75, 69, -86, 165, -48, -113, 182, 10, 184, 88, -18, 21, -85, -137, -2, 212, 186, -99, -80, -269, 81, -152, -24, 16, -82, -116, 310, 26, -7, 48, -73, -118, -335, -31, 57, 18, 162, 106, 224, -149, -108, -144, -81, 52, -63, -88, -154, 54, -38, -50, -117, -133, -118, 39, -72, 227, -238, 232, 197, -118, -38, 58, 51, -200, 285, -49, -380, 212, -219, -425, 171, 57, -87, 55, 224, 100, 87, -52, 21, 60, 67, -41, 49, -212, -135, 1, -90, -99, -32, 13, 210, 87, 81, 37, 126, 219, 252, 103, -115, -222, 6, 197, 90, -199, 314, 49, 99, 46, 154, -93, 164, -23, 112, -126, -84, 198, -5, 147, 115, 132, 209, 38, 152, -42, -72, -268, 167, 136, 89, 21, -78, -134]
5271a34J91K2r1J06o4p5K21j78O2j64P1K27j15j60L28m4k49J75k68M3L2O7K81
5294B84l11q8J82q8N2J97k29j96J06L17l61J55O5o4J39j69Q9r9j8J14p6L49n95
5317b45L20r2k3J9M4j63O5p5P4j16L56k7l19J32l2j62L02o5R9k00Q5M7jN2j5K06
5343B66j31k36j17K14k02M14j27ko4N7o8J24k01K85m10J32j28L04N2j83J09l7
5365E1K50l12K86l44J92M0j78q4M7K9N8j7k28L55l04p7J19M8j64N84m70J96j90
5388a13l29K67p5O4L21J80k71J22Ql0j60K02l51J89r9J84q7j13J36k4J0mj43j14
5412b30K20j6J30p0J06r1j62j05K48J15O3k99J51O9j41m5J83j30P0q3K03J87m57
5435h4JK6qJ15j28J05o9j34J86p4Q7n2J25j05k90M30p4K3q0O7j80Q4k29K4j1M48
$$ y = [-134, 57, 79, -12, 94, 30, -45, 176, -2, 60, -104, -33, 194, 79, -81, 247, 203, -46, 129, -139, -96, -64, 3, 284, -27, -115, 67, -21, 31, 228, -1, -197, -91, 226, -135, 20, 85, 21, 160, -9, 80, -19, -37, 77, 1, 350, -245, 75, -17, -40, -21, 23, -140, -75, -150, -76, -192, 164, 137, -182, -50, -82, -244, 58, -7, 92, -108, -23, 24, 23, 75, 60, 266, 135, -101, -218, -4, -206, 208, 81, 79, 15, 72, 4, 128, -73, 212, -198, -66, -194, 110, 162, -21, 88, 51, 301, -11, 275, -69, 123, 163, -15, -99, -52, -23, 35, 18, -210, 145, -159, -236, -117, -69, -233, 351, -119, 77, -113, -442, -175, -250, -186, 135, 315, 44, 166, 174, 144, -16, 186, -165, 24, -75, 109, 22, -91, 45, 21, 31, 27, -116, -230, -10, -26, 104, 34, 140, 49, -113, -218, 30, 145, 208, -91, 60, 129, -12, -57, 126, -4, 66, -17, 186, 373, -84, -83, -57, -65, 50, -78, 27, -42, -176, 10, -64, 23, -29, 96, -9, -299, 131, 57, 80, 0, 67, -113, -29, -258, -234, -245, 203]
5461B03r7k03j7K78k80l0q5K40k8j72K56j74J25k1P6K2M6o3J2o0n9J84K06n24
5485a65N8J07q8J72j92L0R7j99R5J89k8j59J91l44L11K66k94J3L5N6q9m5k63K80
5509C4j00NK7LM9j69K43L1k88K18J33l73J8J90J0J85l80L50k93P6O6J16nk08K2
5534d0L72q4k24j38J49r2J24j24N2q6k57O76l97M9O6j20K50j43j13J77k41k4L60
5557A92j42j53L60j04k73j70K15J82pl61K93O7J90J9m18K66j21m4m8M51m08p8
5579i2J27j51K52k82L68n35M12j63M4K3j78r9qM98j43k20K76q4jRk8k1J07j34
5603b3q6L40l03Q2j4k9M0q5J77N6j35l3oJ4J92n2j61k38K56K27k01N4R4l3j36
5628cK4Jj1j24J97j14l9P4j28L1q7K65k81K11O4r7O9j72L08l88M09k03K1l3j38
$$ y = [203, 106, -97, -114, 164, -116, -146, -231, 9, -19, -191, 65, -109, 16, -5, 71, 93, 139, 76, 88, 28, -31, 153, 359, -165, -107, 0, -88, 84, -108, -78, 19, -180, -85, 104, 76, -83, 108, -236, 75, 341, 47, 60, 95, 151, 62, 17, -246, 34, -66, -61, -34, -31, 18, -151, 92, 123, -165, 53, 186, -187, -169, 21, 31, 216, -164, 186, -107, -31, 35, 151, 146, -62, -40, 332, 248, 24, -114, 35, -57, 67, -57, -5, -91, -348, 328, -69, -20, 46, -74, 176, 33, -80, 97, -144, -168, 192, 50, -103, 257, 153, -120, -290, -75, 107, 100, -261, 32, 99, 289, 308, -110, 156, 35, -9, -57, 394, -14, -92, 35, -116, 136, -146, 222, -313, 99, -64, -20, 3, -175, -274, -282, 216, 73, -147, 129, 45, 44, 53, 25, 4, 111, -23, -109, 231, -72, 10, -4, -33, 7, -78, 99, 155, 20, -13, -19, -5, 187, 135, -26, -264, -8, 219, 18, 72, 166, 133, -3, 21, 22, 11, -113, 84, -30, -69, 5, -123, -92, -179, 86, -195, 16, 80, -17, 52, -120, 188, -200, 209, 6, 27, -6, -144]
5653a44O2J29M0j22r3J72Q9m1o9p7J3m9M3J2L0L3l7K38k79R4q1P1K3J23k8j03
5679D9k14K46M7j32j2j20J82K50j70j6J65k34o4NqK97k6l42K2K59k80J9J33r8
5703d2n3ML42l65J46K5kqj13L4K86N8m39K7J36k83K24R1k08K28j62j05J86NLK0
5729C5j20n9J97L31k02N9j17j79KJ30j71m8P4m4R1r0J45J2k3o2J40j53J44r8R9
5754I3Mj52l29L56J48n3j67J3l01L15J42k41L18n4k63L37q6j22K5J03j48L15j95
5777E8J28n9k28NM2R1K8j00q4K84l28J65l4k9M41m27K19k97O8k4J01Q4l98K87
5801gM4j67K01NL20j38l13J99j45K14k42K04o7k38J55L76l94J0J67q5k5L40o29
5824b15j54N45j21j5l23L62j04J01k5j22j93K25J00J02q4P2n2K95l91l2l3j92
$$ y = [-144, -82, 47, 87, -35, -128, 44, 133, 92, 23, -54, -41, -90, -47, -35, -5, 28, -9, 229, -50, 44, -37, 34, 57, 180, 152, 49, -165, 81, 128, -4, -16, -136, 46, 296, 126, 110, 275, 41, -23, -18, -26, 271, 245, -97, -75, 184, -96, -77, 56, -42, -95, -91, 251, -114, 32, 57, 55, 47, -66, -32, 254, 312, -127, -100, 36, -247, -23, 68, -140, 88, -74, -179, 7, 12, 15, 35, -85, -144, 53, 384, 182, 241, 124, -55, -53, 77, -94, -142, -68, -112, -21, -111, 34, 46, 23, -39, 101, -52, 92, -6, 93, 97, -55, -384, -28, 120, 67, -100, -87, -388, -73, 69, -172, 146, 92, -171, 166, 80, -42, -17, 86, -62, 253, 58, 186, 127, -101, -96, -54, 37, 65, -35, -119, 165, -163, 2, -32, -61, 380, -47, 172, -125, -57, -81, 20, 104, -294, -7, 37, -130, 71, 76, 396, 258, -55, 144, -1, 213, -29, 175, 108, -130, 25, 401, 7, 17, 184, 99, 74, 414, -215, -369, 176, 55, 40, -283, 79, -25, 76, 51, -71, -264, -39, 61, 163, 79, 151, 99, 394, 3, -29, -62, -254]
5846b54K15J12j91L4j57K76J38k32J3K20j72M2L24l50J18k9jk09j2o0L50J48k58
5869F5L15j48m99L21J47k41L34k46j93J3J44J57k30l01M57M5r6J37q8Nk09N7j11
5892a65N3J35L0K0k4k2K73j53K06k92R6k91K0K53j4k78M44j71j23j57J16O2n9
5915d1k1L32l92KJ88MJ0m6J25m53J91L38l17K82L6k90K37m22j48K33K08L2q7K4
5939B5O5j21L29j60j99K7L0Q0k21L57k52k9J75j11J4O5q2J24J40k04Nj9J8l44
5963b88M93k3k59j02r6m2J40Q7pl9K05j03J59o2q8n2q1K12l72L99m55N15l24J87
5987DL51m76J57N3l15K45k01K70j75K42L5P5k78j10J79j03r8J01j49L07j95J74
6009I3Jmm4j91J88L0q6k26O05l91M3P2j41O6M8J53m5n7j62K59P5j92j13J32n7
$$ y = [-254, -39, 73, -118, -84, -241, 35, 173, -59, -46, 174, 2, 44, 368, 18, 136, 107, 106, -103, -115, -175, 175, 323, 65, 380, 232, -267, 54, 201, -40, 294, 48, -145, -132, 12, 169, -61, -362, 95, 140, 44, 181, 93, 98, -111, -54, -165, -112, 23, 53, 73, 49, 27, 300, 147, 353, 61, 157, -134, -114, 139, 125, -153, 291, 120, -3, -160, -44, 18, -41, -62, 270, -122, -120, 68, 72, 82, 36, 161, -292, -101, 237, -80, 202, 238, -52, 185, -237, -385, -152, 56, 88, 1, 25, 90, -31, 298, 138, -61, -34, -4, 76, -145, 212, -40, -69, 106, -5, 9, 74, -8, 116, 256, 52, 57, 38, 56, -288, 205, 182, -77, -179, -275, -317, -177, -90, -97, -136, 69, -34, 125, 63, -25, -77, -158, 54, -318, 81, -374, 141, -183, 4, 355, -121, 36, 89, -226, 19, -182, 88, -87, 155, 190, 265, -13, -123, 56, -47, -145, -44, -193, 114, -81, 93, 94, 90, 46, -145, 43, 73, -13, -239, 366, -25, 18, 90, -51, 15, 63, 216, 171, 114, -48, 211, 286, 94, -19, 113, 56]
6034E6l6J96l50O5J89P2l12K35l00K25j28J28j53K56Q5l38Qk6R9j62N3l9Q7N5
6058c5k09J45J68J19l90j01K42J05j15J0K56r1j34J65n1k98J95J65r4J50j73J15
6080A44k46J31J45l72K18J67k48k1o4K08j60J89k56R5P9n1J00l7ko0J69m6J01
6103A83j84n8N0M2j05J99Q0n10M36r0n5Q7j32q9K35j15J94j57J65k85J8N5J7k5
6127d4l9j30J75K08k74K74o2j02k9Mk10K34j09N28n09L13j33j13k67M94l28K28
6149A09j46J76k26J20k74N53j87OPl57K73J22l64J41Q6J28k44q2K19M1l97K01
6171i5qJ92k53Q5L1K64k70J67n1J07k0rj35j60L59m93M25p2J97j23j32K70l40
$$ y = [56, 20, 216, -134, -69, 120, 192, -120, 115, -185, 40, -88, 40, -113, 143, 228, -110, -102, -128, -29, -191, -138, -177, -90, -35, -244, -99, 69, 188, -202, -303, -61, 44, -71, -61, 195, 104, -30, 135, 84, -214, -19, 146, 52, 202, 29, 144, -102, 29, 174, -198, 20, 187, -61, -82, -146, 62, -98, 91, -165, -70, 9, -42, 58, 21, 19, -41, 128, 82, 183, -1, -59, -9, 33, -72, 127, 207, -303, 133, 43, -12, 75, -57, -146, 89, -26, 168, 11, 176, -109, -91, -36, -19, -44, -83, -213, -38, 170, -104, 170, 108, 6, -23, -19, -229, 5, -104, 424, -85, 228, 95, -18, -285, 209, -119, 109, -37, 139, -87, 33, -241, 312, 125, 131, 138, -219, 54, 176, -188, -47, 39, 167, -77, -159, 60, 101, -296, -95, -103, 89, -164, -79, -48, 216, -54, 113, 62, 169, 149, 140, 5, -155, 204, -289, 136, 64, 261, 138, 6, 276, -64]
$$ [...]
8191A39
##END NTUPLES=NMR FID
##END=
