##TITLE=1H_RV2403
 CD3CN, 8 sc, 
 27.3.2020
##JCAMPDX= 6.0         $$ Bruker NMR JCAMP-DX V2.0
##DATA TYPE= NMR FID
##DATA CLASS= NTUPLES
##ORIGIN= UXNMR, Bruker Analytische Messtechnik GmbH
##OWNER= root
$$ XWIN-NMR		Version 3.5
$$ Fri Mar 27 13:52:00 2020 Russian Standard Time (UT+4h)  she@DPX200
##.OBSERVE FREQUENCY= 200.1315
##.OBSERVE NUCLEUS= ^1H
##.DELAY= (6, 6)
##.ACQUISITION MODE= SIMULTANEOUS
##.ACQUISITION SCHEME= undefined
##.AVERAGES= 8
##.DIGITISER RES= 18
##SPECTROMETER/DATA SYSTEM= spect
##.PULSE SEQUENCE= zg30
##.SOLVENT NAME= CD3CN
##.SHIFT REFERENCE= (INTERNAL, CD3CN, 0, 15.7039)
##AUDIT TRAIL= $$ (NUMBER, WHEN, WHO, WHERE, WHAT)
$$ ##TITLE= Audit trail, XWIN-NMR		Version 3.5
$$ ##JCAMPDX= 5.01
$$ ##ORIGIN= Bruker BioSpin GmbH
$$ ##OWNER= she
$$ F:/spectra/data/she/nmr/H-F/1/audita.txt
$$ ##AUDIT TRAIL=  $$ (NUMBER, WHEN, WHO, WHERE, WHAT)
(   1,<2020-03-27 13:50:52.76 +0400>,<she>,<DPX200>,
      <created by zg, POWCHK disabled, PULCHK disabled
       configuration hash MD5:
       00 E9 B6 7A A2 85 ED C7 34 08 36 98 17 FE 4E 26
       data hash MD5: 16K
       34 03 54 7A 98 D8 C4 5A EE C0 7F CF 58 EA 76 A7>)
$$ ##END=
$$ 
$$ hash MD5
$$ 63 CB 51 F6 B4 16 E1 EE 5B EC AC F4 64 B0 AB F0
##$RELAX= 
##$RELAX= 
##$RELAX= 
##$RELAX= 
##$RELAX= 
##$RELAX= 
$$ Bruker specific parameters
$$ --------------------------
##$DU= <F:/spectra>
##$EXPNO= 1
##$NAME= <H-F>
##$PROCNO= 1
##$TYPE= <nmr>
##$USER= <she>
##$AMP= (0..31)
100 100 100 100 100 100 100 100 100 100 100 100 100 100 100 100 100 100 
100 100 100 100 100 100 100 100 100 100 100 100 100 100 
##$AQSEQ= 0
##$AQ_mod= 1
##$AUNM= <au_zg>
##$AUTOPOS= <>
##$BF1= 200.13
##$BF2= 200.13
##$BF3= 200.13
##$BF4= 200.13
##$BF5= 200.13
##$BF6= 200.13
##$BF7= 200.13
##$BF8= 200.13
##$BYTORDA= 1
##$CFDGTYP= 0
##$CFRGTYP= 5
##$CHEMSTR= <none>
##$CNST= (0..31)
1 1 145 1 1 1 1 1 1 1 1 1 1 1 1 1 1 1 1 1 1 1 1 1 1 1 1 1 1 1 1 1 
##$CPDPRG= <>
##$CPDPRG1= <>
##$CPDPRG2= <>
##$CPDPRG3= <>
##$CPDPRG4= <mlev>
##$CPDPRG5= <mlev>
##$CPDPRG6= <mlev>
##$CPDPRG7= <mlev>
##$CPDPRG8= <mlev>
##$CPDPRGB= <>
##$CPDPRGT= <>
##$D= (0..31)
0 1.2 0 0 0 0 0 0 0 0.06 0 0.03 0 0 0 0 0.0002 0 0 0 0 0 0 0 0 0 0 0 0 
0 0 0 
##$DATE= 1585302652
##$DBL= (0..7)
120 120 120 120 120 120 120 120 
##$DBP= (0..7)
150 150 150 150 150 150 150 150 
##$DBP07= 0
##$DBPNAM0= <>
##$DBPNAM1= <>
##$DBPNAM2= <>
##$DBPNAM3= <>
##$DBPNAM4= <>
##$DBPNAM5= <>
##$DBPNAM6= <>
##$DBPNAM7= <>
##$DBPOAL= (0..7)
0.5 0.5 0.5 0.5 0.5 0.5 0.5 0.5 
##$DBPOFFS= (0..7)
0 0 0 0 0 0 0 0 
##$DE= 6
##$DECBNUC= <off>
##$DECIM= 24
##$DECNUC= <off>
##$DECSTAT= 4
##$DIGMOD= 1
##$DIGTYP= 9
##$DL= (0..7)
0 120 120 120 120 120 120 120 
##$DP= (0..7)
150 150 150 150 150 150 150 150 
##$DP07= 0
##$DPNAME0= <>
##$DPNAME1= <>
##$DPNAME2= <>
##$DPNAME3= <>
##$DPNAME4= <>
##$DPNAME5= <>
##$DPNAME6= <>
##$DPNAME7= <>
##$DPOAL= (0..7)
0.5 0.5 0.5 0.5 0.5 0.5 0.5 0.5 
##$DPOFFS= (0..7)
0 0 0 0 0 0 0 0 
##$DQDMODE= 0
##$DR= 18
##$DS= 0
##$DSLIST= <SSSSSSSSSSSSSSS>
$$ [...]
##$SUBNAM2= <"">
##$SUBNAM3= <"">
##$SUBNAM4= <"">
##$SUBNAM5= <"">
##$SUBNAM6= <"">
##$SUBNAM7= <"">
##$SUBNAM8= <"">
##$SUBNAM9= <"">
##$SW= 24.9337058887773
##$SWIBOX= (0..15)
0 0 2 0 0 0 0 0 0 0 0 0 0 0 0 0 
##$SW_h= 4990.01996007984
##$TD= 16384
##$TD0= 1
##$TE= 0
##$TE2= 300
##$TE3= 300
##$TEG= 300
##$TL= (0..7)
0 120 120 120 120 120 120 120 
##$TP= (0..7)
150 150 150 150 150 150 150 150 
##$TP07= 0
##$TPNAME0= <>
##$TPNAME1= <>
##$TPNAME2= <>
##$TPNAME3= <>
##$TPNAME4= <>
##$TPNAME5= <>
##$TPNAME6= <>
##$TPNAME7= <>
##$TPOAL= (0..7)
0.5 0.5 0.5 0.5 0.5 0.5 0.5 0.5 
##$TPOFFS= (0..7)
0 0 0 0 0 0 0 0 
##$TUNHIN= 0
##$TUNHOUT= 0
##$TUNXOUT= 0
##$USERA1= <user>
##$USERA2= <user>
##$USERA3= <user>
##$USERA4= <user>
##$USERA5= <user>
##$V9= 5
##$VALIST= <valist>
##$VCLIST= <CCCCCCCCCCCCCCC>
##$VD= 0
##$VDLIST= <DDDDDDDDDDDDDDD>
##$VPLIST= <PPPPPPPPPPPPPPP>
##$VTLIST= <TTTTTTTTTTTTTTT>
##$WBST= 1024
##$WBSW= 4
##$XGAIN= (0..3)
0 0 0 0 
##$XL= 0
##$YL= 0
##$YMAX_a= 158804
##$YMIN_a= -160428
##$ZGOPTNS= <>
##$ZL1= 120
##$ZL2= 120
##$ZL3= 120
##$ZL4= 120
##$ABSF1= 10
##$ABSF2= 0
##$ABSG= 5
##$ABSL= 3
##$ALPHA= 0
##$AQORDER= 0
##$ASSFAC= 0
##$ASSFACI= 0
##$ASSFACX= 0
##$ASSWID= 0
##$AUNMP= <proc_1d>
##$AZFE= 0.1
##$AZFW= 0.1
##$BCFW= 1
##$BC_mod= 2
##$BYTORDP= 1
##$COROFFS= 0
##$CY= 11.3945322036743
##$DATMOD= 1
##$DC= 2
##$DFILT= <>
##$DTYPP= 0
##$F1P= 16.9975609425685
##$F2P= -3.02152046262296
##$FCOR= 0.5
##$FTSIZE= 0
##$FT_mod= 4
##$GAMMA= 1
##$GB= 0.15
##$INTBC= 1
##$INTSCL= 1
##$ISEN= 128
##$LB= 0.24
##$LEV0= 0
##$LPBIN= 0
##$MAXI= 10000
##$MC2= 0
##$MEAN= 0
##$ME_mod= 0
##$MI= 1.114404
##$NCOEF= 0
##$NC_proc= 0
##$NLEV= 6
##$NOISF1= 3.799351
##$NOISF2= 2.8
##$NSP= 1
##$NTH_PI= 0
##$NZP= 0
##$OFFSET= 15.70392
##$PC= 1
##$PHC0= -9863.914
##$PHC1= 12.20082
##$PH_mod= 1
##$PKNL= yes
##$PPARMOD= 0
##$PSCAL= 0
##$PSIGN= 0
##$REVERSE= no
##$SF= 200.130013532006
##$SI= 16384
##$SIGF1= 3
##$SIGF2= 2
##$SINO= 400
##$SIOLD= 16384
##$SREGLST= <1H.CDCl3>
##$SSB= 0
##$STSI= 0
##$STSR= 0
##$SW_p= 3612.71676300578
##$SYMM= 0
##$S_DEV= 0
##$TDeff= 0
##$TDoff= 0
##$TI= <>
##$TILT= no
##$TM1= 0
##$TM2= 0
##$TOPLEV= 0
##$USERP1= <user>
##$USERP2= <user>
##$USERP3= <user>
##$USERP4= <user>
##$USERP5= <user>
##$WDW= 1
##$XDIM= 8192
##$YMAX_p= 0
##$YMIN_p= 0
$$ End of Bruker specific parameters
$$ ---------------------------------
##NTUPLES= NMR FID
##VAR_NAME=  TIME,          FID/REAL,        FID/IMAG
##SYMBOL=    X,             R,               I
##VAR_TYPE=  INDEPENDENT,   DEPENDENT,       DEPENDENT
##VAR_FORM=  AFFN,          ASDF,            ASDF
##VAR_DIM=   8192,          8192,            8192
##UNITS=     SECONDS,       ARBITRARY UNITS, ARBITRARY UNITS
##FACTOR=    0.0002004,     1,               1
##FIRST=     0,             0,               0
##LAST=      1.6414764,     0,               0
##MIN=       0,             -160428,         0
##MAX=       1.6414764,     158804,          0
$$ Real data points
##PAGE= N=1
##DATA TABLE= (X++(R..R)), XYDATA
$$ plain form
0 0 0 0 0 0 0 0 0 0 0 0 8 -8 8 -8 16 -16 16 -24 24 -32 37 -40 48 -56 64 -72 82 -96 109 -121 136 -154 173
33 173 -192 214 -239 266 -294 327 -363 399 -445 492 -544 604 -670 746 -829 930 -1045 1180
51 1180 -1347 1551 -1811 2154 -2634 3344 -4512 6778 -12792 60947 146797 -47451 -160428
64 -160428 -45050 140536 105236 -78639 -135666 23170 138669 35102 -131132 -95013 88623
75 88623 144741 -15392 -147241 -59209 110309 101952 -60111 -121824 12405 129429 45972
86 45972 -113673 -104732 59468 133798 11053 -118187 -63566 81982 91790 -43793 -110575
97 -110575 -2641 114849 61420 -84497 -105643 25400 110951 29297 -87340 -62118 59011
108 59011 84873 -25069 -101202 -24651 91634 75005 -47990 -95705 -4064 83945 39337
$$ packed form
0@%%%%%%%%%%Qj6J6j6K4l2L2m0M8n6O9p7Q8j04J20j36J54j78K05k30K57k90L27
33A73l65M06m53N05n60O21o90P62q44R37j036J148j274J416j575J759j975K225
51A180k527K898l362L965m788N978p856J1290j9570P3739Q5850j94248j12977
64a60428J15378J85586l5300j83875n7027J58836J15499j03567j66234L6119J83636
75H8623N6118j60133j31849Q8032J69518q357j62063o1713J34229J17024q3457
86D5972j59645Q941J64200P4330j22745j29240N4621J45548R808j35583o6782
97a10575J07934J17490n3429j45917k1146J31043Q5551q1654j16637K5222J21129
108E9011K5862j09942p6133P6551J16285j6629j22995m7715R1641Q8009m4608
$$ plain form
119 39337 -61985 -61894 38197 82446 156 -87174 -48976 59093 80113 -11764 -78277 -25638
131 -25638 59936 47523 -40773 -66833 12319 79010 31229 -63858 -68649 22287 75844 18061
143 18061 -60084 -41575 41202 58518 -18493 -73563 -18959 68435 60037 -33976 -77583 -9570
155 -9570 66459 38575 -46585 -56011 25751 72196 6836 -75950 -50241 50397 79073 -5931
167 -5931 -77581 -31171 58961 53380 -38583 -72285 9377 84475 34634 -70777 -74992 29569
179 29569 87549 14476 -75655 -45053 56736 68811 -31378 -89665 -10960 90135 60053
190 60053 -58775 -89327 12147 89631 26484 -76260 -56712 56245 85598 -19758 -101645
201 -101645 -32859 85900 76865 -44431 -93377 1184 89649 34146 -77885 -69154 51196
$$ packed form
119C9337j01322R1J00091M4249q2290q7330L8198J08069K1020r1877o6513N2639
131b5638Q5574j2413q8296k6060P9152O6691m7781r5087m791R0936N3557n7783
143A8061p8145J8509Q2777J7316p7011n5070N4604Q7394q398r4013m3607O8013
155i570P6029k7884q5160r426Q1762M6445o5360q2786K5709J00638K8676q5004
167e931p1650M6410R0132n581r1963l3702Q1662P5098m9841j05411m215J04561
179B9569N7980p3073r0131L0602J01789J2075j00189n8287P8705J01095l0082
190F0053j18828l0552J01474P7484o3147j02744J9548J12957K9353j05356q1887
201a01645O8786J18759r035j21296m8946R4561Q8465n5503j12031Q731J20350
$$ plain form
212 51196 98798 -2918 -102349 -49977 73683 82015 -32642 -90900 -4430 89125 41360 -75633
224 -75633 -80055 38678 101833 14177 -91208 -57383 58902 78197 -24786 -86387 -9588
235 -9588 86037 50240 -65221 -85300 20767 93265 26309 -74177 -56184 46594 72127
246 72127 -18407 -82323 -18172 77769 58766 -47485 -82215 3357 77496 31396 -58351 -52127
258 -52127 37215 68341 -8869 -76661 -30107 62006 62898 -26381 -71248 -9222 60405 32276
270 32276 -45608 -50223 26193 65814 6037 -64684 -41649 39926 59718 -6680 -56187 -17304
282 -17304 45645 34181 -32873 -51273 9431 59272 23975 -44936 -47691 15818 50274 8716
294 8716 -41611 -23962 32360 39164 -16384 -51347 -12025 45734 38999 -21113 -47031 -4667 39762
$$ packed form
212E1196M7602j01716r9431N2372J23660Q332j14657n8258Q6470R3555m7765j16993
224g5633m422J18733O3155q7656j05385L3825J16285J9295j02983o1601P6799
235i588R5625l5797j15461k0079J06067P2498o6956j00486J7993J02778K5533
246G2127r0534o3916O4151R5941j9003j06251l4730Q5572P4139m6100q9747O224
258e2127Q9342L1126p7210o7792M6554R2113Q92q9279m4867O2026O9627k8129
270C2276p7884m615P6416L9621n9777p0721K3035Q1575J9792o6398m9507L8883
282a7304O2949j1464o7054j8400O0704M9841l5297o8911k755O3509L4456m1558
294H716n0327J7649N6322O804n5548l4963L9322N7759o735o0112k5918M2364M4429
$$ plain form
307 39762 20281 -30404 -32727 18764 45870 4664 -46866 -32966 27364 47423 128 -42901
319 -42901 -19021 32576 31257 -21983 -44414 2265 50825 27088 -37242 -48704 9148 50394
331 50394 15248 -40470 -30542 29527 44933 -12249 -56434 -17242 50785 46495 -24974 -57786
343 -57786 -4474 52167 25479 -41775 -42905 26916 59934 973 -64048 -36010 45288 58821
355 58821 -14216 -61810 -12492 55110 34078 -44045 -56440 20591 71221 16160 -63837 -49082
367 -49082 36894 63359 -7431 -63552 -17402 58350 43349 -42560 -67511 9652 73916 28768
379 28768 -56753 -53891 29329 62822 -3867 -64706 -22716 58498 52431 -34796 -71790 -2720
391 -2720 67853 35105 -47214 -52403 24486 61142 -602 -64641 -29792 53084 58144 -22786 -68074
$$ packed form
307C9762j9481n0685k323N1491K7106m1206n1530J3900O0330K0059m7295m3029
319d2901K3880N1597j319n3240k2431M6679M8560k3737o4330j1462N7852M1246
331E0394l5146n5718R928O0069J5406n7182m4185L9192O8027m290p1469l2812
343e7786N3312N6641k6688o7254j130O9821L3018n8961o5021K8038Q1298J3533
355E8821p3037m7594M9318O7602k1032p8123j2395P7031N0630n5061p9997J4755
367d9082Q5976K6465p0790n6121M6150P5752j5001q5909k4951P7163O4264m5148
379B8768q5521K862Q3220L3493o6689o0839M1990Q1214o067q7227l6994O9070
391b720P0573l2748q2319n189P6889L6656o1744o4039L4849Q2876N060q0930m5288
$$ plain form
404 -68074 -11832 57518 35319 -39905 -49648 20956 60592 5602 -61274 -37500 41948 58379
416 58379 -10423 -58846 -16259 47603 33692 -34335 -48679 14531 58673 15148 -51526 -42383
428 -42383 26835 52264 -457 -47431 -18030 38931 33351 -26327 -47933 2965 51019 25070
440 25070 -35317 -41583 11557 41923 6550 -36617 -20254 29548 35167 -13659 -44519 -11397
452 -11397 36978 31293 -16976 -35778 -933 31531 12510 -26915 -24788 17133 36474 3075
464 3075 -35392 -24133 19264 32246 -963 -28716 -10422 23694 19987 -17235 -31317 1384
476 1384 34835 20017 -22542 -32230 3275 30543 10519 -24339 -19389 18317 29965 -5503 -36897
489 -36897 -15906 29314 33260 -9680 -36119 -8193 30097 19478 -23389 -30555 12331 40879
$$ packed form
404f8074N6242O9350k2199p5224r743P0604L9636n4990o6876K3774P9448J6431
416E8379o8802m8423M2587O3862j3911o8027j4344O3210M4142m3525o6674R143
428d2383O9218K5429n2721m6974K9401N6961n580n9678k1606N0898M8054k5949
440B5070o0387o266N3140L0366l5373m3167J6363M9802N619m8826l0860L3122
452a1397M8375n685m8269j8802L4845L2464j9021l9425K127M1921J9341l3399
464C075l8467J1259M3397J2982l3209k7753J8294L4116l707l7222j4082L2701
476A384L3451j4818m2559r688L5505K7268k0024l4858M950L7706J1648l5468l1394
489c6897K0991M5220L946m2940k6439K7926L8290j0619m2867p166M2886K8548
$$ plain form
501 40879 8862 -39018 -31485 21385 41583 189 -38666 -15701 32306 28918 -22940 -42887
513 -42887 3392 48294 23074 -36248 -41555 13964 45283 5737 -41632 -21750 35179 39260
525 39260 -19396 -52366 -7595 49254 33190 -30580 -45327 9272 46935 8905 -44796 -28513
537 -28513 35147 48150 -11813 -55441 -17155 44651 37177 -25264 -45283 7096 48436 12533
549 12533 -46152 -35780 30384 52646 -2813 -52200 -22355 38489 36761 -22462 -44985 5192
561 5192 49929 18030 -43739 -41315 22232 51416 4175 -45757 -23044 33919 35381 -20771 -45877
574 -45877 1060 48985 24422 -36543 -42609 13171 45531 7612 -38931 -21940 30526 35173
586 35173 -16530 -45216 -6322 42599 28645 -25414 -38549 5574 37217 8971 -32768 -21937
$$ packed form
501D0879l2017m7880P533N2870K0198m1394l8855K2965M8007l388n1858j9947
513d2887M6279M4902k5220n9322n307N5519L1319l9546m7369J9882N6929M081
525C9260n8656l2970M4771N6849j6064o3770j4747N4599L7663l8030n3701J6283
537b8513O3660J3003n9963m3628L8286O1806p474o2441k0019N2379M1340l5903
549A2533n8685J0372O6164K2262n5459m9387K9845O0844j728n9223k2523N0177
561E192M4737l1899o1769K424O3547K9184m7241m9932K2713N6963J462n6152k5106
574d5877M6937M7925k4563o0965o066N5780L2360l7919m6543J6991N2466M647
586C5173n1703k8686L8894M8921j3954n4059j3135M4123L1643k8246m1739J0831
$$ plain form
598 -21937 24962 35281 -7970 -40380 -14252 30675 28652 -13743 -31185 27 29050 10779
610 10779 -25949 -23673 15526 33223 3267 -30165 -19754 16661 24938 -3879 -23723 -4777
622 -4777 22295 14849 -16958 -25806 2510 27510 14019 -17334 -21683 4499 20671 3644 -18853
635 -18853 -11158 15922 21226 -5263 -26232 -10984 19061 21431 -5681 -21766 -4173 18718 10957
648 10957 -16040 -20003 7830 27228 8074 -23577 -22169 10045 25703 2814 -22644 -11148
660 -11148 19212 20121 -12410 -29578 -2840 30197 20484 -18487 -29329 2952 28518 8414 -25218
673 -25218 -18594 19785 30253 -6167 -36277 -13838 28994 28747 -13208 -32696 -1060 31272 13007
686 13007 -28086 -26704 17731 38335 2046 -37927 -21978 25286 32093 -10002 -34525 -3211
$$ packed form
598b1937M6899J0319m3251l2410K6128M4927k023m2395j7442L1212K9023j8271
610A0779l6728K276L9199J7697k9956l3432J0411L6415Q277k8817j9844J8946
622d777K7072p446l1807q848K8316K5000j3491l1353m349K6182J6172j7027k2497
635a8853P695K7080N304k6489k0969J5248L0045K370k7112j6085J7593K2891p761
648A0957k6997l963K7833J9398j9154l1651J408L2214J5658k2889k5458J1496
660a1148L0360R09l2531j7168K6738L3037r713l8971j0842L2281K5566k0104l3632
673b5218O624L8379J0468l6420l0110K2439M2832k47m1955j9488L1636L2332j8265
686A3007m1093J382M4435K0604l6289l9973J5949M7264O807m2095k4523L1314
$$ plain form
698 -3211 34627 18188 -29118 -34319 12677 41883 9277 -35522 -25413 22042 32857 -8945
710 -8945 -36778 -5679 37024 24271 -26753 -38952 6267 40856 13541 -31897 -25751 20750
722 20750 33588 -8093 -39434 -10030 36686 29435 -21341 -39340 999 36913 14479 -29224
734 -29224 -25138 19987 35010 -5165 -39677 -15212 31790 31158 -14362 -35452 -1886 31915 13817
747 13817 -26656 -25314 16989 35085 623 -35148 -19106 23147 28510 -8121 -28966 -3218
759 -3218 26972 13895 -22420 -25629 10111 31647 7298 -25780 -19704 13654 23027 -3447 -22867
772 -22867 -5018 21920 15683 -15232 -24817 1111 24378 12248 -15266 -17578 5933 17883 573
785 573 -18293 -8637 15656 18365 -5304 -21643 -7740 15172 14712 -6064 -15101 27 14967
$$ packed form
698c211L7838j6439m7306n201M6996K9206l2606m4799J0109M7455J0815m1802
710h945k7833L1099M2703j2753n1024j2199M5219L4589k7315m5438O146M6501
722B0750J2838m1681l1341K9404M6716p251n0776j7999M0339L5914k2434m3703
734b9224M086M5125J5023m0175l4512K4465M7002o32m5520k1090L3566L3801j8098
747A3817m0473J342M2303J8096l4462l5771J6042M2253N363l6631k0845K5748
759c218L0190j3077l6315l209L5740K1536k4349l3078O076L3358R373k6474j9420
772b2867J7849K6938o237l0915r585K5928K3267j2130k7514k312K3511J1950j7310
785E73j8866R656K4293K709k3669j6339J3903K2912m60k0776r037J5128J4940
$$ plain form
798 14967 5713 -14174 -14450 7065 19939 5394 -15988 -14367 6555 15661 659 -14379 -5767
811 -5767 13573 13268 -8538 -20111 -3405 18896 14761 -9501 -18460 26 16931 6159 -15442
824 -15442 -13221 11431 21422 -417 -23354 -13367 15446 20908 -4147 -21080 -4309 19407 11925
837 11925 -16513 -21521 6953 27328 8181 -23017 -20210 11634 23967 -1202 -23690 -7695
849 -7695 22391 18543 -15630 -28432 925 29492 14635 -20774 -23254 9698 25922 91 -27128
862 -27128 -11691 24275 24924 -12502 -32313 -4531 28739 17685 -19236 -24368 9657 28629 1532
875 1532 -30279 -16537 23653 29456 -8187 -32583 -7734 26948 18151 -19071 -25439 9731 31495
888 31495 4564 -31039 -20909 20103 30404 -4313 -30072 -8422 25230 17766 -18934 -26832
$$ packed form
798A4967r254j9887k76K1515J2874j4545k1382J621K0922R106j5002j5038Q612
811e767J9340l05k1806j1573J6706K2301m135k4262q959J8486J6905j0772k1601
824a5442K221K4652R991k1839k2937R987K8813N462k5055j6933J6771K3716p482
837A1925k8438n008K8474K0375j9147l1198K807L1844J2333k5169k2488J5995
849g695L0086l848l4173j2802K9357K8567j4857l5409k480L2952J6224k5831k7219
862b7128J5437L5966O49l7426j9811K7782L3270j1054l6921n132L4025J8972k7097
875A532l1811J3742M0190N803l7643k4396K4849L4682q797l7222o368L5170K1764
888C1495k6931l5603J0130M1012J0301l4717k5759K1650L3652p464l6700p898
$$ plain form
900 -26832 7706 32173 8722 -27608 -22605 14787 27491 -1920 -26232 -7885 23350 17811
912 17811 -16705 -27079 3207 28851 11989 -20876 -20765 9719 22592 -771 -22439 -8035
924 -8035 20258 18443 -11468 -24889 -2328 22026 13025 -13461 -16981 5882 18252 775 -18941
937 -18941 -10012 14910 18658 -4193 -19978 -6872 14148 12133 -7537 -13655 2617 15415 4202
950 4202 -14722 -12956 7354 17103 3170 -13477 -9566 7252 10887 -2946 -12241 -1889 12811
963 12811 9358 -8249 -14988 -1300 13450 8959 -6963 -10826 1929 10990 1954 -11532 -8101
976 -8101 8729 14605 -19 -14971 -9128 8658 12765 -1906 -12402 -2529 12236 8039 -10284
989 -10284 -15147 2517 17836 8188 -12765 -14526 4710 15341 1369 -14912 -7149 13758 15028
$$ packed form
900b6832L4538K4467k3451l6330N003L7392J2704k9411k4312J8347L1235n539
912A7811l4516j0374L0286K5644j6862l2865J11L0484J2873k3363k1668J4404
924h035K8293j815k9911j3421K2561K4354r001k6486l520K2863J2370j7477j9716
937a8941Q929K4922L748k2851j5785J3106K1020k015j9670o118J6272J2798j1213
950D202j8924J766K0310R749j3933j6647L911J6818L635j3833r295J0352J4700
963A2811l453j7607o739J3688J4750m491j5922l863J2755R061r036j3486L431
976h101J6830N876j4624j4952N843J7786M107j4671j0496R873J4765m197j8323
989a0284m863J7664J5319r648k0953j761J9236J0631j3972j6281P763K0907J270
$$ plain form
1002 15028 -7346 -20628 -4156 18426 13867 -10431 -17473 2823 18114 3762 -18177 -12480
1014 -12480 14043 21206 -3205 -23357 -9167 17670 16578 -9704 -19639 2525 21775 6605
1026 6605 -20858 -17884 12632 25066 563 -23760 -11481 17367 17687 -10576 -22396 1997 25249
1039 25249 10322 -21348 -21839 9841 25931 2804 -22942 -11735 17846 18701 -11203 -25076 -152
1052 -152 26370 13907 -18972 -22841 6950 24170 3347 -21767 -11491 17921 19902 -9690 -25884
1065 -25884 -3526 23816 15400 -14688 -20708 4851 21212 3115 -20312 -11818 16125 20486 -5926
1078 -5926 -23399 -6545 18519 14499 -10563 -17210 3717 18569 3590 -18176 -12785 12049 19434
1091 19434 -1234 -18725 -7861 13041 12132 -7628 -14504 2251 16366 5610 -14418 -13737 6363
$$ packed form
1002A5028k2374j3282J6472K2582m559k4298p042K0296J5291j4352k1939N697
1014a2480K6523P163k4411k0152J4190K6837j092k6282r935K2164J9250j5170
1026F605k7463K974L0516J2434k4503k4323J2279K8848L20k8263j1820K4393K3252
1039B5249j4927l1670m91L1680J6090k3127k5746J1207K9581Q55k9904j3873K4924
1052a52K6522j2463l2879l869K9791J7220k0823k5114J0276K9412J981k9592j6194
1065b5884K2358K7342q416l0088o020K5559J6361j8097k3427Q494K7943M361k6412
1078e926j7473J6854K5064m020k5062o647K0927J4852j4979k1766N391K4834P385
1091A9434k0668j7491J0864K0902r09j9760o876J6755J4115j0756k0028O81K0100
$$ plain form
1104 6363 16362 2814 -12816 -7747 8533 10204 -4980 -12867 -727 13625 8629 -8584 -13271
1117 -13271 293 11712 5255 -7763 -7302 4910 9424 -1233 -11396 -5343 8591 10816 -1438
1130 -1438 -10707 -4614 6738 6853 -3642 -7876 1011 9472 4277 -8178 -10199 2107 11283 4946
1144 4946 -7459 -8071 3016 8639 -44 -9552 -4299 9150 10163 -3877 -13318 -4413 10367 9620
1158 9620 -4968 -10804 833 11285 3493 -11417 -9973 7531 15376 1073 -14614 -8793 9444
1171 9444 12171 -4200 -13746 -491 14825 7693 -12637 -15338 4959 18163 4736 -14834 -10974
1184 -10974 9631 14359 -4501 -17271 -2630 17845 12070 -12274 -18839 2263 19194 6445
1196 6445 -15147 -12132 10625 16858 -4411 -20449 -5506 18669 15305 -10460 -19799 667 18778
$$ packed form
1104F363R999j3548j5630N069J6280J671j5184p887J2140J4352m996j7213m687
1117a3271J3564J1419o457j3018M61J2212M514j0657j0163O053J3934K225j2254
1130a438r269O093J1352J15j0495m234Q887Q461n195j2455k021J2306R176o337
1144D946j2405o12J1087N623q683r508N253J3449J013j4040r441Q905J4780p47
1158I620j4588n836J1637J0452p792j4910J444J7504P845j4303j5687N821J8237
1171I444K727j6371r546J3255J5316p132k0330k701K0297J3204j3427j9570L860
1184a0974K0605M728j8860j2770J4641K0475n775k4344o565K1102J6931j2749
1196F445k1592L015K2757O233k1269j6038J4943K4175l364k5765r339K0466J8111
$$ plain form
1209 18778 6795 -15791 -12962 11495 19219 -2962 -21670 -8403 17016 16517 -8131 -18669 144
1222 144 17936 6580 -16045 -14129 10427 20098 -104 -19847 -9866 13720 15063 -6545 -16721
1235 -16721 327 17163 6999 -15030 -15000 7516 18808 2499 -16175 -9508 10646 12734 -5692
1248 -5692 -15095 -262 15969 8325 -12112 -14825 3759 15578 3905 -12187 -8138 8558 11211
1261 11211 -4545 -14012 -2195 13452 9656 -7738 -12990 416 11492 4180 -8857 -7013 6460
1274 6460 10292 -1862 -12030 -4958 8887 9677 -2661 -9610 -1958 7399 4202 -5835 -6789 3264
1288 3264 9241 2124 -8164 -7245 3071 8103 1653 -5842 -3635 4039 4966 -2519 -7207 -1422 7198
1303 7198 6392 -2999 -8206 -2279 5962 4804 -3272 -5610 1487 7007 1549 -7518 -6593 4084 9621
$$ packed form
1209A8778j1983k2586K829K4457P724k2181j8708J3267K5419m99k4648j0538J8813
1222A44J7792j1356k2625J916K4556R671k0202j9743R981K3586J343k1608j0176
1235a6721J7048J6836j0164k2029L0K2516J1292j6309j8674O667K0154K088j8426
1248e692r403J4833J6231p644k0437k713J8584J1819j1673j6092M049J6696K653
1261A1211j5756r467J1817J5647l796j7394n252J3406J1076p312j3037J844J3473
1274F460L832j2154j0168P072J3845P90j2338o949P652R357l197j0037r54J0053
1288C264N977p117j0288R19J0316N032o450p495K207P674R27p485m688N785Q620
1303G198q06r391n207N927Q241j158q076k338P097N520n458r067R25J0677N537
$$ plain form
1318 9621 1878 -8138 -5910 4630 7176 -2033 -8309 -993 9431 6229 -7001 -10917 811 11366
1332 11366 5097 -8200 -8144 4799 9914 -1441 -11886 -4078 11206 10710 -5775 -13927 -1650 12301
1346 12301 6872 -9013 -10093 5647 13311 -223 -14870 -7653 11454 13876 -4027 -15098 -2932
1359 -2932 13037 7749 -10313 -12304 5818 16257 2072 -15903 -10493 10166 14899 -2764 -15010
1372 -15010 -3136 13702 8562 -11011 -14357 4602 17381 4464 -14685 -11405 8424 14079 -2418
1385 -2418 -14576 -3083 14079 9658 -10301 -15393 2414 16333 5790 -12354 -10586 7236 12786
1398 12786 -2558 -14366 -3588 13623 10689 -8233 -14822 279 13891 5797 -10302 -9145 6773
1411 6773 12110 -2022 -13913 -4849 11608 11065 -5356 -12735 -921 11069 4948 -8817 -8240 5887
$$ packed form
1318I621p743j0016K228J0540K546r209o276P316J0424l202j3230l916J1728J0555
1332A1366o269j3297N6J2943N115j1355j0445P808J5284m96j6485q152J2277J3951
1346A2301n429j5885j080J5740P664j3534j4647P217J9107K422j7903j1071J2166
1359b932J5969n288j8062j991J8122J0439j4185j7975N410K0659M733j7663j2246
1372a5010J1874J6838n140j9573l346J8959J2779j2917j9149L280J9829N655j6497
1385b418j2158J1493J7162m421j9959n092J7807J3919j0543j8144J768J7822N550
1398A2786j5344j1808J0778J7211k934j8922o589J5101J3612q094j6099J157J5918
1411F773N337j4132j1891R064J6457n43j6421p379J1814J1990o121j3765N77J4127
$$ plain form
1425 5887 11567 -391 -12127 -6236 8112 9817 -2528 -9626 -1446 8298 4159 -7097 -7817 3605
1439 3605 10027 2125 -8351 -6493 3886 7306 -231 -6383 -1826 5856 4417 -4278 -7170 -48
1453 -48 7035 4437 -3619 -5828 189 4668 1431 -3894 -2911 3228 5146 -334 -5945 -3890 3382 5712
1469 5712 538 -4555 -2618 2796 3397 -2100 -5096 -90 6105 4067 -4017 -6929 -210 6402 3497
1484 3497 -4211 -4702 2651 6113 -504 -7528 -3692 6414 7819 -2004 -8868 -2811 6842 5322 -4729
1499 -4729 -7181 2510 9405 1822 -9560 -7456 5752 10530 -142 -9957 -4085 7978 6990 -5789
1513 -5789 -10055 1695 12112 4612 -10097 -10111 4518 11726 872 -10729 -4777 9195 8709 -6045
1527 -6045 -12647 -45 13144 6943 -9181 -10939 3690 11778 970 -11367 -5435 10018 10559
$$ packed form
1425E887N680j1958j1736N891J4348J705j2345p098Q180R744m139j1256p20J1422
1439C605O422p902j0476J858J0379L420p537o152M557P682j439q695k892P122
1453d8P083k598q056k209O017M479l237n325R83O139J918n480n611K055P272K330
1469E712n174n093J937N414O01n497k996N006O195k038q084k912O719O612k905
1484C497p708m91P353L462o617p024L836J0106J405r823o864O057R653j520j0051
1499d729k452R691O895p583j1382K104J3208M778j0672r815N872J2063r88j2779
1513e789m266J1750J0417p500j4709j4J4629P208j0854j1601N952J3972m86j4754
1527f045o602J2602J3189o201j6124j758J4629Q088j0808j2337N932J5453N41
$$ plain form
1540 10559 -5354 -13580 -1865 12423 7713 -8019 -10401 3562 11650 707 -12037 -6425 9678
1553 9678 11612 -3825 -13294 -2988 10963 7185 -7506 -9784 4045 11858 1158 -12189 -7434
1566 -7434 8461 11593 -2205 -11608 -2914 9752 6329 -7314 -9443 3640 11793 2225 -10836
1579 -10836 -7756 6217 10130 -1200 -9509 -2419 8503 5719 -6553 -9165 2059 10418 3478
1592 3478 -7951 -7130 3773 7630 -603 -7329 -2086 6940 5474 -4526 -8075 -165 7499 4132
1606 4132 -4376 -5360 1676 5172 32 -5344 -2524 4597 5387 -1322 -5997 -2334 3748 3960 -1176 -3607
1622 -3607 -33 3483 1348 -3425 -3656 1434 4961 2007 -3331 -3938 500 3454 994 -2787 -1744
1637 -1744 2576 3544 -1112 -4961 -2141 3903 4761 -702 -4681 -1680 3640 2776 -2860 -4206 1564 6000
$$ packed form
1540A0559j5913q226J1715J4288m710j5732k382J3963Q088j0943j2744N612J6103
1553I678J934j5437r469J0306J3951l778j4691k278J3829P813j0700j3347M755
1566g434J5895L132j3798r403Q694J2666l423j3643k129J3083Q153r568j3061
1579a0836L080J3973L913j1330q309P090J0922k784j2272k612J1224Q359o940
1592C478j1429Q21J0903L857q233o726N243R026j466j0000l549P910P664l367
1606D132q508r84P036L496n140n376K820P121P90o709m675L663O082K12n136k431
1622c607L574L516k135m773k31N090L527k954n338o07M438K954k460l781J043
1637a744M320R68m656l849K820O044Q58n463l979L001N320q64n636j346N770M436
$$ plain form
1653 6000 1770 -5647 -5449 2443 6659 1159 -5603 -3201 4386 4942 -2997 -7177 -283 7894 4921
1668 4921 -5371 -7794 1086 7870 2236 -6666 -4618 5374 7498 -2381 -9587 -2659 8514 7181
1682 7181 -4548 -8849 464 8606 2715 -7873 -6166 5871 9681 -1218 -10664 -4387 8116 7969
1696 7969 -4087 -9138 575 9460 3144 -8881 -7704 5578 10922 108 -10518 -5116 7542
1709 7542 7787 -4311 -9331 864 10398 3924 -9185 -8799 4600 10917 882 -9709 -4766 7386
1723 7386 7354 -4826 -9824 645 10797 4890 -8321 -8981 3463 9798 876 -8777 -4047 7357
1737 7357 7195 -4634 -9923 -305 9738 5433 -6462 -7842 2455 8023 539 -7710 -3605 6602
1751 6602 6946 -3228 -8827 -1654 7303 4863 -4198 -5833 1801 6196 360 -6469 -3606 4777 6376
$$ packed form
1653F000m230p417J98P892M216n500o762K402P587N56p939m180O894Q177k973
1668D921j0292k423Q880O784n634q902K048R992K124r879p206O928J1173j333
1682G181j1729m301R313Q142n891j0588J707J2037L810j0899r446O277J2503j47
1696G969j2056n051R713Q885o316j2025J177J3282N344j0814j0626N402J2658
1709G542K45j2098n020J0195R534o474j3109L86J3399O317j0035j0591M943J2152
1723G386l2j2180m998J0469J0152n907j3211o60J2444O335q922r653M730J1404
1737G357j62j1829n289R618J0043m305j1895j380J0297N568p484q249M105J0207
1751F602L44j0174n599P173Q957k440r061j635P634M395n836o829K863Q383J599
$$ plain form
1766 6376 -1041 -6415 -2372 4329 3682 -2395 -4170 1038 4790 1154 -4603 -3937 2150 5035 1026
1781 1026 -3631 -2546 1877 2699 -1059 -3071 -263 3570 2473 -2218 -4044 -691 3149 2492 -1262
1796 -1262 -2607 160 2485 605 -2710 -2314 1732 4023 831 -3539 -3093 1353 3554 528 -2909
1811 -2909 -1459 2762 2758 -1980 -4638 -617 4740 3680 -2472 -4956 -220 4465 1834 -3785 -3351 2980
1827 2980 5410 -468 -6406 -3258 4685 5806 -1446 -5979 -1104 5428 3067 -4733 -5530 2676 7586
1842 7586 1313 -7174 -5133 4182 6803 -1087 -6830 -1400 6650 4255 -5393 -7460 1821 8767 2742
1857 2742 -7025 -5869 4045 7135 -1405 -7829 -1681 7804 5630 -5477 -8736 947 8899 3272 -6845
1872 -6845 -5780 4458 7459 -1792 -8942 -2259 8362 6673 -4866 -8907 322 8381 3083 -6847
$$ packed form
1766F376p417n374M043O701o47o077j775N208L752l636n757O66O087K885m009
1781A026m657J085M423Q22l758k012K808L833j097m691j826L353L840o57l754
1796a262j345K767K325j880l315L96M046K291l192m370M46M446K201l026l437
1811b909J450M221mm738k658M021N357j060o152k484M736M685k631n619M34O331
1827B980K430n878n938L148P943J121p252m533M875O532k361p800p97Q206M910
1842G586o273q487K041R315K621p890n743N430Q050k395r648k067R281O946o025
1857B742r767J156R914L090q540o424O148R485k174j1107l259R683P952n627j0117
1872f845J065J0238L001r251p150O683J0621j689j1539m041R229Q059n298r930
$$ plain form
1886 -6847 -5474 4972 8016 -1666 -9351 -3128 7692 6934 -3868 -8081 224 7625 2530 -6805
1900 -6805 -5476 4740 8140 -693 -8457 -3706 6032 6101 -2846 -6631 337 6709 2283 -6093 -5434
1915 -5434 3476 7288 511 -6442 -3524 4130 4653 -2127 -5214 292 5710 2523 -4661 -5068 1622
1930 1622 5599 1327 -4144 -2734 2655 3376 -1523 -4179 -339 4368 2988 -2483 -4279 -89 3496
1945 3496 1684 -2200 -2112 1509 2798 -462 -3480 -1670 2496 3301 -111 -2944 -1476 1527 1789 -725
1961 -725 -1864 150 2498 1299 -2031 -2952 -51 2920 2065 -1290 -2438 -22 2239 742 -2242 -1928
1977 -1928 1897 3405 119 -3858 -2659 2241 3749 -69 -3266 -1201 2910 2401 -2598 -4142 625
1992 625 5109 2348 -3993 -4489 1427 4808 521 -4406 -2126 4043 4087 -2579 -6040 -651 6027 3738
$$ packed form
1886f847J373J0446L044r682p685O223J0820p58j0802m213Q305P401n095r335
1900f805J329J0216L400q833p764M751R738O9q947l785O968O372m426q376O59
1915e434Q910L812o777o953K918P654N23o780l087N506N418l187p184m07O690
1930A622L977m272n471J410N389P21m899k656L840M707j380n471j796M190L585
1945C496j812l884Q8L621J289l260l018J810M166Q05l412k833J468L003K62k514
1961g25j139K014K348j199l330r21K901K971q55l355j148K416K261j497k984L14
1977a928L825J508l286l977J199M900J508l818l197K065M111n09m999j544M767
1992F25M484k761o341m96N916L381m287m927K280O169M4o666l461N389O678k289
$$ plain form
2008 3738 -3733 -5181 1434 5430 576 -5650 -2939 5024 5863 -2151 -7286 -1516 6195 4287 -4073
2023 -4073 -5599 1954 6558 516 -6968 -4004 5361 6974 -1787 -7573 -1886 6302 4205 -4605 -5968
2038 -5968 2475 7577 1015 -7549 -4957 4961 7235 -1230 -7250 -1716 6317 4069 -4991 -6469 2294
2053 2294 7963 1771 -6994 -5222 4051 6552 -1065 -6534 -1345 6163 3988 -4708 -6571 1442 7252
2068 7252 2342 -5562 -4615 3111 5381 -1046 -5802 -1244 5621 4093 -3657 -6030 328 5692 2361
2083 2361 -4001 -3595 2490 4393 -914 -5125 -1568 4524 4066 -2125 -4844 -504 3934 1939 -2857
2098 -2857 -2793 1955 3827 -258 -4214 -2173 2860 3629 -544 -3311 -951 2404 1567 -1903 -2397 998
2114 998 3230 939 -2651 -2604 748 2620 789 -1651 -1212 1060 1525 -638 -2183 -674 2023 2222
$$ packed form
2008C738p471j448O615L996m854o226K711P963Q39q014n135N770P711j908q360
2023d073j526P553M604o042p484K964R365J613q761n786N687Q188k097q810j363
2038e968Q443N102o562q564K592R918K274q465o020N534Q033k248r060j478Q763
2053B294N669o192q765J772R273K501p617n469N189P508k175q696j863Q013N810
2068G252m910p904R47P726K270o427m756M558O865j528p750k373O358N364l331
2083B361o362M06O085J903n307m211L557O092m58o191k719M340M438j995m796
2098b857O4M748J872m085l956K041N033P69m173k767K360L355q37l470m94L395
2114I98K232k291l590M7L352J872j831k440M39K272M65k163j545J509K697J99
$$ plain form
2130 2222 -424 -2466 -1317 1285 1810 -235 -1653 -235 1831 1130 -1720 -2592 258 3091 1825 -1910
2146 -1910 -2847 263 2660 706 -2467 -1619 2273 3120 -942 -4131 -1496 3369 3342 -1471 -3757 -100
2162 -100 3617 1323 -3525 -3061 2546 4845 -38 -5033 -2672 3482 4063 -1590 -4496 50 4821 1959
2178 1959 -4512 -4490 2457 5979 703 -5415 -3149 3775 4430 -2128 -5449 107 6021 2849 -4979 -5636
2194 -5636 2033 6365 1043 -5571 -3159 4250 4790 -2498 -6288 -322 6620 3808 -4634 -5860 1568
2209 1568 6139 989 -5547 -2961 4617 5306 -2430 -6841 -971 6194 4072 -3884 -5428 1399 5634
2224 5634 736 -5486 -3070 4447 5456 -1749 -6338 -1537 5138 3696 -3149 -4597 1397 5166 641
2239 641 -5217 -3250 3704 5208 -866 -5236 -1614 4014 2964 -2735 -3916 1334 4784 947 -4494
$$ packed form
2130B222k646k042J149K602N25k045j418J418K066p01k850q72K850K833j266l735
2146a910r37L110K397j954l173Q48L892Q47m062l189K635M865k7m813k286L657
2162a00L717k294m848M64N607K299m883m995K361O154N81n653k906M546M771k862
2178A959o471K2O947L522n276o118K266O924O55o558l321N556N914l172p828o57
2194e636P669M332n322o614K412P409N40p288l790N966O942k812q442j226P428
2209A568M571n150o536K586P578O89p736m411N870P165k122p956j544O827M235
2224E634m898o222K416P517J009p205m589M801O675j442o845j448N994L769m525
2239F41n858J967O954J504o074m370L622N628j050n699j181N250L450l837n441
$$ plain form
2254 -4494 -3377 2522 4398 -141 -3915 -1358 3111 2367 -2333 -3523 800 4121 1526 -3108 -3114 1138
2270 1138 3139 320 -2545 -1070 2202 2026 -1424 -2977 -317 2731 1984 -1173 -2265 -181 1662
2285 1662 687 -1261 -1096 991 1846 126 -1942 -1574 735 1999 724 -1188 -1227 433 1192 -115 -1500
2302 -1500 -598 1611 1898 -547 -2522 -1188 1736 2106 -476 -2041 -274 1983 996 -2049 -2269 1216
2318 1216 3409 797 -3013 -2409 1577 2952 -378 -3035 -618 3210 2166 -2597 -3881 633 4339
2333 4339 1700 -3315 -3080 1885 3676 -662 -4224 -1067 4235 3398 -2692 -4983 78 4827 2104
2348 2104 -3688 -3476 2418 4493 -759 -5348 -1870 4698 4376 -2355 -5477 -262 4933 2128 -4068
2363 -4068 -3738 2726 5448 -412 -5862 -2658 4421 4748 -1995 -5324 -293 5074 2158 -4421 -4285 2697
$$ packed form
2254d494J117N899J876m539l774K557M469p44m700j190M323L321k595m634oM252
2270A138K001k819k865J475L272j76l450j553K660L048p47l157j092K084J843
2285A662r75j948J65K087Q55j720k068L68K309J264j275j912l9J660P59j307j385
2302a500R02K209K87k445j975J334K924L70k582j565J767K257r87l045k20L485
2318A216K193k612l810O04L986J375l330k657K417L828j044m763j284M514L706
2333D339k639n015K35M965J791m338l562L157N302q37o090k291N061M749k723
2348B104n792K12N894K075n252m589L478O568l22o731l122N215N195k805o196
2363d068L30O464K722n860n450L204P079L27o743l329N031N367k916o579J36O982
$$ plain form
2379 2697 5760 302 -5625 -3033 3810 4397 -1703 -4894 -24 5060 2242 -4317 -4522 2139 5581
2394 5581 813 -4814 -2824 3304 3862 -1808 -4635 -3 4946 2455 -3824 -4413 1418 4809 871
2409 871 -3962 -2277 3004 3402 -1773 -4409 -288 4400 2619 -2834 -3841 753 3700 723 -3163
2424 -3163 -1800 2580 3061 -1236 -3822 -890 3163 2453 -1539 -2766 203 2467 594 -2292 -1567 1675
2440 1675 2608 -130 -2588 -1418 1404 1881 -206 -1517 -267 1336 712 -1191 -1544 226 1808 1111
2456 1111 -938 -1608 -270 1156 777 -614 -859 439 1263 114 -1600 -1335 794 2063 578 -1596
2472 -1596 -1424 738 1528 -234 -1645 -316 1980 1569 -1406 -2688 -128 2696 1544 -1678 -2159 785
2488 785 2439 -30 -2845 -1333 2578 2970 -1081 -3649 -904 3017 2178 -2005 -2873 1063 3575 396
$$ packed form
2379B697L063n458n927K592O843N87o100l191M870N084k818o559k05O661L442
2394E581m768n627J990O128N58n670k827M632M949k491o279n89N831L391l938
2409H71m833J685N281L98n175k636M121M688j781n453j007M594K947k977l886
2424c163J363M380M81m297k586K932M053p10l992j227K969K264j873k886P25L242
2440A675R33k738k458J170K822M77k087j311J250J603o24j903l53J770J582o97
2456A111k049o70J338J426l79j391k45J298Q24j149j714K65K129J269j485k174
2472a596J72K162P90j762j411J329K296m11k975j282K560K824j152l222m81K944
2488G85J654k469k815J512L911L92m051k568K745L921q39m183q68L936K512l179
$$ plain form
2504 396 -3844 -2471 2744 4033 -592 -4157 -1323 3416 2582 -2499 -3704 1143 4618 1113 -4323
2519 -4323 -3422 2512 4529 -286 -4377 -1421 3805 2957 -2859 -4490 846 5168 1814 -4201 -3816 2198
2535 2198 4485 -301 -4497 -1377 4172 3326 -2867 -4931 466 5051 2089 -3801 -3634 2220 4289
2550 4289 -536 -4652 -1445 4266 3612 -2557 -4843 35 4582 1968 -3475 -3164 2251 4136 -651
2565 -651 -4700 -1645 3951 3661 -1940 -4318 -128 3894 1575 -3203 -2799 2193 3965 -337 -4210 -1882
2581 -1882 3041 3220 -1254 -3371 -134 3116 1258 -2729 -2562 1578 3457 314 -3097 -1883 1772
2596 1772 2357 -604 -2287 -171 2257 1169 -1815 -2220 520 2401 927 -1547 -1508 567 1386 -77
2612 -77 -1379 -444 1321 1281 -585 -1720 -634 1123 1258 -154 -1049 -309 767 496 -742 -1028 283
$$ packed form
2504C96m240J373N215J289m625l565K834M739q34n081j205M847L475l505n436
2519d323R01N934K017m815m091K956N226q48n816j631N336M322l354o015L85O014
2535B198K287m786m196L120N549q46o193k064N397M585k962n890J67N854K069
2550D289m825m116L207N711o54o169k286M878M547k614n443L11N415J885m787
2565f51m049L055N596k90n601k378M190M022k319m778M04M992J772m302l873K328
2581a882M923J79m474k117L237L250j858l987J67M140J879l143l411J214L655
2596A772N85k961j683K116K428j088k984m05K740J881j474k474L9K075Q19j463
2612g7j302R35J765m0j866j135J086J757J35j412q95P40J076k71j238k86J311
$$ plain form
2629 283 1488 767 -1040 -1564 -59 1402 800 -837 -1018 556 1329 -124 -1779 -941 1512 2036 -284
2646 -284 -2198 -940 1584 1514 -969 -1908 396 2402 759 -2410 -2255 1234 3012 409 -2672 -1570
2662 -1570 1925 2259 -1199 -2985 -9 3370 1840 -2607 -3311 822 3594 849 -3070 -1991 2380
2677 2380 3071 -1276 -3974 -633 3874 2709 -2441 -3809 579 3852 943 -3478 -2315 2743 3761
2692 3761 -1103 -4527 -1212 3873 3052 -2268 -3821 668 4011 863 -3874 -2624 2890 4220 -811
2707 -811 -4572 -1440 3658 2900 -2307 -3676 945 4218 834 -4081 -2910 2705 4242 -521 -4207
2722 -4207 -1316 3433 2565 -2448 -3605 1031 4279 1023 -3814 -2958 2184 3783 -334 -3615 -1054
2737 -1054 3142 2269 -2328 -3453 702 3871 1311 -2970 -2629 1482 2957 -242 -2869 -796 2641
$$ packed form
2629B83J205p21j807n24J505J461o02j637j81J574P73j453j655Q38K453N24k320
2646b84j914J258K524p0k483r39K304K006j643l169J55L489J778k603l081J102
2662a570L495L34l458j786K976L379j530m447p04M133K772k745l919J079M371
2677B380O91m347k698L341M507j165n150j368M388L273k909m421J163N058J018
2692C761m864l424L315N085q21n320j553M489L343l148m737J250N514J330n031
2707h11l761L132N098p58n207j369M621L273l384m915J171N615J537m763l686
2722d207K891M749q68n013j157M636L248l256m837Q56N142J599m117l281K561
2737a054M196q73m597j125M155L169k560m281L41M111J475l199k627K073L437
$$ plain form
2752 2641 2040 -1733 -2991 91 2852 1361 -1844 -1937 866 2033 -167 -2138 -778 1879 1844 -823
2768 -823 -2202 -515 1630 1114 -839 -1215 363 1336 113 -1467 -989 839 1646 174 -1297 -856 465
2785 465 830 -84 -836 -147 910 731 -658 -1297 -294 1127 1060 -306 -1101 -323 806 553 -683 -922
2803 -922 449 1454 466 -1408 -1459 492 1759 502 -1335 -1048 993 1369 -578 -1937 -360 2089
2819 2089 1666 -1224 -2414 -99 2245 1084 -1718 -1723 1199 2430 -262 -2902 -1308 2359 2624 -966
2835 -966 -2983 -435 2668 1438 -2219 -2408 1388 3343 202 -3424 -2006 2364 3064 -854 -3250 -408
2851 -408 3110 1641 -2675 -3011 1391 3881 556 -3554 -2230 2362 3091 -1079 -3443 -204 3606 1833
2867 1833 -2925 -3366 1273 3985 673 -3448 -2090 2487 2973 -1381 -3688 -152 3842 2070 -2829
$$ packed form
2752B641o01l773j258L082K761j491l205r3K803J167k200j971J360K657l5k667
2768h23j379J687K145n16j953l76J578R73j223j580M78J828Q07j472j471M41J321
2785D65L65r14p52O89J057j79j389o39J003J421o7j366p95P78J129k53j236k39
2803i22J371J005r88j874n1J951J267j257j837K87K041L76j947j359J577K449
2819B089m23k890j190K315K344j161k802nK922J231k692k640J594L667K65l590
2835i66k017K548L103j230l657j89L796J955l141l626J418M370P00l918k396K842
2851d08L518j469m316l36M402K490l325m110J324M592P29m170k364L239L810j773
2867A833m758m41M639K712l312m121J358M577M86m354k307L536L994j772m899
$$ plain form
2882 -2829 -3456 1040 3722 597 -3244 -1798 2583 2908 -1439 -3751 -373 3589 2161 -2339 -3083 817
2898 817 3172 409 -2921 -1510 2378 2781 -1100 -3370 -680 2827 1916 -1681 -2379 691 2543 295
2914 295 -2527 -1463 1892 2487 -542 -2601 -788 1902 1452 -1147 -1722 566 2007 323 -1940 -1408
2930 -1408 1115 1924 43 -1632 -709 1098 970 -766 -1287 256 1552 634 -1149 -1314 252 1234 425
2947 425 -768 -599 483 715 -276 -998 -329 860 984 -128 -1015 -588 475 731 -18 -611 -159 664
2965 664 525 -564 -1092 -118 1189 997 -530 -1291 -217 1071 643 -851 -976 639 1540 101 -1748
2982 -1748 -1192 1152 1885 -103 -1823 -667 1508 1223 -1200 -1890 473 2422 799 -2121 -1964 1057
2998 1057 2388 24 -2257 -860 2040 1742 -1494 -2668 247 2928 1290 -2242 -2287 1134 2619 -138
$$ packed form
2882b829o27M496K682l125l841J446M381L25m347k312L378L962j428m500p44L900
2898H17K355k763l330J411L888M03l881k270K690L507r11l597o98L070J852k248
2914B95k822J064L355N95l029k059J813K690m50k599n75K288J441j684k263N32
2930a408K523Q09j881j675R23J807j28j736n21J543J296r18j783j65J566R82q09
2947D25j193J69J082K32r91p22O69J189J24j112q87M27J063K56p49n93M52Q23
2965F64j39j089n28R74J307j92j527p61J074J288m28j494j25J615R01j439j849
2982a748N56K344P33j988j720J156K175k85k423o90K363J949j623k920J57L021
2998A057J331k364k281J397K900k98l236j174K915K681j638l532m5L421J485k757
$$ plain form
3014 -138 -2738 -914 2560 2217 -1650 -3156 50 3114 1428 -2334 -2292 1401 2828 -349 -3186 -1095
3030 -1095 2845 2572 -1557 -3304 -71 3092 1345 -2452 -2238 1646 3068 -354 -3407 -1344 2744
3045 2744 2671 -1341 -3100 -50 2903 1129 -2502 -2221 1643 3122 -131 -3194 -1486 2305 2401 -1090
3061 -1090 -2639 62 2647 997 -2345 -2178 1332 2840 174 -2571 -1348 1738 1886 -950 -2186
3076 -2186 136 2361 988 -1934 -1994 835 2283 333 -1851 -996 1323 1425 -836 -1842 30 1945
3092 1945 1030 -1320 -1642 355 1570 321 -1231 -684 1015 1125 -560 -1498 -275 1293 1010 -545
3108 -545 -1095 -61 830 295 -680 -522 518 894 6 -893 -662 335 791 265 -445 -424 142 397 -41 -517
3128 -517 -253 526 774 -17 -922 -689 453 956 123 -805 -428 674 692 -559 -1169 31 1416 868 -996
$$ packed form
3014a38k600J824L474l43l867j506L206L064j686l762M2L693J427l177k837K091
3030a095L940k73m129j747L233L163j747l797K14L884J422l422l053K063M088
3045B744p3m012j759L050K953j774l631K81L864J479l253l063J708L791R6l491
3061a090j549K701K585j650l342J67L510J508k666k745J223L086J48k836j236
3076b186K322K225j373k922o0K829J448j950k184Q55K319J02k261j006J872J915
3092A945r15k350l22J997J215j249j552N47J699J10j685r38J223J568k83j555
3108e45n50J034Q91n35r75J58J040L76q88q99K31R97M56n26p10K1N66K55m38m76
3128e17K64P79K48p91r05K33J142N03q33r28L77J102J8j251o10J200J385n48j864
$$ plain form
3147 -996 -1434 197 1443 406 -1259 -854 1072 1416 -566 -1959 -457 1805 1430 -1021 -1839 202
3163 202 1834 452 -1773 -1210 1463 2067 -504 -2444 -754 2005 1647 -1199 -2038 439 2265 451
3179 451 -2293 -1576 1656 2516 -376 -2651 -863 2138 1687 -1463 -2251 615 2682 610 -2594 -1937
3195 -1937 1603 2708 -310 -2677 -800 2233 1660 -1664 -2481 702 2856 834 -2444 -2011 1403 2520
3211 2520 -231 -2515 -599 2353 1661 -1613 -2559 453 2799 937 -2159 -1850 1183 2187 -406 -2290
3227 -2290 -552 2201 1570 -1429 -2446 191 2348 827 -1796 -1558 1194 1908 -405 -2162 -576 1971
3243 1971 1599 -1025 -1968 59 1815 612 -1471 -1195 1068 1663 -353 -1944 -621 1463 1396 -622
3259 -622 -1408 41 1269 386 -1130 -916 752 1362 35 -1271 -702 701 893 -171 -760 -90 714
$$ packed form
3147i96m38J631J246j037j665M05J926L44j982j393J502K262l75k451q18K041
3163B02J632j382k225N63K673O04k571j940J690K759l58k846q39K477J826j814
3179D51k744P17L232Q60k892k275J788L001m51l150p88K866K067k072l204O57
3195a937L540J105l018k367J877L033n73l324q17L183K154k022l278M33L414J117
3211B520k751k284J916K952o92l274r46L012K346j862l096L09L033J004k593j884
3227b290J738K753o31k999j017K637K157j521k623K38K752P14k313j757J586K547
3243A971l72k624r43K027J756j203k083K76K263N95k016j591J323K084o7k018
3259f22p86J449J228q83j516K14J668O10j327j306N69J403J92j064n89O70Q04
$$ plain form
3276 714 345 -608 -698 155 847 405 -386 -569 -37 349 238 -180 -209 128 385 75 -439 -518 79 737 448
3297 448 -378 -710 -44 612 253 -563 -476 555 920 -153 -1147 -598 853 1066 -296 -1104 -205 1050 515
3316 515 -951 -1028 681 1540 174 -1537 -967 923 1400 -375 -1392 -123 1472 805 -1401 -1579 663
3333 663 2015 371 -1729 -1229 1208 1591 -616 -1838 -89 1975 1149 -1546 -1859 557 2144 463
3349 463 -1887 -1149 1425 1741 -839 -2237 -264 2329 1367 -1577 -2189 495 2316 446 -1993 -1223
3365 -1223 1591 1984 -772 -2481 -480 2261 1594 -1430 -2083 454 2171 341 -2075 -1252 1661 2129
3381 2129 -621 -2414 -584 2000 1421 -1278 -1805 592 2069 249 -2080 -1274 1501 2009 -457 -2081
3397 -2081 -515 1724 1114 -1241 -1581 676 1979 247 -1891 -1215 1209 1710 -328 -1656 -322 1446
$$ packed form
3276G14l69r53r0Q53O92m42p91j83N32L86j11m18k9L37K57l10n14p9N97O58k89
3297D48q26l32O66O56l59q16Q7J031L65j073r94N49J451K13j362q08Q99J255n35
3316E15j466p7J709Q59j366j711N70J890M77j775j017J269J595o67k206j78K242
3333F63J352j644k100N00K437L83k207j222J749K064q26k695l13K416J587j681
3349D63k350P38K574L16k580j398J973K593r62k944o12K684J821j870k439P70
3365a223K814L93k756j709K001K741o67l024o53K537J717j830k416Q23K913M68
3381B129k750j793J830K584n79k699n27K397J477j820k329Q06K775N08k466j624
3397b081J566K239o10k355l40K257J303j732k138O76K424N01k038j328J334J768
$$ plain form
3413 1446 842 -1177 -1400 547 1702 365 -1438 -1045 776 1225 -204 -1179 -185 1128 677 -835 -1141
3430 -1141 198 1178 457 -741 -702 300 662 -80 -661 -170 642 553 -274 -709 -228 424 456 -37 -310 -92
3450 -92 192 120 -210 -294 51 429 353 -181 -544 -251 343 462 -44 -405 -68 432 216 -488 -581 271 875 293
3472 293 -729 -689 330 707 -76 -752 -221 814 645 -689 -1140 5 1158 660 -922 -877 437 1104
3490 1104 -56 -1292 -517 1140 1104 -664 -1569 -134 1480 809 -1007 -1153 709 1532 -40 -1681 -773
3507 -773 1454 1536 -691 -1873 -260 1640 861 -1302 -1425 800 1908 108 -1939 -1090 1473 1747 -576
3524 -576 -1910 -216 1733 931 -1497 -1605 843 2098 168 -1994 -1225 1387 1690 -617 -1858 -129
3540 -129 1866 869 -1566 -1701 785 2070 256 -1824 -1027 1293 1486 -772 -1755 -12 1923 882
$$ packed form
3413A446o04k019k23J947J155j337j803L93J821M49j429r75R94J313m51j512l06
3430a141J339R80p21j198L9J002L62p42n81M91Q12q9q27m35M81O52L2m93k73K18
3450i2K84p2l30q4L45L78p6n34l63K93N94J19n06l61L37N00k16p04r3Q52O04n82
3472B93j022M0J019L77p83o76N31J035j69j334m51J145J153m98j582M5J314O67
3490A104j160j236P75J657l6j768r05J435J614o71j816j46J862Q23j572j641R08
3507g73K227Q2k227j182J613J900p79k163j23K225J108j800k047Q49K563K74k323
3524e76j334J694J949q02k428j08K448J255j930k162P69K612L03k307j241J729
3540a29J995r97k435j35K486J285j814k080P97K320J93k258r83J743J935j041
$$ plain form
3556 882 -1497 -1644 647 1848 209 -1621 -784 1288 1304 -779 -1742 40 1790 891 -1249 -1420 536
3573 536 1520 92 -1403 -616 1185 1148 -671 -1529 -126 1356 817 -826 -1023 395 1088 24 -1081
3590 -1081 -437 854 966 -313 -1039 -313 698 532 -393 -543 159 599 46 -638 -498 357 635 49 -461
3609 -461 -338 192 295 -58 -225 2 315 230 -161 -414 -111 306 434 66 -295 -198 115 209 -70 -282 18
3630 18 437 277 -344 -564 -82 551 381 -312 -499 125 539 -62 -712 -338 596 832 -186 -976 -367 750
3650 750 698 -464 -797 205 995 218 -1090 -909 694 1248 -17 -1249 -563 956 923 -625 -1215 200
3668 200 1440 537 -1303 -1217 653 1542 78 -1426 -629 1183 1140 -816 -1588 112 1716 754 -1345
3685 -1345 -1385 682 1591 12 -1578 -606 1396 1225 -930 -1767 50 1775 811 -1329 -1327 730 1564 -178
$$ packed form
3556H82k379j47K291J201j639j830Q37K072J6k083r63J782J750q99k140j71J956
3573E36R84j428j495P87J801l7j819q58J403J482n39j643j97J418O93j064j105
3590a081O44J291J12j279p26P26J011j66r25j50P02M40n53o84J40Q55K78n86n10
3609d61J23N30J03l53j67K27L13q5l91k53L03M17J28l68l61R7L13R4k79k12L00
3630A8M19j60o21k20M82O33j70o93j87O24M14o01o50L74R34K36j018p90O09J117
3650G50n2j162l33J002P90p77j308J81J603N54j265j232O86J519l3j548n90J415
3668B00J240r03j840Q6J870Q89j464j504P97J812m3j956p72J700J604r62k099
3685a345m0K067R09j579j590R72K002j71k155q37J817J725r64k140KK057Q34j742
$$ plain form
3703 -178 -1666 -557 1613 1349 -921 -1779 51 1703 690 -1317 -1195 859 1571 -250 -1769 -569
3719 -569 1488 1308 -812 -1626 46 1498 512 -1293 -1047 913 1504 -191 -1626 -629 1231 1156 -614
3736 -614 -1298 95 1293 406 -1140 -926 727 1332 0 -1235 -588 849 853 -426 -932 99 991 346
3754 346 -857 -810 405 959 144 -741 -424 474 516 -279 -629 44 695 339 -485 -600 68 539 204 -321
3774 -321 -230 222 301 -125 -383 -112 356 373 -46 -358 -195 143 228 -8 -141 -27 180 145 -160 -327 -70 356
3796 356 371 -61 -401 -177 280 281 -162 -347 101 528 178 -530 -554 243 763 185 -606 -495 424 625 -264
3817 -264 -772 -96 850 625 -664 -919 194 1055 390 -928 -656 620 974 -313 -1232 -302 1184 936
3835 936 -707 -1242 121 1246 358 -1094 -813 858 1267 -323 -1492 -461 1238 990 -799 -1318 209
$$ packed form
3703a78j488J109K170k64k270q58J830J652j013k007J22K054P12j821j519J200
3719e69K057j80k120q14J672J452r86j805K46J960N91j695j435R97J860p5j770
3736f14o84J393J198q87j546K14J653O05j332j235O47J437Mj279n06J031Q92o45
3754C46j203M7J215N54q15q85L17Q98M2p95l50O73O51l56q24j15O68M71l35n25
3774c21R1M52P9m26k58K71M68J7m19l12J63L38Q5k36j33J14K07l5l05j67K57M26
3796C56J5m32l40K24M57Jm43j85M48M27l50p08k4P97N20n78p91J11R19K01q89
3817b64n08O76R46k25j289k55J113Q61o65j318K72J276L54j287r19R30J486k48
3835I36j643n35J363J125q88j452K81J671M09j590j169J031J699k48j789n19J527
$$ plain form
3852 209 1319 316 -1298 -918 984 1477 -348 -1571 -432 1279 973 -878 -1294 421 1520 203
3868 203 -1506 -975 1038 1457 -298 -1538 -373 1291 853 -1006 -1315 459 1529 250 -1450 -997
3884 -997 927 1403 -333 -1334 -287 1287 810 -971 -1196 348 1436 345 -1196 -944 665 1144
3900 1144 -270 -1176 -165 1152 754 -818 -1133 209 1139 336 -890 -683 532 773 -193 -998 -133
3917 -133 956 574 -540 -882 -3 820 284 -559 -451 457 690 -170 -710 -170 572 561 -344 -504 -55 387
3937 387 175 -401 -277 349 458 0 -446 -190 216 299 34 -242 -102 161 105 -148 -218 18 263 228 -49
3958 -49 -325 -148 143 273 75 -236 -126 211 250 -137 -421 -53 487 378 -249 -576 -83 570 356 -369 -493
3979 -493 297 646 -133 -837 -408 642 836 -227 -918 -227 775 387 -625 -773 428 1025 67 -1057
$$ packed form
3852B09J110j003j614L80J902M93j825j223J139J711l06j851m16J715J099j317
3868B03j709N31K013M19j755j240J165J664m38j859l09J774J070j279j700M53
3884i97J924M76j736j001J047J574m77j781k25J544J088j091j541K52J609M79
3900A144j414r06J011J317l98j572l15J342R30q03j226K07J215K41r66q05Q65
3917a33J089l82j114l42Q79Q23n36q43J08R08K33q60n40N40P42j1r05j60M49M42
3937C87k12n76J24O26J09m58m46K56M06Q3k65k76J40K63n6k53p0K36K45l5k77
3958d9k76J77K91J30j98l11J10L37L9l87k84L68N40j09o27l27M93O53k14p25j24
3979d93P90L49p79p04M29J050J94j063o91O91J002l88j012j48J201N97r58j124
$$ plain form
3997 -1057 -586 772 906 -293 -975 -129 1001 464 -921 -821 441 1212 175 -1078 -633 773 984
4014 984 -411 -1136 -35 1223 582 -1013 -1114 482 1336 183 -1192 -645 893 1001 -533 -1256 -10
4031 -10 1354 663 -1010 -1169 432 1293 139 -1192 -594 981 1022 -566 -1355 -79 1308 728 -910
4048 -910 -1096 378 1189 98 -1141 -570 943 1032 -476 -1227 -211 1033 634 -796 -1003 328 1021
4065 1021 3 -1090 -540 848 971 -361 -1071 -127 817 513 -635 -702 374 895 31 -889 -483 634
4083 634 760 -206 -771 -124 633 326 -555 -569 321 730 76 -680 -425 385 522 -115 -480 -50 463 217
4103 217 -387 -438 135 502 185 -318 -295 90 244 -35 -230 -49 191 175 -77 -265 -72 118 302 40 -149
4124 -149 -242 -14 192 63 -153 -123 142 286 -3 -450 -262 247 450 4 -422 -183 348 301 -261 -472 111
$$ packed form
3997a057M71J358J34j199o82Q46J130n37j385J00J262P71j037j253M45J406K11
4014I84j395p25J101J258o41j595j01J596Q54j153j375N47J538J08j534p23J246
4031a0J364o91j673j59J601Q61j154j331N98J575M1j588p89J276J387n80j638
4048i10j86J474Q11j091j239N71J513Q9j508p51J016J244l99j430k07J331O93
4065A021j018j093N50J388J23j332p10R44R44l04j148o7J076N21q64r20M06J117
4083F34J26r66n65O47P57l07q81j4Q90M09o54p56K55Q10J37o37l65M30N13k46
4103B17o04n1N73L67l17n03K3L85J54k79j95J81K40j6k52j88J93J90J84k62j89
4124a49r3K28K06j29k16L0K65J44k89m47J88N09K03m46m26K39N31m7n62k11N83
$$ plain form
4145 111 626 244 -549 -553 252 650 46 -625 -247 561 499 -419 -771 51 846 403 -636 -685 320 776 -29
4166 -29 -814 -290 777 674 -497 -975 20 969 449 -723 -716 452 913 -121 -1030 -331 924 852 -523
4185 -523 -1074 -4 1027 413 -841 -746 585 1048 -130 -1166 -436 963 911 -484 -1064 16 1049
4202 1049 393 -908 -795 619 1135 -60 -1158 -494 886 859 -449 -989 73 1030 347 -914 -800
4219 -800 566 1091 -9 -1035 -436 778 706 -480 -886 130 984 305 -849 -748 462 917 -17 -848
4237 -848 -292 691 548 -497 -781 153 875 300 -685 -614 354 686 -60 -667 -174 605 436 -432 -655 62
4257 62 663 271 -447 -407 254 447 -43 -456 -85 365 371 -229 -409 -80 373 145 -157 -177 22 153 3 -197
4279 -197 -62 144 264 90 -142 -233 -39 139 137 15 -116 23 103 47 -174 -201 25 309 157 -197 -292 28
$$ packed form
4145A11N15l82p93mQ05L98o04o71L78Q08o2r18l52Q22P95m43j039m9J005M56q05
4166b9p85N24J067j03j171m78R95R49n20j172PJ168M61j034r09O99J255p2j375
4185e23n51J070J031o14j254R5J331M63j178j036P30J399n2j395n80J080J033
4202A049o56j301J13J414N16j195j098O64J380k7j308n40J062R57o83j261J14
4219h00J366N25j100j026N99J214p2j186m06J016Q54o79j154J01J210M55r34q31
4237h48N56R83j43j045k84R34P22n75r85P1R68L32p46o07M93P79j69q68k23P17
4257F2O01l92p18M0O61J93m90m13L71M50Oo00j80L29M53k28l02k0J99J31j50k00
4279a97J35K06J20j74k32r1J94J78kj22j31J39Q0n6k21k7K26K84j52l54r5L20
$$ plain form
4301 28 307 109 -272 -179 246 345 -140 -480 -126 475 394 -208 -468 68 460 137 -460 -316 447 579 -151
4322 -151 -631 -152 526 465 -317 -584 135 655 108 -679 -470 486 744 -115 -797 -255 659 503 -464 -693
4342 -693 199 852 189 -817 -624 530 856 -119 -875 -253 750 548 -568 -847 212 993 270 -863
4360 -863 -687 493 877 -130 -912 -273 849 671 -648 -913 148 1002 266 -861 -579 451 816 -215
4378 -215 -853 -223 805 569 -472 -883 79 900 230 -717 -498 526 691 -232 -922 -156 784 488 -519
4397 -519 -729 169 726 78 -642 -405 549 641 -269 -787 -139 679 450 -425 -579 172 605 53 -592 -322
4417 -322 453 550 -155 -601 -148 444 305 -279 -373 133 406 19 -411 -260 254 372 -9 -308 -112 183 148
4438 148 -111 -163 67 211 68 -146 -160 15 129 94 -13 -55 -21 19 30 -24 -50 11 102 109 -53 -199 -84 157
$$ packed form
4301B8K79j98l81R3M25R9m85l40L54O01q1o02k60N36L92l23n97J44P63J32p30
4322a51m80M79O78o1p82k67P19N20n47p87K09R56K58q59o82N42R14j56r67k29
4342f93Q92O53o63j006J93J154L26r75p56O22J003k02j116k79J059P81p23j133
4360h63J76J180L84j007p82O39J122j78j319k65J061Q54p36j127K82J030L65j031
4378b15o38O30J028k36j041m11R62Q21o70r47K19J024J65r23o90P66R40k96j007
4397e19k10Q98N57o48p20K37R54R2r10n18O48Q18k29q75j54P51M33n52o45K70
4417c22P75R7p05m46M53N92j39n84r4N06K73l87m30J51N14J18l81k99J96K95l5
4438A48k59n2K30J44j43k14j4J75J14l5j07m2L4M0J1n4k6O1R1Pj62j46J15K41
$$ plain form
4462 157 178 -34 -184 -36 166 83 -198 -195 135 324 35 -321 -230 201 289 -89 -327 -21 358 238 -361 -343
4484 -343 155 529 92 -457 -296 202 340 -115 -510 -87 547 373 -448 -601 153 675 154 -557 -358 415
4504 415 557 -206 -678 -124 689 472 -482 -688 139 747 109 -670 -427 501 673 -238 -817 -167 778 524
4524 524 -459 -672 169 779 85 -731 -453 634 729 -272 -873 -111 626 426 -535 -650 236 811 22 -787
4544 -787 -336 561 694 -252 -747 -74 694 328 -545 -580 336 748 10 -746 -367 556 622 -248 -657 -8 652
4565 652 266 -549 -523 323 685 28 -622 -331 443 465 -222 -511 38 551 221 -449 -441 221 504 59 -414
4586 -414 -212 286 299 -176 -367 28 370 179 -257 -293 69 285 68 -198 -96 151 147 -86 -192 -8 188
4607 188 133 -71 -129 -18 55 35 -8 -7 50 52 -3 -57 -59 -10 81 107 26 -80 -95 17 88 10 -87 -10 145 89 -123 -203
$$ packed form
4462A57K1k12j50J48K02q3k81LL30J89k89l56R1M31Q8l78k38L06L79j20n99J8
4484c43M98L74m37n49J61M98J38m55l95M23O34j74q21j53P54N22n21p11J99P73
4504D15J42p63m72N54Q13k17r54k06Q27O08o38p79K43R28J72r11n79O50R45k54
4524E24r83k13Q41O10o94q16K78J087R5j001o01P62P37k00r61j15Q86N75p89q09
4544g87M51Q97J33r46m95O73P68l66q73l5R16M12p38p56L79R23O6q70m09O49O60
4565F52l86q15K6Q46L62o57o50K91P74K2o87k89N49N13l30o70QO62K83m45m73
4586d14K02M98J3m75j91L95L42j91m36l6L62K16k17k66J02K47mk33j06J84J96
4607A88n5k04n8J11P3k0m3JN7Kn5n4kM9R1K6q1j06j5J12P1p8r7P7J55n6k12q0
$$ plain form
4635 -203 14 236 150 -148 -206 78 223 -8 -272 -111 279 276 -164 -398 -57 366 218 -252 -312 157 409 -14
4657 -14 -460 -231 385 457 -165 -528 -74 488 273 -375 -426 249 587 31 -595 -315 464 538 -181 -592 -48
4678 -48 583 285 -489 -492 304 679 26 -664 -323 484 534 -250 -593 30 641 252 -567 -527 343 683 7 -646
4700 -646 -272 510 474 -334 -606 104 688 239 -590 -509 317 627 -48 -607 -190 547 415 -381 -607 124 677
4721 677 247 -523 -450 299 530 -73 -552 -137 527 398 -343 -559 63 561 203 -406 -337 273 428 -82 -462
4742 -462 -105 426 331 -229 -406 14 365 138 -292 -228 217 305 -78 -347 -103 268 244 -112 -242 23 200
4763 200 33 -172 -122 144 205 -33 -210 -88 132 122 -38 -90 39 88 7 -108 -66 65 112 30 -51 -61 -16 12
4787 12 21 35 -1 -9 10 22 -6 -66 -22 101 125 -20 -151 -70 106 148 -59 -145 34 196 47 -232 -198 147 293 21
$$ packed form
4635b03K17K22q6k98n8K84J45k31k64J61L90lm40k34L41M23j48m70o0M69K52m23
4657a4m46K29O16P2o22l63M54N62k15o48n1O75L38n56o26K80P79P4p19m11N44
4678d8O31k98p74lP96L75o53o90L41Q07N0p84l43O23O11l89q19M0Q70L40o76o53
4700f46L74P82l6q08k72P10N84m49q29Q1Q26L10o75n59M17P37j32p96k26P31N53
4721F77m30p70P3P49K31o03m79M15O64j29p41k16O22M98l58o09O9O10J55n10l80
4742d62L57N31r5n60j77M20L51k27m30O4M45Q8l83k69K44L71k4l56j30K65J77
4763B00j67k05N0K66O1k38j77J22K20j0j60n2J29M9q1j15M2J31M7q2q1j0M5K8
4787A2RJ4l6qJ9J2k8o0M4J23K4j45j31Q1J76M2k07q6J79J62j49k79L4L45J46k72
$$ plain form
4813 21 -307 -133 240 224 -162 -318 64 390 124 -352 -343 179 426 13 -418 -153 368 302 -262 -446 91 522
4835 522 183 -419 -372 243 461 -67 -477 -109 472 341 -343 -517 82 567 173 -446 -356 310 463 -137 -549
4856 -549 -84 555 368 -355 -529 110 570 121 -486 -306 398 489 -198 -596 -94 563 374 -361 -509 139
4876 139 535 76 -524 -288 393 485 -172 -588 -117 499 337 -327 -460 146 472 56 -487 -284 377 458 -92
4897 -92 -468 -110 412 239 -256 -401 141 393 62 -427 -318 231 385 -98 -359 -42 301 162 -265 -269 106
4918 106 338 65 -326 -198 201 216 -98 -214 -11 183 199 -114 -157 96 265 82 -234 -68 115 167 -116
4939 -116 -148 34 143 97 -150 -146 10 81 -4 -41 -28 1 58 -16 -44 -27 53 93 64 21 -103 -61 42 124 -19 -82 -136
4966 -136 136 89 -26 -168 30 239 145 -156 -236 88 236 97 -208 -85 186 263 -101 -315 -98 365 278 -225
$$ packed form
4813B1l28J74L73j6l86j56L82L26k66m76RN22K47m13m31K65N21o6n64j84N37M31
4835E22l39o02M7O15K18n28m10L68N81j31o84j74N99M85l94o19R0O66J53o00m12
4856e49M65O39j87p23j74O39M60m49o07J80P04R1o87l98N02O57j89p35j48O48
4876A39L96m59o00K36O81R2o57m16M71O16j62o64j33O06L26m16n43K03O61Q1n50
4897i2l76L58N22j73m95j45N42K52l31m89J09N49J54m83k61L17L43j39m27mL75
4918A06K32k73l91J28L99J5l14j16K03J94J6l13m3K53J69j83l16J66J83N2k83
4939a16l2J82J09m6k47MJ56P1q5l7J3K9N7p4k8J7Q0M0k9m3j24M2J03Q2j43o3n4
4966a36K72m7j15j42J98K09r4l01q0L24J48j39l05J23K71P7l64k14K17M63q7n03
$$ plain form
4988 -225 -313 5 307 50 -295 -169 296 384 -152 -444 -78 425 263 -276 -296 182 467 -8 -414 -130 382
5009 382 459 -145 -525 -6 400 242 -339 -332 290 500 -64 -447 -233 339 493 -189 -434 -30 452 249 -351
5030 -351 -377 272 527 82 -528 -217 407 445 -219 -559 14 478 248 -557 -409 216 506 32 -481 -284 381
5051 381 405 -181 -489 78 463 239 -404 -376 164 411 59 -354 -165 317 303 -195 -380 13 406 187 -306
5072 -306 -317 156 356 5 -313 -96 311 254 -135 -301 36 310 138 -221 -205 148 236 55 -249 -57 156
5093 156 211 -100 -229 -2 202 98 -136 -126 84 159 -16 -178 -76 113 135 -21 -120 -46 49 33 -67 -66 49
5116 49 45 55 -99 -72 -45 60 91 -8 -35 -50 32 61 4 -209 -55 142 132 -120 -192 -82 267 171 -140 -201 1 136
5142 136 64 -265 -106 279 263 2 -329 -114 198 226 -152 -310 -50 262 102 -277 -343 222 405 -48 -352
$$ packed form
4988b25q8L18L02k57l45J26M65Q8n36k92L66N03j62n39k0M78K85m75m06K84N12
5009C82P7o04l80N19M06j58n81PO22K10n64l83K14N72J54o82k45M04M82k03o00
5030c51k6O49K55m45o10L11O24L8o64l40N73M64k30q05J48O25K90m74n13J97O65
5051C81K4n86l08N67L85k24o43K8N40K47l52m13J89M82j4m98j85L93L93k19m93
5072c06j1M73K00l51l18K17M07n7l89j66L37K74j72l59J6L53Q8j81l04J92K13
5093A56N5l11j29K27K04j04k34J0K10P5j75j62J02J89K2j56r9P4R5j6j00JJ15
5116D9mJ0j54K7K7J05L1r9k7j5Q2K9n7k13J54J97j0k52p2J10L49r6l11o1K02J35
5142A36p2l29J59L85j6k61l31K15L12K8l78j58K60L12j60l79o6N65J83m53l04
$$ plain form
5163 -352 -155 303 221 -220 -357 55 392 118 -379 -295 229 399 -30 -403 -134 348 293 -240 -414 80 480
5184 480 161 -390 -353 233 433 -44 -443 -134 407 320 -260 -462 62 499 185 -383 -348 230 444 -30 -462
5205 -462 -134 418 355 -246 -475 17 468 189 -363 -300 237 399 -60 -450 -133 388 339 -219 -407 32 387
5226 387 118 -341 -255 238 362 -85 -408 -126 330 270 -181 -317 54 322 76 -298 -199 208 305 -55 -335
5247 -335 -110 248 182 -159 -238 48 258 56 -235 -176 151 236 0 -196 -82 127 133 -81 -154 -1 179 73
5269 73 -150 -168 11 194 56 -71 26 58 19 12 -127 -52 58 62 -1 -96 -101 -73 160 58 -70 -83 28 149 -10
5294 -10 -104 -64 48 197 3 -156 -110 127 211 14 -154 -24 253 110 -193 -165 151 252 113 -219 -119 209
5316 209 140 -47 -276 -22 229 181 -232 -264 68 313 86 -248 -164 240 326 -95 -238 -108 260 198 -234 -341
$$ packed form
5163c52J97M58q2m41j37M12L37k74m97Q4N24J70m29l73K69M82n5n33j74M94M00
5184D80l19n51L7N86K00m77l99L09N41q7n80k02N24M37l14n68L5N78K14m74m32
5205d62L28N52o3o01k29M92M51k79n52O3N37J62m59l90L17N21m9n58j88M39L55
5226C87k69m59Q6M93J24m47l23K82M56o0m51j36L71K68k46l74R9M07R7l60k80
5247c35K25L58o6l41p9K86K10k02k91N9L27Q5k36j96J14K09Ok14p3J53J80j06
5269G3k23j8J79J83j38j27R7L2l9pj39P5J10Mo3r5nK8K33j02j28j3J11J21j59
5294a0r4M0J12J49j94j59M6K37Q4j97j68J30K77j43l03K8L16J01j39l32J00L28
5316B09o9j87k29K54K51m8m13l2L32K45k27l34Q4M04Q6m21j43J30L68o2m32j07
$$ plain form
5338 -341 110 376 66 -334 -266 235 351 -143 -436 -143 348 332 -220 -378 105 403 101 -397 -261 259 401
5359 401 -68 -478 -130 367 292 -235 -369 125 427 76 -398 -291 298 418 -65 -421 -110 366 244 -269
5379 -269 -327 114 434 85 -376 -237 261 349 -83 -357 -61 338 201 -275 -329 126 378 67 -318 -208 225
5400 225 290 -85 -315 -33 304 183 -230 -288 78 305 77 -253 -175 149 224 -65 -233 -43 243 152 -131 -224
5422 -224 23 206 62 -135 -122 91 144 -15 -150 -72 111 123 -20 -124 -37 58 61 -28 -54 13 86 41 -43 -86 -12
5447 -12 79 61 -33 -50 -15 49 54 -57 -83 23 103 58 -100 -120 15 128 46 -125 -99 69 115 -29 -171 -47 154
5472 154 138 -96 -202 -4 188 125 -154 -172 78 222 -1 -262 -81 206 229 -73 -280 -41 244 163 -205 -237
5494 -237 158 298 42 -358 -172 243 291 -76 -332 -10 367 155 -219 -333 109 401 21 -336 -257 241 334
$$ packed form
5338c41M51K66l10m00O8N01J16m94k93K93M91j6n52j58M83K98l02m98J36N20J42
5359D01m69m10L48M97p5n27j34M94L02l51m74J07N89J20m83l56L11M76j22n13
5379b69n8M41L20l49m61J39M98Q8m32k74K96L99j37m76n4M55K52l11l85J10M33
5400B25O5l75k30K82L37j21m13n8L66K27k28l30P8L24P5k89j68J90K86r1k83r3
5422b24K47J83j44j97J3K13N3j59j35P8J83J2j43j04Q7R5Lq9k6O7P3m5q4m3P4
5447a2R1j8r4j7L5O4Nj11k6J06Q0m5j58k0J35J13q2j71K6J68M6j44j42J24K01
5472A54j6k34j06J98J92o3k79j8K50J44k23k61J81K87K3l02k07K39K85q1l68l2
5494b37L95J40k56m00J86M15M8l67k56L22L77k12l74j14M42K92l80l57P9M98R3
$$ plain form
5515 334 -103 -352 -22 347 201 -274 -338 133 331 45 -390 -192 238 288 -141 -405 -46 399 165 -332 -357
5536 -357 142 324 30 -369 -104 315 315 -208 -354 -10 434 214 -253 -267 129 303 44 -314 -178 309 232
5557 232 -78 -359 -15 280 121 -148 -229 102 276 27 -279 -196 119 194 -71 -224 -68 227 165 -128 -203 61
5579 61 239 54 -197 -128 137 199 1 -192 -89 131 107 -77 -131 -10 177 75 -133 -112 18 104 16 -79 -41
5602 -41 41 88 -32 -89 16 89 90 15 -76 -94 10 114 -3 -111 31 36 19 -158 -85 -10 91 143 -37 -163 -32
5627 -32 79 50 -107 -94 22 152 4 -158 -124 86 161 -3 -178 -77 139 133 -105 -194 14 232 87 -196 -208
5650 -208 93 258 13 -248 -130 201 214 -129 -293 4 308 161 -225 -268 97 302 20 -294 -145 246 268
5671 268 -145 -352 -23 325 179 -242 -274 137 329 2 -329 -151 272 273 -153 -366 -29 324 153 -253 -265
$$ packed form
5515C34m37k49L30L69j46m75o4M71J98k86m35J98M30N0m29k64L59M45k34m97k5
5536c57M99J82k94l99K65M19%n23j46L44M44k20m67j4L96J74k59l58J36M87p7
5557B32l10k81L44K95j59k69q1L31J74k49l06Q3L15P5k65j53J56K95o2k93p5K64
5579F1J78j85k51O9K65O2j98j93J03K20k4j84n4J21J87j02k08K1J30Q6q8r5L8
5602d1Q2M7j20n7J05P3Jp5r1j8J04J04j17j08J42Nj7j77P3P5J01N2j80j26J31
5627c2J11k9j57J3J16J30j48j62L4K10P5j64j75J01K16ok38q9K08K18j45k83j2
5650b08L01J65k45k61J18L31J3l43j64K97L04j47l86m3L65K05k82l14J49L91K2
5671B68m13k07L29L48j46m21l2M11J92l27l31J78M23Jm26k13L37L53j71m06j2
$$ plain form
5692 -265 139 315 -11 -351 -149 276 276 -146 -327 -11 325 143 -258 -249 168 332 -6 -329 -159 255 266 -126
5714 -126 -298 6 294 122 -244 -238 137 307 15 -284 -158 198 222 -106 -262 -7 251 112 -194 -219 81
5735 81 256 35 -207 -117 150 153 -62 -195 -25 190 118 -132 -175 28 161 29 -135 -88 93 114 -44 -136 -41
5758 -41 109 79 -58 -105 9 91 28 -59 -57 31 70 14 -80 -44 34 60 24 -29 -26 13 36 14 -43 -30 38 62 5 -88 -115 36
5788 36 115 -9 -94 -60 64 66 -32 -115 -2 146 101 -95 -140 23 153 55 -128 -117 99 168 -52 -217 -83 188
5812 188 176 -110 -229 5 222 75 -198 -168 129 244 -41 -279 -108 210 203 -132 -266 16 267 92 -236
5833 -236 -207 147 294 -13 -290 -119 236 216 -147 -276 36 291 101 -266 -226 163 295 -25 -290 -109 257
5854 257 191 -170 -265 53 323 94 -274 -216 162 284 -29 -287 -86 245 190 -178 -288 25 304 101 -240
$$ packed form
5692b65M04J76l26l40K02M25%m22j81L16L36j82m01RM17J64l38l23J70M14J1l92
5714a26j72L04K88j72l66OL75J70k92k99J26L56K4l28j56K55K58j39l06k5L00
5735H1J75k21k42R0K67Lk15j33J70K15p2k50m3K03J33j32j64M7J81K1j58r2R5
5758d1J50l0j37m7J14Q2o3q7KQ8L9n6r4L6P8K6l6n3LL9K3k2n7J3O8K4n7r3k7J51
5788C6P9j24q5L4J24Kr8q3J13J48m5j96m5J63J30r8j83J1K16O9k20j65J34K71
5812A88j2k86j19K34K17j47k73L0K97J15k85k38J71L18pl35j34K82K51j75l28
5833b36K9L54J47l07k77J71L55k0l63j29L12K55j90l67M0L89J32l20k65J81L66
5854B57o6l61r5L18K70k29l68N8L78J22l13k58K01L31n5l68j10L13K79k03l41
$$ plain form
5875 -240 -209 129 258 -32 -271 -77 232 188 -147 -270 19 261 100 -203 -188 113 226 -25 -238 -88 205
5896 205 193 -85 -204 -11 207 93 -145 -130 80 172 -5 -171 -88 131 140 -56 -145 -5 124 53 -106 -94 57
5919 57 126 5 -106 -70 66 79 -27 -77 -9 66 31 -60 -60 7 59 29 -50 -49 -2 29 21 -12 -35 2 23 18 -30 -54 -6 71
5949 71 46 -48 -85 0 78 25 -56 -67 62 108 -1 -122 -69 100 130 -24 -149 -30 131 83 -111 -137 55 190 46
5974 46 -175 -114 118 184 -48 -193 -32 191 126 -146 -208 50 230 49 -199 -163 127 187 -48 -232 -39 221
5996 221 138 -165 -228 46 253 52 -222 -153 156 212 -82 -263 -45 248 158 -173 -229 56 251 49 -223 -145
6018 -145 172 223 -85 -275 -59 248 161 -160 -241 61 260 59 -233 -154 168 235 -56 -276 -71 240 177 -144
6040 -144 -216 37 240 50 -210 -166 134 232 -44 -237 -74 185 135 -116 -179 47 213 55 -174 -142 123 188
$$ packed form
5875b40L1L38J29k90k39J94L09m4l35j23K89K42j61l03J5L01J13k51k13J50K93
5896B05j2k78j19J93K18j14k38J5K10R2j77j66Q3K19Rj96q9J40J29p1j59J2J51
5919E7O9j21j11L6J36J3j06n0O8P5l5r1%O7N2l0p9JM7L1ql3k3L7K1nm8k4M8P7
5949G1k5r4l7Q5P8n3q1j1J29M6j09j21N3J69L0j54j25J19J61m8j94k6J92J35j44
5974D6k21O1K32O6k32j45J61K23o5k72o2K58J80j81k48L6K90O0k35j84J93K60
5996B21q3l03o3K74K07k01k74O9L09N6k94j81K18K93r0l31n6K85J95k02k72P8
6018a45L17N1l08j90K16L07q7l21q1L02J99k01k92P9L22O7k91k20K05L11o3l21
6040a44p2K53K03j90k60M4L00R8k76j93J63K59n0k51o3K26J66j58k29L2K65O5
$$ plain form
6062 188 -21 -180 -35 152 102 -103 -145 52 177 51 -133 -106 75 141 -5 -120 -23 131 65 -71 -97 19
6084 19 121 51 -68 -65 34 73 -14 -66 -30 53 54 -30 -58 -21 42 45 -1 -42 -19 26 5 -14 -36 -16 34 35 -2 -54 -40 37 68
6115 68 -5 -73 -21 72 57 -49 -96 13 114 50 -95 -95 42 123 5 -128 -58 119 125 -65 -154 0 170 93 -110
6140 -110 -136 58 156 15 -166 -71 147 156 -87 -197 -22 183 105 -135 -158 74 194 8 -207 -109 169 178 -75
6163 -75 -216 -38 191 106 -160 -182 89 228 2 -233 -132 171 195 -85 -237 -22 227 107 -182 -205 85 242
6185 242 14 -258 -153 164 198 -90 -240 -24 228 121 -173 -206 71 246 44 -214 -104 175 150 -84 -244
6206 -244 -22 249 86 -141 -207 65 204 34 -268 -149 168 125 -77 -194 -34 180 104 -99 -154 33 141
6227 141 -18 -88 -86 137 135 -31 -165 -45 146 112 -113 -100 48 132 -2 -93 -54 96 110 -26 -124 -26 68 68 -46
$$ packed form
6062A88k09j59J45J87n0k05m2J97J25j26j84K7J81O6j46j15R7J54o6j36k6J16
6084A9J02p0j19LR9L9q7n2L6Q3Jq4k8L7O3Lm6m1K3M5k1j9k2K0N0Jl7n2J4P7L1
6115F8p3o8N2R3j5j06m7J09J01o4j45%J37Q1j18j33P0J77Oj90q9J54J70p7k03
6140a10k6J94R8j41j81R5K18Rk43j10J75K05p8k40k3K32J20j86k15R8K78Rk53
6163g5j41J78K29q5k66k2K71J39k26k35J01L03K4k80j52K15K49j20k89k3K90J57
6185B42k28k72J05L17L4k88j50K16K52j07k94l3K77J75k02k58J10K79k5k34j60
6206b44K22K71j63k27o6K72J39j70l02J19L17m3k02j17J60K14p6k03n5J87J08
6227A41j59p0KK23kj66j34J20J91l4k25J3J48Q4j34r1L9J50J4j36r8R8R4%j14
$$ plain form
6252 -46 -65 7 75 16 -67 -50 26 63 2 -41 0 18 66 34 -1 -50 -34 62 11 -70 -43 93 -1 41 -99 -147 59 -6 -74
6281 -74 -78 -69 79 93 -52 -120 -66 108 170 -100 -61 49 64 13 -135 -37 65 130 -55 -134 -89 146 103 -124 -126 38
6307 38 164 72 -140 -107 104 171 9 -189 -48 185 125 -85 -167 36 207 51 -182 -135 81 200 -9 -244
6329 -244 -67 117 129 -83 -200 -44 197 31 -175 -214 131 248 -6 -144 -91 99 58 -114 -206 -28 198 107
6351 107 -217 -144 86 228 -130 -282 -109 207 126 -141 -181 -13 281 34 -127 -200 96 183 -36 -224 -74 219
6373 219 136 -118 -203 4 196 69 -166 -136 95 175 -21 -192 -83 119 147 -77 -154 -4 156 55 -131 -127 100
6396 100 153 2 -146 -71 105 108 -48 -130 -17 122 53 -84 -103 51 110 8 -88 -68 68 88 -5 -88 -17 76 61
6421 61 -41 -84 -16 64 47 -37 -64 -5 57 30 -43 -47 30 58 21 -54 -55 12 60 16 -52 -54 40 75 -12 -86 -56 59 79 -23
$$ packed form
6252d6j9P2O8n9q3J7P6L7o1m3M1J8M8l2l5m9J6R6n1q1K7J36r4M2j40m8K06o5o8
6281g4mRJ48J4j45o8N4J74O2k70L9J10J5n1j48R8J02O5j85p9M5K35m3k27kJ64
6307C8J26r2k12L3K11O7j62j98J41K33o0k10q2K03J71j56k33M7K16J19k09k35
6329b44J77J84J2k12j17J56K41j66k06l9L45J17k54j38N3J90m1j72r2J78K26r1
6351A07l24P3K30J42l58j52J73L16q1k67m0J68K94k47j61p3K96Q7k19j88J50K93
6373B19q3k54q5K07J92j27k35L0K31Q0j96j71J09K02K8k24p7J50J60j01j86MK27
6396A00N3j51j48P5J76Lj56q2J13J39o9j37j9J54N9j02r6K0J36K0r3q3P1R3j5
6421F1j02m3O8Q0j7q4k7N9O2k7p3mP7K8l7p5jO7M8m4o8kR4L5q7p4L0J15K0j02
$$ plain form
6451 -23 -84 -25 67 53 -70 -106 20 110 31 -106 -100 54 128 -1 -75 -47 100 140 -22 -102 2 167 10 -60 -138 21
6477 21 175 15 -35 -108 165 127 -32 -145 -66 109 180 -171 -188 45 175 11 -137 -52 107 180 -71 -224 -144
6500 -144 244 174 -125 -197 -17 206 38 -263 -103 163 188 -116 -240 6 202 139 -172 -184 48 204 92 -214
6522 -214 -115 126 154 -69 -273 -36 206 116 -160 -231 85 215 57 -195 -148 117 153 -48 -187 -64 185 106
6544 106 -101 -213 31 136 26 -141 -126 73 149 -16 -149 -32 116 116 -105 -147 61 148 58 -122 -108 65 117
6567 117 32 -125 -68 105 95 -53 -116 -16 111 67 -66 -76 17 95 9 -93 -71 36 83 -6 -80 -52 52 60 -18 -50
6593 -50 -7 80 48 -45 -79 -2 78 47 -31 -67 9 65 25 -63 -51 37 81 18 -71 -46 47 79 -9 -67 -31 70 54 -57 -102
6622 -102 -10 90 49 -79 -103 13 113 24 -105 -64 69 110 -30 -146 -34 111 105 -52 -138 -6 167 13 -144
$$ packed form
6451b3o1N9R2j4j23l6J26R0p9j37OJ54P4j29p4K8J47M0j62q0J04J65j57p0p8J59
6477B1J54j60n0p3K73l8j59j13P9J75P1l51j7K33J30j64j48Q5J59P3k51j53Q0
6500a44L88p0k99p2J80K23j68l01J60K66K5l04j24K46J96o3l11j2K32J56j12l06
6522b14R9K41K8k23k04K37K42r0k76p1L16J30j58k52M7K65L6k01j39J23K49p9
6544A06k07j12K44J05j10j67J5J99P6j65j33J17J48%k21m2K08Q7r0j80J4J73N2
6567A17q5j57N7J73j0j48o3J00J27m4j33j0R3P8q6j02K2J07M7q9p4K8J04Qp8l2
6593e0M3Q7l2r3l4P7Q0l1p8l6P6N6m0q8J2Q8M4o3q9K5R3L2q8n8L6J01j6j11m5
6622a02R2J00m1j28k4J16J00q9j29M1J33M1j40j16J12J45oj57q6J32J73j54j57
$$ plain form
6645 -144 -97 79 184 -22 -166 -100 139 163 -59 -239 41 158 71 -124 -158 118 168 40 -182 -85 167 178 -120
6668 -120 -158 -22 258 126 -170 -226 172 208 36 -200 -83 125 155 -58 -236 39 178 48 -213 -146 69 215
6690 215 7 -237 -96 182 185 -79 -159 -5 216 82 -136 -121 50 196 -19 -142 -72 142 151 -90 -157 -31 184
6713 184 117 -95 -146 52 102 82 -265 -43 99 105 -41 -112 -79 103 86 -94 -65 0 147 38 -149 -150 37 117 26
6738 26 -144 -51 84 109 3 -123 -17 91 41 -81 -103 39 79 88 -78 -73 82 71 -65 -79 -24 104 74 -45 -78
6763 -78 -19 47 44 -13 -81 19 83 64 -53 -74 16 71 29 -52 -61 27 88 2 -94 -44 73 85 -18 -114 -38 101 77 -72
6791 -72 -113 7 114 51 -107 -104 56 138 5 -133 -76 117 126 -63 -153 -24 153 89 -123 -154 35 182 31 -167
6815 -167 -113 121 159 -41 -193 -39 170 104 -125 -182 30 197 55 -176 -129 119 185 -48 -201 -44 178 137
$$ packed form
6645a44M7J76J05k06j44O6K39K4k22j80K80J17q7j95l4K76N0j28k22R7K52J1k98
6668a20l8J36K80j32k96n6L98L6j72k36J17K08L0k13j78K75J39j30k61O7K15J46
6690B15k08k44J41K78Lk64q0J54K21j34k18J5J71J46k15j23P0K14Rk41o7J26K15
6713A84o7k12n1J98N0k0l47K22J42Oj46p1L3J82j7j80K9O5J47j09j87jJ87Q0r1
6738B6j70R3J35K5j06j26J06J08n0j22k2J42M0Rj66NJ55j1j36j4N5J28l0j19l3
6763g8N9O6ln7o8J00O4j9j17k1R0N5m2q1rQ8O1q6r6N0J17J2j03r6P6J39k4j49
6791g2m1J20J07o3j58LJ60Q2j33j38N7J93Rj89r0J29J77o4k12l1J89J47j51j98
6815a67N4K34L8k00j52J54K09o6k29n7K12J67j42k31M7K48O6k33j53J57K22m1
$$ plain form
6837 137 -103 -193 21 203 50 -175 -134 119 193 -36 -202 -61 178 141 -106 -191 23 196 62 -172 -135 111
6859 111 186 -18 -199 -76 164 156 -93 -194 7 189 67 -155 -146 89 182 10 -175 -93 144 142 -74 -190 -4
6882 -4 171 83 -125 -145 71 167 17 -140 -80 121 146 -42 -140 -30 134 97 -86 -127 31 131 33 -109 -87 75
6906 75 123 -12 -102 -43 95 90 -52 -109 -12 77 53 -63 -86 14 79 12 -76 -76 30 87 -3 -82 -46 46 72 -16 -88 -21
6934 -21 87 69 -28 -90 -9 91 52 -55 -83 9 95 22 -91 -74 55 112 2 -106 -53 85 109 -30 -110 -17 132
6959 132 87 -90 -126 27 160 40 -116 -99 93 157 -25 -156 -57 151 132 -83 -167 7 172 81 -145 -130 76
6982 76 175 -8 -179 -81 143 156 -93 -189 -11 181 84 -142 -145 80 203 5 -184 -96 158 155 -57 -195 -23 198
7006 198 89 -101 -208 76 230 8 -191 -149 137 162 -109 -257 11 217 74 -187 -154 45 249 -1 -172
$$ packed form
6837A37k40r0K14J82j53k25M1K53P4k29j66J41K39l7k47q5K14J73j34k34L7K46
6859A11P5k04j81J23K40qk49j01K01J82j22k22RK35R3j72j85Q2K37kk16j16J86
6882dJ75q8k08k0K16R6j50j57O0K01K5j88r8J10J64l7j83m1J58J00r8j42K2J62
6906G5M8j35r0N9J38nj42n7R7Q9k4j16k3J00O5o7q8%J06N7r0p9L6R2K6q8p2O7
6934b1J08j8r7o2Q1J00l9j07k8R2Q6p3j13J7J29N7j10j08N3J38K4j39q0R3J49
6959A32m5j77l6J53J33j20j56J7J92O4j82j31R9K08j9k15q4J74J65r1k26J5K06
6982G6R9j83j71R8K24J3k49r6J78J92r7k26lK25J23j98j89Q8K54lk12j38J72K21
7006A98j09j90j07K84J54k22j99M2K86K5k71j48K68K06j43k61L3J99K04k50j71
$$ plain form
7027 -172 -86 96 146 -63 -212 -25 147 96 -141 -175 37 176 50 -156 -173 67 170 -28 -178 -64 144 131
7049 131 -96 -167 6 155 70 -118 -115 92 152 -1 -129 -68 119 117 -40 -140 -2 133 73 -76 -103 28 125 30
7073 30 -101 -74 64 104 10 -88 -28 76 79 -42 -100 -17 69 57 -60 -91 13 90 38 -65 -71 31 82 20 -83 -57 52
7100 52 80 -14 -92 -44 76 82 -42 -103 -7 101 71 -78 -102 27 119 45 -105 -75 70 132 -18 -129 -52 114 116 -55
7126 -55 -147 -13 144 72 -104 -133 64 169 15 -153 -79 111 154 -46 -171 -26 164 97 -118 -155 43 178 33
7149 33 -167 -121 101 169 -42 -184 -49 162 126 -115 -177 24 204 69 -178 -140 115 187 -14 -187 -71 175
7171 175 155 -112 -192 18 216 86 -167 -161 96 194 -12 -216 -90 166 157 -94 -197 -4 207 100 -158 -152 78
7194 78 195 8 -187 -104 145 160 -62 -189 -18 166 105 -123 -154 52 170 24 -173 -113 102 146 -27 -153
$$ packed form
7027a72Q6J82N0k09j49J87J72n1k37l4K12J39j26k06j7K40J03j98j50J14K08j3
7049A31k27p1J73J49q5j88LK07O0j53j28O1J87kj57j00J38J35o0j49k7J31R7r5
7073C0j31K7J38M0r4r8O0J04Lj21n8Q3Q6j2j17l1J04P7n2j03oJ02N1o2j03K6J09
7100E2K8r4p8M8J20Oj24o1R6J08l0j49k4J29R2p4j50L0J45O2j50j11P7J66Kj71
7126e5r2J34J57p2j76k9J97J05j54j68P4J90M3k00j25J45J90o7k15l7J98J35j45
7149C3k00M6K22O8k11j42J35K11l6k41o2K01J80j35k47L8K55P2k01j73J16K46
7171A75k0k67q0K10J98j30k53OK57R8k06k04J26K56rk51j03J93K11j07k58OK30
7194G8J17j87j95Q3K49J5k22j27J71J84o1k28l1K06J18j46j97O0K15M4j73j26
$$ plain form
7216 -153 -38 129 87 -89 -140 30 139 38 -119 -93 63 122 -14 -114 -43 94 104 -46 -112 -8 109 69 -70
7239 -70 -96 19 95 26 -87 -78 58 104 5 -84 -52 70 82 -24 -90 -20 96 55 -55 -92 6 90 53 -78 -79 18 92
7266 92 22 -84 -74 56 118 -19 -128 -52 93 94 -49 -124 -20 119 70 -90 -136 27 130 43 -132 -95 86 134
7290 134 -17 -143 -57 122 99 -75 -144 24 160 75 -136 -131 59 177 7 -165 -82 119 144 -80 -179 -16 195
7313 195 72 -133 -140 50 186 33 -183 -113 128 166 -59 -203 -35 180 117 -133 -177 48 201 30 -205 -133
7335 -133 117 195 -42 -210 -46 188 138 -132 -194 29 201 59 -188 -142 121 200 -26 -207 -67 171 157 -118
7357 -118 -198 19 194 78 -161 -143 99 183 6 -171 -61 152 130 -63 -158 0 169 79 -116 -124 56 155 23
7380 23 -149 -78 108 128 -45 -145 -32 122 77 -86 -120 13 123 35 -113 -93 75 119 -2 -129 -46 85 90 -55
$$ packed form
7216a53J15J67m2j76n1J70J09j01j57K6J56N9j36j00P1J37J0j50o6J04J17m0j39
7239g0k6J15P6o9j13RJ36M6r9q9L2J22J2j06o6P0J16m1j10l7R8Q4l7j31jR7P4
7266I2p0j06J0J30O2j37j09P6J45Jj43p5J04J39m9j60m6J63J03q7j75L7J81M8
7290A34j51j26Q6J79k3j74o9J68J36q5k11NJ90J18j70j72Q3K01K5k24r9J63K11
7313A95j23k05pJ90J36j53k16P0K41L8k25j44J68K15o3k50m4K25J53j71k35P2
7335a33K50P8k37j68J64K34n0k70o2K23J72j42k47M6K63P9k26j81J40K38j4k75
7357a18q0K17J75j16k39J8K42Q4j77j77J10K13k2j93r5J58J69r0j95qJ80R9j32
7380B3j72P1J86K0j73j00J13J54m5j63l4J33J10q8j48K0J68M4j21j27Q3J31Nj45
$$ plain form
7404 -55 -94 -19 95 39 -42 -101 0 146 -7 -87 -89 55 98 16 -113 -50 43 79 -14 -79 -15 100 92 -46 -119 1 114
7431 114 107 31 -75 30 191 0 -76 -99 60 150 47 -97 -46 123 54 10 -103 96 167 40 -111 -142 17 155
7455 155 19 -138 -69 114 136 -19 -136 -70 147 131 -86 -168 20 161 43 -173 -110 88 218 29 -196 -90
7477 -90 195 160 -85 -191 84 227 19 -132 -185 130 92 44 -212 -66 125 134 -64 -187 26 194 118 -141 -112
7500 -112 81 221 -3 -150 -101 172 169 -77 -208 -17 198 134 -128 -173 55 202 38 -187 -123 153 167 -41
7522 -41 -206 -48 183 126 -118 -179 37 173 43 -159 -121 94 163 -25 -174 -49 141 129 -82 -150 8 152
7544 152 62 -131 -122 50 142 0 -131 -77 98 115 -58 -137 -27 121 80 -89 -115 29 135 40 -110 -89 57 112
7568 112 -6 -118 -57 76 95 -37 -119 -34 104 70 -65 -92 8 106 50 -98 -86 39 108 22 -100 -72 72 111
$$ packed form
7404e5l9P5J14n6q1n9J01J46j53q0kJ44M3q2j29O3R3L6r3o5O4J15qj38p3J20J13
7431A14pp6j06J05J61j91p6k3J59R0j03j44N1J69o9m4j13J99P1j27j51l1J59J38
7455A55j36j57O9J83K2j55j17O6K17j6k17q2J88J41j18k16O3J98J30j89k25J06
7477i0K85l5k45j06K75J43k08j51n3L15l8m8k56J46J91Rj98j23K13J68p6k59K9
7500a12J93J40k24j47M9K73lk46j31J91K15o4k62m5K28J47j64k25O4K76J4k08
7522d1j65J58K31n7k44o1K16J36j30k02L8K15O9j88j49J25J90j2k11o8J58J44
7544A52r0j93RJ72R2j42j31N4J75J7j73p9J10J48m1j69k6J44J06r5j50K1J46N5
7568A12j18j12O1J33J9j32q2Q5J38l4j35k7J00R8n6j48J2J25O9q6j22K8J44L9
$$ plain form
7592 111 -20 -104 -32 93 87 -42 -108 -1 123 71 -67 -97 31 132 28 -104 -84 66 134 -10 -144 -55 109
7615 109 121 -58 -141 -5 142 66 -114 -134 49 154 22 -159 -96 110 142 -43 -161 -41 160 104 -121 -180 55
7638 55 189 44 -179 -142 112 170 -39 -217 -85 145 99 -78 -193 29 176 82 -170 -180 111 226 -2 -246
7660 -246 -42 241 160 -121 -177 15 198 80 -154 -152 89 199 2 -201 -96 154 162 -81 -201 -12 191 99
7682 99 -150 -164 69 181 18 -186 -110 125 141 -49 -188 -23 172 99 -123 -169 40 168 38 -149 -103 94
7704 94 142 -23 -158 -45 132 105 -90 -142 1 136 62 -115 -114 70 137 11 -150 -91 89 101 -47 -137 -26 103
7728 103 84 -69 -100 25 127 24 -95 -81 59 112 -1 -110 -61 60 82 -25 -100 -28 80 70 -60 -119 -2
7751 -2 92 50 -69 -92 17 93 22 -102 -72 51 115 -5 -119 -38 81 104 -48 -117 -8 124 63 -87 -123 34 155
$$ packed form
7592A11j31q4P2J25oj29o6J07J24n2j38l0J28J01j04j32K0J50O8j44j34Q9J64
7615A09J2j79q3J36J47p6j80k0J83J05j32j81O3K06L2j85j18J20K01n6k25n9K35
7638E5J34j45k23L7K54N8k09j78J32K30m6j77j15K22J47r4k52j0K91J15k28k44
7660b46K04K83q1k81n6J92J83j18k34KK41J10j97k03J05K50Qk43j20J89K03r2
7682I9k49j4K33J12j63k04P6K35J6j90j39J65J95p3k22m6K09J28j30j87M6J97
7704I4M8j65j35J13J77k7j95n2J43J35p4j77JJ84O7j26j61N9J80J2j48r0J11J29
7728A03j9j53l1J25J02j03j19J4J40N3j13j09M9J21K2j07p5P2J08j0j30n9J17
7751bR4m2j19k3J09P6p1j24L0J23O4j20j14Q1J19K3j52o9J09J32o1j50l6J57J21
$$ plain form
7776 155 29 -116 -98 81 128 -17 -149 -52 128 102 -85 -158 -4 160 74 -137 -151 66 169 -5 -179 -84 125
7799 125 149 -80 -183 -13 177 106 -140 -169 68 180 21 -189 -121 132 175 -47 -195 -42 176 120 -134 -186
7821 -186 44 208 50 -183 -126 121 189 -40 -194 -66 171 143 -125 -177 44 205 79 -174 -143 94 176 -9
7843 -9 -201 -88 151 128 -104 -197 3 185 74 -159 -151 87 166 -12 -188 -85 125 142 -71 -166 -25 164 89
7866 89 -133 -144 67 162 19 -154 -96 100 134 -36 -154 -46 125 106 -83 -128 14 138 46 -126 -112 56 134
7889 134 9 -118 -52 98 98 -47 -108 -17 107 66 -70 -100 10 103 36 -91 -92 33 100 3 -106 -70 57 99 -22
7914 -22 -118 -33 73 72 -56 -124 -12 94 46 -90 -100 7 108 28 -105 -85 53 108 -2 -116 -63 110 103 -60 -153
7939 -153 -15 129 74 -115 -132 31 146 17 -134 -105 88 128 -29 -158 -38 138 125 -84 -172 32 176 65
$$ packed form
7776A55j26j45J8J79M7j45j32R7J80k6j87p3J54J64q6k11j4K17J03j74j74R5K09
7799A25K4k29j03J70J90p1k46k9K37J12j59k10O8K53M3k22j48J53K18n6k54n2
7821a86K30J64j58k33N7K47O8k29j54J28K37k8k68n2K21J61j26k53L1K37Q2j85
7843ij92J13K39k3k32r3K00J82j11k33QK38P9j78j76J03K10J7k13r5J41J89p5
7866H9k22j1K11R5j43j73N8J96L4j70j18J08J71j9j89m5J42J24r2j72J4J68P8
7889A34j25j27O6J50%j45o1R1J24m1j36l0J10R3o7j27jJ25O7r7j09L6J27M2j21
7914b2r6Q5J06jj28o8J12J06m8j36j0J07J01q0j33K0J38N5j10j14N3J73pj63r3
7939a53J38J44n5j89j7J63J15j29j51K9J93M0j57j29J20J76j3k09q8K04J44j11
$$ plain form
7961 65 -145 -150 58 194 41 -177 -55 142 145 -106 -154 -16 196 58 -171 -174 75 207 -22 -166 -104 130 165
7984 165 -62 -199 -88 138 129 -163 -176 47 214 37 -196 -110 177 171 -29 -230 -22 212 135 -94 -157 42 155
8007 155 110 -188 -83 170 220 16 -180 -3 117 132 -166 -170 -4 206 76 -145 -126 118 180 0 -168 -68
8029 -68 134 97 -114 -202 -32 171 56 -181 -131 40 99 -16 -167 -25 64 77 -66 -179 15 116 82 -101 -132
8052 -132 -24 131 18 -85 -104 55 110 44 -106 -41 61 96 -41 -87 34 113 72 -33 -98 1 55 41 -72 -93
8076 -93 23 115 -12 -100 -49 94 113 -20 -108 -45 65 75 -20 -123 -9 133 36 -82 -84 17 121 40 -113 -82 84
8101 84 103 -15 -145 -58 100 102 -69 -134 -7 156 76 -103 -125 45 155 20 -145 -88 106 151 -80 -199 -16
8124 -16 145 126 -103 -142 24 177 63 -138 -112 108 162 -30 -188 -67 156 134 -94 -187 0 192 75 -155
$$ packed form
7961F5k10nK08J36j53k18J22J97Lk51m8J38K12j38k29lK49J32k29j44O2K34L5
7984A65k27j37J11K26rk92j3K23J67j77k33Q6K87ok00k01K08K34p7k29o3J99J13
8007A55m5k98J05K53N0k04j96J77J20J5k98mJ66K10j30k21J9K44O2j80j68J00
8029f8K02l7k11q8J70K03j15k37N0J71N9j15j51J42Q9J3j43j13J94J01l4j83l1
8052a32J08J55j13j03j9J59N5o6j50O5J02L5j37m6J21P9m1j05o5R9N4j4j13k1
8076i3J16R2j27q8N1J43J9j33q8O3J10J0r5j03J14J42r7j18kJ01J04q1j53L1J66
8101H4J9j18j30Q7J58Kj71o5J27J63q0j79k2J70J10j35j65N7J94M5k31j19J83
8124a6J61j9k29l9J66J53j14k01K6K20N4j92j58J21K23k2k28r3J87J92j17k30
$$ plain form
8146 -155 -155 76 177 4 -180 -86 135 149 -86 -202 -8 168 94 -141 -161 67 187 11 -192 -103 140 170 -69
8169 -69 -183 -17 184 112 -116 -159 59 189 29 -161 -110 113 159 -53 -180 -34 160 116 -105 -171 42 144
$$ packed form
8146a55%K31J01j73j84R4K21J4k35j16J94J76p4k35k0K28J20j76k03Q9K43L0k39
8169f9j14J66K01p2k28m3K18J30j60j90N1K23M6k12j27J46J94m4k21o6K13J02
8191A44
$$ Imaginary data points
##PAGE= N=2
##DATA TABLE= (X++(I..I)), XYDATA
$$ plain form
0 0 0 0 0 0 0 0 0 0 8 -2 8 -8 8 -8 16 -16 16 -24 29 -32 40 -46 52 -57 66 -80 89 -102 114 -129 145 -166
32 -166 185 -207 231 -259 288 -320 353 -394 435 -482 533 -590 654 -726 808 -897 1000 -1122
50 -1122 1264 -1434 1641 -1900 2233 -2684 3328 -4332 6116 -10234 38311 -45228 -151378 3100
64 3100 137342 62574 -123813 -117199 66363 158804 11588 -145125 -84673 98752 119064
75 119064 -42390 -133544 -9128 132319 71250 -104913 -125598 39080 143495 33783 -116281
86 -116281 -83144 73688 107153 -30034 -121874 -22443 116597 82961 -74638 -120517 8782
97 8782 116095 45289 -86159 -76426 53370 97849 -13181 -109279 -41745 89880 90178 -38412
109 -38412 -103858 -15567 86371 49538 -61699 -72538 33355 91870 10667 -90401 -61121
$$ packed form
0@%%%%%%%%Qj0J0j6J6j6K4l2L2m0N3o1P2q6R8j09J23j46J69j91K16k43K74l11
32a66L51l92M38m90N47o08O73p47Q29r17J015j123J244j380J534j705J897k122
50a122K386k698L075l541M133m917O012p660J0448j6350M8545q3539j06150J54478
64C100J34242p4768j86387O614J83562R2441j47216j56713O0452J83425K0312
75A19064j61454r1154J24416J41447o1069j76163k0685J64678J04415j09712j50064
86a16281L3137J56832L3465j37187r1840R9431J39040l3636j57599m5879J29299
97H782J07313p0806j31448R733J29796M4479j11030r6098O7534J31625K98j28590
109c8412o5446Q8291J01938l6833j11237j0839J05893N8515q1203j01068K9280
$$ plain form
120 -61121 54675 87608 -4891 -81018 -31397 61008 53420 -40326 -73909 7318 83012 39058
132 39058 -61893 -73921 17338 76470 21382 -59352 -43929 40659 61696 -15743 -75774 -24760
144 -24760 65831 64066 -27748 -76455 -14382 62456 40215 -42941 -57008 21522 72421 13264
156 13264 -71896 -55685 41559 78609 2796 -71784 -35789 51980 55095 -31472 -72430 536
168 536 80254 43378 -60283 -78055 16753 83113 24049 -67171 -50342 47164 71389 -19761
180 -19761 -87899 -23929 80967 69087 -43863 -89940 -2306 83493 37115 -66786 -64085 43794
192 43794 89113 -3827 -97367 -47891 73188 85024 -28091 -93176 -13529 84136 46590 -67941
204 -67941 -78974 35892 102285 15650 -95979 -65076 60026 89713 -16915 -92012 -19744
$$ packed form
120f1121J15796L2933r2499p6127M9621R2405p588r3746l3583Q1227P5694m3954
132C9058j00951j2028R1259N9132n5088q0734J5423Q4588K1037p7439o0031N1014
144b4760R0591j765r1814m8707O2073P6838k2241q3156j4067P8530N0899n9157
156A3264q5160J6211R7244L7050p5813p4580L5995Q7769L115q6567m0958P2966
168E36P9718l6876j03661j7772R4808O6360n9064r1220J6829R7506K4225r1150
180a9761o8138O3970J04896j1880j12950m6077Q7634Q5799m6378j03901K701J07879
192D3794M5319r2940r3540M9476J21079J1836j13115o5085P9647R7665l7546j14531
204f7941j1033J14866O6393q6635j11629L0903J25102K9687j06628p5097P2268
$$ plain form
215 -19744 85198 56317 -64894 -91268 21546 104407 32622 -84331 -71012 46942 86131
226 86131 -10677 -89410 -25409 82685 65987 -53505 -95215 3982 94215 42130 -68056
237 -68056 -68004 36847 80396 -5268 -85788 -33988 73348 72796 -35453 -89104 -10849 77359
249 77359 43818 -53845 -62449 29182 76327 3705 -78690 -44201 56289 73157 -15921 -75348
261 -75348 -19656 60509 41977 -42689 -59532 18880 72163 17185 -64602 -52022 34220 65741
273 65741 397 -58720 -23969 46371 41665 -30721 -58469 2864 62689 32205 -43269 -53527
285 -53527 11975 53226 12289 -43736 -28207 33164 44536 -13795 -55217 -17275 45675 42928
297 42928 -18634 -48216 -6399 40139 21506 -31144 -35101 17725 47981 8006 -46050 -35757
$$ packed form
215a9744J04942k8881j21211k6374J12814Q2861p1785j16953J3319J17954L9189
226H6131r6808p8733O4001J08094j6698j19492m1710R9197R0233n2085j10186
237f8056N2J04851M3549q5664q0520N1800J07336n52j08249n3651P8255Q8208
249G7359l3541r7663q604R1631M7145p2622q2395L4489J00490J6868q9078n9427
261g5348N5692Q0165j8532q4666j6843P8412N3283n4978q1787J2580Q6242L1521
273F5741o5344n9117L4751P0340m706p2386k7748O1333N9825l0484p5474j0258
285e3527O5502M1251m0937n6025J5529O1371J1372n8331m1422L7942O2950k747
297D2928o1562k9582M1817M6538j8633n2650l957N2826L0256l9975n4056J0293
$$ plain form
309 -35757 23833 46848 2764 -40723 -19590 30799 31589 -19944 -44716 -1360 48552 30244
321 30244 -31732 -48144 3763 46318 17764 -35857 -31120 25090 44624 -6701 -53619 -22853
333 -22853 43724 48393 -16268 -54487 -10897 46147 28859 -35198 -44592 19010 58814 9941
345 9941 -57810 -42501 34861 59429 -4037 -57643 -20024 48691 39497 -35512 -59376 9353
357 9353 68785 27148 -55252 -55479 25412 63876 3149 -60299 -26619 51923 51060 -31996 -70926
370 -70926 -3617 70291 40026 -47635 -60020 18512 64464 7040 -62741 -33719 51612 61234
382 61234 -22775 -74487 -16096 63671 45453 -39121 -58755 14529 64167 11101 -62891 -41691
394 -41691 45098 66183 -10486 -69313 -23686 53589 44441 -33118 -56182 11436 63809 17494
$$ packed form
309c5757N9590K3015m4084m3487K1133N0389P90n1533k4772M3356M9912j8308
321C0244o1976j6412N1907M2555k8554n3621M737N6210J9534n1325m6918L0766
333b2853O6577M669o4661l8219M3590N7044j7288o4057r394O3602L9804m8873
345I941o7751J5309P7362K4568o3466n3606L7619O8715r194p5009k3864O8729
357I353N9432m1637q2400k27Q0891L8464o0727o3448L3680P8542q63q3056l8930
370g0926O7309P3908l0265q7661j2385P8532M5952n7424o9781K9022Q5331R622
382F1234q4009n1712N8391P9767j8218q4574j9634P3284M9638n3066p3992K1200
394d1691Q6789K1085p6669n8827M5627P7275r148p7559k3064O7618N2373m6315
$$ plain form
406 17494 -58576 -48418 33418 64304 308 -59327 -25839 44790 41981 -28688 -55423 5281
418 5281 61220 26155 -48066 -50884 19593 56292 7337 -48395 -25539 37711 41174 -21624 -54144
431 -54144 -5363 52531 33566 -32016 -46904 6906 44849 11559 -38236 -26307 28987 41634
443 41634 -9279 -48310 -17647 36894 36225 -14839 -38723 -3078 34074 15626 -28605 -29371 16180
456 16180 40291 6586 -36296 -27270 18219 33597 -192 -29569 -10949 25007 21696 -17304
468 -17304 -33382 -568 34861 21889 -20609 -31922 1785 29030 10465 -23367 -19302 17388
480 17388 30254 -3294 -35513 -18141 25447 32808 -5807 -33019 -9834 26636 19565 -20277
492 -20277 -30260 8400 38908 13003 -33952 -33052 14900 39272 5052 -34296 -18312 27550 30316
$$ packed form
406A7494p6070J0158Q1836L0886o3996n9635L3488P0629k809p0669k6735O0704
418E281N5939l5065p4221k818P0477L6699m8955n5732K2856O3250L463o2798l2520
431e4144M8781N7894j8965o5582j4888N3810L7943l3290m9795J1929N5294J2647
443D1634n0913l9031L0663N4541o69n1064k3884L5645L7152j8448m4231p66M5551
456A6180K4111l3705m2882R026M5489J5378l3789k9377J8620L5956l311l9000
468a7304j6078L2814L5429j2972m2498j1313L3707K7245j8565l3832M065L6690
480A7388J2866l3548l2219J7372M3588P361l8615k7212K3185L6470p071l9842
492b0277r983L8660L0508k5905m6955R00M7952K4372l4220l9348J5984M5862K766
$$ plain form
505 30316 -17176 -42384 -3377 44001 28260 -28688 -42480 6308 42576 11513 -37207 -26101
517 -26101 29130 42003 -11122 -51242 -16111 43340 38460 -22265 -46292 1373 45025 15908
529 15908 -40581 -34736 27616 51369 -1953 -53442 -25980 38208 42247 -17430 -47066 -1059
541 -1059 47472 20923 -41442 -42880 21524 55256 7400 -49416 -30437 32469 41837 -15079 -47546
554 -47546 -3613 49035 27315 -37939 -47901 12867 52882 13435 -43028 -30426 28865 40883
566 40883 -13505 -48836 -8365 47563 33350 -30326 -47925 4930 46628 15304 -37446 -28903
578 -28903 26488 41124 -9531 -48232 -15150 40650 36038 -20163 -42705 -415 38812 15103
590 15103 -32574 -28619 21701 40853 -1534 -42336 -21226 28867 33746 -10373 -34479 -3847
$$ packed form
505C0316m7492k5208L9007M7378j5741n6948j3792M8788L6268l1063m8720J1106
517b6101N5231J2873n3125m0120L5131N9451m880o0725k4027M7665M3652k9117
529A5908n6489N845O2352K3753n3322n1489K7462O4188M039n9677k9636M6007
541a059M8531k6549o2365j438O4404L3732m7856n6816J8979O2906R368n6916l2467
554d7546M3933N2648k1720o5254r962O0768M0015l9447n6463J2602N9291J2018
566D0883n4388l5331M0471N5928j4213o3676j7599N2855M1698l1324n2750Q543
578b8903N5391J4636n0655l8701L3082N5800m612n6201k2542M2290L9227k3709
590A5103m7677L955N0320J9152m2387m0802K1110N0093M879m4119k4106L0632
$$ plain form
602 -3847 31366 15905 -26379 -29288 12585 37167 8222 -30968 -23970 15588 27814 -2531 -26302
615 -26302 -7053 24460 18656 -16867 -29220 191 28821 16463 -16959 -22827 4389 21691
627 21691 3807 -20291 -12406 16518 23050 -4190 -26603 -12311 17900 21279 -4813 -20710 -3957
640 -3957 18256 10791 -15689 -20279 6457 26472 9672 -21020 -21876 7386 23540 3894 -20255
653 -20255 -11244 17211 20083 -9841 -28384 -5887 26765 21849 -13888 -27828 -507 25533 10367
666 10367 -22003 -19816 15806 30369 -1213 -33539 -17880 23718 29650 -7672 -30964 -5355
678 -5355 28483 16338 -23901 -29023 11790 38049 8472 -33904 -26058 19169 33145 -4048 -33438
691 -33438 -8560 31753 23103 -23701 -37132 5241 40647 16275 -30804 -29502 16071 34386
$$ packed form
602c847L5213j5461m2284k909M1873K4582k8945l9190O998L9558J2226l0345k3771
615b6302J9249L1513n804l5523j2353K9411K8630j2358l3422n868K7216J7302
627B1691j7884k4098P885K8924O532k7240k2413J4292L0211L379k6092j5897J6753
640c957K2213p465k6480m590K6736K0015j6800l0692q56K9262J6154j9646k4149
653b0255R011K8455K872k9924j8543K2497L2652m916l5737j3940K7321K6040j5166
666A0367l2370K187L5622J4563l1582l2326J5659M1598N932l7322k3292K5609
678e355L3838j2145m0239n122M0813K6259k9577m2376P846M5227J3976l7193k9390
691c3438K4878M0313q650m6804j3431M2373L5406k4372m7079J302M5573J8315
$$ plain form
703 34386 -2737 -36385 -12287 33753 29938 -20043 -41318 -1683 38923 20013 -27418 -29832
715 -29832 15070 35891 -1186 -39045 -17420 32359 35016 -14117 -40961 -6404 35232 20560
727 20560 -25562 -29969 14540 38003 2298 -39104 -22675 27385 36014 -8141 -37006 -8127
739 -8127 31439 19713 -24204 -30617 11715 38280 7638 -34346 -25313 19596 32451 -3639 -31112
752 -31112 -8245 27646 19583 -20570 -30686 5410 33865 12949 -25210 -24155 11550 26265
764 26265 -648 -25289 -8973 22786 20462 -13384 -28454 -2590 25496 15691 -14877 -20048 5226
777 5226 20286 2188 -20345 -11720 15899 21353 -3636 -22930 -9682 15258 15814 -6133 -16044
790 -16044 91 16366 6752 -15009 -16030 6408 20567 6425 -15373 -14309 6123 14935 249
$$ packed form
703C4386l7123l3648K4098M6040l815m9981k1275L9635M0606j8910m7431k414
715b9832M4902K0821l7077l7859K1625M9779K657m9133k6844L4557M1636j4672
727B0560m6122m407M4509K3463l5705m1402J6429N0060Q629m4155k8865K8879
739h127L9566j1726m3917o413M2332K6565l0642m1984R033M4909J2855l6090k7473
752c1112K2867L5891q063m0153j0116L6096K8455k0916l8159J055L5705J4715
764B6265k6913k4641J6316L1759k324l3846j5070K5864K8086r805l0568n171K5274
777E226J5060j8098k2533Q625K7619N454k4989j9294J3248K4940N56k1947r911
790a6044J6135J6275r614k1761j021K2438J4159j4142k1798J064K0432Q812j4686
$$ plain form
803 249 -14290 -5582 13669 13525 -7740 -19827 -4414 17161 14603 -7608 -16913 -632 15314
816 15314 6084 -14171 -13241 9687 20751 1783 -21018 -14438 12143 19920 -1609 -18981 -5638
829 -5638 17227 12898 -13745 -21735 3330 25597 11279 -19192 -21054 7560 22822 2036 -21723
842 -21723 -10269 19434 20482 -11118 -28352 -4060 26561 17936 -16144 -24190 5130 25184 4218
855 4218 -24917 -15645 20044 27377 -6577 -31627 -10052 25075 21173 -14458 -25748 4603 28450
868 28450 6865 -27754 -21316 18307 31653 -1675 -31329 -13152 23484 21810 -14561 -27652
880 -27652 4122 31628 10818 -28009 -25835 14503 32278 1753 -29236 -13571 22721 22065 -14782
893 -14782 -29842 1771 32470 15053 -24599 -27078 9965 29487 3126 -26420 -12895 21847
$$ packed form
803B49j4539Q708J9251j44k1265j2087J5413K1575k558k2211r305J6281J5946
816A5314r230k0255R30K2928J1064j8968k2801O580K6581P777k1529j7372J3343
829e638K2865m329k6643p990K5065K2267j4318l0471j862K8614J5262k0786k3759
842b1723J1454K9703J048l1600j7234K4292L0621q625l4080q046K9320K0054k0966
855D218k9135R272L5689P333l3954k5050K1575L5127l902l5631j1290L0351K3847
868B8450k1585l4619O438L9623J3346l3328k9654J8177L6636j674l6371j3091
880b7652L1774K7506k0810l8827K174M0338J7775l0525l0989J5665L6292o56l6847
893a4782j5060L1613L0699j7417l9652k479L7043J9522k6361k9546J3525L4742
$$ plain form
905 21847 22682 -12814 -30278 -2468 29029 17393 -18491 -24441 6280 24825 3233 -23509 -12789
918 -12789 19203 22992 -7919 -27315 -6824 22033 16851 -12066 -19812 3833 20570 3996 -20077
931 -20077 -13989 13742 21837 -1376 -21281 -9624 14014 14281 -7117 -15842 1381 17298 6694
944 6694 -15170 -15577 6120 18563 4735 -13863 -10507 7502 12007 -3141 -13565 -2571 13777
957 13777 10834 -8043 -15960 -2091 13378 8991 -6991 -10512 2483 11186 1651 -11985 -8489
970 -8489 8427 14693 730 -13976 -9044 7505 11628 -1657 -11407 -2313 11627 7989 -9293
983 -9293 -14800 989 16268 8952 -10389 -13798 2912 13805 2261 -13408 -7848 11805 15266
996 15266 -4656 -19395 -6621 15521 14625 -7270 -16657 315 16569 5815 -15954 -14156 10523
$$ packed form
905B1847Q35l5496j7464K7810L1497j1636l5884n950L0721J8545k1592k6742J0720
918a2789L1992L789l0911j9396K0491K8857n182k8917p746K3645J6737j6574k4073
931b0077O088K7731Q095k3213j9905J1657K3638K67k1398q725J7223J5917j0604
944F694k1864m07K1697J2443j3828j8598L356J8009M505j5148j0424J0994J6348
957A3777k943j8877p917J3869J5469m387j5982l521J2995Q703r535j3636L496
970h489J6916O266j3963j4706M932J6549M123j3285r750R094J3940l638j7282
983i293n507J5789J5279p316j9341l409J6710J0893j1544j5669N560J9653L461
996A5266j9922j4739J2774K2142q96k1895r387J6972J6254j0754k1769J798K4679
$$ plain form
1009 10523 21319 845 -21146 -12056 13995 17510 -6034 -19222 -953 20201 9968 -17603
1021 -17603 -20102 7806 24760 5277 -21054 -14565 13624 19180 -6470 -22545 -2509 23531
1033 23531 14585 -17285 -24107 4602 25463 7474 -20581 -15145 14469 21074 -6722 -25808 -5409
1046 -5409 24487 18385 -14819 -25069 2142 24119 7663 -20371 -15432 15034 23003 -5068 -26847
1059 -26847 -8776 22066 19543 -11242 -22987 956 22020 7259 -19707 -16064 13462 23607
1071 23607 -1477 -24272 -11053 17155 17834 -8108 -19558 622 19869 7479 -17687 -16748 9512
1084 9512 21728 2390 -19060 -11110 12173 14703 -6010 -16706 -240 17560 9119 -13636 -16634
1097 -16634 4219 17759 5045 -13181 -9782 8461 12184 -3938 -14787 -2835 14146 10959
$$ packed form
1009A0523J0796k0474k1991R090K6051L515k3544j3188J8269K1154j0233k7571
1021a7603k499K7908J6954j9483k6331O489K8189N556k5650j6075K0036K6040
1033B3531q946l1870o822K8709K0861j7989k8055N436K9614O605k7796j9086K0399
1046e409K9896o102l3204j0250K7211K1977j6456k8034M939L0466P969k8071k1779
1059b6847J8071L0842k523l0785j1745K3943K1064j4761k6966L643K9526J0145
1071B3607k5084k2795J3219K8208O79k5942j1450K0180J9247j2390k5166R39K6260
1084I512J2216j9338k1450P950K3283K530k0713j0696J6466J7800q441k2755k998
1097a6634K0853J3540j2714j8226L399J8243L723j6122j0849J1952J6981l187
$$ plain form
1109 10959 -7880 -14762 -805 12450 6229 -8373 -8472 5295 10965 -669 -12495 -6720 8863
1122 8863 11931 -1024 -11198 -4799 7211 6867 -4270 -8152 1168 10267 4576 -8498 -10288 1743
1136 1743 10884 4847 -6814 -7374 3089 7855 -254 -9127 -4142 8383 10285 -2660 -12353 -4951
1150 -4951 8745 9088 -3610 -9565 269 10283 4084 -10141 -10235 5322 14412 3167 -12433 -9513
1164 -9513 6882 11635 -2170 -12680 -2408 13058 9206 -9943 -15645 1631 16669 7324 -12255
1177 -12255 -12112 6708 14238 -1822 -16238 -5428 15397 14117 -8615 -18957 -1507 17410 9161
1190 9161 -12578 -13625 7598 17460 -792 -19537 -9117 15828 17772 -6435 -19989 -3107 17419
1203 17419 9537 -13610 -15280 8037 20383 1424 -20620 -12313 13996 18669 -4552 -19117 -3320
$$ packed form
1109A0959j8839o882J3957J3255o221j4602r9J3767N670j1634j1826N775J5583
1122H863L068j2955j0174O399J2010l44j1137l882R320R099n691j3074j790J2031
1136A743R141o037j1661n60J0463M766q109q873M985J2525J902j2945r693P402
1150d951J3696L43j2698n955R834J0014o199j4225r4J5557R090j1245j5600K920
1164i513J6395M753j3805j0510J0272J5466l852j9149n702J7276J5038r345j9579
1177a2255J43J8820P530j6060j4416J0810K0825j280k2732j0342J7450J8917q249
1190I161k1739j047K1223R862j8252j8745J0420K4945J944k4207j3554J6882K0526
1203A7419p882k3147j670K3317J2346j8959k2044Q307K6309M673k3221j4565J5797
$$ plain form
1216 -3320 17356 10015 -14179 -17066 6900 21406 4134 -18932 -13490 11289 17218 -3613 -17679
1229 -17679 -3047 17063 10661 -13124 -17873 4041 19693 6133 -15308 -12421 8925 14905 -3324
1242 -3324 -16456 -3536 15967 11693 -10188 -17077 860 16168 6707 -11760 -10481 7441 13191
1255 13191 -2397 -15354 -5067 13178 12310 -6080 -14450 -1518 12037 6013 -8967 -8990 5884
1268 5884 12254 -161 -12987 -7114 8647 11358 -1818 -10551 -2806 8229 5366 -6361 -8397
1281 -8397 2946 10678 3255 -8692 -8276 3040 8665 1622 -6504 -3614 4925 5616 -3033 -8031 -1554
1296 -1554 7607 6620 -3000 -7954 -1973 5596 4095 -3404 -5055 1889 6839 1446 -7126 -6473 3383
1311 3383 8824 2249 -6812 -5539 3688 6359 -1527 -7474 -1368 8302 6589 -5445 -10473 -802 9646
$$ packed form
1216c320K0676p341k4194k887K3966J4506j7272k3066N442K4779N929k0831j4066
1229a7679J4632K0110o402k3785m749K1914J5652j3560k1441K887K1346N980j8229
1242c324j3132J2920J9503m274k1881o889J7937J5308r461j8467J279J7922N750
1255A3191j5588j2957J0287J8245q68j8390q370J2932J3555o024j4980k3J4874
1268E884O370j2415j2826N873J5761K711j3176q733P745J1035k863j1727k036
1281h397J1343P732p423j1947M16J1316N625p043q126K890Q539O91q649m998O477
1296a554R161r87r620m954N981P569j501p499j651O944M950n393q572O53R856
1311C383N441o575r061J273R227K671p886n947O106R670j713j2034n028R671J0448
$$ plain form
1326 9646 5847 -6147 -7790 3137 9183 64 -10645 -5418 9067 11181 -3039 -12848 -3735 10236
1340 10236 7821 -6819 -10248 3421 12809 2193 -13230 -9580 8605 14308 -1003 -14008 -5212
1353 -5212 11152 9251 -8051 -13176 2952 15939 5131 -13968 -12581 7151 15415 202 -14361
1366 -14361 -5683 12268 10757 -8587 -15713 1255 17091 7706 -12743 -13499 5715 14928 375
1379 375 -14491 -5916 12883 12287 -7671 -16775 -976 15914 8777 -10674 -12590 5042 14025 198
1393 198 -14558 -6621 12302 13377 -5511 -15913 -2716 13386 8247 -9022 -11193 4940 13457
1406 13457 601 -14066 -7932 10246 13111 -3040 -13476 -3222 10900 7069 -8107 -10284 4302
1419 4302 12956 2153 -12240 -8658 7112 11453 -897 -10476 -3006 8828 6122 -6931 -9721
$$ packed form
1326I646l799j1994j643J0927O046r119j0709N227J4485K114j4220r809R113J3971
1340A0236k415j4640l429J3669R388j0616j5423L650J8185N703j5311j3005Q796
1353e212J6364j901j7302n125J6128J2987j0808j9099J387J9732Q264j5213j4563
1366a4361Q678J7951j511j9344p126J6968J5836r385k0449p56J9214R213j4553
1379C75j4866Q575J8799n96j9958r104J5799J6890p137j9451j916J7632Q983j3827
1393A98j4756P937J8923J075j8888j0402J3197J6102n139j7269k171J6133Q517
1406A3457j2856j4667O134J8178K865j6151j0436J0254J4122l831j5176k177J4586
1419D302Q654j0803j4393L582J5770M341j2350r579P470J1834k706j3053k790
$$ plain form
1432 -9721 2320 11284 3995 -8491 -8279 3507 8491 287 -7360 -2837 6630 5973 -4241 -8702
1446 -8702 -802 7968 5344 -3953 -6330 314 5463 1266 -4750 -3560 3764 6047 -327 -6383 -4117
1461 -4117 3330 5545 434 -4366 -1977 3286 3045 -2612 -5016 181 5906 3964 -3476 -6334 -631
1476 -631 5290 3119 -3121 -4086 2129 5470 -67 -6805 -3979 5002 7520 -672 -7656 -3307 5419
1491 5419 5291 -3429 -6686 1294 8550 3009 -7940 -7911 3693 9956 1563 -8496 -4987 6218 7301
1506 7301 -4033 -9908 -253 10999 6358 -7993 -10679 2238 11072 2670 -9391 -6136 7538
1519 7538 9727 -3897 -12645 -2528 11820 8835 -6970 -11667 1333 11398 3094 -10443 -7360
1532 -7360 8124 11903 -2670 -13740 -4612 11035 9620 -5969 -11348 1371 11798 3071 -11392
$$ packed form
1432i721J2041Q964p289j2486K12J1786M984q204p647M523R467o57j0214m461
1446h702P900Q770k624r297k377O644N149m197o016J190P324K283o374o056K266
1461d117P447K215n111m800K389N263k41n657k404N197N725j942p440k858N703
1476f31N921k171o240r65O215L341n537o738K826Q981K518q192o984M349Q726
1491E419j28q720l257P980P256n541j0949K9J1604O263q393j0059L509J1205J083
1506G301j1334n875R655J1252m641j4351k686J2917Q834q402j2061L255J3674
1519G538K189j3624q748J0117J4348k985j5805m697J3000J0065q304j3537L083
1532g360J5484L779j4573j1070R128J5647j415j5589n379J2719J0427q727j4463
$$ plain form
1545 -11392 -8550 7713 12992 -902 -13181 -5399 9760 9059 -5678 -11015 1660 12344 3776
1558 3776 -11273 -9774 6439 12771 254 -11626 -5247 8743 8195 -5832 -10915 1526 12311
1571 12311 4831 -9920 -9897 4455 11238 849 -9913 -4254 8097 7724 -5409 -10747 214 11101
$$ packed form
1545a1392K842J6263N279j3894j2279P782J5159p01j4737n337J2675J0684q568
1558C776j5049J499J6213O332j2517j1880O379J3990n48j4027n083J2441J0785
1571A2311p480j4751K3J4352O783j0389j0762N659J2351l73j3133n338J0961J0887
$$ [...]
8191a
##END NTUPLES=NMR FID
##END=
