##TITLE=1H_RV2303
 CDCl3, 8 sc, 
 24.3.2020
##JCAMPDX= 6.0         $$ Bruker NMR JCAMP-DX V2.0
##DATA TYPE= NMR FID
##DATA CLASS= NTUPLES
##ORIGIN= UXNMR, Bruker Analytische Messtechnik GmbH
##OWNER= root
$$ XWIN-NMR		Version 3.5
$$ Tue Mar 24 14:10:20 2020 Russian Standard Time (UT+4h)  she@DPX200
##.OBSERVE FREQUENCY= 200.1315
##.OBSERVE NUCLEUS= ^1H
##.DELAY= (6, 6)
##.ACQUISITION MODE= SIMULTANEOUS
##.ACQUISITION SCHEME= undefined
##.AVERAGES= 8
##.DIGITISER RES= 18
##SPECTROMETER/DATA SYSTEM= spect
##.PULSE SEQUENCE= zg30
##.SOLVENT NAME= CD3CN
##.SHIFT REFERENCE= (INTERNAL, CD3CN, 0, 15.7039)
##AUDIT TRAIL= $$ (NUMBER, WHEN, WHO, WHERE, WHAT)
$$ ##TITLE= Audit trail, XWIN-NMR		Version 3.5
$$ ##JCAMPDX= 5.01
$$ ##ORIGIN= Bruker BioSpin GmbH
$$ ##OWNER= she
$$ F:/spectra/data/she/nmr/H-F/1/audita.txt
$$ ##AUDIT TRAIL=  $$ (NUMBER, WHEN, WHO, WHERE, WHAT)
(   1,<2020-03-24 14:09:25.81 +0400>,<she>,<DPX200>,
      <created by zg, POWCHK disabled, PULCHK disabled
       configuration hash MD5:
       00 E9 B6 7A A2 85 ED C7 34 08 36 98 17 FE 4E 26
       data hash MD5: 16K
       67 EE 64 13 F8 48 FB FF 35 19 9A D9 E5 FF 99 68>)
$$ ##END=
$$ 
$$ hash MD5
$$ D3 F5 5A D9 A0 58 B1 FD 78 3B E5 22 0A 10 BF 0E
##$RELAX= 
##$RELAX= 
##$RELAX= 
##$RELAX= 
##$RELAX= 
##$RELAX= 
$$ Bruker specific parameters
$$ --------------------------
##$DU= <F:/spectra>
##$EXPNO= 1
##$NAME= <H-F>
##$PROCNO= 1
##$TYPE= <nmr>
##$USER= <she>
##$AMP= (0..31)
100 100 100 100 100 100 100 100 100 100 100 100 100 100 100 100 100 100 
100 100 100 100 100 100 100 100 100 100 100 100 100 100 
##$AQSEQ= 0
##$AQ_mod= 1
##$AUNM= <au_zg>
##$AUTOPOS= <>
##$BF1= 200.13
##$BF2= 200.13
##$BF3= 200.13
##$BF4= 200.13
##$BF5= 200.13
##$BF6= 200.13
##$BF7= 200.13
##$BF8= 200.13
##$BYTORDA= 1
##$CFDGTYP= 0
##$CFRGTYP= 5
##$CHEMSTR= <none>
##$CNST= (0..31)
1 1 145 1 1 1 1 1 1 1 1 1 1 1 1 1 1 1 1 1 1 1 1 1 1 1 1 1 1 1 1 1 
##$CPDPRG= <>
##$CPDPRG1= <>
##$CPDPRG2= <>
##$CPDPRG3= <>
##$CPDPRG4= <mlev>
##$CPDPRG5= <mlev>
##$CPDPRG6= <mlev>
##$CPDPRG7= <mlev>
##$CPDPRG8= <mlev>
##$CPDPRGB= <>
##$CPDPRGT= <>
##$D= (0..31)
0 1.2 0 0 0 0 0 0 0 0.06 0 0.03 0 0 0 0 0.0002 0 0 0 0 0 0 0 0 0 0 0 0 
0 0 0 
##$DATE= 1585044565
##$DBL= (0..7)
120 120 120 120 120 120 120 120 
##$DBP= (0..7)
150 150 150 150 150 150 150 150 
##$DBP07= 0
##$DBPNAM0= <>
##$DBPNAM1= <>
##$DBPNAM2= <>
##$DBPNAM3= <>
##$DBPNAM4= <>
##$DBPNAM5= <>
##$DBPNAM6= <>
##$DBPNAM7= <>
##$DBPOAL= (0..7)
0.5 0.5 0.5 0.5 0.5 0.5 0.5 0.5 
##$DBPOFFS= (0..7)
0 0 0 0 0 0 0 0 
##$DE= 6
##$DECBNUC= <off>
##$DECIM= 24
##$DECNUC= <off>
##$DECSTAT= 4
##$DIGMOD= 1
##$DIGTYP= 9
##$DL= (0..7)
0 120 120 120 120 120 120 120 
##$DP= (0..7)
150 150 150 150 150 150 150 150 
##$DP07= 0
##$DPNAME0= <>
##$DPNAME1= <>
##$DPNAME2= <>
##$DPNAME3= <>
##$DPNAME4= <>
##$DPNAME5= <>
##$DPNAME6= <>
##$DPNAME7= <>
##$DPOAL= (0..7)
0.5 0.5 0.5 0.5 0.5 0.5 0.5 0.5 
##$DPOFFS= (0..7)
0 0 0 0 0 0 0 0 
##$DQDMODE= 0
##$DR= 18
##$DS= 0
##$DSLIST= <SSSSSSSSSSSSSSS>
$$ [...]
##$SUBNAM2= <"">
##$SUBNAM3= <"">
##$SUBNAM4= <"">
##$SUBNAM5= <"">
##$SUBNAM6= <"">
##$SUBNAM7= <"">
##$SUBNAM8= <"">
##$SUBNAM9= <"">
##$SW= 24.9337058887773
##$SWIBOX= (0..15)
0 0 2 0 0 0 0 0 0 0 0 0 0 0 0 0 
##$SW_h= 4990.01996007984
##$TD= 16384
##$TD0= 1
##$TE= 0
##$TE2= 300
##$TE3= 300
##$TEG= 300
##$TL= (0..7)
0 120 120 120 120 120 120 120 
##$TP= (0..7)
150 150 150 150 150 150 150 150 
##$TP07= 0
##$TPNAME0= <>
##$TPNAME1= <>
##$TPNAME2= <>
##$TPNAME3= <>
##$TPNAME4= <>
##$TPNAME5= <>
##$TPNAME6= <>
##$TPNAME7= <>
##$TPOAL= (0..7)
0.5 0.5 0.5 0.5 0.5 0.5 0.5 0.5 
##$TPOFFS= (0..7)
0 0 0 0 0 0 0 0 
##$TUNHIN= 0
##$TUNHOUT= 0
##$TUNXOUT= 0
##$USERA1= <user>
##$USERA2= <user>
##$USERA3= <user>
##$USERA4= <user>
##$USERA5= <user>
##$V9= 5
##$VALIST= <valist>
##$VCLIST= <CCCCCCCCCCCCCCC>
##$VD= 0
##$VDLIST= <DDDDDDDDDDDDDDD>
##$VPLIST= <PPPPPPPPPPPPPPP>
##$VTLIST= <TTTTTTTTTTTTTTT>
##$WBST= 1024
##$WBSW= 4
##$XGAIN= (0..3)
0 0 0 0 
##$XL= 0
##$YL= 0
##$YMAX_a= 5340
##$YMIN_a= -5224
##$ZGOPTNS= <>
##$ZL1= 120
##$ZL2= 120
##$ZL3= 120
##$ZL4= 120
##$ABSF1= 10
##$ABSF2= 0
##$ABSG= 5
##$ABSL= 3
##$ALPHA= 0
##$AQORDER= 0
##$ASSFAC= 0
##$ASSFACI= 0
##$ASSFACX= 0
##$ASSWID= 0
##$AUNMP= <proc_1d>
##$AZFE= 0.1
##$AZFW= 0.1
##$BCFW= 1
##$BC_mod= 2
##$BYTORDP= 1
##$COROFFS= 0
##$CY= 11.3945322036743
##$DATMOD= 1
##$DC= 2
##$DFILT= <>
##$DTYPP= 0
##$F1P= 16.9975609425685
##$F2P= -3.02152046262296
##$FCOR= 0.5
##$FTSIZE= 0
##$FT_mod= 4
##$GAMMA= 1
##$GB= 0.15
##$INTBC= 1
##$INTSCL= 1
##$ISEN= 128
##$LB= 0.24
##$LEV0= 0
##$LPBIN= 0
##$MAXI= 10000
##$MC2= 0
##$MEAN= 0
##$ME_mod= 0
##$MI= 1.114404
##$NCOEF= 0
##$NC_proc= 0
##$NLEV= 6
##$NOISF1= 3.799351
##$NOISF2= 2.8
##$NSP= 1
##$NTH_PI= 0
##$NZP= 0
##$OFFSET= 15.70392
##$PC= 1
##$PHC0= -9698.047
##$PHC1= 11.80082
##$PH_mod= 1
##$PKNL= yes
##$PPARMOD= 0
##$PSCAL= 0
##$PSIGN= 0
##$REVERSE= no
##$SF= 200.130013532006
##$SI= 16384
##$SIGF1= 3
##$SIGF2= 2
##$SINO= 400
##$SIOLD= 16384
##$SREGLST= <1H.CDCl3>
##$SSB= 0
##$STSI= 0
##$STSR= 0
##$SW_p= 3612.71676300578
##$SYMM= 0
##$S_DEV= 0
##$TDeff= 0
##$TDoff= 0
##$TI= <>
##$TILT= no
##$TM1= 0
##$TM2= 0
##$TOPLEV= 0
##$USERP1= <user>
##$USERP2= <user>
##$USERP3= <user>
##$USERP4= <user>
##$USERP5= <user>
##$WDW= 1
##$XDIM= 8192
##$YMAX_p= 0
##$YMIN_p= 0
$$ End of Bruker specific parameters
$$ ---------------------------------
##NTUPLES= NMR FID
##VAR_NAME=  TIME,          FID/REAL,        FID/IMAG
##SYMBOL=    X,             R,               I
##VAR_TYPE=  INDEPENDENT,   DEPENDENT,       DEPENDENT
##VAR_FORM=  AFFN,          ASDF,            ASDF
##VAR_DIM=   8192,          8192,            8192
##UNITS=     SECONDS,       ARBITRARY UNITS, ARBITRARY UNITS
##FACTOR=    0.0002004,     1,               1
##FIRST=     0,             0,               0
##LAST=      1.6414764,     0,               0
##MIN=       0,             -5224,           0
##MAX=       1.6414764,     5340,            0
$$ Real data points
##PAGE= N=1
##DATA TABLE= (X++(R..R)), XYDATA
0@%%%%%%%%%%%%%%%%%%%%%%%%%Lj1J6j6J6j6J6j6J6j9K5l0L2l2L5m1M6n0N5o1
45c2O8p6Q5r6J07j19J35j53J77k09K52l14M10n80R79l555k303P903K335m878n220
66e084L066N763J43n793k479L982M474j851m945q50M403K855k661l926P52L803
82A652J178l194k488J860L161k35k683j176J726J614n27j551m28Q43Q98J9p15
99d6p74K19J223O92j087j615K24K051R26j753j892Q44K470L67k580j633J826K810
117B272n55l261j116K943K714j763l724J08L905J590l349l131K083M132k32m327
133a711j593L462L097j949l862K61L669J498k958k717J519L412Q6l260j603K414
149b35K624j166k784k47K471J409j954j952J173K007l8j990n94J133J052n17j007
$$ plain form
0 0 0 0 0 0 0 0 0 0 0 0 0 0 0 0 0 0 0 0 0 0 0 0 0 0 0 3 -8 8 -8 8 -8 8 -8 8 -11 14 -16 16 -16 19 -22 24 -26 29 -32
45 -32 36 -40 45 -51 56 -63 72 -81 96 -113 139 -175 235 -345 634 -2921 -5224 2679 5014 136 -5084
66 -5084 -2018 3745 3888 -1905 -4384 -402 4072 2221 -2724 -3574 829 3684 1023 -2903 -2151 1652
82 1652 2830 -364 -2852 -992 2169 1934 -749 -1925 -199 1415 888 -663 -1091 -248 650 669 -46
99 -46 -820 -601 622 1314 227 -1388 -1164 887 1813 60 -1832 -988 1482 1849 -731 -2364 -538 2272
117 2272 1717 -1544 -2660 283 2997 1234 -2490 -2382 1523 3113 -236 -3367 -1284 2848 2616 -1711
133 -1711 -3304 158 3255 1306 -2556 -2295 1374 2872 -86 -2803 -1284 2128 2214 -1046 -2649 -235
149 -235 2389 1223 -1561 -1808 663 2072 118 -1834 -661 1346 1308 -682 -1276 -143 909 392 -615
166f15J33P00K02m32o7KnJ55K87j92l54m18M07P68j5r33m75Q00J091n87j331j01
188i80J640Q98j495j573N69K227K53k062j415J874J772r78k362K22K378R71k056
205a17j909J173K413k1k381j059K018J861j104k359q9K521R21j817j791R00K260
222A420j10j912r30J646J319j028j716M83J637L66j220r13P35R05k97q11L3P05
240C12L13o06m22K24N18k54k82J17K42k9m56R9N57N0o68j57N72M04n35p40L95
261c46J154k51j182l28J093R29r30j268N19J467J44j462o87J094J208n52j519
278i17j98J619P83j139j273N29J670N2j720p17J299J293o72j524l4J461O00j173
296f1j062Q16J293l51j263k77J033O49o18p39K11Q19J10p29m05O14M24l17n41
$$ plain form
166 -615 -482 218 420 -12 -79 -77 -82 73 360 168 -186 -604 -197 571 556 -377 -852 -52 1039 452 -879 -980
188 -980 660 1558 63 -1510 -941 1286 1539 -523 -1938 -64 1708 730 -1632 -1410 968 1939 -117
205 -117 -2026 -853 1560 1539 -842 -1901 117 1978 874 -1485 -1574 947 1868 51 -1740 -840 1420
222 1420 1310 -602 -1532 114 1433 405 -1311 -828 809 1175 -45 -958 -223 682 385 -426 -393 312
240 312 625 19 -403 -179 339 85 -197 -80 162 133 -323 -224 333 383 -285 -442 130 534 -1 -741 -346
261 -346 808 557 -625 -953 140 1069 139 -1129 -610 857 1001 -461 -1148 -54 1154 602 -917
278 -917 -1115 504 1287 148 -1125 -596 1074 1126 -594 -1311 -12 1281 609 -915 -949 512 1112 -61
296 -61 -1123 -307 986 635 -628 -905 128 777 159 -580 -369 450 560 -169 -574 40 464 147 -394
315c94N0N94J63m54j73K45L00l78k70K22M68l35k90R1N12p3o30N3N03K60o00n08
337f44M05Q00p7p41k71O29O12n70p28K5J013K95q58p21O27J042l47j028j97J033
357B99M45p22q61M53J056P1j127m40P62P53m27q96R9R34J77p01n50N68O80j87
377C86p45j68O19L46l93m92J90N69k7l79k91M55K21k23l44L54K19K3m77j14M80
398B09j7k73k09M04J18j51m13M01K46j13l75n7K00L24k83m35K41M78K3m96l10
419d88O37L14m05m54L6O26L13o77l58L88M90j38o79k7O22K84m78m71K49N68j0
440C42n27k13M21L87k49n17N9N23J47m05l03K29L97r2l92m5L53J99k94k59J40
461i9K77k9k71k1K15R0j66j28J25J18o3j44K2J31L9j48n9J56J14j25k13J08K22
$$ plain form
315 -394 -344 250 413 -41 -214 31 331 -47 -317 -95 373 38 -252 -161 351 278 -352 -299 204 464 -136 -644
337 -644 -239 561 484 -257 -528 101 713 143 -585 -560 453 748 -110 -831 -204 838 491 -537 -734 299
357 299 744 22 -839 -386 670 741 -386 -826 -64 689 262 -634 -535 399 576 -125 -675 -107 573 386
377 386 -359 -527 92 438 45 -447 -257 312 285 -94 -385 70 291 68 -276 78 297 320 -157 -271 209
398 209 192 -81 -290 114 232 81 -332 69 315 202 -173 -230 -30 294 11 -424 -183 295 318 -178 -488
419 -488 149 463 58 -396 -360 266 579 -98 -456 -68 422 284 -395 -422 200 484 6 -465 -216 352 342
440 342 -185 -398 23 410 161 -356 -297 226 373 -32 -335 -106 291 199 -193 -238 115 314 20 -239 -99
461 -99 178 149 -122 -143 72 162 -4 -132 -7 111 48 -96 -74 57 96 -52 -111 45 159 34 -179 -71 151
484A51l9k22n7L26J0j46j81M9L18J3l37j15K85J34j33l22J07K85J01k33k66J83
506h9L88j60k73k9K41J33k28j98Q4L69km22K2J08M05k10l20RK44J50k42j00J86
529F6J50j47m3j11K9J91j89n5l9L52j37j16m2J13j7Rj15O0Q6k46J70j60K49K7
553H5j32n2J00q0J25j13p0L76j86m2P6j4j08P2k01J11K31r4p3j07J08m4O0j68
577a40m9K53J37j74j22J56J66k27j17k4J93M2j39%j5K10r0p0r0J17J3o3j6l0J00
602B1P8m8j06J6M6K3j1j09J6R2K5o5k1J04l8r2M2N5l9l2P0Ql5OmL3n2J8RK0LO
634C9m3KK8mj2m1KJ7N8l5l7OO8k0m4nJ00p9O3r8l4R3o9M7p9O3M2n4j9OM0M0ko1
668b2j0M3K1j8n0j1O8j0k9j1L6J7l0m2K5L5%Kj8j4J7J9J2l4JK2J5j9n1L4M3nm0
$$ plain form
484 151 112 -110 -167 159 169 23 -158 -109 209 222 -115 -230 55 189 56 -266 -159 126 227 -6 -272 -89
506 -89 299 139 -134 -163 78 211 -17 -215 -131 238 236 -186 -164 -56 349 139 -181 -172 72 222 -20 -120 66
529 66 216 69 26 -85 -56 135 -54 -109 -148 204 67 -49 -91 22 5 14 -101 -41 45 -201 -31 -191 58 85
553 85 -47 -99 1 -79 46 -67 -137 239 53 11 87 73 -35 37 -164 -53 178 84 11 -96 12 -32 28 -140
577 -140 -189 64 201 27 -95 61 227 0 -117 -141 52 94 -45 -45 -60 150 60 -10 -100 17 30 -33 -49 -79 21
602 21 99 51 -55 -39 7 30 19 -90 -74 18 43 -22 -43 61 23 -69 -27 28 -11 -43 27 35 0 6 2 35 -17 1 10 30 33 39
634 39 -4 -2 26 22 10 -31 -29 -12 46 11 -26 -20 48 28 -16 -21 79 0 63 -35 -69 24 -45 2 -77 -14 28 -26 -45 -39 1 41 39 -22
668 -22 -32 11 32 14 -36 -47 21 11 -18 -29 7 24 -6 -48 -23 12 12 14 -4 -18 -1 18 30 -4 -3 19 34 15 -36 -2 41 36 -4
701dm0L8M4pj3k2KlJ5jl6L0L5k2k8j3PM2j1o8M3J8lm1oM1K7l1k0KL2k0J7nj1J0
737bK4m7J9n8Q7J8Qq1k0L9m7KK16j08q2j6n1K24j05M3oj11L3L9kk9N4q3J05l1
767C2k7J2m8M6j4K0k8j3k0M9j1K9m9m9M3j1K6qj13J52p1m8N4K1J02p0oP5n9q7
797g1P7o7J4K5Q6k9n9J5L3L7p8J3k7L2J6m3K3N6k3k3l7M2J1pojLj1rK2k2J0J4
830A6m7N3k1OKmJ1Qm0JK5j0J5n0K9L4mn1MJ5L8k5m9L6L6m1k6J5J8M6o1l3M5L1
864B2m%k3J0jkml7M0M6k8n7nP4%k6k3O2J1p1l4K8Q1k7n5JL5Pk2k0J7NK0m0k3M3
900@J6km2j3K1N8o6k4M1K8ln0jN1L2n4j2K2J4p9L3m0J65m7Qm6K5op7M5k6P7j7
933C1k1k1OM7ko3RK6L5m8l8K1P7j6p1j0Q8L1p1n6M2P6m4r1L5M7K1l6m7K6O2j1
$$ plain form
701 -4 -44 -6 38 31 18 -4 -2 -5 10 9 -27 3 38 16 -12 -25 -18 24 13 -55 -12 6 3 -38 -44 -3 24 -7 -27 -25 7 -13 4 -1 -12 -2
737 -2 22 -25 -6 -64 23 41 49 -32 -52 -13 -60 -58 158 50 -32 -48 -99 125 20 63 57 -54 -21 18 16 -13 41 -42 63 32
767 32 5 17 -31 15 1 21 -7 -20 -40 9 -2 27 -22 -71 -28 -39 -13 -21 -134 18 -53 -101 -47 -26 76 6 0 75 16 -71
797 -71 6 -61 -47 -22 64 35 -24 -9 24 61 -17 -4 -31 1 17 -26 -3 53 30 7 -30 12 23 16 10 9 12 1 -8 14 -8 2 16
830 16 -31 22 1 7 9 5 16 24 -16 -15 10 0 15 -35 -6 28 24 -27 -23 -8 30 5 -44 -8 28 -13 -39 -24 -6 40 -21 -54 -9 22
864 22 18 18 -5 5 4 2 -2 -39 1 47 19 -38 -43 31 31 5 -18 44 55 -16 -50 -22 59 32 -23 -22 13 20 -2 -22 -5 0 20 -20 -43 0
900 0 16 14 -28 -41 -20 38 -28 -52 -11 17 14 -36 -37 14 46 -8 -20 2 16 -63 -30 -70 95 48 56 10 35 29 -48 -3 -29 48 31
933 31 10 -11 -5 42 40 -23 -14 12 47 -1 -39 -18 59 43 -28 -38 50 81 10 -46 -4 72 28 -63 -28 19 40 4 -43 -17 45 34
965C4m5mM3M2q3l7J7O6Ro8m7O6M6j7p4J6J01Po8l5N1M8m9o3L4P1J4j16l2P7O6
996G0n0l5NM5J0m2l8M9N7m3n3l2Q8L2p9n1O3N6k6p8QR7J7n7r6N8Q9m2o5jP3J9
1028D8p1p0L4J03nr4lQ4K1o2n3L8Q2pq5kN4N2m6q3P6M3k1n9l9R2M4o2m7qR8l1
1060B1q7M7P2L3m3o9%P5Qp5m1P3J7l5n2J2N4L1o3k1K1M1j3n7NP7J9r8rK6Q3k3
1092B9j03J5P1L4m9m0M4P0m9o6J3O1L0p9j6M1L3Jq4KP0L8o3n8L4M3L3m9m3N1M6
1123F0l4n7PR4j8n9m4N7M7m3n7K0Q5l4n8j4N9M4m1k7nM4j4m1lJ3L3qm3J3M5J4
1155C5o7J3J1O3m7m4J7N8j8k3k7K4L9k1l9j0R0qn6k4M1L1K2p7PL7j1nl8J5K9K
1187A9l5j0N2Rj7m5L1K1km5j1N4kj9l6J3O4m8k8J0K0O6o4l2M3K4nm1k8L9M2n8
$$ plain form
965 34 -11 -15 28 70 -13 -50 -33 33 42 -26 -73 -7 39 22 -52 -36 65 72 4 -31 20 68 19 -44 -10 61 75 -41 -73 4 70
996 70 20 -15 -10 35 45 3 -35 14 71 28 -25 -57 31 63 -16 -67 -4 52 26 -52 -44 53 70 13 -83 -25 64 22 -43 -44 29 48
1028 48 -23 -93 -59 44 39 -55 -58 26 47 -15 -68 -30 52 45 -40 -42 12 64 18 -65 11 54 33 -26 -65 27 71 9 -38 -46 52 21
1060 21 -66 -19 53 86 43 -26 -26 49 57 -18 -59 14 31 -4 -56 -44 10 41 -22 -43 -22 19 6 -51 -46 31 50 -48 -57 -31 52 29
1092 29 -74 -59 12 46 -3 -43 1 71 22 -44 -31 30 60 -19 -35 6 39 40 -44 -42 28 66 3 -55 -21 22 55 6 -37 14 60
1123 60 26 -31 -24 70 52 -7 -51 6 53 10 -47 -27 58 24 -34 -48 11 55 14 -13 -18 26 12 -29 -32 -19 14 6 -37 -24 21 35
1155 35 -32 -19 -8 55 8 -36 -19 39 21 -2 -29 -5 34 13 -26 -36 54 46 -10 -34 7 38 60 -17 -10 27 16 11 -27 -12 17 19
1187 19 -16 -26 26 35 18 -27 4 25 23 -22 -33 21 19 0 -36 -23 41 -7 -35 -25 -5 61 -3 -35 8 32 27 -14 -42 -3 39 -19
1219a9k6L0L0M2o2k1J7N2j4q9Q7K3n3o4K1K4J14o0r4pO5m0N7Q0j58J65j55K5P4
1248D4J1J9j64OR9J1m2j5J6K2jk5nM2k0j2Mj1J4K3jl6QL2Jnj3LQqk0K0j6K3j0
1283Bk4K9mrJ3lJ5pj5KRL3j7j8j0QRok4L0J8l4j0NL2ok2k0K6L5j8n6K9RJ2k9j
1320a7Rj5K7lNk2J7j9L3l6OJ1QOk9K5j8rJ6K2lNl2L1JoOqJ2k8QJ5k8J1j1K6k1
1357eJ0LOk1QLPk6JJ9J8j3k3K6lJoj0j7N2k6k6RQK0k4J5rlj3J1qnJ5%jnkRJ2j1
1398dj7J6L7j3k0MmK3qJ4qnjj4L4m4J7Mj1Pj0kJJ6j7J1p%j9J9J3k2K2J1l9J5l3
1435c4K5j6L6n3j1Q2j6j4m7Pj1J86o5j22K06q8J35k64J24k6J20q5m5m8QJ27j38
1462b7J25j05J5Nm9J8J5j2L0j4M3r4N2P5m1n7K1qk6L5J12j92OP6J0kKKMl3K8m8
$$ plain form
1219 -19 -45 -15 15 57 -5 -26 -9 43 29 -60 27 50 -3 -67 -46 -22 92 32 -62 -69 -4 -44 13 93 -65 100 -55 -30 44
1248 44 55 74 -90 -84 15 26 -16 -31 -15 7 6 -19 -24 18 -2 -14 -10 -21 -7 16 15 -21 -13 19 20 15 2 5 13 5 -15 5 -11 12 2
1283 2 -22 7 3 -6 7 4 19 12 -3 -1 8 41 24 6 -4 4 13 7 -17 13 31 -3 -13 -8 24 18 -4 -24 2 37 19 -37 -8 1 13 -16 -17
1320 -17 -8 -23 4 1 6 -16 1 -18 15 -21 -15 -4 4 10 -19 6 -12 -21 -5 17 14 19 -13 18 19 13 19 11 23 -5 3 18 -10 1 -10 16 -5
1357 -5 5 8 14 -7 1 4 11 -15 -14 5 23 10 -13 13 10 11 5 -5 -22 30 4 -22 -13 -5 15 -9 6 -3 -6 -19 -8 -16 -21 -6 -6 -7 -12 -14 -5 7 -4
1398 -4 -21 -5 32 19 -1 3 -1 22 14 28 20 15 14 0 34 -10 7 11 0 7 -3 -5 -4 12 -5 6 -1 -1 -20 -1 12 -10 12 23 -16 -1 -34
1435 -34 -9 -25 11 -42 -53 29 13 -1 -48 -41 -52 134 69 -53 153 65 200 -64 60 34 154 69 24 -24 -16 111 -27
1462 -27 98 -7 8 13 -36 -18 -3 -15 15 1 44 -50 2 77 36 -21 0 -8 -34 1 113 -79 -73 3 13 11 13 15 19 -14 14 -34
1494c4M0l3N3j24lL0K00r5q0J28j30L5J5Lk7J7JK5k2l1L4J3j3m2K4K6NJ4rj0J3
1525B3J0k0k3L4j5Kqj8J4J6oj6K1%kk9NML7l0J0j5L3j4m0kL9J3l6j1J2L9Km7k1
1560c9N3Rk6k1K9kK3r3j4J01L1j32k8l5J04J59j26q5Q9N6m1n1M9L0j6l6l9N1L1
1589C1j1n7M4K8j0l3k2L6L2lp9K6N6pk8m6O7J2j2p0K9L3L0o5m1M6M1k5n8pQ3J2
1621C2m4m0K8P3m3m7KN8J9o2k9L5O9mr3MP2K4p4j9K5Q0l5n8k7P0M9k9r8L7O1K9
1653F5j21OQ6J6r8j4Q0O2j93R9R1j27Q1j0m4m3K02j15l4rrM0Mj25J47PM1j26L2
1682iO5J92r5k86J31P9k5l4p9N9K25j90j37L7N3J33j28j12J17Q4n6n9l3J13O6
1707A11j12j02Q9J18m3j05LJ05L2r4r1Q0Q5j3j28j6J07N9j05r4O9J42m1j37j0
$$ plain form
1494 -34 6 -27 26 -98 -101 -71 129 34 -46 82 -48 -13 2 5 -22 -5 -4 21 -1 -32 2 15 2 -40 -16 10 15 29 20 10 23
1525 23 33 13 -10 24 9 11 3 -15 -1 15 9 -7 14 14 12 -17 -12 -8 29 -1 9 -6 27 13 -27 -29 10 23 -13 -24 -12 27 29 -18 -39
1560 -39 14 23 -3 -24 5 3 26 -67 -81 20 51 -81 -109 -144 -40 119 -7 -92 -3 53 12 -39 10 40 24 -12 -51 0 31
1589 31 20 -37 7 35 25 -8 -30 6 38 35 -44 -18 38 31 3 -43 24 36 24 -46 -17 16 46 -19 -60 -14 27 2 -56 -63 20 32
1621 32 -12 -52 -24 49 6 -41 -39 19 38 -24 -53 -18 51 47 -46 -42 30 54 -20 -39 -14 66 31 -27 -54 16 65 36 -62 -25 36 65
1653 65 -56 -50 36 52 -46 -60 20 82 -111 -12 79 -48 33 23 -21 -64 138 23 -11 -20 -29 11 15 -110 37 44 85 -41 -9
1682 -9 56 248 153 -133 -2 77 52 18 -61 -2 223 33 -104 -67 -14 119 -9 -121 -4 80 24 -35 -68 45 111
1707 111 -1 -103 -14 104 61 -44 -41 64 96 2 -89 -9 76 63 -65 -81 26 85 -20 -114 -45 97 56 -81 -91
1732i1J28O3r7j01M0J34j6j12n7J54K7Q3j83K1Q3op4j06J43R5q9j62K7K07k2j60
1758g1n4P4J76j91p8J08J01K0j77j7J88M5k7j54K3L1J41k28%J30L4K7k72J33J41
1783A03Rj21j16J54R2o3k07k7J91J10k50m7J18J28Pj99j2J03J51j04k49J66J49
1806H6j39q0m8J26J06j80J12n6J82r9j24J2J44R8j27q7r2L44o3k37j30K62J62
1829A72r5k50J46J61J1k99N3K35L5j38j93J12J79ok29n2J89J05j01k15O9K08M1
1852A38j99o3O3K49k08j33J04J46M1j82q3P7J81j33j14m2K57L0k33o8Q6L28j99
1875D3k28P1K23J83m36o9J24L31k26j51J71L4k4k8k80K28K29n8k83J4K49J23j73
1898F7k36J71K11p2k77l7K62J02k07j55J08K26o5k31n4K32J36j91k00J13K64n1
$$ plain form
1732 -91 37 100 3 -98 -58 76 60 -52 -109 45 72 155 -28 -7 76 70 -4 -110 33 128 39 -123 -96 111 89 -71
1758 -71 -125 -51 125 -66 -144 -36 65 85 -92 -109 79 124 97 -57 -34 -3 138 -90 -90 40 74 101 -171 -38 103
1783 103 112 -9 -125 29 121 58 -149 -176 15 125 -125 -172 -54 74 81 -118 -130 -27 124 20 -229 -63 86
1806 86 -53 -133 -181 -55 51 -129 -17 -73 109 10 -114 -102 42 140 13 -74 -166 178 115 -122 -252 10 172
1829 172 77 -173 -27 134 145 -154 -101 134 169 31 -162 -50 129 123 -106 -158 31 136 35 -180 -111 97 138
1852 138 -61 -124 -61 188 -20 -153 -49 97 138 -44 -127 -50 131 -2 -116 -158 99 129 -104 -172 -86 242 43
1875 43 -185 -114 109 292 -144 -213 -89 242 16 -135 36 70 46 18 -262 -34 195 137 -146 -132 117 240 67
1898 67 -169 2 213 141 -136 -173 89 191 -16 -171 -63 163 98 -133 -187 45 181 -10 -210 -97 167 116
1920A16k34o7K53J61k28k51J46K31k8k01j20K69J04j27k30J40J83N3k16k29K32
1941d3K02k33j10L6K53J02k68p0J27K24j35k50M9K40N2k25j32J64K06j18k47P0
1963a06K22O8k36j30J64K03r7k64L3K51Q0k65j87K02K29q0k31l9J73R2p4j95J91
1986DK36j50k21q2L00O0j32j89J69K09l3k88p5K34J66j85k39J40K38j0k35p8K20
2009E9J53j70k22Q1K68j2k46q6K07J55j48j98M0K75Mk58q9K12J59j32k33O2K47
2032A28M1k71j05K08J91j15k62K6K97K7k31j47J94J95j03k43OK83P4k38j59J83
2054b1J89q6k42mK27R1j93j45K02K18j82q4j08K90m2j06j91J52K27o2k71oK29
2077H2R4j63k02J05K49k1k71m5K11J59j83k21J28K41l1k60n5K30J54j80k31J19
$$ plain form
1920 116 -118 -185 68 229 1 -250 -104 127 99 -102 -222 47 151 24 -206 -66 117 170 -46 -275 -43
1941 -43 159 -74 -184 -148 105 207 -61 -131 -4 220 85 -165 -116 124 176 -49 -181 -17 189 71 -176 -106
1963 -106 116 184 -52 -182 -18 185 88 -176 -143 108 188 -77 -264 -62 167 87 -144 -183 -10 82 8 -187 4
1986 4 240 90 -131 -213 87 147 15 -174 -5 204 171 -117 -192 42 208 23 -216 -76 162 152 -83 -161 59
2009 59 212 42 -180 -99 169 157 -89 -175 32 187 39 -159 -119 156 160 -98 -187 25 184 52 -181 -119 128
2032 128 169 -102 -207 1 192 77 -185 -159 138 165 -66 -213 -19 176 73 -170 -164 119 193 -45 -204 -21
2054 -21 168 82 -160 -164 63 154 -39 -184 18 236 54 -30 -138 152 110 4 -187 -35 192 130 -141 -147 82
2077 82 176 13 -189 -84 165 144 -127 -172 39 198 15 -206 -78 163 132 -128 -183 47 201 21 -210 -91
2099i1K26kk13j13J89K11j85k10J45K11k0k63p5J59K39j87k24N8K90L2k80j22
2121b25L23Q6j08j68n5K27Q3k66l5K97P3j60k77%K71Q5j70j78J26K49o8k68l5
2144a93K66R7k08j00J38J45j50k27M7L00O0j96j54O5L01k07j34QJ89J72k17j09
2166a07J28J3J36k84l5K02J12j82j40Q5K23k4j93j03K22J20j24k04Q1K18kk25
2188h3o4K02J18j30k06Q6K19k2j87q3J63J58j31j71M5K16L1k12j08J63J42j14
2210C2j66M1K01L6k12j01J79J23o1k03N1J62Lj61j53J87J84m0k14Q9J71Jj66l4
2234e1J12J81k09j45kJ14J82j96j0Q8j03J54k17J1J87L2j32j72J20J69k9k50j2
2257a78J26K83k07k40L0K66J1p0j48K11J02j05l68L10J82j94J7j31J02Q3j70J
$$ plain form
2099 -91 135 133 -80 -193 -4 207 22 -188 -43 168 148 -115 -190 -31 208 21 -203 -145 145 177 -103 -225
2121 -225 98 184 76 -92 -147 80 163 -103 -138 159 232 72 -205 -205 66 151 -19 -197 -71 178 110 -158 -193
2144 -193 73 170 -38 -138 0 145 -5 -232 -185 115 175 -21 -175 -110 191 -16 -150 -142 47 219 2 -107
2166 -107 21 34 170 -114 -149 53 165 -17 -157 -72 151 127 -66 -169 53 173 49 -155 -74 144 142 -83
2188 -83 -147 55 173 43 -163 -77 142 120 -67 -150 13 171 40 -131 -86 130 161 -51 -159 4 146 32
2210 32 -134 -93 108 144 -68 -169 10 133 72 -131 -80 82 85 -76 -229 -42 142 102 -112 -23 148 149 -17 -51
2234 -51 61 242 33 -112 -114 0 182 -14 -24 64 -39 115 -102 -91 96 128 -4 -176 -56 113 84 -166 -178
2257 -178 -52 231 24 -216 -186 80 91 21 -127 84 186 81 -287 23 205 11 28 -103 -1 82 -88 -87
2279h7L7J50l5j59m3L04rk70M1RK12j60j49M8Q9J35k04k8L9J90N6j33r1K48j43
2304D7R4k54j9J74Q0j07j71J54R5j7j32j8J43L3j20j04L5K10j03l9j07K20j5m5
2328C4j58Q0J01Kj96M7J39n7mj45J29P7J2j80o2K13N2p9o9N6J50q6j41OR9P2m9
2355D3j61N2J08KM7k47J68J56j05j30N4j6P7Ojj5rL9j92M6J79m5n2p4R8R1j32
2382a3l8j04J61K1r5m4Q9J04n0j28k6J36P0j42k9M0Q9l8l6j5P9K6o0o7O1Q2l5
2409C8r1KQ8J7l6q4M6Q0j3p9l7Q9L8n9m5L6O1np8kO8K7o1n1MJ01j4o1l6P2L8m0
2441A3m5K1O4m0p0K8P4J01j30j00K7J58r1o5N9M7no7l6RJ16L0j39n8J36RJr2n
2470e0R1Kp9J4M4Q0j5j70M8O9pom0K1L7r4P4j58J82j05L6Oj9Q2n2k8j4K3J09p7
$$ plain form
2279 -87 -50 100 65 -94 -137 167 158 -112 -71 -62 150 -10 -159 -111 -22 113 -91 -119 -80 110 166 33 -58 190 47
2304 47 141 -113 -132 42 122 15 -156 -2 93 76 -56 -74 69 102 -18 -122 -87 123 20 -19 -126 94 79 34
2328 34 -124 -44 57 59 -137 -90 49 -8 -12 -157 -28 49 61 -119 -181 32 84 5 -64 -8 142 56 -85 -79 20 92 43
2355 43 -118 -66 42 44 91 -156 12 168 63 -67 -13 -29 48 54 53 38 29 68 -124 -78 101 56 4 -70 28 119 -13
2382 -13 -51 -155 6 27 -68 -112 -23 81 31 -97 -123 13 83 -59 -88 -48 41 3 -33 -48 31 57 -3 -70 -9 73 38
2409 38 -53 -51 37 54 18 -66 -20 60 47 -32 -69 20 58 -1 -46 -10 51 46 -32 -34 34 61 0 -51 -47 54 40 -21 -57 15 53 13
2441 13 -32 -11 53 13 -57 -29 45 146 16 -84 -57 101 10 -55 4 51 46 -21 -57 -48 68 98 -41 -99 37 46 47 -45 -50
2470 -50 41 43 -36 -22 22 102 87 -83 -35 34 27 21 -19 2 39 -55 19 -139 43 -62 -26 -20 -39 43 -9 -37 -51 -28 81 4
2500Dk1qN6m5ql1O1Rr1K4QK2OO5j03L7MJ3p0j8J43j7k6k2l9J06nj00N2O5n1o5
2532d5R0O9q7M5j38j5Q5J93j58j61R3J43k8j41n0J82P6j13On9n4P1kJ5L3J5j89
2559a24J05Lm5pO4lp8M5N7J2om3m4J33j54Q3j1jj4M4j09J17p0lM3k5O7l9N4K6
2589G7m7j14P2l0P2L6k4p4O3l0J9k2J4O7m0o7QQ5o4oK0nJ6r5K1j7L2P9q6L0J5
2620EJ0J6o9L6m6N7K6q0M2O8j15J42K1j20N8q4O3j1%p5pN3RK7o2M0l8L5M1k9k8
2651a5j7k1P7o7M3K2%j0l0M4Lj4l9rP4k5mkpMmJ0qJ2j4pK5l2K6l6J8qRlnJ6l5
2688b9M2k9K5j9oMJ8j4OJj9M4k2j2j4j1L6jJ1rOj3K4j6k9K7jk2N2Ro5M6M8p1P
2723Dk2Q3o0l4P7m5Q0J7j14j08J35q1R9n0M9p0N9j8K4k5%K5k4j2Ll1L0LJ1j8J7
$$ plain form
2500 4 -17 -25 31 -14 -22 -53 8 17 -74 -50 -42 -20 -14 51 -52 -15 -11 2 -68 -86 57 40 14 -8 -47 59 54 -46 6 71 20 -45
2532 -45 45 114 27 72 -66 -81 4 197 39 -122 -29 114 86 -55 -105 77 153 40 46 -13 -67 4 2 17 50 65 -124
2559 -124 -19 -16 -61 -68 -4 -7 -85 -40 17 29 23 -20 -64 69 -85 -2 -13 -14 -28 16 -93 24 -46 -49 -6 -31 36 -3 51 77
2589 77 30 -84 -12 -42 30 66 42 -32 31 1 20 -2 12 79 39 -28 -20 65 1 -5 15 10 26 -69 -48 -65 -33 46 -40 -10 5
2620 5 15 31 -38 -2 -48 9 35 -45 -3 65 -50 92 113 -7 51 -33 30 19 19 -56 -63 -10 -1 26 -36 4 -34 1 42 13 -15
2651 -15 -32 -53 24 -43 0 22 22 12 -18 26 29 15 -24 -33 41 16 12 10 3 7 3 13 5 17 3 -4 21 -11 15 -21 -3 -11 -2 -5 -10 6 -29
2688 -29 13 -16 9 -10 -16 -12 6 -8 -2 -1 -20 24 2 -10 -24 -35 1 0 11 2 8 -5 19 3 -26 1 0 -22 30 39 -26 20 68 -3 4
2723 4 -18 65 5 -29 48 3 83 100 -14 -122 13 -68 31 -19 30 -40 19 1 25 0 0 25 1 -11 -8 -39 -9 -6 5 -13 4
2754Dj1mrK9k7JJ2lpmK6j1LJ1K1l9J0Pk2M3l6J6j3LK4q%k8OlL2k8J1PJ5ok0K0
2792B2l4j6J5K0j1J9lNkj3LKqj2J3OJ4OP%j2K3j10Q8RN6j1l6J27r4m9l6J6k9J90
2827A65j66J49j19j11J42N0j61N0n8M8K04k16Q4j23J55j16q0M2N6l6r5J23K34
2850B21j87n0Jq3J59j01nj42J15J22N8j8j12j6K1n1J96j30K3l9n8J95r3j54K84
2875A56k79J68k6r5J36j13Q9n0M9L9n2j37K09q7j7J0N0q4J14p8rj57L67k08Q4
2900G9O8j83M9m3J6O7q7P9j4j3pj2K2L0q4J3J5jJ06r8Rk4o4L0N8j2L7q0L5k6J4
2931b1j0L6l2M0pL1m9N5m3rRJ2j0MKK8ql7RK6l8MJKJ2Kj2jJ1jMkJ7nj1j0J1J7
2969B7j1l4J7J1j0Mpj7J1K8m0K2KK0l7PJ3mk0j6L2J7oj6oJJ5jj1j5K9J9j7j7%
$$ plain form
2754 4 -7 -11 -20 9 -18 -17 -5 -8 -15 -19 7 -4 -1 10 31 -8 2 9 -13 30 -6 10 -3 0 24 16 16 -12 -6 -9 23 -5 6 13 28 22 2 22
2792 22 -12 -28 -13 7 -4 15 12 17 15 2 5 7 -1 -13 0 6 20 26 33 33 21 44 -66 22 31 87 76 40 167 73 24 -12 4 -25 165
2827 165 -1 148 29 -82 60 110 -51 -1 -59 -11 193 -23 61 -62 93 -23 -103 -61 -5 -41 -136 -13 221
2850 221 34 -16 -15 -98 61 -40 -45 -187 -72 50 108 90 -22 -38 -17 -68 128 -2 21 -18 -76 119 26 -128 156
2875 156 -123 45 19 -76 60 -53 36 -14 35 74 22 -115 94 7 -10 0 50 -34 80 2 -7 -164 203 -5 79
2900 79 147 -36 13 -30 -14 53 -34 45 31 18 11 -1 21 51 -33 -20 -5 -6 100 2 11 -13 -77 -47 11 -1 36 -44 -9 -35 -21
2931 -21 -31 5 -27 13 6 37 -12 43 0 -9 0 12 2 6 8 36 28 -9 0 26 -12 -8 -7 -5 7 9 -3 -4 7 6 10 8 25 20 9 -1 10 27
2969 27 16 -18 -1 10 0 4 -3 -20 -9 19 -21 1 3 23 -14 -7 6 2 -18 -34 -2 15 9 -7 -13 -12 3 2 -9 -24 5 24 7 -10 -10
3004a0K4J1k4%Nj8NmJ8jMk0k4N3nK2kQm9L1k0l4M4J1n4j0O8j1jpJ1k8K7J8rk2
3040GK1ppk9L6k6NPk7P3j2p6O5k9J3pQl5L0J07p9J01j73P5n8n3J61j65J27j88
3070a35R2J26j19J8r5K52p7o5P5j19P5L7j9k2l8n4Q0nk8j7P1k6j4k4J4j3L0k2
3098b2K4JK6k6LqJ4j2j5K3l4O7k6o1N6k9J5pJ4j02R7Pj3n0P9m8M3K2n1O0m0r5
3130h8J06K4O3k7q8k1P2Oj19Q3J1J6l1LmM5n1j2l3K7L8j6Pj2j5L0l0k0L9Jnm3
3162d4KO6j1j7J4J2J8K1j18N4K1k7J8m7q6J69K4o1K2P2j83j9J63r0M7l7m1K20
3190A62j32N5L8n4N4j78OO6J3qM5k5o5l2J0K7O8m2Pm5L3K4n2L1%lrOJ9l5J1NL1
3223C1n0JPJ4mJ3mpnKj5RJ8L9l2k0qmJ6jRK4j0m2J5J5J3j8NnN5m5k9J9L8m3M0
$$ plain form
3004 -10 14 25 1 1 6 -12 -7 -11 7 6 10 -10 -34 19 14 36 34 42 -7 24 4 -30 14 25 -29 -39 29 18 17 10 21 -7 20 38 29 7
3040 7 28 21 14 -15 21 -5 0 7 -20 53 41 -35 30 1 14 7 15 -20 10 117 38 139 -34 41 -17 -70 91 -74 53 -135
3070 -135 -43 83 -36 -18 -113 139 62 -3 72 -47 28 65 46 24 -14 -68 12 7 -21 -38 33 7 -7 -31 -17 -30 0 -22
3098 -22 2 3 29 3 6 -2 12 0 -15 8 -26 41 15 -46 10 -19 -4 -11 3 -99 -2 5 -8 -58 21 -27 16 38 -13 47 7 -88
3130 -88 18 42 105 78 -10 -31 41 47 -72 11 22 38 7 10 6 51 0 -12 -45 -18 20 4 11 -1 -16 14 -16 -36 3 4 -1 -44
3162 -44 -42 24 13 -4 10 22 40 61 -57 -3 18 -9 9 -38 -124 45 69 8 30 102 -81 -100 63 -27 20 -17 -58 162
3190 162 30 85 123 69 123 -55 -49 17 30 22 67 42 -23 -55 -45 -18 50 8 15 -30 3 27 -25 6 6 3 -6 0 19 -16 -5 0 31
3223 31 -19 -18 -11 3 -1 12 8 1 -4 -2 -17 -8 10 49 17 -3 -11 -15 1 0 9 33 23 -19 -4 11 24 6 11 6 61 16 -13 6 44 1 41
3260D1n1M3n2RR6j17n8J21j49L8J05O4lj9j00M5k4k0nO7P8j52k0J03N5j85K9l
3288f4J12p4J9j06qqJ16L1j3P2n3l9kJ25j13K6qN4p3l9J13J2n1j0n2K3j4J01k6
3317E1j40Q3L8J7p3Q2m1j4k4N4L4j34J42n9k3k4N7mj8j4NJnj6K3j6J4K1%k0jQ
3349Dmk4M2j6J8%j2rJLpK1jjMJ5k1j1J1OJ3k4qOjRrnQlj4M3k1l%j1jJ4mNrmk4
3392b4J9OJ6j9j1J0mj7K0Kj0K0J3l7L9kj0nk6J6Oor%J4qK2rJ0Jk6K4j1oQONOl2
3431ikK3j0LJj5P%JKRKpKJ3kmJ3m4J5pJ3qJ0j4Mnjj3PK8lnlj3rOJ1JqkJ4KOj0
3476aJ0j3MQk2KL2Nj9NOoJ4r%j7mnJ8j4J3nmJ6j4Llj6J2J6k7K0j0K0K%j5Krj5
3516b0K3lqoJ0Lj3OoPK3jj4KJ6p%k2nL0k1PjmJ5k2L4J3k1l8K3jJ4k6J2j8J1K7
$$ plain form
3260 41 -10 33 -19 -10 86 -31 -89 32 -117 -79 26 90 87 68 -32 13 -11 -31 -36 31 109 -43 -63 40 95 -90 -61 -64
3288 -64 48 -26 -7 -113 -121 -129 -13 18 5 77 24 -15 -17 108 -5 21 13 67 -6 -45 68 80 29 19 -33 -10 -24 77 51
3317 51 -89 -6 32 49 -24 58 17 3 -21 33 67 -67 75 16 -7 -31 26 22 4 -10 -5 -4 -9 -25 -2 -18 -4 17 17 -3 -4 4
3349 4 0 -24 18 2 20 20 8 -1 0 3 -4 17 16 15 19 34 13 2 13 19 32 8 0 6 5 14 5 0 8 5 -9 34 13 10 10 -1 -2 12 8 13 4 0 -24
3392 -24 -5 1 17 -2 -13 -3 -7 -24 -4 -2 -12 8 21 -16 23 21 11 6 -20 -4 2 -4 -13 -13 1 -7 15 6 16 17 -9 15 4 -2 6 12 17 23 -9
3431 -9 -11 12 2 5 6 -9 -2 -2 -1 1 10 12 5 7 20 18 14 27 -17 -2 -9 4 -4 6 -8 -4 -9 -10 -23 -16 12 9 4 1 -12 -21 -15 -4 -3 -11 -13 1 3 9 -1
3476 -1 9 -4 0 8 -14 -12 20 25 6 11 17 11 25 16 16 -1 -5 -10 8 -6 7 2 -2 14 0 3 0 -16 -4 12 -15 5 -5 15 17 17 2 4 -5 -20
3516 -20 3 0 -8 -14 -4 -1 -14 -8 -14 -7 16 15 1 3 19 12 12 -10 -15 15 -6 1 0 -4 11 -11 23 36 15 -23 0 -1 13 -13 -1 -19 -8 19
3554A9k3k5O0k2j8l6O0R1j44J9J4lRl9OL7j7K2k4L9l1Rj7nK5K5l9J0%Nlj1rK6
3588A0oj0JrRQjk3J6K7J0k2Pj1NMJ6l1K9j3k9J7MJ3j5llPJ3j6mM1k9%j3rK9k7
3626hj4PK1k5J2j8PL0j7oPq1P7K4p4O3n2qO4m0PO2j23J1O2M9n2N4J8p8K4j2K2
3659A3M3m0o0K6J2m1O0K9k8p6O5J01q3n4KJ47j35p7K72k27k7K1Q3r4J74o8r2K4
3687c0J00o9OJ9l5M7Ol9n9Q2j6mk2J4mK6l0nJ6Rj0k2NJ7Qk3mL2kPl9K0J3LqkJ6
3724B3jnj0k3J5K6jk3pK6rk6J8K0Nqk5%K8k3j0mJ5Nj6m%L8l0m7K6K9L2n6KM6m8
3761b2Q2n7o3R5M6n9M5j21M4O6j08nJ59j65L7P4m7Q2q2mj4l8J52p0l3M5L3m7j22
3790i7J33l5ml4J2k2R5m4ql3L8K3kl7OL8ok0k1J8K7k0k7pN8j8k2k7L4M5k2o5J2
$$ plain form
3554 19 -4 -29 31 9 -9 -45 15 106 -38 -19 -5 -8 1 -38 -32 5 -12 10 -14 25 -6 3 -14 -19 6 31 -8 2 2 7 4 -7 -16 10
3588 10 4 -6 -5 -14 -5 3 2 -21 -5 22 32 10 17 6 11 15 31 0 29 16 -13 4 8 21 6 3 0 7 20 4 0 41 12 12 -1 -10 19 -8
3626 -8 -22 -15 6 -19 -7 -25 -18 12 -5 -11 -4 -85 -8 16 -58 5 -47 -55 9 -31 -24 38 -85 -74 -12 37 -15 39 57 -21 3 -9 13
3659 13 56 16 -44 -18 -6 -47 13 42 14 -62 3 104 21 -33 -31 116 -19 -96 176 -51 -78 -57 26 -68 106 38 -54 -30
3687 -30 70 1 7 26 -9 38 44 5 -54 28 12 8 -14 0 -4 22 -8 -13 3 12 2 -20 -15 2 10 -13 -17 15 13 20 -19 1 14 17 9 7 23
3724 23 22 17 7 -16 -1 25 24 1 -6 20 11 -15 3 23 28 20 -5 -5 23 0 -10 -14 1 6 -10 -14 -14 24 -6 -53 -27 2 34 -22 -20 26 -22
3761 -22 60 3 -60 35 81 22 67 -54 -10 56 -52 -57 102 -63 -26 48 1 83 1 -3 -17 -55 97 27 -6 39 72 25 -97
3790 -97 36 1 -3 -37 -25 -47 48 4 -4 -37 1 24 22 -15 -9 29 23 3 -18 0 27 7 -20 -27 31 13 -9 -36 -2 43 21 -44 -32
3823c2L2L0m6j1M0jj4l7M9J1J5m4l1L3M1qm7J5K5K9o4K5K0M2p2k06R3N7N2N8j10
3854e6L5J74j78J71k04J8P0n0k4M0J4n8L6k0M0jjn2K7M6Lm5j4K4L4l5j9NM1Mm0
3885a5k2N8Nk3m3K8L4J6n1j2N4K5k9n8L0K6K7m0l0L6J8Ln4J2L0N2q6l3L4O1mq0
3917c1K8M8j4m9pL4K1k5l8JM6j2l2l3N3M8l0l4nN1J6m2l6L0J9J5m3l4J04on5q2
3949i4P9Q3o0l1J0L2M7m8m4M8l5L6%q0J08N2j17Q0m6R6M8j38l8N9L7j07K2q1Q7
3978ER6o2l6K8L3r8J6k9Q1J5n2m9K1L3l6K4l3O5J2q2j7O5L3k4l8jN3K5l2o4L5
4009a3N0j6m4j5N2L0m8l4M1M7j8n2%N1Om2l1M8M4l1o4J2N2Ok4l2K5L6Om5l8O0
4041A9K6l8m7J8M6mk6l9M4K3l5l1J4L2K0m3KL0K2l9n6L5N2k3l4nM2K3Mo4qO0L
$$ plain form
3823 -32 0 30 -16 -27 13 12 -2 -39 10 21 36 -8 -39 -6 35 27 -20 -5 20 49 -15 10 30 72 0 -206 -113 -56 -4 54 -56
3854 -56 -21 153 -25 146 -58 -40 30 -20 -44 -4 10 -48 -12 -32 8 7 6 -46 -19 27 30 -15 -29 -5 29 -6 -25 -20 21 25 -15
3885 -15 -37 21 26 3 -40 -12 22 38 -13 -25 29 54 25 -33 -3 23 50 10 -20 16 34 37 -17 -5 25 77 -9 -42 -8 53 49 -31
3917 -31 -3 45 31 -18 -25 9 30 5 -33 -32 14 2 -30 -63 -10 38 8 -26 -31 20 36 -6 -42 -12 7 22 -21 -55 49 43 -12 -94
3949 -94 -15 68 8 -23 -13 19 66 18 -26 22 -13 23 23 -57 51 103 -14 66 20 116 164 26 -12 47 84 -23 -1 -82 5
3978 5 101 39 3 31 64 -34 -18 -47 34 49 -3 -52 -31 2 -34 -10 -43 22 34 -48 -65 0 33 9 -29 -30 23 48 16 -48 -13
4009 -13 37 21 -23 -38 14 44 -4 -38 3 50 32 -20 -20 31 37 -5 -36 12 56 25 -39 -27 25 31 7 -25 0 36 42 -3 -41 19
4041 19 45 7 -40 -22 24 20 -6 -45 -1 22 -13 -44 -30 2 22 -21 -19 11 33 -6 -62 -27 25 2 -32 -37 5 28 32 -32 -40 20 23
4074B3k0l5N6K7k4n7J4O6j7l3l0L4O4o2m7L5K0L7q0kK7N0j5m3j6L8J0l7j1L0M3
4105D5m1l2J0L7mk2k1KO5m9m1QL0K4%R7j43N7m0n4pJ19L2r4m6N1N3j1p7RN1n0
4137d2M9o2k3L9o6O0Q8l1qK3j11Q6J05j36o8J66J9J7o4j64J85j28R2Rj00O9n7
4164e3kJ02j24J54j01l1q3J46pR4j21j5J7M0P7j52J58k0n7k5OK7k9%NL5j8Qr1
4193f0RN6J2k3J5oJ0l9qL8OJ5Km1K0J6j1l2%N2pk3l9K7N4Lq6NL5K7n1Nj3M4rl5
4229c2J2K2M2n2j7KM1Qm2k3L6M4m6l3K8QK8n0J4L6Kj4l9L0K8Kn3pN1K2m0k4J8
4262BK1Rl4l4N5K8m2o1N7J6Ol0oJ8J3j3k6rN1J4n8KK1K7l7k0OL0Mk8k3M1K9j2
4296A7m4J9RK7l7k5L0K4Nn7L4J6K5m1j3L5Jj4k6J0K7J3qm5L7J5j6j6j2M0j8l1
$$ plain form
4074 23 3 -32 24 51 27 -30 -16 50 33 0 -30 4 68 6 -41 -6 14 51 -29 -31 -4 46 31 -12 -28 10 20 -17 -28 2 45
4105 45 4 -28 -18 19 15 -7 -28 -26 39 -10 -51 -43 -13 11 11 108 -35 22 -18 -72 -79 40 72 -22 -68 -17 36 25 -52 -43 8 -42
4137 -42 7 -55 -78 -39 -105 -45 43 12 4 27 -84 2 107 -29 -97 69 88 105 41 -123 62 -66 26 35 -65 4 -53
4164 -53 -55 47 -77 77 -24 -55 -138 8 1 95 -26 -41 -24 16 93 -59 99 79 22 -3 3 30 1 1 6 41 23 31 -60
4193 -60 -51 5 17 -6 9 3 13 -26 -34 4 10 25 27 -14 6 22 11 -21 -21 31 24 1 -38 -11 43 46 -40 -35 0 27 -24 -19 -32 12 3 -32
4229 -32 -20 2 44 -8 -25 -23 18 26 -16 -39 -3 41 -5 -38 -10 -2 26 -24 -10 26 28 14 -25 5 33 35 -18 -25 26 48 8 -16 2
4262 2 23 32 -2 -36 19 47 5 -56 1 17 23 -7 -13 5 18 5 -21 -30 21 35 -23 -21 0 27 -10 -30 -24 6 10 -18 -41 0 29 17
4296 17 -27 -8 1 28 -9 -34 -4 20 25 -32 2 18 43 2 -11 24 25 11 -15 -5 22 35 27 -18 19 34 18 2 -10 30 12 -19
4328a9jK8K2j0j5JJ5Qj6l0JL9ql8MK4KPn4PN1Jl5pK9Mk3j1J0J2Rl3J3lM0k8k5
4365b9J10j00M9Oj00Q1NK7j18J69j49N3P0p5j7J32O2j76Mj6M8j1%k2j3k3J4j8
4393c7J11l3k0NK3m1k0k1P2k5J1rj3j7M1o1J2OM6k4m2K1J7j5K8p1R9q1Q0K8o4
4424FJ3j4Rq7Q7k6lnl5P5K4K7p3j9O3j7j7K7PK7k8K9J1l6j7k1K4j41J47q5J58
4455A10j22kj3P2n7O8p6K2n4K4O5J7o8L3k9mR9j20q0J21n0m9N1QR0j52J28j3n8
4484c9J1K8J0l3K3j0j1K9N8o8O0j06J04j57J55o8L3Q0MO2j06l8L6j10p7J60K7
4511E7Q6j59M4o5K21j74O9j33l2K21j49J00j36M8m9R5M4j67m5J19m7l3J11J2n
4536C3r1q0J89m5J6l9l9O9k9ojL5m0Q7k2j7K5j3r3M5M6K8l3Qn9K2J0J4L2l5lJ
$$ plain form
4328 -19 -20 8 30 20 5 6 21 29 13 -17 -16 23 15 -23 -19 5 7 14 -40 -33 18 19 -16 -23 6 10 -13 -24 -14 -2 7 -26 -13 -16 24 -4 -29
4365 -29 81 -19 30 36 -64 17 22 49 -69 100 -49 4 74 -1 -18 114 176 0 4 -12 36 25 25 3 -10 -33 -19 -37
4393 -37 74 41 21 26 49 8 -12 -33 39 14 25 16 3 -14 27 -34 -22 -16 30 6 -36 -15 2 -13 15 -56 43 -38 42 70 6
4424 6 19 5 14 -73 14 -12 -15 -20 -55 20 44 71 -2 -21 42 25 8 35 42 69 41 70 81 45 28 7 31 -110 37 -48 110
4455 110 -12 -14 -27 45 -12 56 -20 2 -52 -28 37 54 -14 19 -10 -14 85 -35 -115 6 -44 -93 -42 -34 56 -96 32 19 -39
4484 -39 -28 0 10 -23 0 -10 -21 8 66 -2 58 -48 56 -101 54 -14 19 99 103 165 59 21 57 -53 -130 30 57
4511 57 143 -16 28 -37 184 10 79 -54 -86 135 -14 86 -50 -2 -51 44 88 -79 -124 -5 -52 -85 26 38 33
4536 33 -58 -138 51 6 22 -17 -56 13 -16 -22 -23 12 -28 59 37 20 45 32 -61 -16 30 58 25 33 -26 -4 6 20 52 17 14 15
4568A5l4J2O1lq2K1m7J08l7n4O0Pjn2PQL0m2J13j15Q7n4k4oK4l3K3J5N7k4q3L8
4600ek2K9O1o3k2j8J0J5k1M2P7q1N5k6j59J68pl6M0m6O7n2o6M6j0K7j3qj6J9m5
4631f0J34j34M1q2K1O3l0m3R3J7k3j8J36j62K3k5m1OR4K3k9J17qj25o6J50n8J12
4659A26j18o1J13n1l5QR8r2K8K3K2r4R3j9j4K8jn8N1o7l3m4M4J42p9j0J6L5l8
4688A3K9k7L0o2Jl7P4RM5j03N5Km7j5J3k2K6OJ5M7p6O8o2RlM1j5nj4QJNLk5QN
4724@pKKrNK5l0NkL0k8J7MpjQJ0%n0N6k4nj6K1LM3m9K6m5J8J3J8m3O7ol0n0O5
4762C6r1K9K9o7J30q4k4J11m8k1k5J4J4j7mJ0%%lNMJ4mlJOk8QQlJjL3k2k7J4O
4799AJ9nk1M5l5jJ2qkj5J6J5j1m2K1jJ6nRppK5j7oJ1j1j1K1k2K9k3kmJ0mJ1k3
$$ plain form
4568 15 -19 -7 54 51 -31 -10 -57 51 14 -40 20 27 26 -26 -19 -11 19 -23 90 -25 62 8 -16 -22 2 -31 -8 7 64 40 -43 -5
4600 -5 -27 2 63 0 -22 -40 -30 -15 -36 6 83 2 57 31 -128 40 33 -3 37 -9 58 6 -60 -14 -24 3 -10 -18 -34 -15 -60
4631 -60 74 -60 -19 -101 -80 -17 -47 -90 3 20 -3 -21 115 -47 -24 -49 -90 -84 10 33 4 121 113 -12 -78 72 14 126
4659 126 8 -53 60 9 -26 -18 80 -12 16 39 61 -33 60 41 27 55 54 -4 47 -20 -53 -97 -53 89 10 0 16 51 13
4688 13 42 15 45 -17 -16 -53 21 30 75 -28 27 29 -18 -33 -20 -42 -16 -10 5 52 -24 44 -18 -9 -12 29 14 9 -5 3 4 9 12 -13 -5 0
4724 0 -7 -5 -3 -12 -7 18 -12 -7 -9 21 -7 10 14 7 6 14 24 24 -26 30 6 1 -15 6 9 52 3 29 -16 2 15 33 -10 57 51 21 -29 36
4762 36 -55 -26 3 -64 66 -18 -42 69 21 0 -25 -11 3 -14 -18 -8 -8 -8 -11 -6 -2 12 8 5 6 12 -16 -8 0 -3 -2 -3 30 8 -19 -5 1
4799 1 20 15 -6 39 4 3 15 7 5 -10 6 21 10 -32 -11 -12 4 -1 8 1 -6 19 2 -4 7 -4 -15 6 -16 13 -10 -12 -16 -6 -10 1 -22
4836b2L6k8K6j8%K0j9J7l3K9J2j4J4rnq%mLMNJ7k0J0Kj6lK4k3L2j4lnoJ1k5L3
4873B0Pk8pJ1j0nK9Jj9j6lL9j6nj2J8k9J6kpL6l1P2j06L6m7P0J7n5LJ14J3R5k70
4907g1J25k0p9J2j6P0m3O3l8p5O6m9M8OK8l4j28J51o7J42k00m9K59P9k51R7Q9
4934A15r4Q4l3j19K9L7j03J01K5q3KM4k4j8M4L7l1n0J2LL1k2J2K6opkKQj4Lj3
4966dK1j3J0k2J4OrJ4j1J1j2Rnj0J4k4K2j0rNPlj0J4mJ0k1J0nOJK6o8N2J9j1j5
5003EK7J6pl2j6l0K5N9m4k8K3l3N9j1n9Q7j32O9Q7o1l8M5l5N7k9qrM7l9K1kJ3
5035B7k0J6l7J5J9opkLpMrRqKJ7j4j8qL0j8j3J8jJ6qomj0J3kP%pL1m8RRJJ0mP
5077F%jK4j3l9K2Nj1O6o0K2J1Qn8j20J06L1n9R8L5Km6l2j3P4n5oRp9P9m2L1K4
$$ plain form
4836 -22 14 -14 12 -6 -6 14 -5 12 -21 8 20 6 20 11 6 -2 -2 -6 -3 1 6 23 3 13 15 -1 -4 20 -3 29 15 12 7 1 12 -13 20
4873 20 27 -1 -8 3 -7 -12 17 18 -1 -17 -20 19 3 -2 -14 4 -25 -9 -11 -18 18 -13 59 -47 -11 -58 12 29 -26 -23 91 104 199 -71
4907 -71 54 34 -45 -33 -49 21 -22 41 3 -72 -6 -55 -7 -1 27 -7 -135 16 -51 91 -109 -158 101 180 -71 26 115
4934 115 21 105 72 -47 -18 19 -84 17 42 -41 -39 5 -19 -37 7 44 13 -37 -25 -22 9 -13 -1 25 19 12 10 12 20 6 9 -4
4966 -4 17 4 14 -8 6 12 3 17 6 17 5 14 9 -1 13 -11 11 1 -8 -3 4 1 -9 5 1 11 -10 0 -5 1 2 28 -40 12 31 20 5
5003 5 32 48 41 9 -7 -37 -12 47 3 -25 -2 -35 24 13 -46 41 -91 -22 65 4 -34 11 -24 33 4 -4 -13 34 -5 16 14 27
5035 27 7 23 -14 1 20 14 7 5 8 1 5 -4 5 -3 -1 16 2 -16 -24 6 -12 -25 -7 -8 8 0 -6 -10 -20 -7 -9 -2 -2 -9 22 -26 -17 -8 -7 3 -1 6
5077 6 6 5 29 16 -23 -1 4 -7 59 -1 21 32 40 -18 -138 -32 -1 -60 38 73 75 29 -3 -16 58 3 -3 6 -73 6 -36 -5 19
5110A9K2n2Qm2L7K6l5k0L9l7K1J0l0L9Qm7L8k3J5k7RRmLJ5J7k3oQRJ2rj1j2L9
5145B5k7J1jMl5M0J1p2N4mj0L6j8j2J9Lj0p7P2jj0J1J2k6k3M4J2km3PK3k9J7R
5179A0m8L2K6j6k0k4KJ54j47j2Rk1L6PM1Ll8L1J7m1j6O5o4rk5L4M0L6J3j06K3
5210hR9p8J4n7M4JJqNnoOmj2lmJ9k9L5OrrLnj1JJ0j2NK3J0j8Lj6Rk1Kj3K9j7J9
5251aj6j1rJ3J9m1L4M0n5N3K2k3n0J6J4O9o2k6M4Oj7j4OJ0M7j16O9k8kK9k9K0
5283A1n2J1PJ5k8N3m8L8J8qL2k7q9M8O1l8L0m6N6p2OK8K9q0N3k0K3J1j7%M6j46
5315i5J34k3N2l1j30J63j25Q3o7kL9J00j28L1K8q3J5OL1Qm7P9J7j9l2MJ4p3J7
5344c4J13p7K2l8P2l1p6M5j2m4R6k1QO2j46J09o6j3J83k37J71r8m3rO1k4N6m6
$$ plain form
5110 19 41 -11 -3 -45 -8 18 -17 -37 2 -35 -14 -4 -34 5 13 -34 4 -19 -4 -31 -22 -13 -17 -14 1 18 -5 -11 -3 6 18 9 -2 -14 25
5145 25 -2 9 8 12 -23 17 28 -44 10 6 -4 32 14 2 21 24 14 -63 9 8 -2 9 21 -5 -28 16 28 26 -17 -10 13 -16 1 10
5179 10 -38 -6 20 4 -16 -40 -38 116 -31 -43 -34 -55 -19 -12 29 32 -6 25 42 1 -15 50 -14 -23 -48 -14 26 62 75 -31 -8
5210 -8 91 13 27 -30 14 15 16 8 13 8 2 8 4 -8 -11 -15 4 -25 10 16 7 -2 1 -4 -15 -14 -4 -16 -11 12 22 4 7 -9 0 -21 -19 -32 -3 -20 -1
5251 -1 -17 -28 -37 -24 -5 -46 -12 28 -27 26 48 25 -25 -9 5 74 12 -14 30 36 19 5 11 21 68 -48 21 -7 -9 20 -9 11
5283 11 -41 -30 -23 -8 -36 17 -31 7 25 17 49 22 -67 -19 42 4 34 -12 44 -28 -22 6 35 -45 8 -12 11 22 5 5 51 -95
5315 -95 39 16 68 37 -93 70 -55 28 -39 -41 -2 98 -30 1 29 -54 -39 -33 -2 6 -41 38 55 36 4 8 22 -51 -34
5344 -34 79 2 24 -14 58 27 -49 -4 -16 -60 36 15 23 85 -61 48 -18 -31 152 -85 86 -12 -55 -64 -3 -27 29 -17
5372a7pn9Q5po5P2L1j9m5P6o9m9R0pm3J2K3J8j0k4OkK7k3L4nm7N2l5K7j4k8L1
5405IJ7k7J3m6Qk4L4Rm2JO0n5K0jJ15j87J91K6j01K7q2L4K3r3P0mj2Q8j86J21
5435Fk1oM6p7mN6j1j6L0M2k7l2L5l4M9p1R1l3j0k1J0K3o0M1LK3J2po4m6P7k4M0
5468B0l1Jj2RL6k8M1j01J19n8K8j4J7L0r5k0jLO7k4J6L0n6J7M1k0n4M8L7n0j9
5499b3L9j5Lm2M3j00L4P2mk9Q2r5M7%k2o2J30o7j14J61n5k8M0l1O9Rp8k3L9M6
5529B6l6K4L5q0OL7JoOnk8QJ1L3j9k1j1K5j3j9M4j0n0J5M7l1j0j4J30n1q3M4n7
5562e2nO3K9l2J0L%nLk2K1j4J7J3m2OPMNJ1Ml1QRj5moNjR%J6k8OJ6kJj2PK3J3
5603C8p6M2Mk9L8l6J7k0L3j2LoRj2J0j0QRj2j8ML8j5MnOJ4k3Qj5J0KOmj0J1k0
$$ plain form
5372 -17 -24 -83 2 -5 -70 2 33 14 -31 45 -24 -73 17 10 -33 -21 2 20 10 -14 -8 -10 17 -6 28 23 -24 28 -7 20 6 -22 9
5405 9 26 -1 12 -34 -26 -50 -16 -7 -49 -48 12 -43 -23 -24 91 -96 95 121 20 47 -35 -1 22 -71 -1 -5 -17 71 -115 6
5435 6 -15 -21 25 -52 -56 0 -11 -27 3 45 18 -14 21 -13 36 -35 56 23 13 -8 2 25 -35 6 9 32 44 37 -27 -73 4 -20 20
5468 20 -11 -10 -22 -13 23 -5 36 -65 54 -4 24 10 27 57 -38 -58 -59 -56 11 -13 3 33 -23 -6 35 15 -39 9 46 -4 -23
5499 -23 16 1 4 -38 5 -95 -61 11 7 -22 60 -35 12 12 -10 -72 58 -9 -123 38 -17 -45 -5 -36 33 42 -36 -59 -20 26
5529 26 -10 14 49 -31 -25 12 13 7 13 8 -20 -12 -1 32 13 -8 -19 6 -7 -26 18 8 -42 -27 20 -11 -21 -35 95 44 -39 5 -52
5562 -52 -57 6 35 3 13 16 16 11 14 -8 13 -1 16 29 -13 -7 0 4 9 20 24 -7 1 10 -5 -9 -15 -10 -11 -2 -2 14 -14 -8 8 6 7 -5 2 25 38
5603 38 -38 4 8 -21 17 -19 -2 -22 11 -1 2 -4 5 -7 3 -7 1 10 -2 -20 -16 22 7 11 6 12 26 3 11 -4 6 8 14 10 0 11 -9
5640iJ1j5K7lNj5kj2J2P%Jplj0j1J8Rk7M7j0j7J0mJ4k2QqmjJ1nj3J6KK2k9L4l
5679B4Jm7qL4koRrK0j4Rk1K8k5RkKJ7%j2mnmPmLJ5j3lj7KM0l0kmJ2oJJ4k2J9j7
5721a1nmK1J8j1j0nK5l7LJ6LRl3%L8Lnnj9JK3j4pJ7J4j1l0ML4lk6J0j6J6j1%O
5759bj6J5mLPpOkj9PlJ2J5k3j1K4k0OkQ%k6K7K1lj1rkLk3J7j4L3Oj6OJJ9j7k9
5799b3K3J2KnJ3j6J2k8jj4L4Rj0j2K6nj0nl0M4j2k0OjK2%k9J7qOoj9K7J4rj4J5
5836EkQjl7PJ3Jj4J9kN%jJ5oRj5k1NK5k3%K1J9j8J3r4J09Q6j45j8Q8l8J1M8p9
5872gN2P4l9o3l3K6mp6O6Q6q0L5N9j76L8P5m8j57K24Q1r2m8r8J96M6j92K9j9R5
5901E0o1K0j7J19j00k8Jj4O2k7P2j53Q2K9M0p0n1J08q2n1J56m7J12j43M1p3J6
$$ plain form
5640 -9 2 -13 14 11 16 1 -1 -13 -1 6 6 7 0 -3 -13 -24 -6 3 -24 23 13 -4 6 2 16 -6 2 -6 -10 -11 0 -5 -18 -2 0 22 -7 27 24
5679 24 25 -22 -30 4 2 -4 5 -4 16 2 11 -10 18 -7 2 0 2 19 19 7 3 -2 -6 1 -3 0 15 2 -1 -18 -16 24 -6 -8 -12 0 -6 -5 9 -13 6 -11
5721 -11 -16 -20 1 19 8 -2 -7 18 -19 -16 0 3 12 -21 -21 17 20 15 10 -9 -8 15 1 -6 11 25 14 -16 -12 22 19 -7 3 -13 3 -8 -8 -2
5759 -2 -18 -3 -7 -4 3 -4 2 0 -19 -12 -15 -3 12 -11 -22 2 -18 -12 -14 -6 -6 -32 -5 16 13 2 -7 -9 -6 -29 -12 -26 7 13 -3 3 4 23 6 -23
5799 -23 0 12 14 9 22 6 18 -10 -11 -25 9 18 8 -4 22 17 7 2 -28 16 4 -16 -10 -11 11 11 -18 -1 -9 -3 -9 -28 -1 13 4 -10 5
5836 5 3 11 10 -27 -20 -7 -6 -20 -1 -3 2 2 1 16 10 19 4 -17 -12 13 -10 -10 11 30 12 25 -69 40 126 -19 -37 51 13 24 72 -7
5872 -7 45 119 80 17 -16 10 6 -70 -4 82 2 37 96 -80 -42 33 -15 -172 52 133 41 -7 -105 91 137 -55 -26 -45 50
5901 50 -11 9 -8 111 11 -17 -16 -30 32 5 77 -76 6 35 75 5 -46 62 -20 -71 85 38 150 7 48 -25 -9
5928iJ9l4L6o1J19no4qlK3%n1O9j7l4nJ5J0%k0j2K8J9o8K5kM1Nk1%kJ3qnj9L4
5964HNj8j8K4Mpj4jO0o7L4j2J1K5k4j3NL2l8J5m8M8J1ok9ML2l2J17q2K8p3M2n7
5998c4L3J2PJk1J5Nk3j5JK6j3Kl6J2L0J9l8oK3j0L3l9J8K0On5J8nkpj9J20j35
6032e7N4j1N2k9J2n7N3j56L01j16l4k6R8l6p8j1P1O2p2R1o6QJ8Ln2n8N4P4j71
6061g9N4k6N0j41Q6L9O7k5k2k0M6M2n6K3n8L2j2qP7q6L1rk9J1J6j6k5J9J4pL2
6092B0p6N3m6Q6Rj7oK4o8k8M7Q0K4j86l4J18N5n5p0J9J01n3OK5o8O4l8Ok9J8J7
6123bpk7L0K4pj9QrK4l5J1J4lNj5NqK7l8Pj6N7j4k5MjJ4j7kLK0J1j6j2J6J9k7
6160akqQK2k6l6J3P3o4O4j09Q0N1q6oQL9l1j1jLL9j9l1L0lkkjJ1%Qk5J1J5Rj4
$$ plain form
5928 -9 10 -24 12 -49 70 65 1 -7 -10 13 13 -38 31 14 -20 -25 -10 0 0 -20 -32 -4 15 -53 -28 -30 11 16 -5 -5 -7 6 -2 -7 -26 8
5964 8 13 -5 -23 1 5 -2 -16 -17 43 -24 10 -2 9 34 10 -3 2 34 -4 11 -37 11 22 16 -13 -9 23 -9 108 26 54 -19 23 -34
5998 -34 -1 11 18 19 -2 13 18 -5 -20 -19 7 -6 -4 -40 -28 2 21 -17 -23 0 -10 23 -16 2 22 28 -27 -9 -14 -16 -23 -42 78 -57
6032 -57 -3 -14 38 9 21 -36 17 -139 162 46 12 -14 84 48 -30 -41 30 92 20 111 45 53 71 74 22 -36 18 92 -79
6061 -79 -25 -51 -1 -142 -56 -17 50 25 3 -17 29 71 15 38 -20 12 0 -8 69 -17 14 5 -24 -13 3 -13 -38 -19 -5 -12 20
6092 20 -56 -3 -49 37 46 29 23 47 -21 -49 -2 78 102 -84 -118 0 55 0 -70 -51 50 -3 3 28 -40 24 -14 -8 -37 -19 -2
6123 -2 -9 -36 -6 18 11 -8 0 -9 15 -20 -9 5 2 7 -8 -3 -11 16 -22 -15 -31 26 12 -13 -9 -10 4 -13 -15 -12 8 19 3 -9 7 26 -1
6160 -1 -3 -11 -3 19 -7 -43 -30 43 -21 43 -66 14 65 -21 -27 -19 20 -11 -22 -23 -20 19 0 -31 -1 -4 -6 -8 -9 2 2 10 -15 -4 11 20 6
6197Fj0RjJ3l5K2J6mk9J4jJ1j8pJ7J7lj1QkK2j9k1mL9Qm2nK6j7nlJ0k5K8pj2L4
6235A9K1k1k1jkJ9j7m8L5M0k5j5L5K4n4K0k2J0J7K2o7J2L4j4k3L3Rj4K9l2j1K
6267fL7j8j8J6j5L3l3K8ojkk2K4K1j3l0oJ5K0jm7Mjk6N4l1P2J6p2P8m1k7n7L4
6301b1M8oK1J5p6J0L2J9K3q4O1J0n4r0Q7oN6j04m9J47l7lm6kK8M1J9k8j3n4O3
6332GN3r5P0m9O5K6m3mJ4P0p9JJ9k6j3J0ln1RK4N6Ok05K0J43m5R6k18J08P2q8
6363e0K13k16J9k3J47j42J42o9K2j17J93n3q2Q1m0O5m2m9l5L8n1P0J7l7qJ01N1
6390A45j59Q1r1J7O2q0mM4J3n1N1ok1M3Jk3n3M4oJ6K4o3LO7q1L5J4j7p2M5M3k3
6422bMl4MK6J5J0n2K2k7L3j9PrK3JKJ3j8kmj5J0J6k1J6K3J2l7%J7MpNJ5k0K0J
$$ plain form
6197 6 -4 5 4 17 -18 4 20 16 -13 1 0 11 -7 -14 3 20 17 6 14 12 34 15 -6 -10 29 37 -5 -10 16 -1 -6 -9 1 -24 4 -3 -15 19
6235 19 40 19 -2 -3 -5 14 -3 -51 -16 24 -1 -16 19 43 -11 9 -13 -3 14 36 -31 -19 15 1 -22 11 20 6 35 3 -8 -6
6267 -6 31 13 -5 11 -4 29 -4 24 18 17 15 -7 17 38 25 -5 -11 4 24 23 -24 -20 -21 -47 7 -24 48 64 -8 70 29 2 -55 -21
6301 -21 27 21 42 57 -19 -9 23 42 65 -19 42 52 -2 -92 -5 -11 45 -59 -108 39 2 -1 -47 -49 -21 20 39 11 -2 -56 7
6332 7 60 -35 35 -14 51 77 34 30 44 114 35 36 55 29 16 26 23 -28 -19 5 61 67 -138 -118 25 -20 76 -142 -34 38 -50
6363 -50 163 -53 -34 -57 90 -52 90 21 43 -74 119 66 -16 65 25 90 48 -1 -36 2 -49 21 38 1 -7 94 145
6390 145 -14 67 -24 -7 55 -25 -29 15 28 -23 28 22 1 44 45 22 -31 13 7 23 47 -16 -13 54 -27 8 22 5 -67 -22 21 -2
6422 -2 2 -32 -28 -2 13 23 -29 -7 -34 -1 -20 -13 -22 1 2 4 17 -1 -3 -7 -22 -12 4 -17 -1 22 34 -3 -3 14 18 11 16 31 11 31 32
6459C2l5M3k6oJM5l1J5n0M0n3L8j8oK0Jllk6M9L2p7J8J7m3Qk9j2M6K2P0j26M5
6492bm9M3Nno9J51m3p3j2P3m7K9k1p1O8N2p8M5K1l2J9K3m2O1n8K0L6p0j5J03K2
6523H4j11J31O3j80R8P9j38p1N6l3J00p3Kl3nN8n2k6O8p3O9j8n3O5n0L4L3m9K9
6552Dj7l9O6n1L7J4j8Q%K2j5l6L0j2L8l4j2K9oM4k3j9Q3p7l5R3kj01L5N7p5rj1
6585c2N2K6p3K9n1O6k6L0l4LL8n4K6j8L0l2%JK0j0QLpJ2j5mnLPOnjQLoj9K4Jl8
6624c4M0j1K0l1KJ6OpP%J9l3K4OJ4l9k0K4Lj9K1jj3j4K6J2l5J3JOl1J8J2J7l4
6659a5L2k0rK2j5k2L1K8o7M8k8J4k0nOJ4MOJ7k6j6j0M8l5K5j5%L6j6l1K5jl7O6
6693C4l6j6J9L1o2J9J4j0j7M2Rl5MPlJ6%j5jj5kLK0j8mJ6l0K9j0RpJ3NJrj6oK1
$$ plain form
6459 32 -3 40 14 8 9 54 23 38 -12 28 -25 13 -5 -11 9 10 7 4 -22 27 59 -18 0 17 -26 -18 -47 -59 -13 9 79 -47 -2
6492 -2 -51 -8 -3 -8 -77 74 31 -42 -54 19 -28 1 -20 -91 -23 29 -49 -4 17 -15 4 27 -15 46 -12 8 44 -26 -41 62 84
6523 84 -27 104 167 -13 85 164 26 -45 11 -22 78 5 7 -26 -31 27 -25 -51 17 -56 13 -5 -58 7 -43 -9 24 -25 4
6552 4 -13 -52 14 -37 0 14 -4 4 4 26 11 -25 5 -7 31 -3 -15 14 8 52 29 10 93 16 -19 74 72 -29 6 63 -12 -21 -32
6585 -32 20 46 -27 2 -49 17 -9 21 -13 -10 28 -26 0 -18 12 -20 -20 -19 1 -9 -1 2 -5 7 -8 -12 -17 -14 -7 -1 -6 -7 1 4 -2 -21 3 4 -34
6624 -34 6 -5 15 -16 -14 2 8 1 8 8 27 -6 18 24 38 -1 -21 3 6 -13 8 7 -6 -20 6 18 -17 -4 -3 3 -28 -10 2 19 -15
6659 -15 17 -3 -12 10 -5 -27 4 32 -35 13 -15 -1 -21 -26 -20 -6 -2 4 21 -5 -21 -31 17 -18 7 -8 -8 28 12 -19 6 5 -32 34
6693 34 -2 -18 1 32 -30 -11 3 -7 -24 18 27 -8 -4 3 0 16 16 1 0 -15 -17 -14 6 -12 -16 0 -30 -1 -11 -2 -9 4 9 10 1 -15 -21 0
6731@J1j2%Jj8J9pJJQj5K2j7RMkj7KK0J0Lm3O3ok9Pj7P0m9Rk9kj4Q2o3M2j7j5
6769A2L8q1P7r2Ln1P9L3j6kp8J68l4N6j41O5j68J36J16K9j16l1j8j0P3Mpj07J07
6798D4M5r6j7P1M3j1r5l2J24n7rln0L5J8P1k1l5M2p2P5j0m9j9O7l3j02P0m3l8
6828h7J53l5l0o6K0MJ13j11L6o6P9L4K6p8m9J36j49L4L2R3r5m3Q0k6%K8l1J7J0
6857B9K1o1L3j7j9N5q6L1Q1o0Lj6J6j0rK2m4O3k4K3K0Jj8o0n6J73j05k1J59n9
6887F5o3J38p4j17N7K7j45J39J3l0l5m5R0j3j7pnJ2ljj6P8o5k2P1m0K5j4ql0J0
6918b5K7L1n0L2Nk2j3KK5l4L6k0J0PJ5j4J4j4j0llJ3nNmnRj2k%rJJ7rj2L1j8k
6956fKolK3k0j1J3j3J1Pk3K2j7%J7LPol6K1K7rrrJ9k2N7l3m1M7l6j9Q1r5k3K22
$$ plain form
6731 0 11 -1 -1 0 -18 1 -6 -5 -4 4 -11 11 -6 3 7 5 -12 -10 10 20 23 -20 43 37 8 15 -2 68 19 28 -1 -3 -17 65 2 44 27 12
6769 12 50 -31 46 -46 -43 -94 -15 18 2 0 -78 90 56 112 -29 36 -132 4 120 149 33 2 -16 -26 47 51 44 -63 44
6798 44 89 -7 -24 47 90 79 -16 -48 76 19 10 7 -43 -8 10 81 60 25 67 -5 70 60 11 -8 59 26 -76 -6 -49 -87
6828 -87 66 31 1 -65 -45 -41 72 -39 -3 -69 10 44 70 -8 -57 79 -70 -36 -4 89 -6 -49 31 5 5 33 2 19 29
6857 29 50 -11 22 5 -14 41 -45 -14 67 7 10 -6 10 0 -9 13 -31 32 8 31 51 52 34 -26 -82 91 -14 -35 124 65
6887 65 2 140 66 -51 6 33 -112 27 40 10 -25 -70 20 7 -10 -17 -22 -10 -13 -14 -30 48 -17 -39 32 -8 17 3 -5 -35 -25
6918 -25 2 33 -17 15 20 -2 -15 -13 12 -22 14 -6 4 11 26 12 26 12 2 -1 -4 9 4 9 5 0 9 -3 -5 -5 -14 -13 4 -5 -17 14 -4 -6
6956 -6 -4 -10 -13 10 -10 -21 -8 -21 -10 -3 -26 -4 -21 -21 -4 -1 6 0 -36 -15 12 3 -6 -15 4 -18 39 6 -35 12 -24 -43 38 -57 -80 142
6992A42j37rL1o4L3L1o5O4L2l9%j03Q9NJ8l2l0K3Qk3j6mqN9j8J0k1KK9l1qL2k1
7025b1J3J1Nj9KMJ6j0KkP%j8J1k3K3jJ6k4NNkK7k4Qk4K3RPj0Qj7K3j6j1K2qk5
7063hK3J0mj8L9l8j04J02j1j38J19J08l5l0p0LK3kj0K1KK6r0J14o5nL1M0j53J08
7093a2K1M9n5M3m3L2l6J4N6j25L7P9p9K2pM4k2K1k5lLj2M0n0J8KpPK2j9Lj1jj0
7127dJ2%j0j0J7qk3J3J0Rk4J0RL6m7rM9l3oM0p7M1k7Q7m6k7M3r0J65r2j14R8J9
7160A1J6M1pj01QM5p8P9Qm9L5N7l6m5K4nL1l4J2Nl5J4Kj8L7k9Rl4L7rJ1qj4L7
7194A7k6K0j1lNJ6l7qJ7R%j5L8l3K2rQn0N6j1L8J6q0K3NK0p7O5M4p3j4O1q0N8
7228A1m0oN4K6m6L6n1Nj6N1o3K28k03Q4l1j26J16j7l8Q0n1J6l6M6J00j37N4O8
$$ plain form
6992 142 5 -4 27 -37 -4 27 -38 26 58 19 19 -84 5 10 28 -4 -34 -11 -3 -26 -42 -46 -54 5 -13 -3 -24 -22 7 -24 -32 0 -21
7025 -21 -8 3 8 -11 -9 -5 11 1 3 1 8 8 -10 1 -22 1 0 16 -8 -3 2 0 27 3 11 -13 10 19 26 16 24 7 30 14 3 25 17 -8
7063 -8 15 25 21 3 42 4 -100 2 -9 -147 -28 80 45 15 -55 -52 -29 -31 -41 -20 -18 8 -82 32 -33 -38 -7 33 -120 -12
7093 -12 9 58 3 46 3 35 -1 13 69 -56 -19 60 -19 3 -4 40 18 39 14 11 14 2 42 -8 10 12 5 12 34 15 18 7 6 -4
7127 -4 8 8 -2 -12 5 -3 -26 -13 -3 6 -18 -8 1 37 -10 -19 30 -3 -9 31 -46 -5 -32 55 9 -18 25 -65 100 8 -106 -8 11
7160 11 27 68 61 -40 -32 13 -65 14 22 -27 8 65 29 -16 8 3 34 0 12 17 -18 -4 -2 -20 17 -12 -3 -37 0 -9 2 -6 -20 17
7194 17 -9 11 0 -3 2 18 -19 -27 -10 -1 -1 -16 22 -11 11 2 10 -40 16 5 43 59 -21 2 7 27 -50 15 59 -14 -28 33 -47 11
7228 11 -29 -35 19 45 -1 35 -16 -11 -27 24 -39 189 -14 70 39 -87 29 12 -26 54 3 19 -17 29 129 -8 46 114
7256A14j05k3Q2p2l9L4n7R3J1j26R9nm4RJ01J8q9O0L6j37P2J8q2Q7o7k6R%QK3
7286Bk7J3J3N4jl6N3n6Lk9K8k8M2j1j6j4LPQPk0Ol1L3j6J6Nj4j1KK8k9RjloRk2
7324c0K8JQj8mJ5J2%pMj1J1qK0k6J1Ml1L0j4L1k6J4l1N5l0n1O2J0j7k1M0k9J6
7358A8Rl5N9l0j4L0j4j7j3Pl4J51p1j09K20j88O7k2Q0Mj12Q4r3J30j28j8k6J3
7386e2L1kJ14r5O5m1L4j04J8P4j39J03n5O2n9Q1L6k0r0M2J5J7l9J2J5Jj4mj8J7
7416Ejj4kK9k9jJKpRKK8R3j24J3j2jKNLpj9J6j8J1J2j4QrjJ0J0nKMKj5K2o7O1
7456DK3k2JNL7m7L5j01R4k6J2K9j1l6M3O1m1k9Nm5Jk5K3P4q0mMP9r2n2L5N4N2
7489F0r1k9j0Q9k4O9j7q2L3j3L5L0P2j40J4qO6r1N9j03K02j16O8l3j6p7P0J8K
$$ plain form
7256 114 9 -14 68 -4 -43 -9 -66 27 38 -88 11 6 -38 -29 72 90 1 61 97 -40 32 50 -32 55 -12 -38 -29 -29 -21 2
7286 2 -25 -12 1 55 54 18 71 15 18 -11 17 -11 31 20 4 -10 -7 0 8 15 -5 1 -30 3 -13 3 8 -6 -17 -15 13 -16 -7 -8 -11 -17 -8 -30
7324 -30 -2 -1 7 -11 -15 0 12 12 5 9 -2 9 1 21 -5 6 10 -21 9 -5 26 0 14 -17 38 8 -43 19 29 12 -9 31 2 18
7358 18 27 -8 51 21 7 37 23 6 -7 0 -34 117 46 -63 157 -31 36 14 94 98 -14 70 -23 107 -21 -39 -65 -52
7386 -52 -21 -23 91 -4 61 20 54 -50 -32 42 -97 6 -49 13 -46 35 71 51 -39 3 18 35 -4 8 23 24 10 6 -12 5
7416 5 4 -10 -12 17 -12 -13 -12 -10 -17 -8 -6 22 115 -9 4 -8 -9 -7 -2 1 -6 -25 -9 -27 -16 -4 -18 -10 -19 -20 -10 0 -5 -3 1 3 -12 10 -57 4
7456 4 27 5 6 11 48 1 36 -65 29 3 15 44 33 -3 40 101 60 31 36 -9 -8 -33 -10 64 -16 -20 -16 63 -29 -81 -46 8 60
7489 60 -31 -60 -70 19 -5 64 47 -35 -2 -15 20 50 122 -18 -4 -12 54 -37 22 -81 121 5 73 40 24 -53 17 35 37
7518C7Pr7o6J19j2QJ8r3J22Mo9l2P3r4J02J8m2j3j5J21r0M0l0Kl9L9n2J0j28J02
7548e0M2P6j30l0J59j09j14J12j0O7o4J54j09L0m4ln5K26j43M4r4Q4k7K3n4j6
7574c5J40j2q8J04j27k3Q0J3q3L8M9o9opL5K4M3l2j28J08k2J0N8Nj29J30o7lk9
7603b3l0Q4n0Rm9O3j5J2k5J76j82NO2j6o9J12r5J28j28nl6J76p0j17k3M0J11N5
7631A00J2j29j8P3m3R6jj07J04Mj20M3L3K4j57Q3J43r5K6j76R8l7O4p7o8J05R5
7658G5j58J08J0q5R6o2o7J02n9P5n6l8J82j05K6j2j5m1J2j67J34J2J09j7o4p3
7684g8R8j3o1K6N0j7o9J7j4R7Mj5l0j1j0K9K2m7N3n7J0L5n3L3JK9j1nl7K4J%J5
7717A6n4O5l1L2k5L4q4O7m3M6j7r2J40j16N2o9P1Kk8K2N7o3J7j8m4O8L9np9l9
$$ plain form
7518 37 44 -53 -119 0 -12 -4 14 -79 43 47 -22 -54 19 -75 27 45 3 -10 -25 96 6 46 16 18 -21 18 -34 -24 -152 -50
7548 -50 -8 68 -62 -92 67 -42 -156 -44 -54 13 -51 103 -6 24 -20 -23 -78 148 5 49 -45 39 12 35 -19 -35
7574 -35 105 93 5 109 -18 -41 39 52 -31 7 56 -13 -19 -26 9 33 76 44 -84 24 2 12 70 75 -54 76 9 6 -23
7603 -23 -53 31 -19 -10 -59 4 -11 1 -24 152 -30 -25 37 21 -48 64 -31 97 -31 -36 -72 104 34 -83 -106 -66 45 100
7631 100 112 -17 -35 38 -5 91 90 -17 87 91 -29 14 47 71 -86 -3 140 45 71 -105 -7 -44 20 -57 -125 -20 75
7658 75 -83 25 35 -50 46 -16 -83 19 -40 35 -21 -59 123 18 44 32 17 -24 -12 -179 -45 -33 76 59 -5 -78
7684 -78 20 7 -54 -28 22 5 -64 -47 -61 36 40 25 -5 -16 -26 3 25 -22 31 -26 -16 19 -34 -1 0 29 18 13 -24 0 1 1 16
7717 16 -38 27 -4 28 3 37 -47 20 -23 23 6 -86 54 -62 -10 -79 -8 -6 -34 -12 45 -18 -1 -19 -63 5 44 39 -40 -79
7747g9mJ17j57J83p5O4Qj17kj7J34j55J18j%N3q4K1J2l2k8M4P2q2O7l9p8R4j1
7776B6m6jk9M8l3j4P5j2k6j1J07q6k4J8j7j0J6K2k4K8j7jMk5N1k6J2j6j5J4Qp
7808a1pNOJ8j7J4J1k4%J7j7OJk1RK7k6NJ2JLk1J6nkkmJ0pK3k4Jj5K2K0l5M%j2
7847a9J6j6J3NK0l7NM2k9jJRk9L4Nj0l3OK5j9k0P9m9o0J12j2j6kl0j4m7P7jjM6
7882E0k5ROK8j27L0J25q5PML4l0m2L2J03j73O5L4qp6l2K3N4J3n6M0j3K6l1K6l3
7913b2k8Q0k1k4p4N6J64j97P3j05Q8q0M2P3lK6lk9r0M8K0%l3L5N3lj3m0K6j3q
7944bK6Qm6J1J8pM0j4l4jlJ3jk6MONjJRnmqJ9j0J0k5J5OJMj5oJ4j4j0L2J4Pj9
7984A2j1oK2%l1M5k8J6j0J1L0k8j5J3k3M0j0j0k7j6N8ml4K1K7j9k8j4L5K3Nm2
$$ plain form
7747 -79 -83 34 -123 60 -15 49 57 -60 -62 -79 55 -100 18 17 17 70 -14 7 19 -13 -41 3 75 -7 60 21 -57 37 26
7776 26 -20 -21 -50 -2 -35 -49 26 14 -12 -23 84 -2 -26 -8 -25 -35 -19 3 -21 7 -10 -11 -7 -32 19 -7 5 -11 -26 -12 -4 -11
7808 -11 -18 -13 -7 11 -6 8 19 -5 -5 12 -5 1 2 -19 -10 17 -9 -4 8 9 12 -9 7 2 0 -2 -6 4 -3 20 -4 -3 -18 4 24 -11 -7 -7 -19
7847 -19 -3 -19 -6 -1 19 -18 -13 29 0 -1 0 9 -20 14 19 9 -24 -18 7 -12 -32 47 -2 -62 50 38 22 20 -10 -24 -71 6 5 4 50
7882 50 25 34 40 68 -59 -29 96 11 18 22 56 26 -16 16 119 -54 11 45 37 -39 -71 -48 6 19 -37 3 -10 16 -15 11 -22
7913 -22 -50 30 9 -15 -89 -33 131 -66 7 -98 -10 -90 -48 25 22 48 45 16 -74 -26 -6 -6 -39 -4 49 46 33 -7 19 6 -2
7944 -2 24 32 -14 -3 15 8 48 34 0 -1 -4 9 8 -18 -14 -8 -3 -4 -3 6 1 -3 -11 8 -2 8 -17 -2 4 5 9 -6 -12 2 -12 -22 10 24 31 12
7984 12 1 -5 17 17 -14 31 3 19 9 20 50 22 7 20 -3 37 27 17 -10 -26 32 28 -6 15 42 23 -5 -19 16 39 44 2
8016BL6k9l4mM2Mm0J1K4k3N3o7K3l7M6N6n6plJ3k1Mmj3nJ8k5J4K3Kk7K4j3J8J7
8051B2k3%J8j3K3l7J9J3j0Ok9J7K2m8L2j6J3%Mj4J5pRl1K1J0mkj8PJ7j6k4NK6
8086Gj0mK3l2K4oq%K0k6jQj2J7Kl5K4J1Pk6JJ1QLJ4k0rL4j8lj8L4MJ2k4LqmJ7
8125B0j5J8k2lJ8k4PPQk4LJ1Jmk0LRJ8k9J8j7orRL3j5k1K6%QMl1PJ0J1j3J1jj
8164Ej2J5l2M6j5Kk1Rrj0j4RN1K8m8k6J03n2q7L1n9J21ll3M7m2J8
$$ plain form
8016 2 38 9 -25 -29 13 17 -23 -12 12 -11 42 -25 -2 -39 7 63 7 0 -3 10 -11 -7 -11 -24 -29 -11 -36 -22 1 3 -24 0 -13 5 22
8051 22 -1 -1 17 4 27 -10 9 22 12 18 -11 6 28 -20 12 -4 9 9 13 -1 14 7 16 -15 6 16 12 10 -8 -1 16 0 -24 -19 7
8086 7 -3 -7 16 -16 8 2 -6 -6 14 -12 -13 -5 -17 0 2 -33 -9 2 9 -17 -16 -5 3 6 20 0 -9 25 7 4 -14 20 24 36 12 15 7 3 20
8125 20 5 23 1 -2 16 -8 -1 6 14 -10 -7 4 5 1 -19 -16 -7 11 -18 0 -17 -23 -32 -23 10 -5 -26 0 0 8 12 -19 -12 -2 9 -4 7 6 5
8164 5 -7 8 -24 22 7 9 -12 -3 -12 -22 -36 -27 24 52 4 -22 81 29 -58 -27 -86 35 32 -1 46 4 22
8191B2
$$ Imaginary data points
##PAGE= N=2
##DATA TABLE= (X++(I..I)), XYDATA
0@%%%%%%%%%%%%%%%%%%%%%%%%%%%%kRj4J5j6J6j6J6j6J6k1K8l0L1l2L7m4M6n0
47b7N8o4P2q1R0j03J19j38J62j99K52l39N24j878M708K184o666l751L891N791
67D605j598n855j503N079L548k893m913N42M770J981l624l542J699M022K58l622
83a046j832K554K940r68l166m85K200J522j144j648QJ283P20l79q96m20N03J045
101G91K02j240j195P31J937K79j965j426J327K243k79k574j020K389K209j245
117A164l116k91L274J921k505l297R87L883P82l709k428K800L742j215m327o82
133c017L968K464k814l574J086L891O37l430k139K314L119p36l347q02K755K070
149B445j696k791N06K647Q49k365j384J307K077m94k168m65J784Q90q74j028M28
$$ plain form
0 0 0 0 0 0 0 0 0 0 0 0 0 0 0 0 0 0 0 0 0 0 0 0 0 0 0 0 0 0 -2 7 -7 8 -8 8 -8 8 -8 8 -13 15 -15 16 -16 21 -23 23 -27
47 -27 31 -33 39 -42 48 -55 64 -74 88 -111 141 -198 326 -1552 3156 5340 -1326 -5077 -1186 4605
67 4605 3007 -2848 -4351 728 4276 1383 -3530 -2988 1782 3763 139 -3403 -1704 2318 2576 -1046
83 -1046 -2878 -324 2616 1648 -1518 -2003 197 1719 575 -1073 -1065 218 938 559 -337 -757 -254 791
101 791 993 -247 -1442 -711 1226 1505 -460 -1886 -559 1684 1405 -1169 -2189 200 2409 1164
117 1164 -1952 -2243 1031 2952 447 -2850 -1863 2020 2802 -907 -3335 -535 3207 1992 -2335 -3017
133 -3017 951 3415 601 -2973 -1887 2004 2641 -789 -2928 -614 2505 1769 -1578 -2380 375 2445
149 2445 749 -2042 -1536 1111 1960 -405 -1789 -482 1595 1101 -1067 -1532 252 1142 268 -760 -332
166c32Q77n3n74l46L52J00J5J12j81k56j84L76N64rr82k11Q44Q35n49j504L84
187g22J470O17j572j391J087J912j48k329p71K064J807j545j911K64K544N53k493
204e64j585J643K472q06k231o14K188J372j587k001N57K362M65k010j561J507
220c93J992l43k360k80J926J031j357j743Q42J753l5j460p57J157R71o50r03R0
238e19Q74J60o25l81N07L82j77l67j08L84r7l06K03L53n6n56j11O63L39o53o00
259f91N68Q56l26j180m7J229O16j036j101O51J498j16j493n17J301J017r75j340
277a086R9J699M64j232j078P32J537k46j668l79J444R42q43j569L11J696K58j447
295c66q08J084J093m79j301j00J249N59r71q13N36P81j74o28k24O66L81k97o15
$$ plain form
166 -332 545 492 -82 -428 -76 24 39 151 -30 -286 -470 -94 470 461 -521 -732 112 947 398 -1106 -722
187 -722 748 1365 -207 -1598 -511 1401 1253 -1076 -1847 217 2024 479 -1432 -1168 1376 1929 -564
204 -564 -2149 -506 1966 1160 -1071 -1685 503 1875 288 -1713 -1156 1206 1671 -339 -1900 -393
220 -393 1599 1256 -1104 -1384 542 1573 216 -1527 -685 1068 1033 -427 -1184 -27 944 294 -609 -519
238 -519 355 515 -110 -491 16 398 221 -146 -254 130 33 -273 -70 283 227 -329 -440 223 562 -91 -691
259 -691 -123 733 407 -773 -820 409 1025 -11 -1112 -461 1037 921 -572 -1089 212 1229 254 -1086
277 -1086 -987 712 1176 -56 -1134 -402 1135 889 -779 -1158 286 1228 385 -1184 -873 823 1081 -366
295 -366 -1174 -90 1003 524 -777 -877 372 931 -40 -853 -317 464 290 -338 -562 104 485 188 -427
314d27K28N80j0n76n8L02L09m38l24N27K40j65m44J59L41N1m98j88N92K81o14
335a32m80M74P53j55q24j60P07M37o10o80M05Q03P3r79m90Q45P25m17j017J12
355f10R37M48r05p72P24J009l11r83l17R17O12p16p51L99P99O5p58m10N14N98
375D89k40p34J1O84K94n04m16L83M13l2n98m6L16L44l38k63P1M16j04l84O2K89
397A13J62l35j18J82L30l87l76K97N18k05m80O9L81O8k40l66L02M12j18m14r7
418c02M10L61m55n63L32O11N4o40k73N35M52l95n88J03O28J92n88l61L50N76j37
439C02n74j20N01L32l67m65J58N20N5m71k15L22L56j77m09N1L79J05l23k16J84
460g2K94j08k69j0K66P2k25j03J58J14r0j57M2J88j5j80PJ15J12k02p4R4J78J2
$$ plain form
314 -427 -199 381 371 -205 -263 39 348 -90 -414 113 353 188 -256 -97 244 295 -203 -391 201 482 -132
335 -132 -612 -138 615 460 -364 -524 183 620 10 -670 -265 538 611 -368 -858 -13 712 295 -722 -610
355 -610 327 775 -130 -902 -178 831 520 -463 -780 137 749 33 -718 -319 480 545 -213 -623 -109 489
375 489 249 -485 -474 210 504 0 -416 -33 380 348 -250 -296 20 364 26 -237 -166 250 146 -238 -176 113
397 113 275 -60 -178 4 334 -53 -429 -132 386 181 -299 -230 151 219 -21 -387 -85 327 209 -205 -302
418 -302 108 469 14 -549 -217 394 448 -192 -465 70 522 127 -461 -358 270 462 -126 -487 -137 439 302
439 302 -272 -392 109 441 74 -391 -233 287 342 -129 -344 -22 334 157 -252 -201 178 283 -40 -256 -72
460 -72 222 114 -155 -165 101 173 -52 -155 3 117 27 -130 -88 100 85 -95 -88 27 139 -63 -137 -43 135 147
484A47k60j61L17J34k84r6J75K67M1n25R4K92J12k96j25m3L86O6l69j61L63K12
506B86j51l22k8L80J27k85k42K57J24K9l06j13M13K00l16k45J43J68O8k31j17
527a61K09J27r0j10j00J48R7j03j41K08j0L4k48O2J28k2lj47J33q2J34j05q8K9
551a01O5J35j93J26Oq3p4K54L0k13M3j44J58J45k20R9m6J23n5l5j06K12m3q6p6
576g9j41M06q7j59J7J23P8j07k07L5J25P8j48mJ63j8k8m2j63J30J21n6j09M5N7
601C0J1k7j09P1N8Rp9q9J00K9nK8j19Q3k4Kj8Q3m8K7j5N6o3l4jO5m4rM4jJ7Rm3
634fJ1l7K5Ll1K5J2Rj9m7N0O8k4q0J5Q0m6l2k1R0j51Q5l4L7L7K9q3p3P3J5P7o3
666fk6J5M1j5k9k9M1L5ll0rK9Nj5k4J7K3J8l9j7J3K0L2k3j6k3N4l5Jn2L4M6om5
$$ plain form
484 147 -113 -274 43 177 -107 -203 -28 239 280 -245 -151 141 253 -43 -168 -211 175 241 -128 -289 74 286
506 286 135 -187 -215 165 292 7 -235 22 146 175 -131 -244 169 369 53 -192 -49 119 187 -44 -161
527 -161 48 175 85 -25 -125 23 120 17 -124 84 74 108 -140 -78 50 28 25 -122 11 -71 63 -42 -130 -101
551 -101 -36 99 -94 32 38 -45 -119 135 165 -48 -5 -149 9 154 -66 33 -13 110 55 20 -86 126 83 -3 -79
576 -79 -220 186 99 -60 -43 80 158 51 -156 -121 4 82 -66 -70 93 75 47 5 -158 -28 93 37 -72 -27 30
601 30 41 14 -95 -24 34 43 -36 -125 -25 4 -1 27 -92 -9 -33 -31 -49 34 -14 13 -2 54 -9 -43 -44 21 -23 -32 12 11 28 37 -6
634 -6 5 -32 -7 -4 -35 -10 2 11 -8 -55 -5 63 39 -41 -26 54 8 -24 -45 45 -106 -21 -55 -18 19 48 -35 -108 -35 -20 57 -6
666 -6 -32 -17 24 9 -20 -49 -8 27 24 -6 -15 14 19 4 -20 -3 20 38 -1 -18 -5 15 47 24 8 -15 39 4 5 -47 -13 33 27 -18
700a8oK4L5j7j1k6PJ6j8QjK7j8Nm3k2O1J0j2l8J4L9Ln1NL1L2l2k1lJ8OK8j5j7
735@oK8K5p2J0L9L7n2j4l8J44q5r4J97j08J7j8J00r2ol7O6L9j52LJ38J5j04K9
764IPO3j14M8oRj6nJ1o2LmM1K0J8J9p8O3lp7O4L9J03k10k7Q1P1j40J26N1j60K5
796c1pKk7L8M4Nm7O9j7L3k8K0m1Rm4j0K1L2Km1J8J3J6j4l7O1l7J8k0rL9j7MJm5
831b7MOL0j4j6J0J0k9J3J7%k7J6J7Lk8j7M4J5m7%M5kk4j8KN1qol0RM4j9j9k1M8
867C2Nk5l3kN8Kpm4NO6m9k3j4P4jm8o9O0N0j2o7k4O5J8l4j5K2L3nm8NJ6L1l1k1
902c0J9K5pk3k3K6N9m0m0K5O1Mm7k9L1N2k7j41J02L8pL3n9m5J51k2j20K5O6j9
932C8m8j0K6L7k1m1j5M6K0m1m1N2O1k9p8lP1L9p6k4M0L2j9q8J3P8J2o7k5N8M6
$$ plain form
700 -18 -24 0 35 18 7 -19 -12 4 -14 -6 -7 20 2 7 -36 -58 3 13 1 -37 -23 16 19 -32 -27 4 36 4 -17 -20 -2 4 32 17 0
735 0 -6 22 47 -25 -15 24 61 9 -5 -43 101 16 -78 119 11 28 10 110 18 12 -25 41 80 -72 -69 69 84 -20 9
764 9 16 79 -35 13 7 16 0 -5 6 -56 -53 -57 -16 4 22 41 -37 26 23 -54 10 49 152 -58 -85 -4 67 -73 53 104 -56 -31
796 -31 -38 -36 -63 -25 19 24 -23 46 29 62 34 54 13 22 -22 -32 -11 21 23 -18 0 13 29 15 -22 39 2 20 0 -9 30 13 17 18 -27
831 -27 -23 -17 13 -1 -17 -7 3 -26 -13 4 4 -23 -7 10 13 -15 -32 12 27 -20 -20 25 23 -1 -19 -17 34 26 20 -10 -1 43 24 5 -16 32
867 32 37 12 -21 -23 35 37 30 -14 -9 57 8 -15 -29 45 44 -4 -73 -13 37 25 -42 -66 -1 17 -17 -32 -10 23 18 -30 -25 -9 22 -9 -30
902 -30 -11 14 7 -16 -39 -13 46 6 -34 -9 52 56 9 -20 11 63 36 -105 -3 35 28 61 2 -43 108 86 -34 -9 57 38
932 38 -10 -20 6 43 22 -19 -34 12 32 -9 -50 2 63 34 -44 -47 24 63 -13 -37 3 35 16 -72 -59 19 31 -36 -61 -3 43
963D3qn8J6J4K9n2m5K0M8M6o4k7M7M5n0l3J4Q4lo3n1O3O6o5p8L2P5j9o0lP7K2
995F2m1m3J7L8Qp7jM6M6n5p6M1N8Nm1m3M0N9l8n6PP7Lq0j6M2O4n4n1L6P1Kp0l7
1029e7N5M0l0l8lP3K2o7o0M8Q2j7r7kO8L7m2n3M4P3k9p5j1P0L2l9p7O2L9op7j9
1061e4J31J5p8j04N5P1nn7l9M7P2p6l0J0Q8l2l3l2N8L8m6n3kQ1qm6qJ8O6l2p2
1092e7L3N6K2q6k6P7J2j1p0J2R6No3m9O7N7n7m8J0O9lo3l4N3O7m1m5j6N9L1p5
1123a8l6L3O2mq2l5Q5L2m7m0mQ7no1j0O5Ll8m1K7N9j3m9pJ5M3k2n1K6Q5j7m7k8
1156c3M8L1l7l6J8N1k2k7k6K8O5n1m3J7M9Kl8k3M8J8k0m3j0M8Mj7o7N0O0m0l7
1187c3lN7Jj5n1K5M1qo8%O9K7o0l5M0L0Kn3NL2K7l8j4J7L4j8l6RK8J7k5m8M8K1
$$ plain form
963 43 35 -23 -7 7 36 -16 -61 -41 7 53 -11 -38 9 54 4 -29 -15 69 66 3 -48 15 81 16 -62 -30 45 26 -34 -37 40 62
995 62 21 -22 -5 33 41 -36 -37 9 55 0 -76 -35 23 28 -13 -56 -16 43 5 -51 -44 33 36 -44 -60 -18 46 -8 -59 -23 48 50 -20 -57
1029 -57 -2 38 8 -30 -33 40 62 -5 -65 -17 65 48 -49 -51 17 54 12 -41 3 76 47 -28 -39 31 63 24 -53 9 48 42 -35 -54
1061 -54 77 92 14 -90 -35 36 31 -26 -65 -18 54 -22 -52 -42 46 14 -19 -51 7 45 -1 -54 -56 25 17 -29 -37 -19 47 15 -57
1092 -57 -24 32 54 -32 -58 19 31 20 -50 -38 58 63 0 -49 18 75 18 -30 -20 49 46 -17 -51 2 69 28 -17 -33 26 57 -18
1123 -18 -54 -21 41 37 -45 -80 5 37 -10 -50 -54 33 28 -33 -43 22 25 -13 -54 -27 32 19 -30 -37 -22 21 -1 -52 -26 59 42 -5 -33
1156 -33 15 46 9 -27 -9 42 20 -7 -33 -5 60 9 -34 -17 32 34 -4 -27 21 39 19 -24 -34 14 18 1 -66 -16 44 4 -33
1187 -33 -36 21 22 7 -44 -19 22 14 -54 -54 15 42 -18 -53 -13 17 19 -34 -29 3 30 -8 -22 -5 29 11 -25 -16 12 29 4 -44 4 25
1221B5lRm8LM8l9j5oM2K6p0ON9o4M1r0O7K3rM3l7N4J5M4j29N9p8P1j01K4O0m1
1253a1N1j17L0N0Kk0j5NJ5J4k4%PL4Pl5K5mrk4J8L5k8j3oK4JKk4J4L2j4k3pK6
1288A8j8j8rJ9L2j9KrjL2om3RJ5KLl1OkJ7pj5K6Mlk7mL3Mj4kOK3l2j0L2j1J0q
1327DLk3M1k0l6L9JPqOj4jqK1j9K9j4j6KrL6prPNPm3K1Qj3J9k7J7oOj0mj3J7N
1367Aj9qJ7K5j7k1K3j6J2pkL6k7Mk8J4J9k0J5J8k1PoK5j9%J5j7J0k1J2kNlj0K4
1403A8j9L0j6K3k5oJ1J1kpl7J4jn%K2Mk0jNNQk4J0Kk1L2j5J4m1M5m3K5m4L6o0
1439g2J17K4o8k2n3L2J4J08NL5p3o1N7j18M0J5J4m6MJ1M7Rk7j7J0M4k9K2j4L5
1469D3o4P8o0k0L1j2J3J6r6R6k9kj4N9O4r4k4M1p7J01m2L4o6Oj8Q2o7M4k7k2L3
$$ plain form
1221 25 22 31 -17 -14 34 -5 -20 -26 16 42 -28 -22 37 -27 14 -76 -9 14 5 48 11 65 80 124 -5 54 -24 47 -54 -30 30 -11
1253 -11 40 -77 -47 3 5 -15 -30 -25 -10 4 -20 -20 -13 21 28 -7 18 14 5 -19 -1 34 6 -7 -13 11 12 14 -10 4 36 22 -1 -8 18
1288 18 0 -18 -27 -8 24 5 7 -2 -3 29 23 -20 -11 4 6 9 -22 -16 -18 -1 -8 -23 3 7 4 -23 -27 6 10 -4 -6 0 23 -9 -19 13 2 12 4
1327 4 7 -16 25 5 -31 8 9 16 8 14 0 -1 -9 12 -7 22 8 -8 -6 -15 21 14 5 12 17 24 -19 2 10 -3 16 -11 6 0 6 -4 -8 -21 -4 1
1367 1 -18 -26 -9 16 -1 -22 1 -15 -3 -10 -12 24 -3 1 -27 -13 6 -14 1 19 -2 5 -1 24 5 5 20 3 13 -8 4 2 7 4 -6 18
1403 18 -1 29 13 36 11 5 16 27 25 18 -19 -5 -6 -11 -11 11 15 -5 -6 -1 4 12 -12 -2 0 -21 11 -4 10 -31 14 -29 -4 -48 -12 -72
1439 -72 45 69 1 -21 -74 -42 -28 80 85 120 47 -14 43 -75 -35 -20 -6 -52 -48 -37 10 19 -8 -25 -15 29 0 22 8 43
1469 43 -21 57 -3 -23 8 -4 9 25 -71 25 -4 -6 -20 39 103 9 -15 26 -51 50 8 42 -24 -18 -36 46 -21 23 -4 -26 7
1500GP2k26m3K29j42J38m5J2k5M6j3K8o0K5Rlnj0L8Kj3k9qM3k6RoL0j3qm2kP0
1533C9k2l3mJ5J4j2l8K0L2k3oRj4K9Lm8NL8kl0l1M5L2l1k3LM5J7l6j7K1JK1mk0
1568epM1l6o2N8J30n6q1P7j26P6qk0K0L5jm7k3O9J6m9l1L2L3km7jJ6L0l1m2K5
1600a7K8Qk7n1N7M5m0o8K3Q2Rq1k5O3L7l4o1M3N8j4m0l6N7M3l1q5K3P0Km1k5L6
1632HM5k5p6J6O6J8o0n5M5J01o0n1mP1L3o0o5N0O8n2n7K9J5J18j21k0j6J39r2
1661Hn5N9jpr1J1P2ok8p8p7J64J17j26J5L2M9o9o1qL8J09P4r5kO4r9l8oJ67m9
1692H3m6j12N2L3L7m5n9P7R1n7j45N1J02L2j17o0P5J09o3j24M4J09K0j18p4Q5
1718b0J14n3j23kJ39M5j36o7P1J38m5j69K0J34M1j20r3J12J17m5j21m7J28Q1q0
$$ plain form
1500 7 79 -147 -190 39 -103 35 -10 2 -23 23 10 38 -22 3 12 9 4 -6 32 34 21 -8 -16 27 1 10 4 34 21 13 -29 -31 39
1533 39 17 -16 -20 -5 9 -3 -41 -21 11 -12 -18 -9 -23 6 9 -39 -34 4 2 -28 -59 -14 18 -13 -36 -33 12 29 -7 -24 -3 -2 19 15 -5
1568 -5 -12 29 -7 -69 -11 119 63 -18 59 -67 9 1 -19 1 36 35 -12 -35 34 50 1 -30 2 35 33 -14 -15 1 31 0 -42 -17
1600 -17 11 19 -8 -59 -2 43 3 -65 -42 40 49 -32 -57 6 43 9 -52 -9 49 35 -5 -41 16 59 28 -57 -34 36 38 -3 -28 8
1632 8 53 28 -48 -32 34 52 -8 -63 -18 83 23 -28 -32 39 72 12 -53 -3 65 13 -44 -15 0 118 -3 -23 -39 100 8
1661 8 -47 12 11 4 -87 -76 -4 -10 -38 -116 -193 -29 88 -38 -23 9 58 -11 -72 -80 -42 67 141 46 44 108 9 -29 -35 132 83
1692 83 37 -75 -23 10 47 2 -57 20 111 54 -91 -40 62 94 -23 -83 -8 101 38 -86 -42 67 87 -31 -105 -20
1718 -20 94 41 -82 -84 55 100 -36 -103 -32 106 61 -108 -88 46 87 -33 -126 -14 103 58 -63 -110 18 99 19
1743A9j08pJ94mj31q7J97L8q4j43Q2J56N6k66J5J17N6j36n5Q0K00m4k89J03J10
1768F9Q4j38j95O9J80Pr2p1L8K60j47j22p2J42k7l1K6l6N2j3q9p1L42n6j73l3
1794i7M4K46j29k48O4J73Q3k23o1J63K01j42j65j15K89L5j85jO5K69l79o8J36
1817d5M8J63j80j05R6P2Q8k80l7K74N0p6j88P7J79l1k49R6M6J28p9k45J48K01
1841A51r5j75j1J68J15j10k34J29K16Mk07j19K43J02j84j70J12J14K8k55k2K36
1863C6J65j83j76m7L08Oj14j73J85J82j37k34R8K72J6k06j77P1L02j51j57jK47
1886A32qk09j07K58R2j71k9l3J24Q7r0k04R6J75m0k25nK16R3k11j16J57J64m7
1910I9k35KK06J19k22j68J52K24j59j26LJ77R0k22j61K08J83q8k00J2K19M7j57
$$ plain form
1743 19 -89 -96 98 94 -37 -124 73 111 27 -116 -34 122 178 -88 -73 44 100 -36 -91 -11 189 145 -144 -41 69
1768 69 153 15 -180 -111 69 76 -16 -87 -49 211 64 -58 -130 12 -15 -46 -20 -56 -4 -17 -106 -177 165 109 -64 -97
1794 -97 -53 193 64 -184 -120 53 136 -87 -148 15 216 74 -91 -206 83 118 -67 -68 -3 266 -113 -181 -45
1817 -45 3 166 -14 -119 -23 49 137 -143 -180 94 144 68 -120 -43 136 105 -144 -48 -2 126 47 -198 -50 151
1841 151 56 -119 -130 38 153 43 -191 -62 154 158 -49 -168 75 177 -7 -177 -65 49 77 -178 -200 36
1863 36 201 18 -158 -205 103 109 -5 -178 7 189 52 -182 -84 188 204 -2 -179 -108 194 43 -114 -115 132
1886 132 124 -85 -192 66 158 -13 -42 -75 49 136 46 -158 -62 113 73 -152 -157 59 152 -59 -175 -18 146 99
1910 99 -136 -134 72 191 -31 -199 -47 177 18 -108 -105 72 162 -60 -221 -13 170 82 -118 -106 113 160 3
1933Ck25J45J61L2j02j28J09K28r6l07R9J79k7j78p8J95K08k05k25J15K24J3k45
1956a05q2J89J89j78k14Q1K50J1k30r8J82J85j27k28M1K31P2k91l0J92J10j06
1978D4j93P4J00R2j76j60J68K46o7k36j40L45J10l01j70K49K05j50j48m1K62P0
2000A83j92j95J56K25l8k93RK22J14k02j92J43K42n3k45p0K53J32k16j70J15K12
2022A40l3k38o7K45J35j71k12J00K67l7k49q2K41J40j46k29Q5K69Jk60j04K28
2044B3K00j71k30N9K67O8k74j13J97J80j09k42J2L01l1j41j16J29J94j16k14K4
2066a03J78j0j00j52J94J79q8k54J1K21R4k27j35J49K30j04k29j3K74Q4k26j85
2088b12J35K46o3k52j7K48R0k29j35J06K34m2k19p6L01R6j69k41J74J88L5l30
$$ plain form
1933 3 -222 -77 84 116 14 -114 -5 223 127 -180 -81 98 71 -107 -185 10 218 13 -212 -97 127 140 -105
1956 -105 -187 2 191 13 -201 -120 130 141 -89 -187 -5 180 53 -175 -134 97 169 -122 -152 40 150 44
1978 44 -149 -75 25 117 -59 -219 -51 195 128 -108 -248 97 207 -94 -264 -15 190 40 -108 -149 113 183
2000 183 -9 -204 -48 177 139 -154 -145 77 191 -11 -203 -60 182 129 -116 -186 67 199 -17 -187 -72 140
2022 140 107 -131 -198 47 182 11 -201 -101 166 129 -120 -202 39 179 33 -196 -111 158 159 -101 -205 23
2044 23 223 52 -178 -119 148 216 -58 -171 26 206 97 -145 -133 168 137 -4 -120 9 203 87 -127 -103
2066 -103 75 65 -35 -187 7 186 98 -156 -145 76 170 -57 -192 -43 187 83 -146 -159 115 199 -27 -212
2088 -212 -77 169 106 -146 -163 85 175 -54 -189 -83 151 109 -110 -186 115 211 42 -199 -25 163 198 -132
2110a32J6J49J34j12k18R0K38k1k27j03J92J60j72j93R0K66Mj63j10L9L40j66
2132A01l11P8K16O3k29q9K16P6q5k63J38K28k4j37k30L05J47j34j85KK64rk68
2155a30J1J45J14q7j75m9K87Mj85j39K10K79j54k48kK05Q6j96j24J12K01o5k45
2178a45J9K05Q4j83j17R9J97n0k34j0J92J06j63j77J21J95n2j74n9J91J03j30
2200A8j88J10J94k9j96q2K09J34j72j67Q8J84kj82n4J84J06r5j96L8K18Mk19l8
2224a33J31K12j42j51Q8J13%k20m0J10K15m0k46K3K09l3k36J5J54O0k2l04J41
2247i6J70J12k89M9O3J88j89j10J81jn5k08p2J28K57J48k83p9J81j0r9Ok2K00
2271A70j89l4r2J85jr6r8J15K8J88k48N5L8J27r5k42J63P5N3k39L1L13j07o6k21
$$ plain form
2110 -132 -116 33 167 55 -163 -73 165 144 -83 -186 6 166 -6 -199 -109 157 161 -2 -112 -73 267 101
2132 101 -210 -132 84 147 -82 -171 45 121 36 -227 -89 139 115 -22 -252 53 200 66 -119 -117 147 138 -130
2155 -130 -119 26 140 53 -122 -171 116 120 -65 -204 6 285 131 -117 -119 86 172 -24 -148 -36 165 100 -145
2178 -145 -126 79 163 -20 -137 -38 159 109 -125 -135 57 163 0 -177 -56 139 87 -87 -146 45 148 18
2200 18 -170 -60 134 105 -91 -173 36 170 -2 -169 -81 103 101 -81 -135 49 155 60 -136 -98 120 124 -95 -133
2224 -133 -2 210 68 -83 5 118 118 -102 -142 -32 183 143 -103 -80 129 96 -140 -125 29 89 67 -237 -96
2247 -96 74 186 -103 -54 9 197 8 -102 79 78 23 -185 -257 -129 128 276 -7 -86 95 85 -14 -8 -30 170
2271 170 -19 -53 -145 40 39 -57 -155 -40 -12 176 -72 -17 21 148 53 -189 -26 49 102 -137 -106 207 100 34 -187
2296a87P8K29p3k11N3lJ89Mj87J06J47p6j33m8J06J19j32m9l4J64N0j73k6J65
2320G8M6j08j16oJ83j0q5j15J47P4j26j61K94j72j6O8j69J92Q3N9k47K4J55M7
2344A19j64j16J42J00m2r0k0J24N7q9j32M3J33O1j71n3J46r9O6r6OJ86n3p3p8
2369i3J62k3k9j57K03j8lj30r6K32Q7q1j19O4P5L6j70Q0K9Rn2n7k1Q7K3j30NJ00
2397A3M6l2o8L6Q6k5n2n3N5P3k0j21L5Q2K3o5n0N3N9l9q4LR4L6r8o6P9N2k1r1
2427f0J8P2J5n5n0M3O9j5p7J1N7On5l3J4Q8m5l2l6J09M7j23p2L0O5nNm1R6M3o2
2458B7n5kO6K8m8m1M4j2M3j36Q3M8k6n8kJ47j12k7J5mP9N8j84N7N4rn9J43j01
2487A6o7J69k17J03k4Q1n7l5m5O9J9k0n4PM0Ok2j9N9pJ1ML2m2L9l0k1QpJ5n1O5
$$ plain form
2296 -187 -109 120 47 -164 -111 -114 75 79 -108 -2 145 69 -64 -112 -6 113 -19 -68 -102 62 112 -61 -87 78
2320 78 124 16 -100 -106 77 67 -18 -133 14 88 -38 -199 95 -77 -93 -25 -194 -2 81 140 -107 -83 72 119
2344 119 -45 -161 -19 81 39 -51 -71 53 110 21 -111 -68 65 126 -45 -98 48 -51 15 -81 -75 111 58 -15 -93
2369 -93 69 46 17 -140 63 45 42 -88 -184 48 135 54 -65 -1 74 110 -60 20 49 58 6 -51 -72 15 38 -92 -87 13
2397 13 59 27 -41 -5 81 56 4 -49 6 79 59 -62 -27 55 78 13 -37 16 75 36 -48 -45 49 85 -13 -79 0 52 31 -60
2427 -60 -42 30 45 -10 -60 -17 52 37 -40 -29 28 34 -21 -54 -40 48 3 -29 -65 44 91 -32 -104 -74 -9 -14 -9 -50 46 89 27
2458 27 -28 -30 36 64 16 -25 19 7 50 -86 -3 45 19 -39 -41 106 -6 -33 -18 -22 57 115 -69 -12 42 33 -26 117 16
2487 16 -51 118 -99 4 -20 61 4 -31 -76 -7 12 -8 -62 -55 -15 -9 -31 -50 9 2 13 17 49 7 46 16 -5 3 -4 11 -40 25
2519B5Lk9K6k9j6P1j5j5j2p5J84j27l9P0l1O0j69R2J14r4%m7L6j0M6j29L2lQ5
2548Dk4pO0M9j46N9j5Ml6oj09K93k35Q7l5J1K3L6O9j63L6J70j10j9O7nj37K2O7
2577A0P0l5m2j28J14J27l2K2qj00L8m4J0J0j03J10N2q7O0k9N1k7k7K4k5k1l9O0
2605A1jj9O5k2r1J15p9O6o5kJ0N0j44K6L9Q2m1k4j5J7m0N1L8p7R1M1m1J18j39
2634B0o1O0n9RoJ33j65J32l4j9JM9m0j1r4J40l5J4l1Pk0M6j5m0K0M1J7m1j8J1
2664A1J9m2K8l3K2lok7L6Jpj0K3j6onMJ4l4J4J5kK1j3j8K1l2K3J4j8j0OLJ6J1
2699B0lj2J9m7M1qQj8J2pj1L8j7J9j2rn4M1J3j11J89j19km7J00j08M7k8o0lK42
2730A13q0L3O7j73K8l8J21j50Q3O4o1r8J33r1L8k4O1k5Mj7J6mqkJ6qj4QKJ1rK
$$ plain form
2519 25 28 -1 25 -4 -20 51 36 21 9 -66 118 -9 -48 22 -9 51 -118 -26 88 -6 -6 -53 -17 -27 19 -110 -78 -81 4
2548 4 -20 -27 33 82 -64 -5 -20 -16 -52 -58 -167 126 -109 -22 -57 -46 -23 13 82 -81 -45 125 15 -4 63 58 -79 -57 10
2577 10 80 45 3 -125 -11 116 84 106 98 -2 36 -8 2 12 -91 19 71 -16 44 15 66 39 12 36 11 -10 -49 11
2605 11 10 -9 56 34 -57 58 -21 45 -20 -22 -12 38 -106 -80 -41 41 0 -24 -39 -22 -62 -11 27 -50 41 82 41 159 20
2634 20 -41 19 -40 -31 -37 96 -69 63 29 10 11 60 20 9 -85 55 20 34 3 10 -10 36 21 -19 1 42 59 18 0 11
2664 11 30 -12 16 -17 5 2 -4 -31 5 6 -1 -11 12 -4 -10 -15 -11 3 -31 -17 -2 -4 17 4 -14 7 -25 -2 12 -6 -16 -10 -7 9 20
2699 20 17 5 24 -23 18 10 18 0 12 5 -6 32 15 34 22 13 -41 0 13 -98 91 -28 -30 -77 23 -85 -38 -66 -126 -129 113
2730 113 33 66 133 -40 -12 -50 71 -79 4 68 7 -91 42 -49 -11 -35 26 1 5 -12 4 0 -8 -10 6 -2 -16 -8 -6 5 -4 -2
2762bjLJ8k9J0JpqK6j0Lkj5J8j6K6k3KjkQrJ4k3J1lnNK4l0J7k2NrJ9j7RK%J5l2
2803c0K8Qj6pJ0j0J3M2l1N3l1j17N0Q2l1j07Q0ql5L6OJ05oj49J44p2L3o8M8Rj26
2834i7J18Nq1Q3pj07M6KN9j04n8J16j25j4M01l77p2l1K00j41K28P6j33J14Lj18
2860a4J06j12l6K4M2o2J13l4Pj09M4N5nj6n6Q2o5K6o1J30q5O7j11R7j23J01p3
2887f8M7J92j61J6R7k17%J54m5K1QK5n7n4M4j16J08m4M3j5Q9q3L7l0n0O5j3q5
2915i2O4Q1k9N1j09J6M7l8K2nM1l6l2K5r2O6K7j0nL9k1Jk4J1K7l2J3qK3%Jl5j7
2948c0L9k1J7mJ3J2m0L0j4pJ2Lk8jKj5M5j9j3J8jk8J5RRk7lMJ5j0j8K8J7J1k2
2983bj3J8J5j6qQoJ6j5pK4K4k3kl1JK0nMJNMPpj2NMj1J5k6L0jj7J8Ml5mJ3J8l
$$ plain form
2762 -2 -3 0 18 -11 -1 0 -7 -15 11 1 4 2 -13 5 -11 15 -8 -6 -7 -9 -1 -10 4 -19 -8 -11 -16 -11 13 -17 0 -22 -17 -26 -7 -24 -15 -13 -13 2 -30
2803 -30 -2 6 -10 -17 -7 -17 -4 38 7 60 29 -88 -38 44 13 -94 -14 -22 -57 -21 -15 90 84 -65 79 7 40 -28 20 29 -97
2834 -97 21 26 -55 28 21 -86 -40 -38 21 -83 -141 -25 -150 -164 237 -140 -212 -243 -43 -184 44 120 -13 101 104 -14
2860 -14 92 -20 -56 -32 10 -52 61 27 34 -75 -31 24 19 3 -53 29 -36 -10 -71 59 -26 41 -70 27 -96 5 -68
2887 -68 -21 171 10 26 123 -94 -94 60 15 36 44 69 12 -42 2 -114 -6 -50 -7 -22 67 -16 21 -9 -59 6 -7 -92
2915 -92 -28 53 24 75 -34 -18 29 -9 13 8 49 13 -19 6 -86 -20 7 -3 -8 31 10 11 -13 -2 25 -7 6 -2 21 21 22 -13 -30
2948 -30 9 -12 5 1 14 26 -14 16 2 -5 7 10 -18 -19 -17 -32 13 -6 -19 -1 -2 -30 -15 -6 3 -24 -27 -23 -8 -18 -36 -8 9 20 -2
2983 -2 -15 3 18 2 -6 2 -4 12 -3 -10 14 38 15 13 -18 -17 3 -2 2 3 8 12 19 12 0 5 9 -2 13 -13 17 16 -1 17 21 -14 -18 -5 13 10
3023A0QK2p6N6m5qKK0L1j3o0O5K2n2K4rP0l3n1k5M5L9n1K3k8K8N5r3l0J18p3J02
3055I3m3m0noO0o9m6J14qNk7o7J85k20Q1J9n8O5pn8P8J3ok7qM8o3Pj5l1O4q9R1
3088C0j7l1L0j6j5J0J0Lk7K0J1jk0J2k4LPmO3o3Q4j1n0k3M8n3P6nk9kkk1nO2o9
3123a9Kk6N5k3M4O1p8p1K7L8k5P3j09J12o7q0P5n0P5j3j3o4M0M7l5P0m8J7o3O2
3153A4j6Nk7J6J2K3m6k7Q8k8L7l9jk0O9k8n1N3l5j8M7N5r8l8P8j46L7J38J3l9
3183B8Qo6O3mr4J47p8j07K67j90K4J12j30j10Q2Q8j8j3n3pN5K4p1O2j5Qm0L3J3
3212A8Kl1j6K5Mj3J4J1k8J6qnK5Mj9J6JnooMj9K7Oqpj1mL2k0K4j9Rl9K1J6K4j4
3250B1l8J5J7j2J5k4K3l5J2jl5N9M1m7r6J43m5L7o1j0J0k8qJ27r6Rn7J74j39L3
$$ plain form
3023 10 18 40 -36 20 -25 -33 -31 -11 20 7 -53 12 34 -18 6 -3 67 34 -17 -42 3 42 -9 14 -14 14 69 -24 -54 64 -9 93
3055 93 50 10 5 -1 59 -10 -56 58 50 55 28 -39 146 -74 7 26 -32 33 26 -32 46 59 53 26 18 66 3 10 -5 -36 28 -61 30
3088 30 13 -18 12 -4 -19 -9 1 4 -23 -3 8 7 -13 -1 -25 -22 -15 -19 44 -19 65 54 4 -19 29 -24 52 47 18 16 14 -7 -12 50 -19
3123 -19 -17 -43 12 -11 33 94 16 -55 -28 10 -15 58 -51 61 -6 -86 -11 -61 14 1 -12 -76 -36 11 -24 46 -2 15 -48 14
3153 14 -2 3 -24 -8 4 27 -19 -46 42 14 51 12 11 -9 60 32 -19 34 -1 -19 28 83 -15 -53 25 -121 -84 54 67 28
3183 28 36 -30 33 29 -65 82 4 -103 164 -26 -2 110 -20 -130 -48 40 22 9 -44 -51 4 28 -43 19 4 12 -28 5 18
3212 18 20 -11 -27 -2 2 -11 3 14 -14 2 -6 -11 14 18 -1 15 16 11 5 -1 3 -16 11 17 9 2 -9 -13 19 -1 23 4 13 -26 -5 11 35 21
3250 21 -17 -2 15 3 18 -6 17 -18 -6 -7 -42 17 58 11 -85 58 13 50 -11 -21 -11 -39 -47 80 -16 -7 -64 110 -29 4
3280Dq1O8O8j5l0q2O2J16k12K07n6o2M9k1L8M8o6k7R3j35n0J05N4k3p0k6J35j46
3308e5J01j02J35r5n7P1L8%l4Q3o5P6j43L0R6j00p8R4k9M4mjnl0kQ1o1%nmJ9n
3340gj2NK5L0j8j7j3kRL0k6okL5l6kQK1j5JkJ5k0llrL5l3J3qj1K5J2k1qL4k4N
3378Ej9jJ0j6J4qJj4NPOJ8j3j6J4Pnj7JMPqOjJ3j3J3oJ6Mkp%nK0j0Nj4K6kj7O
3420A4j0J8k6QJ1kqJ3j1j4J7j2J7oj3LNJj8J8l1K5J0k1pqL1kJ5j0oj3J4orj6K9
3457@pOnKJ0Qk1RLk3RJ2KlqJ6lRRk2JK2j6kRk1J6N%j1K1j9jnRj3PJ1j9RMoNnj7
3502a3j7K0Lj0Oj4L1k6K3Oj2oJ7lJ4j4j8J3NK1k7J7Qk3J6qmJ2j2rK8j9Pj0J1j8
3538eK5j8Oj1K0kl0J1J6j8Pl0O8n1l5P7kpnp9K0L6O6j4r9Q1qNn2J6J3j6j5L3j1
$$ plain form
3280 4 -77 -9 59 44 14 -68 -6 110 -102 105 49 -13 36 15 53 101 35 8 101 -34 -84 21 75 52 -18 -44 91 -55
3308 -55 46 -56 79 -16 -73 -2 36 36 2 85 20 96 -47 -17 79 -21 -99 -5 -34 10 6 5 0 -30 -32 49 -12 -12 -17 -21 -2 -7
3340 -7 -19 -14 11 41 23 6 -7 -9 0 30 4 -2 -4 31 -5 -7 1 22 7 8 6 21 1 -2 -5 -14 21 -12 1 -7 -18 7 19 -2 -10 24 0 5
3378 5 -14 -15 -5 -21 -7 -15 -14 -28 -23 -16 -10 8 -5 -21 -7 0 -5 -22 -21 -17 -10 -18 -12 -13 0 -13 0 -6 10 14 12 5 5 0 20 10 15 1 27 25 8 14
3420 14 4 22 -4 4 15 13 5 18 7 -7 10 -2 15 9 -4 -1 4 5 -13 5 -26 -1 9 -12 -19 -27 4 2 17 7 1 -12 2 -4 -13 -29 0
3457 0 -7 -1 -6 -4 6 14 -7 2 5 -18 -9 3 5 2 -6 10 7 16 25 3 4 26 10 8 17 -4 12 17 17 6 27 8 7 2 11 -2 5 16 -3 6 10 4 9 4 -13
3502 -13 -30 -10 -7 -17 -11 -25 6 -20 3 9 -3 -9 8 5 19 5 -13 0 5 26 -1 16 24 1 17 9 5 17 5 -4 24 5 12 2 13 -5
3538 -5 20 2 8 -3 17 15 -15 -4 12 -6 1 -29 39 -12 -47 30 28 21 16 -63 -43 -7 59 45 -54 27 19 24 -28 -12 1 -15 -30 3 -8
3573hjOrLJ5j7qJ1J0J4j2j1L2l4J9OmPnJ2j2LqjoJ3OJ1k2qOj2J0Rpk7K1J5nl6
3613b4K1J4l2J7k8L8J2l7j1OM0J1n8L7qk8N0rn0K3J6j3pl3j44K04j05J11J2m3
3643a8K3n7P8L1rK4n4m1N1j9l1P5j3nJ7J0n3JrJ2nJ6k3L8m3j2J16o1p7R6o9L5
3675B4Kl3J7j0j26N2j8Q8L2J6Mn1L7j23R5l2QN4j01Q0mj0Pk5PM5j0l8qK7J5l1
3707a0MKK6%k1mOK4j5j2J1J5nql1PJ9Nk5J8Qj8Kj3K8Jrl0J7OQj6m0L4K9j1m6J3
3745c1L2K4p2L4j0O0m7lN6k4j1j05J46o4o9J38j11JJ25m0o0l1Q2Qmj9K5m0K4p3
3775e9M7P2r5O1o4O0K4Mo9KK4Ol8j23J21L8K2o9N0l6N1ql0k1M5Pm4k6K5L0J7m8
3807b4%QL7k6l1mN9Pm5jJ9J4k0o9P6K4j6l2J1L5K0pn9L0K5k1lk4K0M3k7l9J1L4
$$ plain form
3573 -8 -9 -3 -12 -9 6 -11 -19 -8 2 16 4 -7 25 -9 10 16 12 19 14 26 14 17 9 8 2 15 21 32 10 2 8 -4 6 15 8 -19 2 17 12 -24
3613 -24 -3 11 -21 -4 -32 6 18 -19 -30 -24 16 27 -31 6 -2 -30 20 11 -39 -16 0 -13 -20 -53 -197 7 -98 13 25 -18
3643 -18 5 -52 26 57 48 72 18 -23 28 9 -22 53 40 35 52 62 9 10 1 13 8 24 1 39 -4 -16 100 39 -38 58 -11 24
3675 24 26 -7 10 0 -126 -74 -92 -4 28 44 48 -3 34 -89 6 -26 -18 36 -65 15 11 1 8 -17 -10 35 25 -13 -21 6 21 -10
3707 -10 -6 -4 22 22 1 -3 3 27 12 0 11 26 21 13 -18 -11 8 13 -12 6 14 -4 -2 -15 13 14 5 -25 -8 -2 6 -10 -50 -16 13 2 -44 -31
3745 -31 1 25 -47 -13 -23 37 -10 -13 43 19 8 -97 49 -15 -84 54 -57 -56 69 29 -31 -62 20 28 24 5 30 -10 14 -59
3775 -59 -12 60 -35 26 -38 22 46 50 -19 -17 7 13 -25 -148 -27 11 33 -36 14 -22 29 21 -9 -30 15 22 -22 -48 -23 7 24 -24
3807 -24 -24 -16 21 -5 -36 -40 19 26 -19 -20 -1 13 -7 -76 0 24 8 -24 -13 22 42 35 -24 6 31 10 7 -17 3 46 19 -20 -9 25
3841B5J2n8j6N5on3L0L5M7n2M4Mk6K9j11M6r2J20k4Pr3L8P8l6n5L2J6L1m5k4J7
3872b5O0j6o1J2O7J8m5m8M3J8Ll3l1P6j9k5l5M0M1j4k6k6N8mk8k3K3K3jj3l4L5
3904A0K8k1l6pO7k3l6k7M6L0j6n7K5M9l0l1j8L9K3j6m2J1M2Ll0j5K6M0j3n9J9
3935a9L6kj2m4N1L1mo1J7N6qjm5K5J7l2p4M8N8j3m0j5M0OK0K1j6o8R8q3j0j3R4
3968E8k9r4N7R1k22J70o5M2P8j31K0p5R5L7m1k1J0N1o9JO3k1O1p9J6j1L6ln7k5
3998e7M1M4qo6L2M8rm2PL2M3o1k0K1M5J6p2kJ3K4k4k9mP3%m6k8M0K8m0k3MM9J0
4032C9o2l2M3M0lp6J0M0K6m2j6J8K4j0m0jO8Ol2n9P0K4l5n0K8M3J3l9j3oN4Po7
4065c0K1L2K0k0m4J2O7l4m3j0L2K8k2l3ON9ln5j6L8K5l0k8qP0l1l3k4O1K6m4n0
$$ plain form
3841 25 37 -21 -37 18 12 -41 -11 24 71 19 63 67 41 70 -41 5 -87 33 9 16 -77 -39 39 3 -52 -20 -4 27 -18 -42 -25
3872 -25 35 19 -42 -30 37 55 10 -38 5 23 26 -7 -38 38 19 -6 -41 -1 40 26 0 -26 32 28 0 -23 0 23 22 9 -25 10
3904 10 38 17 -19 -26 41 18 -18 -45 1 31 15 -42 -17 32 2 -29 -47 -8 15 -1 -43 -32 10 13 -17 -32 -6 34 21 -38 -19
3935 -19 17 15 3 -41 10 41 37 -24 -7 49 41 40 -5 20 37 5 -69 -21 37 24 -16 -31 9 15 35 56 40 -28 70 -13 -23 -36 58
3968 58 29 -65 -8 83 -139 31 -34 8 86 -45 -25 -100 -5 32 -9 -30 -20 31 -38 -37 26 5 66 -13 3 -8 28 25 -32 -57
3998 -57 -16 28 20 -46 -14 34 25 -17 -10 22 65 4 -16 5 50 66 -6 -8 5 29 5 -24 -28 45 45 -1 -29 11 39 -1 -24 -20 29 39
4032 39 -23 -55 -12 28 25 -51 -41 -1 25 -17 -33 -15 9 -1 -41 -42 26 32 0 -59 11 35 0 -50 -22 21 34 -5 -18 -24 30 37 -30
4065 -30 -9 23 43 23 -21 -9 58 24 -19 -29 3 31 9 -24 -18 41 38 -17 -33 5 30 0 -28 -36 34 3 -30 -54 7 33 -11 -61
4097f1K0N7km8k7N7J7kn3K4N8j9n3k8N6N9n2m3RP6pn8j06O5m0J16m5l8K5P4L5
4128F6j29L9M5L0j28n3J84M7j39K5l7P2m3M2j4J01j17k9J2m9K0qjpJ38j16M7k
4156dL6j8J55j11j27PQ7J7pp4R1j9j01R1j22J17L7j40K0l4J03Rq%M4o9lJ8J18
4185A13p1l0o9M9N4j4q2N2J2K7l7k9P2k3Qm7J7L3rm2j1O8oj9n5J8M9j3m7k1L5
4216a8L9j6n1QN7Rm2j2K3J8k4n3M7L4J4o6J4QL5j0l3j9O0K3m0j0RK9k0l4J0L6
4248B5K3k9k8KM2Nm6nK3J5j7l5J2M5Kn6PK5Nql9J9N3k7k9j8L9J2o1mJ4M9j4k5
4282b4k9M9K9k9j9K3j8L2k7j2K0K3qk0j0L7Ll1k7L8L3rk8rL6J3rk7QL3k4l5J8
4315@J2L6m4l8M2L3k8k1k3M3J3k7j6NM2k1mk0J7K0k9kj5M7k8k7J3MJ1j6nJ7K5
$$ plain form
4097 -61 -41 16 14 -34 -61 -4 13 11 -42 -18 40 21 -32 -60 -4 55 3 -40 -31 45 38 -20 -126 -61 -101 15 -30 -68 -43 31 66
4128 66 -63 -24 21 51 -77 -130 54 101 -38 -13 -50 22 -21 21 7 108 -9 -38 -26 -75 -55 -63 -64 -71 67 -49 -2 -4
4156 -4 32 14 169 58 -69 -62 25 42 35 -39 52 33 -68 23 -99 18 55 -85 -65 -99 4 13 5 5 49 -20 -23 -5 113
4185 113 42 12 -57 -8 46 32 -50 2 14 41 4 -25 47 24 32 -15 2 35 26 -16 -27 41 35 16 -39 -21 28 15 -32 -53 -18
4216 -18 21 5 -46 -38 19 28 -14 -26 -3 15 -9 -62 -15 19 33 -33 -19 -11 24 14 -19 -38 22 45 5 -5 4 33 13 -21 -11 25
4248 25 48 19 -9 -7 35 40 -6 -11 12 27 10 -25 -13 32 34 -22 -15 10 15 7 -32 -13 40 13 -16 -34 5 17 -44 -48 -34 15 1 -24
4282 -24 -53 -4 25 -4 -23 0 -18 14 -13 -25 -5 18 10 -10 -20 17 20 -11 -38 0 33 24 -4 -13 23 36 27 0 8 41 17 -18 0
4315 0 12 48 4 -34 8 41 13 -8 -31 12 25 -2 -18 -13 29 8 4 -16 1 21 -8 -10 -25 22 -6 -33 -20 -16 -5 -21 -26 -9 16
4348A6k3j2j4M0m%kkJ5l%j2J6J6j3o4N2P8q7J5ml4J3l7J25K3j78J87j50jO2Q6
4380A04p3q1J0J09l4j20KJ07m0Rj3j8L3j0Qj9L0j3L3nm2M6r4P9j7l1Q2l2l9j9
4410d8L0J34j19l4P4k8oJ3Ok8J2J6l4J1%K6l6M6lr3K7J10o9K9J5J5k3j21R0P8
4440I0j17j3Q6rj03q3N6L5n0J67l0k3o2j4J41r5M6o8N6k6JL8m4J5o3M6N3m5Lm
4470a6Q8l5n1K7J4k1m5J08k6j11J9k0j9J39n2l3M1L8m9J2O7lJ4n0j05pJ5J11o
4499D4m0J12j16N0J6j6q0O3j25O9P6k3j35J28j4J00l5L5m8j7l8J9m8L6M0j30J46
4526F9m5Mm2k9o8R6%PK9j2m5N4n1P4l8l1R0pq2l6O8KJ8l3K9k5No4P4nK8n8K4j1
4560a1M3p8nJ7J9Pm1L0l2JJ8M0l3OM4k9j1mmK3L4p7L0lQjk5J1M5l0nKj0L3pL1
$$ plain form
4348 16 -7 -19 -33 7 3 3 1 -1 14 11 11 -1 15 31 18 -46 6 84 -3 12 8 -26 -13 -50 75 98 -80 107 -43 -44 18 104
4380 104 31 -50 -40 69 35 -85 -83 24 -16 -7 -20 -38 -5 -15 -7 -26 4 -9 24 19 -23 23 -71 8 -9 -40 42 10 -29 -48
4410 -48 -18 116 -3 -37 37 9 3 16 22 -6 6 22 -12 -1 -1 25 -11 35 32 -61 -34 76 7 36 51 66 43 -78 12 90
4440 90 -27 -40 46 37 -66 -149 -93 -58 -108 59 29 6 -56 -70 71 -24 22 -46 10 -16 -15 23 -21 -6 -69 -23 30 -15 -12 -16
4470 -16 72 37 -14 13 27 6 -39 69 43 -68 -49 -69 -88 51 -1 -34 7 45 -4 8 75 72 86 36 -69 -76 -61 50 44
4499 44 4 116 0 50 66 50 -30 33 -92 -23 53 30 -105 23 9 109 74 109 61 44 6 25 -23 13 53 -77 69
4526 69 24 28 -14 -43 -111 -15 -15 -8 21 9 -36 18 -33 41 3 -28 62 55 -27 -63 5 7 25 -8 21 -4 1 -63 11 6 34 -24 0 -11
4560 -11 32 -46 -51 -34 -15 -8 -49 -19 -51 -50 -32 8 -25 -19 25 -4 -15 -19 -23 0 34 -43 -13 -16 -8 -9 -34 -23 22 -8 -13 -11 -21 12 5 36
4596C6j7J4p9P4Jj9m3N4p6N0M3q6N3j9M4j5n1J29q1RL1p1MnR8o9J7k7J1k5l2J8
4628b9M6j02N7l3P1K8o5l0KJ8K11k22J0Jj03K15Jj45rQ6N2m6N9j20R3Qon4L7q4
4658e3K3J35j09l2J02m0n1J35j86ON9l2Q6Rp9k9R9q7M6mm3j1L5K1j14RQ6p0O4
4687b5JL0J7m4k0k9P5K5o6O9n5m9M6L3j2j9M0m4J8j3O5jn9J4K3l7NO8m9PMOj9
4720EL8k7j3L4j5j6K0lmj1JJ3kj4j4J0jQkk0J1J8%pn0L0MP2l7p4L3rJ6m2J2nm
4757d5j2J50j13o1L7J6L6O0q1mN8J4J0p3L6k3K3lk1J7r%Lj0J5k8L6j3nk0J9mO
4790A1j3jKJ1j6K6qj5qNMook4L6j1N%nQj0jK3j2qoJ1K0k3J6j7K4j7mMNk1K8Nj5
4830cJ1Jjk0J3MPkJ1j8RKk1QKPMj0K1r%j6J8jj7K2j5nj2J1qRj0J2j7mKnJ4oJJ
$$ plain form
4596 36 19 33 -46 28 29 10 -33 21 -55 -5 38 -48 5 -14 30 15 -36 93 12 21 52 -19 -15 -20 78 9 26 -1 10 -15 -47 -29
4628 -29 17 -85 -28 -61 10 38 -27 -57 -55 -37 174 -48 -38 -37 -140 75 76 -69 -78 8 60 14 73 -47 46 54 48 -6 31 -53
4658 -53 -30 105 -4 -36 66 26 -25 110 -76 -70 -11 -43 43 52 -27 -56 43 -44 2 -2 -45 -56 -21 0 -114 -105 -19 -89 -25
4687 -25 -24 6 23 -21 -41 -70 5 30 -36 33 -22 -71 -25 8 -4 -23 17 -27 -9 -22 43 42 -17 -3 20 -17 -12 56 7 14 18 24 5
4720 5 43 16 3 37 22 6 26 23 19 8 9 22 20 6 -8 2 1 9 7 -13 -2 16 16 9 -41 -11 -7 65 28 -46 -13 -22 -6 -48 -36 -41 -45
4757 -45 -57 93 -20 -81 -44 -28 8 68 -13 -17 41 55 65 -8 28 5 28 25 4 21 12 12 15 5 20 -8 28 15 10 -10 9 5 11
4790 11 -2 -3 -1 10 -6 20 12 -3 -11 -6 -2 -8 -14 -38 -2 -13 -8 -8 -13 -5 -15 -16 7 -5 -13 -19 -8 12 -11 5 -12 12 -5 -9 -5 0 -21 7 12 -3
4830 -3 8 9 8 -12 1 5 12 10 21 3 12 14 -7 1 3 10 14 4 25 16 16 0 18 17 0 22 7 2 -10 1 -7 2 -8 4 -13 -17 -15 -20 -6 -12 -11 -10
4872a0Nmmj2J6lRrJ5k8L9k0J2rK3j4K0n8P1j8J4q5J32j10Q0kj11L9L6M5q8J3j
4905a7J4L2mo4J02j44P4jJ1m2M5o3J50p8K4oR5j01Jn8P6O0j74O4j0n5Q1K6n8k2
4935d2J05p0%J42q6l8O3r4M3O6j03P0J1j00R0n6K9j1o1M7KJ7j7L2n7L5k4J6OQ
4965B3j5MRj3mj7K7nQj6J2l0J9j2j0RqJ5lqL3Lm1NK0J3l5oL5l7K3K4k5qL5p3l0
5002g9R4j3k7j5pL9J%j5O5l6j4O9j39m0J01Q5m1J2m4J9QP2m6rj1m6L3j6K9l6N
5034bj1RLnrL4m1K6kJ4j3j2OQj6PkK0k7j7K1j1J8mQk1J5lK%LL5k0jj1j1K5mj9
5073hJ1mJ5Qj5K2K2l9oOj4J3P8r5J8n2n6J7lN4j0K9qP1q9R8j82J08m0Q1rJ1m1
5106iK6m5L2L1n2J8k7j1R5n3rm7N6k4L3oqj6J9J0j8MJJ6J1j2Oj8j1J7jlnmJ0j2
$$ plain form
4872 -10 -5 -9 -13 -25 -9 -12 -3 -12 3 -25 14 -6 6 -3 20 6 26 -32 39 21 35 -50 82 -28 52 50 -61 -22 14 59 -29 -16 -17
4905 -17 -3 29 25 -39 63 -81 -7 -8 3 -39 6 -57 93 15 39 33 128 27 28 -30 46 106 -68 -4 -14 -69 12 38 -20 -42
4935 -42 63 -7 -7 135 49 11 74 -20 23 89 -14 56 67 -33 57 1 30 19 -42 5 7 24 7 39 -18 17 -7 9 15 23
4965 23 8 12 21 8 4 -13 14 9 17 1 13 -17 2 -10 -20 -11 -19 -4 -7 -15 18 21 -20 -15 5 18 -17 -23 12 -25 -2 22 -3 -11 24 -49 -79
5002 -79 15 2 -25 -40 -47 -8 -7 -7 -22 43 7 -7 62 -77 -117 -16 69 28 40 -4 15 23 95 49 40 29 -17 16 0 29 -7 -2
5034 -2 -13 -4 -1 -6 -15 19 -22 4 2 16 3 -9 -3 5 -11 -4 -6 14 -13 -30 -9 -20 -2 -6 2 -19 -4 -7 -5 -5 -2 33 13 12 1 -10 15 11 -8
5073 -8 3 -1 14 22 7 29 51 12 6 12 -2 11 89 -6 12 -40 -96 -79 -82 -28 -38 -9 -17 54 -35 63 -119 -11 -51 30 21 32 -9
5106 -9 17 -28 4 35 -17 1 -26 -37 58 5 -4 -51 5 -19 14 8 0 -16 3 13 -5 -1 0 16 27 15 21 3 -8 9 8 5 0 -4 6 -6
5142fQK1pj5klJ9k7K8J5k3j6k0K8oj3j4K5PL5j8k8n%LJ5K7n0j9N4L2j26N5N1r0
5177f5P2K4j2l2J9j0k9NM4j12R6m3J18M0j25k5R5r5J28j20m3R0Rj6m2N7K4r9L4
5206a3N5m4J1pn%O4q5K7nKlj1J8j6J5lj2j6QJ5K2m7J1J6qJ3j1J0Lk7J8j5J8J2
5241A0j0J6j1ONj6J2j7Oj6JK7pj2k8O2l9M3j4mqN3l8j7KL1l2m7MR5n5j5jJ2J8
5276A6j4m3K3L9m3K2J1m6L7mJ1M6j0k9l5p9R3K0oN7k2n2l8j1o3J04m1J33m1r4
5306e9N9Q3j3n7Kl9M1J5j17J27j02R5L4n1k0P0j20J70j51L8K4K0Om4J3n7j1m8
5334i2R2Q4n8J07j20j05N7m3M3m0J06j5L8j01k5N3m9K9K6Np0J59j12J5J8l2M4
5361A4q5P0J8Op4K0N8l9J3k7J1N3j0M7l9J5kJ0p1L7k8K6L0m1n5K5n9L0M5k6O0
$$ plain form
5142 -6 2 23 16 1 -1 -4 15 -12 16 31 8 -8 -28 0 -6 -19 -33 -8 -1 34 16 -12 -17 -17 -14 1 28 -22 -41 13 45 -81 -26 25 -65
5177 -65 7 31 19 -13 6 -4 -33 -28 16 -96 0 -43 75 115 -10 -35 60 -35 93 -27 -70 20 29 13 -29 28 52 -47 -13
5206 -13 42 -2 9 2 -3 -3 61 -24 3 -2 0 -3 -14 4 -12 3 0 -12 -28 -20 -5 17 -30 -19 -3 -11 2 -9 1 4 -23 -5 -20 -2 10
5241 10 0 16 5 11 16 0 12 -5 1 -15 -14 13 6 -6 -34 28 -11 32 18 14 6 59 21 4 6 37 5 -42 -38 57 2 -13 -14 -2 16
5276 16 2 -41 -18 21 -22 0 11 -35 2 -2 9 55 45 16 -19 -98 -5 15 9 66 44 -8 -46 -57 -120 -16 -57 76 35 -59
5306 -59 0 83 70 13 15 -24 17 32 -85 42 -60 35 69 18 -2 68 -52 118 -33 5 29 49 55 11 24 -33 -44 -92
5334 -92 0 84 26 133 13 -92 -35 -78 -35 -75 31 16 54 -47 -72 -19 -68 -39 -13 -8 -78 81 -31 -16 2 -30 14
5361 14 -71 -1 17 23 -51 -31 27 -12 1 -26 -15 38 28 75 36 51 49 59 -12 25 -3 23 53 12 -43 -18 -77 -47 -2 -28 32
5392C2m8M3j4n5QM1j7J8k6j8J7KM1km7L5L5m0k9o9lN2RQ1p6k8Q1o3lM9J40j43
5424Cm4n9J25L3j23P0L5J02k32J71r9nJ53q3J0j06N5j10J28k4j0M8l6jnL4k4k5
5452a9M1k6n9Q3q3J7J4M2Lj08O0J6pK1m7Q2k5k0J8n2O9m7K0k1J01m7pq0O2L9k0
5483B0m2P4o3k0M4m0j2N0OJ6k5k0nJ5jm5L7J5rK7m7Q1k7n7Q5m1jj5k2%L6l2q3
5516a01R2o1J16M6j16J3k5qP5J2j0q1J22p9oj2M1j7J4l4M9o8M1J4nj5N4rm7j4
5546a9P3n1l1M9J9j5m2R5j0Mn1k9RlomM2k5Nj0K1mk1J1%lj6kmK2k6L0pj0k0J0
5582a9j0K0J4Jj9PJ7l1J6qQj1J4mML%pK0pJPl9J7R%J3k7MK3qKlNj2J9lrmj0MJ6
5624A3Qoqj1mjRpJ2Oj9KJj2kK9m0K2j2LPJ5mj7J2mJ0J1k8nK3J3k5JJjJ6Rj7J5
$$ plain form
5392 32 -16 27 13 -42 -34 7 -10 8 -18 -36 -19 -17 24 22 -25 10 45 5 -24 -93 -96 -44 -35 46 -30 -58 23 -40 -43 6 146 3
5424 3 -41 -100 25 58 -65 5 40 142 -90 81 -18 -23 130 47 57 -49 6 -104 24 0 -10 38 2 1 -4 30 6 -19
5452 -19 22 -4 -63 20 -63 -46 -32 10 13 -95 -35 -19 -26 -5 -52 30 5 -15 3 -49 20 -27 -7 -28 73 26 19 -61 1 40 20
5483 20 -22 52 -11 -31 13 -27 -39 11 17 33 8 -12 -17 -2 -3 -48 -11 4 -5 22 -25 56 29 -28 57 16 15 0 -22 -22 14 -18 -101
5516 -101 -9 -70 46 92 -24 -11 -36 -44 31 43 33 -48 74 -5 -11 -23 18 1 15 -19 30 -38 3 17 12 -3 51 42 -5 -19
5546 -19 54 3 -28 21 40 25 -17 78 68 72 21 -8 1 -2 -8 -12 30 5 10 0 21 17 -4 7 7 4 -12 -14 -18 4 -22 8 1 -9 -29 -19
5582 -19 -29 -9 5 6 -13 -6 11 -20 -4 -12 -4 -15 -1 -5 -1 2 2 -5 15 8 9 16 -23 -6 3 3 16 -11 -7 16 8 10 7 12 0 19 16 7 3 -7 -3 13
5624 13 21 15 7 -4 -8 -9 0 -7 5 11 -8 -6 -5 -17 -19 10 -30 -8 -20 -17 -10 5 1 -16 -4 -8 2 13 -15 -20 3 16 -9 -8 -7 -8 8 17 0 15
5664A5j8K1k6PK9k3oJ0%L7o2J6mKj4jL7j1qQj7K9rmj6k2L5rNj5lOnj0L1j9oLP
5703a0kPk0MJ1LMj4RJNJ1pmJ0mMj0OqJ7NpMJK0k6J2k7J6k5PK1nlNoJ3lj9j2L8
5745B2k4Nkl1L8j1Mk6J9J6j2j5mJ5kQpj0RK5k0k3J7K6j7j5MK1rk1J3lK1j1jJ9
5781A8j0j9J7K2kj6oj1MJ6Mj1lNJ0Ok1Qj3K4k3Nk7K3J4j2k0K8nj3k1J3J8j1QN
5817DoK3l4j9L2j1J0j6pK0mj8J0J2J4pk2jK8Kpk1K7NlmnJMj0j1J0NJ1Mj5L2k9
5855Dj3RN0l9k1k8j8K0LJ6J7l1J6mk9R9j33RK1j15M1J05N2q8J3J50oK6q0j16n9
5886a29MJ05r2J66P5j84k9J13l1J24n8j69J79l8j2M3j5o8j13J07P8Mj2O0j48M1
5912Aj1j0r1J66k1kq4P6p3K9oN2q7j2J28o4K8K2m7M9o5k5N3m1L7l6K7ojJ0m6M4
$$ plain form
5664 15 -3 18 -8 -1 28 5 -1 9 9 46 -16 0 -4 -2 -16 -17 20 9 1 9 -8 21 12 8 -8 -30 5 -4 1 -14 -17 -11 -16 -26 5 -14 -20 -17 -10
5703 -10 -12 -5 -25 -21 -10 -7 -3 -17 -8 -7 -2 9 2 -2 8 4 8 -2 4 -4 13 18 11 15 16 36 10 22 -5 11 -14 -7 14 9 6 11 5 18 15 -4 -16 22
5745 22 -2 3 1 -30 8 -3 1 -25 -6 10 -2 -17 -21 -6 -8 0 -7 -17 -8 17 -3 -26 -9 17 0 -15 -11 10 1 -20 -7 -10 11 0 -1 18
5781 18 8 -11 6 28 26 10 4 -7 -3 13 17 6 3 8 18 24 3 11 -2 22 -1 4 -23 0 14 2 -18 10 5 -8 -29 -16 2 -9 -1 4
5817 4 -2 21 -13 -32 0 -11 -1 -17 -24 -4 -8 -26 -16 -4 10 3 -19 -20 8 10 3 -18 9 14 11 7 2 3 7 -3 -14 -4 1 12 16 1 33 4
5855 4 -9 0 50 11 -10 -38 -56 -36 -33 -17 0 -31 -15 -19 -48 51 -82 -73 -52 -167 -126 -21 31 -57 -44 106 100 126 46 -70 -129
5886 -129 -125 -20 -112 54 129 -55 -84 29 -2 122 64 -105 74 36 24 67 52 -16 -129 -22 56 60 48 108 -40 1
5912 1 -10 -20 -111 55 34 32 -52 24 -49 -20 -26 26 -61 -73 55 -9 19 41 -6 43 -22 -47 6 -35 2 -34 -7 -13 -14 -4 -50 -6
5944fJ7j5j3j2N1j9Ll1K9J4Kk6Lj4L2KrJ3Lnk1j3N0l7K1j8J0L2l6k2%L6k0mrP
5980eK4j0k5oM0k3L9n2n3Q3K6R9j11l3K6l7jJkNjj1J2L3l1j3NK4K0k9k0L9JQl4
6015a2K6pj5J0mK5k5L2l3%pQ0p4M4oj4j7p2J2PP4K6j13nO3l5M2J2k6j6M3K4O7
6048A06j38Q4j26J18n0J4J8J7j47Q8q7J21p4O2J1K0jj09O9J9p3J1L8K0jq6O6m
6076a4N3o5N6l4J6mJ5qL0m3%MJ5l3L2M1p0J4qL8q4P2J6k5r7O6L0o1j06R9J22j11
6108d4J26j29N0k2M3o5J2NM0%n6J8L0kl9j4L6K5k1O%Rnj7mJ3K5j6nPJ5Ok7J1n
6143FK2j5j6OKJ1j9JQK9l1j6KM4J7p4J7l1N5Mm0pj9N4N2o1J8q7J07l8j9L4j8j6
6177a8k4L3J4Jk1lLKj6K0j3M5l0J1j7J1J4K5k1qj3K3j4j0J0K3j6jkK0kk5mJ4m
$$ plain form
5944 -6 11 -4 -17 -29 22 3 6 -25 4 18 20 -6 -3 -17 15 17 8 21 24 19 -2 -15 35 -2 19 1 11 43 7 -15 -15 21 1 -3 -12 -5
5980 -5 19 9 -16 -22 18 -5 34 -18 -71 12 38 137 26 -7 19 -18 -19 -18 -20 -15 -16 -27 -15 18 -13 -26 -21 3 23 -6 -26 13 14 22 -12
6015 -12 14 7 -8 2 -2 23 -2 30 -3 -3 -10 70 -4 40 34 20 3 -69 -57 -50 24 50 -63 -68 -5 -40 2 14 -12 -28 15 39 106
6048 106 -32 52 -74 44 -6 8 26 43 -104 -16 -103 18 -56 6 17 37 36 -73 -4 15 -58 -47 -9 11 10 -76 -10 -14
6076 -14 39 -26 30 -4 12 8 23 15 45 2 2 6 21 -12 20 61 -9 5 -3 35 -49 23 39 14 -83 -17 13 -48 -154 -55 67 -44
6108 -44 82 -47 3 -19 24 -41 -29 -24 16 16 -40 -22 8 6 -33 -47 -11 14 -7 -1 -1 8 3 -14 -18 -5 20 4 -1 6 21 27 0 11 6
6143 6 28 13 -3 3 5 16 -3 -2 6 35 4 -12 -10 34 51 -23 -6 -37 18 22 -18 -25 -44 10 62 1 19 -68 39 1 -18 16 -2 -18
6177 -18 -42 -9 5 6 -15 -18 -15 -13 -29 -9 -22 23 -7 4 -13 -2 12 37 16 8 -5 18 4 -6 4 27 11 10 8 28 26 1 -3 11 7
6212GQrnJ3J8l3Lj3K1Ooj5j0K6lk7J3Rj9NpK1j7Pk8JK9l4K8oJ4lJ0j5j6N2m3l
6250b1%L3Rl5J8j3L5l9Oj8K6K3k5Mk1L8j5Mj8K1J4k2Oj5rL4qj0mLJ0k5oJ9L5l0
6286DL2n7N3m3m8Q3j09J33j59R7k0N0n8m5J32q4m9L1J68j06N2m6k7j3O2n2lO9
6314D7j14Q6k1k7J4Q4q5L3j8J0%N5q0L3k9O0n7K4q8Q6jp2NK3L3rr0R5P5J3q0j5
6346a0Mj4M4J7r7O1O3q9n8N1K4P2j18n5J43j9q7n0J55p3O3k6m7j4K7L7J58j48
6374A4j7p7O2q2J78m3l9J8P0k9p6MJ33p0j2l0k8O7j08N0K1l5P8j9r9J04Pp1J9
6403a0J0l9O6Pp7N4J2l4KJ6k3N1l2o3O1J9k4qk3J3K2J2k7L5n8N0l0MK2rK7j9Q
6436A5lnnk4M1j8j3lJ5J0jJ0jl0K2Kj6J6j5opM8ql7QJ2J9n9oQ0ln6J1oL4j9n3
$$ plain form
6212 7 15 6 1 14 32 -1 2 -11 10 16 10 -5 -15 11 8 -19 -6 3 -16 -11 -18 3 -14 -7 -35 -34 -5 -39 -11 -17 -3 -6 4 -11 -27 25 -18 -21
6250 -21 -21 12 21 -14 4 -9 26 -13 -7 -25 1 24 -1 3 -18 20 5 9 -9 12 26 4 10 -5 -14 20 12 2 -2 1 11 -14 -20 -1 34 4
6286 4 36 -21 32 -11 -59 24 -85 48 -111 -14 -34 16 -42 -87 45 -39 -88 -57 111 5 57 11 -16 -29 33 -19 -22 47
6314 47 -67 19 -2 -29 -15 69 -16 17 -1 9 9 64 -16 17 -12 48 -9 15 -73 13 12 -60 -55 -32 1 -8 -98 -3 72 85 5 -10
6346 -10 -6 -20 24 41 -56 5 68 -21 -79 -28 -4 68 -50 -105 38 19 -68 -118 37 -36 27 1 -46 -60 -33 4 162 14
6374 14 -3 -80 -18 -100 78 35 -4 14 84 55 -21 -17 116 46 34 4 -24 43 -65 -15 6 -29 49 30 -69 35 42 -29 -10
6403 -10 0 -39 27 34 -43 11 23 -11 -9 7 -16 35 3 -60 1 20 -4 -12 -35 -22 0 12 -15 20 -38 12 -18 -14 8 -1 26 7 15
6436 15 12 7 2 -22 19 1 -12 -15 0 10 9 19 18 -12 10 12 -4 12 -3 -9 -16 32 24 -13 -5 7 26 -33 -39 41 38 -18 -7 -13 21 2 -51
6473e1J2jL3m1Q0n8J8j3M4l7K2K0nN2j27J00nJ9j31j2M3j6J0P3j02J15k5L0Mn6
6503eJ4k5K7L6m2M7j6K8o6K6jPk4%J16j35l1J45k24N9J40k9j08lO0l4L7n3K4P
6533b3j16J25R5k05J25m3L8N6p2R2p1qLlJ2oJ3RmJ0Mm3N8l7k4NJ2N%j2K2j0Rj7
6567aJ2J3n5RL9Jjk1K9Kn4j9O1L2j21J54o8L5j27R0m4Lj4K6qJ2J0pL4n0L1oOR
6601A2j9j1J2JJ2mk2L1Kj5LKk1L6lNrlK3j3Jj5J9j3j0K8j9jK0j7k3RnoJ1Noj9
6639b2J2NKj5MjJ2J4k5JpqK1oOJ4j4Nj3K3qj5J0MlpRj8K9j0Kk2M0k3K2l9J1N0
6677D0J2m0mK2M6k5l9J2k4j2m4Q6m2K8l0L5nj4pJ1J1k6j6jK9rk%K1nk6jnL3l9
6712c0K8j5K9l3RkJ0JKJ6k6J6mOj2oRjoOpmJ2K1mj1j4J2K3k7qM1rlk1J2k6L6k
$$ plain form
6473 -51 -39 -40 -7 -48 32 -26 -8 -21 23 -14 8 28 23 75 -52 48 43 62 -69 -81 -38 -54 -44 29 -73 42 17 47 51 -5
6503 -5 9 -16 11 47 5 52 36 64 -2 24 23 30 6 6 122 -13 -44 101 -123 -64 76 47 -61 -64 -4 -38 -1 -54 -30 -23
6533 -23 -139 -14 81 -124 1 -42 -4 52 -20 72 1 -7 -4 -7 5 -1 12 21 17 27 31 -12 46 9 -15 -10 2 7 7 -5 17 7 16 -1
6567 -1 11 24 -31 -22 17 18 17 -4 25 27 -27 -46 15 47 -74 80 12 47 -80 10 -34 -31 -45 -19 -27 -15 -5 -12 22 -28 3 -3 3 12
6601 12 -7 -18 -6 -5 7 3 -19 12 14 -1 2 4 -17 19 16 21 12 9 32 19 20 5 24 11 1 29 10 9 29 12 -11 -2 -7 -13 -2 3 -3 -22
6639 -22 -10 -5 -3 -18 -14 -15 -3 11 -14 -13 -20 -28 -7 -13 -7 7 -7 -2 -15 8 0 -15 -5 -1 -4 -11 -2 -20 9 -1 1 -21 19 -4 18 -21 -10 40
6677 40 52 12 8 30 76 51 12 24 0 -12 -56 30 -12 16 -14 21 16 2 -5 6 17 -9 -25 -26 3 -6 -8 -8 13 8 -18 -19 -24 9 -30
6712 -30 -2 -17 12 -21 -12 -14 -4 -3 -1 15 -11 5 1 7 -5 -11 -2 -3 -9 -3 -10 -14 -2 19 15 4 -10 2 25 -2 -10 31 22 19 -2 10 -16 20 18
6751A8l0K1J8Jn4K3n6M6R6n9p5N7L7K9r5J8J9j4Lpm1l0J49r3P5q3L3qk9pL8p8
6783g8l4J14j35J86j74J32NM9o4RJ1r4J11n8J35j38M7k5J9l8J5j2RK1l2P3j6m
6811C4j29N4N7N9l3r1K0J1j9MN9p0N2K1m9m2P1k1J16J0r0l2k3k9N6j1j00M3M1
6840c1OP0Or1J94j80Q7q8O7Mo9n8J05j26J44P3j02J7l7J03p9M0j10L4O9r6K6R8
6868G6j01R3r2J00m3m4n4K7l7L6N8j10L8M2l6P7j6P6l9l2L7pn7l4O6K0q8MP1l4
6898cj6Nm0J00n4Q0j12N2kJoj6LlOL2L6o5M3n8K0J9o1M0nPJ3j9nj4K6J1j1kKQ
6934A2j1Kj7PPj7MpPK3k8OJ2pj5K8k2oJ2Rj6rjJ6pJ4Kkj0J4k4J8lJ4mJ3LqqJ3
6974A4k2mMK5j5J7j3L4l9Q1n9n7L1L2Kn5m0J09o0L0k7l8R6o5j2J1o0M6k2k0N9
$$ plain form
6751 18 -12 9 27 28 -26 -3 -59 -13 83 24 -51 6 43 72 -23 -5 14 0 3 -4 -45 -75 74 -19 56 -27 6 -2 -31 -38 0 -78
6783 -78 -112 2 -133 53 -121 11 16 65 1 10 21 -73 38 -20 115 -23 24 -1 18 -20 -5 -17 -8 13 -19 54 38 34
6811 34 -95 -41 16 75 42 -49 -29 -18 -37 -33 26 -44 8 29 -20 -62 9 -12 104 114 24 -8 -31 -60 -4 -15 -115 -72 -31
6840 -31 -25 45 51 -40 154 -26 61 -27 40 44 -25 -83 22 -104 40 113 11 28 -9 94 15 55 -55 -21 48 -48 -22 76
6868 76 -25 68 -24 76 33 -11 -65 -38 -75 -39 19 -91 -53 -11 -47 30 14 90 51 19 56 49 -8 -42 24 44 -44 -40 31 -3
6898 -3 -19 -14 -54 46 -8 72 -40 12 10 11 5 -11 -8 -11 -5 27 63 -2 41 -17 3 22 -39 1 -4 3 16 -3 -8 -22 4 15 4 2 4 12
6934 12 1 3 -14 -7 0 -17 -13 -20 -13 10 -18 -12 0 -7 -22 6 -16 -22 -10 -1 -17 -26 -27 -11 -18 -4 -2 -4 -14 0 -24 -6 -9 5 1 14 17 9 1 14
6974 14 -8 -12 -8 17 2 19 6 40 1 82 23 -34 -3 29 31 -24 -64 45 -15 15 -12 -50 46 -19 -31 -20 -80 -34 -56 -76 -17
7005a7o9R5N4r5K5k8N1o4M7J5Kj4Kj1oQJ6J4j6j2jJ9k2J9nmJj6RK4j0k1J9QMK
7041B3k4J0J8J%m1L3j6J8k2%Oj0mOMj0jPkj8KN2J1n3l7J3M9l8J2m3jM4o0M4qO3
7078B8m5qQ7r1K0K8L4r6N2m5J6rMN8p4O6j6K7o7N9M6o4L5Rm1Qn6L0l6K5rkJ3K
7112a2K9Mkl7K2pjpkJ4Nj6K0k2Ql2K4Lnj3jK0K5m1j4L5J9j8J1l6kJ1M5m3N1k5
7148A0J7m1N6mq5K11l37K04j08J07n5P2NJ9n7j0k4j1KP2k0q7M8K6k8O9p7k2N9
7177A1rMm1K9m6N0rOj4k6KM6k5K9l7mK2qJ3Rk3J0Oj5J9PnpJ5l6L2j6J2K3k8K5
7213B1KK1m4pk2j7J34n1o3P0n4R7r2o4kR4p7kmJ42j30O1j3M0j02Q0j08J08j04
7242h6R1P0n8P0j37M2q4R2l0j1R4l3ok5M8o5J13j53L1l4J47k60K10K8K0k44KJ99
$$ plain form
7005 -17 -86 9 63 -32 -7 -35 16 -48 -1 14 16 2 4 -7 -13 -5 11 25 9 -3 -4 15 -7 12 7 3 4 -12 -3 21 11 -10 9 17 21 23
7041 23 -1 9 27 28 28 -13 20 4 22 0 0 6 -4 -8 -2 2 -8 -9 -2 -4 -22 -20 32 43 -10 -47 -34 15 -23 -11 -54 -55 -11 -71 -27 -35 28
7078 28 -17 -25 62 -29 -9 19 53 -43 9 -36 -20 -29 -25 33 -41 25 9 36 -31 28 74 10 45 54 13 21 -35 -5 -41 -16 -25 -27 -14 -12
7112 -12 17 21 19 -18 4 -3 -4 -11 -13 1 6 -10 10 -12 -4 -36 -12 -9 -14 -27 -28 -8 17 -24 -38 -3 16 -2 9 -27 -29 -18 27 -16 35 10
7148 10 27 -14 42 38 -47 164 -173 31 -77 30 -25 47 52 71 14 4 -20 -31 -29 43 23 -64 -16 10 -18 51 -26 -48 11
7177 11 2 6 -35 -6 -52 -2 -11 -5 -19 -45 -43 3 -22 7 -30 -34 -12 -20 -7 2 -21 -11 -5 -20 -1 6 1 -6 9 -27 5 -11 1 24 -4 21
7213 21 23 44 0 -7 -29 -46 88 37 -26 44 -10 87 -5 -69 -71 23 -54 -56 -60 82 -48 13 0 40 -62 18 -90 18 -86
7242 -86 5 75 17 87 -50 -8 -92 0 -30 -41 53 20 14 -11 37 -28 85 -68 -37 -71 76 -184 26 54 74 -170 -168 31
7270C1rn5N7lp9R9j14P3M0k7L4j06N3L0n6J05m3Po1j7J6l9K1K6j7kL9%j4Mj0K1
7302Dj5K2l1J0omj1K2mK3J6k6j1J4j7Pj5K6oj8J9J0J1l2J9mJnJ1pNnPj4J3kj7
7339a0K1k5MK1oj5LJ7lmk6pK4pK3M7m8l0L7m3N7o6J6J4N3j8m7R4r5o1O7P0j48
7372i1JJ83q5J48k18J93k04J34L9p7M9k4l4j10J46O7j15j2M7n7J00q1P4r4J02
7397H1o4l5J11j32L9K7l2rM7o6OK5mNJ0lRl6NL2k9lJ7j6j2J3Rj5K6J0l1MJ19n3
7431E5r5J7J2K4k7J2Kj3oJ9%lOpkJ3mRLJ2J4l2j7J5oM5j9k3k3M2nQKm2J1L2or0
7469f7M6M4M2q1K4o7kM4n2L6n0L9M6m5Lm1K9N9J0mo8J08j9L3j9n4J15j10j0l7
7499d8N3k5J06j2rj28N2j8O9Mj57J30K2M3M4n4j6l3l0NKk4N6Ol2m1J13L3j01Q
$$ plain form
7270 31 22 -33 24 21 -58 41 -73 0 40 13 47 -59 -6 24 -32 73 30 37 -24 -41 -25 -64 -43 -17 -34 -36 3 3 -11 -7 -17 4
7302 4 -11 11 -20 -10 -16 -20 -31 -9 -13 10 26 0 -11 3 -14 -7 -22 4 -2 -20 -1 9 20 -12 7 3 4 -1 10 3 8 3 10 -4 9 7 -10
7339 -10 11 -14 -10 11 5 -10 -7 10 7 3 -23 -30 -6 -13 10 57 9 -21 16 -27 30 -36 -20 -6 47 29 -18 76 -19 -80 -13 57 -91
7372 -91 -90 93 8 156 -62 131 -73 61 100 23 72 48 14 -96 50 117 2 -10 37 -20 80 -1 73 -21 81
7397 81 17 -18 93 -39 0 27 -5 -14 33 -33 -27 -2 -6 -1 9 6 15 -21 -16 16 -13 -16 1 -15 -27 -14 -5 -20 6 16 -15 -11 108 55
7431 55 -40 -23 -11 13 -14 -2 0 -13 -19 0 0 -3 3 -4 -6 7 3 12 15 27 41 9 -8 7 1 46 27 4 -19 23 18 26 28 -14 -3 29 23 -67
7469 -67 -21 23 65 -16 8 -59 -61 -17 -69 -33 -83 -44 2 -43 -40 -81 -52 7 17 13 -55 53 34 67 48 -6 109 -1 -11 -48
7499 -48 5 -20 86 74 65 -63 -11 -29 40 44 -113 17 39 82 126 72 56 23 -7 -2 0 -24 32 38 6 -35 78 111 10 18
7529A8j09J1M4J3mm9J74j65J33O1j53L8j70K18k9j28N4R2j35P9OJp3K1l8J13l1
7556hOl4P7M3q5K5nr0J31j08P0P7j15po2O6MOO7o7J18j54J31po9l7P3o9jR0j07
7587d1N4j6nk5l7N9Q3j54J42r7O1k5orJ4n3J50r3m1J2lr8J09RM9j09J08k1K2l7
7617BN3o5J15j11j29L9R9Q2O7j62%P1l8Q0j41Ml3J29q0O8j26Q3k3P0j42J1J7K0
7645d0J92k15p4M6J28p7J8Q8q0J12j56K9m1O8k5p3J05m9O9n2Q3J6j14%j33K32
7671E7j27N0jJ39k2j63Q6j8j6L9j1M6r6Q6n0j9R5j00k4K6N4L0l2l3L0Kj1k2J2
7700Gkl4L3l3P2n9k1QKO0j4k3o2P1k4Ok1K2J2k9L1j8jo3MN2L3n5M4j3k6l8J03
7733B4N3q0k4J29j59J32j93K8P4j3O4j42J00J7M2j08J5M2j7O5k03R9J14r3N4n
$$ plain form
7529 18 -91 -80 -36 -23 -27 -76 98 -67 66 127 -26 12 -158 60 31 -97 -43 49 -86 -7 -1 0 -73 -52 -90 23 -8
7556 -8 -2 -36 41 84 -1 24 19 -71 60 -48 22 99 -16 -23 -85 -19 -15 -9 58 -9 109 -45 86 79 10 -27 46 -23 -24 66 -41
7587 -41 13 -3 -8 -33 -70 -11 72 -82 60 -37 24 -1 -7 -16 -2 -55 95 2 -39 -27 -30 -128 -19 -10 39 -70 38 17 39 2
7617 2 55 -10 105 -6 -135 -96 3 85 152 -10 -10 61 23 103 -38 -34 -67 62 -18 50 -76 7 -16 54 -88 -77 -60 -40
7645 -40 152 -63 -137 -91 37 -40 -22 66 -14 98 -58 -29 -70 -2 -27 -100 5 -44 25 -27 56 72 -42 -42 -175 57
7671 57 -70 -20 -21 118 96 -67 19 1 -15 24 13 59 -37 49 -1 -20 75 -25 -49 -23 31 61 29 -4 26 28 17 -5 7
7700 7 5 -29 4 -29 43 -16 -37 -29 -27 33 19 -4 -66 5 -19 -13 -34 -12 0 -29 2 -16 -17 -80 -76 -24 9 -46 -2 -15 -41 -79 24
7733 24 77 -3 -27 102 -57 75 -118 -90 -16 -29 35 -107 -7 10 52 -56 -41 1 -16 49 -154 -55 59 -34 20 15
7759A5j0Mr7P2Q9m4m4M9k3j9Rm2N2nm1O5r3J06k1m8o5J07K6o9j8J4N3k3j9m7O8
7790Aj2Rk5K3k3L6LlJOorJ8nJPj5jnJ3j9J5j2J5moll5L2J2k1J5J5j9J4k8K7pk4
$$ plain form
7759 15 5 9 -88 -16 73 29 -15 34 11 -8 1 -41 11 6 -35 30 -63 43 22 -26 -91 16 42 -27 -45 -31 22 -1 -20 -67 1
7790 1 -11 -2 -27 -4 -27 9 12 9 10 16 10 1 19 14 15 22 7 6 1 14 -5 10 -2 13 9 3 0 -35 -3 9 -12 3 18 -1 13 -15 12 5 -19
$$ [...]
8191a3
##END NTUPLES=NMR FID
##END=
