##TITLE=1H_Pr MeCarb_d6
 DMSO-d6
 8 sc, 
 3.7.2024
##JCAMPDX= 6.0         $$ Bruker NMR JCAMP-DX V2.0
##DATA TYPE= NMR FID
##DATA CLASS= NTUPLES
##ORIGIN= UXNMR, Bruker Analytische Messtechnik GmbH
##OWNER= root
$$ XWIN-NMR		Version 3.5
$$ Wed Jul  3 13:55:24 2024 Russian Standard Time (UT+4h)  she@DPX200
##.OBSERVE FREQUENCY= 200.131
##.OBSERVE NUCLEUS= ^1H
##.DELAY= (6, 6)
##.ACQUISITION MODE= SIMULTANEOUS
##.ACQUISITION SCHEME= undefined
##.AVERAGES= 8
##.DIGITISER RES= 18
##SPECTROMETER/DATA SYSTEM= spect
##.PULSE SEQUENCE= zg30
##.SOLVENT NAME= DMSO
##.SHIFT REFERENCE= (INTERNAL, DMSO, 0, 15.7039)
##AUDIT TRAIL= $$ (NUMBER, WHEN, WHO, WHERE, WHAT)
$$ ##TITLE= Audit trail, XWIN-NMR		Version 3.5
$$ ##JCAMPDX= 5.01
$$ ##ORIGIN= Bruker BioSpin GmbH
$$ ##OWNER= she
$$ F:/spectra/data/she/nmr/H-F/1/audita.txt
$$ ##AUDIT TRAIL=  $$ (NUMBER, WHEN, WHO, WHERE, WHAT)
(   1,<2024-07-03 13:53:45.06 +0400>,<she>,<DPX200>,
      <created by zg, POWCHK disabled, PULCHK disabled
       configuration hash MD5:
       00 E9 B6 7A A2 85 ED C7 34 08 36 98 17 FE 4E 26
       data hash MD5: 16K
       83 A1 E1 49 BD 24 AA 30 C7 A4 0D 6B 81 CE 63 3C>)
$$ ##END=
$$ 
$$ hash MD5
$$ D8 D6 C0 66 D3 7A 6B 82 EB D9 60 76 71 8A D9 E5
##$RELAX= 
##$RELAX= 
##$RELAX= 
##$RELAX= 
##$RELAX= 
##$RELAX= 
$$ Bruker specific parameters
$$ --------------------------
##$DU= <F:/spectra>
##$EXPNO= 1
##$NAME= <H-F>
##$PROCNO= 1
##$TYPE= <nmr>
##$USER= <she>
##$AMP= (0..31)
100 100 100 100 100 100 100 100 100 100 100 100 100 100 100 100 100 100 
100 100 100 100 100 100 100 100 100 100 100 100 100 100 
##$AQSEQ= 0
##$AQ_mod= 1
##$AUNM= <au_zg>
##$AUTOPOS= <>
##$BF1= 200.13
##$BF2= 200.13
##$BF3= 200.13
##$BF4= 200.13
##$BF5= 200.13
##$BF6= 200.13
##$BF7= 200.13
##$BF8= 200.13
##$BYTORDA= 1
##$CFDGTYP= 0
##$CFRGTYP= 5
##$CHEMSTR= <none>
##$CNST= (0..31)
1 1 145 1 1 1 1 1 1 1 1 1 1 1 1 1 1 1 1 1 1 1 1 1 1 1 1 1 1 1 1 1 
##$CPDPRG= <>
##$CPDPRG1= <>
##$CPDPRG2= <>
##$CPDPRG3= <>
##$CPDPRG4= <mlev>
##$CPDPRG5= <mlev>
##$CPDPRG6= <mlev>
##$CPDPRG7= <mlev>
##$CPDPRG8= <mlev>
##$CPDPRGB= <>
##$CPDPRGT= <>
##$D= (0..31)
0 1.2 0 0 0 0 0 0 0 0.06 0 0.03 0 0 0 0 0.0002 0 0 0 0 0 0 0 0 0 0 0 0 
0 0 0 
##$DATE= 1720000424
##$DBL= (0..7)
120 120 120 120 120 120 120 120 
##$DBP= (0..7)
150 150 150 150 150 150 150 150 
##$DBP07= 0
##$DBPNAM0= <>
##$DBPNAM1= <>
##$DBPNAM2= <>
##$DBPNAM3= <>
##$DBPNAM4= <>
##$DBPNAM5= <>
##$DBPNAM6= <>
##$DBPNAM7= <>
##$DBPOAL= (0..7)
0.5 0.5 0.5 0.5 0.5 0.5 0.5 0.5 
##$DBPOFFS= (0..7)
0 0 0 0 0 0 0 0 
##$DE= 6
##$DECBNUC= <off>
##$DECIM= 32
##$DECNUC= <off>
##$DECSTAT= 4
##$DIGMOD= 1
##$DIGTYP= 9
##$DL= (0..7)
0 120 120 120 120 120 120 120 
##$DP= (0..7)
150 150 150 150 150 150 150 150 
##$DP07= 0
##$DPNAME0= <>
##$DPNAME1= <>
##$DPNAME2= <>
##$DPNAME3= <>
##$DPNAME4= <>
##$DPNAME5= <>
##$DPNAME6= <>
##$DPNAME7= <>
##$DPOAL= (0..7)
0.5 0.5 0.5 0.5 0.5 0.5 0.5 0.5 
##$DPOFFS= (0..7)
0 0 0 0 0 0 0 0 
##$DQDMODE= 0
##$DR= 18
##$DS= 0
##$DSLIST= <SSSSSSSSSSSSSSS>
$$ [...]
##$SUBNAM2= <"">
##$SUBNAM3= <"">
##$SUBNAM4= <"">
##$SUBNAM5= <"">
##$SUBNAM6= <"">
##$SUBNAM7= <"">
##$SUBNAM8= <"">
##$SUBNAM9= <"">
##$SW= 18.0517599122864
##$SWIBOX= (0..15)
0 0 2 0 0 0 0 0 0 0 0 0 0 0 0 0 
##$SW_h= 3612.71676300578
##$TD= 16384
##$TD0= 1
##$TE= 0
##$TE2= 300
##$TE3= 300
##$TEG= 300
##$TL= (0..7)
0 120 120 120 120 120 120 120 
##$TP= (0..7)
150 150 150 150 150 150 150 150 
##$TP07= 0
##$TPNAME0= <>
##$TPNAME1= <>
##$TPNAME2= <>
##$TPNAME3= <>
##$TPNAME4= <>
##$TPNAME5= <>
##$TPNAME6= <>
##$TPNAME7= <>
##$TPOAL= (0..7)
0.5 0.5 0.5 0.5 0.5 0.5 0.5 0.5 
##$TPOFFS= (0..7)
0 0 0 0 0 0 0 0 
##$TUNHIN= 0
##$TUNHOUT= 0
##$TUNXOUT= 0
##$USERA1= <user>
##$USERA2= <user>
##$USERA3= <user>
##$USERA4= <user>
##$USERA5= <user>
##$V9= 5
##$VALIST= <valist>
##$VCLIST= <CCCCCCCCCCCCCCC>
##$VD= 0
##$VDLIST= <DDDDDDDDDDDDDDD>
##$VPLIST= <PPPPPPPPPPPPPPP>
##$VTLIST= <TTTTTTTTTTTTTTT>
##$WBST= 1024
##$WBSW= 4
##$XGAIN= (0..3)
0 0 0 0 
##$XL= 0
##$YL= 0
##$YMAX_a= 147557
##$YMIN_a= -180749
##$ZGOPTNS= <>
##$ZL1= 120
##$ZL2= 120
##$ZL3= 120
##$ZL4= 120
##$ABSF1= 10
##$ABSF2= 0
##$ABSG= 5
##$ABSL= 3
##$ALPHA= 0
##$AQORDER= 0
##$ASSFAC= 0
##$ASSFACI= 0
##$ASSFACX= 0
##$ASSWID= 0
##$AUNMP= <proc_1d>
##$AZFE= 0.1
##$AZFW= 0.1
##$BCFW= 1
##$BC_mod= 2
##$BYTORDP= 1
##$COROFFS= 0
##$CY= 11.3945322036743
##$DATMOD= 1
##$DC= 2
##$DFILT= <>
##$DTYPP= 0
##$F1P= 15.6554695791079
##$F2P= 12.8336369535428
##$FCOR= 0.5
##$FTSIZE= 0
##$FT_mod= 4
##$GAMMA= 1
##$GB= 0.15
##$INTBC= 1
##$INTSCL= 1
##$ISEN= 128
##$LB= 0.24
##$LEV0= 0
##$LPBIN= 0
##$MAXI= 10000
##$MC2= 0
##$MEAN= 0
##$ME_mod= 0
##$MI= 1.114404
##$NCOEF= 0
##$NC_proc= 0
##$NLEV= 6
##$NOISF1= 3.799351
##$NOISF2= 2.8
##$NSP= 1
##$NTH_PI= 0
##$NZP= 0
##$OFFSET= 15.70392
##$PC= 1
##$PHC0= -25318.26
##$PHC1= 8.187481
##$PH_mod= 1
##$PKNL= yes
##$PPARMOD= 0
##$PSCAL= 0
##$PSIGN= 0
##$REVERSE= no
##$SF= 200.130013532006
##$SI= 16384
##$SIGF1= 3
##$SIGF2= 2
##$SINO= 400
##$SIOLD= 16384
##$SREGLST= <1H.CDCl3>
##$SSB= 0
##$STSI= 0
##$STSR= 0
##$SW_p= 3612.71676300578
##$SYMM= 0
##$S_DEV= 0
##$TDeff= 0
##$TDoff= 0
##$TI= <>
##$TILT= no
##$TM1= 0
##$TM2= 0
##$TOPLEV= 0
##$USERP1= <user>
##$USERP2= <user>
##$USERP3= <user>
##$USERP4= <user>
##$USERP5= <user>
##$WDW= 1
##$XDIM= 8192
##$YMAX_p= 0
##$YMIN_p= 0
$$ End of Bruker specific parameters
$$ ---------------------------------
##NTUPLES= NMR FID
##VAR_NAME=  TIME,          FID/REAL,        FID/IMAG
##SYMBOL=    X,             R,               I
##VAR_TYPE=  INDEPENDENT,   DEPENDENT,       DEPENDENT
##VAR_FORM=  AFFN,          ASDF,            ASDF
##VAR_DIM=   8192,          8192,            8192
##UNITS=     SECONDS,       ARBITRARY UNITS, ARBITRARY UNITS
##FACTOR=    0.0002768,     1,               1
##FIRST=     0,             0,               0
##LAST=      2.2672688,     0,               0
##MIN=       0,             -180749,         0
##MAX=       2.2672688,     147557,          0
$$ Real data points
##PAGE= N=1
##DATA TABLE= (X++(R..R)), XYDATA
0 0 0 0 0 0 0 0 0 0 0 0 0 0 0 0 0 0 5 -8 8 -8 8 -8 15 -16 16 -23 24 -27 32 -37 40 -48 55 -61 69 -77 88 -98
38 -98 109 -123 134 -150 167 -185 205 -225 249 -274 302 -334 366 -404 446 -493 544 -605 670 -747
58 -747 839 -945 1072 -1233 1436 -1702 2072 -2623 3531 -5288 10003 -53192 -134885 -58778 25808
73 25808 75298 85903 120144 147557 138063 95574 75241 70221 59210 48234 65787 81002 61498
86 61498 34195 51104 76211 38128 -55891 -110840 -88940 -49016 -49260 -62004 -53615 -50039 -85814
99 -85814 -132823 -144927 -124888 -96462 -53753 3368 38150 26373 12237 41561 83691 73257
111 73257 25411 16619 62044 98496 92676 83429 96501 97267 57939 7917 -13130 -9024 1332
124 1332 22636 48492 38414 -21300 -76373 -81508 -70008 -90432 -121153 -107415 -58374 -33701
136 -33701 -47828 -52670 -26441 -5244 -13862 -26865 -16716 5442 31232 67814 102744 99148 54455
149 54455 20327 28066 44652 35117 24792 51704 89204 81924 34180 -854 -3842 -7710 -29692
162 -29692 -49573 -53094 -53108 -53194 -40695 -25391 -39059 -76372 -92383 -69142 -45602 -44047 -33064 12461
176 12461 55582 49774 11600 -7188 6419 22111 27676 37552 53819 59873 57456 61727 63377
189 63377 41592 8588 415 16271 19090 -2807 -12809 7204 20099 -10012 -59671 -82127
201 -82127 -73409 -61918 -53392 -37347 -19969 -15095 -18635 -16692 -15108 -26490 -34291 -13337 23003
214 23003 35966 23010 23840 49851 63895 41589 11169 7526 24668 35701 38899 45473 48592
227 48592 35569 14569 -511 -16304 -39381 -50101 -30349 -4919 -9106 -34573 -43096 -28192
239 -28192 -24161 -44607 -59767 -46385 -20212 -5304 1458 11040 17193 12702 7466 8357 6989 1514
253 1514 10361 42210 68259 60279 33193 23884 30872 25240 1910 -10156 1968 17094 15250
266 15250 3102 -6787 -17223 -31606 -39869 -39789 -42310 -47382 -37221 -9112 6790 -7421 -29478
279 -29478 -29390 -13848 -10766 -18765 -12109 15070 37476 39256 31682 25444 20140 15158 17872 24986 25352
294 25352 20569 26504 41350 38812 10405 -17115 -19197 -10674 -15585 -28251 -25810 -8994 -883 -10846
308 -10846 -26340 -36315 -40889 -39774 -28893 -15205 -9638 -7841 4419 19639 17069 -3284 -13653
321 -13653 1046 21182 24836 20688 27765 42318 44250 29861 13089 3870 -231 1144 8774 13346
335 13346 7705 -836 -421 882 -14092 -38654 -46212 -30201 -13882 -14459 -20548 -15101 -4889 -5687
349 -5687 -16974 -24398 -22182 -12905 460 15749 24012 21219 17949 22717 25762 14762 -131 2389
363 2389 22162 35200 28361 17072 15001 15045 5569 -10487 -19589 -19583 -13653 -5839 -418 -4375 -15869
378 -15869 -23275 -21103 -19620 -28577 -35665 -23866 -718 10857 4530 -2868 75 5392 3130 -1417
392 -1417 777 10099 21808 31151 34166 26489 13830 7583 9997 9700 519 -5211 4145 17958 16764
407 16764 -4 -14425 -17183 -16466 -20972 -25773 -23332 -14947 -6482 -1408 -3730 -13463 -22180 -19871 -9851
422 -9851 -3486 -5089 -1877 13000 26893 24687 10994 3345 6487 12171 12254 10929 14105 20087 23549
437 23549 20742 10702 -3671 -13641 -11471 -3649 -2477 -8614 -9827 -2626 1265 -9039 -24544 -29824
451 -29824 -22602 -14387 -11989 -9879 -5084 1831 6410 6156 -556 -8153 -7774 3495 16367 20207 16778
466 16778 17045 22955 22257 9991 -2937 -3557 5379 11715 10255 5884 3504 3068 794 -5629 -15323
481 -15323 -23124 -22114 -12436 -3943 -4875 -10539 -10563 -6294 -7423 -16292 -21783 -14111 1436 12060 13005
496 13005 10111 8911 9757 10390 8247 4119 2620 8586 17843 21817 15984 7933 5701 7220 2451
511 2451 -8561 -14492 -8269 2834 6554 844 -8178 -13983 -16072 -16686 -17606 -18553 -15008 -5704 3692
526 3692 5114 -1960 -6963 -3372 3489 4006 -489 -443 8812 19406 22240 16213 8616 4689 4002 4076
542 4076 2954 2559 6089 12799 14985 7139 -6456 -14625 -12865 -7954 -8276 -13140 -13619 -7375 -2144 -3246
558 -3246 -9918 -14117 -13218 -8914 -5357 -3887 -885 5664 14316 16706 9222 -937 -4603 2054 10111
573 10111 12510 10652 10871 14002 14305 8005 -602 -4437 -2771 489 268 -3302 -6336 -4261 -762 -2126
589 -2126 -10916 -20527 -21711 -13583 -5250 -2304 -1880 -148 3400 2685 -3210 -8004 -6052 2257 10913 13231
605 13231 9878 6850 8710 12203 11180 4529 -1280 435 6796 10199 8184 4408 3120 2284 -2638
620 -2638 -11798 -18146 -16078 -7589 -500 -316 -5674 -10215 -9714 -6710 -6376 -8792 -8312 -2015 5396 7675
636 7675 4724 2727 4593 7994 6342 1175 -1513 3055 12472 18385 15981 8429 2631 772 200
651 200 -2344 -5222 -4385 525 3716 -228 -8076 -13067 -11474 -7718 -7625 -10989 -11913 -6716 959 4617
667 4617 2234 -2611 -4989 -2832 -668 -577 551 6089 13566 16543 11937 3788 -113 2727 7714 8366
683 8366 4845 3262 4939 6238 4417 -2178 -8143 -9308 -7368 -7085 -8938 -9558 -5581 277 1598 -4437
699 -4437 -11846 -13761 -8780 -2112 1216 1177 2285 5244 7196 4901 488 -1076 3171 8989 10508 8098
715 8098 6145 8133 11318 10086 2862 -4571 -6495 -2963 796 285 -1952 -2615 -2238 -3650 -8816 -14336
731 -14336 -14043 -7637 -1154 51 -2738 -5472 -3021 50 175 -2865 -4578 -1566 4922 9002 8969 7611
747 7611 7948 9781 8351 3332 -1032 -348 5647 10471 8645 2882 -1749 -2697 -2695 -4691 -8092 -9372 -5789
764 -5789 -1415 -1072 -4470 -7321 -7118 -4569 -4580 -7633 -9239 -5667 1805 7116 6279 2371 777 1983
780 1983 4005 3932 2697 4691 9661 13011 10943 4982 369 344 2284 1528 -1559 -4099 -2095 1641
796 1641 2197 -2040 -7330 -9434 -7769 -6708 -7525 -7878 -5606 -303 2190 26 -5176 -6673 -3680 944
812 944 2694 2814 3416 6574 10192 9218 5262 1420 1686 4537 6112 4163 2295 3262 5719 5142 613
829 613 -5794 -7940 -5669 -2860 -2337 -4047 -4605 -2782 -1961 -4092 -8568 -10168 -7129 -2074 491 -121
845 -121 -591 1601 4857 5064 1765 -1207 -13 4589 8245 8060 6034 5401 6546 6118 2467 -2256 -3472
862 -3472 -306 3059 3154 -372 -3229 -3097 -2484 -4169 -7913 -10136 -7771 -3101 -368 -1755 -3642 -3286
878 -3286 -1395 -491 -2162 -3931 -2090 2821 7397 7788 4796 3085 4080 5308 4087 1242 910 3579
894 3579 7093 6752 3300 -520 -1866 -910 -1779 -4469 -6537 -4966 -1329 529 -1715 -5658 -7191 -5653
910 -5653 -3767 -4478 -5300 -4095 737 4402 4112 1471 -701 472 2914 3790 2669 2338 4835 8536
926 8536 8558 5080 789 -359 1246 1977 445 -1645 -1183 1175 1987 -1019 -5354 -7701 -6713 -4246 -3524
943 -3524 -4744 -4593 -2324 702 458 -2686 -5143 -3746 -114 2877 2296 1964 3980 6144 6869 4465
959 4465 837 6 2585 5227 4987 3128 1986 3152 3792 1164 -3426 -5964 -4474 -1829 -906 -2402
975 -2402 -4323 -3438 -1905 -2779 -5387 -7186 -5943 -2358 552 826 -190 -257 2038 3506 1974 -403
991 -403 -504 3075 6482 7049 4919 3302 3581 4230 2638 -159 -1938 -865 1787 3145 837 -2280
1007 -2280 -3371 -2627 -2607 -4915 -7104 -6570 -2998 -21 -339 -3032 -3846 -2467 -689 -1230 -2179 -1802 1461
1024 1461 4921 6029 4222 2091 2230 3765 4264 2780 974 2230 4877 6308 3738 -142 -1556
1039 -1556 -1293 -915 -2357 -4081 -4016 -1652 -124 -1105 -4138 -6421 -5490 -3423 -2423 -3254 -3380 -1005 2129
1056 2129 3021 1194 -949 -618 1637 3331 3223 2348 3528 5591 6959 5052 1517 -343 278 2050
1072 2050 2164 137 -697 213 995 -67 -3642 -6156 -5220 -3405 -2383 -3284 -4065 -3065 -997 -295 -1738
1089 -1738 -4318 -3864 -1451 1962 2770 1840 2021 3727 5095 3701 1115 -16 2483 4740 5554 3802
1105 3802 1947 1629 2345 2216 -799 -3144 -3582 -1699 -179 -848 -2984 -3665 -2612 -2398 -3759 -6071 -5885
1122 -5885 -2715 398 924 -215 -911 -227 1201 1614 433 -139 1648 4531 5674 4505 2666 2245
1138 2245 3680 3485 1566 -806 -687 1650 2954 2172 -788 -2586 -2609 -1875 -2626 -3941 -4174 -2401 -590
1155 -590 -424 -2229 -3405 -2750 -1414 -313 -1158 -1624 -288 2395 3780 3197 1620 775 1870 2700 2444
1172 2444 1454 1884 3375 4441 3418 623 -1759 -1469 48 174 -1069 -2579 -1535 -521 -731 -1979
1188 -1979 -4055 -4121 -2756 -1682 -1879 -2485 -1873 362 1729 1025 -934 -1873 -370 2168 2692 2345 2034
1205 2034 2874 3887 3387 1571 99 576 2087 2381 1161 -338 -591 561 996 -880 -3376 -4525
1221 -4525 -3008 -1214 -1100 -1939 -2106 -1574 -663 -1628 -3109 -3307 -1576 868 1963 1069 391 1096 2209
1238 2209 2614 1573 534 675 2373 3509 3006 1778 1529 1912 1558 78 -1779 -2242 -799 987 797
1255 797 -1018 -2551 -2749 -1594 -1884 -2766 -3585 -2581 -509 250 -419 -1631 -1039 480 1039 540 -414 -149
1273 -149 2098 3876 3740 2383 1288 1047 1759 1506 515 193 1210 2255 1855 -262 -1949 -1645 -1145
1290 -1145 -512 -1818 -2738 -2755 -1167 -274 -725 -2238 -2967 -1787 -881 -881 -1242 -695 1145 2738 2084 762
1308 762 -358 511 1928 2577 1998 1119 1995 2924 2819 1305 -347 -597 185 542 -358 -1184 -1315 -272
1326 -272 245 -801 -2911 -3638 -3025 -1469 -693 -1198 -1543 -746 611 213 -892 -1382 -850 1243 2261 1864
1344 1864 947 1067 2512 3022 2074 325 -122 839 1887 1915 843 5 448 919 -505 -2024 -2827 -1903
1362 -1903 -485 61 -1078 -2218 -2112 -968 -827 -1775 -2301 -1807 -96 913 879 -153 66 1347 1956
1379 1956 1258 150 67 1639 3125 2916 1781 715 715 1112 890 -222 -1082 -690 489 717 -357 -2035
1397 -2035 -2236 -1227 -981 -1818 -2907 -2336 -1079 343 33 -866 -1479 -736 29 152 -379 -205 1206 2619
1415 2619 2778 1364 677 686 1410 1905 1341 218 718 1484 2112 1014 -779 -1337 -975 -219 -728 -1935 -2125
1434 -2125 -798 -51 -481 -1858 -2557 -2084 -984 -222 -787 -888 -93 921 1919 909 -212 -205 1136 1959
1452 1959 1550 1177 1067 2180 2534 1835 -54 -710 55 1093 778 -74 -720 -473 188 -493 -1332 -2578
1470 -2578 -2454 -992 -375 -782 -1628 -1548 -572 192 -628 -1458 -1210 278 1350 1437 805 685 1262 2019 1792
1489 1792 546 14 681 2030 2099 1312 329 187 516 484 -688 -1714 -1715 -474 190 -395 -1159 -1845 -1399
1508 -1399 -828 -1083 -1971 -1958 -620 610 687 -58 -468 -103 1092 1013 348 19 830 2088 2605 1786 864
1527 864 472 941 1151 553 -55 -445 323 1362 603 -1025 -1639 -1301 -735 -1019 -1883 -1880 -952 -160 8 -729
1547 -729 -1414 -1172 -313 107 67 -451 74 1515 1973 1501 150 -89 949 1721 1219 433 312 1310 1524
1566 1524 1140 82 -887 -852 -259 19 -767 -1221 -1041 -238 84 -1017 -2135 -1883 -901 101 -218 -797 -281
1585 -281 423 821 767 -251 -517 252 1390 1616 1086 534 1078 1925 1561 469 -489 -422 795 1242 50
1604 50 -482 -518 -56 -490 -729 -2018 -1961 -1179 -366 -285 -1064 -1130 -812 -92 3 -885 -1342 -515 846 1288 642
1625 642 156 897 1362 1383 762 155 138 1123 1910 1514 205 -301 3 549 299 -1154 -1414 -589 374 -36
1645 -36 -1200 -1460 -1321 -895 -639 -1401 -1603 -1014 136 635 245 -356 -635 152 1216 592 -19 246 1306
1664 1306 1941 1525 441 108 503 826 446 -221 -159 6 393 783 -210 -1279 -1533 -727 -357 -912 -1482
1683 -1482 -1195 -114 173 -565 -1301 -1240 -253 82 21 -64 85 790 1304 1424 684 135 373 1154 1549 1109
1703 1109 -144 512 1172 1416 163 -1033 -889 -6 137 -329 -903 -880 -621 -329 -549 -1105 -1729 -1293 -298
1722 -298 225 -481 -791 -32 925 596 -570 -439 303 753 1490 1290 552 578 979 1289 936 130 -427 155
1742 155 902 799 -50 -846 -204 602 -162 -1271 -1717 -881 -194 -265 -423 -742 -812 -191 -101 -342 -790 -669 72
1763 72 1225 933 47 -234 707 1161 493 -239 0 649 1363 1218 484 266 13 419 304 -168 -849 -844 -72
1784 -72 407 -212 -1131 -1409 -631 -94 -466 -1446 -1173 288 264 196 -277 -304 118 477 388 359 246 381 1137 1338
1806 1338 1189 -148 -136 755 910 509 -447 -78 704 538 -6 -597 -756 -1020 -396 -351 -811 -1172 -810 -24
1826 -24 283 -578 -1515 -950 241 383 -426 -595 636 967 821 21 125 176 723 947 1138 665 -42 482
1846 482 1007 1228 -74 -899 -189 447 444 -462 -793 -368 -2 -503 -973 -1068 -719 -575 23 145 -434 -463 -273
1867 -273 566 234 -282 -442 102 1199 994 137 86 1038 962 358 181 -24 298 465 537 548 -77 -477 -138
1888 -138 214 -43 -1271 -1012 -366 337 -352 -1161 -801 -540 -24 -491 -841 -656 -171 366 579 488 63 -73
1908 -73 439 963 490 -411 48 1059 1520 725 -398 138 570 450 -248 -208 -56 -68 -53 -311 -423 -732 -1169
1929 -1169 -443 132 -651 -1128 -688 373 635 -467 -933 -562 388 342 106 98 226 532 601 801 206 -63
1949 -63 434 755 868 128 -467 -20 1109 612 -605 -958 -576 -3 -234 -269 -646 -477 -235 -168 -423 -606
1969 -606 -1103 -610 362 413 -137 -577 190 847 655 -286 -65 456 974 777 429 241 451 605 511 636 -277
1990 -277 -436 -3 630 555 -525 -863 -290 233 -379 -952 -976 -234 160 -225 -723 -234 -368 197 46 -93
2010 -93 -292 -155 297 878 822 -62 -94 697 1070 316 -285 148 1014 648 364 -52 -135 12 183 -5 -470
2031 -470 -377 -663 130 278 -284 -907 -867 -151 98 -591 -1059 -376 368 471 159 -266 295 77 468 500 412
2052 412 21 565 1016 927 539 -260 -137 562 791 -157 -750 -47 494 268 -306 -646 -612 -244 -153 -345 -533
2073 -533 -516 -524 16 318 -599 -1103 -191 388 541 -39 -125 325 875 668 160 -34 394 400 692 477 371 -97
2095 -97 235 519 544 -430 -828 -129 136 127 -870 -894 -259 265 -387 -518 -720 -734 -112 -73 190 -373 -150 -85 676
2118 676 466 -398 -303 524 1236 706 -159 182 723 798 389 -38 3 290 411 111 58 -184 -484 -299 -51
2139 -51 -403 -1040 -666 132 417 -233 -962 -429 179 6 -564 -424 48 128 205 521 328 67 239 695 814
2160 814 258 -122 240 773 834 362 -310 -67 -9 434 -464 -739 -298 -123 -171 -397 -630 -723 -419 -394 -41 -523
2182 -523 -687 -316 184 363 -362 -452 46 695 294 -73 117 411 682 488 529 201 -10 150 664 494 -387
2203 -387 -445 -52 173 171 -716 -1145 -131 -169 -587 -691 -522 -251 25 -20 -393 -551 -589 -29 39 36 -176 -173 545
2226 545 834 634 -346 -91 608 540 480 12 66 424 461 173 37 -357 -146 183 6 -156 -341 -486 205
2247 205 70 -514 -761 -651 93 266 -165 -221 -356 32 115 199 -114 -146 201 326 832 176 10 131 642
2268 642 819 -8 -202 -132 439 509 -41 -216 -387 -68 -291 -473 -317 -552 -352 84 169 -566 -671 -233 -91
2289 -91 233 -465 -578 -112 408 645 39 -260 98 475 497 235 97 28 463 826 416 352 -333 -44 335
2310 335 42 -312 -677 -66 -11 52 -656 -448 -399 -102 -408 -134 -157 -167 42 80 92 -199 -249 1 713 163 -160
2333 -160 59 531 484 347 -68 70 413 712 524 -3 50 106 105 274 97 -380 -493 -148 301 -278 -610 -600
2355 -600 -130 184 36 -778 -455 168 131 -193 -150 -232 -77 585 417 137 -61 118 355 483 403 -87 251
2376 251 267 472 -283 -316 -180 50 525 -8 -409 -243 -313 81 257 -402 -446 -149 -14 257 -142 -400 -62
2397 -62 213 215 -45 -314 119 320 396 482 401 122 243 277 161 63 -233 216 362 84 -116 -425 -249 -11 12
2420 12 -481 -421 -165 133 158 -182 -448 -612 -270 14 23 -581 -325 206 280 332 -173 -118 299 624 438 151 189
2443 189 229 631 414 70 -142 -133 239 324 39 -200 -186 263 117 -37 -551 -469 -237 -33 -66 -186 -404 -34
2465 -34 243 -94 -119 -303 45 255 338 244 -310 109 301 725 24 -290 -15 57 497 335 -4 -2 -18 205 -31
2488 -31 -304 -415 -85 -56 61 -140 -453 -278 -41 176 -508 -239 -234 247 190 -153 -255 -43 433 372 185 4
2510 4 -70 282 551 354 93 26 229 428 70 -66 -446 -25 210 276 25 -119 -458 44 -71 -444 -305 -260
2532 -260 -131 22 -226 -202 -415 52 15 3 -92 94 207 254 276 200 -11 381 627 296 246 -70 101 337 190
2555 190 -111 -305 -277 254 -111 -143 -484 -94 29 165 151 -535 -240 -196 365 132 -11 -260 -89 29 155
2576 155 44 -42 76 129 319 315 123 35 539 453 -20 -175 -147 179 364 -188 -183 -133 -98 -161 60 -269 -195 -410
2600 -410 -143 -29 -207 -256 -119 -124 152 -219 -477 -150 72 464 301 105 -23 161 278 324 -187 -176 31 226
2622 226 389 8 8 -141 16 -56 -271 -119 -108 -8 255 -164 -375 -118 86 -24 -96 -194 -125 212 268 -6 -124
2645 -124 -205 261 336 322 -10 -78 -30 443 359 -99 -21 -146 207 336 -22 16 -290 85 233 34 -101 289 -29
2668 -29 213 117 -133 -390 -173 95 -18 -370 -310 82 81 19 -62 16 -228 406 376 93 -43 100 263 106 75
2691 75 -182 22 47 362 291 -299 -316 -103 272 -34 -216 -114 -32 79 2 -264 55 -353 54 14 93 -288 -150
2714 -150 172 321 86 -72 7 241 137 287 -2 179 -23 168 248 216 -53 -85 265 -47 -99 -126 -215 -143 179
2737 179 21 -355 -410 38 250 -196 -372 -316 -56 216 45 -158 -101 50 384 290 -11 -216 -10 239 428
2758 428 197 -206 -179 153 224 18 -115 -356 -131 239 -136 -185 -139 -136 144 79 -18 -190 0 299 164 -91 -319
2781 -319 13 182 81 -58 -136 -58 100 103 270 -130 136 226 193 204 -122 -528 116 291 -68 238 -147 -72 34
2804 34 -121 -226 -4 -378 145 0 160 49 -34 -118 158 -50 -305 -73 200 314 -80 -25 -190 166 307
2825 307 192 -187 -193 -103 259 116 -325 56 -142 -88 77 89 -333 -542 -102 225 -30 -156 -274 45 37 -8 37
2848 37 -53 40 50 146 -151 -101 34 109 531 -44 -213 -38 135 434 26 -114 147 5 221 -104 -142 31 270
2871 270 279 -285 -116 -132 36 -82 -97 -296 -347 -29 132 37 -51 -71 -207 291 269 43 -146 -149 71 1 -187 -30
2895 -30 -71 265 226 33 -60 -226 289 69 286 -57 21 -71 39 122 -98 230 -118 56 -54 62 -258 -55
2917 -55 4 201 -101 -363 16 -266 3 243 -347 -49 283 204 307 -16 54 177 48 288 -161 -6 227
2938 227 83 237 -9 -406 -296 38 159 -130 -67 -216 -115 -60 158 -311 -102 -14 285 141 -41 -231 -117
2959 -117 -4 75 6 -280 73 0 319 -15 -128 93 6 28 -137 -70 -106 1 187 11 -19 -351 -56 48 107
2982 107 -159 -64 -36 151 263 -115 160 -109 146 285 195 -161 -181 221 112 50 -188 -219 242 144 250 250 -85
3005 -85 139 -73 110 45 -305 -147 249 162 -14 13 43 31 15 125 -343 -207 -175 190 -47 175 -229 -22 208
3028 208 -23 -54 -300 -59 128 -230 28 21 -93 -59 345 89 -260 -118 11 225 236 -515 -197 191 115 -248
3050 -248 -65 -12 150 101 200 -155 -53 -112 149 348 -205 -36 -13 114 450 210 -50 104 110 99 18 89 359
3073 359 141 275 7 -158 23 -59 -68 185 -163 22 -36 25 86 -145 -162 0 141 98 119 -185 119 96 -28
3096 -28 8 143 77 88 5 50 7 277 9 119 -41 125 -7 -17 -19 98 -87 -5 -45 -46 18 111 -61 -59 6 -282
3122 -282 108 -204 -214 -50 18 54 -193 -342 163 220 -22 94 -496 22 19 -211 -19 39 194 260 -101 -163 -388
3145 -388 82 -105 172 128 -36 -107 23 61 -16 60 -121 -138 149 89 -135 -68 3 57 104 -230 -468 -50 77 119
3169 119 -127 -218 -34 214 -141 140 -194 -444 146 94 302 -135 -81 27 277 55 -201 -310 -137 131 -7
3190 -7 -101 -128 -94 372 61 -274 -201 -170 -307 -198 -201 -130 117 99 -148 -143 -15 15 -37 175 427 -225 -109 -45 184
3215 184 -119 132 134 -15 -252 160 -158 -51 -106 261 66 -204 -116 -181 18 240 -107 -222 -9 93 114 120 -33
3238 -33 -108 -89 38 -135 5 -30 4 205 141 -32 -20 -175 -69 -28 -156 105 -91 247 -26 39 -145 -188 -285 -207
3262 -207 -108 -83 -25 200 -139 7 22 19 -10 64 200 -26 -196 -325 -125 36 -86 -40 37 284 266 269 -80 57
3286 57 54 33 46 -210 -51 3 142 117 -23 -147 -16 82 172 -215 -20 -119 76 -35 -222 9 -126 11 -96
3309 -96 -15 -164 -82 123 429 186 12 -34 310 -130 329 105 144 244 303 73 15 167 82 48 55 209 -290 -384
3333 -384 -120 -66 13 49 -108 87 175 -3 -7 -79 31 47 90 -334 -312 70 141 -149 156 -114 -156 15 85 52 3
3358 3 -23 69 172 -42 -107 3 -82 -109 123 -177 62 -108 -89 188 56 -229 76 35 20 135 -195 -374 -44
3381 -44 19 97 -65 5 67 12 2 53 -49 94 281 -85 169 -106 286 289 77 162 -392 42 72 288 -90 -158
3405 -158 -219 -456 -59 -40 -69 -135 21 -20 182 99 -165 161 -227 28 -75 -35 176 125 251 -177 -53 82 183
3428 183 -5 59 -117 82 104 -20 -212 -13 -118 -73 -90 -122 5 33 -38 31 -13 -197 -36 -158 13 37 132 90
3452 90 242 -43 220 24 119 171 229 85 -97 87 203 -4 42 -309 109 53 23 21 -85 -104 -115 -161 56 43
3476 43 -78 -208 6 148 21 10 -305 120 -30 -137 190 -158 -158 118 -180 98 47 -20 246 127 247 126
3498 126 -33 -170 238 -63 -202 38 -27 -31 160 -91 30 -240 0 -143 -163 -107 -173 47 55 135 -45 -195 47
3521 47 181 28 -111 25 96 48 15 128 94 312 42 -138 -147 273 -266 -101 1 -103 -26 35 250 -44 -150
3544 -150 -209 -99 -93 -139 -132 114 -387 -219 177 32 38 -49 -211 32 -112 69 143 0 -152 48 3 -126 102 8
3568 8 245 166 87 -95 -21 8 192 -323 -194 -202 97 -131 63 -256 33 68 14 216 -226 -113 -17 185 -98 -49
3592 -49 -103 -51 37 -48 119 -1 125 -18 73 183 -63 -20 400 -75 34 -106 -238 -19 34 74 -290 -250 57
3615 57 86 -56 -168 108 89 127 -124 -42 262 -143 -328 129 -116 -82 -89 144 97 -110 126 61 131 311 40 164
3639 164 -128 -53 84 -113 -331 -82 151 -82 -20 45 -212 -145 -34 -87 280 66 48 -58 335 18 118 -105
3661 -105 -197 -275 196 100 180 237 200 155 -176 -171 179 178 -148 3 22 -23 5 -149 -88 99 29 109 -45 210 117 -146
3687 -146 -48 135 -214 -198 -135 128 14 15 -202 -60 342 -71 77 9 113 -125 49 -115 -126 -90 -157 -124 9
3710 9 -292 246 -105 123 -16 153 54 -55 -331 -37 -48 -33 -83 223 -23 102 63 -96 31 -178 132 31
3732 31 -43 -282 -19 50 187 -135 -8 106 -64 -22 -30 66 97 -72 -85 -192 1 -31 -23 24 -262 -24 46 81 329
3757 329 -126 -138 -68 71 83 -266 11 146 10 26 194 -76 -108 143 -108 15 -45 -49 153 -154 51 31 -95
3780 -95 -122 128 -265 22 100 86 255 -160 -61 -272 7 -223 208 -35 67 -276 -70 -80 -151 -54 -44 239 38
3803 38 64 26 137 -38 -99 -51 -58 125 -343 -30 4 38 -10 27 -41 53 -269 -95 -170 -197 156 -64 31 90 -64 270
3829 270 174 -61 29 -20 -141 92 54 -382 34 -227 -14 36 -80 -6 -96 -16 -57 -102 -43 -57 154 54 14 21 -22
3854 -22 149 -17 25 -29 -151 -192 139 -27 222 -25 237 -122 162 -35 -42 -136 -10 -2 35 -82 -126 -107 13 -87
3878 -87 173 -143 -6 -70 79 -19 -196 133 -39 -117 -277 65 120 -107 -95 15 82 120 178 -50 -159 52 145
3901 145 -270 -218 -39 -47 43 201 126 -101 -40 62 51 -143 260 -61 177 116 -110 -158 -215 -267 128 -94 57 -150
3925 -150 -2 -6 161 175 -146 87 -104 -16 29 -198 105 -270 184 136 -246 -179 -179 122 -145 -41 88 61 -123
3948 -123 112 -87 -25 78 -95 67 -237 187 -80 -138 106 239 85 -75 416 -18 109 78 -55 109 -176
3969 -176 39 -204 -101 201 -108 132 -105 -390 190 157 5 -132 -134 -115 -143 -12 216 7 141 -32 -168 -3
3991 -3 -79 180 286 -139 61 -172 0 52 -5 -86 173 53 61 62 139 106 125 125 62 29 -201 -131 -61 85 -89 47
4017 47 -246 58 -11 -18 180 73 -182 156 342 52 -71 -157 -78 -152 187 181 -153 -131 -106 48 49 206 -29 -23 313
4042 313 32 -274 -117 -47 65 213 114 -69 65 -98 -66 38 -71 -137 25 176 103 -158 -175 -44 -38 211 -62
4065 -62 141 -74 -192 -130 223 104 -98 112 -12 50 -64 159 372 -18 -19 97 -107 -20 -96 -245 -103 -119 23
4088 23 146 -77 -28 -86 94 -3 -141 -126 11 -208 -149 177 146 55 16 134 -117 59 -44 -148 -108 -84 72 90
4112 90 -300 272 -65 -101 -45 -22 59 97 -154 -421 106 18 44 187 -39 67 -42 111 312 131 242 -51 -190
4135 -190 70 -6 -368 -74 -40 -96 164 3 -287 102 -4 14 -187 89 -66 15 -23 19 83 -76 180 -33 276
4158 276 199 192 21 -65 -99 50 -184 -232 51 165 58 -90 -12 -228 227 -15 -216 34 -58 57 -215 89 -199
4181 -199 -2 -92 -213 33 116 -114 -7 -176 -351 -99 -98 -46 49 69 -124 1 -106 75 192 90 -121 -106 -28
4204 -28 -100 154 38 -158 159 170 -248 -105 233 51 256 -8 -63 -24 -137 261 73 103 -27 17 60 -93 107
4227 107 139 -100 -12 -153 -113 38 154 216 -70 -136 82 -80 56 -188 -254 320 175 -47 -84 25 -87 -83 105
4250 105 -130 27 11 46 -30 132 -68 53 85 22 29 91 86 -210 21 237 -71 -284 40 182 177 -116 -72 6 -56
4275 -56 105 89 -61 132 64 54 19 43 -36 2 -76 20 -122 1 128 335 -144 206 2 -112 222 73 -37
4298 -37 -288 -230 -26 121 -206 218 14 257 209 91 83 -6 20 -33 -28 -16 -76 115 291 -252 -112 84 113 -41
4322 -41 -67 -3 69 42 94 -124 341 87 5 117 -115 -144 -21 -116 -65 -153 -105 -124 -166 -216 17 -212 291 34 -36
4347 -36 107 -186 41 344 13 -40 326 -182 89 114 -35 48 -71 -38 38 185 193 -70 165 -51 -314 -2 29
4370 29 39 -249 -202 84 43 -3 187 -55 -200 81 248 -121 105 -144 -61 71 284 -79 -64 -35 -162 -81 -9
4393 -9 8 -228 100 84 31 -91 56 121 250 -46 97 71 -69 63 -76 46 203 -77 -246 -163 310 39 93
4416 93 139 229 -43 -202 -46 -157 55 -17 -386 137 -182 -43 63 85 217 -44 -226 77 -231 -119 78 -249
4438 -249 185 -127 186 76 -177 -131 -87 37 -409 -93 8 -132 53 -28 54 105 165 -130 -150 89 253 -38
4460 -38 -5 -362 -171 125 55 -72 142 110 35 -107 -172 -244 56 74 -23 46 68 -62 484 237 58 41 202 -12
4484 -12 -81 110 131 -109 -217 -113 -154 73 -118 85 130 -84 -244 31 -69 121 21 -122 56 155 -169 -286
4506 -286 173 32 216 4 -146 -245 132 5 153 58 14 231 -73 197 -214 -8 -99 66 230 24 -172
4527 -172 -61 27 85 79 203 -153 92 57 -242 62 101 71 -101 55 -35 63 168 -327 -137 2 78 -105 91
4550 91 -96 -148 81 -41 -25 -22 -28 -32 61 128 -392 149 -52 151 -68 151 -19 -139 171 227 -43 -41 15 10 288 109
4576 109 -15 17 109 53 231 -23 -58 74 296 -252 -148 -236 98 -74 -170 110 -236 -79 140 -84 -81 69 103
4599 103 -99 87 -88 24 -245 -100 -301 -68 -324 -83 296 148 73 26 -77 -37 25 -102 -292 106 112 285
4621 285 -179 -155 142 -93 128 298 -46 254 -42 121 45 -113 59 193 26 -143 36 25 -18 -178 -143 86
4643 86 124 117 -25 -91 37 -253 -230 -103 -72 -49 -139 11 12 -38 -102 118 178 -124 76 43 272 -20 -205 -135 -50 98
4669 98 149 -28 271 194 16 -15 39 263 -64 67 41 -93 146 -106 178 57 157 126 -40 -57 128 39 -105
4692 -105 161 171 12 -331 17 31 -150 195 67 -274 180 0 1 -226 -21 -4 161 94 276 81 -29 124
4714 124 41 244 -156 -268 -290 185 -68 223 225 24 301 -35 32 245 177 -35 -219 69 56 -140 111 337
4736 337 -217 88 -33 103 71 100 -37 107 -182 -22 204 -34 249 86 -26 -119 -129 -41 -14 104 197 6
4758 6 147 64 -48 -21 36 -120 145 112 112 -105 70 12 11 0 99 -145 72 -74 115 114 13 -103 -101 41 -60 47
4784 47 -130 68 172 54 -291 76 105 -157 48 78 -3 25 122 -116 188 -42 -179 -223 170 -93 -323 96
4806 96 117 -12 151 -179 -61 195 102 -163 -264 -192 -60 -55 256 -28 -185 102 9 6 -80 -143 104 46 -223 147
4830 147 31 -10 210 129 23 304 117 45 -252 91 10 -103 -12 -37 49 22 -202 19 -16 -306 37 337 -143
4853 -143 49 -106 -59 -5 -149 172 -91 -57 51 -27 138 195 158 -13 156 64 -110 84 116 72 -70 -268 -176
4876 -176 -129 309 -120 -119 61 123 -76 -6 -119 1 -138 149 14 226 100 -18 327 40 180 121 68 -21 -26
4899 -26 206 262 181 271 -24 -78 -169 17 347 44 -72 7 84 154 -115 -287 166 142 80 77 28 138 -88 -90 41
4924 41 -127 46 160 197 13 -4 -16 74 -110 -113 -458 -179 27 -194 51 -45 -127 76 10 38 -46 297 -7 72
4948 72 -50 127 -29 -60 113 26 -33 -68 152 -69 167 24 84 52 -132 185 109 245 236 -6 18 68 36 -193
4972 -193 59 39 201 -7 -128 -38 145 53 223 275 74 -81 -83 -177 -185 169 133 -124 258 56 41 14 90 -173
4996 -173 0 -159 -43 -11 -15 17 -44 -19 79 -77 -92 -139 52 -86 8 -50 -189 -112 -162 25 -96 -80 102 56 -25
5021 -25 82 -61 -311 -193 -10 -162 -314 6 -170 135 -39 -160 -180 -181 95 -133 41 92 12 -297 -87 -104
5043 -104 -199 -67 -102 -209 -87 -26 -318 366 68 -106 88 18 84 124 35 134 172 9 -44 139 155 1 102 -5
5067 -5 -126 99 -90 -170 23 -61 214 -82 -86 -195 11 -295 -31 207 130 178 -42 -38 97 169 271 -197 59 -54
5091 -54 82 208 -50 272 148 -342 -102 112 -123 67 204 -231 128 123 18 -62 -165 -4 135 3 87 -26
5113 -26 -329 70 -240 46 -129 151 -130 106 -46 -24 -82 -44 -155 104 21 179 -128 84 -113 37 -147 -18
5135 -18 167 142 -38 94 -8 16 159 -81 -100 111 -179 -10 103 -75 -35 -108 -224 -89 102 314 -37 -118
5157 -118 314 7 1 164 12 35 139 -133 96 90 -43 -117 -191 -14 172 55 -6 174 12 111 203 38 150
5180 150 96 -38 39 59 -49 149 -31 58 -56 60 134 -5 79 -108 -258 180 147 -81 -179 -232 46 -10 159
5203 159 -67 -26 -7 -32 -46 -81 -35 -138 114 5 -159 -72 -112 -205 -143 -46 -91 50 44 75 4 221 -38 -98 -197 108
5229 108 -91 142 155 14 -51 162 43 94 -5 52 192 157 43 -60 139 72 94 -87 318 23 297 -210 -10
5252 -10 -91 -217 -79 -254 172 -25 -41 -24 270 170 -368 -35 -27 4 -12 63 224 -58 -142 -120 107 36 58 71 148
5277 148 37 171 100 12 46 163 112 97 75 30 -49 -23 125 124 133 -216 18 13 128 220 -104 31 162 -69 28 -128
5303 -128 117 28 -445 -118 -213 17 -145 -284 164 -25 205 81 22 -16 69 45 70 -231 177 -122 72 134 -255
5326 -255 63 258 171 -103 -223 -165 90 13 162 69 -60 -61 302 -51 -82 -88 113 19 -89 37 13 319 -3 20
5350 20 -67 -131 -12 120 -83 -63 -73 -36 165 -171 21 -134 -14 127 -59 -207 -78 -148 -149 -116 60 121 79 -273
5374 -273 136 -79 66 -94 111 205 84 62 9 -70 124 7 -39 223 1 -192 -175 -8 -96 -107 162 134 54
5397 54 -149 -248 135 -17 -169 -83 147 132 145 -52 -154 -340 -34 320 -81 -199 121 -95 330 -141 157 17
5419 17 -264 -161 150 159 -103 -26 257 0 -46 -236 -18 379 -75 -44 49 316 -36 7 -12 -284 -3 77 63 58
5443 58 -72 7 -82 -9 -250 -60 78 -165 90 -28 -89 91 -211 -42 94 -94 0 211 341 41 64 -273
5465 -273 -68 -97 -176 245 -58 114 87 -176 -17 59 -113 108 -78 -78 -143 175 5 -115 300 77 -281 164
5487 164 -258 12 153 126 83 -26 126 -235 -149 41 -262 53 128 8 70 40 -41 -132 -92 113 13 -46 274
5510 274 130 396 88 -249 149 182 16 310 -35 90 48 89 45 -101 16 -41 -12 -50 62 -68 -26 -28 -74 18
5534 18 68 101 168 -109 169 -185 -251 -73 -35 13 257 201 -92 -35 82 225 102 59 -70 197 -44 4 5 -54 25
5559 25 -303 45 120 200 1 -78 78 -10 273 59 -60 -99 255 28 161 23 179 42 118 114 -5 144 120
5582 120 -34 24 154 105 -14 -22 92 -135 58 -189 93 94 126 37 -164 255 -367 15 125 -65 -2 -113 -12
5605 -12 -26 -121 -100 46 -205 -10 93 -69 64 -121 -132 -77 -17 -36 -193 -276 -166 -1 124 -54 78 -27 184
5628 184 -204 -73 -102 -122 -190 -14 -83 -20 85 -99 -19 -58 60 2 92 186 264 263 -74 -210 -49 -265 -66 -123 2
5653 2 21 -96 -85 -116 129 145 0 -146 -62 163 69 65 -113 -75 138 -323 -18 -99 46 318 -124 158 -126 193
5677 193 -143 57 -157 96 50 -55 -135 -21 94 81 -69 -140 118 67 -105 -78 -98 -162 145 116 19 27 191 -59
5701 -59 58 268 -23 60 94 -39 49 114 115 205 -105 142 -30 8 25 34 201 -60 -27 -19 -31 92 -4 -397 47 156
5727 156 -106 24 -59 135 -142 283 224 0 -205 -64 -170 76 -116 -102 267 132 -188 63 248 -129 93
5748 93 -160 37 -67 9 -221 -208 115 60 183 101 122 -6 97 86 -9 167 120 120 43 -133 -209 49 -36 -83 -290
5773 -290 -244 -38 -212 -167 -30 60 -179 274 110 0 -23 188 -91 -117 274 -36 7 -163 -48 -27 164 -72
5795 -72 -144 -237 -196 -3 -35 -114 215 -46 -69 -96 49 32 -63 29 338 -26 72 56 -21 215 3 -117 121 115 -71
5820 -71 -35 -178 -149 -107 -124 -63 -20 -73 -70 -56 -156 -121 -89 -89 -74 54 215 186 89 -77 133 -64 241 176 -213 -97
5846 -97 -55 -221 -28 -10 -82 -15 -109 -36 -77 70 188 -28 44 -24 -35 16 75 -166 -110 18 109 -183 5 -53 81
5871 81 -78 -17 -23 468 185 232 73 91 -71 214 204 -151 -78 -35 3 95 -308 1 -29 -23 -104 15 -128 227 164
5896 164 -267 182 -211 21 139 -99 -28 89 23 -42 41 31 178 -153 170 -1 -20 66 51 266 123 115 -28
5919 -28 -226 -137 -36 7 55 -23 -103 -51 126 -44 54 -142 295 -150 -228 -8 -118 -33 98 57 -43 -1 -55 -76 -71
5944 -71 -81 -45 92 -116 91 10 116 163 20 -95 -302 26 -50 -94 39 -145 -217 -12 6 145 115 97 114 -98
5968 -98 -272 55 138 -128 225 53 -90 54 164 97 -66 112 -108 -328 48 211 -1 36 -105 242 90
5989 90 -87 202 182 49 -164 -147 -261 -34 45 46 19 -80 -78 92 -129 -81 183 -74 -87 -155 -65 -52 -106 -39 -156 -46
6015 -46 3 -124 28 120 -15 -48 -137 -2 -126 64 155 -267 -82 -16 254 -4 -331 224 146 190 129 -126 -42 106
6039 106 406 42 -15 200 -139 39 52 192 11 -211 119 305 -159 -164 -53 98 -262 187 -69 -19 197 -162
6061 -162 136 -253 -93 264 230 -159 -189 113 107 193 -241 35 62 92 256 -267 143 107 -241 -203 109 6 -46
6084 -46 73 44 43 26 93 118 32 169 -30 42 78 228 61 -141 160 109 -223 35 -10 -24 206 -124 -72 -101 -124
6109 -124 58 45 -4 -172 -133 -230 -97 7 -118 -41 316 -153 -11 -134 -118 139 105 -135 85 -194 48 1 -98
6132 -98 -172 -97 -3 -45 -151 5 -3 -70 -148 -250 -65 -149 -8 139 -106 -14 -88 174 325 -193 -3 -24 -78 108 114
6157 114 -227 170 169 269 114 -188 -270 -83 0 219 129 57 124 43 11 31 -255 -21 146 225 -10 51 -113 -219
6181 -219 -3 -103 241 -64 -196 90 -166 195 8 -26 19 -117 39 -51 152 50 -160 114 -20 96 -203
6202 -203 -174 100 65 -222 122 -10 -86 48 53 -59 -109 -20 -238 44 -104 -148 -35 196 24 44 35 -153 -104 266
6226 266 -28 6 -100 104 -39 -130 234 -6 -19 -159 -73 29 -28 -70 -143 -1 142 160 82 -167 -184 -135 -17 4
6250 4 178 92 -134 79 -43 -15 -102 96 5 298 171 149 175 125 -65 41 3 -18 106 -17 174 -88 104 -129
6274 -129 -50 73 21 12 -59 35 177 -262 -123 -142 17 -167 136 123 -258 -33 -146 -193 -177 177 170 -160 253 6
6298 6 -82 42 -117 60 133 -116 0 303 -191 -107 12 -165 -69 -234 -125 -10 -177 105 -171 -220 143 -196
6320 -196 102 42 -9 95 -42 295 -109 71 -30 -133 -32 -92 144 85 102 62 -155 -202 -464 -25 -107 76 -161
6343 -161 183 -110 15 84 -107 56 74 431 18 130 16 -15 120 -250 49 96 105 29 -41 59 155 282 10
6366 10 295 -178 146 -165 -199 -150 73 183 -34 -137 40 1 -202 3 -51 145 -65 -83 138 124 -11 189
6388 189 -154 -35 -1 -130 17 -73 104 -26 152 -4 -341 241 -278 -133 152 -270 65 83 -102 240 31
6409 31 55 -54 -310 -299 -106 -297 230 80 -128 28 4 -125 80 -100 115 31 67 38 164 -76 -151 16 143
6432 143 85 132 54 160 -124 -230 123 182 234 -170 22 -261 232 -109 -198 250 -13 75 75 -82 -49 -182 -174 136
6456 136 -93 -161 -104 -6 -15 54 23 -272 -166 189 -62 -25 -261 11 -160 -90 143 -127 -93 132 94 -158 140 37
6480 37 226 -57 -240 -11 -48 73 10 -151 14 -7 -76 -6 -311 -26 -97 -2 108 134 -219 -211 -13 -157 -77 -67
6504 -67 -12 140 -139 -267 151 40 250 -177 -4 137 60 -121 -279 100 193 112 -165 143 -69 70 -103 48
6526 48 -9 -61 130 -134 -34 -159 -62 -30 16 77 29 29 54 -103 -54 163 84 -169 -107 -165 -158 143 132 76 128 106 -329
6553 -329 -42 -92 -70 43 273 -22 19 -39 29 15 36 -146 -145 51 151 6 117 118 -75 10 -87 10 27 -94 75
6578 75 -58 -23 181 -184 43 183 -101 -23 119 -42 -11 63 -106 293 -123 279 -49 -5 -48 91 -4 240 158
6601 158 199 197 171 -141 180 49 63 232 -88 -42 54 90 -14 -247 -40 199 103 -17 36 153 194 237 -244 151
6625 151 -59 -66 -244 -4 -104 -104 -129 -64 -186 281 191 69 -66 128 35 70 0 -18 108 61 162 -250 -173 169
6649 169 -31 -68 114 -152 -64 -35 130 148 14 361 140 49 303 11 74 115 -320 125 -9 -15 -65 -110 135 -73
6673 -73 71 -315 150 -94 -201 -77 -65 146 -29 -98 171 -119 -242 -231 -56 -156 -132 95 161 -101 160 -35
6695 -35 -107 -27 -271 66 -31 -48 -50 111 65 -124 -60 -7 -85 -155 -30 -61 13 -32 -190 -244 -140 -75 244 37 -10 107
6721 107 128 -215 -94 -25 257 -114 23 -221 -119 -74 -45 -9 -56 -117 -72 -87 21 2 16 73 -134 -149 -37 122
6745 122 -38 -49 -71 124 -102 0 20 11 203 4 69 66 65 101 47 25 -31 -122 -42 -225 -23 -45 -33 -210 50 262
6771 262 -171 -159 -141 -33 10 -5 -58 17 89 -167 202 -154 -116 -118 -17 287 116 -56 -92 -323 49 -1 75 152 -15
6796 -15 55 -10 -97 101 -257 227 143 190 -29 49 7 -49 -75 36 -122 -43 124 185 -5 67 173 -77 -243 30
6820 30 3 -2 125 66 -130 19 224 41 -14 24 170 -43 25 -122 -80 -64 -187 289 -156 -11 101 7 223 31
6844 31 0 87 -13 183 183 -151 -169 -38 -65 -282 -4 -274 221 -14 135 5 -33 138 28 -24 -8 -69 -51 17
6868 17 1 106 -148 6 -8 -56 -104 50 0 -16 86 44 339 63 -6 -212 -86 128 12 -83 -84 107 26 -223
6892 -223 -129 -70 112 -18 108 74 87 63 80 -104 -26 156 244 177 146 -91 -52 237 -12 261 -2 201 63 -123
6916 -123 -6 -75 9 -209 16 -13 -69 42 -138 168 71 102 -142 -99 133 238 218 157 -34 91 85 102 -185 -212
6940 -212 -71 -57 40 31 -70 -34 8 -175 -82 158 60 -231 75 5 -3 33 -139 -42 -184 32 -229 96 -170 -44
6964 -44 -105 153 -6 -272 112 -13 -30 -24 229 171 -140 -72 -93 114 -2 -52 -111 -10 -45 29 135 -15 80 -8 -78
6989 -78 -95 83 27 -4 -122 18 -35 -62 -47 -137 -63 -42 177 157 126 102 81 -146 -67 -270 79 -148 101 98 -256 28
7015 28 35 -112 -60 32 -118 -174 285 -140 22 -23 2 122 49 75 -22 262 15 128 -20 41 56 189 -113 -89 105
7040 105 88 -33 -57 155 177 10 30 80 139 -76 81 108 141 -129 121 -142 -70 105 -46 -142 -274 79 -192
7063 -192 -246 216 276 232 -117 -50 -24 146 -78 -48 -13 -160 -26 13 182 74 -258 -41 -115 -50 -219 187 -190
7086 -190 -57 -259 -232 -107 182 -123 -121 -151 20 -94 -399 71 -100 -93 -108 -81 48 -25 110 -234 -2 -97 60
7109 60 -61 -23 -95 -18 -96 -30 225 1 17 -79 -243 -5 231 -75 -51 126 157 -206 95 3 -43 -155 204 76
7133 76 -59 119 -65 -252 -14 -160 -68 -67 195 -76 -29 -108 51 36 -100 -80 136 -52 58 -177 -67 238 -36
7156 -36 -44 -384 125 -186 203 106 -170 101 70 -44 -22 -142 -267 125 -60 -56 19 298 -83 -248 170 -73 65
7179 65 0 175 214 23 -18 58 71 -141 17 10 -73 -47 94 -126 -162 206 148 -40 -50 -103 -50 -25 -67 19 21 -335 -133
7206 -133 -103 26 -71 108 -177 -130 -144 137 63 -171 106 -11 263 92 -64 -81 96 275 -15 70 -39 -12 140
7229 140 -133 4 141 -68 192 225 76 -142 140 -69 -53 139 -77 117 -62 -57 134 80 -13 60 129 -102 -209
7252 -209 51 -122 112 -210 8 230 64 41 -133 -59 222 196 -224 40 -54 -81 118 -55 257 -5 187 -104
7274 -104 -5 -198 105 -172 -131 390 77 -154 246 -90 157 -76 138 113 183 49 144 -66 -47 -231 344 235
7296 235 -116 21 -36 91 44 70 10 -109 240 106 112 53 -3 102 -135 19 26 243 -184 74 -111 -28 -175 67
7320 67 72 164 -64 -36 -89 242 -37 -139 59 -247 -155 37 110 64 167 -163 53 -25 -52 95 92 168 -109 -116 -31 -124
7346 -124 80 -360 137 -5 132 67 -25 -178 -141 0 30 -14 189 -4 28 312 4 45 62 -171 132 -151 101
7369 101 -67 -121 -38 75 -52 -134 -131 114 -246 -104 40 4 -174 -207 -111 -45 8 -8 -91 -241 45 91 -201 -70
7393 -70 83 -179 -23 -182 185 -65 38 54 -66 163 205 -45 -62 150 85 31 144 -83 -27 36 -4 -262 -4
7416 -4 72 -110 4 120 -117 59 -196 -212 -62 137 207 40 -136 -102 35 31 148 157 -186 -146 -3 85 -32 206
7440 206 -68 -117 -331 -29 42 -169 -153 -108 84 265 -174 90 19 227 203 -206 96 53 -200 -118 -140 -55 -119 -15
7464 -15 -120 50 98 -146 -192 50 -33 -31 -170 -66 34 -88 292 -124 182 -54 116 102 72 107 -9 -17 -20 201
7488 201 -136 181 45 163 -52 77 -60 153 130 -49 -52 -126 -13 92 -243 258 -107 31 -16 -200 139 -44
7510 -44 28 -11 -34 76 58 -56 -100 28 20 28 -65 -277 56 -120 -62 -205 -68 38 108 -5 22 -97 -18 -36 -86 109
7536 109 31 -140 -72 -203 13 -39 -63 -186 -50 -116 60 -83 -46 -81 -290 41 148 -133 14 60 59 25 -46 -99
7560 -99 -120 -15 -156 -114 -153 23 140 70 189 261 56 -12 156 -81 -83 -19 -48 107 86 128 -208 -182 62 -6 250
7585 250 -165 -70 98 61 -112 -58 -79 -53 73 -106 -86 -92 -70 -38 141 -85 -53 -159 34 77 144 46 154 -108 1
7610 1 247 112 -83 -281 283 -82 27 142 186 -343 80 115 -43 -320 -40 -74 -7 57 -179 116 -120 230
7632 230 -36 -201 -153 42 134 -179 62 94 9 -195 -49 -160 98 -25 61 -100 -118 -370 37 90 -76 138
7654 138 -30 211 -70 16 9 162 159 -257 -42 -44 289 -44 49 -77 61 183 45 16 -321 74 38 6 4 119
7678 119 -272 -142 -141 204 29 75 127 -22 82 -152 -49 355 -100 -28 99 -30 109 -108 23 -178 -13 237
7700 237 94 -61 -61 -69 182 -97 -121 36 -87 204 25 -105 -36 -72 -141 -45 -144 -197 282 -30 -3 -28 -37 311 -89
7725 -89 -19 -139 122 72 244 119 309 198 199 85 -103 185 7 -275 21 63 -151 -164 44 -143 -139 -30 -131
7748 -131 184 8 118 162 -246 -154 127 159 260 -110 109 -88 -49 -53 -32 -36 -125 -37 62 36 -34 115 -26 -31 215
7773 215 -12 -25 -347 38 98 191 -96 -28 101 -31 -177 -95 163 201 38 -184 107 85 203 161 42 -36 103
7796 103 -87 249 -12 68 -100 151 -110 257 50 158 65 -194 226 -125 313 100 -187 -109 -81 -12 -36 137
7818 137 -148 -26 267 -102 -301 -190 -103 -93 97 -97 -192 94 224 53 156 84 109 -59 -126 65 176 -15
7840 -15 2 -58 132 20 214 -180 235 -158 -184 -308 -4 -59 -93 6 35 -293 -8 -220 109 -71 -122 69 239
7863 239 341 232 -24 -84 -104 -57 -92 -49 -181 -102 31 179 46 37 -105 99 49 -76 122 -62 -200 -13 -76
7886 -76 -145 297 -137 100 -120 269 -144 -68 -67 -50 135 -103 301 155 -27 96 84 -208 -108 70 -57 209
7908 209 -342 -109 377 -9 -4 -26 -132 -220 233 64 -79 7 89 140 46 -285 63 123 43 -134 -197 -60 -28 -28 219
7933 219 76 -28 187 -40 -215 -168 262 134 -161 -94 95 -3 -182 5 144 265 212 -69 -123 51 9 53
7955 53 123 100 -30 26 -37 110 277 -68 72 62 161 -112 -87 371 -279 17 -16 -359 -208 -88 18 -17 38 -98
7979 -98 15 -155 -29 -285 47 22 -112 -305 142 -96 -26 268 261 79 135 410 163 128 -135 104 -1 198
8001 198 -112 -146 124 -5 63 -103 -64 34 -137 -7 83 15 56 -10 -47 -282 -264 101 -37 161 8 146 -41
8024 -41 -15 25 -157 -122 74 189 260 393 -135 -33 -41 151 182 100 -18 72 2 -273 -350 78 -55 -112 -75 150 -48
8049 -48 84 141 9 37 -117 -100 -22 203 -213 -94 -51 98 41 63 130 178 108 -22 128 188 -78 297 89 6
8073 6 -83 222 70 102 70 -288 -75 -183 337 -165 92 -65 141 -209 -122 11 2 246 -241 -41 -409 -70 -83
8096 -83 -60 -64 -126 -54 -143 -69 45 -19 0 323 146 -57 -111 105 -97 344 45 -39 100 -57 125 139 79 4 -22
8121 -22 71 305 289 -140 -19 54 36 299 -58 47 -105 23 22 -85 -26 -191 65 -45 -139 36 41 11 103 -7
8145 -7 142 -223 9 103 -129 162 -118 57 42 -131 -98 -132 85 -23 -2 91 30 96 30 17 -9 -22 -85 -22 -64 -137
8171 -137 -24 -17 -89 116 -129 194 53 -65 269 316 -48 45 -90 -114 100 123 -38 -323 119 339
8191C39
$$ Imaginary data points
##PAGE= N=2
##DATA TABLE= (X++(I..I)), XYDATA
0 0 0 0 0 0 0 0 0 0 0 0 0 0 8 -8 8 -8 8 -16 16 -16 24 -24 32 -40 40 -48 57 -66 79 -89 103 -116 130 -150 169
35 169 -190 214 -240 267 -298 331 -370 410 -451 501 -554 611 -673 743 -818 899 -993 1094
53 1094 -1207 1334 -1477 1640 -1828 2044 -2302 2610 -2989 3469 -4094 4956 -6216 8241 -12060
68 -12060 21859 -107848 -180749 -61694 -71554 -76438 -79151 -48256 -62157 -73471 -63125 -15367
80 -15367 10849 35625 64987 93465 79755 65070 81656 107092 73508 14495 10460 81395
92 81395 139361 131771 93735 75356 51110 -5192 -62870 -75659 -59554 -49607 -48119 -44373 -60751
105 -60751 -104450 -132645 -107569 -69236 -74771 -101717 -78019 -6495 38991 29221 14590 26758
117 26758 31670 6578 -13112 8968 54811 91126 114796 126985 105634 51651 18007 35869
129 35869 60353 43100 9887 12455 35374 20122 -34112 -70973 -69241 -68215 -91423 -107171 -89875
142 -89875 -57833 -33564 -13434 -2257 -22122 -61809 -73163 -36538 3765 12253 15210 46937
154 46937 79567 66953 25287 13730 41291 63718 60222 54899 63593 69157 62307 54051 40556
167 40556 3589 -44548 -62348 -41511 -25814 -37543 -44039 -23441 -11181 -42949 -88109 -93773
179 -93773 -60431 -30824 -21764 -13694 422 4750 920 3602 9791 2292 -6353 12122 49686 66827
193 66827 56639 54715 74632 79361 42089 -2329 -8690 14000 26427 21424 14698 7493 -11511
206 -11511 -34820 -47170 -51537 -59981 -62147 -39729 -11777 -11355 -33493 -37839 -17512 -10076 -32253
219 -32253 -49763 -31102 6078 27739 33139 39211 43253 34453 23008 22529 25728 25019 31418 53968
233 53968 68507 48055 10493 -5034 3227 -850 -26208 -41243 -26092 -5678 -5635 -18236 -25910
246 -25910 -31249 -42149 -49595 -46119 -39331 -34249 -19572 8383 23064 5840 -18561 -15933 6816
259 6816 16672 9986 16197 42105 61297 55749 37844 27237 20828 12196 8199 11449 10810 5481
273 5481 8455 19439 14011 -17672 -46307 -45110 -28547 -26758 -36568 -31361 -10588 -1491 -14455 -31256
287 -31256 -34867 -30807 -23588 -10436 5425 13468 16131 25620 38542 34554 11837 -678 13689
300 13689 34260 34946 24855 27317 38092 34386 11570 -9774 -17983 -17398 -14076 -7341 -2270 -7359
314 -7359 -16941 -17432 -15897 -27890 -47979 -50384 -28129 -6008 -4639 -11102 -4456 8581 8328 -4265
328 -4265 -10961 -3659 9498 22740 34323 39385 33139 24290 23917 23775 11046 -4975 -3253 16772
342 16772 28045 15765 -654 -4677 -3778 -13549 -29889 -36568 -30141 -19629 -11163 -6177 -8781 -18776
356 -18776 -24792 -20057 -14929 -18926 -21747 -6803 18684 30180 20429 9153 11469 17404 14122 6561
370 6561 8841 19143 28797 32627 29772 18105 2961 -5165 -3712 -2868 -11324 -16558 -7178 7188
384 7188 3942 -15455 -29369 -28221 -22885 -24466 -26913 -20045 -7457 2395 5555 3047 -4394 -11323
398 -11323 -7640 4129 12106 11056 12600 25779 36977 29713 10855 598 4826 11222 9642 6574
412 6574 9171 13585 13539 6244 -5686 -18691 -26249 -22402 -12651 -9899 -14783 -15582 -6797 -1451 -11215
427 -11215 -25747 -27112 -15040 -2682 1213 3520 9668 16167 17545 13283 5845 -467 1046 11810
441 11810 23706 24558 17160 13740 17763 15666 1978 -11503 -12197 -1687 3969 995 -4828 -6298
455 -6298 -6847 -10962 -17904 -25494 -28866 -22669 -9183 1923 1128 -4795 -5054 -62 520 -6692 -10343 -264
471 -264 15392 22932 19464 14394 12981 13495 11814 7390 2264 1531 6998 16241 18700 9833 -1340
486 -1340 -6182 -5645 -10593 -19656 -22627 -13075 -1240 1103 -7006 -14995 -16892 -14598 -12019 -10946 -9892
501 -9892 -5282 4102 12989 13883 6537 444 2649 7919 7473 3130 5238 16237 25933 24266 12525
516 12525 1852 -2069 -1516 -373 -1351 -2562 -1059 1857 2157 -5263 -16941 -22207 -17353 -10746 -10527
531 -10527 -13889 -11351 -1209 5863 3531 -4916 -10503 -8337 -2612 2849 5951 9214 13869 18550 17493
546 17493 8804 -288 -997 7093 14536 13331 7580 5460 8408 7495 -37 -10144 -15160 -13060 -9015
561 -9015 -7386 -7896 -7455 -4654 -2178 -4767 -13675 -20314 -16305 -4587 5215 6139 2450 2717 5820 5761
577 5761 1788 -1702 1083 9261 15377 15478 12084 10262 11669 12284 7066 -2721 -9558 -6527 1708 5959
593 5959 2436 -4387 -6916 -7782 -11211 -16594 -17893 -11858 -2579 2510 490 -5256 -7866 -4728 -926
608 -926 -1362 -4759 -4637 2448 11709 15128 12089 8655 8429 8716 6065 1063 412 6623 14041 14910 7736
625 7736 -2402 -8671 -7887 -6046 -6866 -9463 -9080 -4096 -265 -2491 -8456 -11383 -9354 -5916 -7399 -9972
641 -9972 -8375 -107 8502 10784 5407 -1454 -3057 1070 6132 7756 8948 11717 15645 15569 8475 39
657 39 -2990 286 3293 1269 -3302 -4623 -1033 2470 209 -6962 -13163 -13816 -10202 -7114 -6496 -5222
673 -5222 -1590 2211 1152 -5748 -11416 -9570 -1259 6450 8266 6554 6721 9673 11730 9679 4425
688 4425 1829 3650 7416 7457 5119 3618 4984 6201 2074 -6475 -13089 -11679 -4707 266 26 -4010
704 -4010 -6117 -5864 -6207 -9599 -12630 -10530 -3995 1924 2425 39 -326 3287 7020 5728 1158 -827
720 -827 3204 10304 14277 12204 8113 6128 5251 2573 -2127 -4909 -2458 3407 6289 2517 -3969 -7780
736 -7780 -7061 -5053 -6610 -10353 -11196 -6970 -1526 -30 -3064 -5478 -4930 -2345 -2282 -3943 -3079 2518 10456
753 10456 13923 10668 4393 1865 3677 6015 5234 3285 3922 7195 8700 5956 -190 -4065 -3703 -2080
769 -2080 -3330 -6465 -7967 -4042 132 500 -4972 -10591 -11708 -8539 -4983 -4376 -3693 -362 4043 6064
785 6064 2919 -1245 -1802 2236 6702 7342 5586 5202 7925 10718 9033 3303 -1328 -1279 1229 2562
801 2562 1181 -636 367 2215 449 -5453 -10958 -11796 -7471 -3385 -3004 -5190 -5206 -2927 -1095 -2398
817 -2398 -5736 -6161 -1888 2907 5327 4575 4031 5900 8289 7413 2559 -703 974 5551 8747 7535
833 7535 4197 2698 2385 1705 -2032 -5939 -6531 -2815 434 -568 -4365 -6523 -5579 -4269 -5469 -8307
849 -8307 -9450 -5443 118 2900 1705 -248 6 1938 2806 820 -216 1827 7470 10470 8994 4782
865 4782 2484 3275 4176 2175 -801 -1414 1657 4090 3334 -938 -4917 -5542 -4571 -4986 -7038 -8281 -5290
882 -5290 -1153 657 -1588 -5437 -5824 -3515 -863 -843 -1008 728 4834 7992 6678 3024 646 1982
898 1982 4670 4788 3114 2731 4908 7077 6535 1812 -3016 -3644 -2256 -1122 -2563 -4296 -3708 -1193
914 -1193 -449 -3594 -7493 -9011 -6232 -3074 -1869 -2540 -1971 912 3434 2872 -291 -2425 -441 3790
930 3790 5777 5354 4092 5147 7070 6619 3087 -895 -1222 1434 3346 3011 429 -923 -75 -39 -2617
947 -2617 -6865 -8398 -6029 -2344 -1456 -2922 -3948 -2778 -1232 -1402 -4136 -5171 -2871 1571 4275 4267
963 4267 2755 2732 4342 5053 3172 364 822 3799 6979 6370 3506 984 1187 1373 -231 -3568 -5224
980 -5224 -3135 -439 261 -1797 -4795 -5307 -4048 -3590 -4734 -6370 -4799 -626 2291 1689 -935 -1764
996 -1764 239 1732 1756 646 1410 4350 7242 7245 4664 1884 1433 2891 2712 768 -742 486 2834
1013 2834 3219 29 -3738 -5528 -4017 -3290 -3952 -5313 -4602 -1708 16 -995 -3886 -5451 -3963 -1239
1029 -1239 90 -303 -268 2153 5323 5732 3136 685 1013 3601 4758 3874 3077 3505 4875 4830 2231
1046 2231 -1539 -3308 -2032 -286 -472 -2277 -3425 -2131 -829 -2153 -5498 -7239 -5591 -2585 -1427
1061 -1427 -2105 -2345 -915 1600 1869 -160 -2035 -1259 1948 4992 5212 3768 3491 4609 5455 3707 462
1078 462 -440 1263 3111 3353 1068 -947 -873 -32 -1206 -3897 -6039 -5499 -2727 -497 -1558 -3423 -3738
1095 -3738 -2526 -1464 -2816 -4312 -3079 437 3522 3222 1506 1079 2370 3715 3398 2114 1062 2595
1111 2595 5132 5812 4056 1363 917 1369 847 -1510 -3274 -2609 -174 1171 -652 -3474 -4848 -4205
1127 -4205 -2903 -3385 -4447 -4247 -1959 421 919 -1142 -2258 -1092 1217 1642 784 615 2421 5421
1143 5421 6383 4522 1693 935 1745 2525 1980 1048 685 1842 2515 650 -2166 -3304 -2828 -1505 -1530 -2892
1161 -2892 -3499 -2662 -673 -692 -2539 -3923 -3565 -1916 -326 -37 69 697 2735 3441 1842 128 -232
1178 -232 1664 3873 3927 2475 1946 2425 3126 2300 -83 -1515 -1048 98 362 -565 -1649 -1524 -601 -730
1196 -730 -2748 -5200 -4839 -2692 -671 -535 -1353 -1428 -639 510 -364 -1208 -1079 758 3149 3588 2275 1487
1214 1487 2184 3215 3266 1192 -325 293 2098 2955 2250 500 -832 -207 -719 -1956 -3489 -3254 -1495
1231 -1495 -193 -526 -2352 -3514 -2763 -1294 -1145 -1917 -2762 -934 1174 2005 1277 409 667 2075 2161 1216
1249 1216 486 1228 3223 4489 3171 804 -172 -18 848 770 -516 -1178 -74 499 -134 -1977 -3321
1266 -3321 -2734 -2103 -1708 -2620 -3222 -2030 155 999 -54 -1411 -1651 -642 461 1038 770 1140 2657
1283 2657 3545 2716 867 110 1035 2504 2632 893 193 869 1971 1457 -196 -1896 -2279 -1596 -944 -1512
1301 -1512 -2433 -2070 -901 -706 -1767 -3416 -3498 -1903 -61 313 -249 -392 582 1850 1548 610 9 858
1319 858 2114 2984 2304 1412 1735 2774 2589 685 -775 -1226 206 1195 872 -657 -1309 -1201 -866 -1803
1337 -1803 -3297 -3270 -1874 -671 -201 -1158 -1954 -1106 15 222 -684 -1583 -561 1380 2405 2559 1295
1354 1295 1140 1570 2118 1333 237 455 1734 2882 2006 652 -664 -384 -136 -376 -1593 -2130 -1725 -630
1372 -630 -186 -1247 -2276 -2349 -1478 -1100 -1539 -2168 -1437 270 1793 1295 111 -597 205 1155 1518 947 1148
1391 1148 1837 3033 2531 1211 97 178 1010 1239 -28 -841 -567 594 653 -492 -2326 -2951 -2079 -966
1409 -966 -1195 -2252 -1802 -701 97 -56 -1281 -2060 -772 427 1005 600 141 906 2130 2304 1196 290
1427 290 324 1488 2224 1481 953 679 1545 1450 229 -1138 -1700 -1107 5 -63 -1308 -1844 -1061 -576 -897
1446 -897 -2144 -2733 -1966 -584 156 -99 -765 -548 932 1043 590 -577 -212 1441 2491 2282 1251 930
1464 930 1486 1687 1125 -13 -507 354 1398 1241 -178 -749 -783 -453 -708 -1832 -2498 -1995 -866 81 -760
1483 -760 -1540 -1528 -897 -466 -537 -1146 -1002 599 1851 1784 782 -31 928 1649 1495 633 296 837 2160 2106
1503 2106 1146 -47 -261 203 288 -347 -1459 -1265 -410 434 -69 -1599 -2145 -1642 -797 -767 -1642 -1559 -762 230
1523 230 709 -364 -877 -486 589 1223 922 564 1086 2013 2443 1706 230 -55 852 1307 920 -206 -92
1542 -92 804 845 134 -1149 -1831 -1372 -540 -435 -1161 -1320 -1291 -302 -178 -818 -1794 -1412 50 686 531 -31
1562 -31 270 1394 1645 1192 -5 -103 869 1614 2065 1046 529 730 1233 667 -398 -1383 -898 114 192
1581 192 -313 -1360 -987 -429 -532 -1346 -2034 -1702 -879 25 482 -522 -1025 35 492 463 -77 -470 561
1600 561 1887 2028 1039 420 946 1213 1115 457 -245 291 694 1055 645 -566 -923 -673 -136 -720 -1820
1619 -1820 -1957 -680 122 -157 -1131 -1421 -859 -219 -141 -622 -530 68 985 1330 805 259 44 933 1560 948
1639 948 188 230 1325 1995 1447 50 -385 -24 409 -167 -739 -931 -532 61 -200 -840 -1549 -1989 -594
1658 -594 -319 -682 -1591 -900 323 607 18 -857 -608 372 695 669 446 479 1135 1541 1349 426 -208 -27
1678 -27 867 1191 412 -371 -297 510 533 -674 -1368 -1333 -694 -351 -863 -864 -1282 -450 -24 -389 -832 -1473 -751 421
1700 421 952 26 -103 387 1265 1303 -25 -62 329 1444 1431 810 365 784 918 653 393 -500 -1001 -542
1720 -542 591 213 -633 -1139 -630 -80 -534 -1420 -1733 -489 392 49 -316 -624 -287 245 196 147 -113 103
1740 103 696 1605 1602 610 202 895 1539 810 -254 -198 896 1004 660 -345 -485 -651 -332 -502 -805 -791
1760 -791 -1132 -307 130 -400 -1652 -1088 -216 295 -332 -1065 -482 500 1278 491 224 130 417 711 768 843 277
1781 277 577 1243 1408 448 -384 -403 251 527 -148 -746 -610 -55 -31 -628 -1333 -1259 -985 -671 -547 -435 -829
1802 -829 -364 312 701 -606 -961 -463 1008 1247 475 -80 467 1308 999 386 -76 291 616 701 683 289
1822 289 -143 104 664 507 -820 -1338 -455 168 91 -669 -1124 -597 -10 -345 -1166 -1070 -298 66 324 342 13
1843 13 -197 240 970 872 -204 -483 648 1439 1465 335 140 554 1066 151 -568 -178 269 516 236 -284
1863 -284 -661 -914 -642 -234 -343 -1175 -1128 -228 477 -63 -965 -599 233 276 -282 -526 -136 681 961 755 588
1884 588 228 -32 558 1029 478 -177 165 1262 1133 166 -667 -320 275 123 -660 -1035 -534 -264 -309 -235
1904 -235 -421 -919 -879 -603 -76 -363 -607 -246 882 657 -178 -373 -75 826 875 507 277 945 824 887 414
1925 414 134 -252 -112 250 630 -53 -987 -103 334 281 -883 -1425 -595 181 39 -668 -665 -304 118 -311 -138
1946 -138 -436 -303 -238 746 594 244 -127 528 1476 871 -231 -196 600 1155 797 107 -59 523 521 -222 35
1967 35 -469 -726 -254 113 28 -941 -1054 -280 266 -442 -1209 -835 143 226 -131 -445 -289 346 485 40 32 125
1989 125 65 1081 1404 764 117 -2 528 742 21 -353 -37 144 684 -97 -597 -294 -373 -24 -296 -541
2009 -541 -530 -611 -134 200 -52 -965 -920 133 457 -130 -540 -54 780 469 167 -227 214 357 481 391 232
2030 232 30 169 657 963 346 -609 -405 328 442 -348 -860 -171 443 57 -1088 -938 -329 -389 -378 -419 -316
2051 -316 -258 -166 425 460 -175 -408 88 685 748 19 -284 657 1078 519 -88 -152 336 324 363 203 -182 -93 -202
2074 -202 112 -28 -695 -987 -432 326 59 -811 -792 -298 374 -221 -651 -551 163 297 3 282 153 -98
2094 -98 419 543 549 -224 5 607 1071 797 -208 -312 533 825 193 -709 -577 -208 -13 -121 -317 -604 -745
2115 -745 -499 -113 -337 -873 -728 351 421 -277 -739 -481 483 608 -32 -189 214 600 544 423 228 54
2135 54 337 315 415 297 -426 -120 747 504 -58 -766 -521 216 -65 -658 -700 -357 -187 -234 -491 -560 -635 -67
2157 -67 86 -49 -38 -620 -171 630 557 201 -230 254 992 751 205 132 395 732 661 297 -8 -83 93 412
2179 412 25 -441 -361 -31 191 -129 -722 -1031 -285 6 -369 -610 -434 126 295 122 -346 13 82 -62 580
2200 580 583 68 69 516 1012 315 176 -58 489 832 424 -169 -180 203 348 -22 -278 -514 -508 -467 -20 -199 -702
2223 -702 -253 -47 -28 -248 -733 -148 251 647 -57 -80 104 387 614 395 -148 120 283 534 742 430 17
2244 17 261 397 398 -66 -443 -14 341 407 -254 -819 -241 -1 -32 -669 -476 -458 -510 140 210 -66 -597 -140 389
2267 389 563 -79 -243 392 1144 843 457 9 -128 647 499 199 10 -46 240 733 -56 -339 -669 -383
2287 -383 239 21 -555 -404 -112 167 -127 -546 -588 111 132 -58 -244 -211 -13 80 390 80 -116 -194 380 296
2309 296 533 -236 -245 237 698 161 -383 -236 213 126 169 -469 -438 -223 -100 -92 -339 -714 -439 -165 23 -274
2331 -274 -630 -201 196 293 -12 -350 -317 349 336 272 132 204 396 655 487 332 7 8 359 566 120 -213
2353 -213 54 556 192 -205 -482 -245 34 4 -307 -804 -445 -281 -162 -49 -499 -536 -447 217 184 -70 -263
2374 -263 33 479 264 -109 18 257 419 436 430 -16 -23 -89 359 -9 7 -249 -210 620 200 -31 -612 -370 118
2397 118 179 -335 -705 -296 263 177 -91 -581 -281 -215 269 51 -341 36 430 485 243 39 -182 348 566
2418 566 172 -168 -333 149 475 247 131 -307 31 10 152 -269 -309 -339 -166 176 -142 -584 -544 -109 208
2439 208 -68 -389 -126 138 146 133 71 -242 11 476 266 340 -60 366 278 638 267 -121 10 161 254 -48
2461 -48 -228 -271 120 51 -297 -637 -414 -191 -103 -173 -266 -396 -19 25 474 -17 -476 -85 324 558 377 5
2483 5 64 394 153 21 -14 -3 259 437 161 -34 -33 -76 277 277 -282 -477 -178 -1 73 -442 -378 -261 190 114
2507 114 -262 -323 -187 132 164 189 -180 -128 -12 220 527 -94 35 456 412 312 319 219 -49 175 255 -2 -351
2530 -351 -149 429 148 -37 -499 -219 -202 38 -157 -544 -469 20 58 -207 -145 -551 -206 272 103 86 -192 207
2552 207 448 260 -68 -179 62 271 548 137 -254 296 441 387 213 -214 -178 12 123 -54 -330 -289 -21
2573 -21 -177 12 -306 -291 -196 322 -147 -30 -207 -73 389 300 -134 -293 -38 400 514 313 -53 -150 141 371
2595 371 404 -82 -105 230 253 210 -187 -188 -317 201 -32 -168 -610 -348 -25 32 -23 -245 -111 29 98 -244 -245 -362
2619 -362 -48 280 74 162 -9 18 326 197 154 70 170 286 334 159 -26 75 193 92 -277 -57 94 363
2641 363 234 46 -305 -226 -49 -110 -185 -169 -360 77 474 -47 249 102 -280 154 314 63 -61 79 452
2662 452 418 260 -51 -257 357 468 66 -235 -132 16 302 -110 -149 -228 -168 -66 -25 -310 -21 -41 237 220
2684 220 -13 -222 -100 128 239 -332 -76 15 34 366 276 -50 -115 169 240 145 11 25 -40 299 0 -172 -309
2707 -309 -93 -41 126 60 -390 -118 -140 231 -308 -184 -215 242 -80 -84 3 85 -45 17 219 -232 52 -126 354
2730 354 277 104 -52 18 47 79 -2 -174 46 183 294 118 -110 -96 -76 130 -25 -563 -334 -163 309 -24
2752 -24 -289 -250 9 98 185 -111 -96 206 65 340 208 -77 -80 235 398 238 -176 62 415 384 105 -55 -311
2775 -311 20 71 -80 -391 -128 83 218 5 -193 -182 -112 10 -119 -104 -312 -8 155 102 4 -207 -83 131
2797 131 270 -89 -59 -149 -63 222 99 -81 -159 49 120 180 -36 -285 -51 52 56 105 -278 -166 -20 113 -372
2820 -372 -257 -413 13 373 13 -342 -350 111 169 79 -170 -99 28 484 277 -40 -44 -64 158 295 105 -121 -84
2843 -84 281 467 -267 -381 -199 4 217 -174 -141 106 156 -20 8 -172 -234 13 89 38 -116 -41 -14 42 218
2866 218 340 -170 105 149 92 180 -251 -95 253 279 -285 63 -322 132 29 -104 -46 -253 38 -71 83 -150
2888 -150 -465 -48 93 324 -13 -258 20 -162 125 -18 -243 138 156 151 96 -245 -145 29 177 210 -160 -130
2910 -130 -13 160 88 18 107 42 18 140 -43 -242 -451 147 74 -60 129 -128 205 -126 0 -76 124 163 73
2933 73 341 112 -196 92 248 116 9 -135 -114 139 397 400 -294 -66 50 162 35 -227 -252 -238 40 26
2955 26 -109 -255 26 84 179 10 -67 61 180 33 -36 -35 109 -25 128 84 -148 -32 326 62 -104 -6 -126
2978 -126 18 222 182 184 138 -234 187 -1 -333 -248 22 -120 151 -261 -86 242 -11 -93 58 -344 122 -60
3000 -60 219 125 -190 88 325 244 -91 -2 -1 22 108 184 16 -115 77 57 202 220 -37 111 -35 190 -81 2
3024 2 -171 -123 100 -43 -28 -32 112 16 -37 -13 -263 34 85 56 -99 -89 33 256 260 -44 -170 -132 157 229 -29
3049 -29 -22 -55 -18 120 -54 -363 -26 -218 -19 -162 -163 -5 23 129 60 -25 -7 -125 274 136 -251 -119 -56 272
3073 272 222 -321 -37 -23 80 262 72 -43 -100 -310 126 204 269 99 124 52 -17 50 -105 -101 247 62 -453 -125
3097 -125 -50 215 365 -400 0 -166 44 101 -96 2 -14 -431 69 85 73 -302 123 -205 69 -141 -113 26
3119 26 92 -30 -60 -234 -43 179 86 -90 -100 -108 -21 177 269 -111 -7 -59 18 182 250 34 145 216 104 -125
3143 -125 -23 77 260 314 306 -193 6 10 21 -133 -49 75 273 -93 -1 146 -177 369 -27 19 -194 27 -119
3166 -119 71 -127 -263 -205 -258 15 296 -61 -211 18 -7 38 -131 -109 -1 210 37 28 -312 -262 215 144 123
3189 123 -63 -73 95 397 154 93 -284 -120 42 -14 6 -244 34 195 9 174 -340 69 -82 -26 -27 -209
3211 -209 160 -180 129 275 -137 305 96 206 176 -77 -190 22 270 330 -140 -208 -64 -9 205 -61 48
3232 48 -88 51 432 -22 -193 -168 -255 80 144 -121 -69 211 -87 121 -30 -140 -74 406 -1 209 -167 9
3254 9 307 243 110 -98 9 28 35 65 8 -190 -8 140 42 -137 -366 -35 50 53 -151 59 -40 237 -77 12 83
3279 83 -11 -71 61 -160 -144 -155 192 -17 106 14 -19 257 18 11 -191 -34 76 274 154 129 80 -164 7 468
3303 468 -187 -116 123 -285 47 23 -284 55 89 -197 49 -56 -159 -241 -25 239 99 -194 -78 -7 219 -44
3325 -44 -258 -54 82 310 33 -124 42 116 53 -54 -52 -289 12 179 143 168 -105 -20 18 85 -103 -127 -157 -139
3349 -139 11 286 -96 -74 71 9 -161 -22 -12 207 266 50 -116 116 88 79 118 -178 -64 145 -70 -59 18
3372 18 -188 107 128 -15 -145 -352 -228 94 171 -98 -96 -190 -40 -4 -103 147 60 -61 155 10 14 100 52 -48
3396 -48 347 118 119 90 147 91 -145 -233 260 -145 -106 -119 -50 -78 184 207 -209 -115 -84 -164 -92 122 -170 215 86
3421 86 -104 34 -73 -147 25 220 274 -30 -25 99 441 201 95 -6 58 201 351 77 -65 -50 81 207
3443 207 39 -146 -151 -109 227 50 -424 72 -352 -56 83 29 -83 -59 -36 -40 137 -19 95 226 236 -7 199
3466 199 150 -45 -60 -52 -97 -59 22 106 75 193 19 269 -80 38 233 160 -102 -82 -137 -51 -290 -218 257 76 -181
3491 -181 -39 449 130 33 6 -132 97 84 5 255 106 -233 31 -92 -206 -43 123 -315 293 135 -68
3512 -68 13 168 -93 60 -32 -47 253 -106 -55 -49 -53 -304 -12 -67 -213 -109 -27 158 -181 -305 -151 130 10 48
3536 48 -36 -195 12 51 -180 88 -208 -55 -103 27 35 -33 -181 -58 -1 59 -95 -103 -198 -136 97 -241 -238 -279 -222 76
3562 76 197 60 -88 42 39 -84 -14 59 0 -57 145 -17 1 -121 -10 -13 0 -18 -33 -142 360 77 -165 -13
3586 -13 -14 -41 157 13 -210 92 -137 -188 -61 -38 -86 -91 -274 -39 81 17 42 -65 162 36 9 126 66 129 -202
3611 -202 -18 68 76 -41 100 -106 125 -160 -165 -67 -133 -96 19 114 116 127 -258 191 -15 34 -20 -251 62 441 -87
3636 -87 285 -338 106 -117 318 -71 -252 -150 115 211 66 -41 -155 327 319 10 152 -59 -156 94 -133 207
3658 207 -75 109 -296 183 79 152 -54 31 -8 -60 -29 200 -39 158 284 91 79 -37 46 124 -93 38 151
3681 151 226 -81 -192 140 37 -179 164 66 -169 -82 -125 -139 12 -86 26 -4 70 -77 -98 218 46 113 455
3704 455 -75 71 -266 214 122 59 42 -146 185 150 -33 -100 49 -42 -132 -289 15 -63 36 107 65 -174 -129 -100
3728 -100 -168 43 14 -84 37 -57 20 121 -418 57 -15 124 248 265 -66 230 202 -186 -162 209 -192 104 -272
3751 -272 -88 -43 -109 7 -227 155 -17 -258 -164 -151 5 -81 186 162 224 2 36 -130 37 -133 -107 9 -158
3774 -158 196 99 207 123 -31 23 -104 -37 -79 -65 74 6 8 76 -25 95 -155 -49 24 -37 -13 -206 -197 -93 268
3799 268 -80 -81 -62 -23 -44 -2 245 142 -26 12 -41 64 63 211 -51 -90 21 7 187 170 134 74 39 -16 -20 95
3825 95 -50 123 -238 -73 -103 -140 4 -137 180 -207 -112 44 -143 69 -137 3 -162 -9 -284 -10 9 112
3847 112 169 6 44 162 -99 126 -83 -51 0 -26 192 -101 -118 116 115 -78 111 251 -74 -349 -199 -142 -57
3870 -57 -147 -203 -41 -74 -53 40 -108 -59 28 49 112 -51 -9 107 60 277 64 -80 -217 -23 97 65 -260 38
3894 38 -102 -47 -153 -157 -43 79 -24 -95 -266 55 -174 -32 22 136 -21 30 184 -24 -27 -102 -90 70 -61 204
3918 204 127 -182 -107 78 157 -110 -17 -299 3 51 52 120 85 -200 -339 97 -252 139 -42 -134 210 -313 -28
3941 -28 186 103 9 -5 -328 9 23 230 125 -6 -61 -2 84 -190 137 -199 54 -175 -156 -50 -251 -177 -214 -47
3965 -47 48 -55 152 135 -470 -85 365 115 -88 -12 -212 -29 21 313 129 12 -35 75 74 24 -201 -16 -137
3988 -137 146 135 238 -66 229 -136 -186 -164 -262 -196 -133 78 192 -118 -53 74 -97 -89 -8 21 71 243 44 123
4012 123 15 0 141 -21 -4 120 3 232 198 -53 50 309 -119 -151 134 210 -35 63 -72 243 53 162
4034 162 11 -123 271 -135 17 -62 115 -99 35 -68 -69 11 225 -202 -155 -39 170 87 20 -99 10 18 -27
4057 -27 80 -146 209 -37 -146 155 252 -230 -23 -119 230 -101 -80 24 99 -21 -208 9 -308 82 31 -58
4079 -58 47 -37 -90 33 21 -81 -88 71 237 -272 -14 21 1 301 -213 46 115 -54 30 36 37 -116 183 -67 -12
4104 -12 -76 49 -17 -18 156 50 127 -29 -53 -177 -39 -43 -123 158 93 39 72 265 -12 -200 4 -79 105 -139 -109
4129 -109 -64 35 -68 47 -223 -135 43 30 39 96 -241 118 -162 -59 73 2 -20 273 160 -186 110 54 41 -212
4153 -212 17 401 194 54 -55 35 87 -113 -57 -158 -107 -167 142 412 111 -130 -103 -68 -126 166 34 -19 -85
4176 -85 -34 -188 -233 68 96 21 145 315 -25 -127 -12 127 127 13 177 219 -60 -257 28 -101 -205 -18 -106
4199 -106 133 -102 -252 30 74 -52 -68 99 -58 87 -5 9 1 96 294 -18 -13 -152 294 217 0 -46 -7 -4 9
4224 9 -15 -175 -21 -31 14 -95 26 50 -116 -82 7 -27 94 37 -240 6 -102 54 -89 414 35 -74 22 -122
4248 -122 146 149 -224 42 -87 -93 -86 129 45 -52 -266 84 -76 -245 23 -16 75 -86 31 -151 142 119 178 -124
4272 -124 -248 -49 137 -71 67 213 1 -80 30 187 -76 -332 -255 92 -161 -70 -86 -155 56 -384 -150 248
4294 248 234 148 -399 -176 -71 -6 91 163 -153 435 -181 -56 -95 -180 109 -60 97 -4 -28 -155 -12 13 -126
4317 -126 112 237 -72 137 29 -261 152 -133 293 33 -133 86 84 394 -205 17 -30 -43 -155 74 90 181
4339 181 -86 198 104 -6 -203 13 -52 -310 181 252 46 7 132 -209 -53 -195 -193 -17 -95 -52 113 96 9
4362 9 108 91 72 -185 37 13 42 3 185 -239 198 -128 -292 63 139 80 -26 -32 -102 268 45 5 -35 127 39
4387 39 -56 53 -144 6 -164 -92 62 4 -238 74 -136 19 -561 69 -136 -65 130 -151 -36 177 -18 43
4409 43 246 -15 -124 -23 -186 158 -27 -334 -72 7 231 -125 53 -142 -126 23 -18 -211 -42 159 0
4430 0 -41 19 -43 -40 -74 -358 -16 -209 55 13 -124 -102 90 245 -83 61 364 -114 4 71 287 311 -128 -106
4454 -106 -109 -77 131 106 244 98 -28 99 -33 -291 -70 -156 320 -52 232 -67 -116 -67 26 108 -233 130 134 -51
4478 -51 89 3 -45 46 -49 196 -115 294 -125 134 -72 -23 -218 -161 132 96 94 -172 -91 -181 22 -146 -129 96
4502 96 -4 -39 -152 237 -115 -29 180 -127 -36 138 147 164 96 101 -1 22 15 90 91 -101 63 -40 182 -49 -62 149
4528 149 140 150 -35 -63 58 248 -61 98 -135 105 -183 -294 50 140 -10 37 -76 16 -303 87 -137 160
4550 160 223 3 -83 165 -151 -111 -58 -99 -171 168 -79 169 -6 -102 183 -295 37 -58 -283 51 -254 10 -18
4573 -18 89 236 -201 -65 33 -150 16 243 87 44 49 112 -177 63 -227 -111 55 32 -106 101 54 -62 28
4596 28 -130 -57 -32 -71 -71 -138 122 -44 190 -36 -61 -3 251 -47 -21 -49 -29 158 -23 105 36 -2 15 -58 193
4621 193 -73 94 65 -8 -37 -191 126 -228 87 -68 -118 -22 45 -196 44 59 -183 7 -140 -130 196 0 65
4644 65 69 164 -32 -178 50 321 20 45 13 109 223 -12 8 -27 255 176 -189 53 50 107 212 142 143 -93 -105 3
4670 3 51 40 -1 -152 -54 319 -142 -93 56 -192 90 -146 105 -4 75 53 29 109 176 103 -3 197 -6 -37 -5
4695 -5 -116 114 -102 58 113 -3 27 -88 206 -128 180 -7 -112 -33 282 -17 -91 244 10 -149 -327 -98
4717 -98 116 -97 64 37 -188 -179 48 -189 -151 -40 184 125 -216 51 214 -62 -8 -162 204 53 -59 127
4739 127 250 288 99 -52 225 142 12 -92 -54 -31 -44 -51 -242 102 -212 -93 -10 -61 -95 -54 252 -113 26 84
4763 84 58 251 72 196 90 208 -19 43 178 -87 -25 -158 77 -149 47 32 -30 5 -117 295 -46 -167
4785 -167 -158 91 123 -56 208 300 134 -12 138 284 238 -83 59 -43 -36 -65 -52 -27 53 12 -16 -121 151 -56
4809 -56 -11 89 -51 54 -11 -219 109 341 -6 8 -226 -151 23 14 -18 20 37 -201 47 -176 -86 -70 84 10
4833 10 -211 40 -71 115 132 47 -16 171 130 170 59 69 237 147 149 122 -35 -128 -143 98 -117 -126 -66 126 97 50
4859 50 -54 146 -41 26 171 137 178 4 -132 -160 48 -157 91 -167 114 176 -384 -282 -266 17 7 64 -78
4882 -78 -55 -90 -127 -140 -74 -37 -6 -87 -54 316 143 90 -21 -79 61 158 10 31 -15 21 -22 107 -293 -13 -305 233
4908 233 164 -260 -57 61 -58 37 160 38 183 84 -16 115 0 -368 327 -22 2 0 83 326 -126 -140 -65
4931 -65 28 -51 -35 88 -206 153 -164 188 -215 255 -75 63 -120 -315 -50 -28 53 -181 45 -58 -77 136
4953 136 93 -310 -74 115 -29 34 160 151 -55 126 -22 141 -87 -188 260 -1 189 -74 -58 -100 105 2
4975 2 -273 -298 -50 38 -92 0 9 -155 100 -97 -10 -29 -130 -227 -113 198 130 263 -108 64 116 -144 -117 75
4999 75 -8 -11 -167 -62 -17 -31 151 42 -210 -201 96 -125 49 -147 -134 22 99 48 39 -77 -13 -45 252 234 25
5024 25 321 -62 -151 -135 173 -119 -45 233 222 72 119 -84 -405 -225 -48 -20 -63 100 -56 27 286 -352 -226
5047 -226 -47 -143 18 247 -165 4 186 17 32 29 -127 9 -102 300 -157 -195 198 124 -80 117 90 -149
5069 -149 57 -237 99 -159 -53 -185 30 61 -320 -156 -37 11 -230 64 40 146 -90 203 -253 77 -123
5090 -123 -42 103 78 111 187 55 -144 76 -108 -36 152 212 97 26 -131 -145 50 39 40 119 16 200 -292 -22
5114 -22 76 -140 42 123 -137 -110 28 -76 72 75 -127 -134 19 183 35 102 168 -61 16 -253 142 114 100 31 -77
5139 -77 -13 29 -47 -37 38 -293 84 298 -109 -18 157 -299 30 195 138 -49 -150 99 76 -272 95 259 -155
5162 -155 335 277 -34 162 20 79 43 133 21 127 18 45 -76 -56 101 -12 -341 -3 -1 -78 377 -176 -114
5185 -114 -12 69 -8 93 -272 37 -129 -27 -64 60 62 75 -120 76 176 -184 -208 231 216 -192 39 -53 120
5208 120 73 242 -37 -85 91 -72 71 277 205 237 61 100 -123 17 -51 -122 86 29 202 120 221 67 50
5231 50 -74 -108 39 52 169 -163 -39 -33 -64 59 3 271 98 -179 47 -3 -250 12 -1 -128 91 -217 -132
5254 -132 -36 -442 9 138 97 -26 -258 129 84 -270 -199 -77 120 -42 -40 -99 -129 -135 64 24 82 25 54 106 -12
5279 -12 -20 160 78 267 177 64 -147 10 -8 -29 6 -8 -132 -105 226 15 -17 -11 39 -172 82 -58 118 -33 -59
5304 -59 97 156 30 -41 69 36 -207 -26 199 269 -44 69 122 143 102 -147 -50 89 106 -241 -32 -254 -88
5327 -88 -55 -142 33 85 117 131 33 52 -20 -98 54 -15 -55 121 56 -26 -213 213 -37 26 2 168 271 340 154 -37
5353 -37 195 -34 83 -62 -11 60 -31 -14 -91 -8 -146 -252 106 -50 -8 -61 -65 111 186 -220 -108 -178 -94 -133 -305
5378 -305 -46 -169 -11 114 139 112 -59 -250 208 -72 39 78 -129 -4 100 -59 116 60 -121 194 -137
5399 -137 -180 -114 31 -121 149 13 123 118 72 102 112 136 -213 186 95 -136 -77 -89 153 25 32 -218 203 370
5423 370 -184 7 -29 67 112 -55 35 78 25 60 -49 39 11 -76 -273 -129 -216 216 -119 -208 108 -265 114 -143
5447 -143 -37 172 200 -28 -239 -16 -218 319 71 -41 45 29 -149 -105 403 -13 -233 -37 -67 31 106 79 -349
5470 -349 14 74 101 -40 -43 -89 11 27 42 149 -106 -214 95 37 100 120 -151 -14 -58 -126 131 -80 23 -177
5494 -177 -4 -218 -102 -24 55 -81 -16 243 57 140 -70 221 275 -17 46 277 37 6 -299 6 -8 152 195
5517 195 -67 -101 -124 30 -508 -396 -103 -59 35 117 -75 120 -120 58 129 -31 -8 -33 -79 -278 -25 148 100
5540 100 -75 -180 69 216 -26 154 53 137 -181 -214 316 106 293 10 -275 177 -51 -157 -143 -61 -45 -126
5562 -126 -255 106 -75 93 -29 -218 -74 70 418 -39 -159 -100 -111 130 93 264 86 260 139 209 -4
5583 -4 -125 -131 47 228 187 -20 -52 34 148 -187 -158 133 52 69 80 133 18 -31 -158 152 125 -15 123 152 -4
5608 -4 -159 105 47 190 -203 -77 18 -33 37 -86 -82 213 -68 -22 44 -168 -182 208 60 63 -77 -265 195 -74
5632 -74 -30 254 -147 16 -81 131 16 -83 37 248 137 -64 -65 73 -10 249 -85 -239 -69 4 136 -235 98
5655 98 -202 -202 31 -277 45 226 -76 -127 -72 115 -286 125 36 307 -40 -61 -119 -270 3 84 182 12 -411
5678 -411 114 -86 94 -29 19 -27 -105 -86 108 28 56 8 3 98 28 -33 -112 -71 107 -37 -146 4 38 144 -7
5703 -7 49 38 266 48 36 -230 169 -67 -46 172 7 51 43 33 94 104 94 91 -177 -16 -36 -157 141 84 -17 -19
5729 -19 -37 306 -92 57 142 -8 216 -9 -43 -221 40 35 -166 74 -146 7 68 -41 215 -302 0 199
5751 199 31 -147 115 -212 48 99 72 67 -216 68 -120 17 -47 18 -95 89 -167 31 139 -308 77 -84
5773 -84 -57 9 190 -4 -93 39 202 -50 -120 104 34 137 76 -61 -67 77 -15 -51 202 -102 186 -137 -40 129
5797 129 54 121 11 288 -170 38 176 227 125 55 -107 76 95 41 -231 -47 -259 -167 -39 -256 -231 110 100
5820 100 24 -296 -161 125 101 117 -119 193 194 302 102 99 108 40 -79 -127 -156 -55 130 174 -155 112 -58 -74 102
5845 102 70 298 -128 240 -44 -56 -79 9 82 -170 -113 25 43 -61 -17 -155 20 -42 -139 -422 180 146 -49 124
5869 124 32 62 85 4 199 126 131 -23 16 -193 175 200 -234 -220 54 -86 138 -90 -205 -231 28 -49 -127 -113 -51
5894 -51 -127 49 -134 -154 -67 -66 36 168 -68 -259 83 167 6 150 -153 103 196 230 76 144 120 147 144 -132 80
5919 80 -41 42 198 161 -364 175 138 -109 281 -305 240 230 -15 -27 -46 68 -44 22 153 -232 -208 174 -39
5942 -39 -17 13 -43 -39 106 43 136 29 263 82 -41 -154 144 -60 9 -82 155 181 78 -74 117 79 -153 -108
5966 -108 -58 -174 201 -154 -74 233 -206 11 166 -36 -77 2 -199 -33 117 178 111 340 -92 228 -116 -71
5988 -71 -56 -465 141 -140 -147 47 -97 111 50 122 5 167 -301 235 -10 63 -162 -100 24 273 -87 13 148
6011 148 46 47 -125 89 50 5 -126 -55 25 -79 -205 318 75 -392 -135 51 -92 -46 -220 -26 -43 -249 -152
6034 -152 38 6 -78 -147 97 -63 63 10 -155 -88 205 -76 -61 148 198 8 -143 107 -3 25 -177 -151 77
6057 77 166 23 34 -6 -187 -102 39 92 78 -44 88 -41 -122 -25 -2 -30 10 -4 135 41 156 -207 20 222 60
6082 60 254 28 -81 0 138 -89 74 -147 200 106 -89 187 -98 -105 12 84 95 -91 97 -204 -189 -67 101
6105 101 -50 -118 -122 104 139 -153 -39 -60 -68 -70 -143 31 139 152 275 46 68 -53 127 192 38 -177 72 63 151
6130 151 -71 -99 -18 -182 -51 -187 -109 31 91 158 -183 -44 60 -257 48 -41 109 13 -24 -191 -10 99 20
6153 20 64 -3 194 -150 -141 -56 175 -100 91 119 -102 136 156 -257 -58 -4 123 -85 89 67 -7 184 -16 104
6177 104 295 -67 0 -39 80 17 130 57 -287 32 137 -8 49 257 42 -281 -239 57 199 -10 23 21 -213
6200 -213 127 -238 -98 -44 -212 52 -27 237 245 -105 39 274 112 28 78 -104 -150 112 17 281 4 -129 6
6223 6 -58 185 181 -86 170 37 -88 -193 -59 65 56 15 104 -22 -8 -351 -137 -7 -108 -148 -138 7 -75 -116 -283
6248 -283 -4 -6 39 -37 -164 191 59 186 12 6 -125 151 55 130 132 148 151 192 -3 96 23 -13 -159 140 65 17
6274 17 -218 37 -145 -86 242 -159 -115 -112 -61 -71 -302 254 100 17 203 78 119 -39 221 -223 282 200 126 211
6298 211 -163 300 175 233 -308 -61 -90 103 -63 235 -55 22 -143 -146 39 108 108 -106 -224 7 209 -100 126
6321 126 -139 -11 -123 161 -73 181 7 58 22 70 313 -199 248 169 47 203 122 170 -201 -33 -67 35
6343 35 -102 -79 139 -7 20 -79 25 393 -65 -169 114 26 179 -184 44 -109 -392 92 -10 238 3 -41
6365 -41 121 135 -175 -156 4 -5 62 -72 -14 -56 -35 -120 -25 -184 -118 -151 -70 -53 -33 -144 147 10 192 -125 -31 -26
6391 -26 6 -143 48 -158 71 -110 9 -42 -213 95 214 318 159 -27 -226 148 223 -267 48 -19 -142 -41
6413 -41 -92 -55 11 -180 -154 -8 123 -157 133 48 -85 -8 43 38 -44 176 -21 -61 -6 -67 155 -2 -89 73 38
6438 38 39 43 187 -20 207 48 -172 32 69 -43 -22 132 -59 -213 -109 -234 211 -119 -184 -58 139 110 -33
6461 -33 -142 -22 32 -170 -58 60 43 -51 100 -93 -177 -112 8 -269 -17 40 -135 -176 134 -58 -149 58 0
6484 0 -116 33 216 28 124 -198 105 -107 114 120 -190 -21 45 -19 -13 233 9 94 -88 -156 3 -105 85 -122
6508 -122 41 -100 226 -122 172 30 -34 106 -164 365 -231 70 -62 -355 -147 -27 122 -6 84 -262 -60
6529 -60 -12 78 50 -115 -33 -42 73 17 -32 -59 40 76 161 219 98 -165 99 -95 139 130 -98 67 57 54 -30 -84 176
6556 176 -12 -119 -243 72 -7 78 -100 -93 -255 160 41 109 61 14 55 -212 -217 55 -46 -139 -110 241 -19 -110
6580 -110 -226 38 207 -138 -176 -106 18 -25 -93 -42 125 -123 -47 -170 37 -139 -78 -115 211 210 66 70 -131 50
6604 50 71 111 -188 -201 -142 -59 -77 -173 -14 -79 25 -32 -39 110 112 9 -111 -86 -3 136 -111 -194 18 83 -170 249
6630 249 316 137 -35 -145 123 -119 20 -115 155 -113 -45 122 55 32 -222 -166 57 238 25 2 22 -211
6652 -211 70 535 27 42 -143 -52 237 2 69 -244 -280 -39 58 -8 -94 101 123 273 73 99 -37 -80 230
6675 230 -37 -51 -249 -111 255 7 29 -222 48 -19 114 121 71 -121 -64 -119 -214 80 25 -167 -164 -162 -140 33 -90
6700 -90 43 -111 -88 156 137 51 -39 -108 -59 -229 -219 -221 119 116 -254 136 280 82 -84 -145 94 -131 129 96 97
6725 97 -150 119 107 -23 -136 19 351 -29 -336 90 -80 -154 -137 -22 -65 177 1 92 -50 -41 -145 -68 83
6748 83 41 139 -71 84 33 162 160 187 135 199 75 60 48 -29 122 -121 244 238 200 97 -170 38 44 -116 -37 193
6774 193 119 167 214 -95 -128 81 125 126 -123 -223 -86 144 -65 -82 -56 -1 36 93 83 36 -51 26 -136 123 -27
6799 -27 -4 234 167 -125 -20 -101 279 183 -5 -134 192 -85 -156 -213 284 -227 228 -148 202 125 33 166 -134
6822 -134 -166 -307 -113 31 -13 66 -31 37 46 -162 60 -129 116 -172 9 36 -55 -294 -175 -244 -355 126 -99
6845 -99 -259 -102 91 -296 32 121 50 -66 -144 -129 152 -93 88 369 43 -14 22 79 246 30 21 -116 6
6868 6 -183 -178 -33 -126 77 11 85 170 -75 -56 -91 268 -45 244 38 -35 -72 -148 -2 41 144 189 111 -172 77
6893 77 -94 227 -81 -44 -124 128 -15 -347 47 -183 -154 -9 -113 -97 165 26 -167 70 -91 -27 182 -170
6915 -170 -295 -190 -126 270 -68 -374 235 -244 -97 -130 -144 241 54 82 121 114 -68 -182 -188 -345 -74 128 -178
6938 -178 252 141 -55 153 3 154 -20 67 -158 -168 38 185 350 76 -156 -76 94 155 -292 -53 -139 -143
6960 -143 -52 -60 -141 -104 -92 93 114 -44 -63 181 -53 198 319 -144 306 -7 -4 -82 178 -112 63 -124 -134 -84
6984 -84 -62 -145 119 -39 94 -305 -135 13 -173 -84 113 227 -67 71 17 54 -114 151 85 102 -171 69 -101
7007 -101 142 -59 -302 -21 -160 -204 210 -371 73 29 -94 377 121 -131 137 -136 -236 127 -7 201 39
7028 39 283 191 150 -159 -12 37 -90 -115 -191 203 200 141 -10 -154 -254 -35 35 -81 73 3 -44 86 -184 -190 -81
7053 -81 -148 302 139 148 -144 51 145 25 -280 -198 207 -17 25 44 66 -38 133 -78 -136 186 -163 163 -106
7076 -106 -127 139 57 -200 -90 -56 119 9 -351 12 153 -62 86 -156 -50 112 -204 -26 152 24 66
7097 66 17 -242 -130 21 -132 -256 -185 -38 -52 52 -62 370 29 -73 100 -68 -20 169 -185 -110 58 -188
7119 -188 22 -10 -213 -322 -174 38 61 138 214 65 -30 14 190 215 -91 51 -57 -122 3 178 -53 -63 56
7142 56 -50 62 240 184 141 98 -56 63 -189 1 -66 -33 10 152 103 -18 -114 -198 266 -152 131 -116 -157 -17
7166 -17 -65 9 144 48 -320 49 37 345 92 137 -28 104 -62 213 37 -79 -164 -18 43 -58 107 -192 -152
7189 -152 -171 346 -256 -40 3 84 78 -34 -209 -185 15 41 -135 118 43 -60 -94 -19 98 23 -31 90 -68 -154
7213 -154 -170 46 -220 131 36 106 -49 -195 7 44 -86 -141 -151 44 58 190 -171 -13 46 -212 147 -41 -103
7236 -103 -5 -49 72 -175 123 218 184 -144 -248 -174 -156 67 147 235 12 10 -125 -64 -128 16 -83 177 -304 172
7260 172 -7 -65 -110 -78 -58 -301 68 -62 104 -63 -146 57 108 -58 352 8 -7 98 21 -159 -121 -75 6 -54
7284 -54 138 50 -131 27 170 -4 203 322 315 177 -202 129 -35 -32 50 -176 -111 -319 -144 176 -33 142 144
7307 144 4 -31 -61 100 8 -84 84 21 257 -14 105 228 -363 42 174 165 -110 96 106 167 -245 48 157
7330 157 221 25 -91 74 -385 97 -63 38 16 -27 -66 115 -46 -143 188 -140 -150 187 246 -224 53 -4 -47
7353 -47 144 -134 -22 -45 61 43 185 -50 51 -202 -26 -94 -83 59 27 -56 -20 -101 -105 88 13 -62 -90 74 14
7378 14 -134 -10 -90 255 -241 -81 -272 253 36 -59 -226 -303 -58 15 25 105 -194 153 103 75 82 18 376 200
7402 200 -1 57 37 51 -94 -220 257 -62 -180 -58 5 135 243 8 245 26 256 12 31 241 13 -68
7424 -68 100 195 -113 168 317 219 -25 -29 -55 287 214 32 123 159 -32 48 -227 -94 78 2 -67 -261 140 -74
7448 -74 -138 -190 -88 -335 -73 -18 -233 39 -64 -45 41 94 -79 -218 161 30 34 39 87 -119 -178 -93 65 -185 148
7473 148 246 -204 -144 71 6 132 54 -105 141 151 -69 89 -220 -99 284 36 103 124 57 10 -128 -30 -83 19
7497 19 -78 19 354 -123 26 82 106 13 -134 -167 90 133 14 -125 182 222 93 -15 93 121 41 30 -343 256
7521 256 258 11 212 -76 -118 124 -220 44 55 129 98 -181 27 -27 160 -5 -59 31 -22 -149 31 -77 -231
7544 -231 -46 88 116 60 8 -187 200 -70 -131 94 116 -148 -144 -105 22 155 61 115 124 195 -86 40 -77 -91 -119
7569 -119 161 49 -30 127 -133 90 -263 83 -17 10 -82 177 -25 -99 60 -20 -72 11 70 -106 146 -16 147
7592 147 108 -208 124 -84 -100 237 -196 77 -24 -26 -45 -146 -19 -54 -145 43 132 74 -249 1 27 -3 -174 41
7616 41 -109 -85 85 44 -51 -115 26 114 -66 268 -113 -158 207 -139 27 -163 210 212 193 70 86 137 93 -155
7640 -155 209 142 -20 -136 -167 321 -142 -96 -44 24 64 346 -174 -9 -142 -147 -57 54 -12 -12 9 220 -86 -3 -233
7665 -233 61 -33 160 -103 -53 217 -88 21 210 -114 -114 168 127 66 116 211 50 -102 59 43 304 94 -168
7688 -168 88 -8 -134 -80 -81 -126 177 83 -8 116 -57 111 -53 10 22 -97 38 13 15 -47 -202 -211 26 54 106 -65
7714 -65 391 -49 176 18 -244 19 7 92 10 -76 -127 -29 56 41 62 71 13 -17 -64 269 6 79 -198 -138 24 -138
7740 -138 259 -129 -52 -129 -29 152 -98 79 -144 102 -86 102 -115 -52 8 69 66 59 9 -222 -140 -162 110 68
7764 68 22 -110 -66 85 211 -195 -30 -225 -36 351 -450 52 48 -115 -68 149 77 122 -128 -80 234 44 45 30
7788 30 -43 -135 166 -350 -194 -203 -199 108 44 27 3 -36 80 -10 67 -185 95 41 62 -110 131 -60 -66 216 -112 103
7814 103 -52 -278 -43 82 159 -191 -161 59 -136 -83 117 -11 -109 -16 24 -61 -44 128 -69 108 -61 -282 134
7837 134 -236 19 -59 -43 -155 3 -87 -218 169 -211 177 39 -214 31 -33 39 300 -481 126 14 -155 -98
7859 -98 -72 80 187 224 57 -32 19 39 -147 82 128 59 28 152 -232 -114 -93 -143 214 -46 28 24 57 -66 138
7884 138 134 90 -128 80 66 89 -95 -144 103 -165 -19 -66 -57 144 228 148 139 -171 194 71 21 220 -54 183 9
7909 9 25 25 -51 -88 234 116 195 18 -125 154 58 -113 -49 186 136 -118 115 -207 -44 337 -7 46 150 144 6
7934 6 -79 -20 75 -149 -127 192 -185 -104 70 -13 67 248 31 -14 -168 -114 53 94 -212 -90 -94 -1 303 -140 85
7959 85 -118 190 21 98 -145 83 -239 71 169 -119 49 -191 -122 -207 -125 -51 -74 -82 -29 -47 -95 -74 269 -79 130
7984 130 -194 245 254 26 125 -34 -56 140 198 -105 28 -68 145 -182 -72 16 -98 -32 -160 84 -18 -122 -95
8007 -95 34 31 -97 -10 185 1 401 -127 73 45 118 -55 18 36 147 128 -60 28 189 152 52 240 317 -180
8031 -180 -248 214 -29 43 -95 247 -132 -52 -120 -218 135 223 205 141 -53 -72 339 247 -99 13 -59 9 -43 -98 367
8056 367 -47 2 -166 41 24 216 -28 -87 28 402 -162 -35 17 245 29 -138 79 308 152 6 55 -76
8078 -76 54 62 -287 -213 247 -58 -44 50 67 -203 -101 86 -104 383 -52 67 154 -111 -7 -122 73 39 -146
8101 -146 -217 14 119 20 -218 -55 157 83 -91 52 37 241 329 120 69 -178 148 263 51 91 38 -182 -162
8124 -162 113 -23 -184 34 -93 170 -70 -95 74 -47 49 -106 204 -151 -7 211 78 -250 -58 36 28 245
8146 245 -76 -132 47 -185 -63 -27 -56 106 -56 -13 -143 13 -77 114 -20 52 33 -29 5 -9 -29 85 162 204
8170 204 168 -4 -218 -215 100 -275 57 -85 -119 -105 5 90 -41 -159 -3 -81 102 49 -190 33 8
8191H
##END NTUPLES=NMR FID
##END=
