##TITLE=1H_PhPM1709
 CDCl3, 8 sc, 
 18.9.2019
##JCAMPDX= 6.0         $$ Bruker NMR JCAMP-DX V2.0
##DATA TYPE= NMR FID
##DATA CLASS= NTUPLES
##ORIGIN= UXNMR, Bruker Analytische Messtechnik GmbH
##OWNER= root
$$ XWIN-NMR		Version 3.5
$$ Wed Sep 18 13:57:13 2019 Russian Standard Time (UT+4h)  she@DPX200
##.OBSERVE FREQUENCY= 200.1315
##.OBSERVE NUCLEUS= ^1H
##.DELAY= (6, 6)
##.ACQUISITION MODE= SIMULTANEOUS
##.ACQUISITION SCHEME= undefined
##.AVERAGES= 8
##.DIGITISER RES= 18
##SPECTROMETER/DATA SYSTEM= spect
##.PULSE SEQUENCE= zg30
##.SOLVENT NAME= CDCl3
##.SHIFT REFERENCE= (INTERNAL, CDCl3, 0, 15.7039)
##AUDIT TRAIL= $$ (NUMBER, WHEN, WHO, WHERE, WHAT)
$$ ##TITLE= Audit trail, XWIN-NMR		Version 3.5
$$ ##JCAMPDX= 5.01
$$ ##ORIGIN= Bruker BioSpin GmbH
$$ ##OWNER= she
$$ F:/spectra/data/she/nmr/H-F/1/audita.txt
$$ ##AUDIT TRAIL=  $$ (NUMBER, WHEN, WHO, WHERE, WHAT)
(   1,<2019-09-18 13:56:08.29 +0400>,<she>,<DPX200>,
      <created by zg, POWCHK disabled, PULCHK disabled
       configuration hash MD5:
       00 E9 B6 7A A2 85 ED C7 34 08 36 98 17 FE 4E 26
       data hash MD5: 16K
       BD C9 87 9A E4 02 07 5A 69 4D CA 76 F1 AB C3 35>)
$$ ##END=
$$ 
$$ hash MD5
$$ 3A 8E 92 B6 3C E1 DA 51 24 EB B2 C1 9C C5 2C 65
##$RELAX= 
##$RELAX= 
##$RELAX= 
##$RELAX= 
##$RELAX= 
##$RELAX= 
$$ Bruker specific parameters
$$ --------------------------
##$DU= <F:/spectra>
##$EXPNO= 1
##$NAME= <H-F>
##$PROCNO= 1
##$TYPE= <nmr>
##$USER= <she>
##$AMP= (0..31)
100 100 100 100 100 100 100 100 100 100 100 100 100 100 100 100 100 100 
100 100 100 100 100 100 100 100 100 100 100 100 100 100 
##$AQSEQ= 0
##$AQ_mod= 1
##$AUNM= <au_zg>
##$AUTOPOS= <>
##$BF1= 200.13
##$BF2= 200.13
##$BF3= 200.13
##$BF4= 200.13
##$BF5= 200.13
##$BF6= 200.13
##$BF7= 200.13
##$BF8= 200.13
##$BYTORDA= 1
##$CFDGTYP= 0
##$CFRGTYP= 5
##$CHEMSTR= <none>
##$CNST= (0..31)
1 1 145 1 1 1 1 1 1 1 1 1 1 1 1 1 1 1 1 1 1 1 1 1 1 1 1 1 1 1 1 1 
##$CPDPRG= <>
##$CPDPRG1= <>
##$CPDPRG2= <>
##$CPDPRG3= <>
##$CPDPRG4= <mlev>
##$CPDPRG5= <mlev>
##$CPDPRG6= <mlev>
##$CPDPRG7= <mlev>
##$CPDPRG8= <mlev>
##$CPDPRGB= <>
##$CPDPRGT= <>
##$D= (0..31)
0 1.2 0 0 0 0 0 0 0 0 0 0.03 0 0 0 0 0 0 0 0 0 0 0 0 0 0 0 0 0 0 0 0 
##$DATE= 1568800567
##$DBL= (0..7)
120 120 120 120 120 120 120 120 
##$DBP= (0..7)
150 150 150 150 150 150 150 150 
##$DBP07= 0
##$DBPNAM0= <>
##$DBPNAM1= <>
##$DBPNAM2= <>
##$DBPNAM3= <>
##$DBPNAM4= <>
##$DBPNAM5= <>
##$DBPNAM6= <>
##$DBPNAM7= <>
##$DBPOAL= (0..7)
0.5 0.5 0.5 0.5 0.5 0.5 0.5 0.5 
##$DBPOFFS= (0..7)
0 0 0 0 0 0 0 0 
##$DE= 6
##$DECBNUC= <off>
##$DECIM= 24
##$DECNUC= <off>
##$DECSTAT= 4
##$DIGMOD= 1
##$DIGTYP= 9
##$DL= (0..7)
0 120 120 120 120 120 120 120 
##$DP= (0..7)
150 150 150 150 150 150 150 150 
##$DP07= 0
##$DPNAME0= <>
##$DPNAME1= <>
##$DPNAME2= <>
##$DPNAME3= <>
##$DPNAME4= <>
##$DPNAME5= <>
##$DPNAME6= <>
##$DPNAME7= <>
##$DPOAL= (0..7)
0.5 0.5 0.5 0.5 0.5 0.5 0.5 0.5 
##$DPOFFS= (0..7)
0 0 0 0 0 0 0 0 
##$DQDMODE= 0
##$DR= 18
##$DS= 0
##$DSLIST= <SSSSSSSSSSSSSSS>
##$DSPFIRM= 0
$$ [...]
##$SUBNAM2= <"">
##$SUBNAM3= <"">
##$SUBNAM4= <"">
##$SUBNAM5= <"">
##$SUBNAM6= <"">
##$SUBNAM7= <"">
##$SUBNAM8= <"">
##$SUBNAM9= <"">
##$SW= 24.0689530833862
##$SWIBOX= (0..15)
0 0 2 0 0 0 0 0 0 0 0 0 0 0 0 0 
##$SW_h= 4816.95568400771
##$TD= 16384
##$TD0= 1
##$TE= 0
##$TE2= 300
##$TE3= 300
##$TEG= 300
##$TL= (0..7)
0 120 120 120 120 120 120 120 
##$TP= (0..7)
150 150 150 150 150 150 150 150 
##$TP07= 0
##$TPNAME0= <>
##$TPNAME1= <>
##$TPNAME2= <>
##$TPNAME3= <>
##$TPNAME4= <>
##$TPNAME5= <>
##$TPNAME6= <>
##$TPNAME7= <>
##$TPOAL= (0..7)
0.5 0.5 0.5 0.5 0.5 0.5 0.5 0.5 
##$TPOFFS= (0..7)
0 0 0 0 0 0 0 0 
##$TUNHIN= 0
##$TUNHOUT= 0
##$TUNXOUT= 0
##$USERA1= <user>
##$USERA2= <user>
##$USERA3= <user>
##$USERA4= <user>
##$USERA5= <user>
##$V9= 5
##$VALIST= <valist>
##$VCLIST= <CCCCCCCCCCCCCCC>
##$VD= 0
##$VDLIST= <DDDDDDDDDDDDDDD>
##$VPLIST= <PPPPPPPPPPPPPPP>
##$VTLIST= <TTTTTTTTTTTTTTT>
##$WBST= 1024
##$WBSW= 4
##$XGAIN= (0..3)
0 0 0 0 
##$XL= 0
##$YL= 0
##$YMAX_a= 213045
##$YMIN_a= -292758
##$ZGOPTNS= <>
##$ZL1= 120
##$ZL2= 120
##$ZL3= 120
##$ZL4= 120
##$ABSF1= 10
##$ABSF2= 0
##$ABSG= 5
##$ABSL= 3
##$ALPHA= 0
##$AQORDER= 0
##$ASSFAC= 0
##$ASSFACI= 0
##$ASSFACX= 0
##$ASSWID= 0
##$AUNMP= <proc_1d>
##$AZFE= 0.1
##$AZFW= 0.1
##$BCFW= 1
##$BC_mod= 2
##$BYTORDP= 1
##$COROFFS= 0
##$CY= 11.3945322036743
##$DATMOD= 1
##$DC= 2
##$DFILT= <>
##$DTYPP= 0
##$F1P= 20.1720416913024
##$F2P= 0.152960286110954
##$FCOR= 0.5
##$FTSIZE= 0
##$FT_mod= 4
##$GAMMA= 1
##$GB= 0.15
##$INTBC= 1
##$INTSCL= 1
##$ISEN= 128
##$LB= 0.24
##$LEV0= 0
##$LPBIN= 0
##$MAXI= 10000
##$MC2= 0
##$MEAN= 0
##$ME_mod= 0
##$MI= 1.114404
##$NCOEF= 0
##$NC_proc= 0
##$NLEV= 6
##$NOISF1= 3.799351
##$NOISF2= 2.8
##$NSP= 1
##$NTH_PI= 0
##$NZP= 0
##$OFFSET= 15.70392
##$PC= 1
##$PHC0= -9732.91
##$PHC1= 16.00096
##$PH_mod= 1
##$PKNL= yes
##$PPARMOD= 0
##$PSCAL= 0
##$PSIGN= 0
##$REVERSE= no
##$SF= 200.130013532006
##$SI= 16384
##$SIGF1= 3
##$SIGF2= 2
##$SINO= 400
##$SIOLD= 16384
##$SREGLST= <1H.CDCl3>
##$SSB= 0
##$STSI= 0
##$STSR= 0
##$SW_p= 3612.71676300578
##$SYMM= 0
##$S_DEV= 0
##$TDeff= 0
##$TDoff= 0
##$TI= <>
##$TILT= no
##$TM1= 0
##$TM2= 0
##$TOPLEV= 0
##$USERP1= <user>
##$USERP2= <user>
##$USERP3= <user>
##$USERP4= <user>
##$USERP5= <user>
##$WDW= 1
##$XDIM= 8192
##$YMAX_p= 0
##$YMIN_p= 0
$$ End of Bruker specific parameters
$$ ---------------------------------
##NTUPLES= NMR FID
##VAR_NAME=  TIME,          FID/REAL,        FID/IMAG
##SYMBOL=    X,             R,               I
##VAR_TYPE=  INDEPENDENT,   DEPENDENT,       DEPENDENT
##VAR_FORM=  AFFN,          ASDF,            ASDF
##VAR_DIM=   8192,          8192,            8192
##UNITS=     SECONDS,       ARBITRARY UNITS, ARBITRARY UNITS
##FACTOR=    0.0002076,     1,               1
##FIRST=     0,             0,               0
##LAST=      1.7004516,     0,               0
##MIN=       0,             -292758,         0
##MAX=       1.7004516,     213045,          0
$$ Real data points
##PAGE= N=1
##DATA TABLE= (X++(R..R)), XYDATA
$$ plain form
0 0 0 0 0 0 -8 0 -8 8 -8 16 -16 24 -32 32 -40 48 -64 72 -88 104 -120 144 -165 191 -216 248 -285 322 -367
29 -367 415 -466 525 -589 658 -733 817 -909 1011 -1119 1240 -1375 1523 -1686 1867 -2068
45 -2068 2293 -2549 2840 -3175 3561 -4021 4570 -5245 6098 -7214 8741 -10977 14571 -21320
59 -21320 38461 -173888 -292758 -10105 -78584 -160880 -133184 -91018 -216752 -215816 -63243 -13557
71 -13557 -168174 -203724 -92546 -70955 -168473 -125680 598 -6723 -104024 -88681 -64024 -151382
83 -151382 -188353 -38173 61070 -47841 -155215 -92415 -33762 -73163 -57268 32990 -2366
94 -2366 -136104 -133644 -11822 1183 -66668 -27492 52877 -1192 -88421 -43305 23482 -21479
106 -21479 -45162 41179 58951 -63946 -105240 20145 89820 15037 -15323 45275 24858 -63709
$$ packed form
0@%%%%qQqJ6j6K4l2M0n6O4p2Q8j12J36j60J92k24K64l09L56m07M64n33O07o89
29c67P82q81R91j114J247j391J550j726J920k130K359k615K898l209L553l935
45b068M361m842N389o015O736p582Q591r815J1343j3312J5955j9718K5548l5891
59b1320N9781k12349j18870K82653o8479q2296K7696M2166j25734R36J52573M9686
71a3557j54617l5550J11178K1591r7518M2793J26278p321r7301J5343K4657q7358
83a51382l6971J50180R9243j08911j07374O2800N8653l9401J5895R0258l5356
94b366j33738K460J21822J3005o7851L9176Q0369n4069q7229M5116O6787m4961
106b1479k3683Q6341J7772j22897m1294J25385O9675p4783l0360O0598k0417q8567
$$ plain form
118 -63709 -27940 89386 75434 -26197 -11928 70177 44899 -21230 22819 91594 55135 6624
130 6624 41050 52041 -12715 -15236 77198 100793 20827 -7031 42365 41147 1671 36771 86883
143 86883 30328 -45172 -3791 66114 34379 -14708 24330 61484 13672 -22130 14707 24152
155 24152 -26188 -25856 35489 32880 -36621 -45970 7305 12246 -22336 -10902 9235 -35850 -75759
168 -75759 -29536 19499 -16060 -56736 -24589 3889 -32417 -56187 -22243 -8909 -43941 -48302
180 -48302 -11903 -17604 -62307 -58297 -12437 -8526 -40819 -44781 -35360 -54895 -64748 -31269 -14184
193 -14184 -49584 -70509 -41515 -27722 -55568 -60905 -30020 -28585 -60284 -59570 -32279 -39871 -64940
206 -64940 -46405 -11920 -25851 -60385 -54220 -30043 -33320 -39453 -22880 -20255 -46499 -51501 -21604
$$ packed form
118f3709L5769J17326j3952j01631J4269Q2105k5278o6129M4049O8775l6459m8511
130F624L4426J0991o4756k521R2434K3595p9966k7858M9396j218l9476L5100N0112
143H6883n6555p5500M1381O9905l1735m9087L9038L7154m7812l5802L6837R445
155B4152n0340L32O1345k609o9501r349N3275M941l4582J1434K0137m5085l9909
168g5759M6223M9035l5559m0676L2147K8478l6306k3770L3944J3334l5032m361
180d8302L6399n701m4703M010M5860L911l2293l962R421j9535r853L3479J7085
193a4184l5400k0925K8994J3793k7846n337L0885J435l1699P14K7291p592k5069
206f4940J8535L4485j3931l4534O165K4177l277o133J6573K625k6244n002K9897
$$ plain form
219 -21604 -10045 -30396 -34685 -16686 -18420 -34948 -25720 -4948 -12875 -28767 -14843 2418 -13025
232 -13025 -30665 -14176 7277 295 -11440 -5158 -1875 -11481 -7872 10742 12419 -4585 -8766
245 -8766 2300 5347 2317 9174 13788 2604 -3620 9582 18077 6800 716 13566 19799 7517
259 7517 2047 13387 18243 10173 10357 20266 17975 5455 5242 16044 18219 12915 13021 13751 8242
274 8242 7907 17053 19257 9500 5767 12322 11612 3337 5904 16435 13926 1772 1293 9860 8644
289 8644 753 2039 7728 4009 -3309 -2004 2416 637 -2437 -1341 -1815 -5471 -5411 -3160 -6002 -9634
305 -9634 -6127 -2890 -9196 -15808 -11273 -4684 -8462 -14677 -12157 -8520 -13363 -18275 -14228 -9276 -12581
320 -12581 -18130 -17554 -14210 -13945 -15851 -16677 -16781 -15686 -14318 -15651 -19363 -19136 -14283 -13118 -18210 -20440
$$ packed form
219b1604J1559k0351m289J7999j734j6528R228K0772p927j5892J3924J7261j5443
232a3025j7640J6489K1453o982j1735O282L283r606L609J8614J677j7004m181
245h766J1066L047l030O857M614j1184o224J3202Q495j1277o084J2850O233j2282
259G517n470J1340M856q070J84R909k291j2520k13J0802K175n304J06P30n509
274H242l35R146K204r757l733O555p10q275K567J0531k509j2154m79Q567j216
289H644p891J286N689l719p318J305M420j779l074J096m74l656O0K251k842l632
305i634L507L237o306o612M535O589l778o215K520L637m843m912M047M952l305
320a2581n549N76L344K65j906q26j04J095J368j333l712K27M853J165n092k230
$$ plain form
336 -20440 -15784 -12979 -16596 -18343 -13880 -11554 -16287 -19766 -15853 -11637 -13593 -17060 -15235 -10614 -9323
351 -9323 -11895 -14013 -12870 -9521 -7813 -9991 -12756 -11259 -7003 -5906 -7744 -6845 -3777 -4462 -8047 -7009
367 -7009 -1411 -669 -6450 -8956 -3415 2351 379 -4012 -2990 1817 3045 11 -1934 -850 255
382 255 -333 -313 2194 4613 3980 1636 2103 5704 6734 2128 -2434 -178 6144 7581 3302 1708 6193
399 6193 10006 7542 3371 3416 5144 3946 2065 4298 8234 7670 3777 3322 7739 10207 5952 -197
415 -197 -637 4061 6317 3141 -39 1849 5795 5673 2293 983 2171 1316 -1567 -2037 1059 1840 -1433
432 -1433 -3011 974 5078 2623 -3585 -5075 -1035 1415 -1821 -5525 -4343 -543 519 -1308 -1846
447 -1846 -973 -2006 -4545 -4281 -1263 -853 -4730 -7135 -3762 1150 1023 -3290 -5447 -2980 -132 -1318
$$ packed form
336b0440M656K805l617j747M463K326m733l479L913M216j956l467J825M621J291
351i323k572k118J143L349J708k178k765J497M256J097j838Q99L068o85l585J038
367g009N598P42n781k506N541N766j972m391J022M807J228l034j945J084J105
382B55n88K0K507K419o33k344M67L601J030m606m562K256O322J437m279j594M485
399F193L813k464m171M5J728j198j881K233L936n64l893m55M417K468m255o149
415a97m40M698K256l176l180J888L946j22l380j310J188q55k883m70L096P81l273
432a433j578L985M104k455o208j490M040K450l236l704J182L800J062j827n38
447a846Q73j033k539K64L018M10l877k405L373M912j27m313k157K467K848j186
$$ plain form
463 -1318 -4652 -5210 -2677 -1402 -3279 -4078 -1674 -90 -2260 -3651 -1039 604 -3619 -8064 -5294 740
479 740 1129 -3191 -4552 -1545 503 -111 -1140 -1792 -2851 -3060 -2217 -1593 -801 1049 1668 -218 -727 1960
497 1960 2195 -2373 -3755 1929 5448 636 -3771 39 5091 3486 914 2655 3283 -906 -2359 2242
513 2242 5007 1843 -255 1911 3090 1891 2150 2917 937 96 3203 3648 -1628 -3265 3170 6723
529 6723 2022 -861 2788 2722 -3043 -2208 5872 6467 -2222 -4626 2379 4826 44 -603 3318 1811
545 1811 -2785 -1115 2574 267 -1924 2277 3872 -2252 -4944 728 2590 -2793 -2176 4236 1752
560 1752 -7312 -5212 4961 3681 -6086 -5055 2975 774 -6568 -2895 4211 -62 -6699 -2243 2887
575 2887 -2721 -7073 -1134 2200 -3542 -4774 821 -698 -7687 -3976 4839 451 -9518 -5135 4406
$$ packed form
463a318l334n58K533J275j877p99K404J584k170j391K612J643m223m445K770O034
479G40L89m320j361L007K048o14j029o52j059k09Q43O24P92J850O19j886n09K687
497A960K35m568j382N684L519m812m407L810N052j605k572J741O28m189j453M601
513B242K765l164k098K166J179j199K59P67j980q41L107M45n276j637O435L553
529F723m701k883L649o6n765Q35Q080N95q689k404P005K447m782o47L921j507
545A811m596J670L689k307k191M201J595o124k692N672J862n383O17O412k484
560A752r064K100J0173j280r767J031Q030k201p342L673P106m273o637M456N130
575B887n608m352N939L334n742j232N595j519o989L711Q815m388r969M383R541
$$ plain form
590 4406 -1069 -9841 -2875 5970 -1648 -9689 -968 6877 -2567 -10242 -1128 5621 -2224 -6457 1061
605 1061 2376 -5097 -2817 6391 2742 -7426 -3560 5174 -531 -7748 1185 8829 -1887 -9649 1963
620 1963 9365 -2824 -9353 3391 8861 -4364 -9162 3179 6789 -3634 -3598 6735 4033 -6947
634 -6947 -2877 7593 2417 -6109 1143 7766 -2170 -7153 6052 11351 -2690 -7221 7164 9281
648 9281 -6690 -7734 9501 10586 -5560 -5367 9213 7010 -6266 -1486 10923 3818 -8497 -1033
662 -1033 9144 1452 -4788 5389 8573 -4865 -6818 8572 9476 -6606 -6195 9691 6862 -9528
676 -9528 -4483 12582 6823 -9569 -3124 11078 2746 -9761 12 11028 11 -9399 1542
689 1542 7733 -3316 -5095 8203 6846 -9530 -7890 8168 5352 -8919 -2648 11032 922
$$ packed form
590D406n475q772O966Q845p618q041Q721P845r444p675R114O749p845m233P518
605A061J315p473K280R208l649j0168L866Q734n705p217Q933P644j0716p762J1612
620A963P402j2189o529J2744N470j3225m798J2341L610j0423L6J0333k702j0980
634f947M070J0470n176q526P252O623r936m983J3205N299j4041m531J4385K117
648I281j5971j044J7235J085j6146J93J4580k203j3276M780J2409p105j2315P464
662a033J0177p692o240J0177L184j3438j953J5390R04j6082M11J5886k829j6390
676i528N045J7065n759j6392O445J4202q332j2507R773J1016j1017r410J0941
689A542O191j1049j779J3298j357j6376J640J6058k816j4271O271J3680j0110
$$ plain form
702 922 -13813 -1941 13949 2747 -11506 -1113 8792 -3841 -11106 4319 11743 -3073 -9038
715 -9038 3292 4583 -7450 -3612 10575 4525 -11150 -5429 7764 225 -9351 3307 12848 -3538
729 -3538 -15224 356 10913 -3146 -9641 5714 8615 -9425 -12149 6067 9082 -5157 -4588
742 -4588 6760 -161 -13189 -3464 11235 3034 -8461 535 6847 -6867 -11554 6807 13047 -5142
756 -5142 -11647 3875 6438 -8750 -6843 11037 8633 -9760 -8454 5952 2352 -8219 570 11137
770 11137 -385 -11987 -1592 7206 -2589 -5806 7508 8045 -9226 -10753 6225 7677 -6253
783 -6253 -3747 9642 2840 -12728 -4979 11194 4901 -8208 -1151 7797 -2696 -10389 2516 10370
797 10370 -1664 -7439 3570 4826 -7593 -5978 8362 6108 -7553 -4096 7413 489 -10596
$$ packed form
702I22j4735J1872J5890j1202j4253J0393R905j2633p265J5425P424j4816n965
715i038J2330J291j2033L838J4187o050j5675N721J3193p539r576J2658R541j6386
729c538j1686J5580J0557j4059o495J5355K901j8040k724J8216L015j4239N69
742d588J1348o921j3028R725J4699q201j1495Q996O312j3714m687J8361O240j8189
756e142o505J5522K563j5188J907J7880k404j8393J306J4406l600j0571Q789J0567
770A1137j1522j1602J0395Q798r795l217J3314N37j7271j527J6978J452j3930
783f253K506J3389o802j5568P749J6173o293j3109P057Q948j0493p693J2905P854
797A0370j2034n775J1009J256j2419J615J4340k254j3661L457J1509o924j1085
$$ plain form
810 -10596 -629 11695 1408 -10570 -977 8049 -2151 -8083 4441 9329 -4214 -8711 3488
823 3488 6068 -4470 -3493 7344 3846 -7484 -3051 7047 1277 -7018 1409 9130 -1034 -8838
837 -8838 1317 7488 -2479 -5884 5399 7060 -5671 -7326 4869 6123 -4104 -3088 5946 1988
851 1988 -7317 -1946 7393 1967 -5410 625 5517 -2494 -6424 3032 6727 -2350 -4303 4208 3593
866 3593 -6067 -3980 6649 4485 -5588 -2922 5640 1267 -6389 -638 7075 956 -6069 -444 4494
881 4494 -1588 -4276 3032 5005 -2807 -4469 2024 1948 -3635 -458 5605 874 -6336 -1560 5305 590
897 590 -4784 787 4985 -1634 -5497 1428 4807 -1837 -4135 2342 3500 -3163 -3759 2330 2501 -2314
913 -2314 -1128 2500 -737 -4321 178 4193 -246 -3690 595 2357 -2581 -3392 2867 3599 -3180 -4032
$$ packed form
810a0596R967J2324j0287j1978R593R026j0200n932J2524M888j3543m497J2199
823C488K580j0538R77J0837l498j1330M433J0098n770q295Q427P721j0164p804
837h838J0155O171r967l405J1283J661j2731j655J2195J254j0227J016R034l958
851A988r305N371R339n426p377O035M892q011l930R456L695r077j953Q511o15
866C593r660K087J0629k164j0073K666Q562m373p656N751P713o119p025N625M938
881D494o082k688P308J973p812j662O493p6n583L177O063m731p210M776O865m715
897E90n374N571M198o619l863O925L379o644k298O477J158o663n96O089J71m815
913b314J186L628l237l584M499M015m439l444M285J762m938q11O259P32o779q52
$$ plain form
929 -4032 2517 3185 -2679 -2848 2391 2064 -2754 -2112 2029 1269 -1606 -205 1733 -512 -1767 813
945 813 1393 -1358 -820 2457 964 -2942 -801 3703 1485 -3252 -1167 3510 1653 -2667 -863 2914
961 2914 1266 -1938 -307 2297 886 -816 588 1532 134 -279 825 288 -457 1408 2582 -19
977 -19 -1964 1038 3473 606 -2203 87 2529 582 -1150 1011 2701 448 -1500 260 2207 1051
993 1051 -725 -430 741 1416 1307 120 -910 27 1979 1516 -748 -743 1312 1177 -900 -521 1944 1672
1011 1672 -1367 -1579 1482 2580 23 -1708 -336 1233 492 -719 -650 404 994 473 -452 -764 149
1028 149 540 -599 -1281 137 1158 -268 -1800 -442 1585 615 -1690 -1616 232 613 -803 -1352 -343
1045 -343 348 -277 -1186 -1044 -53 259 -559 -1416 -797 267 -309 -1620 -1235 608 683 -1197 -1776 51 946
$$ packed form
929d032O549O68n864j69N239l27m818O42M141p60k875J401J938k245j255K580
945H13N80k751N38L277j493l906K141M504k218m737K085M677j857m320J804L777
961B914j648l204J631K604j411j702J404R44j398m13J104n37p45J865J174k601
977a9j945L002K435k867k809K290K442j947j732K161J690k253j948J760J947j156
993A051j776K95J171O75j09j187j030R37J952m63k264NK055j35k077L79K465k72
1011A672l039k12L061J098k557j731J372J569p41j211O9J054N90n21r25l12R13
1028A49L91j139o82J418J021j426j532J358K027r70k305P4J848L81j416n49J009
1045c43O91o25r09J42R91L12q18q57O19J064n76j311L85J843P5j880n79J827Q95
$$ plain form
1064 946 -587 -1899 -906 434 -33 -1088 -688 335 244 -532 -853 -276 128 -409 -1127 -738 531 1023
1082 1023 -215 -1494 -512 1084 630 -1021 -974 490 898 -311 -638 580 975 -138 -527 453 1105
1099 1105 419 -331 59 690 873 494 -87 -97 925 1639 817 -383 131 1441 997 -318 139 1496
1117 1496 1192 -129 319 1711 1281 -293 -79 1254 1120 112 138 967 877 496 647 588 92 239 1066
1136 1066 704 -208 322 1137 356 -558 357 1315 131 -1067 331 1564 143 -1330 -186 1010 -77
1153 -77 -962 89 620 -505 -888 290 338 -996 -975 100 -257 -1178 -213 600 -752 -1696 -181 747 -1133
1172 -1133 -2101 -259 742 -1174 -1825 171 400 -1903 -2001 258 237 -1969 -1787 253 -239 -2061 -1285
1189 -1285 195 -1003 -2181 -616 417 -1422 -2134 -108 364 -1832 -1929 364 62 -2295 -1333 1408
$$ packed form
1064I46j533j312R93J340m67j055M00J023r1p76l21N77M04n37p18L89J269M92
1082A023j238j279R82J596m54j651M7J464M08j209l27J218L95j113l89R80O52
1099A105o86p50L90O31J83l79n81j0J022P14q22j200N14J310m44j315M57J357
1117A496l04j321M48J392m30j574K14J333j34j008K6Q29r0l81J51n9m96J47Q27
1136A066l62r12N30Q15p81r14R15R58j184j198J398J233j421j473J144J196j087
1153g7q85J051N31j125l83J178M8j334K1J075l57r21R65Q13j352r44J515R28j880
1172a133r68J842J001j916o51J996K29k303r8K259k1k206J82K040m92j822P76
1189a285J480j198j178J565J033j839p12K026M72k196r7K293l02k357R62K741
$$ plain form
1205 1408 223 -2611 -1345 1495 114 -2452 -778 1719 -94 -2051 -102 1616 -527 -1621 600
1220 600 1188 -925 -803 1597 1158 -1362 -296 2209 616 -1956 340 3113 574 -2008 735 3349
1236 3349 365 -1949 1169 3264 105 -1403 1762 2909 -94 -510 2160 1956 -714 318 2954
1251 2954 1467 -911 1099 3189 292 -1441 2073 3643 -277 -1809 2354 3614 -637 -1633 2738
1266 2738 3226 -1295 -1460 2700 2622 -1021 -372 2611 1038 -1770 329 2672 207 -1326 1650 2267
1282 2267 -1676 -2060 2480 2559 -2213 -2059 2686 1773 -3135 -1970 3100 1822 -3173 -2065 1909 222
1298 222 -2927 -492 2186 -824 -3146 -471 703 -2248 -2103 1634 857 -3752 -2816 1600 114 -4028
1314 -4028 -1615 2710 -560 -5279 -2124 2564 -282 -4108 -1014 1741 -2061 -4454 -382 1750 -1761
$$ packed form
1205A408j185k834J266K840j381k566J674K497j813j957J949J718k143j094K221
1220F00N88k113J22K400m39k520J066K505j593k572K296K773k539k582K743K614
1236C349k984k314L118K095l159j508L165J147l003m16K670k04k670J032K636
1251B954j487k378K010K090k897j733L514J570l920j532M163J260m251r96M371
1266B738M88m521j65M160p8l643O49K983j573k808K099K343k465j533K976O17
1282B267l943l84M540P9m772J54M745r13m908J165N070j278m995J108L974j687
1298B22l149K435K678l010k322K675J174k951J45L737p77m609R36M416j486m142
1314d028K413M325l270m719L155M688k846l826L094K755l802k393M072K132l511
$$ plain form
1329 -1761 -2702 452 -177 -3810 -2209 2014 239 -3705 -1253 2055 -1450 -4643 -109 3474 -1167
1344 -1167 -4604 70 2826 -1896 -3793 1423 3135 -1892 -3271 1065 1514 -2064 -850 2911 865
1359 865 -2976 -480 2721 -222 -2449 1796 3787 -1274 -3289 2104 3870 -1484 -2438 3243 3765 -2106
1375 -2106 -2418 3157 3268 -1326 -517 3547 1522 -2279 373 3987 1283 -1328 1879 3398 -963 -2036
1391 -2036 3089 4120 -975 -1361 3685 2965 -2578 -1312 4481 3306 -2084 -738 3662 1431 -2406
1406 -2406 578 4360 1013 -2476 618 2715 -683 -1470 2861 3014 -2039 -2105 2382 1596 -2669 -601
1422 -601 3986 1208 -3877 -1405 3116 364 -3148 386 3356 -1002 -4260 -158 2580 -866 -2290
1437 -2290 1219 990 -3337 -2737 1969 1451 -2569 -1387 1744 -978 -4395 -751 3116 -217 -3661 -442
$$ packed form
1329a761r41L154o29l633J601M223j775l944K452L308l505l193M534L583m641
1344a167l437M674K756m722j897N216J712n027j379M336M49l578J214L761k046
1359H65l841K496L201k943k227M245J991n061k015N393J766n354r54N681N22n871
1375b106l12N575J11m594Q09M064k025l801K652L614k704k611L207J519m361j073
1391b036N125J031n095l86N046p20n543J266N793j175n390J346M400k231l837
1406b406K984L782l347l489L094K097l398p87M331J53n053o6M487p86m265K068
1422f01M587k778n085K472M521k752l512L534K970m358l258M102K738l446j424
1437b290L509k29m327O00M706n18m020J182L131k722l417L644L867l333l444L219
$$ plain form
1453 -442 1787 -2174 -3853 860 2698 -1744 -3352 220 675 -2733 -1734 2303 936 -3327 -2106 1312
1469 1312 -283 -2707 296 2657 -1161 -3798 -389 1941 -1075 -1951 1736 1837 -2668 -2883 1679 2066
1485 2066 -1559 -1021 2136 533 -2787 -585 2987 1046 -1873 184 2209 -551 -1943 1479 3047
1500 3047 -123 -1256 1610 1512 -1507 -578 3150 2375 -1276 -626 2341 1023 -1374 960 3430 686
1516 686 -2012 466 2651 321 -891 1847 2431 -715 -1369 1752 2178 -427 -133 2188 1065 -1488
1532 -1488 -185 2262 836 -1088 802 2139 -449 -1851 989 2340 -453 -1402 1127 1353 -1355
1547 -1355 -1328 1590 1393 -1404 -1322 946 363 -1409 -412 1278 -53 -1627 -265 485 -1184 -1454 802
1564 802 839 -1731 -1845 636 482 -1897 -1421 855 174 -2214 -1383 872 -16 -1951 -1049 473 -607
$$ packed form
1453d42K229l961j679M713J838m442j608L572M55l408R99M037j367m263J221L418
1469A312j595k424L003K361l818k637L409K330l016q76L687J01m505k15M562L87
1485B066l625N38L157j603l320K202L572j941k919K057K025k760j392L422J568
1500C047l170j133K866r8l019R29L728p75l651O50K967j318k397K334K470k744
1516F86k698K478K185k330j212K738N84l146o54L121M26k605K94K321j123k553
1532a488J303K447j426j924J890J337k588j402K840J351k793r49K529K26k708
1547a355K7K918j97k797Q2K268n83j772R97J690j331j574J362P50j669k70K256
1564H02L7k570j14K481j54k379M76K276o81k388Q31K255q88j935R02J522j080
$$ plain form
1581 -607 -1697 -594 164 -1020 -1086 187 -213 -1831 -1105 694 -90 -1738 -624 931 -424 -2017 -421
1598 -421 1245 -259 -1860 -434 1123 -144 -1276 42 858 -278 -808 186 457 -293 -4 700 102
1615 102 -606 435 1018 -277 -741 1032 1655 -192 -1011 936 1753 65 -703 984 1562 59 -433
1632 -433 996 1532 460 77 669 716 513 1017 932 256 287 1341 1123 -204 22 1562 1326 -274 -212
1651 -212 1466 1379 -327 -324 1242 1261 -108 -287 700 839 141 131 447 239 -17 172 145 -148 243 758 -22
1672 -22 -985 -169 860 125 -1064 -487 636 64 -1112 -544 513 -23 -1124 -789 128 -75 -836 -665
1690 -665 -307 -344 -516 -648 -890 -798 -322 -23 -798 -1079 -432 -90 -933 -1290 -478 134 -744 -1437 -653 154 -392
1711 -392 -1147 -782 -211 -492 -817 -636 -204 -235 -438 -522 -689 -456 -124 -99 -563 -456 176 215 -521 -751 129
$$ packed form
1581f07j090J103P58j184o6J273m00j618P26J799p84j648J114J555j355j593J596
1598d21J666j504j601J426J557j267j132J318Q16j136n30R94K71p50K89P04n98
1615A02p08J041N83j295m64J773O23j847q19J947Q17j688p68J687N78j503m92
1632d33J429N36j072l83N92M7k03N04q5o76L1J054k18j327K26J540k36j600O2
1651b12J678q7j706LJ566J9j369j79R87J39o98j0L16k08k56J89k7k93L91N15p80
1672b2r63Q16J029p35j189N77J123n72j176N68J057n36j101L35R17k03p61J71
1690f65L58l7j72j32k42R2M76K99p75k81O47L42q43l57Q12O12q78o93P84Q07n46
1711c92p55L65N71k81l25J81M32l1k03q4j67K33L32K5m64J07O32L9p36k30Q80
$$ plain form
1732 129 479 -85 -394 174 475 -9 -139 275 554 248 -30 273 496 535 457 512 348 390 613 629 423 539
1754 539 961 873 403 469 957 973 462 489 1017 1017 549 635 973 967 677 660 878 775 672 776 885 720 675 798
1778 798 619 362 539 938 804 304 329 810 554 256 362 629 421 94 303 520 330 105 264 187 -97
1799 -97 -62 334 161 -241 -143 214 -32 -490 -369 98 -200 -613 -321 -24 -311 -601 -379 -301 -575 -648 -286 -429
1821 -429 -922 -651 -82 -435 -1222 -884 -199 -507 -1123 -657 -87 -656 -1201 -810 -196 -735 -1074 -567 -356 -793
1841 -793 -859 -313 -399 -975 -709 -125 -501 -1160 -513 130 -510 -1059 -365 203 -679 -1093 -109 448 -447 -891 -53
1862 -53 189 -574 -544 385 251 -612 -319 493 173 -408 255 733 -233 -701 513 1133 -79 -402 813 1021
1882 1021 -336 -447 948 1170 -102 -22 1148 832 -323 190 1193 714 -110 643 1066 113 -216 1203
$$ packed form
1732A29L50n64l09N68L01m84j30M14K79l06k78L03K23L9p8N5j64M2K23J6k06J16
1754E39M22q8m70O6M88J6n11K7N28%m68Q6L38ok90j7K18j03j03J04J09j65m5J23
1778G98j79k57J77L99j34n00K5M81k56k98J06K67k08l27K09K17j90k25J59p7k84
1799i7L5L96j73m02R8L57k46m58J21M67k98m13K92K97k87k90K22P8k74p3L62j43
1821d29m93K71N69l53p87L38O85l08o16M66N70n69n45L91O14n39l39N07K11m37
1841g93o6N46q6n76K66N84l76o59O47O43o40n49O94N68q82m14R84N57q95m44Q38
1862e3K42p63L0R29j34q63K93Q12l20n81O63M78r66m68J214O20j212l23J215K08
1882A021j357j11J395K22j272Q0J170l16j155N13J003m79q24P53M23r53l29J419
$$ plain form
1900 1203 1452 -90 -315 1118 1101 -387 -48 1657 1344 -571 -279 1125 881 -448 318 1421 431
1917 431 -637 313 1220 -35 -518 867 1018 -675 -705 1050 925 -878 -391 1234 509 -1480 -597 1385
1935 1385 595 -1040 -245 931 -337 -1443 159 988 -413 -1052 395 424 -1159 -831 984 334 -1557
1952 -1557 -768 955 -225 -1814 -262 1445 -277 -2172 -450 1088 -603 -1734 158 1070 -925
1967 -925 -1761 76 500 -1123 -903 745 10 -1791 -651 1039 -195 -1735 -38 1339 -784 -2078
1983 -2078 219 1566 -683 -1802 377 1209 -1061 -1608 889 1132 -846 -948 728 298 -1186 -153
1999 -153 1313 26 -1266 346 1322 -637 -1337 1060 1640 -987 -1406 1287 1506 -1079 -1033 1601 1295
2016 1295 -1286 -806 1531 923 -981 22 1544 179 -1077 554 1425 -371 -852 1188 1265 -1010
$$ packed form
1900A203K49j542k25J433j7j488L39J705l13j915K92J404k44j329P66J103r90
1917D31j068R50R07j255m83J385J51j693l0J755j25j803M87J625p25j989Q83J982
1935A385p90j635P95J176j268j106J602Q29j401o39J447K9j583L28J815o50j891
1952a557P89J723j180j589J552J707j722j895J722J538j691j131J892R12j995
1967i25q36J837M24j623K20J648p35j801J140J690j234j540J697J377k123j294
1983b078K297J347k249j119K179Q32k270n47K497K43j978j02J676m30j484J033
1999a53J466j287j292J612R76j959p00K397N80k627m19K693K19k585M6K634l06
2016A295k581M80K337o08j904J003J522j365j256J631Q71j796m81K040P7k275
$$ plain form
2032 -1010 -841 1682 1177 -1350 -636 1818 759 -1618 -313 2135 688 -1561 -174 1564 115 -1247
2048 -1247 495 1438 -406 -966 765 790 -957 -496 1480 592 -1564 -373 1675 209 -1730 43
2064 43 1889 -186 -1950 152 1782 -237 -1523 481 1302 -889 -1412 746 1011 -911 -677 1094
2080 1094 202 -1588 -370 1408 -30 -1566 126 1380 -642 -1749 723 1571 -832 -1651 716 1124
2096 1124 -1169 -1020 1313 1013 -1437 -1022 1089 360 -1306 -101 1403 -189 -1582 95 1285 -581
2112 -581 -1184 904 1219 -1114 -1310 1127 1151 -1051 -713 1374 563 -1578 -611 1629 636 -1130 -71
2129 -71 1245 -290 -1334 587 1580 -310 -1030 751 959 -888 -752 1311 1085 -1034 -576 1159 442
2146 442 -1110 12 1591 163 -1389 5 1230 -262 -1036 812 1241 -822 -1335 634 963 -808
$$ packed form
2032a010J69K523n05k527P14K454j059k377J305K448j447k249J387J738j449j362
2048a247J742R43j844n60J731K5j747M61J976q88k156J191K048j466j939J773
2064D3J846k075j764K102J630k019j286K004Q21k191n23K158K65j922K34J771
2080A094q92j790J218J778j438j536J692J254k022j107K472Q48k403q19K367M08
2096A124k293J49K333l00k450M15K111p29j666J205J504j592j393J677J190j866
2112e81o03K088L15k333j96K437K4k202L38K087q11k141R67K240r93j766J059
2129g1J316j535j044J921R93j890p20J781K08j847J36K063k26k119M58J735p17
2146D42j552J122J579j428j552J394J225j492p74J848M29k063n13J969L29j771
$$ plain form
2162 -808 -589 1146 605 -1299 -717 1096 428 -983 -72 965 -314 -1167 235 1034 -444 -950 565
2179 565 632 -1077 -850 1011 790 -986 -718 865 124 -1365 -391 1236 271 -1193 -287 778 -299
2196 -299 -914 338 817 -512 -867 482 526 -690 -306 897 281 -1157 -455 958 231 -990 10
2213 10 1064 -22 -1218 31 1012 -82 -756 368 809 -384 -689 444 649 -353 -238 643 105
2230 105 -681 77 971 93 -796 254 952 -350 -860 601 1113 -244 -842 366 907 -355 -482 619
2248 619 809 -268 -321 510 234 -293 201 739 -69 -465 435 767 -272 -434 684 679 -505 -632 646
2267 646 768 -370 -396 612 437 -556 -447 442 373 -299 -51 281 -152 -336 213 308 -405 -336 351 213 -629
2288 -629 -360 549 288 -765 -546 462 158 -697 -392 362 120 -633 -431 173 -48 -467 -218 20 -245
$$ packed form
2162h08K19J735n41j904N82J813o68j411R11J037j279q53J402P99j478n06J515
2179E65O7j709K27J861k21j776K68J583p41j489R74J627r65j464R06J065j077
2196b99o15J252M79j329l55J349M4j216L84J203o16j438P02J413p27j221J000
2213A0J054j086j196J249R81j094o74J124M41j193l05J133K05j002J15Q81n38
2230A05p86P58Q94q78q89J050O98j302n10J461N12j357n98J208N41j262j27J101
2248F19J90j077n3Q31k76n27M94N38q08l96R00L32j039j62J118nj184j27J278
2267F46J22j138k6J008j75r93J09Q89o9o72K48L32m33j84N49R5p13O9O87j38q42
2288f29K69R09k61j053K19J008l04q55L05P54k42p53K02O04k21m19K49K38k65
$$ plain form
2307 -245 -297 -34 -152 -543 -127 266 -126 -638 -120 455 -90 -724 -195 476 -45 -672 -149 392 83 -426
2327 -426 -162 226 -38 -119 -89 -37 -58 125 165 -158 -320 184 395 -216 -416 196 544 -129 -455 183 619 37
2349 37 -434 25 463 149 -177 39 230 129 11 34 126 185 173 159 -40 168 452 256 -194 -90 517 457
2371 457 -125 -245 441 515 -16 -185 221 390 73 -83 217 362 177 -41 25 124 241 210 50 -96 125
2392 125 399 113 -179 7 392 96 -273 -106 410 262 -287 -240 114 167 -122 -332 -24 92 -16 -181 -151
2413 -151 -106 -95 -102 -302 -238 7 -16 -254 -411 -41 111 -263 -556 -167 148 -61 -390 -163 2 -83 -321 -247 -3
2436 -3 -100 -165 -115 -61 -81 -27 -104 -179 -154 -3 -51 -221 -152 43 67 -182 -288 138 88 -253 -269 137 199 -85 -207 101
2462 101 169 -46 -61 180 126 -19 0 169 76 34 151 163 16 49 278 217 34 79 341 194 -155 103 423
$$ packed form
2307b45n2K63j18l91M16L93l92n12N18N75n45o34N29O71n21o27N23N41l09n09
2327d26K64L88k64q1L0N2k1J83M0l23j62N04K11o11k00O12L48o73l26O38M36n82
2349C7m71M59M38l14l26K16J91j01j18K3R2N9j2j4j99K08K84j96m50J04O07o0
2371D57n82j20O86P4n31j69M06J69l17j56L00J45j85k18O6R9J17l1j60j46K21
2392A25K74k86k92J86L85k96l69J67N16j48n49M7L54N3k89k10L08J16j08j65L0
2413a51M5J1pk00O4K45k3k38j57L70J52l74k93L89L15k09l29K27J65q5k38P4K44
2436cr7o5N0N4k0N4p7p5K5J51m8j70O9J95K4k49j06M26n0l41j6M06O2k84j22L08
2462A01O8k15j5K41n4j45J9J69r3m2J17J2j47L3K29o1j83M5K62j47l49K58L20
$$ plain form
2485 423 258 -41 155 429 161 -90 185 483 120 -117 158 417 119 19 245 314 125 61 291 267 89
2506 89 164 449 86 -70 261 414 4 -122 408 431 -131 -293 297 562 -131 -267 243 491 -76 -274 175
2527 175 316 -98 -177 25 -13 -178 -24 11 -283 -226 141 51 -521 -358 276 120 -545 -505 357 69 -686 -519
2549 -519 302 206 -551 -484 99 116 -322 -283 -92 -212 -372 -104 -38 -382 -187 149 -143 -622 -216 410 -97 -756
2571 -756 -223 596 -4 -820 -280 547 86 -695 -276 453 99 -446 -43 307 64 -141 39 1 -147 107
2591 107 475 -74 -414 218 617 -166 -593 375 827 -181 -719 302 885 4 -637 309 720 40 -398
2610 -398 282 512 64 19 387 174 -147 351 573 -6 -154 562 676 -352 -479 742 913 -269 -482
2629 -482 755 808 -301 -418 584 651 -278 -204 538 302 -223 91 545 -17 -267 390 330 -352 -272 749
$$ packed form
2485D23j65k99J96K74k68k51K75K98l63k37K75K59k98j00K26O9j89o4K30k4j78
2506H9P5K85l63j56L31J53m10j26N30K3n62j62N90K65o93j36N10K48n67j98M49
2527A75J41m14p9K02l8j65J54L5k94N7L67r0n72J63O34j56o65M0Q62k88p55J67
2549e19Q21r6p57O7N83J7m38L9J91j20j60K68O6l44J95L36k92m79M06O26n07o59
2571g56N33Q19o00q16N40Q27m61p81M19P29l54n45M03L50k43k05J80l8j48K54
2591A07L68n49l40O32L99p83m27R68M52j008n38J021N83q81o41R46M11o80m38
2610c98O80K30m48m5L68k13l21M98K22n79j48P16J14j028j27J221J71j182k13
2629d82J237N3j109j17J002O7r29P4P42k36n25L14M54n62k50O57o0o82Q0J021
$$ plain form
2649 749 340 -671 -436 729 325 -755 -296 854 249 -895 -403 678 209 -724 -212 347 -154 -593
2667 -593 49 274 -365 -434 222 26 -794 -420 532 14 -965 -305 558 -269 -1112 -188 716 -198 -988 -189
2687 -189 415 -389 -820 18 309 -522 -670 191 46 -769 -312 452 -145 -889 -192 543 -253 -886 144 616
2707 616 -416 -971 185 677 -447 -724 415 491 -524 -572 452 330 -501 -221 558 19 -641 93 723
2726 723 -59 -606 357 660 -403 -570 642 824 -338 -388 679 557 -452 -235 878 524 -448 69
2744 69 871 274 -431 430 912 -5 -452 595 848 -195 -275 812 683 -401 -317 821 623 -366 39
2763 39 922 377 -538 5 872 217 -355 388 766 -160 -440 605 697 -345 -235 678 461 -565 -190 771
2783 771 374 -635 -70 772 25 -708 117 697 -182 -722 310 475 -566 -680 359 430 -682 -554 428
$$ packed form
2649G49m09j011K35J165m04j080M59J150o05j144M92J081m69r33N12N59n01m39
2667e93O42K25o39o9O56j96q20L74R52n18r79O60Q63q27q43R24R04r14p90P99
2687a89O04q04m31Q38K91q31j48Q61j45q15M57P64n97p44O97P35p96o33J030M72
2707F16j032n55J156M92j124k77J139P6j015m8J024j22q31K80P79n39o60P34O30
2726G23p82n47R63L03j063j67J212J82j162n0J067j22j009K17J113l54r72N17
2744F9Q02n97p05Q61M82r17m47J047K53j043q0J087j29j084Q4J138j98r89M05
2763C9Q83n45r15N43Q67o55n72P43L78r26k80J045R2j042J10R13k17j026L75R61
2783G71l97j009N65Q42p47p33Q25N80q79n40J032J65j041j14J039P1j112J28R82
$$ plain form
2802 428 179 -848 -482 567 -46 -999 -359 465 -211 -832 -50 368 -552 -803 135 308 -638 -676 338
2821 338 124 -850 -559 360 -3 -836 -362 461 -152 -939 -266 423 -240 -803 -60 412 -373 -736 167 326
2841 326 -496 -511 341 75 -604 -128 563 54 -728 -24 723 -17 -725 55 704 -122 -571 282 708 -205
2861 -205 -437 384 501 -217 -195 465 291 -266 125 618 69 -402 378 825 -63 -364 553 805 -127 -398
2881 -398 538 833 -95 -306 610 736 -50 -131 545 547 32 111 564 351 -12 386 515 40 -55 609 634 -246
2903 -246 -126 694 548 -330 -255 651 510 -347 -252 489 349 -273 -80 356 206 -229 4 112 -195 -138 199
2924 199 86 -399 -164 367 -45 -636 -117 484 12 -719 -339 425 -43 -721 -398 314 -32 -526 -402 51
2944 51 -46 -292 -227 -202 -249 -224 -71 -273 -364 9 154 -409 -678 -43 373 -266 -653 -1 418 -230 -580 -135
$$ packed form
2802D28k49j027L66J049o13r53O40Q24o76o21P82M18r20k51R38J73r46l8J014
2821C38k14r74K91R19l63q33M74Q23o13p87O73O89o63n63P43M72p85l63R03J59
2841C26q22j5Q52k66o79M76O91n09p82P04P47p40p08P80O49q26m49Q53M26r13
2861b05k32Q21J17p18K2O60j74n57L91M93n49m71P80M47q88l01R17K52r32k71
2881c98R36K95r28k11R16J26p86q1O76Kn15P9M53k13l63L98J29m75r5O64K5q80
2903b46J20Q20j46q78P5R06j41q57R5P41j40o22J93M36j50m35K33J08l07N7L37
2924A99j13m85K35N31m12n91N19O01m72p31L80P64m68o78L23P12l46m94J24M53
2944E1r7k46O5K5m7K5J53k02r1L73J45n63k69O35M16o39l87O52M19o48l50M45
$$ plain form
2966 -135 289 -161 -511 -100 174 -117 -182 -77 -16 -64 18 -46 -242 -117 303 259 -253 -223 298 367 -250 -293 330
2989 330 478 -117 -268 164 431 28 -108 200 329 123 43 120 236 277 308 166 103 266 503 312 -40 213
3011 213 587 389 -154 100 658 539 12 87 533 455 36 71 406 421 228 176 251 252 270 323 165 83 236 311
3035 311 161 9 221 471 87 -212 6 351 64 -176 -15 207 61 -141 -98 128 -39 -133 -58 -23 -118 -72
3057 -72 -104 -145 -170 -106 -52 -215 -262 -38 40 -243 -354 -132 13 -260 -345 -143 -1 -285 -272 -165 -86 -216 -289 -150
3081 -150 -41 -207 -161 -204 -205 -210 -151 -131 -226 -185 -52 -106 -340 -232 -9 -55 -292 -227 -129 -38 -221 -174 12 -51 -222 -155
3107 -155 23 -49 -163 -83 150 -41 -72 62 117 -11 -34 78 82 46 73 160 61 111 156 162 125 63 142 261 135 140 291
3134 291 332 163 59 195 356 215 154 257 369 201 211 217 223 227 238 289 155 135 263 190 65 137 266 236 6
$$ packed form
2966a35M24m50l50M11K74k91o5J05O1m8Q2o4j96J25M20m4n12L0N21O9o17m3O23
2989C30J48n95j51M32K67m03j36L08J29k06q0P7J16M1L1j42o3J63K37j91l52K53
3011B13L74j98n43K54N58j19n27P5M46p8m19L5L35J5j93n2P5JJ8N3j58q2J53P5
3035C11j50j52K12K50l84k99K18L45k87k40J61K22j46k02M3K26j67r4P5L5r5M6
3057g2l2m1k5O4N4j63m7K24P8k83j11K22J45k73q5K02J42k84J3J07P9j30p3J39
3081a50J09j66M6m3jnN9K0r5M1J33n4k34J08K23m6k37O5R8R1j83M7J86o3j71O7
3107a55J78p2j14Q0K33j91l1J34N5j28k3J12Ml6K7Q7r9N0M5Ol7o2P9J19j26NJ51
3134B91M1j69j04J36J61j41o1J03J12j68J0OOMJ1N1j34k0J28p3j25P2J29l0k30
$$ plain form
3159 6 64 335 287 -11 -58 274 234 -68 -79 141 164 -6 -55 54 97 64 62 -26 -83 -40 98 -41 -143 -101 161 -54
3185 -54 -289 -138 192 8 -357 -133 69 1 -326 -328 9 -42 -217 -222 -63 -117 -147 -139 -238 -278 -112 -39 -233 -371 -106
3210 -106 100 -200 -491 -92 178 -164 -401 -170 173 -57 -364 -216 34 -98 -211 -136 -71 -103 -18 -98 -216 -147
3232 -147 40 118 -241 -234 186 280 -274 -371 155 343 -136 -317 220 423 -12 -235 184 301 145 -11 131 172
3254 172 114 188 276 83 69 319 259 -118 -8 538 416 -130 -54 531 436 -180 -123 487 472 -90 -112 336 404 0
3278 0 0 252 252 74 153 144 -10 120 341 104 -294 -29 517 178 -379 -38 584 182 -465 -60 458 206 -363
3301 -363 -180 299 151 -244 -121 85 -36 -188 -30 -36 -297 -70 192 -134 -454 -74 270 -209 -610 2 363
3322 363 -263 -617 -85 288 -223 -614 -111 197 -249 -492 -82 22 -253 -301 -2 -186 -398 -81 162 -252
$$ packed form
3159FN8K71m8k98m7L32m0l02j1K20K3j70m9J09M3l3kq8n7M3J38j39j02M2K62k15
3185e4k35J51L30j84l65K24K02o8l27kL37n1j75nJ59n4l0Qr9m0J66P3j94j38K65
3210a06K06l00k91L99K70l42k37K31L43k30l07J48K50j32j13P5O5l2Q5q0j18O9
3232a47J87P8l59PM20R4n54r7N26J88m79j81N37K03m35k23M19J17j56j56J42M1
3254A72n8P4Q8j93j4K50o0l77J10N46j22n46P6N85r5o16N7O10j5n62k2M48O8m04
3278@%K52%j78P9rj54J30K21k37l98K65N46l39n57L41O22m02o47M05N18k52n69
3301c63J83M79j48l95J23K06j21j52J58ok61K27K62l26l20L80L44m79m01O12L61
3322C63o26l54N32L73n11l91N03L08m46k43M10J04k75m8K99j84k12L17K43m14
$$ plain form
3342 -252 -461 9 144 -363 -524 125 335 -404 -514 147 308 -357 -470 181 243 -254 -269 174 139 -173 -53
3363 -53 225 -62 -216 156 279 -120 -195 326 330 -293 -208 498 323 -241 -138 547 318 -305 -82 537 279 -172
3385 -172 85 453 152 -95 241 375 62 -51 399 282 -119 -19 565 360 -190 100 567 184 -335 222
3405 222 615 167 -273 119 512 89 -258 279 468 -102 -195 357 318 -125 -37 374 190 -249 -42 343 93
3426 93 -252 123 317 -107 -363 139 277 -246 -293 183 223 -372 -381 240 192 -418 -201 230 20 -387 -176 245
3448 245 -101 -442 -136 185 -272 -376 45 108 -247 -315 110 22 -510 -282 286 -37 -506 -141 315 -57 -591
3469 -591 -126 320 -110 -445 -34 295 -123 -402 29 190 -203 -268 199 107 -237 -117 251 -101 -344 90 378
3490 378 -97 -349 161 502 -81 -455 197 405 -206 -317 245 426 -96 -146 286 256 -89 -1 224 110 -30
$$ packed form
3342b52k09M70J35n07j61O49K10p39j10O61J61o65j13O51O2m97j5M43l5l12J20
3363e3K78k87j54L72J23l99p5N21Mo23Q5P06j75n64J03O85k29o23K23O19k58m51
3385a72K57L68l01k47L36J34l13j13M50j17m01J00N84k05n50K90M67l83n19N57
3405B22L93m48m40L92L93m23l47N37J89n70r3N52l9m43Q8M11j84m39K07L85k50
3426I3l45L75J94m24k56N02J38n23m7M76M0n95rO21m8o10K17M31k10m07K11M21
3448B45l46l41L06L21m57j04M21O3l55o8M25q8n32K28N68l23m69L65M56l72n34
3469e91M65M46m30l35M11L29m18k79M31J61l93o5M67r2l44J20L68l52k43M34K88
3490C78m75k52N10L41n83l74O52K08o11j11N62J81n22n0M32l0l45Q8K25j14j40
$$ plain form
3511 -30 209 306 -12 -77 343 443 -178 -170 381 392 -237 -180 462 448 -158 -64 462 410 -117 9 408 251 -53
3534 -53 81 245 37 -19 222 192 -55 -35 396 198 -346 -85 428 196 -428 -107 441 47 -397 -78 318
3555 318 105 -341 -175 131 -9 -233 -102 31 -156 -170 -45 -149 -349 -84 287 -146 -554 -54 257 -219
3575 -219 -510 -89 201 -146 -548 -148 214 -57 -414 -162 95 -114 -220 -131 -10 -155 -143 16 -201 -261 9
3596 9 107 -211 -280 120 172 -234 -432 36 282 -132 -273 59 222 -85 -301 68 124 -109 -62 54 99 30 124
3619 124 159 -126 -32 257 163 -149 -77 356 298 -155 -167 340 289 -50 -103 272 307 14 1 268 233 136 145 104 166
3644 166 185 235 200 43 115 367 177 -99 131 431 199 -77 56 337 265 -88 91 312 215 -44 73 190
3666 190 99 16 75 33 0 13 86 -16 -29 100 138 -59 -116 56 211 -39 -293 -74 211 15 -258 -36 54 -53
$$ packed form
3511c0K39R7l18o5M20J00o21QN51J1o29N7O42j4o06R4N26n2n27J26L99j57l04
3534e3J34J64k08n6K41l0k47K0M31j98n44K61N13k32o24L21N48l94m44L19L96
3555C18k13m46J66L06j40k24J31J33j87j4J25j04k00K65L71m33m08N00L11m76
3575b19k91M21K90l47m02M00L62k71l57K52K57k09j06Q9J21j45J2J59k17o0K70
3596IR8l18o9M00N2m06j98M68K46m14j41L32J63l07k16L69N6k33M7J16M5o9R4
3619A24L5k85R4K89r4l12P2M33n8m53j2N07n1l39n3L75L5k93j3K67l5r7Rm1O2
3644A66J9N0l5j57P2K52j90k76K30L00k32k76J33K81p2l53J79K21r7k59J17J17
3666A90r1q3N9m2l3J3P3j02j3J29L8j97n7J72J55k50k54K19K85j96k73K22R0j07
$$ plain form
3690 -53 -222 -75 -41 -76 -175 -134 -121 -84 -44 -73 -156 -170 -30 -68 -248 -300 -18 3 -233 -243 -36 19 -164 -226 -23 29
3716 29 -159 -207 -122 4 -163 -121 -2 -120 -99 -83 -80 -150 -121 -42 15 -120 -69 51 22 -159 -130 100 32 -54 -43 19
3742 19 44 -19 20 94 40 -63 100 137 130 -14 83 102 32 83 93 146 106 114 139 194 103 149 147 103 76 142 175 110 31 199
3772 199 238 40 22 194 230 125 -9 154 207 67 44 103 181 94 78 148 102 95 3 67 35 80 106 14 70 61 157 10
3800 10 -156 -68 82 -1 -166 -101 81 60 -91 -184 4 -24 -127 -69 -1 5 -38 -165 -142 -191 -70 -1 -108 -190 -76
3825 -76 9 -152 -288 -68 47 -157 -339 -188 35 -120 -280 -214 -32 -66 -186 -165 -32 -17 -133 -134 -178 -106 30
3848 30 -22 -199 -193 38 58 -223 -197 70 107 -92 -212 -25 172 -29 -166 14 167 24 -68 31 68 163 67 0
3872 0 -14 53 165 83 -40 70 263 194 -28 23 281 263 -50 -55 291 282 100 -32 194 346 173 -3 165 186
$$ packed form
3690e3j69J47L4l5r9M1J3L7M0k9q3j4J40l8j80n2K82K1k36j0K07N5j83o2K03N2
3716B9j88m8Q5J26j67M2J19j18K1J6Lp0K9P9N7j35N1J20k9j81K9K30o8q6J1O2
3742A9K5o3L9P4n4j03J63L7pj44R7J9p0N1J0N3m0QK5N5r1M6km4k7O6L3o5p9J68
3772A99L9j98j8J72L6j05j34J63N3j40k3N9P8q7j6P0m6pr2O4l2M5K6r2N6rR6j47
3800A0j66Q8J50q3j65O5J82k1j51r3J88k8j03N8O8Om3j27K3m9J21O9j07q2J14
3825g6Q5j61j36K20J15k04j82J51K23j55j60O6J82l4j20K1J33J5j16jm4P2J36
3848C0n2j77OK31K0k81K6K67L7j99j20J87J97k01j37J80J53j43r2R9L7R5r6o7
3872@j4O7J12q2j23J10J93o9k22N1K58j8l13nL46rj82j32K26J52j73j76J68K1
$$ plain form
3896 186 107 146 120 100 147 278 112 -43 154 376 157 -148 54 291 226 -55 -24 343 183 -119 -53 206 149
3919 149 -18 10 100 74 23 10 68 -95 37 138 -30 -227 36 224 -21 -270 -59 116 -75 -364 -61 196
3941 196 -13 -228 -187 124 -87 -264 -76 -122 -201 -134 -39 -93 -268 -102 -26 -204 -287 -6 40 -278 -334 19 137
3964 137 -222 -407 -11 55 -166 -247 -13 47 -206 -242 -23 2 -152 -109 19 -106 -188 96 125 -119 -203 117 138
3987 138 -134 -164 231 176 -144 -110 233 244 -144 -77 189 143 -41 0 144 97 2 157 230 -23 -94 212 234 -100
4011 -100 57 342 292 -128 46 340 248 -75 61 347 204 -73 48 313 119 -53 204 264 34 -19 233
4032 233 245 -64 18 302 156 -212 -19 352 130 -146 65 274 62 -239 13 236 -6 -171 40 206 -131
4053 -131 -128 92 92 -186 -199 115 12 -273 -67 222 -20 -329 -76 96 -121 -306 -39 124 -213 -318 -32 31
$$ packed form
3896A86p9L9k6k0M7J31j66j55J97K22k19l05K02K37o5k81L1L67j60l02O6K59n7
3919A49j67K8R0k6n1j3N8j63J32J01j68j97K63J88k45k49K11J75j91k89L03K57
3941A96k09k15M1L11k11j77J88m6p9O7R5n4j75J66P6j78q3K81M6l18n6L53J18
3964A37l59j85L96O6k21q1K34O0k53l6K19K5j54M3J28j25q2K84K9k44q4L20K1
3987A38k72l0L95n5l20L4L43J1l88O7K66m6j84M1J44m7r5J55P3k53p1L06K2l34
4011a00J57K85n0m20J74K94r2l23J36K86j43k77J21K65j94j72K57O0k30n3K52
4032B33J2l09Q2K84j46l68J93L71k22k76K11K09k12l01K52K23k42j65K11J66l37
4053a31LK20%k78j3L14j03k85K06K89k42l09K53J72k17j85K67J63l37j05K86O3
$$ plain form
4075 31 -267 -149 59 -12 -344 -211 57 -104 -355 -198 74 -150 -368 -93 119 -148 -275 -86 92 -235 -268
4096 -268 44 57 -211 -189 81 1 -287 -77 159 -9 -286 21 210 -134 -274 64 198 -136 -203 85 186
4117 186 -141 -141 184 176 -90 -131 272 117 -28 99 225 78 -76 171 243 25 -107 231 293 -97 -11 379 325
4140 325 -55 -45 294 304 -123 19 309 229 -9 71 243 135 1 194 253 12 -68 255 235 -82 17 354 191
4163 191 -121 5 312 245 -122 7 261 121 -168 -38 211 56 -166 20 106 -43 -65 90 -63 -141 -28
4184 -28 175 26 -291 -56 199 -49 -337 -132 133 -15 -403 -154 214 -107 -344 -126 36 -185 -299 -90
4204 -90 -39 -166 -208 -36 -117 -284 -100 23 -192 -327 -54 76 -177 -325 -68 101 -160 -325 -42 78 -97
4225 -97 -240 -24 5 -188 -212 50 -1 -83 -44 20 -69 -162 115 65 -80 -146 131 205 -151 -171 148 163 -53 -128 119
$$ packed form
4075C1k98J18K08p1l32J33K68j61k51J57K72k24k18K75K12k67j27J89J78l27l3
4096b68L12J3k68K2K70q0k88K10K36j68k77L07J89l44j40L38J34l34o7K88J01
4117A86l27%L25qk66m1M03j55j45J27J26j47j54K47P2k18j32L38O2l90Q6L90n4
4140C25l80J0L39J0m27J42K90q0k38Q0J72j08j34J93N9k41q0L23k0l17R9L37j63
4163A91l12J26L07o7l67J29K54j40k89J30K49j55k22J86Q6j49k2J55j53p8J13
4184b8K03j49l17K35K55k48k88K05K65j48l88K49L68l21k37K18J62k21j14K09
4204i0N1j27m2J72q1j67J84J23k15j35K73J30k53j48K57J69k61j65K83J20j75
4225i7j43K16K9j93k4K62n1q2L9O4q9r3K77n0j45o6K77P4l56k0L19J5k16p5K47
$$ plain form
4250 119 190 4 -43 163 147 60 39 162 24 47 179 155 -36 -13 241 144 -64 43 237 289 -34 41 264 191
4274 191 26 51 216 209 -17 149 236 87 99 105 149 58 62 161 59 -9 77 205 105 -120 -14 271 105 -98 -48
4299 -48 126 30 -101 8 117 52 -111 10 -62 -68 -37 23 -74 -101 -3 7 -58 -188 -45 30 -135 -215 -10 87 -144
4324 -144 -249 -158 23 -142 -159 -158 -5 -88 -93 -118 -212 -184 -92 -46 -95 -200 -70 -70 -201 -223 -18 9 -107 -240 -46 40
4350 40 -46 -191 -64 23 -48 -69 -128 29 -34 -50 1 -50 1 -14 -40 -147 -46 40 58 -42 -64 73 69 -15 -47 126 108
4377 108 -18 -13 131 161 53 3 12 128 73 91 86 92 70 120 104 0 122 197 110 35 185 192 151 60 89 165 130 137 111
4406 111 134 109 69 59 83 170 98 74 50 55 88 141 36 -13 156 103 39 -54 44 112 34 -37 17 78 26 -50 36 -18 -23 26
4436 26 -37 -6 28 -24 -20 -50 -36 -55 -48 -71 -119 -56 -28 -83 -178 -80 -17 -139 -183 -87 -51 -110 -106 -104 -108 -147 -118 -95 -103 -103 -105 -56 -149 -125
$$ packed form
4250A19P1j86m7K06j6q7k1J23j38K3J32k4j91K3K54r7k08J07J94N2l23P5K23p3
4274A91j65K5J65pk26J66Q7j49J2OM4r1MR9j02o8Q6J28j00k25J06K85j66k03N0
4299d8J74r6j31J09J09o5j63J21p2oL1O0r7k7R8J0o5j30J43P5j65q0K05R7k31
4324a44j05R1J81j65j7JJ53q3nk5r4K8R2M6m9j05J30%j31k2K05K7j16j33J94Q6
4350D0q6j45J27Q7p1k1n9J57o3j6N1n1N1j5k6j07J01Q6J8j00k2J37mq4l2J73j8
4377A08j26NJ44L0j08n0RJ16n5J8nOk2N0j6j04J22P5q7p5J50Pm1r1K9P6l5Pk6
4406A11K3k5m0j0K4Q7p2k4k4NL3N3j05m9J69n3o4r3R8O8p8p1N4O1n2p6Q6n4nM9
4436B6o3L1L4n2Ml0J4j9Pk3m8O3K8n5r5R8O3j22m4R6L6n9MKml9K9K3q%kM9r3K4
$$ plain form
4470 -125 -130 -53 -149 -166 -91 -43 -99 -112 -60 -15 -82 -92 -69 -65 -89 -63 -14 -63 -46 16 18 -16 21 28 127 -5 -29 64 72 -24 -33 51
4502 51 125 35 -21 -29 81 -5 -2 76 83 72 111 119 108 49 166 122 2 101 168 192 65 15 193 100 26 29 145 186 68
4531 68 77 159 191 70 35 80 133 124 116 74 1 107 105 45 0 18 190 97 -41 19 101 64 -105 -2 93 51 -80 -51 39
4560 39 44 -55 -2 -12 -21 3 20 -68 -129 10 -7 -53 -170 -6 21 -162 -215 -64 41 -96 -198 -159 16 -79 -243 -88
4586 -88 -114 -112 -144 -91 -56 -120 -51 -59 -157 -145 -13 24 -198 -197 -39 18 -143 -258 -63 -15 -113 -153 2 48 -87 -93 -29 3
4614 3 -43 -67 -12 -70 -21 4 103 -75 -67 79 93 -104 -74 123 153 -61 -19 180 173 -16 11 229 120 25 36 192 155
4641 155 68 57 83 7 48 170 165 -15 90 257 163 -40 37 196 122 -31 21 230 142 90 65 141 167 48 52 154
4667 154 92 59 53 159 1 13 200 62 -84 45 173 40 -151 50 167 -10 -118 56 142 36 -154 -13
$$ packed form
4470a25nP7r6j7P5M8n6j3N2M5o7j0K3Mk4K6M9m9J7O2Kl4L7PR9j32k4R3Qr6rQ4
4502E1P4r0n6qJ10q6LP8Pj1L9Qj1n9J17m4j20R9O7K4j27n0J78r3p4LJ16M1j18
4531F8RQ2L2j21l5M5N3rqm2p3J06ko0m5J8J72r3j38O0Q2l7j69J03R5m2j31K9R0
4560C9Nr9N3j0rK4J7q8o1J39j7m6j17J64K7j83n3J51J05j37j02L9J75r5j64J55
4586h8k6Kl2N3L5o4O9qr8J2J32L7k22JJ58N7j61j15J95M8r8m0J55M6j35oO4L2
4614Cm6k4N5n8M9K5R9j78QJ46J4j97L0J97L0k14M2J99pj89K7K18j09r5J1J56l7
4641A55q7j1K6p6M1J22nj80J05J67r4k03P7J59p4j53N2K09q8n2k5P6K6j19MJ02
4667A54o2l3oJ06j58J2J87j38j46J29J28j33j91K01J17j77j08J74Q6j06j90J41
$$ plain form
4689 -13 87 -28 -37 -9 -8 -50 -21 75 -27 -201 15 85 -65 -191 40 115 -141 -255 -17 176 -123 -256 -10 20
4713 20 -163 -222 -42 14 -178 -172 13 -106 -180 -60 69 -98 -208 -57 62 -198 -222 -54 26 -181 -132 110 75
4736 75 -160 -194 80 90 -136 -76 95 7 -54 3 28 -44 -152 60 103 -93 -68 110 96 -75 -39 174 167 -24 -50
4761 -50 238 140 -116 1 167 138 42 109 141 8 13 114 179 72 50 212 162 -22 -20 231 133 -47 69 201 144
4786 144 -81 63 261 137 -81 73 117 42 -68 57 132 65 22 92 90 -31 -74 147 39 -151 -53 158 65 -177
4810 -177 0 168 -21 -131 34 64 8 -125 -49 61 -67 -105 38 1 -130 -40 33 -61 -156 -97 130 -66 -237
4833 -237 -81 36 -134 -263 -79 -10 -124 -161 -64 -59 -115 -128 -43 -51 -110 -138 27 -81 -228 -14 35 -140 -227 -27 103
4858 103 -82 -181 31 62 -143 -126 10 21 -105 -96 3 61 -107 -35 66 -84 -105 143 75 -98 -75 101 165 -34
$$ packed form
4689a3J00j15rK8Jm2K9R6j02j74K16P0j50j26K31P5k56j14K38J93k99j33K46L0
4713B0j83n9J80N6j92OJ85j19p4J20J29j67j10J51J19k60k4J68Q0k07M9K42l5
4736G5k35l4K74J0k26O0J71q8o1N7K5p2j08K12M3j96K5J78j4j71L6K13pj91k6
4761e0K88r8k56J17J66k9r6O7L2j33NJ01O5j07k2J62n0j84KK51r8j80J16J32n7
4786A44k25J44J98j24k18J54M4p5j10J25P5o7m3P0kj21m3K21j08j90R8K11r3k42
4810a77J77J68j89j10J65L0n6j33P6J10j28l8J43l7j31R0P3r4r5N9K27j96j71
4833b37J56J17j70j29J84O9j14l7R7Nn6j3Q5qn9k8J65j08j47K14M9j75q7K00J30
4858A03j85r9K12L1k05J7J36J1j26RR9N8j68P2J01j50k1K48o8j73K3J76O4j99
$$ plain form
4882 -34 -89 90 152 -39 4 186 119 -11 -40 140 79 -22 13 155 41 38 151 112 6 58 200 79 -30 24
4906 24 229 141 -28 29 182 83 -68 -27 198 125 -34 -12 68 101 46 82 86 93 45 45 83 -60 32 169 51 -82 -46
4933 -46 146 6 -100 -21 137 8 -104 -28 104 -4 -52 52 4 -11 -108 -48 -45 -121 16 -9 -96 -109 -53 56 -135
4958 -135 -163 -74 45 -91 -164 -13 -1 -56 -210 -77 72 -73 -180 -115 -74 -79 -46 -59 -128 -105 -58 -20 -192 -134 -2
4983 -2 4 -100 -148 -30 62 -60 -135 -28 10 -78 -111 51 84 -55 -73 -53 -31 19 6 29 -20 70 39 127 -40 18 95 110
5011 110 -34 -31 142 101 -26 -27 131 124 18 -7 164 142 6 4 105 85 158 127 68 75 46 192 62 72 94 156 47
5038 47 64 61 133 165 19 14 90 123 -2 14 25 99 -12 70 103 50 21 37 -40 12 81 122 -18 -95 31 40 14 -88 37
5067 37 90 -11 -106 -32 64 19 -100 12 -51 -41 -51 -67 -122 11 -22 -57 -75 -89 -29 -56 -76 -132 -78 -7 -132 -150 -37
$$ packed form
4882c4n5J79O2j91M3J82o7j30k9J80o1j01L5J42j14lJ13l9j06N2J42j21j09N4
4906B4K05q8j69N7J53r9j51M1K25p3j59K2Q0L3n5L6MPm8%L8j43R2J37j18j33L6
4933d6J92j40j06P9J58j29j12P6J32j08m8J04m8j5r7O0Lp6J37k5q7j3N6J09j91
4958a35k8Q9J19j36p3J51J2n5j54J33J49j45j07O5M1nL3j3o9K3M7L8j72N8J32
4983bOj04m8J18R2j22p5J07L8q8l3J62L3j39j8K0K2N0j3K3m9R0l1Q8j67N8P7J5
5011A10j44LJ73m1j27jJ58pj06k5J71k2j36kJ01k0P3l1n9Pk9J46j30J0K2O2j09
5038D7J7lP2L2j46nP6L3j25J6J1P4j11Q2L3n3k9J6p7N2O9M1j40p7J26Rk6j02J25
5067C7N3j01r5P4R6m5j19J12o3J0j0j6n5J33l3l5j8j4O0k7k0n6N4P1j25j8J13
$$ plain form
5094 -37 -13 -109 -130 -78 -8 -52 -88 -49 -1 -79 -84 -54 -43 -79 -23 -67 -95 -59 29 4 -129 -75 46 12 -29 -105 -1 127 9
5123 9 -23 -14 93 -29 31 26 -2 -16 22 -3 5 53 98 51 59 72 121 32 9 88 132 84 1 34 124 92 63 82 153 89 49 86
5155 86 32 124 115 79 85 53 68 117 133 -15 125 102 54 41 78 123 33 22 80 122 66 25 114 6 48 24 2 83 -66
5184 -66 -6 50 -40 -45 -35 8 -36 -14 12 -10 -24 -69 -46 -1 -101 -63 -120 10 -63 -30 -92 -30 -44 -24 -25 -44 -90 9 -39 -83
5214 -83 -73 -39 15 -8 -137 -66 64 -52 -146 -41 -41 -60 -27 -33 -78 -105 -21 -43 -119 -67 -94 -34 -121 -76 34 25 -87 -74 39
5243 39 36 -52 -99 -50 72 6 -112 16 -42 53 -30 -2 68 73 53 19 40 87 146 37 -37 7 130 111 11 15 165 144
5271 144 -56 59 57 120 3 31 69 132 116 67 85 90 43 82 58 18 56 150 10 -123 46 177 103 -58 23 167
5297 167 80 -59 25 131 112 -37 7 105 27 25 30 31 2 73 30 -33 -25 68 58 -18 -61 0 111 10 -74 40 104 -1
$$ packed form
5094c7K4r6k1N2P0m4l6L9M8p8nL0J1l6N6m4k8L6Q8k5j33N4J21l4m1p6J04J28j18
5123Il2RJ07j22O0nk8j4L8k5QM8M5m7QJ3M9q9k3P9M4m8q3L3R0l2k9J9P1o4m0L7
5155H6n4R2rl6Ol2J5M9J6j48J40k3m8j3L7M5r0j1N8M2n6m1Q9j08M2k4k2Q1j49
5184f6O0N6r0nJ0M3m4K2K6k2j4m5K3M5j00L8n7J30p3L3o2O2j4K0jj9m6R9m8m4
5214h3J0L4N4k3j29P1J30j16r4J05%j9L3om5k7Q4k2p6N2k7O0q7M5J10rj12J3J13
5243C9lq8m7M9J22o6j18J28n8R5q3K8P0Nk0l4K1M7N9j09p4M4J23j9j00MJ50k1
5271A44k00J15kO3j17K8L8O3j6m9J8Nm7L9k4m0L8R4j40j33J69J31p4j61Q1J44
5297A67q7j39Q4J06j9j49M4R8p8kNJk9P1m3o3QR3j0p6m3O1J11j01q4J14O4j05
$$ plain form
5325 -1 -93 -25 93 -5 -156 -110 -7 -43 -81 -82 -76 -46 -11 -69 -108 -71 -39 -44 -107 -157 -31 -7 -197 -121 -22 11 -86 -214 -12
5354 -12 16 -35 -151 -19 -26 -31 -142 -61 -64 -116 -62 7 -26 -147 14 32 -118 -63 97 52 -46 -37 90 92 -16 -95 141 48
5382 48 -39 37 48 78 34 28 30 0 -7 103 37 47 44 136 115 -1 50 182 93 -29 83 146 122 8 20 145 136 35 27
5411 27 85 49 65 126 104 74 82 119 103 -12 11 155 62 -12 64 161 54 -19 -3 125 39 -36 46 84 1 -20 60 40 -11
5440 -11 13 56 -1 6 -50 76 -32 -139 -38 21 -18 -99 25 -26 -96 -134 -18 -44 -67 -89 -45 -51 -38 -86 -38 -59 -158 -48
5468 -48 6 -95 -153 -11 2 -149 -133 15 -20 -86 -146 -61 56 -78 -146 -38 -13 -105 -116 11 -31 -129 -2 -17 -85 -73
5494 -73 -40 -7 -97 -114 68 2 -10 -46 58 68 -50 -1 114 93 -7 -39 104 50 -36 108 66 -17 -2 81 114 -78
5520 -78 15 94 48 -87 45 182 80 16 -4 110 80 -52 95 105 60 52 59 66 32 76 112 40 -6 13 51 121 -23 17
$$ packed form
5325ar2O8J18r8j51M6J03l6l8jOL0L5n8l9L7L2no3n0J26K4j90P6R9L3r7j28K02
5354a2K8n1j16J32pnj11Q1ln2N4O9l3j21J61J8j50N5J60m5r8RJ27Kj08p9K36r3
5382D8q7P6J1L0m4oKl0pJ10o6J0lR2k1j16N1J32q9j22J12O3k4j14J2J25rj01q
5411B7N8l6J6O1k2l0QL7j6j15K3J44r3p4P6R7j07p3J6J28q6p5Q2L8q3k1Q0k0n1
5440a1K4M3n7Pn6J26j08j07J01N9l9q1J24n1p0l8J16k6k3k2M4oJ3m8M8k1r9J10
5468d8N4j01n8J42J3j51J6J48l5o6o0Q5J17j34o8J08K5r2j1J27m2r8J27j5o8J2
5494g3L3L3r0j7J82o6j2l6J04J0j18M9J15k1j00l2J43n4q6J44m2q3J5Q3L3j92
5520g8R3P9m6j35J32J37j02o4k0J14l0j32J47J0m5qPPl4M4L6p2m6J9L8P0j44M0
$$ plain form
5548 17 150 39 8 3 155 63 -89 16 68 -14 27 12 86 53 -12 70 10 22 -8 47 -72 -66 28 74 -77 -98 24
5575 24 27 -24 -150 -22 50 -47 -125 -50 -20 -54 -61 -28 14 -59 -49 -75 -54 -91 -11 -39 -125 -138 33 10 -119 -151 -15 5 -118
5604 -118 -96 -32 -16 -78 -81 -40 44 -83 -60 -84 8 -76 -9 -29 16 -109 1 -45 -80 -65 84 38 -9 -60 70 52 -66
5631 -66 -77 69 109 3 -38 31 95 19 40 10 100 -9 10 59 10 94 110 64 37 -7 145 76 -34 -20 153 83 18
5658 18 7 103 67 36 12 112 132 31 58 7 141 108 10 35 75 80 137 68 -52 7 74 65 -68 -7 114 37 2 -11
5686 -11 76 58 1 -17 -10 33 -60 -10 -47 -12 23 -79 -50 -23 -38 -65 -124 -48 24 21 -70 -146 -23 -38 -79 -141 -17 -18 -46 -139
5716 -139 -51 -57 -32 -70 -111 -66 -84 -25 -24 -80 -28 -38 -83 -154 -109 -41 -110 -88 -123 -61 -37 -127 -58 38 6 -39 -70 -58 -65 -21 2
5747 2 -1 3 -50 -32 41 -4 14 47 18 -29 33 107 48 11 5 93 100 35 29 37 57 31 39 62 77 36 31 40 46 59 53 29 11 72 128 93
$$ packed form
5548A7J33j11l1nJ52r2j52J05N2q2M1j5P4l3o5Q2o0J2l0N5j19OR4M6j51k1J22
5575B4Ln1j26J28P2r7p8P5L0l4pL3M2p3J0k6K1l7Q0k8q6j3J71k3j29l2J36K0j23
5604a18K2O4J6o2lM1Q4j27K3k4R2q4O7k0M5j25J10m6l5J5J49m6m7n1J30j8j18
5631f6j1J46M0j06m1O9O4p6K1l0R0j09J9M9m9Q4J6m6k7m4J52o9j10J4J73p0o5
5658A8j1R6l6l1k4J00K0j01K7n1J34l3r8K5M0NN7o9j20N9O7rj33O1J21p7l5j3
5686a1Q7j8n7j8PM3r3N0l7L5L5j02K9K7j5k7n9P6P2lr1p6J23j5m1o2J24jk8r3
5716a39Q8oK5l8m1M5j8N9Jn6N2j0m5p1M5O8o9K2l5O2K4r0O9R6l2m5l1J2pM4K3
5747BlMn3J8P3m5J8L3k9m7O2P4n9l7oQ8Po5oQK0k6QK3J5m1nROJ3ok4j8O1N6l5
$$ plain form
5783 93 59 17 79 35 56 62 117 52 60 -16 70 77 54 103 32 78 32 91 10 25 11 -32 79 -16 28 13 78 -34 -27 68 3
5814 3 -108 -5 36 13 -16 2 -8 15 -30 -9 -52 -29 12 -31 -84 -138 -84 34 -52 -72 -36 16 -56 -26 -72 -13 -19 -52 -43 -2
5844 -2 -52 -48 -42 -53 -41 -63 6 -83 -76 -8 -35 -89 -119 -78 17 -2 -88 -8 -34 -99 -98 -56 8 -72 -85 -54 1 -3 -80 20 -30 46 13
5877 13 -25 45 17 16 4 -11 -25 106 86 7 -11 21 48 54 -26 75 59 75 46 8 68 35 47 -36 88 30 61 77 28 55
5907 55 133 61 9 51 90 76 -11 90 91 80 -31 73 45 94 50 26 94 89 51 70 -30 6 56 38 72 -48 36 71 3
5936 3 -69 29 115 30 -61 -89 43 81 -23 -20 0 -84 -14 -59 -33 -21 -46 -16 -21 19 2 50 -36 -88 -33 72 -73 -55 -58 -25
5966 -25 -44 -117 -65 -21 -48 -57 -44 -9 -55 -96 -2 -100 -66 -1 -13 -132 -91 -45 47 -133 -97 1 43 -46 -110 33 7 -33 -109
5995 -109 48 18 -20 -31 -51 21 -9 38 20 -23 -2 44 -6 -45 -31 67 34 13 -31 117 99 -46 32 113 104 -4 19 114
$$ packed form
5783I3l4m2O2m4K1ON5o5Qp6Q6Pk3M9p1M6m6N9q1J5j4m3J11r5M4j5O5j12PR5o5
5814Cj11J03M1k3k9J8j0K3m5K1m3K3M1m3n3n4N4J18q6k0L6N2p2L0m6N9ol3RM1
5844bn0MOj1J2k2O9q9PO8k7n4l0M1R5j9q6Q0k6o5JM2O4q0j3L1N5mp7J00n0P6l3
5877A3l8P0k8jj2j5j4J31k0p9j8L2K7Oq0J01j6J6k9l8O0l3J2q3J24n8L1J6m9K7
5907E5P8p2n2M2L9j4q7J01Jj1j11J04k8M9m4k4O8nl8J9j00L6N0j8L4j20Q4L5o8
5936Cp2R8Q6q5r1k8J32L8j04LK0q4P0m5K6J2k5L0nM0j7M8q6n2N5J05j45J8lL3
5966b5j9p3N2M4k7rJ3L5m6m1R4r8L4O5j2j19M1M6R2j80L6R8M2q9o4J43k6m0p6
5995a09J57l0l8j1k0P2l0M7j8m3K1M6n0l9J4R8l3k1m4J48j8j45P8Q1rj08K3R5
$$ plain form
6023 114 85 26 92 50 94 23 64 20 62 78 103 44 5 -2 96 65 31 13 58 52 -53 70 111 92 22 21 33 48 10 25
6053 25 72 50 21 41 87 43 23 55 7 -65 -17 67 10 -72 -1 87 -3 -83 18 35 25 -46 2 0 -46 -27 -7 10 -41 -18
6083 -18 32 -28 -88 -67 -58 -119 -73 3 21 -56 -58 -99 -2 -44 -162 23 56 -62 -125 22 -29 -96 -45 52 -61 -104 -18 -10 -133
6112 -133 -48 -17 25 -117 -167 7 -43 -78 -46 -11 27 -11 14 48 54 -30 -50 23 -37 -31 26 -10 -9 -38 68 66 -9 -57 96 3
6142 3 -78 57 84 74 -23 38 72 118 3 45 29 30 5 92 114 86 20 92 65 26 15 108 105 -24 62 94 51 -22 24 78
6172 78 75 -12 12 68 111 59 42 -21 37 49 74 76 -64 25 112 16 -85 54 104 75 -42 16 70 62 -97 1 105 3
6200 3 -85 37 23 -9 2 -4 9 -54 -18 -46 -44 -106 -29 32 -88 -128 -7 57 -60 -149 -10 -2 -45 -45 -14 -78 -67 -62 -66 20 -45
6231 -45 -49 -50 -60 -103 -85 2 -118 -51 17 -10 -77 -28 14 -7 -41 -76 -66 45 -46 5 37 1 -17 -86 65 23 -5 -5 43 -62
$$ packed form
6023A14k9n9O6m2M4p1M1m4M2J6K5n9l9pR8l1l4j8M5oj05J23M1j9p0jJ2J5l8J5
6053B5M7k2k9K0M6m4k0L2m8p2M8Q4n7q2P1Q8r0q0J01J7j0p1M8km6J9K0J7n1K3
6083a8N0o0o0K1Ro1M6P6J8p7km1R7m2j18J85L3j18o3J47n1o7N1R7j13m3Q6Qj23
6112a33Q5L1M2j42n0J74n0l5L2L5L8l8K5L4Oq4k0P3o0ON7l6Jk9J06kp5m8J53r3
6142Cq1J35K7j0r7O1L4M6j15M2j6Jk5Q7K2k8o6P2k7l9j1R3lj29Q6L2m3p3M6N4
6172G8lq7K4N6M3n2j7o3N8J2K5Kj40Q9Q7r6j01J39N0k9j17N8N4qj59R8J04j02
6200Cq8J22j4l2J1oJ3o3L6k8Ko2P7O1j20m0J21O4j17q9J39Qm3%L1o4J1NmQ6o5
6231d5mjj0m3J8Q7j20O7O8k7o7M9M2k1l4l5J0J11r1N1L2l6j8o9J51m2k8%M8j05
$$ plain form
6261 -62 -10 35 33 -18 42 60 17 -17 4 43 44 -30 34 70 74 7 16 77 20 61 21 94 51 4 68 78 28 85 113 63 38 29 128
6294 128 56 70 34 67 97 -24 21 116 56 44 25 13 14 45 22 31 47 15 21 4 -17 -6 71 32 -63 -24 58 16 -16 3 8
6325 8 -21 -60 -17 -43 -18 11 0 80 54 4 -64 -92 -33 11 22 -18 -95 -49 -19 -63 -36 5 -7 -44 -101 -40 -11 -28 -74 -31 13
6356 13 -7 -66 -71 33 -60 -67 -28 -51 -42 -33 -60 -40 -81 -3 -14 -79 -36 51 -32 -90 -56 52 -3 -60 -83 -49 24 35 -23 -7 -41
6387 -41 -10 16 -86 6 46 65 -17 7 53 -4 32 14 25 71 7 33 40 80 42 -16 -41 86 89 11 48 14 71 56 36 57
6417 57 21 -7 81 55 5 126 108 15 23 85 63 62 10 13 66 4 58 24 35 -11 -21 27 10 24 58 -15 -79 3 33 33 -20 2
6449 2 20 47 53 -26 8 -12 -52 -6 42 -29 -51 -87 -1 -58 -9 -101 -71 24 -62 -10 -28 -43 -31 -13 -24 -26 1 -61 -11 -52 -26 11
6481 11 -15 -63 -49 -24 6 -25 -139 -25 -45 -64 -39 -61 -78 -19 -67 -3 -43 20 -29 24 -23 -5 -17 29 -10 -70 -54 22 -44
$$ packed form
6261f2N2M5kn1O0J8m3l4K1L9Jp4O4L6Mo7RO1n7M1m0P3m3m7O4J0n0N7K8n0k5rR9
6294A28p2J4l6L3L0j21M5R5o0j2j9j2JL1k3RJ6l2Oj7k1J1P7l9r5L9Q2m2l2J9N
6325Hk9l9M3k6K5K9j1Q0k6n0o8k8N9M4J1m0p7M6L0m4K7M1j2l7n7O1K9j7m6M3M4
6356A3k0n9nJ04r3pL9k3RRk7K0m1P8j1o5M3Q7q3n8L4J08n5n7k3L4P3J1n8J6l4
6387d1L1K6j02R2M0J9q2K4M6n7L6j8J1M6o4K6PM0l8n8k5J27Lp8L7l4N7j5k0K1
6417E7l6k8Q8k6n0J21j8r3QO2k2jn2LN3o2N4l4J1m6j0M8j7J4L4p3o4Q2L0%n3K2
6449BJ8K7Op9L4k0m0M6M8p1k2l6Q6n7M9r2L0R5q6N2j8j5J2J8j1kK7o2N0m1K6L7
6481A1k6m8J4K5L0l1j14J14k0j9K5k2j7N9m8O4m0O3m9N3m7J8j2M6l9o0J6P6o6
$$ plain form
6510 -44 -40 -9 -7 33 -1 23 25 6 19 68 6 41 6 27 1 -29 37 22 -23 60 25 51 -21 0 48 67 93 14 75 87 40 94
6542 94 0 10 29 -24 18 7 21 88 73 24 33 96 49 -29 14 30 -4 12 18 90 1 27 47 -39 -21 20 32 -5 2 -10 -52 18
6574 18 -33 19 39 65 -35 -15 25 -88 -55 -8 -43 13 12 -44 -10 -49 -27 12 12 -1 29 -33 -33 -80 -4 2 -121 -57 -25 -33 -5
6605 -5 -99 29 -13 -52 -67 -21 -29 -142 -70 -98 16 -71 12 -67 -34 -78 -56 -3 -3 4 -26 -49 -84 -43 -13 -36 -11 -54 26 79 -20
6636 -20 -25 16 -9 83 -7 32 3 36 -47 -22 -4 27 24 -25 -9 22 85 -1 -51 -8 94 113 -16 17 65 30 -10 -34 110 1
6666 1 53 64 -15 48 42 81 58 -5 36 96 50 -33 72 4 102 61 11 78 60 -32 13 43 23 -42 27 66 1 -33 17 5 22
6697 22 -4 -6 20 -3 50 51 -41 -33 -2 71 8 -23 -56 12 -9 -16 16 66 -15 -39 -24 -13 -40 -16 -32 -19 -28 48 -34 -51 -30 -30 -45
6730 -45 -97 -19 -46 -35 -127 -92 -62 -66 -71 -77 -22 -24 -80 -98 -62 -55 -22 -14 -2 -46 -12 14 20 -100 -9 -18 39 -32 -56 52 47 -92 -9
$$ packed form
6510d4ML1KM0l4K4Kj9J3M9o2L5l5K1k6l0O6j5m5Q3l5K6p2K1M8J9K6p9O1J2m7N4
6542I4r4J0J9n3M2j1J4O7j5m9RO3m7p8M3J6l4J6OP2q9K6K0q6J8M1J2l7Pj2m2P0
6574A8n1N2K0K6j00K0M0j13L3M7l5N6jn6L4l9K2L9%j3L0o2%m7P6Oj23O4L2qK8
6605er4J28m2l9j5M6qj13P2k8J14q7Q3p9L3m4K2N3%Pl0k3l5M1L0k3K5m3Q0N3r9
6636b0nM1k5R2r0L9k9L3q3K5J8L1lm9J6L1O3q6n0M3J02J9j29L3M8l5m0k4J44j09
6666AN2J1p9O3oL9k3o3M1O0m6q3J05o8R8m1n0O7j8r2M5L0k0o5O9L9o5l4N0j2J7
6697B2k6kK6k3N3Jr2QL1P3o3l1l3O8k1pL2N0q1k4J5J1k7K4j6J3rP6q2j7K1%j5
6730d5n2P8k7J1r2L5L0mnoN5kn6j8L6PL3QJ2m4L4K6Oj20R1rN7p1k4J08nj39Q3
$$ plain form
6763 -9 33 57 70 8 72 52 61 9 -1 17 7 72 6 -7 4 25 38 17 20 117 74 3 57 117 116 11 42 87 67 -48 22
6794 22 61 40 15 53 38 29 11 60 33 -10 20 92 -20 32 30 49 52 -66 -23 117 37 -33 -34 97 56 49 52 4 -16 -25 42 49
6826 49 -17 30 58 -42 6 14 -18 -61 -102 -8 -3 -34 -26 -55 -2 -73 -52 -52 40 -60 -47 -48 -45 40 -50 -84 -73 -22 -52 14 -57 -65 -68
6859 -68 -61 -36 -38 -5 28 -66 -85 -38 22 -27 -69 -83 37 -26 -28 -21 -7 -27 17 1 -35 -45 32 22 -66 -16 24 19 -1 67 9 71
6891 71 11 -29 2 58 37 16 40 -3 48 49 60 55 7 32 -36 -21 32 113 37 -36 -17 79 68 44 56 25 -7 11 33 91 35
6922 35 -29 38 20 39 6 21 -7 64 4 64 72 6 58 78 86 -52 48 20 -14 -6 -4 52 -25 0 11 -23 -4 -19 92 39 14
6953 14 8 -37 -5 -43 7 -21 55 -53 20 10 -3 -50 -55 56 -40 -90 -24 35 -40 -32 -58 12 -29 -19 -42 -30 -54 -68 -7 -54 -21
6984 -21 11 -6 -65 -73 13 8 -59 -71 51 -71 -44 3 -65 -28 -101 -86 -7 13 -102 -70 -7 -78 -15 25 10 -39 -31 -8 -8 -20 24
$$ packed form
6763iM2K4J3o2O4k0Rn2j0J8j0O5o6j3J1K1J3k1LR7m3p1N4O0jj05L1M5k0j15P0
6794B2L9k1k5L8j5rj8M9k7m3L0P2j12N2kJ9Lj18M3J40q0p0jJ31m1pLm8k0rO7P
6826D9o6M7K8j00M8Ql2m3m1R4Nl1Qk9N3p1K1%R2j00J3jLQ5r0l4J1N1l0O6p1ql
6859f8PK5kL3L3r4j9M7O0m9m2j4J20o3kPJ4k0M4j6l6j0P7j0q8N0M0nk0O8n8O2
6891G1o0m0L1N6k1k1K4m3N1JJ1nm8K5o8J5N3Q1p6p3J9R6j1k4J2l1l2J8K2N8n6
6922C5o4O7j8J9l3J5k8P1o0O0Qo6N2K0Qj38J00k8l4QKN6p7K5J1l4J9j5J11n3k5
6953A4om5L2l8N0k8P6j08P3j0j3m7nJ11r6n0O6N9p5Qk6P0m1J0k3J2k4j4O1m7L3
6984b1L2j7n9qQ6no7j2J22j22K7M7o8L7p3J5P9K0j15L2O3p1O3M0j5m9QK3%j2M4
$$ plain form
7015 24 -2 23 6 -25 63 2 27 5 39 -51 -40 -1 11 19 -4 -7 19 66 16 64 -19 63 53 89 13 8 31 17 41 34 2 49
7047 49 35 -12 38 54 58 78 42 50 37 46 31 -40 65 95 43 36 -39 -25 14 27 68 -1 18 45 6 -21 44 34 -20 -24 -2 43
7079 43 -46 -53 -15 -17 -12 0 -51 -14 -28 -3 -47 10 -20 -54 -47 -118 27 -45 -76 -42 -56 -47 5 -29 -26 13 -17 -90 -48 -52 -18 -39 -30 -90
7113 -90 -77 -25 -19 -31 -62 -4 -82 4 -57 -7 8 -22 -29 28 13 -12 -60 -28 52 -4 -38 -27 -57 -64 0 -22 -14 26 65 12 -10 -19 17
7146 17 6 -39 31 15 95 -45 68 -15 -2 58 34 4 57 31 84 -3 38 72 110 34 24 1 31 67 -6 33 58 51 -40 54
7176 54 112 -8 34 -16 46 46 27 28 81 27 45 24 4 -36 9 44 36 1 -22 52 36 4 20 55 39 -24 25 -8 24 -44 -58
7207 -58 19 -60 15 -45 -15 20 -35 22 -4 -72 3 -62 -26 -36 -22 21 -3 -9 14 21 2 22 -3 -36 -9 20 -77 -19 13 -24 33
7238 33 6 -27 9 -28 -37 -27 17 27 -31 13 -45 4 -36 -34 13 -23 -13 -37 -10 -26 -6 -28 -48 37 -18 25 -18 -19 26 126 48
$$ packed form
7015B4k6K5j7l1Q8o1K5k2L4r0J1L9J2Qk3lK6M7n0M8q3Q2j0L6p6nK3j4K4pl2M7
7047D9j4m7N0J6MK0l6Qj3Rj5p1J05L0n2pp5J4L9J3M1o9J9K7l9k7O5j0n4mK2M5
7079D3q9pL8kNJ2n1L7j4K5m4N7l0l4Pp1J45p2l1L4j4RN2l4LL9l0p3M2mL4k1Ro0
7113i0J3N2Oj2l1N8p8Q6o1N0J5l0pN7j5k5m8L2Q0n6l4J1l0pO4k2QM0L9n3k2rL6
7146A7j1m5P0j6Q0j40J13q3J3O0k4l0N3k6N3q7M1L4L8p6j0k3L0L6p3L9K5pr1R4
7176E4N8j20M2n0O2%j9JN3n4J8k1k0m0M5L5ql5k3P4j6l2J6L5j6o3M9l3L2o8j4
7207e8P7p9P5o0L0L5n5N7k6o8P5o5L6j0J4M3k4oK3Pj9K0k5l3K7K9r7N8L2l7N7
7238C3k7l3L6l7rJ0M4J0n8M4n8M9m0KM7l6J0k4K7j6K0k2k0Q5n5M3m3jM5J00p8
$$ plain form
7269 48 -38 -3 71 3 -24 10 55 81 26 38 -17 82 54 8 48 36 25 5 24 40 54 30 33 -26 -32 46 48 70 5 81 108 18
7301 18 57 99 27 -1 32 47 41 17 50 13 16 54 81 13 3 -15 37 40 -4 -24 18 10 5 39 35 33 -21 -16 17 -8 -46 18 46 24
7335 24 34 -11 13 -7 -4 12 2 17 40 16 -20 -7 -25 37 -96 -33 0 38 -52 -94 7 40 -85 -60 6 -20 -48 -71 -17
7364 -17 -54 -11 -63 -18 -13 -48 6 -21 -16 -52 -16 -17 -3 -61 -4 51 -25 -27 -60 -41 -23 -17 15 19 -75 -12 -15 -14 -12 32 47 3 28 95 0
7399 0 -51 -30 72 70 9 -42 86 39 -54 17 5 70 -14 101 25 32 15 80 11 23 77 50 69 -5 34 30 33 14 -5 25 44
7430 44 39 50 69 49 -11 -23 15 60 30 38 9 62 60 9 39 -64 -2 -7 27 25 55 25 18 -32 62 -10 -21 1 14 7 70 -47 43
7463 43 -24 11 -7 14 -37 -61 14 -11 -15 -55 29 -40 -21 -67 18 14 -56 -133 4 -18 51 -37 -59 -15 -15 -30 -34 -41 -48 8 -64 -85 -10
7496 -10 4 2 -64 -79 -7 23 -76 30 -13 10 30 -91 -44 28 -5 25 -6 8 -20 19 -1 36 -6 -48 53 -32 -32 89 10
$$ packed form
7269D8q6L5P4o8k7L4M5K6n5J2n5R9k8m6M0j2j1k0J9J6J4k4Ln9oP8KK2o5P6K7r0
7301A8L9M2p2k8L3J5ok4L3l7LL8K7o8j0j8N2Lm4k0M2qnL4mkn4NL3k5l8O4K8k2
7335B4J0m5K4k0LJ6j0J5K3k4l6J3j8O2j33O3L3L8r0m2J01L3j25K5O6k6k8k3N4
7364a7l7M3n2M5Nl5N4k7Nl6L6jJ4n8N7N5p6kl3J9J8OL2Mr4O3lJKM4J5m4K5O7r5
7399@n1K1J02ko1n1J28m7r3P1j2O5q4J15p6Pj7O5o9J2N4k7J9p4L9mLj9j9L0J9
7430D4nJ1J9k0o0j2L8M5l0Qk9N3kn1L0j03O2nL4kL0l0pn0R4p2j1K2J3pO3j17R0
7463D3o7L5j8K1n1k4P5k5mm0Q4o9J9m6Q5mp0p7J37k2O9q8k2M4%j5mppN6p2k1P5
7496a0J4ko6j5P2L0r9J06m3K3K0j21M7P2l3L0l1J4k8L9k0L7m2m2J01q5%J21p9
$$ plain form
7525 10 0 15 -7 17 -9 28 8 75 -10 -2 -6 50 62 14 54 86 18 59 55 81 48 0 12 46 62 98 5 5 -3 42 33 40 9 46
7559 46 35 27 41 -10 80 35 -26 35 73 -38 25 -31 55 65 44 -30 -26 54 31 -45 30 33 3 -57 -33 36 84 72 -77 -19 -9
7590 -9 -18 0 11 -20 20 -7 -25 -95 19 -27 8 -84 -34 -31 9 -70 -56 56 -68 -35 -80 -51 32 -10 -63 3 18 57 -34 -119
7620 -119 -41 -10 -28 -77 -53 17 -34 54 -21 -29 -2 -7 -19 17 15 15 -32 2 -14 33 -47 -14 -21 -22 -3 45 -2 82 57 -48 -24 -18 56
7653 56 -8 11 5 62 124 45 -30 2 22 63 21 12 19 39 40 17 56 17 24 37 55 53 77 49 21 14 -3 63 57 -3 -7 98 52 -17
7687 -17 26 25 47 6 3 40 49 83 36 15 -17 13 47 51 -21 -24 52 0 -4 14 -2 -3 13 -2 -12 -48 -33 -17 -25 -50 -55 -31 -36 14 -41
7722 -41 -35 -11 -75 -14 -37 -88 -101 -40 14 -33 15 -52 -69 -74 -23 -59 -30 -57 -53 -51 12 11 -3 -30 -26 18 -40 -26 -12 -40 -14 12 -25
7755 -25 -16 -3 -23 12 -45 -11 -20 4 -23 15 44 18 -2 13 -23 -65 24 41 -30 -1 34 -36 33 51 3 40 -2 0 29 38 48 60
$$ packed form
7525A0j0J5k2K4k6L7k0O7q5QmN6J2m8M0L2o8M1mK6l3m8J2L4J6L6r3%qM5rPl1L7
7559D6j1qJ4n1R0m5o1O1L8j11O3n6Q6J0k1p4MQ0k3p6P5Ll0o0K4O9M8j2j49N8J0
7590irJ8J1l1M0k7j8p0J14m6L5r2N0LM0p9J4J12j24L3m5K9Q3m2n3O6J5L9r1q5
7620a19P8L1j8m9K4P0n1Q8p5qK7nj2L6k%m7L4j6M7q0L3pjJ9M8m7Q4k5j05K4OP4
7653E6o4J9oN7O2p9p5L2K0M1m2rPK0Jk3L9l9PJ3J8kK4k8k8pj7O6oo0mJ05m6o9
7687a7M3jK2m1lL7RL4m7k1l2L0L4Mp2lP6n2mJ8j6jJ6j5j0l6J5J6qk5nK4nN0n5
7722d1OK4o4O1k3n1j3O1N4m7M8o7j7nN1l6K9k7MKO3jj4k7MM4n8J4J4k8K6K6l7
7755b5RJ3k0L5n7L4rK4k7L8K9k6k0J5l6m2Q9J7p1K9L5p0O9J8m8L7m2KK9RJ0J2
$$ plain form
7787 60 1 35 39 -18 61 34 -1 4 10 28 2 25 89 26 8 98 51 38 10 61 59 6 23 30 97 1 14 58 131 -5 40 11
7819 11 31 -2 0 -10 20 15 -37 -8 67 47 -26 86 -30 32 29 7 11 16 25 35 -24 -50 -14 5 -16 -71 -2 -51 -22 -56 -5 12
7851 12 -16 -30 -61 -20 30 -40 -22 -45 65 -23 -34 -29 29 35 -31 -30 -8 -4 8 -4 10 13 -57 -48 11 -33 70 -10 -21 -84 13 64
7883 64 -30 36 -13 -41 -13 -48 -6 -6 24 -100 -23 14 4 -41 -46 54 -12 -20 -13 -3 -72 27 0 -2 -17 49 74 46 -3 -26 7 -2
7915 -2 14 55 69 25 28 23 -14 17 58 102 80 56 34 -43 111 30 -9 27 -15 53 -1 11 39 -2 34 5 21 -27 47 -14 -30
7946 -30 -8 73 17 66 6 22 95 78 0 3 20 28 49 23 -38 -32 -15 -37 -11 -34 13 -15 3 -58 -20 -66 -55 50 -16 9 11 -22
7978 -22 -6 22 -35 -42 -14 -13 -24 -1 -21 -3 -65 -59 -12 -52 -9 23 8 35 -69 -56 -50 -134 -60 -21 -47 -71 -11 3 -8 11 -7 -24
8010 -24 9 -8 55 -3 -26 -57 0 7 -35 39 32 -14 -20 -16 46 -61 60 23 24 58 33 53 -11 7 18 41 94 83 38 -2 32 60
$$ packed form
7787F0n9L4Mn7P9k7l5NOJ8k6K3O4o3j8R0m7j3k8N1kn3J7PO7r6J3M4P3j36M5k9
7819A1K0l3Kj0L0nn2K9P5k0p3J12j16O2lk2MNRJ0n9k6L6J9k1n5O9m9K9l4N1J7
7851A2k8j4l1M1N0p0J8k3J10q8j1NN8Oo6JK2MJ2j2J4Lp0RN9m4J03q0j1o3R7N1
7883F4r4O6m9k8K8l5M2%L0j24P7L7j0m5nJ00o6qPJ0o9R9k7kj5O6K5k8m9k3L3r
7915bJ6M1J4m4Lnl7L1M1M4k2k4k2p7J54q1l9L6m2O8n4J2K8m1L6k9J6m8P4o1j6
7946c0K2Q1n6M9o0J6P3j7p8LJ7QK1k6o1OJ7k2K6k3M7k8J8o1L8m6J1J05o6K5Kl3
7978b2J6K8n7pK8Jj1K3k0J8o2OM7m0M3L2j5K7j04J3Oq4P4L9k6k4O0J4j1J9j8j7
8010b4L3j7O3n8k3l1N7Pm2P4pm6oMO2j07J21l7JL4k5K0o4J8J1K3N3j1m5m0L4K8
$$ plain form
8042 60 7 36 -27 32 -18 -32 42 39 81 36 71 4 68 16 31 28 18 43 9 -9 5 83 -24 42 36 73 24 1 48 4 5 -17
8074 -17 33 5 -9 13 5 18 59 33 0 58 4 -8 -24 -13 -40 22 -56 -75 -18 31 -44 26 23 -2 11 -3 -48 87 18 6 -20
8105 -20 10 -48 -65 -1 4 -59 -84 -37 -71 -42 -33 12 -53 -53 -6 -34 -31 -37 -59 -18 23 -56 -28 -48 -14 -79 28 1 2 26 -21 -12 20
8138 20 33 -28 -33 -4 20 15 17 -35 27 -46 -37 -61 2 7 16 57 79 31 59 -25 -22 70 17 -16 37 -11 38 23 38 32 -19 -5 -6 22 20
8173 20 47 46 -9 -16 55 5 29 -3 21 -41 23 74 75 42 69 16 -16 34
$$ packed form
8042F0n3K9o3N9n0j4P4lM2m5L5o7O4n2J5lj0K5l4j8J4P8j07O6oL7m9k3M7m4Jk2
8074a7N0k8j4K2qJ3M1k6l3N8n4j2j6J1k7O2p8j9N7M9p5P0lk5J3j4m5J35o9j2k6
8105b0L0n8j7O4No3k5M7l4K9RM5o5%M7k8Lok2M1M1p9K8k0L4o5J07k7JK4m7RL2
8138B0J3o1nK9K4nKn2O2p3Rk4O3NRM1K2m8K8q4LR2n3l3N3m8M9j5J5on1J4jK8k
8173B0K7jn5pP1n0K4l2K4o2O4N1Jl3K7n3l2N0
8191C4
$$ Imaginary data points
##PAGE= N=2
##DATA TABLE= (X++(I..I)), XYDATA
$$ plain form
0 0 0 0 0 0 0 0 0 0 0 0 0 0 0 0 0 0 0 0 0 0 0 0 0 -1 1 -1 1 0 2 0 0 1 -1 1 -1 2 -2 2 -4 6 -4 5 -4 6 -7 5 -6 6 -2 -1 6 -14 27 -52
54 -52 88 -156 283 -557 1249 -3715 27459 213045 140122 -32981 -2211 57239 -16949 -24539 123218
69 123218 150971 -6301 -49896 86509 123839 28587 46426 158990 127603 3849 4239 61150
81 61150 16334 -784 130574 201578 65394 -46106 38600 127805 84192 64644 123805 89165
93 89165 -27361 -4353 133460 147926 56325 66115 132923 78364 -10447 39088 119729 78329
105 78329 33415 95059 109339 792 -26527 103924 163458 60611 2030 60920 61584 -11649
117 -11649 20833 126204 98787 -16091 -6903 82609 62212 -12319 21014 84965 38627 -27662
129 -27662 1023 27276 -21532 -25248 54700 63984 -30007 -63370 -2622 10396 -33412 -17059
$$ packed form
0@%%%%%%%%%%%%%%%%%%%%%%%jKkKjKk%JkKkLmMoJ0j0RrJ0j3J2j1J2qJPk0M1p9
54e2J40k44M39q40J806m964L1174J85586p2923j73103L0770N9450p4188p590J47757
69A23218K7753j57272m3595J36405L7330r5252J7839J12564l1387j23754L90N6911
81F1150m4816j7118J31358P1004j36184j11500Q4706Q9205m3613j9548N9161l4640
93H9165j16526K3008J37813J4466r1601R790O6808n4559q8811M9535Q0641m1400
105G8329m4914O1644J4280j08547k7319J30451N9534j02847n8581N8890O64p3233
117a1649L2482J05371k7417j14878R188Q9512k0397p4531L3333O3951m6338o6289
129b7662K8685K6253m8808l716P9948R284r3991l3363O0748J3018m3808J6353
$$ plain form
141 -17059 22807 -28596 -94340 -44270 30960 -4681 -66022 -33904 5385 -41809 -81150 -40175
153 -40175 -17258 -59621 -62653 -6708 -10064 -77520 -80734 -17001 -7485 -51453 -50905 -26634 -56026
166 -56026 -83511 -33023 15350 -24228 -69623 -36485 -2325 -36614 -62651 -27240 -8089 -41818
178 -41818 -49992 -14011 -14484 -53953 -46996 138 292 -40625 -46847 -26249 -31630 -37161 -7155 7677
192 7677 -26839 -45855 -12416 7229 -18719 -26170 4699 9291 -20923 -20109 11107 9349 -14272
205 -14272 989 31841 15391 -19243 -7956 23895 21923 8092 17688 21286 56 -1876 28710
218 28710 38981 14383 6060 24943 26420 10064 16807 36463 28467 10362 21224 37445 22225
231 22225 4807 21350 41376 29155 11384 16788 23944 16370 17017 30747 28101 8183 3990
$$ packed form
141a7059L9866n1403o5744N0070P5230l5641o1341L2118L9289m7194l9341M0975
153d0175K2917m2363l032N5945l356o7456l214O3733R516m3968N48K4271k9392
166e6026k7485N0488M8373l9578m5395L3138L4160l4289k6037L5411J9151l3729
178d1818q174L5981m73l9469O957M7134J54m0917o222K0598n381n531L0006J4832
192G677l4516j9016L3439J9645k5948p451L0869M592l0214Q14L1216j758k3621
205a4272J5261L0852j6450l4634J1287L1851j972j3831R596L598k1230j932L0586
218B8710J0271k4598q323J8883J477j6356O743J9656p996j8105J0862J6221j5220
231B2225j7418J6543K0026j2221j7771N404P156p574O47J3730k646j9918m193
$$ plain form
244 3990 17984 22188 15521 16738 18915 8422 2086 13591 20458 7659 -301 11102 16572 3149
258 3149 -3430 7683 12331 1886 -1411 6298 3768 -8184 -7419 4198 4824 -4481 -7050 -5285 -8767
273 -8767 -9387 -2304 -1821 -12530 -16844 -9731 -8922 -16688 -15317 -6391 -9733 -21978 -21641 -11661 -12335 -21193
289 -21193 -20614 -14471 -17520 -24188 -21416 -15217 -16647 -20538 -19517 -18807 -21423 -21088 -17814 -18770 -21270 -17836
305 -17836 -14197 -19405 -24276 -18488 -11496 -15349 -21404 -17948 -12581 -15777 -19475 -14627 -9308 -12881 -17882
320 -17882 -15317 -9834 -9096 -10960 -10921 -9619 -8367 -7249 -8036 -9985 -8199 -2820 -1509 -5833 -7044 -1684
336 -1684 1421 -2252 -3897 679 3328 -684 -2924 2129 6557 4064 671 3056 7567 7758 4632
351 4632 3269 5476 8512 8955 6015 3904 6155 10303 10729 8075 7940 10178 9090 5433 6223 10809
$$ packed form
244C990J3994M204o667J217K177j0493o336J1505O867j2799p960J1403N470j3423
258C149o579J1113M648j0445l297P709k530j1952P65J1617O26r305k569J765l482
273h767o20P083M83j0709m314P113Q09p766J371Q926l342j2245L37R980o74q858
289b1193N79O143l049o668K772O199j430l891J021P10k616L35L274r56k500L434
305a7836L639n208m871N788O992l853o055L456N367l196l698M848N319l573n001
320a7882K565N483P38j864L9J302J252J118p87j949J786N379J311m324j211N360
336a684L105l673j645M576K649m012k240N053M428k493l393K385M511J91l126
351D632j363K207L036M43k940k111K251M148M26k654j35K238j088l657P90M586
$$ plain form
367 10809 10526 5027 3772 10095 14504 10595 4999 5963 10229 9992 5895 3945 6094 7918 7419 6972
383 6972 8366 9100 6978 4155 4491 7166 7074 2523 -392 3204 8791 8314 2801 1020 5210 7574
399 7574 3403 -1494 -1021 1530 821 -925 979 3914 2347 -1881 -2317 1245 1794 -3659 -8621 -6818
415 -6818 -1055 796 -2852 -5480 -3037 322 -1193 -5578 -6711 -4838 -4354 -5982 -5234 -1929 -1043 -4090
431 -4090 -5275 -1671 998 -2637 -8032 -7368 -1956 412 -3094 -6286 -3998 277 547 -2203 -3130 -1900
447 -1900 -2139 -3806 -3096 -281 -198 -3461 -4388 78 4347 2701 -2258 -3683 -318 2185 370 -2586
463 -2586 -1923 1665 3084 1303 388 2507 3488 1073 -537 1736 3362 -34 -2609 1573 7285 6146
479 6146 756 -319 3432 5467 3828 2278 1961 1916 2285 3542 4286 4558 5316 5321 3378 2729 4705 4754
$$ packed form
367A0809k83n499j255O323M409l909n596R64M266k37m097j950K149J824m99m47
383F972J394P34k122k823L36K675r2m551k915L596N587m77n513j781M190K364
399G574m171m897M73K551p09j746J904K935j567m228m36L562N49n453m962J803
415f818N763J851l648k628K443L359j515m385j133J873M84j628P48L305Q86l047
431d090j185L604K669l635n395O64N412K368l506l192K288M275K70k750r27J230
447a900k39j667P10K815Q3l263r27M466M269j646m959j425L365K503j815k956
463b586O63L588J419j781r15K119R81k415j610K273J626l396k575M182N712j139
479F146n390j075L751K035j639j550l17m5L69J257P44K72P58Nj943o49J976M9
$$ plain form
497 4754 1033 194 5464 8103 2963 -989 3590 8525 5673 1253 2074 3102 10 -768 3962 6338
513 6338 2480 -305 1887 3233 1150 405 1182 -12 -939 1650 2284 -2012 -3079 2868 5428 -447
529 -447 -4090 -179 1423 -2901 -2098 4889 4431 -4424 -6081 2057 4891 -716 -2244 1881 1157 -3279
545 -3279 -1793 2510 692 -2195 1102 2931 -2388 -4566 1342 3609 -1896 -2761 2956 1358 -6218
560 -6218 -3623 6284 4585 -5661 -4865 3939 2554 -4816 -1536 5852 1964 -5035 -729 5062 -56
575 -56 -4679 1425 5569 36 -2143 3541 3407 -2909 -260 7722 3580 -5914 -1261 8874 4306 -4679
591 -4679 1452 10205 2776 -5794 2485 10522 1478 -5932 3608 10967 2511 -3281 4315 7300 155
606 155 863 9317 6181 -3758 -196 9445 4870 -2948 4506 11930 1949 -5644 5592 13141 946
$$ packed form
497D754l721q39N270K639n140l952M579M935k852m420Q21J028l092p78M730K376
513F338l858k785K192J346k083p45P77j194r27K589O34m296j067N947K560n875
529d47l643L911J602m324Q03O987m58q855j657Q138K834n607j528M125p24m436
545c279J486M303j818k887L297J829n319k178N908K267n505q65N717j598p576
560f218K595R907j699j0246P96Q804j385p370L280P388l888o999M306N791n118
575e6m623O104M144n533k179N684j34o316K649P982m142r494M653J0135m568q985
591d679O131Q753p429q570Q279Q037r044p410R540P359q456n792P596K985p145
606A55P08Q454l136r939L562R641m575p818P454P424r981p593J1236P549j2195
$$ plain form
621 946 -6291 5953 11896 -1042 -6025 6971 11583 186 -2067 7815 6040 -4875 -1420 9645
635 9645 5170 -4315 1822 9337 582 -5177 6383 11433 -2550 -7563 6669 10032 -5012 -6471
649 -6471 10266 11181 -5812 -6495 8972 7963 -5839 -2445 10110 3708 -8809 -1506 9989 2703
663 2703 -5508 3306 7763 -4311 -6926 7442 8666 -7318 -7659 8436 7060 -8837 -4706 11994
677 11994 6341 -10816 -5005 10300 3124 -10024 -802 11074 511 -9830 1045 9038 -1897
690 -1897 -5847 6140 5981 -9031 -7280 9201 7052 -8258 -4041 9639 1425 -12445 -1089 14475
704 14475 2524 -13087 -2710 9350 -1865 -9990 4586 12017 -3500 -10643 2874 6620 -5294
717 -5294 -3875 9233 3917 -11247 -5117 10016 3820 -7397 2415 11241 -3854 -14572 1964
$$ packed form
621I46p237J2244N943j2938m983J2996M612j1397k253R882j775j0915L455J1065
635I645m475r485O137P515q755n759J1560N050j3983n013J4232L363j5044j459
649f471J6737R15j6993o83J5467j009j3802L394J2555o402j2517P303J1495p286
663B703q211Q814M457j2074k615J4368J224j5984l41J6095j376j5897M131J6700
677A1994n653j7157N811J5305p176j3148R222J1876j0563j0341J0875P993j0935
690a897l950J1987j59j5012J751J6481k149j5310M217J3680q214j3870J1356J5564
704A4475j1951j5611J0377J2060j1215q125J4576P431j5517p143J3517L746j1914
717e294J419J3108n316j5164O130J5133o196j1217R812Q826j5095j0718J6536
$$ plain form
730 1964 13861 -708 -9310 4845 9048 -7843 -10436 8203 11425 -4915 -6709 5535 1683
743 1683 -10090 -1236 12905 3732 -9927 -1770 7054 -3858 -8612 7738 12906 -6084 -13083 3790
757 3790 8806 -5838 -5590 10894 8142 -10674 -9122 7531 5603 -6426 -191 10114 -510 -11812
771 -11812 -641 9934 175 -5923 5137 6638 -8856 -9620 8269 10157 -5398 -5342 7765 2675
785 2675 -11400 -3475 13043 6041 -9028 -2744 8014 -763 -8705 3451 11341 -1235 -8277 3093
799 3093 6569 -4854 -4577 8867 6757 -7503 -4794 7806 2899 -8141 427 12086 1425 -11199
813 -11199 -1277 9430 -16 -7229 4161 9284 -4266 -9169 3790 7707 -3578 -4236 6438 3996
827 3996 -7125 -3167 7678 2517 -6699 443 8368 -968 -8675 1690 8802 -1095 -6150 4227
$$ packed form
730A964J1897j4569q602J4155M203j6891k593J8639L222j6340j794J2244l852
743A683j1773Q854J4141r173j3659Q157Q824j0912m754J6350N168j8990o999J6873
757C790N016j4644K48J6484k752j8816J552J6653j928j2029O235J0305j0624j1302
771a1812J1171J0575r759o098J1060J501j5494p64J7889J888j5555N6J3107n090
785B675j4075P925J6518p002j5069O284J0758q777p942J2156P890j2576p042J1370
799C093L476j1423K77J3444k110j4260K709J2600m907j1040Q568J1659j0661j2624
813a1199R922J0707r446p213J1390N123j3550m903J2959L917j1285o58J0674k442
827C996j1121L958J0845n161r216P142P925r336p707J0365P112r897n055J0377
$$ plain form
841 4227 6481 -5698 -7127 5752 7535 -3774 -4169 5029 2294 -6809 -1872 7594 2275 -6213 -685
856 -685 5356 -1662 -6017 2818 6589 -2743 -5690 3134 3856 -5157 -3589 6582 4181 -6402 -4163
871 -4163 5201 1916 -5926 -627 6910 675 -6941 -1205 4795 -848 -4411 2428 4721 -3124 -5151
886 -5151 2056 3007 -2980 -1327 4334 425 -6234 -1300 5974 1226 -4965 -75 4587 -1415 -5268
901 -5268 1769 5601 -1184 -4151 2223 3866 -2811 -3493 3106 3662 -1731 -1243 2792 425 -3129 911
917 911 4752 178 -3601 723 3545 -948 -2254 3437 3908 -2825 -3533 3193 4225 -1963 -2430 3194
933 3194 2956 -2217 -1739 2850 2190 -1231 -83 2347 448 -1144 1226 2102 -625 -664 2483 1473 -1968
950 -1968 -110 4099 1747 -3094 -989 3756 1861 -2627 -713 3452 1754 -1815 -345 2415 840
$$ packed form
841D227K254j2179j429J2879J783j1309l95R198k735r103M937R466n319q488N528
856f85O041p018m355Q835L771r332k947Q824P22r013J568J0171k401j0583K239
871d163R364l285p842N299P537o235p616N736O000n643l563O839K293p845k027
886e151P207R51n987J653N661l909o659M934P274m748o191M890M662o002l853
901e268P037L832o785k967O374J643o677o82O599N56n393M88M035k367l554M040
917I11L841m574l779M324K822m493j306N691M71o733p08O726J032o188m67N624
933C194k38n173M78M589o60l421J148K430j899j592K370Q76k727l9L147j010l441
950a968J858M209k352m841K105M745j895m488J914M165j698l569J470K760j575
$$ plain form
965 840 -1333 150 1559 108 -443 793 689 -395 766 1649 -689 -2094 875 3050 88 -2711
981 -2711 -299 2334 331 -1816 259 2015 -252 -2020 -84 1772 180 -1739 -1046 547 844 208
997 208 -669 -1118 -124 1341 416 -1814 -1633 595 772 -1127 -840 1318 869 -2056 -2040 1066 1667 -1084
1015 -1084 -2540 -453 1226 150 -1271 -1032 128 414 -314 -1077 -910 47 402 -645 -1323 -61 886
1032 886 -457 -1656 -115 1677 479 -1805 -1421 671 842 -746 -1152 253 925 186 -692 -349 486
1049 486 503 -447 -966 -71 1014 552 -580 -162 1365 1135 -825 -1205 785 1650 69 -1029 203 1539
1067 1539 873 -434 -79 982 875 48 -68 696 917 329 -183 189 1248 1355 126 -718 429 1817
1085 1817 1043 -755 -588 1080 1346 49 -129 1051 1352 117 -393 587 1016 249 -396 254 1067 946
$$ packed form
965H40k173J483J409j451n51J236j04j084J161Q83k338j405K969K175k962k799
981b711K412K633k003k147K075J756k267j768J936J856j592j919O93J593K97o36
997B08q77m49R94J465r25k230J81K228J77j899K87K158m49k925J6L106O01k751
1015a084j456K087J679j076j421K39J160K86p28p63J67R57L55j047o78J262R47
1032H86j343j199J541J792j198k284L84K092J71j588m06J405O72p39q78L43Q35
1049D86J7r50n19Q95J085m62j132M18J527k30j960l80J990Q65j581j098J232J336
1067A539o66j307L55J061j07q27j16P64K21n88n12L72J059J07j229q44J147J388
1085A817p74j798J67J668K66j297j78J180L01j235n10R80M29p67o45O50Q13j21
$$ plain form
1103 946 358 -144 23 811 1113 142 -811 -28 1303 804 -546 -241 1003 591 -805 -308 1038 579
1121 579 -921 -612 697 413 -793 -739 218 174 -327 -206 -172 -552 -526 41 -307 -1180 -636 281 -262 -1134
1141 -1134 -355 522 -665 -1819 -510 715 -663 -1919 -588 764 -374 -1496 -523 114 -887 -1343
1157 -1343 -131 188 -1077 -1125 -34 -182 -1205 -569 281 -661 -1570 -41 916 -761 -1855 -35 999
1174 999 -854 -1515 440 993 -1064 -1152 997 973 -1246 -1110 1127 886 -935 -253 1455 455 -945
1191 -945 341 1524 -141 -968 1127 1829 -286 -609 1549 1505 -800 -183 2420 1489 -1285 10 2954
1208 2954 1561 -1133 311 2765 1104 -1096 974 2872 906 -545 1472 2354 125 -139 2154
1223 2154 1938 -474 427 2872 1379 -1130 758 3320 852 -1741 1029 3637 728 -1794 1184
$$ packed form
1103I46n88n02J67P88L02r71r53P83J331m99j350L05J244m12j396M97J346m59
1121E79j500L09J309k84j206N4R57m4n01J21L4l80K6N67l48q73N44R17n43q72
1141a134P79Q77j187j154J309J225j378j256J331J352j138j122R73O37j001m56
1157a343J212L19j265m8J091j48j023O36Q50r42r09J529R57j677j094J820J034
1174I99j853o61J955N53k057q8K149k4k219J36K237k41j821O82J708j000j400
1191i45J286J183j665q27K095P02k115l23K158m4k305O17K603r31k774J295K944
1208B954j393k694J444K454j661k200K070J898j966j451K017Q82k229k64K293
1223B154k16k412R01K445j493k509J888K562k468k593K770K608k909k522K978
$$ plain form
1238 1184 3255 122 -1721 1386 2740 -264 -1058 1714 1808 -1075 -494 2184 903 -1740 108 2321
1254 2321 -159 -2032 979 2544 -1325 -2983 1158 2596 -1671 -2787 1545 2110 -2488 -2936 1341
1269 1341 1429 -2412 -2080 1209 86 -2880 -1144 1431 -959 -2986 -216 818 -2602 -2971 1315 1437
1285 1437 -3337 -3453 1278 802 -3896 -2716 2385 1093 -4080 -2948 1485 132 -3364 -1274 1681
1300 1681 -959 -3539 -680 1132 -1670 -2169 1122 612 -3530 -2577 2115 1119 -3259 -1300 2783 -82
1316 -82 -4582 -1247 3766 939 -3355 -508 2740 -647 -3198 840 3245 -448 -2043 1319 1608 -1815
1332 -1815 -532 3451 1736 -2419 -298 3392 511 -2539 1658 4980 246 -3403 1215 4486 -29
1347 -29 -2280 2796 4582 -627 -2241 2424 3338 -473 -70 3612 1952 -1899 350 3959 1273 -1502
$$ packed form
1238A184K071l133j843L107J354l004p94K772R4k883N81K678j281k643J848K213
1254B321k480j873L011J565l869j658M141J438m267j116M332N65m598m48M277
1269A341Q8l841L32L289j123k966J736K575k390k027K770J034l420l69M286J22
1285A437m774j16M731m76m698J180N101j292n173J132M433j353l496K090K955
1300A681k640k580K859J812k802m99L291n10m142R53M692r96m378J959M083k865
1316h2m500L335N013k827m294K847L248l387k551M038K405l693j595L362K89l423
1332a815J283L983j715m155K121L690k881l050M197L322m734l649M618L271m515
1347b9k251N076J786n209j614M665R14l811M03L682j660l851K249L609k686k775
$$ plain form
1363 -1502 1996 4075 -661 -2633 2747 4677 -776 -2218 3198 3741 -2117 -2489 3326 3629 -1378 -1244
1379 -1244 2939 1325 -2631 -340 3451 837 -2344 566 2504 -1342 -2600 2106 3070 -2238 -2963
1394 -2963 2045 1907 -3301 -2348 3265 2007 -3830 -2738 2168 434 -3564 -823 2857 -454 -4291
1409 -4291 -1195 1596 -1520 -2871 1018 1274 -3367 -3559 1166 855 -3465 -2075 2309 -214 -5104 -2346
1425 -2346 2580 82 -3972 -944 2219 -1950 -4990 -527 2763 -938 -3049 144 661 -3277 -2691
1440 -2691 2059 1587 -2805 -1980 1575 -404 -3547 -303 3444 -60 -3765 -551 2382 -1015 -2799
1455 -2799 1627 3310 -1456 -3270 836 1985 -1182 -753 3007 1621 -2551 -1379 2568 1360 -1412
1470 -1412 995 3253 -175 -2720 985 3618 437 -1233 2106 2448 -1628 -1621 3160 3460 -666 -870
$$ packed form
1363a502L498K079m736j972N380J930n453j442N416N43n858l72N815L03n007J34
1379a244M183j614l956K291L791k614l181K910J938l846j258M706R64n308p25
1394b963N008j38n208R53N613j258n837J092M906j734l998K741L680l311l837
1409d291L096K791l116j351L889K56m641j92M725l11m320J390M384k523m890K758
1425b346M926k498m054L028L163m169l040M463L290l701k111L193N17l938N86
1440b691M750m72m392Q25L555j979l143L244L747l504l705L214K933l397j784
1455b799M426J683m766j814M106J149l167M29L760j386m172J172L947j208k772
1470a412K407K258l428k545L705K633l181j670L339L42m076PM781L00m126k04
$$ plain form
1486 -870 2405 1363 -1770 258 3841 1784 -1601 185 2580 155 -1483 1711 3245 -194 -1610
1501 -1610 1381 1890 -1037 -532 2840 1815 -2052 -1269 2159 1137 -1497 329 2586 -173 -2846 -237
1517 -237 2287 -30 -1730 733 1434 -1639 -2185 938 1456 -1463 -1532 948 109 -2387 -1121 1432 -41
1534 -41 -2320 -746 843 -1276 -2558 186 1491 -1328 -2645 -162 508 -2039 -2054 838 752 -2182 -2132
1551 -2132 318 -60 -2027 -1096 629 -614 -2137 -709 461 -1026 -1615 345 483 -1821 -1799 758
1567 758 839 -1616 -1317 1023 429 -1947 -1087 1314 466 -1362 -536 1149 166 -1160 -37 970 -97
1584 -97 -399 827 719 -658 -124 1524 828 -852 -20 1683 623 -960 551 2181 549 -1163 360
1601 360 2077 606 -608 778 1789 548 -232 884 1181 317 340 1078 662 31 833 1426 298 -417
$$ packed form
1486h70L275j042l133K028L583k057l385J786K395k425j638L194J534l439j416
1501a610K991N09k927N05L372j025l867P83L428j022k634J826K257k759k673K609
1517b37K524k317j700K463P01l073n46L123N18k919o9K480q39k496J266K553j473
1534d1k279J574J589k119j282K744J305k819j317K483O70k547j5K892q6k934N0
1551b132K450l78j967R31J725j243j523J428J170j487n89J960J38k304K2K557
1567G58Q1k455K99K340n94k376Q60K401q48j828Q26J685r83j326J123J007j067
1584i7l02J226j08j377N34J648o96j680Q32J703j060j583J511J630j632j712J523
1601C60J717j471j214J386J011j241p80J116K97q64K3P38m16o31Q02N93j128p15
$$ plain form
1619 -417 1121 1676 -116 -842 1098 1912 52 -848 777 1347 -221 -817 712 1223 5 -474 238
1636 238 421 -43 117 191 -484 -416 476 363 -793 -632 686 375 -1291 -1121 605 485 -1212 -1175 395
1655 395 401 -1136 -1382 -111 6 -849 -904 -379 -444 -855 -596 -615 -867 -581 -207 -796 -1443 -632 327 -453 -1565
1676 -1565 -1005 214 -307 -1429 -887 412 -159 -1239 -849 104 -168 -918 -777 -108 -31 -254 -411 -420 -323 122
1696 122 162 -471 -593 140 529 -149 -518 333 729 -109 -687 223 1068 489 -267 182 833 506 41 282
1716 282 708 661 501 415 530 642 847 656 233 328 987 1024 357 295 1011 1231 489 136 748 1081 546 349
1738 349 832 1031 545 254 553 784 614 485 509 509 507 622 525 214 324 586 457 25 132 591 518 -82
1760 -82 -76 309 266 -231 -191 246 217 -199 -229 -9 -186 -398 -283 -81 -271 -434 -222 -335 -610 -486 -227 -377
$$ packed form
1619d17J538N55j792p26J940Q14j860r00J625N70j568n96J529N11j218m79P12
1636B38J83m64J60P4o75O8Q92j13j156J61J318l11j666J70J726j20j697L7J570
1655C95Oj537k46J271J17q55n5N25o5m11K59j9k52K86L74n89o47Q11R59p80j112
1676a565N60J219n21j122N42J299n71j080L90R53k72p50J41O69P7k23j57rR7M45
1696A22M0o33j22P33L89o78l69Q51L96q38n78R10Q45n79p56M49O51l27m65K41
1716B82M26m7j60q6J15J12K05j91m23R5O59L7o67o2P16K20p42l53O12L33n35j97
1738C49M83J99m86k91K99K31j70j29K4%kJ15r7l11J10K62j29m32J07M59p3o00
1760h2OL85m3m97M0M37k9m16l0K20j77k12J15K02j90j63K12j13k75J24K59j50
$$ plain form
1782 -377 -849 -748 -282 -361 -782 -717 -405 -613 -963 -657 -509 -716 -829 -659 -582 -855 -861 -567 -629 -990 -798 -404
1804 -404 -559 -961 -761 -365 -621 -997 -788 -344 -559 -840 -533 -301 -620 -688 -354 -329 -735 -520 35 -181 -842
1825 -842 -428 230 -58 -713 -363 311 -84 -569 -58 595 60 -465 52 377 28 -105 424 426 24 183 711
1846 711 417 -193 303 1061 463 -131 597 1127 337 -85 824 1148 259 -187 730 1122 356 208 996 911
1866 911 -93 169 1053 740 153 628 1165 251 -318 801 1334 130 -291 928 1190 -172 -276 1001
1884 1001 1162 -201 -312 869 725 -405 35 1039 497 -484 50 685 -153 -521 698 978 -464 -847
1902 -847 515 635 -887 -733 940 643 -1223 -988 737 427 -1060 -523 642 -281 -1360 -254 712
1919 712 -384 -1014 198 410 -1202 -1327 492 483 -1234 -1043 748 65 -1906 -993 1012 246 -1663 -869
$$ packed form
1782c77m72J01M66p9m21O5L12k08l50L06J48k07j13J70P7k73oK94o2l61J92L94
1804d04j55m02K00L96k56l76K09M44k15k81L07K32l19o8L34K5m06K15N55k16o61
1825h42M14O58k88o55L50O74l95m85N11O53n35n25N17L25l49j33N29Km02J59N28
1846G11k94o10M96P58n98n94P28N30p90m22R09L24q89m46R17L92p66j48P88q5
1866I11j004K62Q84l13n87M75N37r14n69J119N33j204m21J219K62j362j04J277
1884A001J61j363j11J181j44j130M40J004n42r81N34O35q38l68J219K80j442l83
1902h47J362J20j522J54J673k97j866K35J725l10j487N37J165r23j079J106R66
1919G12j096o30J212K12j612j25J819rj717J91J791o83j971R13K005p66j909P94
$$ plain form
1937 -869 645 -359 -1461 -151 930 -630 -1445 -32 398 -992 -823 842 283 -1530 -923 900
1953 900 49 -1550 -215 1571 -96 -1896 -232 1528 -77 -1407 332 1445 -555 -1299 612 1279
1969 1279 -527 -582 980 449 -1167 -267 1565 477 -1091 311 1689 -223 -1543 751 2115 -103
1985 -103 -1467 791 1700 -527 -1159 1165 1681 -496 -780 1144 897 -690 132 1486 307 -1127 414
2002 414 1602 -243 -979 1152 1735 -847 -1408 1268 1697 -878 -1036 1615 1313 -1213 -901 1498 974
2019 974 -1094 -318 1338 217 -1139 388 1464 -321 -1089 822 1042 -1185 -1004 1512 1086 -1450
2035 -1450 -940 1521 622 -1761 -641 1859 521 -1895 -525 1468 26 -1561 54 1179 -584
2050 -584 -1390 439 728 -1044 -787 1052 313 -1810 -687 1445 121 -1814 -217 1683 -338 -2234
$$ packed form
1937h69J514j004j102J310J081j560q15J413M30j390J69J665n59j813O07J823
1953I00q51j599J335J786j667j800J664J760j605j330J739J113k000p44J911O67
1969A279j806n5J562n31j616R00J832j088j568J402J378j912j320K294J364k218
1985a03j364K258R09k227o32K324N16k177k84J924k47j587Q22J354j179j434J541
2002D14J188j845p36K131N83k582n61K676M29k575j58K651l02k526L12K399n24
2019I74k068P76J656j121j356J527J076j785p68J911K20k227J81K516m26k536
2035a450N10K461q99k383J120K500j338k416J370J993j442j587J615J125j763
2050e84q06J829K89j772K57J839p39k123J123K132j324j935J597J900k021j896
$$ plain form
2066 -2234 -15 1804 -276 -1823 316 1340 -817 -1535 737 1091 -995 -941 888 368 -1386 -297
2082 -297 1496 88 -1617 -131 1321 -494 -1545 695 1634 -786 -1746 616 1239 -977 -1137 1220
2098 1220 1058 -1304 -970 1203 641 -1124 -244 1359 -53 -1532 184 1458 -269 -1189 654 1130
2114 1130 -1096 -1321 1059 1315 -950 -851 1187 574 -1516 -625 1630 610 -1423 -362 1182 -116
2130 -116 -1228 388 1409 -423 -1377 447 1018 -804 -734 1185 935 -1255 -959 1066 515 -1103 -143
2147 -143 1476 84 -1478 -94 1239 -175 -1081 550 1129 -825 -1308 711 1162 -740 -830 889 477
2164 477 -1371 -659 1204 560 -1001 -298 846 -169 -1128 280 1118 -278 -962 407 637 -855 -806
2181 -806 1078 893 -1008 -706 922 490 -1070 -246 1281 305 -1310 -245 994 117 -733 315 898
$$ packed form
2066b234K219J819k080j547K139J024k157p18K272L54k086N4J829n20j754J089
2082b97J793j408j705J486J452j815j051K240R39k420r60K362O23k216j60K357
2098A220j62k362L34K173n62j765Q80J603j412j479J716J274j727r20J843M76
2114A130k226k25K380K56k265R9K038o13k090Q91K255j020k033J061J544j298
2130a16j112J616J021j832r54J824N71j822P0J919k50k190K96K025n51j618R60
2147a43J619j392j562J384J333j414r06J631N79j954m83K019M51j902r0J719m12
2164D77j848P12J863o44j561P03J144j015r59J408Q38j396o84J369K30j492M9
2181h06J884j85j901L02J628m32j560Q24J527r76j615J065J239q77q50J048N83
$$ plain form
2198 898 -469 -837 447 793 -518 -339 917 333 -1009 -331 1155 356 -880 -14 1130 53 -1058
2215 -1058 157 1262 -1 -880 249 912 -257 -580 584 766 -263 -331 522 157 -621 102 966 45
2233 45 -795 147 829 -257 -862 455 1090 -386 -951 383 828 -468 -673 465 565 -520 -562 343
2251 343 352 -411 -139 379 -281 -678 72 535 -415 -659 463 545 -767 -863 445 497 -710 -728 313 334 -654
2272 -654 -561 413 166 -570 -414 154 -144 -452 31 200 -472 -522 212 46 -690 -400 568 223 -693 -485 514
2293 514 207 -701 -437 463 173 -620 -355 355 71 -440 -168 126 -175 -227 127 26 -256 -72 328 -65
2313 -65 -651 -55 591 88 -635 -69 552 42 -627 -58 552 148 -395 -40 453 189 -95 76 157 -41 95
2334 95 214 53 -110 369 511 -14 -263 255 595 -39 -282 292 688 25 -340 114 526 121 -198 12
$$ packed form
2198H98j367l68J284L46j311J79J256n84j342O78J486p99j236Q66J144j077j111
2215a058J215J105j263q79J129O63j169l23J164J82j029o8Q53l65p78P23Q64r21
2233D5q40R42O82j086o05J317O35j476n65J334M45j296k05J138J00j085m2R05
2251C43Rp63K72N18o60l97P50M63r50k44J122Q2j312r6J308N2j207j8J041K1r88
2272f54R3R74k47p36J56N68k98l08M83J69o72n0P34j66p36K90R68l45r16K08R99
2293E14l07r08K64R00k90p93K65P10k84n11K72K94l01n2L54j01k82J84M00l93
2313f5n86N96O46n03p23N66O21n10o69N69O10m04n43L55M93k64k84J71Q1j98J36
2334I5J19j61j63M79J42n25k49N18L40o34k43N74L96o63l65M54M12m05l19K10
$$ plain form
2354 12 335 158 -6 67 132 163 122 16 -134 53 324 140 -275 -149 358 250 -377 -309 213 358 -174 -380
2376 -380 148 249 -151 -343 -58 136 -136 -249 -121 2 29 -101 -246 -328 -121 103 -150 -435 -159 204 -85
2397 -85 -473 -313 162 73 -429 -352 147 132 -249 -396 -98 49 -126 -247 -155 0 20 -50 -250 -199 0 -15 -329
2420 -329 -264 34 195 -193 -431 -91 204 -59 -412 -90 157 -5 -170 -67 98 45 -163 -33 30 50 24 38
2442 38 57 4 153 101 -85 33 212 248 -10 36 340 294 -25 -57 306 368 62 40 279 379 88 41 274 276
2466 276 97 71 265 329 161 148 207 79 163 279 234 52 156 341 268 -95 80 417 148 -153 39 336
2488 336 58 -148 83 371 27 -260 2 223 21 -221 14 148 -92 -161 -26 -39 -189 -98 82 -107 -262
2509 -262 -65 48 -188 -406 69 137 -429 -464 147 349 -341 -568 -21 198 -293 -496 -40 114 -177 -324 -127
$$ packed form
2354A2L23j77j64P3O5L1m1j06j50J87K71j84m15J26N07j08o27O8N22J45n32k06
2376c80N28J01m00j92K85J94k72j13J28J23K7j30j45q2K07K24k53k85K76L63k89
2397h5l88J60M75q9n02P7M99j5l81j47K98J47j75j21R2J55K0p0k00N1J99j5l14
2420c29O5K98J61l88k38L40K95k63l53L22K47j62j65J03J65n3k08J30O3K0k6J4
2442C8J9n3J49n2j86J18J79L6k58M6L04m6l19l2L63O2l06k2K39J00k91m7K33K
2466B76j79k6J94O4j68j3N9j28Q4J16m5j82J04J85p3l63J75L37k69l01J92K97
2488C36k78k06K31K88l44k87K62K21k02k42K35J34k40o9J35j3j50R1J80j89j55
2509b62J97J13k36k18M75O8n66l5O11K02o90k27N47K19m91k03M56J54k91j47J97
$$ plain form
2530 -127 -114 -276 -150 -110 -333 -220 87 13 -509 -356 300 35 -645 -476 379 181 -592 -423 329 267 -648
2551 -648 -578 287 240 -312 -301 119 -21 -280 -55 71 -122 -115 232 60 -374 -17 557 53 -531 -26 727 82
2573 82 -613 0 845 383 -554 -51 648 289 -315 136 590 230 -37 171 237 16 235 518 105 -291 389
2594 389 802 15 -419 414 884 -140 -640 424 1071 37 -556 333 795 -45 -573 202 526 18 -100
2613 -100 252 43 -263 117 379 -171 -369 319 430 -523 -565 519 541 -583 -715 413 531 -621 -692 431
2633 431 434 -630 -596 173 119 -478 -254 217 -270 -534 -8 93 -575 -488 351 59 -862 -559 522 148 -998
2654 -998 -556 561 94 -1102 -501 634 126 -870 -443 366 -176 -650 -97 299 -450 -525 213 39 -672
2673 -672 -331 522 30 -871 -296 649 -88 -929 -83 869 -30 -952 -51 712 -131 -652 183 624 -303 -466
$$ packed form
2530a27J3j62J26M0k23J13L07p4n22J53O56k65o80J69Q55j98p73J69P52o2r15
2551f48P0Q65m7n52J1M20j40k59K25J26j93PL47j72m34L57N74n04n84N05P53o45
2573H2o95O13Q45m62r37N03O99l59o04M51M54l60k67K08O6k21K19K83m13l96O80
2594C89M13p87m34Q33M70j024n00J064O47j034n93Q89M62q40n28P75L24n08j18
2613a00L52k09l06L80K62n50j98O88J11r53m2J084K2j124j32J128J18j152p1J123
2633D31Lj064L4P69n4n97K24M71m87k64N26J01o68Q7Q39k92r21L03J081l74j146
2654i98M42J117m67j196O01J135n08r96M27Q09n42m74N53L96p49p5P38j74p11
2673f72L41Q53m92r01N75R45p37q41Q46R52q99r22R01P63q43n21Q35M41r27j63
$$ plain form
2693 -466 346 366 -416 -109 651 169 -650 113 819 98 -594 395 954 -63 -647 506 986 -61 -508
2712 -508 592 793 -268 -291 738 747 -216 -55 773 289 -369 226 880 128 -399 457 829 -202 -416 658
2732 658 810 -364 -413 738 625 -394 -212 832 442 -625 -187 759 190 -490 150 679 -198 -606 272
2751 272 660 -344 -581 587 483 -647 -529 505 347 -684 -393 592 -2 -889 -276 571 -103 -842
2769 -842 -108 372 -534 -781 182 398 -689 -755 217 130 -951 -553 467 104 -902 -394 411 -176 -955
2788 -955 -215 512 -407 -955 31 410 -564 -765 304 334 -833 -766 366 249 -790 -402 536 15 -923
2807 -923 -320 549 -81 -811 33 569 -287 -705 247 519 -472 -542 455 482 -541 -374 652 330 -574 -134
2827 -134 831 272 -544 52 833 102 -502 274 808 -32 -378 508 663 -120 -162 602 513 -322 15 797 353
$$ packed form
2693d66Q12K0p82L07P60m82q19P63P06p21o92R89N59j017n84J153M80j047m47
2712e08J100K01j061k3J029Rr63J61Q28m84o58N95O54p52n27Q56L72j031k14J074
2732F58J52j174m9J151j13j019J82J044l90j067M38R46n69o80O40N29q77m08Q78
2751B72L88j004k37J168j04j130J18J034j58j031K91R85n94q87O13Q47o74p39
2769h42P34M80r06k47R63K16j087o6R72q7j081L98J020l63j006N08Q05n87p79
2788i55P40P27r19n48R86L79r74k01J069L0j167O7J132j17j039L88R38n21r38
2807i23O03Q69o30p30Q44N36q56m18R52K72r91p0R97K7j023J67J026l22r04M40
2827a34R65n59q16N96P81p31o04P76N34q40l46Q86J55p83m2P64q9q35L37P82m44
$$ plain form
2848 353 -447 225 1003 267 -436 279 960 122 -396 476 896 61 -296 513 718 -22 -114 500 460 -107 115
2869 115 579 116 -313 257 624 -82 -508 366 714 -259 -591 304 622 -348 -634 262 529 -305 -491 243
2889 243 223 -395 -298 179 28 -391 -4 152 -376 -417 159 143 -552 -576 273 262 -605 -531 326 154 -636 -607 244
2912 244 77 -584 -548 100 -17 -499 -327 -39 -280 -366 -119 -158 -439 -307 149 -203 -734 -284 314 -57 -820
2933 -820 -350 353 21 -614 -280 354 1 -570 -317 225 22 -211 -166 31 -122 -92 79 -130 -215 185 299
2954 299 -168 -391 226 511 -92 -455 177 597 30 -387 248 647 162 -244 138 498 196 -6 272 340
2974 340 231 319 334 78 119 496 358 -45 43 552 526 -114 -167 544 539 -41 -101 335 480 89 -79 262 373
2997 373 82 71 117 248 164 127 67 -3 153 329 54 -231 56 435 149 -305 -133 391 150 -281 -273 263 173
$$ packed form
2848C53q00O72P78p36p03P15O81q38n18Q72M20q35l57Q09K05p40r2O14m0n67K22
2869A15M64m63m29N70L67p06m26Q74L48r73l32Q95L18r70k86Q96K67q34j86P34
2889B43k0o18R7M77j51m19L87J56n28m1N76j6o95k4Q49j1q67P4Q57j72p90K9Q51
2912B44j67o61L6O48j17m82J72K88k41q6K47l9k81J32M56l52n31M50N98l71p63
2933h20M70P03l32o35L34O34l53n71K53N42k03k33M5J97j53L0J71k09q5M00J14
2954B99m67k23O17K85o03l63O32M20n67m17O35L99m85m06L82L60l02k02K78O8
2974C40j09Q8J5k56M1L77j38m03Q8N09k6o40n3P11nn80o0M36J45l91j68L41J11
2997C73k91j1M6J31q4l7o0p0J56J76k75k85K87L79k86m54J72N24k41m31QN36r0
$$ plain form
3020 173 -262 -264 126 152 -198 -257 -64 -22 -49 -32 -108 -191 -103 14 -230 -388 -137 75 -169 -456 -125 167 -135
3043 -135 -415 -187 69 -103 -340 -242 -73 -181 -277 -216 -73 -151 -184 -207 -193 -229 -156 -157 -257 -293 -106 -1 -269 -338
3067 -338 -81 26 -162 -318 -23 99 -101 -245 -8 126 -19 -151 47 77 -6 -59 82 103 51 160 175 82
3089 82 92 204 209 38 126 290 268 87 128 297 302 109 212 278 243 134 193 342 241 98 153 291 229 103 268
3114 268 281 159 121 231 233 89 95 280 237 81 157 249 146 60 195 249 62 -12 177 265 39 -45 154 218 51
3139 51 -135 66 184 25 -34 33 56 60 -17 -7 -71 -78 -2 46 -113 -149 67 27 -258 -194 55 15 -325 -290 -40 68
3165 68 -237 -288 -79 -30 -142 -250 -115 -129 -206 -183 -106 -217 -186 -48 -162 -337 -220 -10 -130 -355 -218 99 -138
3188 -138 -409 -245 137 29 -327 -276 23 1 -255 -163 -51 -1 -111 -84 -98 -91 -9 60 -77 -180 155 215 -84 -193
$$ packed form
3020A73m35kL90K6l50n9J93M2k7J7p6q3Q8J17k44j58K51K12k44k87L31K92l02
3043a35k80K28K56j72k37R8J69j08r6O1J43p8l3k3J4l6P3jj00l6J87J05k68o9
3067c38K57J07j88j56K95J22k00j44K37J34j45j32J98L0q3n3J41K1n2J09J5r3
3089H2J0J12Nj71Q8J64k2j81M1J69Nj93J03O6l5j09N9J49j01j43N5J38o2j26J65
3114B68J3j22l8J10Kj44OJ85m3j56P6R2j03q6J35N4j87p4J89Q8k26q4J99O4j67
3139E1j86K01J18j59n9O7K3Mp7J0o4pP6M8j59l6K16m0k85O4K49m0l40L5K50J08
3165F8l05n1K09M9j12j08J35j4p7K3P7j11L1J38j14j75J17K10j20k25J37L17k37
3188a38k71J64L82j08l56N1K99k2k56R2J12N0j10K7j4PQ2O9j37j03L35O0k99j09
$$ plain form
3212 -193 135 434 6 -299 18 417 157 -185 51 369 226 -35 19 216 187 133 132 88 100 295 300 -10 -50
3235 -50 384 449 -16 -151 371 421 -11 -208 306 501 -21 -203 201 442 99 -57 136 235 112 135 223 36
3257 36 -5 280 195 -142 -13 349 249 -284 -188 454 294 -350 -308 303 289 -251 -282 228 249 -211 -229 86 15
3280 15 -194 -20 -13 -133 -105 165 -19 -372 -153 290 -48 -571 -316 328 -6 -637 -279 391 10 -609 -316
3301 -316 180 5 -452 -243 58 -135 -309 -130 -98 -370 -181 133 -148 -439 -73 270 -199 -625 -56 394
3321 394 -206 -581 -18 395 -82 -563 -40 347 -123 -361 32 246 -72 -162 171 50 -224 31 366 -15
3341 -15 -216 256 433 -161 -282 277 507 -155 -263 355 531 -161 -257 420 487 -100 -166 332 350 -77 61 347
3363 347 123 -34 234 374 7 -78 456 408 -189 -77 525 345 -187 -164 523 304 -319 -86 490 291 -280
$$ packed form
3212a93L28K99m28l05L17L99k60l42K36L18j43k61N4J97k9n4jm4J2J95Nl10m0
3235e0M34O5m65j35N22N0m32j97N14J95n22j82M04K41l43j56J93R9j23K3Q8j87
3257C6m1K85q5l37J29L62j00n33R6O42j60o44M2O11j4n40l1N10K1m60j8L15p1
3280A5k09J74Pj20K8K70j84l53K19M43l38n23K55O44l34o31L58O70l81o19K93
3301c16M96j75m57K09L01j93j74J79L2k72J89L14k81k91L66L43m69m26N69M50
3321C94o00l75N63M13m77m81N23L87m70k38L93K14l18r0L33j21k74K55L35l81
3341a5k01M72J77n94j21N59K30o62j08O18J76o92r6O77O7n87o6M98J8m27J38K86
3363C47k24j57K68J40l67q5N34m8n97J12O02j80n32K3O87k19o23K33N76j99n71
$$ plain form
3384 -280 -66 403 113 -250 122 290 -64 -198 233 235 -265 -157 301 152 -368 -146 330 -2 -398 -65 354
3405 354 -68 -541 -86 336 -213 -439 25 232 -290 -486 47 111 -398 -320 159 2 -494 -290 214 -48 -508
3426 -508 -127 159 -210 -495 -49 185 -352 -498 79 169 -420 -403 156 101 -393 -337 178 -58 -467 -167 210
3447 210 60 -415 -110 286 -177 -380 52 203 -165 -201 201 181 -268 -271 321 135 -329 -50 482 136 -350
3468 -350 24 498 53 -333 97 446 43 -245 260 456 -48 -71 234 257 -85 62 450 106 -113 196 512
$$ packed form
3384b80K14M69k90l63L72J68l54j34M31Kn00J08M58j49n20K22M76l32l96L33M19
3405C54m22m73M55M22n49k26M64K07n22j96N33O4n09P8M79j57m96K04N04k62m60
3426e08L81K86l69k85M46K34n37j46N77R0n89J7N59n5m94N6N15k36m09L00L77
3447B10j50m75L05L96m63k03M32J51l68l6M02k0m49lN92j86m64K79N32l46m86
3468c50L74M74m45l86M30L49m03k88N05J96n04k3L05K3l42J47L88l44k19L09L16
$$ [...]
8191a0
##END NTUPLES=NMR FID
##END=
