##TITLE=1H_PhPA1609
 CDCl3, 8 sc, 
 17.9.2019
##JCAMPDX= 6.0         $$ Bruker NMR JCAMP-DX V2.0
##DATA TYPE= NMR FID
##DATA CLASS= NTUPLES
##ORIGIN= UXNMR, Bruker Analytische Messtechnik GmbH
##OWNER= root
$$ XWIN-NMR		Version 3.5
$$ Tue Sep 17 14:25:20 2019 Russian Standard Time (UT+4h)  she@DPX200
##.OBSERVE FREQUENCY= 200.1315
##.OBSERVE NUCLEUS= ^1H
##.DELAY= (6, 6)
##.ACQUISITION MODE= SIMULTANEOUS
##.ACQUISITION SCHEME= undefined
##.AVERAGES= 8
##.DIGITISER RES= 18
##SPECTROMETER/DATA SYSTEM= spect
##.PULSE SEQUENCE= zg30
##.SOLVENT NAME= CDCl3
##.SHIFT REFERENCE= (INTERNAL, CDCl3, 0, 15.7039)
##AUDIT TRAIL= $$ (NUMBER, WHEN, WHO, WHERE, WHAT)
$$ ##TITLE= Audit trail, XWIN-NMR		Version 3.5
$$ ##JCAMPDX= 5.01
$$ ##ORIGIN= Bruker BioSpin GmbH
$$ ##OWNER= she
$$ F:/spectra/data/she/nmr/H-F/1/audita.txt
$$ ##AUDIT TRAIL=  $$ (NUMBER, WHEN, WHO, WHERE, WHAT)
(   1,<2019-09-17 14:24:25.87 +0400>,<she>,<DPX200>,
      <created by zg, POWCHK disabled, PULCHK disabled
       configuration hash MD5:
       00 E9 B6 7A A2 85 ED C7 34 08 36 98 17 FE 4E 26
       data hash MD5: 16K
       AE FF 7E 3F 97 BC AA 36 45 94 82 B5 71 84 BD 92>)
$$ ##END=
$$ 
$$ hash MD5
$$ 01 F9 14 38 8E 9D 85 4E E3 08 D8 7D 01 96 EB 00
##$RELAX= 
##$RELAX= 
##$RELAX= 
##$RELAX= 
##$RELAX= 
##$RELAX= 
$$ Bruker specific parameters
$$ --------------------------
##$DU= <F:/spectra>
##$EXPNO= 1
##$NAME= <H-F>
##$PROCNO= 1
##$TYPE= <nmr>
##$USER= <she>
##$AMP= (0..31)
100 100 100 100 100 100 100 100 100 100 100 100 100 100 100 100 100 100 
100 100 100 100 100 100 100 100 100 100 100 100 100 100 
##$AQSEQ= 0
##$AQ_mod= 1
##$AUNM= <au_zg>
##$AUTOPOS= <>
##$BF1= 200.13
##$BF2= 200.13
##$BF3= 200.13
##$BF4= 200.13
##$BF5= 200.13
##$BF6= 200.13
##$BF7= 200.13
##$BF8= 200.13
##$BYTORDA= 1
##$CFDGTYP= 0
##$CFRGTYP= 5
##$CHEMSTR= <none>
##$CNST= (0..31)
1 1 145 1 1 1 1 1 1 1 1 1 1 1 1 1 1 1 1 1 1 1 1 1 1 1 1 1 1 1 1 1 
##$CPDPRG= <>
##$CPDPRG1= <>
##$CPDPRG2= <>
##$CPDPRG3= <>
##$CPDPRG4= <mlev>
##$CPDPRG5= <mlev>
##$CPDPRG6= <mlev>
##$CPDPRG7= <mlev>
##$CPDPRG8= <mlev>
##$CPDPRGB= <>
##$CPDPRGT= <>
##$D= (0..31)
0 1.2 0 0 0 0 0 0 0 0 0 0.03 0 0 0 0 0 0 0 0 0 0 0 0 0 0 0 0 0 0 0 0 
##$DATE= 1568715865
##$DBL= (0..7)
120 120 120 120 120 120 120 120 
##$DBP= (0..7)
150 150 150 150 150 150 150 150 
##$DBP07= 0
##$DBPNAM0= <>
##$DBPNAM1= <>
##$DBPNAM2= <>
##$DBPNAM3= <>
##$DBPNAM4= <>
##$DBPNAM5= <>
##$DBPNAM6= <>
##$DBPNAM7= <>
##$DBPOAL= (0..7)
0.5 0.5 0.5 0.5 0.5 0.5 0.5 0.5 
##$DBPOFFS= (0..7)
0 0 0 0 0 0 0 0 
##$DE= 6
##$DECBNUC= <off>
##$DECIM= 24
##$DECNUC= <off>
##$DECSTAT= 4
##$DIGMOD= 1
##$DIGTYP= 9
##$DL= (0..7)
0 120 120 120 120 120 120 120 
##$DP= (0..7)
150 150 150 150 150 150 150 150 
##$DP07= 0
##$DPNAME0= <>
##$DPNAME1= <>
##$DPNAME2= <>
##$DPNAME3= <>
##$DPNAME4= <>
##$DPNAME5= <>
##$DPNAME6= <>
##$DPNAME7= <>
##$DPOAL= (0..7)
0.5 0.5 0.5 0.5 0.5 0.5 0.5 0.5 
##$DPOFFS= (0..7)
0 0 0 0 0 0 0 0 
##$DQDMODE= 0
##$DR= 18
##$DS= 0
##$DSLIST= <SSSSSSSSSSSSSSS>
##$DSPFIRM= 0
$$ [...]
##$SUBNAM2= <"">
##$SUBNAM3= <"">
##$SUBNAM4= <"">
##$SUBNAM5= <"">
##$SUBNAM6= <"">
##$SUBNAM7= <"">
##$SUBNAM8= <"">
##$SUBNAM9= <"">
##$SW= 24.0689530833862
##$SWIBOX= (0..15)
0 0 2 0 0 0 0 0 0 0 0 0 0 0 0 0 
##$SW_h= 4816.95568400771
##$TD= 16384
##$TD0= 1
##$TE= 0
##$TE2= 300
##$TE3= 300
##$TEG= 300
##$TL= (0..7)
0 120 120 120 120 120 120 120 
##$TP= (0..7)
150 150 150 150 150 150 150 150 
##$TP07= 0
##$TPNAME0= <>
##$TPNAME1= <>
##$TPNAME2= <>
##$TPNAME3= <>
##$TPNAME4= <>
##$TPNAME5= <>
##$TPNAME6= <>
##$TPNAME7= <>
##$TPOAL= (0..7)
0.5 0.5 0.5 0.5 0.5 0.5 0.5 0.5 
##$TPOFFS= (0..7)
0 0 0 0 0 0 0 0 
##$TUNHIN= 0
##$TUNHOUT= 0
##$TUNXOUT= 0
##$USERA1= <user>
##$USERA2= <user>
##$USERA3= <user>
##$USERA4= <user>
##$USERA5= <user>
##$V9= 5
##$VALIST= <valist>
##$VCLIST= <CCCCCCCCCCCCCCC>
##$VD= 0
##$VDLIST= <DDDDDDDDDDDDDDD>
##$VPLIST= <PPPPPPPPPPPPPPP>
##$VTLIST= <TTTTTTTTTTTTTTT>
##$WBST= 1024
##$WBSW= 4
##$XGAIN= (0..3)
0 0 0 0 
##$XL= 0
##$YL= 0
##$YMAX_a= 195374
##$YMIN_a= -397742
##$ZGOPTNS= <>
##$ZL1= 120
##$ZL2= 120
##$ZL3= 120
##$ZL4= 120
##$ABSF1= 10
##$ABSF2= 0
##$ABSG= 5
##$ABSL= 3
##$ALPHA= 0
##$AQORDER= 0
##$ASSFAC= 0
##$ASSFACI= 0
##$ASSFACX= 0
##$ASSWID= 0
##$AUNMP= <proc_1d>
##$AZFE= 0.1
##$AZFW= 0.1
##$BCFW= 1
##$BC_mod= 2
##$BYTORDP= 1
##$COROFFS= 0
##$CY= 11.3945322036743
##$DATMOD= 1
##$DC= 2
##$DFILT= <>
##$DTYPP= 0
##$F1P= 20.1720416913024
##$F2P= 0.152960286110954
##$FCOR= 0.5
##$FTSIZE= 0
##$FT_mod= 4
##$GAMMA= 1
##$GB= 0.15
##$INTBC= 1
##$INTSCL= 1
##$ISEN= 128
##$LB= 0.24
##$LEV0= 0
##$LPBIN= 0
##$MAXI= 10000
##$MC2= 0
##$MEAN= 0
##$ME_mod= 0
##$MI= 1.114404
##$NCOEF= 0
##$NC_proc= 0
##$NLEV= 6
##$NOISF1= 3.799351
##$NOISF2= 2.8
##$NSP= 1
##$NTH_PI= 0
##$NZP= 0
##$OFFSET= 15.70392
##$PC= 1
##$PHC0= -9577.642
##$PHC1= 20.60096
##$PH_mod= 1
##$PKNL= yes
##$PPARMOD= 0
##$PSCAL= 0
##$PSIGN= 0
##$REVERSE= no
##$SF= 200.130013532006
##$SI= 16384
##$SIGF1= 3
##$SIGF2= 2
##$SINO= 400
##$SIOLD= 16384
##$SREGLST= <1H.CDCl3>
##$SSB= 0
##$STSI= 0
##$STSR= 0
##$SW_p= 3612.71676300578
##$SYMM= 0
##$S_DEV= 0
##$TDeff= 0
##$TDoff= 0
##$TI= <>
##$TILT= no
##$TM1= 0
##$TM2= 0
##$TOPLEV= 0
##$USERP1= <user>
##$USERP2= <user>
##$USERP3= <user>
##$USERP4= <user>
##$USERP5= <user>
##$WDW= 1
##$XDIM= 8192
##$YMAX_p= 0
##$YMIN_p= 0
$$ End of Bruker specific parameters
$$ ---------------------------------
##NTUPLES= NMR FID
##VAR_NAME=  TIME,          FID/REAL,        FID/IMAG
##SYMBOL=    X,             R,               I
##VAR_TYPE=  INDEPENDENT,   DEPENDENT,       DEPENDENT
##VAR_FORM=  AFFN,          ASDF,            ASDF
##VAR_DIM=   8192,          8192,            8192
##UNITS=     SECONDS,       ARBITRARY UNITS, ARBITRARY UNITS
##FACTOR=    0.0002076,     1,               1
##FIRST=     0,             0,               0
##LAST=      1.7004516,     0,               0
##MIN=       0,             -397742,         0
##MAX=       1.7004516,     195374,          0
$$ Real data points
##PAGE= N=1
##DATA TABLE= (X++(R..R)), XYDATA
$$ plain form
0 0 0 0 0 0 8 -8 8 -8 16 -16 24 -24 32 -40 48 -57 72 -88 104 -120 141 -162 191 -217 250 -288 329 -373
28 -373 424 -480 538 -606 679 -761 850 -946 1051 -1168 1295 -1439 1592 -1762 1952 -2162
44 -2162 2394 -2654 2951 -3286 3671 -4117 4643 -5274 6047 -7016 8281 -10003 12499 -16470
58 -16470 23792 -41834 180503 158880 -166609 57794 190324 79035 3431 193153 195374
69 195374 -19480 -84598 122156 189943 71611 29290 114583 78491 -15332 13340 106659
80 106659 83307 51107 104636 110810 -20016 -81324 17225 91454 34246 7505 54843 26522
92 26522 -74903 -52927 77445 103594 4950 -40895 -19728 -40667 -58306 15091 66560 -9524
104 -9524 -77971 -25674 6189 -65243 -74746 35028 52278 -78068 -113584 8563 33930 -93210
$$ packed form
0@%%%%Qj6J6j6K4l2M0m8N6p2Q8j05J29j60J92k24K61l03L53m08M67n38O17p02
28c73P97r04J018j144J285j440J611j796J997k219K463k734L031l354L714m114
44b162M556n048N605o237O957p788Q760r917J1321j3063J5297j8284K2502k8969
58a6470M0262o5626K22337k1623l25489K24403J32530j11289p5604J89722K221
69A95374k14854o5118K06754O7787j18332m2321Q5293l6092r3823K8672R3319
80A06659k3352l2200N3529O174j30826o1308R8549P4229n7208k6741M7338k8321
92B6522j01425K1976J30372K6149r8644m5845K1167k0939j7639P3397N1469p6084
104i524o8447N2297L1863p1432r503J09774J7250j30346l5516J22147K5367j27140
$$ plain form
116 -93210 -106827 39927 61320 -97238 -147465 -21419 19722 -82011 -93056 15919 19064
127 19064 -98126 -118793 -19400 18331 -28969 -39494 -22691 -55306 -81876 -36084 3251 -25061
139 -25061 -46440 -24594 -34130 -75120 -56225 2827 -6822 -64034 -54195 889 -7494 -58425 -48467
152 -48467 4697 7901 -28041 -32114 -17595 -30851 -41036 -9514 18369 -1094 -26592 -22726 -19381
165 -19381 -26172 -3506 32301 12388 -41491 -35729 19689 25836 -16478 -13002 30805 19641 -33287
178 -33287 -25807 31835 34276 -15010 -16335 31693 38077 -4228 -14780 18331 33281 15650 6533
191 6533 12964 10454 2724 5834 15066 20625 24234 18363 -1186 -8507 15924 39526 27360 3827
205 3827 7678 22289 15683 4287 18291 35799 20759 -7355 -6827 17682 27407 13078 2332
$$ packed form
116i3210j3617J46754K1393j58558n0227J26046M1141j01733j1045J08975L145
127A9064j17190k0667R9393L7731m7300j0525J6803l2615k6570M5792L9335k8312
139b5061k1379K1846r536m0990J8895N9052r649n7212R839N5084q383n0931R958
152d8467N3164L204l5942m073J4519j3256j0185L1522K7883j9463k5498L866L345
165a9381o791K2666L5807j9913n3879N762N5418O147m2314L476M3807j1164n2928
178c3287P480N7642K441m9286j325M8028O384m2305j0552L3111J4950j7631r117
191F533O431k510p730L110R232N559L609n871j9549p321K4431K3602j2166k3533
205C827L851J4611o606j1396J4004J7508j5040k8114N28K4509R725j4329j0746
$$ plain form
218 2332 8309 15345 12241 6973 8708 14004 14830 10563 5771 5930 9996 9432 1894 253 12819 20742
234 20742 3857 -16967 -7612 21937 25860 -27 -11664 3879 10766 -3795 -4808 17566 21809
247 21809 -8226 -26442 -4242 22155 13924 -9608 -11621 1789 5397 -2549 -4876 1886 5401
260 5401 -327 -8037 -7153 311 2549 -6878 -13861 -4087 9226 1576 -20372 -22478 1394 14681
274 14681 -2091 -19670 -12207 452 -6771 -15538 -3198 9826 -3923 -25665 -21449 351 7104
287 7104 -5791 -17185 -15919 -8143 -3720 -7527 -14174 -10980 -1854 -4787 -18818 -18323 -584 2060
301 2060 -18206 -24716 -2243 9330 -13318 -32167 -13791 9853 1075 -20850 -18854 -2884 -3671
314 -3671 -15711 -13980 -470 1576 -10873 -20514 -14420 -164 5295 -5941 -18979 -13586 1895
$$ packed form
218B332N977P036l104n268J735N296Q26m267m792J59M066n64p538j641J2566P923
234B0742j6885k0824R355K9549L923k5887j1637J5543O887j4561j013K2374M243
247B1809l0035j8216K2200K6397q231k3532k013J3410L608p946k327O762L515
260E401n728p710Q84P464K238r427o983R774J3313p650k1948k106K3872J3287
274A4681j6772j7579P463J2659p223q767J2340J3024j3749k1742M216K1800O753
287G104j2895j1394J266P776M423l807o647L194R126k933j4031M95J7739K644
301B060k0266o510K2473J1573k2648j8849J8376K3644q778k1925J996J5970p87
314c671j2040J731J3510K046j2449r641O094J4256N459j1236j3038N393J5481
$$ plain form
327 1895 1621 -14209 -15802 2026 7337 -11247 -20913 -3055 10425 -4433 -20082 -7608 11007
340 11007 3531 -15999 -14332 3771 9656 -1587 -10042 -5956 889 1205 -3544 -5232 1473 7516
354 7516 507 -12051 -7101 11692 13944 -6327 -15329 2827 17049 2157 -13068 -1142 16274
367 16274 7623 -10988 -6954 11205 11616 -4610 -8633 5525 14417 4562 -7039 -3679 9577 13232
381 13232 2182 -7468 -726 11944 8649 -5343 -4678 11381 14295 -3135 -11706 4826 18055
394 18055 4825 -11292 -2123 15468 10788 -6280 -6675 8547 12627 -141 -7310 636 9288 5534
408 5534 -3848 -4035 5472 10945 2508 -7806 -3400 10214 10567 -4023 -8980 4810 12561 -577
422 -577 -11461 402 14301 5042 -11897 -7690 9440 9921 -5279 -9640 3088 9926 752 -8226
$$ packed form
327A895k74j5830j593J7828N311j8584r666J7858J3480j4858j5649J2474J8615
340A1007p476j9530J667J8103N885j1243q455M086O845L16m749j688O705O043
354G516p009j2558M950J8793K252k0271r002J8156J4222j4892j5225J1926J7416
367A6274q651j8611M034J8159M11j6226m023J4158Q892r855j1601L360J3256L655
381A3232j1050r650O742J2670l295j3992O65J6059K914j7430q571J6532J3229
394A8055j3230j6117R169J7591m680j7068l95J5222M080j2768p169P946Q652l754
408E534r382j87R507N473q437j0314M406J3614L53j4590m957J3790P751j3138
422e77j0884J1863J3899r259j6939M207J7130M81j5200m361J2728O838r174q978
$$ plain form
436 -8226 -2682 7102 5759 -4338 -7641 894 8098 1446 -8352 -4938 8314 8751 -6223 -11521 2638
451 2638 11804 217 -11477 -2052 11063 4342 -9477 -5377 8816 7579 -6345 -8854 2508
464 2508 8326 647 -6923 -2840 5240 5592 -1779 -5906 -484 5947 2642 -5721 -4493 6053 7590
479 7590 -4317 -8861 3250 11344 207 -11115 -2759 10208 4728 -8082 -4793 7698 7346 -4341
493 -4341 -6554 2985 6888 -626 -6582 -2168 4957 4891 -2537 -6072 -421 6741 3289 -6387 -5938 5106
509 5106 6847 -5454 -9087 4641 11930 -1901 -12807 -1412 11191 2834 -10233 -4480 8782
522 8782 5723 -6492 -5754 5283 7432 -1146 -5767 -914 4606 3269 -2202 -4160 1659 8155 3448
537 3448 -7058 -6381 6206 8934 -3519 -8211 4151 10913 -2295 -11181 2074 14605 3803
$$ packed form
436h226N544R784j343j0097l303Q535P204o652r798L414J3252M37j4974n298J4159
451B638R166j1587j1694R425J3115o721j3819M100J4193j237j3924k509J1362
464B508N818p679p570M083Q080L52p371m127N422O431l305q363J228J0546J537
479G590j1907m544J2111Q094j1137j1322Q356J2967n480j2810L289J2491l52j1687
493d341k213R539L903p514n956M414P125o6p428l535N651P162l452r676M49J1044
509E106J741j2301l633J3728P289j3831j0906J1395J2603q357j3067N753J3262
522H782l059j2215P38J1037K149q578m621M853N520j337n471j958N819O496m707
537C448j0506O77J2587K728j2453m692J2362O762j3208q886J3255J2531j0802
$$ plain form
550 3803 -11413 -5520 9442 7740 -4380 -4648 5553 7763 -731 -5964 -389 6784 6494 -993 -5201
565 -5201 1328 9248 4045 -7330 -4573 10826 11482 -6187 -12177 4750 14447 -306 -11530 1956
579 1956 14330 2034 -13019 -4086 12327 8949 -5625 -7005 3129 7103 837 -4800 -1929 5410
593 5410 7101 -1434 -8101 -961 10053 5376 -8321 -6238 9858 10480 -7565 -13038 4311 14419
607 14419 551 -11903 -2306 9506 2058 -9992 -5209 8415 7812 -5339 -11001 -2580 6672 4563
621 4563 -5248 -7740 1431 6778 -2833 -12334 -3208 10921 4995 -11962 -10354 6863 8082 -8679
635 -8679 -12425 4756 12752 -2710 -15404 -5578 8177 5340 -5971 -6733 1409 2881 -4252 -8242
649 -8242 -1375 7660 5326 -7828 -12937 -706 10786 1964 -11193 -4739 9181 3940 -11435 -8285
$$ packed form
550C803j5216N893J4962j702j2120k68J0201K210q494n233N575P173k90p487m208
565e201O529P920n203j1375K757J5399O56j7669n990J6927R697j4753j1224J3486
579A956J2374j2296j5053Q933J6413l378j4574j380J0134L974o266n637K871P339
593E410J691q535o667P140J1014m677j3697K083J6096O22j8045n473J7349J0108
607A4419j3868j2454R597J1812p448j2050M783J3624o03j3151n662Q421R252k109
621D563r811k492R171N347r611r501R126J4129n926j6957J608J7217J219j6761
635h679l746J7181P996j5462j2694R826J3755k837j1311p62Q142J472p133l990
649h242O867R035k334j3154n109J2231J1492q822j3157O454J3920n241j5375L150
$$ plain form
663 -8285 8563 9672 -5409 -9815 1549 7377 -440 -6547 -1662 6223 5991 -2024 -7762 -2778 7681
678 7681 7575 -3688 -6731 3696 7634 -3903 -9705 4171 14479 1375 -13487 -5411 10364
691 10364 7292 -6310 -5268 5851 5858 -4336 -5955 2659 6792 2132 -3641 -2970 2156 5067 864
706 864 -5336 -2206 7956 8095 -4460 -9045 3024 10240 187 -7287 2380 10011 -350 -10191
720 -10191 -912 11140 5782 -6261 -5190 3390 4623 -198 -1826 -115 1624 1720 -201 -2726 -855
735 -855 4072 2604 -4928 -3765 6555 6799 -5768 -9359 3411 9896 -532 -7870 350 6378 -564
750 -564 -5696 949 6387 1072 -5172 -2936 2429 3630 501 -2511 -2975 637 3663 589 -4337 -2180
766 -2180 3577 1762 -4221 -2343 4748 2593 -6439 -5409 5076 7283 -2561 -7024 -378 4587 959
$$ packed form
663h285J6848J109j5081m406J1364N828p817o107M885P885k32q015n738M984J0459
678G681j06j1263l043J0427L938j1537n802J3876J0308j3104j4862Q076J5775
691A0364l072j3602J042J1119Pj0194j619Q614M133m660n773O71N126K911m203
706H64o200L130J0162J39j2555m585J2069P216j0053p474R667P631j0361r841
720a0191R279J2052n358j2043J071Q580J233m821j628J711J739R6j921k525J871
735h55M927j468p532J163J0320K44j2567l591J2770O485j0428p338Q220O028o942
750e64n132O645N438n315o244K236N365J201l129l012m64L612L026l074m926K157
766b180N757j815n983J878P091k155r032J030J0485K207r844m463O646M965l628
$$ plain form
781 959 -2356 631 2376 -690 -2393 -319 2750 3240 617 -3083 -2742 3114 6130 237 -5476 -809
797 -809 5544 2154 -4092 -1013 4879 1386 -5207 -1254 6491 3414 -5170 -4892 2715 5002 519 -2849
813 -2849 -2200 220 1717 1083 -990 -826 890 -224 -3231 -1312 4830 3812 -5041 -7355 1802 7148
829 7148 -141 -6367 -1665 3642 196 -3977 -934 2529 -271 -4297 -2550 1629 2192 -1006 -4788
844 -4788 -4537 1128 4765 -376 -6752 -4319 3150 2343 -4363 -3972 2861 2116 -6221 -6232 3784 6298
860 6298 -3538 -9203 -1640 5859 1851 -5017 -4290 749 1321 -1443 -2198 -104 1086 -599 -3846 -3332
876 -3332 2472 4759 -1858 -7973 -2542 6468 3678 -5911 -5240 4086 4398 -3891 -4972 2869 4871 -1952
892 -1952 -4938 904 5356 1642 -3575 -3267 1614 5439 3154 -2745 -4063 2015 5809 551 -3268
$$ packed form
781I59l315K987J745l066j703K074L069M90k623l700L41N856L016n893n713M667
797h09O353l390o246L079N892l493o593L953P745l077q584K78P607K287m483l368
813b849O49K420J497o34k073J64J716j114l007J919O142j018q853k314R157N346
829G148p289o226M702N307l446m173L043L463k800m026J747M179N63l198l782
844d788K51N665L637n141o376K433P469q07o706L91O833p45q337j1J0016K514
860F298r836n665P563P499m008o868P27N039N72k764p55K094J190j685l247N14
876c332N804K287o617o115N431R010k790r589O71R326L12q289j081P841K002o823
892a952k986N842M452l714n217L08M881L825k285n899j318O078L794n258l819
$$ plain form
907 -3268 1989 6916 308 -6777 -363 10157 6301 -5493 -5358 4960 7564 -82 -3781 2475 6499
922 6499 1980 -2916 -364 5199 5018 -53 -2566 1728 6351 3395 -3327 -2596 5443 8143 344 -5104
938 -5104 143 7020 3108 -3411 -233 6671 4083 -4405 -4140 4703 7734 431 -4737 -1072 4158
953 4158 3082 -1133 -1850 1565 3372 496 -3732 -2139 3689 4464 -2320 -5151 1300 5904 -415 -7447
969 -7447 -2268 6303 3731 -5396 -5731 1931 3537 -2692 -4776 888 4084 -1407 -6775 -4017 3014
984 3014 3872 -2190 -5952 -2493 1664 184 -4229 -2877 1835 1413 -4397 -6097 -429 3600 -304 -6055
1000 -6055 -3758 2373 1634 -4691 -5856 104 3317 -949 -4974 -2527 834 -449 -3492 -2287 1356
1015 1356 1493 -2863 -5443 -1924 3276 2685 -2639 -5049 -946 2647 66 -3464 -1067 3028 758
$$ packed form
907c268N257M927o608p085O414J0520l856j1794J35J0318K604p646l699O256M024
922F499m519m896K552N563j81n071k513M294M623k956o722P31Q039K700p799n448
938e104N247O877l912o519L178O904k588q488K65Q843L031p303n168L665N230
953D158j076m215p17L415J807k876m228J593N828P75o784k831O451M604o319p032
969g447N179Q571k572r127l35P662J606o229k084N664L196n491n368K758P031
984C014Q58o062l762L459M157j480m413J352M712m22n810j700N668M029l904n751
1000f055K297O131p39o325j165N960L213m266m025K447L361j283l043J205L643
1015A356J37m356k580L519N200n91n324k410M103L593k581l530K397M095k270
$$ plain form
1030 758 -4168 -2911 3004 3541 -2154 -4310 985 4396 383 -3881 -1774 3281 3150 -1258 -2253 803
1046 803 2265 23 -1342 969 3281 1393 -2456 -2333 2087 4298 1245 -2006 -695 2757 2472 -487
1062 -487 -542 2511 2957 -537 -1552 1559 3809 1095 -1920 98 2966 2071 -762 -1073 1438 2834
1078 2834 1420 -305 3 1349 1171 -386 -571 1627 2530 16 -2409 -622 2934 2376 -1534 -1894
1094 -1894 1152 2054 -978 -1930 996 2500 -450 -2950 -695 2439 1071 -2335 -2246 1012 1807 -1017
1110 -1017 -2739 -921 1415 314 -1837 -1975 409 800 -1328 -2624 -243 1906 -165 -3194 -2627 1144
1126 1144 1878 -1901 -3697 -16 1923 -893 -3499 -1145 1931 515 -2819 -2457 1039 1992 -1287 -3037
1142 -3037 -295 2178 691 -2355 -1994 1303 1899 -794 -2592 -283 2633 996 -2614 -1983 2322 2888
$$ packed form
1030G58m926J257N915N37n695k156N295L411m013m264K107N055j31m408r95L056
1046H03J462k242j365K311K312j888l849J23M420K211l053l251J311L452k85k959
1062d87n5L053M46l494j015L111K250k714l015K018K868q95k833l11K511J396
1078B834j414j725L08J346j78j557j85K198R03k514k425J787L556n58l910l60
1094a894L046R02l032r52K926J504k950k500K255L134j368l406Q9L258P95k824
1110a017j722J818K336j101k151j38K384L91k128j296K381K149k071l029N67L771
1126A144P34l779j796L681J939k816k606K354L076j416l334L62L496R53l279j750
1142c037K742K473j487l046L61L297N96k693j798K309K916j637l610O31M305N66
$$ plain form
1158 2888 -1227 -3152 644 3887 1029 -3178 -1109 3259 2444 -1911 -2376 2126 3820 -7 -2724
1173 -2724 -129 3985 2318 -1764 -1624 2198 3876 365 -2424 70 3913 2639 -1905 -1956 2485 4401
1189 4401 -89 -3382 438 4887 2349 -3248 -1977 3647 4260 -1356 -3245 1585 4484 722 -3182
1204 -3182 -607 3638 2783 -1713 -2742 1120 3879 867 -3136 -1692 3176 2983 -2169 -3749 1273
1219 1273 4183 -230 -4437 -1312 3779 2063 -3779 -3644 2150 3520 -1777 -4728 -1044 3332 931
1234 931 -3717 -3175 1265 2290 -2090 -4304 -1231 3071 1039 -4398 -4012 1531 3112 -1866 -5312 -626
1250 -626 3802 213 -5320 -3351 2827 2582 -3369 -4489 422 3019 -1185 -4495 -1833 2607 1628 -3262
1266 -3262 -4041 134 2906 13 -4034 -2128 2632 1787 -3288 -3927 1216 3839 -885 -4476 -651 3786
$$ packed form
1158B888m115j925L796L243k858m207K069M368q15m355m65M502J694l827k717
1173b724K595M114j667m082J40L822J678l511k789K494L843j274m544n1M441J916
1189D401m490l293L820M449k538n597J271N624O13n616j889M830K899l762l904
1204c182K575M245q55m496j029L862K759l012m003J444M868j93n152j580N022
1219A273K910m413m207L125N091j716n842J35N794J370n297k951L684M376k401
1234I31m648N42M440J025m380k214L073M302k032n437L86N543J581m978l446M686
1250f26M428l589n533J969O178k45n951j120M911K597m204l310K662M440r79m890
1266c262p79M175K772k893m047J906M760q45n075o39N143K623m724l591L825M437
$$ plain form
1282 3786 1179 -3675 -2037 2803 2905 -1780 -3183 223 3073 1182 -2167 -1355 1883 2581 -595 -2591
1298 -2591 548 3825 1773 -2773 -1968 2952 3862 -1221 -3161 1634 4560 477 -3314 185 4081
1313 4081 2332 -2262 -1341 2701 3250 -481 -1805 766 2890 1739 -880 -916 1386 2982 627 -1827
1329 -1827 -264 2987 1977 -1733 -1451 2694 3116 -1354 -2644 1246 3763 230 -2549 19 2521
1344 2521 819 -1938 -1129 1684 1336 -459 -1238 -430 905 954 -564 -1504 101 1609 -128 -2547 -1143
1361 -1143 1949 1273 -2242 -1926 1426 1471 -2178 -2463 1191 2194 -1081 -2897 -613 1066 -509 -1924
1377 -1924 -653 738 -241 -1645 -1640 -361 489 -62 -1243 -1489 -212 606 -860 -2127 -477 1672 334
1394 334 -2849 -1676 1302 1054 -2065 -1602 1423 1383 -1982 -2594 559 1753 -467 -1612 -150 700 -53
$$ packed form
1282C786k607m854J638M840J02m685j403L406K850j891l349Q12L238O98l176j996
1298b591L139L277k052m546Q05M920R10n083j940M795K926m083l791L499L896
1313D081j749m594R21M042N49l731j324K571K124j151k619l6K302J596k355k454
1329a827J563L251j010l710K82M145M22m470j290L890K517l533k779K568K502
1344B521j702k757Q09K813l48j795p79Q08J335M9j518r40J605J508j737k419J404
1361a143L092o76l515L16L352M5l649k85L654J003l275j816K284J679j575j415
1377a924J271J391r79j404NJ279Q50n51j181k46J277Q18j466j267J650K149j338
1394C34l183J173K978k48l119M63L025m0l365o12L153J194k220j145J462Q50p53
$$ plain form
1411 -53 -1203 -699 272 876 285 -1295 -1492 755 1636 -507 -2191 93 2314 117 -2663 -572 2867
1428 2867 1139 -2609 -1345 2430 1813 -1779 -1816 1361 2266 -412 -1752 -102 1603 880 -528 -793
1444 -793 419 1331 497 -1220 -686 1732 1670 -1070 -2395 748 2906 204 -2668 -676 2286 1111
1460 1111 -2275 -1325 1934 1776 -1452 -1961 624 1848 139 -1643 -992 952 1152 -545 -1835 -706
1476 -706 1312 1074 -1481 -2064 775 1737 -1238 -3138 120 3052 166 -3637 -1535 1960 1288 -2128
1492 -2128 -2464 823 1559 -940 -2478 -621 1370 348 -1822 -1734 666 1502 -554 -2425 -1225 1639
1508 1639 1318 -1684 -2281 588 1696 -692 -2256 -229 1719 309 -1998 -1396 1345 1348 -1061 -2005 -67
1525 -67 1697 588 -1519 -1610 689 1504 134 -1487 -343 1429 548 -1528 -981 1657 2286 -808 -2182
$$ packed form
1411e3j150N04R71O04n91j580j97K247Q81k143j684K284K221k197k780K091L439
1428B867j728l748J264L775o17l592l7L177R05k678j340J650J705p23j408k65
1444g93J212R12q34j717N34K418o2k740j325L143K158k702k872J992K962j175
1460A111l386R50L259j58l228n09K585J224j709j782O51J944K00j697j290J129
1476g06K018k38k555n83K839R62k975j900L258K932k886l803K102L495o72l416
1492b128l36L287P36k499j538J857J991j022k170Q8K400Q36k056j871J200K864
1508A639l21l002n97K869J108k388j564K027J948j410k307O02K741Lk409r44J938
1525f7J764j109k107r1K299Q15j370j621J144J772q81k076N47K638O29l094j374
$$ plain form
1542 -2182 -55 2321 1340 -1317 -918 1627 1961 -644 -1551 767 2380 674 -1253 -539 1569 1719
1558 1719 -723 -1343 1137 2722 707 -1688 -583 1820 1648 -316 -654 1299 1490 -64 -956 198
1574 198 1979 1568 -265 -1207 150 1844 1153 -750 -641 1658 1819 -766 -1351 834 2395 252 -1691
1591 -1691 -280 1990 926 -1474 -1203 1342 1708 -73 -1477 -431 927 649 -374 -691 432 776
1607 776 -404 -1567 -403 1536 1007 -1312 -1988 25 1453 -133 -1739 -302 1313 129 -1843 -1453
1623 -1453 579 1021 -648 -1383 -353 642 -21 -1606 -1238 658 1185 -532 -1897 -865 1040 460 -1182
1640 -1182 -1083 844 724 -1685 -1999 630 1829 -177 -2133 -686 814 179 -919 -711 673 535 -835
1657 -835 -1202 -194 789 492 -688 -702 323 572 -438 -994 10 1276 741 -558 -803 349 829 214
$$ packed form
1542b182K127K376r81k657L99K545L34k605r07K318J613j706j927P14K108J50
1558A719k442o20K480J585k015k395J105K403j72j964l38J953J91j554q92J154
1574A98J781m11j833r42J357J694o91j903J09K299J61k585n85K185J561k143j943
1591a691J411K270j064k400K71K545L66j781j404J046J358k78j023l17J123L44
1607G76j180j163J164J939n29k319o76K013J428j586j606J437J615j184j972L90
1623a453K032M42j669p35J030R95o63j585L68J896N27j717j365J032J905n80j642
1640a182R9J927j20k409l14K629J199k006j956J447J500o35j098K08J384j38j370
1657h35l67J008R83k97j180j4J025K49j010n56J004J266n35j299k45J152M80o15
$$ plain form
1675 214 -96 585 868 -127 -771 184 1242 1251 234 -349 -120 739 665 102 148 1182 723 -262 -392 703
1695 703 1653 507 -555 279 1561 729 -916 -242 1506 1696 -311 -711 837 1216 -196 -389 984
1712 984 1697 45 -1231 -194 1473 1201 71 -550 161 638 -17 -499 405 1246 574 -984 -787 702
1730 702 1123 -52 -1095 164 1058 189 -1303 -492 875 643 -625 -912 2 637 -325 -1052 -213 1008
1748 1008 305 -1110 -1531 -73 1208 455 -1259 -1013 562 349 -1309 -1353 675 1314 -784 -2467 -626
1765 -626 1568 574 -1914 -1548 953 1272 -1345 -2024 194 1722 -238 -1890 -840 1145 714 -1590
1781 -1590 -1593 935 1660 -282 -2338 -1075 1660 1359 -985 -1481 739 1555 -615 -1772 46 2242 862
1798 862 -1824 -1467 1176 1944 -362 -1697 112 1733 693 -1272 -971 1293 1847 -303 -1578 495
$$ packed form
1675B14l10O81K83r95o44R55J058Rj017n83K29Q59p4n63M6J034m59r85j30J095
1695G03R50j146j062Q34J282q32j645O74J748J90k007m00J548L79j412j93J373
1712I84P13j652j276J037J667k72j130o21P11M77o55m82R04Q41o72j558J97J489
1730G02M21j175j043J259Q94q69j492Q11J367k32j268k87R14O35r62p27Q39J221
1748A008p03j415m21J458J281p53j714K46J575k13j658m4K028O39k098j683J841
1765f26K194r94k488L66K501L19k617o79K218J528j960j652J050J985m31k304
1781a590lK528P25j942k056J263K735l01k344m96K220Q16k170j157J818K196j380
1798H62k686L57K643P68k306j335J809J621j040j965L01K264N54k150j275K073
$$ plain form
1814 495 2235 787 -1508 -582 2213 2224 -1134 -2227 650 2598 859 -1772 -516 2087 1101 -1329
1830 -1329 -1249 1573 2312 -458 -2143 -168 2176 1198 -1375 -1058 1167 1935 -436 -1791 -301 1978
1846 1978 862 -1588 -1284 1489 1842 -969 -1857 279 2501 452 -1994 -1119 1266 1292 -873 -1653 332
1863 332 1363 -114 -1660 -737 1145 1131 -1222 -1913 263 1477 -8 -2040 -1027 1237 757 -1538
1879 -1538 -1829 470 1324 -665 -1972 -599 1190 148 -1728 -1396 949 1128 -726 -2007 -385 1128
1895 1128 119 -1276 -1386 515 698 -1073 -1530 163 1314 -5 -1431 -834 903 830 -1005 -1147 420
1912 420 911 -235 -1259 -216 1013 394 -668 -627 477 972 -242 -734 -45 907 577 -484 -633 426
1930 426 925 204 -621 95 803 268 -631 -155 1125 812 -153 -395 291 538 328 -17 316 709 570 -144
$$ packed form
1814D95J740j448k295R26K795J1l358j093K877J948j739k631J256K603r86k430
1830a329Q0K822P39k770j685J975K344r78k573L17K225P68k371j355J490K279
1846A978j116k450L04K773L53k811q88K136K222k049k446Q75K385K6k165p80J985
1863C32J031j477j546R23J882j4k353o91K176J214j485k032J013K264m80k295
1879a538k91K299Q54j989j307J373J789j042j876L32K345J79j854j281J622J513
1895A128j009j395j10J901J83j771m57J693J151j319j426N97J737p3j835j42J567
1912D20M91j146j024J043J229o19j062M1J104M95j214m92O89R52l30j061j49J059
1930D26M99p21q25P16P08n35q99M76J280l13r65k42O86K47k10l45L33L93j39p14
$$ plain form
1950 -144 -209 328 766 328 -133 -105 557 299 -442 -173 574 819 129 -409 204 388 -136 -243 287 479 -171
1971 -171 -467 -48 367 220 -111 -184 -134 26 -85 -168 -232 62 -114 -476 -476 -94 168 -266 -399 -157 67 -245
1993 -245 -756 -169 135 -30 -522 -503 -269 -263 -614 -436 -113 58 -446 -595 -688 -140 -58 82 -200 -339 -10 -100
2015 -100 -532 -604 327 521 -527 -930 -164 563 -28 -638 -102 623 -130 -839 -532 349 569 68 6 58 -110
2036 -110 148 -12 94 394 776 424 -630 -417 688 948 -111 -174 587 890 -196 -554 725 1574 525
2055 525 -414 269 834 373 24 542 944 477 245 254 -151 180 989 1216 -14 -143 776 789 -63 -386 1033
2076 1033 1350 -137 -992 142 1304 362 -648 90 889 337 -369 -206 519 394 348 -237 -485 -143 539
2095 539 514 -803 -690 592 467 -1115 -1249 611 1006 -643 -1256 -397 762 -394 -1289 -325 609 -12
$$ packed form
1950a44o5N37M38m38m61K8O62k58p41K69P47K45o90n38O13J84n24j07N30J92o50
1971a71k96M19M15j47l31p3N0J60j11q3o4K94j76l62%L82K62m34j33K42K24l12
1993b45n11N87L04j65m92J9K34Ol51J78L23J71n04j49r3N48Q2J40k82j39L29r0
2015a00m32p2R31J94j048m03P66P27n91o10N36P25p53p09L07Q81K20n01o2N2j68
2036a10K58j60J06L00L82l52j054K13J105K60j059o3P61L03j086l58J279Q49j049
2055E25r39O83N65m61l49N18M02m67k32Rm05L31Q09K27j230j29R19J3q52l23J419
2076A033L17j487q55J134J162r42j010P38P99n52p06J63P25j25m6n85k48L42O82
2095E39k5j317J13J282j25j582j34J860L95j649o13Q59J159j156q95R64R34o21
$$ plain form
2113 -12 -1027 -1013 -194 28 -175 -484 -749 -337 -149 -298 -839 -620 628 250 -1251 -1452 354 1043 -536
2132 -536 -1626 -342 629 -169 -1511 -674 827 534 -1091 -1129 -86 428 4 -938 -490 468 285 -695
2150 -695 -1121 -129 1064 460 -858 -854 636 916 -805 -1163 546 1334 -56 -1182 -31 1336 827 -769
2168 -769 -609 841 1139 54 -465 272 1305 843 -418 -572 652 1439 411 -826 59 1310 920
2185 920 -648 -376 1193 1577 -170 -791 454 1527 729 -268 22 1114 947 -392 -608 452 1465
2202 1465 755 -665 -443 974 1235 -306 -761 323 1397 103 -1021 -217 1274 1142 -584 -770 621
2219 621 926 -421 -1127 216 1130 355 -916 -833 349 450 -139 -717 -232 497 100 -934 -1022 541 826
2238 826 -595 -1401 -312 642 119 -1044 -744 535 241 -859 -795 284 404 -430 -856 -505 199 37
$$ packed form
2113a2j015J4Q19K22k03l09k65M12J88j49n41K19J248l78j501k01J806O89j579
2132e36j090J284R71p98j342Q37J501k93j625l8J043N14m24r42M48R58j83r80
2150f95m26R92J193o04j318MJ490K80j721l58J709P88j390j126J151J367n09j596
2168g69J60J450K98j085n19P37J033m62j261j54J224P87j028j237Q85J251l90
2185I20j568K72J569L84j747o21J245J073p98r97K90J092j67j339k16J060J013
2202A465p10j420K22J417K61j541m55J084J074j294j124Q04J491j32j726j86J391
2219F21L05j347p06J343R14p75j271Q3J182J01n89n78M85P29l97j034q8J563K85
2238H26j421q06J089R54n23j163L00J279k94j100O4J079J20q34m26L51P04j62
$$ plain form
2256 37 -926 -1031 89 463 -167 -1068 -512 262 226 -617 -686 197 262 -601 -922 4 908 165 -871 -347 423
2277 423 504 -384 -413 120 372 -188 -463 -2 568 150 -336 -215 410 384 -67 -351 214 805 514 -150 -188
2298 -188 450 901 104 -46 314 753 7 -212 490 1171 672 -218 -190 765 971 170 -286 393 823 186
2318 186 -214 241 830 743 -198 -208 667 899 154 -372 349 944 475 -305 -400 597 650 -65 -122 522 870 35
2340 35 -643 -22 841 484 -522 -483 254 400 -54 -422 4 623 -43 -758 -476 476 585 -170 -726 -316
2360 -316 481 107 -711 -753 377 578 -305 -1230 -140 672 -89 -1039 -576 584 258 -1010 -1158 215 1052
2379 1052 -147 -1205 -462 522 466 -956 -883 319 591 -568 -1283 -146 995 380 -903 -820 460 566
2397 566 -540 -1240 -36 889 299 -888 -738 609 573 -571 -959 150 887 -128 -1078 -614 911 758
$$ packed form
2256C7r63j05J120L74o30r01N56P74l6q43o9Q83O5q63l21R26R04p43j036N24P70
2277D23Q1q88k9N33K52n60k75M61N70m18m86J21O25k6m51k84N65N91k91o64l8
2298a88O38M51p97j50L60M39p46k19P02O81m99q90K8R55K06q01m56O79M30o37
2318A86m00M55N89q7r41j0Q75K32p45n26P21N95m69p80r5R97N3p15n7O44L48q35
2340C5o78O21Q63l57j006L9P37J46m54l68M26O19o66p15K82R52J09p55n56M10
2360c16P97l74q18m2J130K01q83r25J090Q12p61r50M63J160l26j268j48J373Q37
2379A052j199j058P43R84n6j422P3J202K72j159p15J137J141o15j283Q3J280J06
2397E66j106p00J204R25n90j187J50J347l6j144l88J109P37j015r50M64J525j53
$$ plain form
2415 758 -247 -954 112 1096 116 -514 43 885 769 -607 -930 505 1376 489 -896 -286 924 687
2433 687 -492 -581 649 1130 280 -795 99 1250 720 -508 -248 864 1068 -69 -700 238 1250 754
2451 754 -503 -270 580 919 -82 -508 243 1017 316 -705 -272 773 891 -304 -839 119 931 471
2469 471 -585 -238 684 538 -524 -835 19 690 -31 -898 -402 451 592 -587 -1019 56 739 138 -1007
2488 -1007 -828 173 213 -496 -731 316 336 -518 -1174 -355 698 44 -882 -800 116 311 -474 -892 -611 192
2508 192 131 -684 -656 47 214 -386 -790 -271 237 147 -757 -720 274 471 -365 -868 -323 391 68 -682 -490
2529 -490 443 49 -612 -458 184 469 6 -431 -301 424 549 -20 -134 73 370 437 -261 -120 380 673
2549 673 -144 -362 221 587 119 -369 62 612 455 -180 -99 398 476 -8 148 201 424 162 135 152 291 492
$$ packed form
2415G58j005p07J066R84r80o30N57Q42j16j376l23J435Q71q87j385O10J210k37
2433F87j179q9J230M81q50j075Q94J151n30j228K60J112K04j137o31R38J012m96
2451G54j257K33Q50L39j001m26P51P74p01j021M33J045J18j195n35R58Q12m60
2469D71j056L47R22j46j062l11Q54O71p21q67M96Q53J41j179m32J075O83o01j145
2488a007J79J001M0p09k35J047K0q54o56Q19J053o54r26Q2R16J95p85m18K81Q03
2508A92o1q15K8P03J67o00m04N19N08r0r04L7R94J97q36n03N45P14l23p50J92
2529d90R33l94o61J54O42K85m63m37J30P25J25n69j14K07K97O7o98J41N00K93
2549F73q17k18N83L66m68m88M31N50j57o35Q1M97P8m84J56N3K23k62k7J7J39K01
$$ plain form
2571 492 144 -139 27 525 715 25 -89 451 466 233 -187 336 558 85 -159 80 564 189 -231 128
2591 128 359 323 -59 -288 234 18 -49 198 -37 81 -136 -43 -219 15 194 117 -386 -212 -251 -42 -315 -353
2613 -353 231 99 -377 -489 -108 162 -213 -337 -89 36 -200 -419 -294 -56 25 -378 -484 -233 151 -8
2633 -8 -356 -379 12 38 -362 -727 -116 172 -95 -544 -253 119 48 -451 -566 179 171 -310 -755 -217 199 121 -477
2656 -477 -308 171 175 -190 -354 104 464 181 -180 -413 383 551 -268 -566 90 456 -33 -497 -370 588 468
2677 468 -285 -195 71 559 256 -295 -73 738 590 -182 -390 141 794 209 -450 -258 800 562 -422 -263
2697 -263 515 927 120 -578 204 813 424 -397 -309 822 713 -121 -459 207 692 463 -392 -267 425 641
2717 641 16 -594 -22 919 474 -882 -482 845 778 -257 -964 276 825 138 -811 -162 837 374 -698
$$ packed form
2571D92l48k83J66M98J90o90j14N40J5k33m20N23K22m73k44K39M84l75m20L59
2591A28K31l6l82k29N22k16o7K47k35J18k17R3j76K34J79p7n03J74l9K09k73l8
2613c53N84j32m76j12L81K70l75j24K48J25k36k19J25K38Q1m03j06K51L84j59
2633hl48k3L91K6m00l65O11K88k67m49K91L72p1m99j15P45qm81m45N38M16p8n98
2656d77J69M79Ml65j64M58L60k83l61k33P96J68q19k98O56L66m89m64J27R58j20
2677D68p53R0K66M88l03n51K22Q11j48p72k08N31O53n85o59J92J058k38r84J59
2697b63P78M12q07o98P82O09l89q21Q8J131j09q34l38O66M85k29q55J25O92K16
2717F41o25o10N72R41m45j356M00J327o7j035p07J240N49o87r49O49R99m63j072
$$ plain form
2736 -698 -863 126 595 23 -620 -183 432 225 -628 -647 136 721 -10 -962 -598 328 448 -740 -609 423
2756 423 581 -297 -1351 -332 655 222 -948 -698 173 265 -610 -967 -119 536 92 -556 -811 196 418
2775 418 -158 -706 -229 708 106 -998 -864 446 691 -320 -885 -5 730 -120 -786 -287 809 585 -524
2794 -524 -729 180 666 25 -503 111 611 488 -462 -458 435 690 153 -482 -52 808 466 -159 -190 526 916
2815 916 176 -436 32 989 623 -302 -136 283 639 61 -333 363 734 371 -286 -238 461 626 -50 -169
2835 -169 170 754 252 -400 -219 818 637 -229 -384 33 573 136 -561 68 581 305 -237 -236 -21 573
2855 573 -70 -501 79 295 175 -406 -350 343 418 -247 -481 84 340 -68 -450 -78 268 35 -254 -471 -163
2876 -163 37 -278 -409 -144 205 67 -315 -354 5 153 -111 -509 -105 -11 8 -329 -219 91 137 -416 -440 -54
$$ packed form
2736f98j65R89M69n72o43M37O15k07q53j9P83N85p31r52L64R26J20j188J31J032
2756D23J58q78j054J019R87m33j170K50Q71R2q75l57Q48O55m44o48k55J007K22
2775D18n76n48M77R37o02j104J34J310K45j011n65Q80P35q50o66M99J096k24j109
2794e24k05R09M86o41n28O14N00j23r50MQ93K55n37o35M30Q60l42o25l1P16L90
2815I16p40o12M68R57l66r25J66M19L56n78l94O96L71l63o57M8O99J65o76j19
2835a69L39N84n02o52J81J037j81q66j55M17N40m37o97O29N13k76n42JK15N94
2855E73o43m31N80K16j20n81N6O93P5o65k34N65K56m08l82L72L46k33k89k17L08
2876a63K00l15j31K65L49j38l82l9L59J48k64l98M04R4J9l37J10L10M6n53k4L86
$$ plain form
2898 -54 168 -244 -549 -159 146 13 -396 -306 330 284 -125 -232 -35 198 48 -183 -294 357 330 -298 -407
2919 -407 34 364 257 -262 161 569 390 -272 80 339 448 -55 -80 298 600 339 -184 -7 452 469 26
2940 26 -136 345 727 155 -162 92 708 418 -211 -282 365 715 209 -485 -24 684 405 -160 -92 568 534
2961 534 -36 -573 260 467 127 -403 -234 520 602 -66 -528 109 618 292 -454 -181 544 229 -337 -604
2981 -604 63 688 -34 -688 -304 337 286 -473 -690 190 397 -167 -532 -306 371 178 -583 -548 338 441 -391
3002 -391 -900 -350 552 -39 -690 -560 325 431 -343 -871 -161 408 -149 -937 -648 428 224 -588 -836 -62
3022 -62 527 -10 -708 -479 384 297 -628 -728 -103 398 -34 -751 -483 403 520 -656 -788 145 826 -17
3042 -17 -859 -323 568 344 -563 -392 408 348 -365 -691 103 790 275 -463 -456 467 738 -8 -573 105 738
$$ packed form
2898e4K22m12l05L90L05j33m09R0O36m6m09j07J97K33j50k31j11O51k7o28j09
2919d07M41L30j07n19M23M08j79o62L52K59J09n03k5L78L02k61n23J77M59J7m43
2940B6j62M81L82n72l17K54O16k90o29p1O47L50n06o94M61P08k79n65O8O60l4
2961E34n70n37Q33K07l40n30J69P54Q2o68m62O37N09l26p46K73P25l15n66k67
2981f04O67O25p22o54L84O41n1p59k17Q80K07n64l65K26O77j93p61L5Q86J03q32
3002c91n09N50R02n91o51J30Q85J06p74n28P10N69n57p88K89J076k04q12k48P74
3022f2N89n37o98K29Q63q7r25j00O25N01m32p17K68Q86J17j176j32R33O81q43
3042a7q42N36Q91k24r07J71Q00o0p13l26P94O87n15p38PR23K71p46n65O78O33
$$ plain form
3063 738 341 -419 -159 571 682 -230 -435 526 796 422 -408 -262 672 733 -81 -472 189 747 230 -331
3083 -331 -188 715 247 -327 -345 385 731 119 -400 55 576 332 -340 -512 317 675 -16 -446 -93 258
3103 258 134 -611 -275 413 533 -448 -491 -180 369 44 -369 -474 227 170 -316 -571 -139 224 -176 -577 -415
3124 -415 51 203 -464 -421 -114 241 -43 -594 -316 153 57 -584 -584 2 185 -325 -620 -79 62 -103 -487
3145 -487 -418 -86 330 -29 -375 -63 275 75 -337 -161 277 296 -425 -361 64 225 -71 -111 -19 87 -36 -143
3167 -143 -123 119 281 -49 -44 100 375 251 -233 -126 306 395 39 -93 202 277 45 -91 -14 473 252 -73
3189 -73 -102 257 391 130 -34 237 495 215 121 160 488 353 169 64 241 328 24 -92 204 378 384 -207
3211 -207 -59 293 566 169 -179 117 322 196 -276 -68 325 430 -159 -222 69 227 -17 -311 -160 159
$$ packed form
3063G38l97p60K60P30J11r12k05R61K70l74q30J46R34O1q14l91O61N58n17n61
3083c31J43R03m68n74j8P30L46o12n19M55N21k44o72j72Q29L58o91m30L53L51
3103B58j24p45L36O88J20r81m3L11N49l25m13j05P01n7m86k55M32L63m00m01J62
3124d15M66J52o67M3L07L55k84n51K78M69r6o41%N86J83n10k95N41J41j65l84
3145d87O9L32M16l59l46L12L38k00m12J76M38J9p21O4M25J61k96m0R2J06j23j07
3167a43K0K42J62l30NJ44K75j24m84J07M32Q9l56j32K95P5k32j36P7M87k21l25
3189g3k9L59J34k61j64K71K58k80r4L9L28j35j84j05J77Q7l04j16K96J74On91
3211b07J48L52K73l97l48K96K05j26m72K08L93J05n89o3K91J58k44k94J51L19
$$ plain form
3231 159 298 -214 -269 15 127 -78 -308 -42 357 -43 -472 -208 82 181 -172 -580 -308 308 -72 -364 -265
3252 -265 145 -55 -286 -461 30 119 -178 -291 -518 160 327 -251 -547 -106 295 -33 -632 -388 155 181 -265
3273 -265 -282 -82 99 -254 -519 -92 421 149 -284 -364 203 399 -157 -416 -12 301 49 -345 -188 208 369
3294 369 -70 -386 145 397 104 -514 -359 370 488 -183 -394 13 355 201 -93 -91 371 474 -74 -245 365
3315 365 698 423 -82 -136 413 435 20 -341 202 500 363 -232 -132 339 495 -255 -376 232 580 221 -287
3336 -287 -61 412 395 -232 -278 223 494 152 -457 67 553 231 -267 -366 236 414 45 -416 184 392 154
3357 154 -287 -431 143 307 -222 -433 -129 175 230 -397 -279 43 353 -230 -682 -203 333 22 -556 -319
3377 -319 196 88 -487 -317 -59 501 -269 -488 -428 96 185 -381 -425 -44 286 -62 -557 -413 261 254 -410 -415
$$ packed form
3231A59J39n12n5K84J12k05k30K66L99m00m29K64K90R9l53m08K72O16l80k92R9
3252b65M10k00k31j75M91Q9k97j13k27O78J67n78k96M41M01l28n99K44N43K6m46
3273b65j7K00J81l53k65M27N13k72m33q0N67J96n56k59M04L13k52l94J57L96J61
3294C69m39l16N31K52k93o18J55P29J18o71k11M07L42j54k94KM62J03n48j71O10
3315C65L33k75n05n4N49K2m15l61N43K98j37n95J00M71J56p50j21O08L48l59n08
3336b87K26M73j7o27m6N01K71l42o09N24M86l22m98r9O02J78l69m61O00K08k38
3357A54m41j44N74J64n29k11L04L04N5o27J18L22L10n83m52M79N36l11n78K37
3377c19N15j08n75J70K58N60p70k19O0N24Q9n66m4L81L30l48m95J44O74po64n
$$ plain form
3399 -415 17 173 -319 -544 -367 332 259 -468 -441 78 119 -339 -341 63 270 6 -479 -156 382 406 111 -306
3421 -306 -20 354 135 -209 -137 434 370 45 -303 116 438 130 -204 -52 425 213 -138 -128 214 515 -24
3442 -24 -277 2 274 202 -166 41 262 326 30 -165 62 294 166 -45 13 299 362 -118 -243 155 408 138
3464 138 -89 46 293 65 -132 -54 284 406 -69 -684 140 180 -23 54 -42 0 -8 -40 -195 -103 35 168 -354
3487 -354 -87 -35 284 -218 -235 0 162 -367 -288 -134 339 -14 -362 -151 94 23 -244 -330 -23 155 10 -406
3509 -406 -130 135 -10 -233 -50 -131 63 -124 -482 -197 -35 87 -298 -230 84 275 -284 -461 -108 195 -7
3530 -7 -253 -376 242 188 -188 -334 170 201 -121 -269 -42 357 182 -195 1 229 323 -193 -315 3 354 155
3552 155 -208 -185 208 541 -56 -152 115 360 193 -289 33 486 343 -218 -317 376 388 144 -268 -117 535
$$ packed form
3399d15M32J56m92k25J77O99p3p27K7N19M1m58kM04K07k64m85L23N38K4k95m17
3421c06K86L74k19l44P2N71o4l25l48M19L22l08l34J52M77k12l51J0L42L01n39
3442b4k53K79K72p2l68K07K21O4k96j95K27K32j28k11N8K86O3m80j25L98K53k70
3464A38k27J35K47k28j97P8L38J22m75o15Q24M0k03P7r6M2ql2j55R2J38J33n22
3487c54K67N2L19n02j7K35J62n29P9J54M73l53l48K11K45p1k67q6L07J78j45m16
3509d06K76K65j45k23J83q1J94j87l58K85J62J22l85O8L14J91n59j77L53L03k02
3530gk46j23O18n4l76j46N04L1l22j48K27L99j75l77J96K28R4n16j22L18L51j99
3552A55l63K3L93L33n97r6K67K45j67m82L22M53j43n61r9O93J2k44m12J51O52
$$ plain form
3573 535 157 -163 -267 265 483 -60 -227 -129 260 241 -234 -119 105 410 34 -161 -276 612 194 -392 -301
3594 -301 407 463 104 -247 146 443 102 -467 -390 207 317 -237 -383 176 464 149 -444 -281 308 333 -374
3615 -374 -606 -8 208 -141 -627 -147 156 161 -354 -345 240 293 -204 -520 -110 256 53 -420 -371 23 118 -257
3637 -257 -456 -184 381 -30 -509 -365 148 219 -174 -527 -123 88 -173 -275 -340 209 406 -101 -337 -10 287
3658 287 -105 -259 39 216 138 -266 -357 69 296 -73 -398 -181 443 175 -311 -353 34 345 -152 -232 93
3679 93 618 194 -126 -189 409 206 -50 -269 155 204 49 -217 -48 187 261 -21 -333 107 353 209 -210
3700 -210 11 346 153 144 -16 234 222 -16 81 67 73 176 123 -108 -96 239 -14 75 -125 230 193 -129 -154 67
3724 67 286 -39 -68 57 160 -52 -113 -72 76 283 -103 -157 5 27 370 -109 -126 -127 -74 -66 55 0 29 -21 -261
$$ packed form
3573E35l78l20j04N32K18n43j67R8L89j9m75J15K24L05l76j95j15Q88m18n86R1
3594c01P08N6l59l51L93K97l41n69P7N97J10n54j46N59K88l15n93J63N89K5p07
3615c74k32N98K16l49m86M80L03Nn15RN85N3m97l16M10L66k03m73M9L94R5l75
3637b57j99K72N65m11m79J44N13P1l93l53M04K11k61j02o5N49J97n07k36L27K97
3658B87l92j54K98J77p8m04r1M26K27l69l25K17O24k68m86m2L87L11m97q0L25
3679I3N25m24l20o3N98k03k56k19M24M9j55k66J69K35P4k82l12M40K46j44m19
3700b10K21L35j93rj60K50j2k38R7j4OJ03n3k31J2L35k53Q9k00L55l7l22k5K21
3724F7K19l25k9J25J03k12o1M1J48K07l86n4J62K2L43m79j7jN3QJ21n5K9n0k40
$$ plain form
3749 -261 -72 -25 8 -105 55 74 -81 -161 -262 47 45 -63 -98 -177 -17 -171 -246 -236 -49 31 -209 -345 -113 37
3773 37 76 -161 -182 -56 -22 -15 34 65 73 -13 -279 -117 143 18 33 -60 72 124 -10 -171 56 62 46 -21 -128 79
3799 79 119 -42 0 -79 332 204 -15 -179 372 253 3 61 224 161 -79 -113 299 208 25 -8 65 218 82
3822 82 -124 12 228 400 23 61 46 183 274 233 -91 309 114 77 98 112 75 386 98 -225 160 206 147 15
3846 15 268 53 131 -130 -14 -169 224 -41 -238 -109 -16 50 1 -178 36 103 -141 -241 153 328 -57 -13
3868 -13 -333 189 128 -252 -217 -159 -35 138 -197 -69 96 257 -38 -104 -84 124 2 -380 -443 23 283 -54
3890 -54 -325 -241 193 4 -277 -16 154 34 -329 -301 -2 93 -74 -131 -76 146 165 -64 -10 65 358 47 -175
3913 -175 -97 140 139 -20 -319 18 318 120 -138 -80 80 94 -290 -86 -20 245 108 50 -192 209 108 -99
$$ packed form
3749b61J89M7L3j13J60J9j55q0j01L09kj08l5p9J60j54p5J0J87Q0k40j36K32J50
3773C7L9k37k1J26L4PM9L1Qq6k66J62K60j25J5r3J32N2j34j61K27Oj6o7j07K07
3799G9M0j61M2p9M11j28k19j64N51j19k50N8J63o3k40l4M12r1j83l3P3J53j36
3822H2k06J36K16J72l77L8j5J37R1m1l24M00j95l7K1J4l7L11k88l23L85M6n9j32
3846A5K53k15P8k61J16j55L93k65j97J29R3O6m9j79K14O7k44j00L94J75l85M4
3868a3l20N22o1l80L5N8J24J73l35J28J65J61k95o6K0K08j22l82o3M66K60l37
3890e4k71Q4M34j89k81K61J70j20l63K8K99R5j67n7N5K22J9k29N4P5K93l11k22
3913a75P8K37jj59k99L37L00j98k58N8J60J4l84K04O6K65j37n8k42M01j01k07
$$ plain form
3935 -99 15 124 353 -97 1 93 296 377 -7 -65 234 259 112 -235 -38 376 139 -159 -301 242 221 234 -120
3958 -120 221 294 128 -151 14 63 273 65 -191 75 177 1 -153 71 183 220 78 -168 93 215 101
3979 101 -110 54 357 191 -88 -251 137 -28 4 -230 -50 210 182 -308 -118 -50 91 -105 -226 -150 27
4000 27 -173 -147 -131 69 39 -71 -266 -79 165 73 -294 -199 134 -75 -237 -204 115 116 -162 -221 -294 -53 7 -119
4024 -119 -210 -80 100 -72 -174 -176 159 -19 -207 -148 -170 -86 -17 11 -5 164 2 -108 -124 122 110 -20 -119 168
4048 168 100 -53 -212 -70 1 97 38 113 -1 -43 67 18 108 239 42 48 104 6 120 -6 -95 -2 284 122 -99
4073 -99 -134 92 -33 -73 107 252 271 72 -109 -103 59 302 -107 241 374 88 -134 -137 71 166 89 -39 108
4096 108 24 140 66 14 133 46 131 149 40 120 264 47 -81 66 205 -64 -189 -55 87 -98 -146 -73 166
$$ packed form
3935i9J14J09K29m50R8R2K03Q1l84n8K99K5j47l47J97M14k37k98j42N43k1J3l54
3958a20L41P3j66k79J65M9K10k08k56K66J02j76j54K24J12L7j42k46K61J22j14
3979A01k11J64L03j66k79j63L88j65L2k34J80K60k8m90J90O8J41j96j21P6J77
4000B7k00K6J6K00l0j10j95J87K44r2l67R5L33k09j62L3L19Jk78n9p3K41O0j26
4024a19r1J30J80j72j02kL35j78j88N9k2Q4O9K8j6J69j62j10j6K46j2j30r9K87
4048A68o8j53j59J42P1R6n9P5j14m2J10m9R0J31j97ON6r8J14j26q9R3K86j62k21
4073i9l5K26j25m0J80J45J9j99j81OJ62K43m09L48J33k86k22lK08R5p7j28J47
4096A08q4J16p4n2J19q7Q5J8j09Q0J44k17j28J47J39k69j25J34J42j85m8P3K39
$$ plain form
4119 166 73 -357 -100 -172 -51 -73 -437 -64 103 -14 -47 -152 155 66 -174 -246 -214 2 339 -210 -155 -69 -31
4142 -31 -175 -174 80 192 -47 -213 -229 162 -63 -244 -121 74 121 -2 -184 -254 58 -19 -13 -238 211 19 -126
4165 -126 -191 7 73 109 -291 -160 39 66 -148 -277 -20 209 60 -73 -127 -117 194 81 -22 0 426 154
4187 154 52 -19 320 154 -219 -131 134 356 -14 -21 33 105 176 -90 -113 122 328 227 -113 -143 238 110 -95
4210 -95 -68 118 187 212 -53 117 137 230 -153 -76 97 133 -154 -47 -60 103 -99 -201 40 136 207 -172 -84 -25
4234 -25 106 -137 58 -106 -4 -39 -160 -153 -171 84 -17 -243 -135 4 -14 -39 -312 -24 -24 -195 -186 -190 94 -198
4258 -198 -30 -198 -162 -41 16 -198 -201 61 49 -142 -221 21 147 -57 -127 -133 3 -15 -237 -66 -103 -91 -88 -175 -187
4283 -187 194 -29 -13 -81 26 49 -169 -152 11 -49 85 -30 -67 -112 276 -5 -205 -108 -17 55 -44 19 108 124 181
$$ packed form
4119A66r3m30K57p2J21k2l64L73J67j17l3j05L07q9k40p2L2K16L37n49N5Q6L8
4142c1j44JK54J12k39j66j6L91k25j81J23J95M7j23j82p0L12p7Ok25M49j92j45
4165a26o5J98O6L6m00J31J99K7k14j29K57K29j49j33n4J0L11j13j03K2M26k72
4187A54j02p1L39j66l73Q8K65K22l70pN4P2P1k66k3K35K06j01l40l0L81j28k05
4210i5K7J86O9K5k65J70K0R3l83P7J73L6k87J07j3J63k02j02K41R6P1l79Q8N9
4234b5J31k43J95j64J02l5j21Pj8K55j01k26J08J39j8k5k73K88%j71RmK84k92
4258a98J68j68L6J21N7k14lK62j2j91p9K42J26k04p0oJ36j8k22J71l7J2Lq7j2
4283a87L81k23J6o8J07K3k18J7J63o0J34j15l7m5L88k81k00R7R1P2r9O3Q9J6N7
$$ plain form
4308 181 -65 87 100 -28 -37 16 203 29 -112 164 308 -89 -73 57 151 91 165 29 -53 89 4 211 19
4331 19 -7 51 116 103 -35 -4 139 14 -10 -33 129 -12 -37 135 38 126 76 123 -36 -88 8 -41 215 -50 77
4356 77 -13 -6 66 -50 -80 -65 -7 179 -52 89 -107 82 130 113 37 -102 -2 -28 6 -86 59 -79 -93 14 -3
4381 -3 -20 71 -141 -10 -45 -51 50 -40 1 -44 -102 70 -183 -137 -181 161 -37 -40 -105 -49 -26 -47 58 106 -1 -77 156
4408 156 -125 -57 13 165 115 -87 -163 47 72 -29 -179 79 39 -50 45 -30 142 -206 56 68 -8 -126 -14 -10
4432 -10 0 58 -77 196 -18 179 163 -118 12 181 196 285 96 19 49 108 -17 -83 189 334 201 276 92 57
4456 57 36 128 -43 -148 372 119 212 70 -33 188 114 -123 150 -18 43 -54 193 106 166 -47 -210 7 208
4479 208 -88 -151 -11 177 3 -89 -168 18 64 33 -178 -123 119 -38 -28 -4 -135 112 -15 -200 -186 -68 128
$$ packed form
4308A81k46J52J3j28rN3J87j74j41K76J44l97J6J30R4o0P4j36q2J42q5K07j92
4331A9k6N8O5j3j38L1J43j25k4k3J62j41k5J72r7Q8n0M7j59n2R6m9K56k65J27
4356G7r0PP2j16l0J5N8J86k31J41j96J89M8j7p6j39J00k6L4r2J45j38j4J07j7
4381cj7R1k12J31l5oJ01r0M1m5n8J72k53M6m4L42j98lo5N6K3k1J05M8j07p6K33
4408A56k81O8P0J52n0k02p6K10K5j01j50K58m0q9R5p5J72l48K62J2p6j18J12M
4432a0J0N8j35K73k14J97j6k81J30J69J5Q9j89p7L0N9j25o6K72J45j33P5j84l5
4456E7k1R2j71j05N20k53R3j42j03K21p4k37K73j68O1r7K47q7O0k13j63K17K01
4479B08k96o3J40J88j74r2p9J86M6l1k11N5K42j57J0K4j31K47j27j85J4J18J96
$$ plain form
4502 128 95 -60 9 31 72 -23 74 232 98 -120 -107 -145 29 -125 -23 -70 127 -76 -117 17 -73 9 -4 -61 10
4527 10 -94 -8 -176 -244 69 -84 -214 -168 -3 75 -13 -66 -169 -128 -16 -65 -143 -87 54 7 -131 40 251 64
4551 64 -69 13 -128 20 -95 -173 -60 132 45 154 139 9 211 4 84 10 148 -106 -34 151 108 33 174
4574 174 -79 -11 148 97 16 154 -108 99 21 -100 4 -9 152 161 94 127 175 -30 2 73 243 57 63 -246 112
4599 112 142 -103 -164 -74 4 -79 -159 66 -9 156 -65 -12 2 -3 -19 13 -303 227 77 -30 -112 -4 -48 -39 -39 -210
4625 -210 -53 -159 -81 -258 151 106 -221 -101 5 -190 -160 -43 -73 116 -212 4 -118 -14 -183 -5 26 -159
4647 -159 53 -112 73 -216 -123 -82 -121 -98 -67 -13 2 -133 -214 139 1 -62 -80 49 21 -279 -185 -41 163 6
4671 6 25 -120 143 -2 -71 -12 -104 285 114 0 193 -9 -239 191 -140 -122 258 -34 -90 114 132 25 -43
$$ packed form
4502A28l3j55O9K2M1r5R7J58j34k18J3l8J74j54J02m7J97k03m1J34r0Q2j3n7P1
4527A0j04Q6j68o8L13j53j30M6J65P8q8n3j03M1J12m9p8N6J41m7j38J71K11j87
4551F4j33Q2j41J48j15p8J13J92q7J09j5j30K02k07Q0p4J38k54P2J85m3p5J41
4574A74k53O8J59n1q1J38k62K07p8j21J04j3J61Ro7L3M8k05L2P1J70j86Ol09L58
4599A12L0k45o1R0P8q3q0K25p5J65k21N3J4nj6L2l16N30j50j07q2J08m4R%j71
4625b10J57j06P8j77M09m5l27J20J06j95L0J17l0J89l28K16j22J04j69J78L1j85
4647a59K12j65J85k89R3M1l9K3L1N4J5j35q1L53j38o3j8J29k8l00R4J44K04j57
4671FJ9j45K63j45o9N9r2L89j71j14J93k02k30M30l31J8L80k92n6K04J8j07o8
$$ plain form
4694 -43 -97 25 117 25 -113 83 168 40 162 69 -14 48 10 419 -56 322 -37 10 18 77 210 -37 52 -110 177
4719 177 10 27 -102 172 4 -19 -66 115 -36 69 38 88 109 93 -80 137 143 -13 -176 -81 -88 66 34 -234
4743 -234 -26 49 -26 30 30 33 -63 -151 -26 -48 -137 -89 -52 -179 -6 7 50 -310 1 -217 -61 -105 95 37 92 -96
4769 -96 -92 -173 116 -34 -66 -146 -31 35 -266 -95 -61 -162 -38 -40 57 60 -117 -171 -59 -46 -56 11 67 -165 2 174
4795 174 5 -6 -70 85 -107 -59 12 138 90 84 54 35 90 76 11 -50 92 179 -100 -72 104 109 105 3 -227 61
4821 61 67 102 -68 192 235 -71 128 145 77 114 -23 64 22 59 165 58 22 166 241 -97 -38 171 21 59 3
4846 3 194 117 99 -66 110 -52 171 23 75 -2 43 -106 -56 -76 125 -100 -137 -63 116 29 -41 -27 -75 -198 122
4871 122 2 172 -143 -151 24 -31 76 -121 92 -48 113 106 -31 -50 -20 -131 -45 -63 -3 -161 25 -57 -157 -6
$$ packed form
4694d3n4J22R2r2j38J96Q5j28J22r3q3O2l8M09m75L78l59M7QN9J33k47Q9j62K87
4719A77j67J7j29K74j68k3m7J81j51J05l1N0K1j6j73K17Oj56j63R5pJ54l2k68
4743b34K08P5p5N6%Lr6q8J25k2q9M8L7j27J73J3M3l60L11k18J56m4K00n8N5j88
4769i6Mq1K89j50l2q0J15O6l01J71L4j01J24kR7Lj77n4J12J3j0O7N6k32J67J72
4795A74j69j1o4J55j92M8P1J26m8ol0j9N5j4o5o1J42Q7k79K8J76Nmj02k30K88
4821F1OL5j70K60M3l06J99J7o8L7j37Q7m2L7J06j07l6J44P5l38N9K09j50L8n6
4846CJ91p7j8j65J76j62K23j48N2p7M5j49N0k0K01k25l7P4J79q7p0J4m8j23L20
4871A22j20J70l15qJ75n5J07j97K13j40J61pj37j9L0j11Q6j8O0j58J86q2j00J51
$$ plain form
4895 -6 54 -17 -113 -85 -71 87 78 -51 1 26 -93 -32 -94 -258 -29 101 -67 -40 35 -166 131 -16 -171 9 -84
4920 -84 -15 91 -37 -26 -116 -97 42 11 6 -54 97 16 69 79 -41 -23 315 -101 -62 153 -23 -211 -1 -85 57
4945 57 136 93 2 111 -7 86 -54 -88 127 12 138 76 13 36 194 103 61 -16 252 123 -54 56 -126 11
4969 11 95 -119 -170 43 76 -28 85 -176 -10 26 44 -21 22 163 -130 -122 25 -56 81 40 -68 -115 -6 6 -14
4994 -14 -102 39 -49 -52 -97 -153 -26 -60 126 -44 127 -19 -111 -87 77 -121 -36 13 -132 -107 -133 -4 -162 118 183
5019 183 -122 -232 -102 -96 33 -32 -75 -30 -67 60 -47 -60 88 -169 -124 -64 -157 18 -120 0 -122 15 -43 -2
5043 -2 40 28 84 -179 65 -58 104 74 -109 115 221 -246 -95 69 72 -152 227 136 27 51 105 99 -44 121
5067 121 -38 -61 -35 214 3 -153 53 -55 79 -56 135 -8 9 -48 -159 68 165 175 21 179 23 -20
$$ packed form
4895fO0p1r6K8J4J58rj29N2K5j19O1o2j64K29J30j68K7P5k01K97j47j55J80r3
4920h4O9J06j28J1r0J9J39l1no0J51q1N3J0j20J8L38m16L9K15j76j88K10q4J42
4945E7P9m3r1J09j18R3j40l4K15j15J26o2o3K3J58r1m2p7K68j29j77J10j82J37
4969A1Q4k14n1K13L3j04J13k61J66L6J8o5M3J41k93QJ47q1J37m1j08m7J09J2k0
4994a4q8J41q8lm5n6J27l4J86j70J71j46r2K4J64j98Q5M9j45K5k6J29j58K80O5
5019A83l05j10J30OJ29o5m3M5l7J27j07j3J48k57M5O0r3J75j38J20j22J37n8M1
5043bM2j2N6k63K44j23J62l0j83K24J06m67J51J64Lk24L79r1j09K4N4oj43J65
5067A21j59k3K6K49k11j56K06j08J34j35J91j43J7n7j11K27R7J0j54J58j56m3
$$ plain form
5089 -20 -139 220 72 168 -197 53 132 -29 194 -116 180 33 36 -1 -135 -13 96 -52 -78 117 197 -51 14
5112 14 45 -53 21 186 87 -51 27 94 148 223 -19 -74 -57 -101 43 58 1 12 -58 -55 -23 -50 61 -65 -116 9 122
5139 122 -161 78 -131 -60 -44 -88 -8 -172 -106 -117 82 50 -95 -121 45 24 172 -63 -228 15 127 -97 6
5162 6 -115 13 -80 -28 -79 -21 163 -60 4 15 45 -52 -74 -6 62 48 -123 117 22 6 6 209 -104 85 45 7 -233
5189 -233 23 -48 175 75 -15 8 109 -78 172 97 108 84 240 -92 -28 -46 30 255 131 85 -30 225 342
5212 342 125 -128 11 174 5 152 -6 198 -22 -6 79 -82 114 14 227 90 -20 130 122 -105 -74 -146
5234 -146 62 135 97 -39 71 3 12 87 -274 49 -35 -29 97 130 179 70 -132 -38 -50 121 30 -124 -37 -88 17
5259 17 131 36 -152 -41 -17 -20 -294 -1 -266 4 -56 -55 -201 -76 -161 -110 -14 -18 -189 -159 -13 -23 -116 -254 24
$$ packed form
5089b0j19L59j48R6l65K50P9j61K23l10K96j47Ll7j34J22J09j48k6J95Q0k48O5
5112A4L1r8P4J65r9j38P8O7N4P5k42n5J7m4J44J5n7J1p0LL2k7J11j26n1J25J13
5139A22k83K39k09P1J6m4Q0j64O6j1J99l2j45k6J66k1J48k35j65K43J12k24J03
5162Fj21J28r3N2n1N8J84k23O4J1L0r7k2O8O8j4j71K40r5j6%K03l13J89m0l8k40
5189b33K56p1K23j00r0K3J01j87K50p5J1k4J56l32O4j8P6K25j24m6j15K55J17
5212C42k17k53J39J63j69J47j58K04k20J6Q5j61J96j00K13j37j10J50qk27L1p2
5234a46K08P3l8j36J10o8RP5l61L23q4OJ26L3M9j09k02R4j2J71r1j54Q7n1J05
5259A7J14r5j88J11K4lk74K93k65K70o0Jj46J25q5N1R6mj71L0J46j0r3j38K78
$$ plain form
5284 24 42 -66 -189 21 141 -58 -30 -129 -32 133 -7 94 12 26 -94 11 -10 32 25 89 -38 16 7 -35 0 36
5310 36 30 -87 96 80 98 104 91 -58 5 51 214 33 -55 35 0 74 -16 85 108 -76 38 139 13 19 -28 114
5336 114 -45 45 54 136 359 95 89 66 208 -93 30 39 50 -18 -124 99 212 94 30 -24 50 -100 -108 77 47 39
5362 39 -63 175 -27 -202 -64 -135 105 25 -72 121 -178 65 108 158 8 -203 1 -219 -50 21 -94 33
5384 33 -59 127 -249 -54 -34 -67 -101 -42 -55 -170 -211 -41 -51 -135 -206 -115 -153 -113 -76 -178 -7 76 16 -139 -224 45
5410 45 62 -168 -175 -15 -83 -72 -72 127 1 -58 150 102 -25 269 -157 46 43 -64 73 -21 -59 -111 150 220 31
5435 31 -35 -15 151 58 -110 -83 127 106 -41 183 51 36 117 -47 -65 -1 41 114 -153 44 39 74 93 97 4 43 55
5462 55 -27 -28 32 -60 43 -44 -34 126 -91 14 15 45 158 61 -160 -99 189 256 -172 -170 4 41 33 35 1 -63 -201 76
$$ packed form
5284B4J8j08j23K10J20j99K8r9R7J65j40J01q2J4j20J05k1M2pO4j27N4rm2L5L6
5310C6oj17J83j6J8Oj3j49O3M6J63j81q8R0l5P4r0J01K3j84J14J01j26Om7J42
5336A14j59R0RQ2K23k64ok3J42l01J23RJ1o8j06K23J13j18o4n4P4j50qJ85l0q
5362C9j02K38k02j75J38p1K40q0r7J93k99K43M3N0j50k11K04k20J69P1j15J27
5384C3r2J86l76J95K0l3l4N9j3j15m1J70j0q4p1R1l8M0L7j02J71Q3o0j55q5K69
5410D5J7k30pJ60o8J1%J99j26n9K08m8j27K94m26K03lj07J37r4l8n2K61P0j89
5435C1o6K0J66r3j68K7K10k1j47K24j32j5Q1j64j8O4M2P3k67J97nL5J9Mr3L9J2
5462E5q2jO0r2J03q7J0J60k17J05JL0J13r7k21O1K88O7m28KJ74L7qKl4o4j38K77
$$ plain form
5490 76 1 83 25 -164 58 -16 95 -148 -72 121 -7 -25 265 -80 22 -13 47 -20 -29 -96 -52 -54 98 -38 5 -50
5516 -50 128 -160 94 61 16 -176 -94 -164 -159 42 -59 -88 -104 65 36 -44 137 -40 8 109 71 -122 -47 71 -113
5541 -113 -4 -208 -146 96 -62 -90 -19 16 95 -31 -49 -53 -117 11 98 19 0 -59 61 -147 -38 33 -8 -31 59 40
5567 40 264 -73 -25 169 150 8 134 -133 -43 77 -121 97 32 158 183 -15 165 -98 -90 -161 53 137 -44
5590 -44 89 21 132 68 218 32 88 41 -7 -97 191 -124 -82 -167 0 -111 65 -25 -127 40 28 141 -74 139
5614 139 36 119 -5 -19 -36 16 -61 61 -37 44 -42 -74 -38 153 -62 -38 52 152 56 166 15 -40 -41 -72 -56 5
5640 5 112 -99 -67 127 34 -42 38 105 -111 42 -65 72 -121 88 196 -209 -52 -111 117 114 -151 29 -44 -76
5664 -76 149 -89 -89 -88 96 -28 8 -56 -113 -58 71 7 -154 -28 59 -147 6 58 114 -149 101 -45 -48 140 15
$$ packed form
5490G6p5Q2n8j89K22p4J11k43P6J93j28j8K90l45J02l5O0o7ro7M4kJ52j36M3n5
5516e0J78k88K54l3m5j92Q2p0NK01j01k9j6J69k9q0J81j77M8J01l8j93P5J18j84
5541a13J09k04O2K42j58k8P1L5P9j26j8mo4J28Q7p9j9n9J20k08J09P1m1k3R0j9
5567D0K24l37M8J94j9j42J26k67R0J20j98K18o5J26K5j98J80k63Qp1K14Q4j81
5590d4J33o8J11o4J50j86N6m7m8r0K88l15M2q5J67j11J76r0j02J67j2J13k15K13
5614A39j03Q3j24j4j7N2p7J22r8Q1q6l2L6J91k15K4R0J00r6J10j51n5jl1J6O1
5640EJ07k11L2J94r3p6Q0O7k16J53j07J37j93K09J08m05J57n9K28lk65J80p3l2
5664g6K25k38%JJ84j24L6o4n7N5J29o4j61J26Q7k06J53N2N6k63K50j46lJ88j25
$$ plain form
5689 15 151 -29 39 -31 33 -33 57 144 88 34 104 -7 -3 36 -127 6 60 29 80 93 -45 -78 -149 -99 -55 48 -27
5716 -27 -51 -51 -49 132 183 117 40 48 16 -86 131 107 123 -21 -68 -30 -106 113 23 -71 170 174 -43 116 -142 130 60
5743 60 -155 31 201 -8 23 71 -93 2 -28 1 85 -2 99 -40 -10 -120 -6 -99 -89 -51 145 -39 -146 114
5767 114 -57 -131 43 -88 -51 21 108 -24 -137 -8 -268 -83 -45 -10 -44 39 1 -38 16 -121 -34 -65 141 -205
5791 -205 82 -113 0 -81 -186 -36 10 5 67 -3 -79 -94 -116 55 109 61 18 51 127 34 -142 -74 90 96 -7 -106
5817 -106 214 -13 218 -135 66 74 -58 36 -38 136 158 63 -158 -53 237 135 -29 44 -24 87 189 27 26
5840 26 253 67 -69 182 129 -53 -54 -21 24 -11 16 -18 -9 137 -76 147 120 106 -211 56 -82 -199 44 116 -11
5865 -11 34 116 -120 -57 90 196 37 18 -12 122 -9 85 98 192 -200 89 145 28 37 -142 -115 -39 -85 -58 -72 -76
$$ packed form
5689A5J36j80O8p0O4o6R0Q7n6n4P0j11ML9j63J33N4l1N1J3j38l3p1N0M4J03p5
5716b7k4%KJ81N1o6p7Ql2j02K17k4J6j44m7L8p6K19r0r4K41Mk17J59k58K72p0
5743F0k15J86J70k09L1M8j64R5l0K9Q4q7J01j39L0j10J14r3J0L8J96j84j07K60
5767A14j71p4J74j31L7P2Q7j32j13J29k60J85L8L5l4Q3l8l9N4j37Q7l1K06l46
5791b05K87j95J13q1j05J50M6nO2p0p6j5k2J71N4m8m3L3P6r3j76O8J64Oj03r9
5817a06L20k27K31l53K01Qj32R4p4J74K2r5k21J05K90j02j64P3o8J11J02j62j
5840B6K27j86j36K51n3j82jL3M5l5K7l4RJ46k13K23k7j4l17K67j38j17K43P2j27
5865a1M5Q2k36O3J47J06j59j9l0J34j31R4J3R4l92K89N6j17Rj79K7P6m6K7j4m
$$ plain form
5891 -76 -20 -119 75 37 -100 -114 -22 -63 -65 28 -31 -222 72 -205 -132 37 -120 40 -12 -76 -50 -156 -160 15 31 -17
5917 -17 -75 124 16 -41 -34 -192 -170 -125 -63 -145 -40 -77 135 161 -43 -33 38 -27 -72 53 -33 133 -41 -78 -116 -109 46
5944 46 97 157 112 29 13 -132 75 -29 16 -202 -65 54 77 127 -97 -171 61 -167 16 -42 6 -39 4 56 16
5969 16 48 -26 -32 -31 -46 -72 -13 175 -66 -6 -28 -121 64 41 53 -108 26 -112 -10 -7 -22 -46 161 10 80 -91 22
5996 22 83 -76 -12 -32 8 -153 238 17 -57 24 29 -27 2 39 56 -21 92 -13 -117 -31 -143 81 -209 64 -167
6021 -167 15 -129 181 57 -130 -22 -78 177 -6 70 99 200 -134 -89 138 -105 -31 -55 -155 11 -95 -11
6043 -11 -145 63 -67 -6 10 -17 176 -112 -33 23 123 -121 -183 133 -71 -41 179 16 -77 54 156 -35 -97
6066 -97 87 15 -69 132 34 20 120 -20 61 -48 -22 -25 -5 150 48 110 -76 60 -3 -52 -71 8 -52 -128 -38 -10
$$ packed form
5891g6N6r9J94l8j37j4R2m1kR3n9j91K94k77P3J69j57J60n2o4K6j06mJ75J6m8
5917a7n8J99j08n7Pj58K2M5O2q2J05l7K12K6k04J0P1o5m5J25q6J66j74l7l8PJ55
5944D6N1O0m5q3j6j45K07j04M5k18J37J19K3N0k24p4K32k28J83n8M8m5M3N2m0
5969A6L2p4oJj5k6N9J88k41O0k2r3J85k3J2j61J34j38J02Lj5k4K07j51P0j71J13
5996B2O1j59O4k0M0j61L91k21p4Q1Nn6K9L7J7p7J13j05j04Q6j12K24k90K73k31
6021a67J82j44L10j24j87J08n6K55j83P6K9J01l34M5K27k43P4k4j00J66j06Q4
6043a1j34K08j30O1J6k7J93k88P9N6J00k44o2L16k04L0K20j63r3J31J02j91o2
6066i7J84p2q4K01r8j4J00j40Q1j09K6lK0J55j02O2j86J36o3m9j9P9o0p6R0K8
$$ plain form
6092 -10 49 -99 76 56 -140 13 22 136 -81 -80 152 11 74 169 5 -24 -198 11 59 -87 34 50 176 102
6116 102 148 -52 144 59 60 -28 -50 29 -24 152 -27 59 -89 27 -123 86 8 80 -85 18 121 -5 104 -144
6140 -144 5 43 -174 241 15 -69 71 -82 119 -104 94 -95 -168 -37 4 -21 -13 -83 -4 -157 -187 190 -157
6163 -157 88 -83 7 -75 -38 98 15 -12 0 -53 29 -1 -56 21 -159 -72 -12 39 -145 -124 -161 188 -84 -160 -130 25
6189 25 49 -68 -141 -22 -113 93 105 38 -73 11 28 -52 -93 -59 -235 3 -9 -29 8 -172 -15 104 181 -80 -38
6214 -38 -28 61 24 3 -183 25 -97 17 -153 -146 -70 -38 -34 149 -146 23 94 -25 -149 30 21 141 -8 -14 163
6239 163 -2 119 -5 16 10 -70 127 -129 183 122 -78 2 9 -5 -15 -103 -164 -33 -69 101 7 20 4 3 -28 -72 -120
6266 -120 125 -39 15 -125 92 -52 135 -32 57 -18 -71 -238 -62 108 48 103 -65 -306 -113 -39 -98 112 -180
$$ packed form
6092a0N9j48J75k0j96J53RJ14k17JK32j41O3R5j64k9j74K09M8j46J21J6J26p4
6116A02M6k00J96q5Jq8k2P9n3J76j79Q6j48J16j50K09p8P2j65J03J03j26J09k48
6140a44J49L8k17M15k26q4J40j53K01k23J98j89p3J31M1k5Qp0P9j53l0L77l47
6163a57K45j71R0q2L7J36q3k7J2n3Q2l0n5P7j80Q7O0N1j84K1l7L49k72p6L0J55
6189B5K4j17p3J19r1K06J2o7j11Q4J7q0m1L4j76K38j2k0L7j80J57J19P7k61M2
6214c8J0Q9l7k1j86K08j22J14j70PP6L2MJ83k95J69P1j19j24J79rJ20j49oJ77
6239A63j65J21j24K1oq0J97k56L12o1k00Q0Pj4j0q8o1J31l6J70r4J3j6jl1m4m8
6266a20K45j64N4j40K17j44J87j67Q9p5n3j67J76J70o0N5j68k41J93P4n9K10k92
$$ plain form
6289 -180 57 -148 -82 29 -121 -9 134 5 10 -4 28 -146 2 31 29 20 -50 -126 -21 -111 -95 -65 31 96 -53 -138
6315 -138 10 -89 -5 48 -47 58 46 -147 58 10 -128 -97 -41 87 41 183 -94 -54 30 -24 -15 228 89 -83 -132
6340 -132 98 152 -73 -16 106 -177 -1 -29 -67 148 -28 76 155 -109 -124 -133 23 72 38 73 -10 30 -27 -13 153
6365 153 113 -58 -44 53 -49 -71 -52 -72 -67 116 100 -35 38 22 -8 147 -26 3 140 161 -198 -49 50 49 -12 -45
6391 -45 -102 27 -90 -69 -29 -66 61 -52 6 10 -69 -37 20 43 87 -13 -117 -3 -134 139 -104 -102 21 -63 6 -98
6417 -98 23 74 16 35 -68 62 64 -36 -77 -101 -71 145 -39 -95 -57 -215 23 -89 -112 108 -113 24 76 52 -76
6442 -76 77 69 109 -4 -99 -69 -53 28 113 187 -53 57 -94 -91 -66 22 94 -51 37 108 67 130 166 24 -29 -48 -63 -116
6470 -116 -119 27 43 -66 27 -53 14 212 -9 146 -92 -82 -140 102 -141 -25 -1 58 100 -84 -157 -89 149 -12
$$ packed form
6289a80K37k05O6J11j50J12J43j29Nj4L2j74J48K9krp0p6J05r0J6L0R6O5j49q5
6315a38J48r9Q4N3r5J05j2j93K05m8j38L1N6J28m6J42k77M0Q4n4RK43j39j72m9
6340a32K30N4k25N7J22k83J76k8l8K15j76J04P9k64j5rJ56M9l4L5q3M0n7J4J66
6365A53m0j71J4R7j02k2J9k0NJ83j6j35P3j6l0J55j73K9J37K1l59J49R9jo1l3
6391d5n7J29j17K1M0l7J27j13N8Mp9L2N7K3M4j00j04J14j31K73k43KJ23q4O9j04
6417i8J21N1n8J9j03J30Kj00m1k4L0K16j84n6L8j58K38j12k3K20k21J37N2k4j28
6442g6J53qM0j13r5L0J6Q1Q5P4k40J10j51LK5Q8P2j45Q8P1m1O3L6j42n3j9j5n3
6470a16lJ46J6j09R3q0O7J98k21J55k38J0n8K42k43J16K4N9M2j84p3O8K38j61
$$ plain form
6494 -12 -20 -22 -66 156 -42 17 94 -96 93 86 15 29 260 24 -93 112 -131 -56 49 33 8 -28 -18 21 92 -64
6520 -64 -8 54 47 116 25 -62 -12 -200 -8 -142 -106 -131 79 69 34 -56 57 -48 -68 -17 61 55 74 -147 -57 -136 -139 -32
6548 -32 74 6 1 275 -68 -31 7 -86 -39 -144 207 -8 -26 -46 11 -19 37 22 -152 -46 -10 68 -126 32 -127
6573 -127 -42 -81 79 -158 91 -96 -60 8 190 5 3 42 -58 57 -92 79 -53 25 -10 -78 117 32 -94 8
6597 8 -74 29 117 159 -6 -18 207 127 -173 5 7 48 -100 -15 -8 7 200 7 -30 74 72 -16 -61 -183 169 92 100
6624 100 -2 73 -19 -104 38 292 4 188 -63 25 92 -29 17 -130 124 189 -80 -46 -3 -17 -141 139 168 -13
6648 -13 48 -111 67 -20 -96 -61 3 -2 87 -19 125 -62 14 45 -44 77 -64 10 -68 37 -99 -68 -5 -104 -44 -54
6674 -54 -4 8 -162 -144 48 -50 -230 71 45 105 116 -81 177 -46 -81 42 23 257 -57 62 -22 -145 14 138
$$ packed form
6494a2qkm4K22j98N9P7j90J89pp1J4K31k36j17K05k43P5J05j6k5l6J0L9P1j56
6520f4N6O2pO9r1q7N0j88J92j34L6k5K10j0l5r0J13j05k0N1P8oJ9k21R0p9lJ07
6548c2J06o8nK74l43L7L8r3M7j05L51k15j8k0N7l0N6j5j74J06L6P8j94J58j59
6573a27Q5l9J60k37K49j87L6O8J82j85kL9j00J15j49J71j32P8l5o8J95q5j26J02
6597Hq2J03Q8M2j65j2K25q0l00J78KM1j48Q5PJ5J93j93l7J04kq8m5j22L52p7Q
6624A00j02P5r2q5J42K54k88J84k51Q8O7j21M6j47K54O5k69L4M3j4j24K80K9j81
6648a3O1j59J78q7p6L5O4nQ9j06J44j87P6L1q9J21j41P4p8J05j36L1O3r9O0j0
6674e4N0J2j70J8J92r8j80L01k6O0J1j97K58k23l5J23j9K34l14J19q4j23J59J24
$$ plain form
6698 138 -22 1 -68 -133 4 63 20 -84 139 25 -136 -15 40 69 7 -23 155 -42 -83 274 -1 -15 63 -37
6722 -37 -63 33 52 23 158 -25 -82 -142 110 -44 -54 -54 12 -146 4 25 133 39 -89 -52 77 106 41 -114 -75 97
6748 97 41 26 -145 -25 -234 33 -91 127 -88 -176 35 12 91 -106 55 22 47 71 -82 -34 -72 38 -208 -57
6772 -57 68 -35 -124 30 -5 -95 -21 -61 9 296 128 84 -151 72 -6 122 204 -4 61 -52 188 -12 73 -135
6796 -135 79 -113 40 -58 -138 -67 -206 -9 7 -146 -25 -62 -45 -127 85 74 66 -160 -59 56 1 37 12 46 112
6821 112 231 57 49 183 -29 -7 -38 299 213 190 -4 18 35 -66 65 55 -27 183 56 73 -90 -80 -27 -85 -2
6846 -2 -12 -57 53 56 -38 222 42 161 -85 208 -19 -105 -46 -154 2 -16 20 -118 -182 160 9 23 -123 -124 37
6871 37 -116 62 -102 -77 88 -35 -254 -3 -54 -94 106 14 160 -126 121 66 -133 -36 -28 -3 -100 52 21 -140
$$ packed form
6698A38j60K3o9o5J37N9m3j04K23j14j61J21N5K9o2l0J78j97m1L57k75j4P8j00
6722c7k6R6J9k9J35j83n7o0K52j54j0%O6j58J50K1J08r4j28L7J29K9o5j55L9J72
6748I7n6j5j71J20k09K67j24K18k15q8K11k3P9j97J61l3K5K4j53M8l8J10k46J51
6772e7J25j03q9J54l5r0P4m0P0K87j68m4k35K23p8J28Q2k08O5j13K40k00Q5k08
6796a35K14j92J53r8q0P1j39J97J6j53J21l7J7q2K12j1qk26J01J15n5L6k5L4O6
6821A12J19j74qJ34k12K2l1L37q6k3j94K2J7j01J31j0q2K10j27J7j63J0N3n8Q3
6846bj0m5J10Lr4K60j80J19k46K93k27q6N9j08J56j8L6j38o4L42j51J4j46jJ61
6871C7j53J78j64K5J65j23k19K51n1m0K00r2J46k86K47n5j99R7QK5r7J52l1j61
$$ plain form
6895 -140 -65 10 -84 -17 -160 2 -33 -121 -25 -38 -7 -44 158 -132 -76 175 62 -8 -183 15 -166 -101 118 128 -77
6920 -77 61 -74 1 149 188 -38 -113 113 -185 -45 28 43 -4 286 -74 -77 17 -69 -43 55 123 -19 123 55 8
6945 8 -61 144 -16 -17 -100 72 -39 -21 46 -97 77 64 18 -28 40 13 -51 -18 -66 192 62 81 136 -3 -32 3 7
6972 7 -157 167 -102 25 60 127 -13 40 6 209 -119 -159 46 -223 -4 -116 -72 -106 20 -43 -4 -4 -74 240 76
6997 76 213 89 95 -73 20 -10 -73 -37 202 206 -134 76 17 -119 36 -11 23 -21 -116 37 76 26 73 -43 -167 53
7023 53 -11 -43 170 -34 -8 64 119 -4 -12 36 -166 -60 13 69 -41 46 -105 -27 11 -201 -39 -42 153 61 125 132 -38
7050 -38 -83 35 -13 16 -108 29 -15 93 -66 100 62 -46 -139 -43 -96 15 152 -63 76 86 -36 31 -43 57
7074 57 55 150 2 5 6 10 -168 18 79 -64 12 122 191 76 47 0 -139 164 106 153 -59 14 65 150 19 122 60
$$ packed form
6895a40P5P5r4O7j43J62l5q8R6j3L1l7K02k90N6K51j13p0j75J98j81O5K19J0k05
6920g7J38j35P5J48L9k26p5K26k98J40P3J5m7K90l60lR4q6K6R8O8j42J42o8m7
6945Ho9K05j60jq3J72j11J8O7j43J74j3m6m6O8k7o4L3m8K58j30J9N5j39k9L5M
6972Gj64L24k69J27L5O7j40N3l4K03l28m0K05k69K19j12M4l4J26o3L9%p0L14j64
6997G6J37j24Oj68R3l0o3L6K39Ml40K10n9j36J55m7L4m4r5J53L9n0M7j16j24K20
7023E3o4l2K13k04K6P2N5j23qM8k02J06P3N6j10Q7j51P8L8k12J62lJ95r2O4Pj70
7050c8m5J18m8K9j24J37m4J08j59J66l8j08r3R6n3J11J37k15J39J0j22O7p4J00
7074E7kR5j48LJMj78J86O1j43P6J10O9j15k9m7j39L03n8M7k12P3N1Q5j31J03o2
$$ plain form
7101 60 82 -37 117 90 123 -24 40 -40 -63 62 33 56 127 57 83 -124 -96 -106 -234 -174 69 52 -70 -60 35 315
7127 315 88 39 64 -108 115 12 -81 -41 -73 -27 -121 149 36 -55 3 -82 135 -191 -72 122 -46 -148 -34
7150 -34 -77 62 -54 -146 111 69 -117 71 -64 117 16 -19 -50 179 163 -158 10 -198 -150 126 -187 130 43
7173 43 123 31 22 -16 220 40 -16 7 -140 86 -104 -30 -51 11 -149 81 133 151 -160 -85 86 101 -101 41 -40
7198 -40 -19 -93 -10 -34 70 21 -150 -56 -67 138 -8 -1 -14 -68 68 31 49 -140 -30 95 94 19 84 125 76 7 28
7225 28 43 -204 46 42 287 22 173 141 59 10 -5 150 -61 -86 120 -85 46 74 -76 -42 -75 159 112 20 29
7250 29 -69 29 175 232 81 -119 65 42 155 182 122 78 -117 -50 0 123 68 160 -26 63 109 -26 -69 16 84 25
7276 25 120 -91 21 166 -8 24 -10 72 5 178 46 -42 180 19 27 -60 -21 1 12 23 -257 45 87 -109 41
$$ packed form
7101F0K2j19J54k7L3j47O4q0k3J25k9K3P1p0K6k07K8j0j28O0K43j7j22J0R5K80
7127C15k27m9K5j72K23j03r3M0l2M6r4K70j13r1N8q5K17l26J19J94j68j02J14
7150c4m3J39j16r2K57m2j86J88j35J81j01l5l1K29j6l21J68k08M8K76l13L17q7
7173D3Q0r2rl8K36j80n6K3j47K26j90P4k1O2j60K30N2J8l11P5J71J5k02J42q1
7198d0K1p4Q3k4J04m9j71R4j1K05j46Pj3n4J36l7J8j89J10J25jp5O5M1m9o9K1
7225B8J5k47K50mK45k65J51l2q2m9j5J55k11k5K06k05J31K8j50L4l3K34m7r2R
7250B9r8R8J46N7j51k00J84k3J13K7o0m4j95O7N0J23n5R2j86Q9M6j35m3Q5O8n9
7276B5R5k11J12J45j74L2l4Q2o7J73j32q8K22j61Qq7L9K2J1J1k80L02M2j96J50
$$ plain form
7301 41 46 119 -240 -133 38 -51 83 39 -43 -21 153 -41 16 142 50 -68 84 -61 96 -39 28 19 13 0 -102
7326 -102 190 -5 -77 -11 17 -5 -45 -302 -5 -74 -56 133 -44 32 71 -9 155 -204 -120 47 -51 0 -49 53 19
7351 19 -77 -29 14 -73 43 86 14 -3 163 -44 -20 98 -54 -40 -75 -95 -127 -25 -16 37 -23 -48 20 -31 12 -21 11 111
7379 111 -35 54 -53 -115 97 -68 -12 106 81 -20 25 80 -60 -77 -8 -136 70 165 28 44 75 -96 189 -63
7403 -63 81 168 45 236 91 -37 -76 -56 -102 -9 39 -45 -64 -155 138 -84 -59 -119 -118 -95 127 29 13 99 -64 -77
7429 -77 178 96 113 -47 122 66 -51 -40 -42 35 -111 126 78 5 69 28 -52 30 60 -123 150 57 -206 -57 109
7454 109 -125 70 132 -270 13 -95 -164 -64 -19 -52 32 17 50 10 16 91 89 -26 10 -198 2 29 169 249 143
7479 143 96 -82 27 12 27 206 41 -91 47 45 79 175 -68 241 -27 84 6 100 -132 108 -41 -41 64 4
$$ packed form
7301D1NP3l59J07J71q9J34m4q2K2J74j94N7J26r2j18J52j45J57j35O7roj3j02
7326a02K92j95p2O6K8k2m0k57K97o9J8J89j77P6L9q0J64l59Q4J67r8N1m9J02l4
7351A9r6M8M3q7J16M3p2j7J66k07K4J18j52J4l5k0l2J02RN3o0k5O8n1M3l3L2J00
7379A11j46Q9j07o2K12j65N6J18k5j01M5N5j40j7O9j28K06R5j37J6L1j71K85k52
7403f3J44Q7j23J91j45j28l9K0m6R3M8q4j9r1K93k22K5o0JK3K22r8j6Q6j63j3
7429g7K55q2J7j60J69n6j17J1kP7j46K37m8p3O4m1q0Q2L0j83K73r3k63J49J66
7454A09k34J95O2m02K83j08o9J00M5l3Q4j5L3m0OP5kj15L6k08K00K7J40Q0j06
7479A43m7j78J09j5J5J79j65j32J38kL4R6k43L09k68J11p8R4k32K40j49%J05o0
$$ plain form
7503 4 -98 -103 67 -175 -52 37 -162 -36 78 112 85 -209 135 -14 122 -158 -121 -56 -184 -208 -59 -26 -30 125
7527 125 169 36 -11 96 -101 -66 -65 24 25 214 50 108 36 29 -58 -93 -43 -120 165 -77 121 29 -51 -73 -123 34 -63
7554 -63 -54 -123 10 84 63 9 -42 -105 37 -138 67 -15 49 49 -207 67 34 120 82 151 326 6 121 88 68 37 92
7581 92 16 -34 39 223 -45 -6 89 -157 59 -7 49 131 33 -10 -72 75 -42 -42 199 -57 18 63 -121 -24 54 36
7607 36 -208 89 71 133 2 22 -76 106 -213 118 12 -100 -19 -6 -33 3 -35 -127 62 -1 -93 -21 -174 32 8
7632 8 -96 -84 163 16 51 16 -11 -26 -9 148 73 9 -28 -128 9 -149 -33 100 -181 -10 -129 -4 38 -64
7656 -64 4 -109 -54 -49 -36 -110 106 -39 63 -88 12 46 138 135 17 -135 -97 -178 -57 -37 242 34 67 7 14 -21
7682 -21 -103 119 42 -124 -9 52 68 -92 4 156 -100 73 151 -33 -87 117 87 105 -122 -28 21 68 17 5 -26
$$ packed form
7503Dj02nJ70k42J23Q9j99J26J14L4k7k94L44j49J36k80L7O5j28k4J49L3mJ55
7527A25M4j33m7J07j97L5JQ9JJ89j64N8p2pq7l5N0p7K85k42J98r2q0k2n0J57r7
7554f3Ro9J33P4k1n4n1o3J42j75K05q2O4%k56K74l3Q6l8O9J75l20J15l3k0l1N5
7581I2p6n0P3J84k68L9R5k46K16o6N6Q2r8m3o2J47j17%K41k56P5M5j84R7P8j8
7607C6k44K97j8O2j31K0r8J82l19L31j06j12Q1J3k7L6l8r2J89o3r2P2j53K06k4
7632Hj04J2K47j47L5l5k7j5J7J57p5o4l7j00J37j58J16J33k81J71j19J25M2j02
7656f4O8j13N5NJ3p4K16j45J02j51J00L4R2lj18j52L8q1J21K0K79k08L3o0Pl5
7682b1q2K22p7j66J15O1J6j60R6J52k56J73P8j84n4K04l0J8k27R4M9M7n1j2l1
$$ plain form
7707 -26 -18 -65 90 -7 -20 24 75 155 -63 -54 -32 -145 -95 -193 109 -84 66 115 -88 136 -11 -74 99 -42 -1 -14
7733 -14 149 174 62 63 -20 77 41 -88 -8 -16 -27 -76 18 282 1 118 -25 114 -3 9 26 12 -26 82 68 87
7759 87 64 -54 -50 -87 94 -229 -162 3 -48 -14 114 -118 63 57 -205 152 3 98 -81 134 -52 63 -15 -174
7783 -174 33 25 -21 -55 -213 -2 -43 114 -158 117 113 -367 108 -52 -40 82 17 -57 -92 -103 83 6 113 39 24
7808 24 -78 215 10 -110 80 -30 -90 18 -81 71 10 39 67 256 48 100 -102 26 -48 -115 -6 97 -101
7831 -101 14 -105 -67 -87 -72 244 14 -112 -6 162 -104 -22 6 -25 90 6 -29 -65 113 -31 -45 -29 -105 85
7855 85 -112 43 -60 17 -34 -4 11 -34 72 -24 -17 63 -44 -126 42 82 -17 118 105 15 -25 -54 71 147 -68 -58
7881 -58 -36 -62 41 114 -147 -149 213 -158 -77 -106 -41 35 84 14 -73 -41 -95 -6 149 159 3 -186 28 112 14 137
$$ packed form
7707b6Qm7J55r7j3M4N1Q0k18RK2j13N0r8L02j93J50M9k03K24j47o3J73j41M1j3
7733a4J63K5j12Jq3R7l6j29Q0qj1m9R4K64k81J17j43J39j17J2J7j4l8J08j4J9
7759H7k3j18Ml7J81l23O7J65n1L4J28k32J81ok62L57j49R5j79K15j86J15p8j59
7783a74K07qm6l4j58K11m1J57k72K75mm80M75j60J2J22o5p4l5j1J86p7J07p4j5
7808B4j02K93k05j20J90j10o0J08r9J52o1K9K8J89k08N2k02J28p4o7J09J03j98
7831a01J15j19L8k0J5L16k30j26J06J68k66Q2K8l1J15q4l5l6J78j44j4J6p6J90
7855H5j97J55j03P7n1L0J5m5J06r6PQ0j07q2J68M0r9J35j3r0m0k9J25P6k15J0
7881e8K2k6J03P3k61kL62l71Q1k9O5P6M9p0q7L2n4Q9J55J0j56j89K14Q4r8J23
$$ plain form
7907 137 -40 -107 77 -69 -27 108 -89 13 118 -129 -78 -107 6 -11 3 16 -254 -63 -119 -87 -6 40 -140 140
7931 140 21 -121 252 60 -77 -41 -118 67 59 -92 11 134 -233 -23 104 -103 -135 -118 125 -117 -104 -112 111
7954 111 149 80 106 112 -45 83 121 79 -180 -147 275 -180 227 34 149 65 -38 115 -23 159 -93 79 49
7977 49 132 -105 -129 -13 21 -20 -6 30 10 -110 -21 -50 171 -46 -113 47 187 -45 60 5 113 -4 -176 -118
8001 -118 -49 4 -20 29 30 -8 -105 -20 45 -23 -13 112 -22 94 82 24 28 -94 -29 -29 -155 -111 90 -11 -127 -29 9
8028 9 -99 -123 -169 57 40 78 -46 -10 -44 -3 24 99 26 63 25 -60 69 124 -71 -192 -167 -140 6 -43 127 -202
8054 -202 44 -38 88 -11 -53 -94 -25 102 -36 56 -31 -81 -83 -1 -41 -86 7 1 114 34 55 133 84 -197 43 16 25 25
8082 25 46 -13 34 81 30 117 103 20 36 258 161 0 100 71 -50 64 129 50 -94 128 -40 -1 -126 43 120
$$ packed form
7907A37j77o7J84j46M2J35j97J02J05k47N1k9J13j7J4J3k70J91n6L2Q1M6j80K80
7931A40j19j42L73j92j37L6p7J85qj51J03J23l67K10J27k07l2J7K43k42J3qK23
7954A11L8o9K6Oj57J28L8m2k59L3M22m55M07j93J15q4j03J53j38J82k52J72l0
7977D9Q3k37k4J16L4m1J4L6k0j20Q9k9K21k17o7J60J40k32J05n5J08j17j72N8
8001a18O9N3k4M9Jl8r7Q5O5o8J0J25j34J16j2n8Mj22O5%j26M4K01j01j16R8L8
8028Ij08k4m6K26j7L8j24L6l4M1K7P5p3L7l8q5J29N5j95j21K5K7J46m9J70l29
8054b02K46q2J26r9m2m1O9J27j38R2q7n0kQ2m0m5R3oJ13q0K1P8m9k81K40k7R%
8082B5K1n9M7M7n1Q7j4q3J6K22r7j61J00k9j21J14O5p9j44K22j68L9j25J69P7
$$ plain form
8107 120 23 164 -83 -119 -161 18 11 -46 15 113 24 -60 126 32 -58 -12 43 -234 -80 -93 -50 -31 24 -82 -105 -153 43
8134 43 46 47 -88 -24 -199 64 126 -57 -114 -62 174 -132 48 37 65 122 -135 -5 24 -125 -139 -46 -21 -45 175 -122
8160 -122 93 -16 -49 -53 -66 58 5 -19 -259 -13 -218 -4 -12 104 -193 -167 42 61 -15 19 -197 -25 -190 -163
8184 -163 26 -7 31 44 54 -63 -77
$$ packed form
8107A20r7J41k47l6m2J79pn7O1R8q9q4J86r4r0M6N5k77J54j3M3J9N5j06k3m8J96
8134D3LJj35O4j75K63O2j83n7N2K36l06J80j1K8N7k57J30K9j49j4R3K5k4K20k97
8160a22K15j09l3mj3J24n3k4k40K46k05K14qJ16k97K6K09J9p6L4k16J72j65K7
8184a63J89l3L8J3J0j17j4
8191g7
$$ Imaginary data points
##PAGE= N=2
##DATA TABLE= (X++(I..I)), XYDATA
$$ plain form
0 0 0 0 0 0 0 0 0 8 -8 8 -8 10 -16 16 -24 24 -32 35 -40 48 -57 67 -78 89 -103 118 -134 150 -172 193 -217
31 -217 243 -273 305 -339 377 -420 466 -517 573 -634 701 -776 859 -953 1058 -1178 1312 -1472
49 -1472 1656 -1876 2143 -2475 2901 -3471 4273 -5483 7519 -11580 22788 -115784 -397742 -119352
63 -119352 92974 -38857 -149589 3588 22880 -178942 -214066 11258 80101 -81141 -148312
74 -148312 -53725 -57955 -143435 -106436 -4983 -30964 -97405 -71357 -63673 -163984 -193440 -69006
86 -69006 10046 -65186 -119414 -75467 -79198 -150467 -115898 6793 7987 -116012 -161404 -103156
98 -103156 -82727 -90959 -35458 -66 -79369 -143827 -79700 -24269 -78384 -92894 -160 11454
110 11454 -111415 -138589 -9861 24528 -95872 -112473 24789 39469 -116093 -151016 -2832
$$ packed form
0@%%%%%%%Qj6J6j6J8k6L2m0M8n6O7p5Q8j05J24j45J67j92K21k52K84l22L65m10
31b17M60n16N78o44P16p97Q86r83J090j207J335j477J635j812K011k236K490k784
49a472L128l532M019m618N376o372P744r756J3002j9099L4368j38572k81958K78390
63a19352K12326j31831j10732J53177J9292k01822l5124K25324O8843j61242o7171
74a48312R4587m230q5480L6999J01453k5981o6441K6048P684j00311k9456J24434
86f9006P9052p5232n4228M3947l731p1269L4569J22691J194j23999m5392N8248
98a03156K0429q232N5501L5392p9303o4458O4127N5431n4115j4510R2734J1614
110A1454j22869k7174J28728L4389j20400j6601J37262J4680j55562l4923J48184
$$ plain form
121 -2832 51027 -56549 -79598 25461 31046 -82018 -89758 25507 59615 -13729 -41944 -14260
133 -14260 -25626 -42416 3728 40825 3853 -28599 -5580 1032 -26271 -6530 47794 34733
145 34733 -22988 -12388 44888 37011 -14561 -3610 49351 45269 -1451 -7467 17118 14742 6234
158 6234 31831 50775 22550 -7390 3295 19980 18394 30330 50615 26039 -20866 -7779
170 -7779 49437 51727 2474 -482 40493 31729 -16638 -5653 51166 49695 -3717 -6634 41133
183 41133 43814 -2430 -11557 25880 38403 11714 -2524 7483 9716 3082 7215 16783 17272 12488
197 12488 4521 -8015 -7878 15824 31998 12102 -14427 -8810 9862 5160 -7481 2281 14386
210 14386 -2330 -26501 -18603 9648 15394 -4473 -15563 -6561 2176 -1904 -8362 -6263 -1648 -2858
$$ packed form
121b832N3859j07576k3049J05059N585j13064p740J15265L4108p3344k8215K7684
133a4260j1366j6790M6144L7097l6972l2452K3019O612k7303J9741N4324j3061
145C4733n7721J0600N7276p877n1572J0951N2961m082m6720o016K4585k376q508
158F234K5597J8944k8225k9940J0685J6685j586J1936K0285k4576m6905J3087
170g779N7216K290m9253k956M0975q764m8367J0985N6819j471n3412k917M7767
183D1133K681m6244r127L7437J2523k6689j4238J0007K233o634M133R568M89m784
197A2488p967j2536J37K3702J6174j9896k6529N617J8672m702j2641R762J2105
210A4386j6716k4171P898K8251N746j9867j1090R002Q737m080o458K099M615j210
$$ plain form
224 -2858 -8853 -12495 -10989 -6961 -7358 -13149 -13615 -4030 -602 -16524 -30709 -16216 10203 7214 -22288
239 -22288 -31763 -11350 -1151 -14821 -18140 -619 123 -27043 -38088 -10111 14064 -1380 -27341
252 -27341 -25419 -6718 -2703 -12495 -15395 -8457 -5983 -12615 -18339 -14655 -6898 -5962 -14261 -18314 -8540
267 -8540 1164 -8226 -25752 -22034 2274 10348 -10262 -27284 -15600 577 -5308 -14895 -5261 4915
281 4915 -9244 -26415 -16213 7208 8912 -8782 -18729 -11644 -1016 1617 -3690 -8929 -5333 2142
295 2142 -782 -12076 -9534 6783 8289 -10429 -14817 6939 15870 -6952 -21667 -118 22204
308 22204 8567 -14962 -9938 9411 8925 -4197 -2358 10187 10001 -3223 -8575 1752 14747
321 14747 14429 1149 -8313 -66 15134 13099 -2573 -3259 13394 16842 -1509 -8903 9598 21508
$$ packed form
224b858n995l642J506M028l97n791m66R585L428j5922j4185J4493K6419k989k9502
239b2288r475K0413J0199j3670l319J7521P42k7166j1045K7977K4175j5444k5961
252b7341J922J8701M015r792k900O938K474o632n724L684P757R36q299m053R774
267h540R704r390j7526L718K4308Q074k0610j7022J1684J6177n885r587R634J0176
281D915j4159j7171J0202K3421J704j7694r947P085J0628K633n307n239L596P475
295B142k924j1294K542J6317J506j8718m388K1756Q931k2822j4715K1549K2322
308B2204j3637k3529N024J9349m86j3122J839J2545j86j3224n352J0327J2995
321A4747l18j3280r462Q247J5200k035j5672o86J6653L448j8351p394J8501J1910
$$ plain form
335 21508 5340 -9247 4596 21879 11564 -7797 -2734 16555 18409 3126 -4602 2634 10405
348 10405 9222 3470 2689 8117 11415 4042 -4944 1456 17240 15729 -4372 -10645 8822 20932
362 20932 4297 -10731 2285 18330 7619 -10534 -4281 14249 12322 -4953 -6996 8315 14334
375 14334 2030 -8774 -2283 10517 10624 -2362 -9397 -287 11077 6199 -7406 -5767 8992
388 8992 10100 -6754 -12568 4902 16028 582 -14361 -3154 13689 6812 -11204 -9191 7241
401 7241 9224 -4593 -10650 -385 7894 1992 -6636 -4848 4649 7264 -1949 -9762 -3412 8769
415 8769 6801 -7706 -10348 3906 10456 -3048 -12453 288 12621 1876 -13724 -6859 10885
428 10885 8969 -7162 -9589 4355 9697 -1264 -9087 -1832 7633 4160 -6053 -7108 2318 7868
$$ packed form
335B1508j6168j4587J3843J7283j0315j9361N063J9289J854j5283p728P236P771
348A0405j183n752p81N428L298p373q986O400J5784j511k0101o273J9467J2110
362B0932j6635j5028J3016J6045j0711j8153O253J8530j927j7275k043J5311O019
375A4334j2304j0804O491J2800J07j2986p035R110J1364m878j3605J639J4759
388H992J108j6854n814J7470J1126j5446j4943J1207J6843o877j8016K013J6432
401G241J983j3817o057J0265Q279n902q628J788R497K615r213p813O350J2181
415H769j968j4507k642J4254O550j3504r405J2741J2333j0745j5600O865J7744
428A0885j916j6131k427J3944N342j0961p823P255R465l473j0213j055R426N550
$$ plain form
442 7868 120 -8585 -3501 8241 6511 -7671 -10572 4119 11705 -1254 -11817 -1569 10975
455 10975 3222 -10831 -5217 8868 5973 -8372 -9292 3951 8475 -1525 -8043 -1915 5885 3686
469 3686 -4222 -6338 -215 5220 836 -6545 -4330 5152 5252 -6193 -9173 2791 9234 -2711 -12502
484 -12502 -2688 9723 3097 -9681 -5477 7266 5773 -6533 -7636 2920 6006 -2439 -7355 -1111
498 -1111 5559 3214 -3942 -5700 764 6271 1648 -6848 -4939 5227 6028 -5062 -7808 5134 10515
513 10515 -3457 -12782 -51 11934 2360 -10826 -3600 9625 5311 -7149 -5612 6287 7090
526 7090 -2907 -6205 609 5785 3253 -2554 -2795 3003 7129 1749 -7107 -4091 8044 8982 -3666
541 -3666 -7494 4889 10687 -2499 -10174 3231 13864 1411 -12750 -4320 11220 7299 -6263
$$ packed form
442G868p748q705N084J1742j730j4182k901J4691P586j2959j0563J0248J2544
455A0975p753j4053N614J4085k895j4345r20J3243M524j0000o518O128P800k199
469C686p908k116O123N435m384p381K215R482J00j1445k980J1964O443j1945r791
484a2502R814J2411o626j2778M204J2743j493j2306j103J0556L086q445m916O244
498a111O670k345p156j758O464N507m623q496J909J0166Q01j1090k746J2942N381
513A0515j3972r325J2731J1985r574j3186P226J3225m314j2460J537J1899Q03
526G090r997l298O814N176k532n807k41N798M126n380q856L016J2135R38j2648
541c666l828J2383N798j3186p675J3405J0633j2453j4161Q430J5540l921j3562
$$ plain form
554 -6263 -5779 5246 6522 -3254 -6733 382 6633 3743 -3930 -5843 890 6919 1064 -8628 -4464
569 -4464 8890 7555 -9249 -12905 4829 12683 -3446 -14091 -76 11274 -1734 -15696 -4689
582 -4689 11105 4828 -11228 -10671 1830 4671 -3603 -8585 -3867 2549 1664 -6319 -10897 -2712 6576
597 6576 708 -11729 -8626 6162 5401 -11457 -14401 3898 11909 -3925 -15807 -4074 8307
610 8307 146 -11688 -5486 7687 4648 -8889 -11615 -169 7698 2518 -7561 -7613 1699 5801
624 5801 -3689 -10717 -1030 10910 3179 -12832 -9034 8524 8617 -8322 -10640 6701 12251 -4379
638 -4379 -14680 -1756 12303 6300 -6571 -5939 3459 4691 -2335 -4750 2654 8933 4029 -7523
652 -7523 -8779 4506 12960 2374 -10061 -3083 10598 4837 -9793 -5318 10917 9854 -6655
$$ packed form
554f263M84J1025J276r776l479P115O251k890p673j913O733O029n855r692M164
569d464J3354j335j6804l656J7734P854j6129j0645J4015J1350j3008j3962J1007
582d689J5794o277j6056N57J2501K841q274m982M718O416q85p983m578Q185R288
597F576n868j2437L103J4788p61j6858k944J8299Q011j5834j1882J1733J2381
610H307q161j1834O202J3173l039j3537k726J1446P867n180j0079n2R312M102
624E801r490p028R687J1940p731j6011L798J7558R3j6939k318J7341N550j6630
638d379j0301J2924J4059o003j2871O32R398J232p026k415P404O279m904j1552
652g523j256J3285Q454j0586j2435O978J3681n761j4630M475J6235j063j6509
$$ plain form
665 -6655 -9447 3934 9182 -249 -6177 233 7250 4636 -3682 -6553 578 9183 6359 -4725 -6625
680 -6625 4050 7835 -2937 -7360 5584 12991 -1113 -13872 -3269 12803 7287 -7710 -6086
693 -6086 5876 5429 -5449 -6234 3208 6423 -748 -6067 -3211 1963 3238 -1445 -5928 -2257 6024
708 6024 4021 -7542 -9832 2716 9058 -1900 -9425 42 7249 -2712 -10952 -697 10343 2885
722 2885 -9910 -6645 4033 4717 -2080 -3921 -365 1119 255 -1435 -2947 -1045 2943 1087 -5084
737 -5084 -3739 5285 4804 -6980 -8702 4587 9778 -2162 -9294 -245 7022 -231 -5659 1226 6255
752 6255 -17 -5939 -1773 4416 4045 -388 -2607 -1337 2125 3943 642 -3733 -1152 4272 2563
767 2563 -3474 -1759 4350 2353 -5598 -3883 6221 6326 -4277 -7762 676 5786 463 -3639 -673
$$ packed form
665f655k792J3381N248r431n928O410P017k614q318k871P131Q605k824j1084j900
680f625J0675L785j0772m423J2944P407j4104j2759J0603J6072n516j4997J624
693f086J1962m47j0878p85R442L215p171n319K856N174J275m683m483L671Q281
708F024k003j1563k290J2548O342j0958p525R467P207r961q240J0255J1040p458
722B885j2795L265J0678O84o797j841L556J484q64j690j512J902L988j856o171
737e084J345R024m81j1784j722J3289N191j1940p132R049P267p253n428O885N029
752F255o272n922M166O189l71m433k219J270L462J818l301m375K581N424j709
767B563o037J715O109j997p951J715J0104J05j0603l485Q438N110n323m102K966
$$ plain form
782 -673 1447 -1208 -2945 -4 2372 1359 -1698 -3656 -2104 2603 3963 -2019 -6454 -1057 5139
797 5139 1170 -5466 -2159 3749 128 -5899 -1850 5097 1388 -6849 -5207 2920 4090 -2054 -5490
812 -5490 -2693 532 568 -705 -2516 -2383 -913 -1269 -3325 -1513 2895 1280 -6602 -7083 2518 6043
828 6043 -2225 -7940 -2138 3937 33 -4503 -1315 2475 -452 -4368 -1813 2497 1960 -2082 -4393
843 -4393 -2196 2779 4338 -1047 -6188 -2463 4716 3295 -3443 -3131 3541 2859 -4325 -3708 5502 6942
859 6942 -3425 -7330 1687 8615 2759 -4661 -2147 3837 3718 419 -355 2032 3201 1180 -983
874 -983 507 5080 5900 -425 -5043 1382 9275 5166 -4649 -2955 6649 6608 -2261 -3040 4907 6562
890 6562 -675 -3100 3406 6525 1823 -3026 -1198 4462 6014 2148 -3016 -2637 3710 6364 621
$$ packed form
782f73K120k655j737K941K376j013l057j958J552M707J360n982m435N397O196
797E139l969o636L307N908l621o027M049O947l709q237J642Q127J170o144l436
812e490K797L225L6j273j811J33J470l56k056J812M408j615p882m81R601L525
828F043q268n715N802O075l904m536L188L790k927l916K555M310n37m042k311
843d393K197M975J559n385n141L725P179j421o738L12O672o82p184O17R210J440
859F942j0367l905R017O928n856p420K514N984j19l299p74K387J169k021k163
874i83J490M573Q20o325m618O425P893m109r815J694R604m1q869p79P947J655
890F562p237k425O506L119m702m849J828N660J552l866n164L79O347K654n743
$$ plain form
905 621 -3399 1576 5921 -120 -5769 850 9614 4108 -7326 -5568 5524 7100 -1882 -5270 1378
920 1378 5161 -263 -4808 -1341 4104 2731 -3070 -4294 426 4084 345 -5327 -3696 3775 4871
935 4871 -3329 -7677 -1199 5237 957 -5851 -2941 3893 1213 -7093 -5152 3838 5105 -3348 -7800
950 -7800 -2423 3264 1013 -3809 -3810 48 1392 -1865 -5128 -2696 2602 2253 -4204 -6188 492 4074
966 4074 -2252 -7872 -1717 5726 1892 -7006 -6023 2632 3843 -3034 -5024 997 3616 -2145 -6401
981 -6401 -1983 4734 3770 -3139 -5718 -817 3504 1103 -2959 -1799 2782 2151 -3278 -4114 1984 5106
997 5106 186 -4716 -1355 4432 2975 -3259 -3228 2979 5238 160 -3697 -400 3599 1929 -1396 -309
1013 -309 3030 2498 -1877 -2793 1458 5386 3374 -2144 -3390 1568 4724 1527 -1845 515 4199 1901
$$ packed form
905F21m020M975M345o041n649O619Q764n506j1434J758J1092J576q982l388O648
920A378L783n424m545L467N445j373n801j224M720L658l739n672J631P471J096
935D871q200m348O478O436m280o808K910O834k680q306J941Q990J267q453m452
950g800N377N687k251m822jL858J344l257l263K432N298l49o457j984O680L582
966D074o326n620O155P443l834q898R83Q655J211o877j990O021K619n761m256
981f401M418O717r64o909k579M901M321k401m062J160M581o31n429q36O098L122
997E106m920m902L361N787j457o234L1O207K259n078l857L297L999j670l325J087
1013c09L339n32m375r16M251L928k012n518j246M958L156l197l372K360L684k298
$$ plain form
1029 1901 -2687 -877 4883 4257 -1627 -2943 2640 5078 614 -3354 -82 4677 3460 -1144 -1859
1044 -1859 1611 3045 445 -1156 1408 3033 622 -2100 -1148 3030 3902 40 -2975 -1076 2560
1059 2560 1953 -1333 -1276 1743 2023 -1515 -2136 1169 3020 -187 -2877 -552 2459 1096 -2009 -2017 1161
1076 1161 2084 164 -1400 -877 577 422 -841 -764 926 1303 -1096 -2730 -345 2858 1226 -2652
1092 -2652 -2574 1038 1805 -1186 -2293 636 1900 -969 -2975 -479 2478 575 -2746 -1998 1635 1803
1108 1803 -1231 -2346 -291 1815 463 -1651 -1337 1027 1217 -1110 -1835 555 2276 -10 -2774 -1251
1124 -1251 2476 2110 -1446 -2721 703 2684 -139 -2498 -154 2746 1017 -2395 -1113 2379 2248
1139 2248 -1208 -2244 637 3019 702 -2007 -985 2045 2527 -599 -1956 797 3116 1108 -2039
$$ packed form
1029A901m588J810N760o26n884j316N583K438m464l968L272M759j217m604p15
1044a859L470J434k600j601K564J625k411k722R52M178Q72l862l015J899L636
1059B560o07l286N7L019K80l538o21L305J851l207k690K325L011j363l105qL178
1076A161R23j920j564N23J454j55j263P7J690L77k399j634K385L203j632l878
1092b652P8L612P67k991j107K929J264k869k006K496K957j903l321P48L633J68
1108A803l034j115K055K106j352k114L14K364J90k327p25K390J721k286k764J523
1124a251L727l66l556j275L424J981k823k359K344K900j729l412J282L492j31
1139B248l456j036K881K382k317k709J022L030M82l126j357K753K319k008l147
$$ plain form
1154 -2039 -786 2976 2829 -1434 -2619 1516 4206 620 -3004 -339 3766 2270 -2356 -2169 2599
1169 2599 3483 -848 -3274 427 3592 1381 -2673 -1859 2362 2963 -698 -2770 119 3298 1470 -2755
1185 -2755 -2397 2116 3232 -1148 -3894 173 4290 967 -4187 -2242 3169 3017 -2921 -4006 934
1200 934 3493 -867 -4222 -1114 2789 1404 -3368 -3266 905 2906 -845 -4135 -1621 2637 1756 -3401
1216 -3401 -3967 946 3492 -1354 -5097 -1450 3332 1064 -4409 -3520 2404 2887 -2723 -4741 -23 3592
1232 3592 114 -4356 -2689 1900 1974 -2177 -3983 -387 3060 391 -4070 -3106 2583 3028 -2496 -4558
1248 -4558 360 4355 3 -5185 -2052 3996 2767 -3054 -3699 1957 3717 -746 -3726 -17 3769
1263 3769 1681 -2784 -2667 2156 3851 67 -3148 -708 3710 2364 -2433 -2479 2962 4798 -647 -3725
$$ packed form
1154b039J253L762j47m263j185M135K690l586l624K665M105j496m626J87M768
1169B599Q84m331k426L701L165k211m054Q14M221O01l661k072K889L179j828m225
1185b755L58M513J116m380k746M067M117l323n154J945N411j52n938j085M940
1200I34K559m360l355L108L903j385m772J02M171K001l751l290K514M258q81n157
1216c401n66M913K546m846l743L647M782k268n473Q89N924M83n610k018M718L615
1232C592l478m470J667M589P4m151j806L596L447k669m461R64N689M45n524k062
1248d558M918L995m352n188L133O048j229n821o45N656J760m463k980L709L786
1263C769k088m465J17M823J695l784l215K440M418j346m797m6N441J836n445l078
$$ plain form
1279 -3725 676 4785 1618 -2895 -828 3973 3273 -1540 -2313 1900 4141 1212 -1727 -399 3059
1294 3059 2940 -266 -1737 1301 4224 1418 -2545 -1352 3693 3801 -1415 -2588 2064 4474 -21
1309 -21 -3430 162 4355 1710 -2596 -1495 2786 2643 -1130 -2338 809 2599 875 -1807 -1316 1445
1325 1445 2015 -457 -2461 -394 2525 686 -2774 -1835 2180 2187 -2334 -3437 914 2854 -779 -3506
1341 -3506 -727 1953 -376 -2842 -1411 1041 496 -1862 -2303 -478 290 -264 -1549 -1929 -460 640
1357 640 -1036 -3016 -1271 1489 541 -2978 -2425 991 954 -2580 -2767 988 1629 -1913 -3391 -507 1526
1374 1526 -598 -2260 -828 824 -337 -1797 -1241 268 741 -222 -1137 -1183 75 645 -514 -1602 -127
1391 -127 1661 101 -2322 -945 1792 1424 -1572 -1137 1917 1652 -1803 -1879 1349 2285 -160 -1248 374
$$ packed form
1279c725M401M109l167m513K067M801p00m813p73M213K241k929k939J328L458
1294C059j19l206j471L038K923k806l963J193N045J08n216j173M652K410m495
1309b1l409L592M193k645m306J101M281j43l773j208L147J790j724k682M91K761
1325A445N70k472k004K067K919j839l460R39M015Pm521j103M351J940l633k727
1341c506K779K680k329k466J431K452n45k358m41J825P68n54j285l80J469J100
1357F40j676j980J745K760r48l519N53L416l7l534j87L755O41l542j478K884K033
1374A526k124j662J432J652j161j460N56J509M73r63r15m6J258N70j159j088J475
1391a27J788j560k423J377K737l68k996M35L054k65l455p6L228R36k445j088J622
$$ plain form
1408 374 1438 351 -503 37 972 1059 208 -800 -658 1321 2021 -120 -1500 686 2494 -65 -2488
1425 -2488 133 3127 1196 -2568 -1154 2656 1717 -1999 -1542 1669 2179 -824 -1860 384 1650 513
1441 513 -1085 -937 382 920 76 -1295 -693 1311 1026 -1624 -2202 885 2362 -538 -3041 -688 2195
1458 2195 619 -2512 -1468 1755 1014 -2114 -2507 564 1479 -665 -2252 -939 824 484 -1237 -1837
1474 -1837 -476 1165 500 -1946 -2132 742 1498 -1484 -2841 349 2669 -317 -3598 -1302 2504 1209
1490 1209 -2530 -2102 1280 1836 -1069 -2307 106 1872 287 -1814 -1048 1246 1733 -712 -2037 -156
1506 -156 2125 1414 -1391 -1597 1354 2295 -363 -1567 528 2327 688 -1477 -455 2141 1952 -591
1522 -591 -1041 1002 2504 998 -1141 -501 1918 2186 328 -974 430 2123 1040 -984 -211 2534
$$ packed form
1408C74J064j087q54N40R35Q7q51j008J42J979P00k141j380K186J808k559k423
1425b488K621K994j931l764J414L810r39l716M57L211N10l003j036K244J266j137
1441E13j598J48J319N38q44j371O02K004k85k650n78L087J477k900k503K353K883
1458B195j576l131J044L223p41l128l93L071R15k144j587J313J763l40j721o00
1474a837J361J641o65k446j86K874P56k982j357L190K320k986l281K296L806j295
1490A209l739M28L382N56k905j238K413J766j585k101P66K294M87k445j325J881
1506a56K281p11k805k06K951R41k658j204K095J799j639k165J022K596j89k543
1522e91m50K043J502j506k139O40K419K68j858j302J404J693j083k024P73K745
$$ plain form
1538 2534 2320 -454 -1665 1044 2923 1337 -1215 -336 2003 1816 -586 -1083 1232 2369 621 -1297
1554 -1297 -265 1902 1511 -940 -1180 1354 2342 114 -2119 -493 2055 1567 -892 -1034 687 1123
1570 1123 -792 -1335 173 1436 712 -1337 -1682 18 1383 219 -1414 -1213 852 960 -1357 -2051
1586 -2051 440 1503 -628 -2135 -628 1238 84 -1932 -1263 916 925 -995 -2147 -791 625 198
1602 198 -947 -1147 -322 154 -974 -1565 -455 1094 448 -1924 -1952 433 1522 -556 -1747 -354 1222
1619 1222 249 -1674 -804 936 933 -532 -1158 97 963 43 -1022 -221 1251 1293 -510 -1661 -211 1779
1637 1779 1150 -843 -695 1076 1149 -926 -1080 1650 2417 -137 -1760 42 2140 1230 -322 54 1453
1654 1453 1018 -287 -489 850 1546 777 -123 83 1072 1128 199 -242 691 1691 952 -373 -346 915 1375
$$ packed form
1538B534k14k774j211K709J879j586k552Q79K339j87k402m97K315J137j748j918
1554a297J032K167l91k451k40K534R88k228k233J626K548m88k459j42J721M36
1570A123j915n43J508J263p24k049l45J700J365j164j633K01K065J08k317o94
1586b051K491J063k131j507J507J866j154k016O69K179Rj920j152J356J416m27
1602A98j145k00Q25M76j128n91J110J549o46k372k8K385J089k078j191J393J576
1619A222r73j923Q70J740lj465o26J255Q66r20j065Q01J472M2j803j151J450J990
1637A779o29j993J48J771P3k075j54K730P67k554j623J802K098r10j552L76J399
1654A453m35j305k02J339O96p69r00K06R89N6r29m41R33J000p39j325K7J261M60
$$ plain form
1673 1375 335 27 644 685 -121 -326 445 1488 1067 -431 -823 61 1153 539 -313 -129 434 367 -435
1692 -435 -624 436 1088 -136 -1040 -50 1284 37 -1163 -589 1173 794 -1009 -1467 149 615 -491
1709 -491 -1064 496 604 -841 -1963 -609 1136 502 -963 -1421 -339 38 -338 -890 103 483 -381 -1375
1727 -1375 -988 431 637 -715 -1547 -237 676 -391 -1497 -630 656 301 -856 -1280 139 456 -566
1744 -566 -1010 3 887 57 -996 -1179 350 1371 201 -1243 -747 703 676 -685 -616 992 1401 -837
1762 -837 -1739 386 2130 725 -1500 -847 1549 1516 -987 -1315 1052 2081 203 -1444 82 1893
1778 1893 1069 -991 -954 1327 1907 -274 -1863 -116 2303 1475 -910 -1313 1165 1806 -136 -1494 651
1795 651 2229 452 -1804 -667 1910 1750 -626 -1602 483 1797 592 -1583 -655 1449 1434 -728
$$ packed form
1673A375j040l08O17M1q06k05P71J043m21j498l92Q84J092o14q52J84N63o7q02
1692d35j89J060O52j224r04R90J334j247j200N74J762l79j803m58J616M66j106
1709d91n73J560J08j445j122J354J745o34j465m58J082L77l76n52R93L80q64r94
1727a375L87J419K06j352q32J310R13j067j106Q67J286l55j157m24J419L17j022
1744e66m44J013Q84q30j053j83J529J021j170j444M96J450k7j361O9J608M09k238
1762h37r02K125J744j405k225O53K396l3k503l28K367J029j878j647J526J811
1778A893q24k060L7K281N80k181j589J747K419q28k385m03K478O41j942j358K145
1795F51J578j777k256J137K577j60k376r76K085J314j205k175R28K104j5k162
$$ plain form
1811 -728 -1537 435 1999 39 -1929 -539 2130 1404 -1666 -2258 694 2624 154 -2271 -815 1739
1827 1739 820 -2060 -1482 1388 1775 -1190 -2486 -208 2087 531 -1995 -1394 887 1288 -832 -2107
1843 -2107 -64 1729 110 -2036 -1353 1287 1190 -1194 -2155 539 1910 -177 -2371 -966 1731 1276
1859 1276 -1328 -1497 386 1177 -281 -1631 -433 1403 877 -1497 -1626 555 1659 -51 -1809 -473
1875 -473 1458 751 -1239 -1399 934 1750 -516 -1825 -111 1774 589 -1478 -766 1525 1448 -576 -1229
1892 -1229 557 1687 631 -1070 -433 1195 1166 -544 -952 722 1504 195 -1334 -310 1351 1164
1908 1164 -474 -699 802 1318 -59 -908 193 1233 562 -614 -400 742 787 77 -657 219 1077 372
1926 372 -822 -712 371 923 -230 -739 21 680 74 -978 -86 811 546 -548 -656 180 535 71
$$ packed form
1811g28q09J972J564j960j968J390K669p26l070n92K952J930k470k425J456K554
1827A739r19k880N78K870L87k965j296K278K295j556k526O01K281M01k120j275
1843b107K043J793j619k146O83K640r7k384r61K694J371k087k194J405K697m55
1859A276k604j69J883P91j458j350J198J836n26k374j29K181J104j710j758J336
1875d73J931p07j990j60K333Q16k266j309J714J885j185k067P12K291p7k024o53
1892a229J786J130j056j701O37J628k9j710m08J674P82j309j529J024J661j87
1908A164j638k25J501N16j377q49J101J040o71j176K14J142M5p10p34Q76Q58p05
1926C72j194J10J083N52j153n09P60O59o06j052Q92Q97k65j094j08Q36L55m64
$$ plain form
1944 71 -484 51 207 96 -518 -617 68 407 -240 -694 -515 273 -266 -636 -518 358 451 -444 -796 46 288
1965 288 -307 -508 34 30 -467 -703 -302 108 80 -277 -405 -286 -320 -175 -247 -229 135 -118 -473 -505 -57 291
1987 291 -253 -317 22 152 -304 -532 52 526 163 -404 -223 194 76 -56 239 371 54 -179 -391 -6
2007 -6 216 493 400 -108 -59 167 289 -157 -53 749 603 -331 -735 303 899 370 -472 386 891 106 -722
2028 -722 -20 924 523 117 -254 -107 168 208 257 244 274 391 94 -581 -324 995 685 -219 -571 407 492
2049 492 -503 -786 328 1132 -10 -810 -40 506 21 -301 26 359 -165 -325 -271 -416 -30 485 391 -654
2069 -654 -966 112 528 -578 -802 359 731 -739 -1678 -48 913 -130 -1285 -559 485 -286 -983
2086 -983 -498 196 0 -256 -526 -436 -302 106 7 -825 -592 266 343 -1128 -1073 370 884 -665 -1606 -201
$$ packed form
1944G1n55N35J56j11o14r9O85L39o47m54J79P88n39l70J18Q76R3q95l52Q42K42
1965B88n95k01N42mm97k36M01M10k8l57j28J19l4J45p2J8L64k53l55l2M48L48
1987B91n44o4L39J30m56k28N84M74l63n67J81M17j18j32K95J32l17k33k12L85
2007fK22K77r3n08M9K26J22m46J04Q02j46r34m04J038N96n29q42Q58N05p85q28
2028g22P02R44m01m06l71J47K75M0M9j3L0J17k97o75K57J319l10r04l52R78Q5
2049D92r95k83J114Q04j142q00P70N46m85l22L27L33n24j60N4j45L86N15r4j045
2069f54l12J078M16j106k24J161L72j470r39J630R61j043j155P26J044p71o97
2086i83M85O94j96k56k70R0J34M08r9q32K33Q58P7j471N5J443N14j549r41J405
$$ plain form
2106 -201 949 -216 -1210 -235 780 18 -1086 -524 554 567 -198 -622 -348 0 371 -56 -601 -98 659
2125 659 110 -649 -910 712 1403 -139 -961 270 1268 98 -1112 36 1504 746 -676 -504 828
2142 828 844 176 -387 323 1002 537 -308 -450 812 1406 574 -654 -98 1323 1204 -244 -468 936 1488
2161 1488 -36 -931 245 1565 871 -812 -402 1045 1052 -271 -604 355 1156 547 -434 -281 818 1078
2179 1078 -7 -1088 -38 1268 597 -776 -621 1064 1101 -730 -1249 194 1473 295 -921 -371
2195 -371 774 454 -741 -773 474 1225 -48 -1218 -698 749 727 -653 -1184 91 928 -253 -1557
2212 -1557 -377 1199 397 -1257 -1119 294 670 -615 -1304 96 710 -155 -1296 -997 304 547 -533
2229 -533 -916 -254 330 -340 -1030 -648 377 748 -672 -1553 -138 877 167 -1273 -623 671 302 -974
$$ packed form
2106b01J150j165r94R75J015p62j104N62J078J3p65m24K74L48L71m27n45N03P57
2125F59n49p59k61J622O91j542q22J231R98j170j210J148J468p58j422J72J332
2142H28J6o68n63P10O79m65q45j42J262N94q32j228N56J421j19j448k24J404N52
2161A488j524q95J176J320o94j683M10J447Pj323l33R59Q01o09r81J53J099K60
2179A078j085j081J050J306o71j373J55J685L7j831n19J443J279j178j216N50
2195c71J145l20j195l2J247P51j273j170N20J447k2j380n31J275Q37j181j304
2212a557J180J576q02j654J38J413L76j285o89J400O14q65j141K99J301K43j080
2229e33l83O62N84o70o90L82J025L71j420q81J415J015p10j440O50J294l69j276
$$ plain form
2247 -974 -779 419 633 -329 -914 -91 482 198 -565 -369 454 667 -128 -641 -141 906 592 -296 -560
2266 -560 489 722 26 -545 514 1147 135 -753 -120 821 795 -75 -166 553 684 73 -139 456 778 450
2286 450 -24 225 473 537 151 -181 349 900 433 -429 -145 510 667 72 -157 121 552 102 -528 382
2306 382 673 383 -553 -457 528 667 -7 -438 264 470 -120 -378 -108 776 327 -766 -384 244 389 -320
2326 -320 -612 52 578 -47 -838 -525 356 209 -677 -511 -3 57 -617 -800 -134 748 45 -879 -868 12 176
2347 176 -454 -711 -178 67 -291 -949 -457 201 460 -622 -981 -345 357 -8 -927 -422 171 564 -769
2366 -769 -1127 -163 622 116 -1092 -540 529 173 -1026 -910 533 924 -260 -1191 -461 845 391 -851
2384 -851 -453 569 696 -457 -967 71 1311 387 -948 -311 529 845 -220 -682 289 1129 151 -597
$$ packed form
2247i74J95J198K14r62n85Q23N73k84p63J96Q23K13p95n13N00J047l14q88k64
2266e60J049K33o96n71J059O33j012q88O33R41k6q70r1P19J31o11k12N95L22l28
2286D50m74K49K48O4l86l32N30N51m67q62K84O55J57n95k29K78M31m50o30R10
2306C82K91k90r36R6R85J39o74m31P02K06n90k58K70Q84m49j093L82O28J45p09
2326c20k92O64N26o25p91L13Q81j47q86J66N08O0o74j83O66Q82p03r24J1Q80J64
2347A76o30k57N33K45l58o58M92O58K59j082l59O36P02l65r19N05N93L93j333
2366g69l58R64P85n06j208N52J069l56j199J16J443L91j184r31P30J306m54j242
2384h51L98J022J27j153n10J038J240r24j335O37Q40L16j065m62R71Q40r78p48
$$ plain form
2402 -597 -102 914 825 -246 -503 621 1062 327 -733 65 1152 1040 -252 -658 521 1096 475 -403
2420 -403 46 899 744 -414 -539 764 1274 134 -755 -310 1329 601 -416 -439 561 1130 -271 -989
2438 -989 45 1146 309 -1037 -521 639 595 -485 -913 172 894 151 -1024 -691 361 606 -418
2455 -418 -941 114 714 -74 -1232 -479 563 385 -929 -1269 -192 741 32 -1037 -625 372 40 -775
2473 -775 -931 76 381 -398 -986 -369 351 152 -865 -1114 151 840 -129 -1037 -507 379 249 -636 -868
2492 -868 185 468 -366 -967 -9 704 -52 -847 -623 416 671 -61 -708 -109 353 66 -505 -372 399
2511 399 588 -92 -454 -40 816 57 -380 -310 673 732 -110 -613 347 820 243 -286 116 766 473 -173 -47
2532 -47 480 628 199 -142 41 684 691 283 -130 216 614 395 -12 144 793 426 -206 -191 465 817 78
$$ packed form
2402e97M95J016q9j071k57J124M41p35j060P98J087j12j292m06J179N75o21q78
2420d03M49Q53j55j158j25J303N10j140q89M45J639p28j017k3J000N69j401p18
2438i89J034J101q37j346N16J160m4j080m28J085P22p43j175L33J052K45j024
2455d18n23J055O00p88j158P53J042j78j314l40J077R33p09j069M12R97l32q15
2473g75j56J007L05p79n88O17P20j99j017k49J265O89r69r08N30Q86j30q85k32
2492h68J053K83q34o01R58P13p56p95K24J039K55p32o47N99M62k87n71J33P71
2511C99J89o80l62M14Q56p59m37P0R83N9q42n03R60M73n77n29M02O50k93o46J26
2532d7N27J48m29l41J83O43Pm08m13L46L98k19m07J56O49l67o32J5O56L52p39
$$ plain form
2553 78 -379 117 721 418 -177 15 522 288 110 -165 196 186 12 -260 -151 55 219 -34 -390 -196 83
2574 83 35 -488 -500 -24 54 -140 -457 -29 49 -192 -712 -318 -41 -162 -586 -426 -38 -139 -484 -612 -321 -217
2596 -217 -504 -380 -177 -312 -482 -399 -286 -239 -33 -125 -455 -413 -257 -155 -411 -327 30 84 -590 -561 -56 121
2618 121 -205 -673 -199 128 -25 -305 -304 198 96 -208 -441 -9 199 -190 -192 -76 143 317 -151 -380 66
2639 66 429 -43 -362 -163 341 241 -347 -237 410 626 -181 -464 124 694 384 -99 61 472 377 -21 -165
2660 -165 339 760 333 -196 79 609 527 44 -210 522 899 254 -484 41 1093 824 -200 -179 380 668
2680 668 48 -266 167 765 512 -229 -446 473 740 23 -361 -348 523 484 -523 -564 416 701 -223 -780 -221
2701 -221 695 58 -766 -444 466 382 -430 -548 -139 445 135 -720 -560 275 270 -552 -789 -37 553 74 -1040
$$ packed form
2553G8m57M96O04l03n95J92N07k34j78k75L61j0j74k72J09K06J64k53l56J94K79
2574H3m8n23j2M76P8j94l17M28P8k41n20L94K77j21m24J60L88j01l45j28K91J04
2596b17k87J24K03j35j70Q3J13M7K06r2l30M2J56J02k56Q4L57N4o74K9N05J77
2618A21l26m68M74L27j53k80JN02j02l04k33M32K08l89kJ16K19J74m68k29M46
2639F6L63m72l19J99N04j00n88J10O47K16q07k83N88N70l10m83J60M11r5l98j44
2660a65N04M21m27n29K75N30q2m83k54P32L77o45p38N25J052k69j024K1N59K88
2680F68o20l14M33N98k53p41k17R19K67p17l84J3Q71l9j007m1R80K85r24n57N59
2701b21R16o37q24L22R10q4q12j18M09N84l10q55J60Q35nq22k37P52N90m79j114
$$ plain form
2722 -1040 -680 491 702 -656 -1118 57 489 -376 -1209 -30 750 71 -888 -808 194 775 -211 -781
2740 -781 -352 130 226 -422 -610 223 755 -138 -879 -696 591 593 -624 -484 629 721 -554 -1086 92 965
2760 965 346 -698 -570 528 654 -360 -495 309 864 259 -448 -230 454 677 120 -269 335 826 361
2779 361 -701 -306 1119 1078 -97 -710 309 1077 262 -433 312 899 502 -543 -532 518 812 63 -461
2798 -461 -42 840 414 -446 -195 464 778 47 -665 -83 745 295 -413 -258 724 566 -238 -591 127 873
2818 873 321 -560 -424 345 415 -396 -444 197 794 15 -650 -421 320 249 -405 -582 27 599 2 -777 -178
2839 -178 454 222 -542 -518 158 525 -208 -912 -314 318 -35 -566 -451 26 312 -352 -582 -146 149 -129
2859 -129 -628 -544 293 212 -472 -575 21 171 -162 -452 -44 388 -137 -429 -321 48 112 -179 -332 -32 155
$$ packed form
2722a040L60J171K11j358m62J175M32q65q33J179P80o79r59Q0J002N81r86n70
2740g81M29M82R6o48j88Q33N32q93p41J83J287Kj217J40J113R2j275n32J178Q73
2760I65o19j044J28J098J26j014j35Q04N55o05p07K18O84K23n57l89O04M91m65
2779C61j062L95J425m1j175o13J019P68q15o95P45N87l97j045J1J050K94p49n24
2798d61M19Q82m26q60K51O59L14p31p12N82Q28m50p08J55R82j58q04l53P18P46
2818H73n52q81J36P69P0q11m8O41N97p79o65K29P41p1o54j77O09N72n97p79N99
2839a78O32k32p64K4O76L67p33p04N98O32l53n31J15M77K86o64k30M36K95k78
2859a29m99Q4Q37q1o84j03N96J50l33k90M08M32n25k92J08L69O4k91j53L00J87
$$ [...]
8191d3
##END NTUPLES=NMR FID
##END=
