##TITLE=1H_PhEPA1407A1
 D2O,8 sc, 
 21.9.2021
##JCAMPDX= 6.0         $$ Bruker NMR JCAMP-DX V2.0
##DATA TYPE= NMR FID
##DATA CLASS= NTUPLES
##ORIGIN= UXNMR, Bruker Analytische Messtechnik GmbH
##OWNER= root
$$ XWIN-NMR		Version 3.5
$$ Tue Sep 21 12:36:01 2021 Russian Standard Time (UT+4h)  she@DPX200
##.OBSERVE FREQUENCY= 200.1314
##.OBSERVE NUCLEUS= ^1H
##.DELAY= (6, 6)
##.ACQUISITION MODE= SIMULTANEOUS
##.ACQUISITION SCHEME= undefined
##.AVERAGES= 8
##.DIGITISER RES= 18
##SPECTROMETER/DATA SYSTEM= spect
##.PULSE SEQUENCE= zg30
##.SOLVENT NAME= D2O
##.SHIFT REFERENCE= (INTERNAL, D2O, 0, 15.7039)
##AUDIT TRAIL= $$ (NUMBER, WHEN, WHO, WHERE, WHAT)
$$ ##TITLE= Audit trail, XWIN-NMR		Version 3.5
$$ ##JCAMPDX= 5.01
$$ ##ORIGIN= Bruker BioSpin GmbH
$$ ##OWNER= she
$$ F:/spectra/data/she/nmr/H-F/1/audita.txt
$$ ##AUDIT TRAIL=  $$ (NUMBER, WHEN, WHO, WHERE, WHAT)
(   1,<2021-09-21 12:34:22.21 +0400>,<she>,<DPX200>,
      <created by zg, POWCHK disabled, PULCHK disabled
       configuration hash MD5:
       00 E9 B6 7A A2 85 ED C7 34 08 36 98 17 FE 4E 26
       data hash MD5: 16K
       E8 9F 65 96 AC 61 AE 20 D2 C3 D1 5F EB AC 0B 8D>)
$$ ##END=
$$ 
$$ hash MD5
$$ EE 1D E5 AA 51 F0 E0 F7 85 AE C7 87 C6 FB 7D 85
##$RELAX= 
##$RELAX= 
##$RELAX= 
##$RELAX= 
##$RELAX= 
##$RELAX= 
$$ Bruker specific parameters
$$ --------------------------
##$DU= <F:/spectra>
##$EXPNO= 1
##$NAME= <H-F>
##$PROCNO= 1
##$TYPE= <nmr>
##$USER= <she>
##$AMP= (0..31)
100 100 100 100 100 100 100 100 100 100 100 100 100 100 100 100 100 100 
100 100 100 100 100 100 100 100 100 100 100 100 100 100 
##$AQSEQ= 0
##$AQ_mod= 1
##$AUNM= <au_zg>
##$AUTOPOS= <>
##$BF1= 200.13
##$BF2= 200.13
##$BF3= 200.13
##$BF4= 200.13
##$BF5= 200.13
##$BF6= 200.13
##$BF7= 200.13
##$BF8= 200.13
##$BYTORDA= 1
##$CFDGTYP= 0
##$CFRGTYP= 5
##$CHEMSTR= <none>
##$CNST= (0..31)
1 1 145 1 1 1 1 1 1 1 1 1 1 1 1 1 1 1 1 1 1 1 1 1 1 1 1 1 1 1 1 1 
##$CPDPRG= <>
##$CPDPRG1= <>
##$CPDPRG2= <>
##$CPDPRG3= <>
##$CPDPRG4= <mlev>
##$CPDPRG5= <mlev>
##$CPDPRG6= <mlev>
##$CPDPRG7= <mlev>
##$CPDPRG8= <mlev>
##$CPDPRGB= <>
##$CPDPRGT= <>
##$D= (0..31)
0 1.2 0 0 0 0 0 0 0 0.06 0 0.03 0 0 0 0 0.0002 0 0 0 0 0 0 0 0 0 0 0 0 
0 0 0 
##$DATE= 1632213261
##$DBL= (0..7)
120 120 120 120 120 120 120 120 
##$DBP= (0..7)
150 150 150 150 150 150 150 150 
##$DBP07= 0
##$DBPNAM0= <>
##$DBPNAM1= <>
##$DBPNAM2= <>
##$DBPNAM3= <>
##$DBPNAM4= <>
##$DBPNAM5= <>
##$DBPNAM6= <>
##$DBPNAM7= <>
##$DBPOAL= (0..7)
0.5 0.5 0.5 0.5 0.5 0.5 0.5 0.5 
##$DBPOFFS= (0..7)
0 0 0 0 0 0 0 0 
##$DE= 6
##$DECBNUC= <off>
##$DECIM= 32
##$DECNUC= <off>
##$DECSTAT= 4
##$DIGMOD= 1
##$DIGTYP= 9
##$DL= (0..7)
0 120 120 120 120 120 120 120 
##$DP= (0..7)
150 150 150 150 150 150 150 150 
##$DP07= 0
##$DPNAME0= <>
##$DPNAME1= <>
##$DPNAME2= <>
##$DPNAME3= <>
##$DPNAME4= <>
##$DPNAME5= <>
##$DPNAME6= <>
##$DPNAME7= <>
##$DPOAL= (0..7)
0.5 0.5 0.5 0.5 0.5 0.5 0.5 0.5 
##$DPOFFS= (0..7)
0 0 0 0 0 0 0 0 
##$DQDMODE= 0
##$DR= 18
##$DS= 0
##$DSLIST= <SSSSSSSSSSSSSSS>
##$DSPFIRM= 0
$$ [...]
##$SUBNAM2= <"">
##$SUBNAM3= <"">
##$SUBNAM4= <"">
##$SUBNAM5= <"">
##$SUBNAM6= <"">
##$SUBNAM7= <"">
##$SUBNAM8= <"">
##$SUBNAM9= <"">
##$SW= 20.0188988654967
##$SWIBOX= (0..15)
0 0 2 0 0 0 0 0 0 0 0 0 0 0 0 0 
##$SW_h= 4006.41025641026
##$TD= 16384
##$TD0= 1
##$TE= 0
##$TE2= 300
##$TE3= 300
##$TEG= 300
##$TL= (0..7)
0 120 120 120 120 120 120 120 
##$TP= (0..7)
150 150 150 150 150 150 150 150 
##$TP07= 0
##$TPNAME0= <>
##$TPNAME1= <>
##$TPNAME2= <>
##$TPNAME3= <>
##$TPNAME4= <>
##$TPNAME5= <>
##$TPNAME6= <>
##$TPNAME7= <>
##$TPOAL= (0..7)
0.5 0.5 0.5 0.5 0.5 0.5 0.5 0.5 
##$TPOFFS= (0..7)
0 0 0 0 0 0 0 0 
##$TUNHIN= 0
##$TUNHOUT= 0
##$TUNXOUT= 0
##$USERA1= <user>
##$USERA2= <user>
##$USERA3= <user>
##$USERA4= <user>
##$USERA5= <user>
##$V9= 5
##$VALIST= <valist>
##$VCLIST= <CCCCCCCCCCCCCCC>
##$VD= 0
##$VDLIST= <DDDDDDDDDDDDDDD>
##$VPLIST= <PPPPPPPPPPPPPPP>
##$VTLIST= <TTTTTTTTTTTTTTT>
##$WBST= 1024
##$WBSW= 4
##$XGAIN= (0..3)
0 0 0 0 
##$XL= 0
##$YL= 0
##$YMAX_a= 152668
##$YMIN_a= -146023
##$ZGOPTNS= <>
##$ZL1= 120
##$ZL2= 120
##$ZL3= 120
##$ZL4= 120
##$ABSF1= 10
##$ABSF2= 0
##$ABSG= 5
##$ABSL= 3
##$ALPHA= 0
##$AQORDER= 0
##$ASSFAC= 0
##$ASSFACI= 0
##$ASSFACX= 0
##$ASSWID= 0
##$AUNMP= <proc_1d>
##$AZFE= 0.1
##$AZFW= 0.1
##$BCFW= 1
##$BC_mod= 2
##$BYTORDP= 1
##$COROFFS= 0
##$CY= 11.3945322036743
##$DATMOD= 1
##$DC= 2
##$DFILT= <>
##$DTYPP= 0
##$F1P= 2.36226072786647
##$F2P= -0.459571619588291
##$FCOR= 0.5
##$FTSIZE= 0
##$FT_mod= 4
##$GAMMA= 1
##$GB= 0.15
##$INTBC= 1
##$INTSCL= 1
##$ISEN= 128
##$LB= 0.24
##$LEV0= 0
##$LPBIN= 0
##$MAXI= 10000
##$MC2= 0
##$MEAN= 0
##$ME_mod= 0
##$MI= 1.114404
##$NCOEF= 0
##$NC_proc= 0
##$NLEV= 6
##$NOISF1= 3.799351
##$NOISF2= 2.8
##$NSP= 1
##$NTH_PI= 0
##$NZP= 0
##$OFFSET= 15.70392
##$PC= 1
##$PHC0= -14242.23
##$PHC1= 14.0009
##$PH_mod= 1
##$PKNL= yes
##$PPARMOD= 0
##$PSCAL= 0
##$PSIGN= 0
##$REVERSE= no
##$SF= 200.130013532006
##$SI= 16384
##$SIGF1= 3
##$SIGF2= 2
##$SINO= 400
##$SIOLD= 16384
##$SREGLST= <1H.CDCl3>
##$SSB= 0
##$STSI= 0
##$STSR= 0
##$SW_p= 3612.71676300578
##$SYMM= 0
##$S_DEV= 0
##$TDeff= 0
##$TDoff= 0
##$TI= <>
##$TILT= no
##$TM1= 0
##$TM2= 0
##$TOPLEV= 0
##$USERP1= <user>
##$USERP2= <user>
##$USERP3= <user>
##$USERP4= <user>
##$USERP5= <user>
##$WDW= 1
##$XDIM= 8192
##$YMAX_p= 0
##$YMIN_p= 0
$$ End of Bruker specific parameters
$$ ---------------------------------
##NTUPLES= NMR FID
##VAR_NAME=  TIME,          FID/REAL,        FID/IMAG
##SYMBOL=    X,             R,               I
##VAR_TYPE=  INDEPENDENT,   DEPENDENT,       DEPENDENT
##VAR_FORM=  AFFN,          ASDF,            ASDF
##VAR_DIM=   8192,          8192,            8192
##UNITS=     SECONDS,       ARBITRARY UNITS, ARBITRARY UNITS
##FACTOR=    0.0002496,     1,               1
##FIRST=     0,             0,               0
##LAST=      2.0444736,     0,               0
##MIN=       0,             -146023,         0
##MAX=       2.0444736,     152668,          0
$$ Real data points
##PAGE= N=1
##DATA TABLE= (X++(R..R)), XYDATA
$$ [...]
2037a064l007j023J033K288L251K664R60j348k685k911k502p48J547K970K882
2052B307K084M57j525l306k922j620q9J664L276L004J275l28j849l038l093j138
2068d841P45K143L096K663J043j088k431k876k454r31J380K731K806K190O16j509
2084C283k888k895j626m37J505L107K883J411j8j715k932k901j249N54J809K898
2100G89K884R33q57k066k816k574r03J126K538K597K228P31j343k503k926j668
2116c830o11J394K902K781J409J81j496k965k707j285L11J645K694K805J066n17
2132C777j948k707k474j100Q97K220K526K322Q65j099k301k718k062n02J099K786
2148d19K525J585M89j371k775k616j323oJ309K730K770J123l11j646k696k447
$$ y = [-1064, -4071, -5094, -4061, -1773, 1478, 4142, 5102, 3754, 1069, -1842, -4344, -5092, -3545, -575, 2307, 4391, 4848, 3323, 17, -2905, -4525, -4614, -2950, 326, 3330, 4605, 4277, 2428, -610, -3703, -4841, -4096, -1953, 1143, 3806, 4849, 3761, 1330, -1546, -4000, -4931, -3551, -820, 1986, 4176, 4792, 3283, 395, -2500, -4126, -4563, -3058, 49, 2932, 4343, 4325, 2610, -322, -3223, -4472, -3918, -2109, 789, 3673, 4606, 3749, 1683, -1133, -3707, -4610, -3484, -946, 1651, 3879, 4610, 3267, 764, -2162, -3830, -4441, -3047, -145, 2636, 4045, 4226, 2730, -235, -2942, -4227, -3916, -2271, 423, 3228, 4294, 3777, 1829, -878, -3352, -4452, -3555, -1335, 1191, 3513, 4378, 3279, 978, -1740, -3802, -4304, -3205, -419, 2106, 3691, 4180, 2809, 34, -2582, -3905, -3911, -2602, 128, 2898, 4021, 3710, 2064, -632, -3079]
2164c079j039N33J881K544K309J112r80k025k459k196p73R52K544K443J728O84
2180D179j383k450k368j687r6J272K555K507J108M8j441k619k344j172M51J732
2196a708K183K585R46p56j783k335k278q58Q87K169K294J887Q74j168k434k219
2212a714j699m11J151K260K673J248M4j029k591k475j054J65J379K384K328J107
2228C766o84j422k273k297r32O32J877K434J805Q82q88k129k082j822p06J206
2244b633K097K246J438K79r03k447k297j188j37J408K293K218J165l61j434k086
2260c42k377q20M80J569K364J821J011p24k062j832j929q66J065J900K215J599
2276C072K88p70k212k235j091n03J272K202K036J259j85j202k068k244r22L54
$$ y = [-3079, -4118, -3585, -1704, 840, 3149, 4261, 3281, 1256, -1203, -3399, -4172, -3220, -676, 1767, 3495, 4179, 2796, 346, -2022, -3709, -3805, -2533, 22, 2529, 3637, 3685, 2244, -375, -2719, -3891, -3440, -1708, 475, 3060, 4006, 3250, 1467, -868, -3146, -4004, -3117, -948, 1346, 3233, 4107, 2939, 505, -1714, -3413, -3824, -2673, -413, 2260, 3508, 3552, 2523, -68, -2543, -3597, -3432, -2053, 331, 2659, 3766, 3082, 1660, -613, -2910, -3842, -3210, -1333, 1101, 2906, 3788, 2900, 771, -1311, -3133, -3839, -2633, -536, 1710, 3148, 3427, 2524, 77, -2220, -3408, -3545, -2137, 156, 2374, 3539, 3178, 1744, -342, -2719, -3539, -3059, -1490, 874, 2695, 3706, 2982, 920, -912, -2841, -3707, -2642, -742, 1473, 3072, 3360, 2590, 378, -1857, -2948, -3451, -2179, 23, 2059, 3318, 3133, 1931, -137, -2381, -3303, -2949]
2292b949J425K210J867R49o69j715j939j789r41R92J599K116J630M80o64k171
2308D31k015j157m56R18K235J929J167J08j167j891k269r65L82P73K384J836Q50
2325C093k11j457k007j859j044R37J553J912J853M19o70j681k129j229p48Q24
2341b444K061J801J397K40j006j703k184j047J43P06K166J981Q04r7j288j849
2357c19j696j209Q01J178J761J871O79n58j572j967j335p41N40K158J496J493
2373B580M37r89j462k118j234J08N96K051J894P89J79j218j764j747j103N24J177
2390a300J480K032O97l77j397j904j529o73N28J842J522J348O70r17j482j716
2406a176j328j28M23J892J975Q02K84r77j741j698j163L22J030J517J960P81m59
$$ y = [-2949, -1524, 686, 2553, 3502, 2833, 1118, -821, -2610, -3551, -2559, -960, 1156, 2786, 3266, 2602, 431, -1584, -2741, -3197, -2279, -44, 1885, 3052, 3160, 1993, 102, -2167, -3132, -2750, -1977, 407, 2243, 3093, 2882, 1425, -582, -2441, -3485, -2548, -995, 917, 2770, 3189, 2519, 838, -1291, -2520, -3268, -2444, -383, 1418, 2815, 3055, 2049, 346, -1838, -2885, -2742, -2036, 130, 2111, 2915, 2818, 1530, -319, -2015, -3224, -2423, -1245, 516, 2387, 3066, 2508, 936, -1031, -2366, -3107, -2567, -409, 1087, 2580, 3017, 2028, 566, -1552, -2786, -2678, -2082, -31, 1863, 2652, 2831, 1613, -151, -1898, -3001, -2477, -1300, 180, 2212, 2909, 2532, 1135, -769, -2298, -2971, -2443, -601, 921, 2269, 2939, 2022, 540, -1176, -2504, -2632, -2209, -317, 1658, 2460, 2744, 1767, 26, -1672, -2835, -2513, -1483, 34, 1994, 2775, 2316]
2423B316j074j893j267q85K85J701J356J465Q07p79j391j664j361k18M75J692
2439d35J802Q63M98q49j834j434j022j32J062J357J822R38m32p85j648j514o67
2456b410M2J415J423J485Q34p38j227j545j471l43M33J487J889O19O71o70j632
2473B62j288j251j92Q36J402J803P30r4o42j570j680o73j08J405J278J346J061
2490B625m95j131j297j588m45L37J235J805P21O80l70j775j244j088l20O98J300
2507c52J633R41k14l56j493j719o20j51J118J313J270J046l99j047j159j602m63
2524b254M09R79J395J071O56k61j480j238j036o75Q20J214J288J075K7l76j345
2541B69j456q19j28P74J354J268J056l39q98j105j558o25L21Q60J491J017O33
$$ y = [2316, 1242, -651, -1918, -2803, -2518, -817, 539, 2004, 2811, 2032, 641, -1023, -2384, -2602, -2127, -435, 1367, 2230, 2728, 1879, 45, -1389, -2411, -2543, -1481, -124, 1698, 2636, 2204, 1419, -229, -1743, -2410, -2368, -953, 470, 1955, 2789, 2051, 824, -721, -2192, -2535, -2102, -615, 1274, 1893, 2564, 1894, 262, -1026, -2277, -2469, -1633, -231, 1572, 2302, 2208, 1566, -4, -1684, -2357, -2465, -1060, 218, 1564, 2625, 2130, 999, -298, -1886, -2331, -1994, -759, 1046, 1767, 2447, 2077, 302, -942, -2030, -2350, -1652, -352, 1281, 2222, 2008, 1652, 159, -1560, -2180, -2331, -1213, 100, 1370, 2416, 2017, 970, -189, -1791, -2254, -1845, -866, 529, 1600, 2256, 1995, 515, -723, -1759, -2434, -1614, -400, 888, 1963, 1990, 1614, 269, -1187, -2006, -2134, -1360, -6, 1262, 2318, 1979, 1081, -24, -1582, -2207, -1886, -1026, 465, 1482, 2115]
2558B115j82j316j074j136o90N53J124J353J174M9k74j329j387p89k23O32J290
2575a10J268Q43j69p06r59j586o10J32P77J275J153P50j23j215j108r84q20N03
2593a689J031J232J043K32j82j171j469o75k53L13J402J125Q71J0n82r10j543
2610a215o94J78O49J131J248O76j62r72j051j064q35N32Q99R51J357K86k36r54
2628G24j413p75m66M25J279R55J010J14o14q47j375p78J45L73J131J134P48k2
2646A748r01r40r47r27M24P66J029J141K89r0q83j306o77m48J82J097J073Q29
2664A459L73n00j006j268o56N8L08J083J160N34J34o86r70r59p89J34O32R64J155
2683A160O20k09q02j275p57m20J84R47J136P73L86m14q29j212p47n0J68J006J284
$$ y = [2115, 1933, 617, -457, -1593, -2283, -1730, -606, 747, 1921, 1970, 1696, 367, -1020, -1809, -2032, -1400, -110, 1158, 2001, 1832, 1126, 167, -1419, -2029, -1897, -1120, 155, 1308, 2058, 1935, 720, -388, -1372, -2192, -1689, -658, 574, 1617, 1849, 1667, 496, -973, -1648, -1901, -1588, -186, 939, 1810, 1820, 1238, 328, -1215, -1909, -1731, -1082, 49, 1297, 1973, 1811, 839, -212, -1276, -2111, -1579, -680, 271, 1628, 1914, 1678, 724, -689, -1464, -1930, -1505, -226, 729, 1739, 1853, 1239, 392, -983, -1761, -1616, -1243, -112, 1022, 1770, 1748, 847, -93, -1040, -1967, -1543, -777, 252, 1393, 1682, 1592, 709, -597, -1274, -1722, -1540, -443, 630, 1459, 1832, 1332, 326, -942, -1598, -1540, -1232, -149, 1011, 1545, 1679, 993, 23, -936, -1725, -1591, -959, 5, 1160, 1780, 1571, 769, -506, -1263, -1683, -1499, -552, 584, 1357, 1743, 1329, 500, -712, -1459, -1509, -1341, -335, 949]
2702I49N71O0n58r38r35p37Q8N78R60J110M47J6q05j000q80n93J05R54J083O16
2722A091N87l78q46j036o30l81K50R66J116O26L4k44q98j034p48k3N23Q47J088
2741I10N79n0m30j130q73n67R9P72J060P02M80k22q21r53p32l54J94R59J037N71
2761A231J37j35r07r26p16k5L24P08R57Q48j70m50q63q68m83p2O60R30P52O69
2781A601k12q69p54q98l45K54P41R94M94M90k76r18p48q58n0L93O75R39O75n1
2801A277m30p75r83l66j18N60Q70P49N84o9p32p63p61m63K16O62Q53P50K52j55
2821A158p44q62n73k20J41P07J001N45m9j58o54r97m92j55N12O50R56N37M4n77
2841G70q31o18o47L6N86R23P05L10m7o94q12p44j21J23O66R37M80J69k17o75q50
$$ y = [949, 1520, 1580, 1022, 84, -851, -1588, -1500, -922, 38, 1148, 1595, 1611, 806, -194, -1074, -1667, -1562, -608, 475, 1091, 1678, 1300, 454, -582, -1212, -1593, -1343, -377, 739, 1365, 1399, 1155, 257, -777, -1525, -1548, -1025, -178, 910, 1489, 1439, 1009, -121, -994, -1561, -1462, -690, 370, 1072, 1552, 1330, 509, -444, -1176, -1530, -1336, -377, 660, 1231, 1368, 1233, 326, -600, -1316, -1341, -1017, -309, 648, 1496, 1326, 876, 13, -855, -1338, -1410, -750, 180, 932, 1601, 1389, 520, -234, -1132, -1477, -1223, -482, 512, 1006, 1496, 1220, 302, -446, -1304, -1354, -961, -286, 653, 1328, 1277, 847, 72, -911, -1277, -1395, -835, 35, 784, 1368, 1299, 567, -196, -957, -1420, -1204, -542, 311, 1061, 1313, 1158, 414, -448, -1021, -1241, -1100, -393, 608, 1153, 1104, 946, 292, -705, -1197, -1352, -840, -190, 766, 1303, 1347, 770, -61, -679, -1326, -1290, -704, 219, 924, 1234, 1187, 493, -319, -1063, -1184, -1061, -395, 542, 1022, 1191, 974, 299, -551]
2862e51n81r2L50O24R28N37N5m78o61q29n01J4M97P59P15M34j08p05o11n83m15
2883a202M1P70O61P18J10j54o34q57m87r2J67P33Q32N77p6l74n34p58n73p2O06
2904e98N14P52M75l3o20o45m74m94m7P84N73N49L33o3o28p64m97k02J72N90O86
2925C63N86P3k50n66p43m38m5K72O45N35O17k9m86n64o18l70k3N36O69N30L33
2946A027j06m25p39m68k75M9N65P13N20J95k38n69n84p03J10K11N45N85M60J14
2966I87l97o47m90m50k1N06M68P63J84O4m13o44p03j77kM92P80L94K21o1m69n88
2988b03n94j01K52M78N60N13j0k16n32n61n00k1M65L61O31L93m2m28m70n02l58
3009h85p5O43O02K70L98j37l58p15o09j6L3N88O56L75J26l53l22m78n68j41L79
$$ y = [-551, -1132, -1224, -874, -250, 678, 1215, 1270, 792, 131, -698, -1199, -1185, -688, 71, 786, 1220, 1112, 407, -204, -787, -1202, -1161, -391, 270, 988, 1098, 944, 310, -547, -1034, -1126, -959, -226, 606, 1183, 1107, 733, 199, -559, -1132, -1204, -598, -84, 668, 1143, 1110, 490, -155, -629, -1123, -1170, -386, 187, 736, 1069, 1006, 378, -386, -883, -1085, -913, -323, 363, 949, 1022, 772, 206, -537, -975, -1020, -748, -103, 432, 1049, 1020, 534, -30, -648, -1018, -1041, -505, 164, 694, 1027, 921, 496, -243, -711, -986, -937, -372, 341, 861, 1056, 818, 249, -335, -1038, -928, -717, -172, 413, 873, 987, 590, -57, -547, -997, -1018, -512, -44, 719, 903, 967, 554, -90, -793, -970, -972, -480, 300, 694, 915, 854, 385, -203, -797, -898, -646, -168, 392, 905, 895, 679, 147, -414, -914, -935, -470, -109, 522, 915, 873, 445, -25, -527, -885, -960, -317, 285, 555, 953, 816, 458, -257, -866, -882, -849, -261, 395, 770, 896, 543, 221, -257, -825, -966, -587]
3030e87M51N36M03ql58m57l84m52j28L99P68K96L34R6n15n47m14k49K5N22N43
3051B74L07J77J3m94n80m12j36L15L52N19N25J2l52m48m48n11k1L84N22N12K95
3072H05R5m50n93l78k43J08K72N88L91O4P3l68n95m11k04L41K60N94M21j0j93
3093E67m92l95l65r7K95M55L78L62N7l72l89m66l80L6M06N19M32J39p0l05m81
3114a66m59r8P9M14M15N57m1j18l06p02j48p9J35M68L40K79K39m79l74l32l53
3135g29J79J10N75L67K19K9n32l67k91l75J25M40N23M08j4k18j83n44l25J0l3
3156f26M65M07N00L7l93l28l66m05pL65L89L91J73J86m73m56l25k01J59K41L24
3177E7M76K08k09j63n94l98N3k3M29K75M84L6k05l06m10m48R2K60K86M66J67K15
$$ y = [-587, -136, 400, 803, 795, 437, -20, -404, -856, -984, -585, 183, 479, 813, 909, 394, -153, -567, -816, -791, -269, 274, 581, 758, 771, 277, -303, -715, -851, -536, -184, 335, 860, 872, 520, 72, -376, -887, -908, -524, -2, 510, 805, 900, 450, -143, -521, -764, -656, -384, 204, 595, 659, 732, 364, -231, -642, -846, -505, -245, 349, 770, 760, 567, 75, -320, -685, -782, -487, -32, 346, 708, 765, 393, 4, -462, -842, -806, -400, 119, 551, 690, 620, 315, -166, -625, -723, -644, -230, 185, 742, 701, 583, 277, -425, -573, -652, -517, -49, 291, 570, 809, 330, -44, -376, -729, -550, -440, 135, 502, 721, 750, 218, -149, -440, -815, -690, -250, 273, 681, 667, 449, 266, -278, -603, -593, -626, -161, 246, 746, 783, 390, 62, -304, -709, -716, -351, 38, 429, 602, 788, 315, -141, -466, -667, -508, -267, 57, 533, 741, 532, 369, -225, -623, -570, -593, -164, 111, 595, 631, 426, 120, -290, -738, -646, -386, -100, 366, 533, 748]
3199G48k75o32k02k45j5L01L28N05QM9j95n17k42k51NL98M93L43N3k79j79m06
3221b07m03M4Q8L76M02J75J80k42n12j22l00j26L73K46M60J66n8l01m42k87K5
3242d65j08L20M45L03J14k80k12k72l77l0J54K79K95L37P7k06l88j55k88j26K93
3263b90K43L18J71N9j54m20l16m8j39K78L84K73K14r0l44j43n36Q8M1K10L68J68
3285C35K72j89m11j43k98r2K29K31L14K02M2o1m72l24j08q9L22K69L79J63j45
3306D26j13l92l09l8%J55L56L20N1n1k27k99k01k03J94K43M66J09K0k00k37k92
3328b22j17j66J70L97J96K53p6k12k08m12j8K8N8M62L42j15J07l42k70k72k6J44
3350b99J06L81K74J3j95k05k87j48j38K72K62K07K01k5k13k34l08j03R9M0L42
$$ y = [748, 473, -159, -361, -606, -621, -320, 8, 513, 521, 570, 375, -142, -384, -635, -630, -232, 261, 604, 657, 378, 199, -207, -610, -566, -478, -102, 300, 475, 655, 413, -99, -221, -521, -647, -274, -28, 432, 598, 540, 239, -203, -490, -465, -573, -253, 192, 495, 609, 329, 117, -155, -532, -562, -408, -129, 166, 503, 580, 374, -14, -169, -457, -583, -290, -47, 271, 442, 501, 347, -73, -389, -437, -576, -298, 86, 359, 573, 483, 139, -4, -540, -452, -411, -201, 167, 335, 607, 418, 7, -136, -434, -526, -297, -66, 248, 450, 492, 431, -41, -365, -473, -562, -240, 29, 408, 571, 426, 313, -79, -388, -426, -426, -271, 85, 405, 456, 405, 178, -121, -322, -525, -331, -88, 378, 487, 507, 307, 70, -222, -339, -505, -335, 62, 258, 511, 435, 223, 15, -397, -415, -387, -329, 133, 475, 360, 467, 125, -145, -417, -443, -299, -193, 188, 462, 475, 280, 75, -212, -360, -498, -226, 36, 243, 444, 419, 206, -28, -336, -439, -340, -300, 42]
3371D2M04k6o9k36j30l45j28K63J02L82K02m9j66j68l07j19k4J63K18P6L72j7
3393D40k39j61l94k3J3L9L62L25m0J04j94l18k25k14K42J38K99L13q4j28j94k43
3415a82j52p0J80J97J81K13K3k24j04k84k28J14mM38K09R3l1j17l71j94j54J85
3437b82J01K90K81n9R7l32k32p7k09J26K67J50K09R1l49kk96r0O6o5K65K79P7
3460C06R7j94k18j84j70J25p2L46L37j51L0j05k69k16kRK45J64L99k3k15j42k52
3483a55j56L1m3K63K54l1K87k57l68K2k52J29O4K53K77kj3m8l20k16p4m2L31j3
3507g9L32J01j91j04k39j01KM5K51K51L7R2j77k29q4k98J16J01J59K90M7j21P8
3530B79m30q5jj40K60K71J74K0j87j08p7k55j1J12J07K39J9K14k44k44L0j44j06
$$ y = [42, 446, 420, 351, 115, -15, -360, -488, -225, -123, 259, 461, 412, 246, 78, -229, -348, -372, -209, 9, 85, 457, 440, 201, 40, -354, -377, -364, -325, 37, 362, 322, 426, 232, -86, -311, -525, -283, -145, 154, 467, 383, 255, 61, -182, -334, -404, -224, -27, 154, 367, 390, 166, 62, -222, -450, -336, -340, 98, 307, 400, 369, 252, -119, -313, -467, -282, -181, 109, 390, 331, 428, 96, -136, -213, -422, -296, -29, 121, 330, 421, 72, 70, -226, -316, -250, -315, -50, 229, 306, 403, 209, -9, -193, -363, -238, -310, 36, 373, 222, 252, 147, -122, -338, -340, -331, -86, 78, 477, 454, 239, 97, -155, -311, -280, -323, -60, 194, 163, 450, 193, -175, -153, -405, -276, -212, 41, 318, 316, 303, 255, -65, -281, -355, -397, -66, -79, 253, 354, 163, 59, -180, -281, -279, -234, 17, 268, 305, 397, 220, -9, -93, -391, -275, -174, -15, 275, 322, 201, 279, -151, -236, -237, -377, -117, 154, 328, 348, 161, 53, -24, -279, -290, -178, -71, 168, 187, 401, 157, -87, -57, -201, -307]
3553c07R5K74J13J67l8N4m67j39o3j8K55J45K93j6r4j41k35j63lJ06OJ81K89L4
3577C28n1k88j82j32%J16K37K52l3J1k4k74k93J61j76K28N8K27J75j64ok20k33
3600b83n5J41N7K08K37P8j7l85p6j34j26J84J14L02o8NO1k62k43J29k78K37K17
3623D3M8J71N7j78j58k21k4Q0j6L03P1l4R3j91jl51Q0N4J24J77J00lp2j29j81
3648a58o5j02J28L26N1J28k5j37j23k60Q5j7J2L65O6o4j9j52j0j93p1kJ64J99
3672A26J38m7o7m9j75q0k73J85K67l1K78J00k85q6j62j11R1k7L52q0K09O4k67
3695G0q8j32j61J55J17LK78%M5l61j25P8j48J26J77J42J24q0o9j40k12K5q4QL39
3720H7P5Q1O0j56k35L0k54K14qJ50K20n1j54Q3k19o4j34J10J75J74L4M0j87q2
$$ y = [-307, -212, 62, 175, 342, 304, 358, -109, -248, -311, -329, -74, 71, 364, 348, 254, 113, -122, -285, -288, -182, -176, 5, 294, 328, 277, -11, -193, -325, -325, -209, 28, 280, 247, 258, 234, -40, -333, -172, -348, -120, -62, 165, 340, 176, 170, -50, -283, -338, -197, -140, 68, 305, 383, 366, -19, -95, -229, -355, -171, -57, 245, 177, 182, 243, -19, -262, -133, -411, -174, 43, 91, 262, 319, 141, -17, -238, -262, -182, -198, 105, 176, 142, 235, 44, 43, -308, -228, -174, -50, 127, 227, 224, 152, 23, -158, -223, -325, -197, 129, 180, 308, 283, 146, 23, -237, -152, -169, -157, 208, 274, 210, 191, 39, 29, -164, -235, -237, -73, 126, 264, 217, 150, 101, -74, -154, -427, -242, 25, -6, 272, 372, 87, 1, -161, -272, -181, -208, 144, 64, 273, 337, 70, -18, -150, -311, -156, -39, -36, 242, 242, 287, -74, -199, -121, -269, -143, 34, 176, 300, 220, 151, 11, -201, -176, -260, -252, 87, 162, 243, 303, 147, -88, -58, -312, -98, -106, 44, 264, 213, 59, 142, -77, -141, -275, -165, 10, 184, 218, 258, 71, -11]
3744a1r7n4J23j53K60R9Q2K8k09p9j05j36J35J11MJ37P8rr8j61j44L1R3J29N7
3769A11J43o5j48l1j09j48O1oK11J20p4J81j50k04j29lJ3J41O3K74p5r3O5j98
3793e0j30k2J6J84pJ49O3p7j6j31j75K6%J68J99n4J21j31l33J19j52RJ64L3J75
3818A48J6QM7k42l5j13n6j3L62P8L2j79j5n4j48Q0q3O5J89N7L6O8k69l3j68rJ93
3845c8l1J82J57j61K5k35j59J06J8pK09M9K07k40o9pj19r2O9J63J73noL8k36q5
3871i4r7j9J67Q0J24J36k11k2j47j09J23k12J98J49M6J51k07n0M2k62Q5K5J4K09
3895A19J1J03j10j35j18o6p1J22J71K3R6n8N4j53j55O5p4qK15N3J34j09n7k6o3
3920c7j48J9J85R0m1M9J49l88J01p5j44J59Q0N5J11N1o9m7l44J11l6O5J82k0J97
$$ y = [-11, -108, -162, -39, -192, 68, 167, 249, 277, 68, -11, -116, -252, -117, -6, -2, 135, 213, 204, 106, -55, -199, -168, -75, 54, 111, 254, 189, 41, 10, -99, -247, -186, -192, 19, 139, 65, 246, 96, -108, -237, -240, -227, -86, -23, 251, 176, 83, 148, -50, -180, -202, -186, -2, -9, 140, 203, 126, 110, -21, -196, -170, -170, -2, 197, 143, 264, 133, -200, -81, -233, -224, -60, -27, 148, 164, 172, 219, -23, -58, -171, -227, -240, 122, 200, 232, 53, 38, -16, -164, -84, -167, -102, 87, 144, 180, 248, -21, -54, -222, -231, -38, -69, 113, 270, 109, 134, -101, -260, -154, -136, -143, 66, 115, 322, 82, 13, 6, -113, -205, -136, 27, 200, 195, 189, 227, -9, -94, -191, -210, -43, 37, 161, 297, 86, 64, -83, -192, -69, -281, -83, 66, 112, 263, 56, 6, 48, -214, -129, -104, -90, 119, 130, 233, 123, -12, -130, -196, -267, -145, 26, 49, 145, 87, 141, -12, -167, -102, -176, -184, 31, 84, 218, 109, 52, 26, -37, -185, -166, 19, 109, 68, 117, 266, -122, -21, -96, -240, -81, -1, 54, 165, 216, 147, 100, -244, -133, -169, -104, 78, 58, 255]
3945B55j73k2m3j26j03J94p4J44J49O8j11j31m3q6k26K07J56nJ73j0M7k13j17
3968i0m9j35N3L35L2Q2j1k04n4rk18K47q0K33M1j16L8j00N2q1k21R2K12L8J17
3993B04m1j18N1j69K2j94P0K53l2J12L3k12N8j34j33K11J0M7K44j22l4j10j01
4016h5m4j54J73J44J4J23j05j02Q7j40k2K6j59K82qJ01Q2j48nk24RK5mJ20J22
4041A08N2J2j16j85P2j62J12J41m1J36K8j61Jk85J91n5q3K44J5J14J17k23l1k12
4065b11K2J25k9M6K70j39K8K2k26N0j82R3J57J1J25K6o5j7k49p0M8r2K63J0P7
4090I3P7K9n8k06k48K63k2L5K25n8J6K9k88ln9K9J51o9L06o7r1l7k16O2m6j26
4116b79K43J37l9J5j8k2n3j27j3P3J05J44m1J6J9j44k15J17l9R9R6R2R2k57Q3
$$ y = [255, 82, 60, 17, -109, -212, -18, -92, 52, 201, 269, 158, 27, -16, -102, -328, -121, 35, 30, 203, 193, 240, 27, -90, -139, -274, -221, 114, 146, 228, 217, 13, -41, -50, -268, -21, -101, 132, 173, 57, 95, -5, 47, -34, -255, -163, 49, 87, 204, 163, 45, 96, -73, -51, -245, -175, 78, 46, 158, 191, -21, 37, -97, -230, -19, -9, 38, 282, 160, 126, 16, -85, -129, -283, -110, 34, 48, 171, 66, -36, 51, -89, -111, -85, -244, 38, 30, 131, 213, 65, 60, -164, -155, -130, -134, -14, 108, 160, 172, 56, -129, -57, -219, -107, 34, -7, 129, 157, -4, -3, -288, -97, -152, -235, 9, 24, 138, 255, 32, 1, -211, -189, -64, -93, -47, 223, 84, 112, 134, -92, -42, -224, -131, 26, 37, 162, 188, 123, 106, -143, -213, -165, -257, 6, 16, 93, 170, 199, 141, -65, -313, -50, -72, -37, 188, 130, 146, 175, -113, -116, -175, -146, 5, -64, 242, 175, 84, 47, -169, -107, -153, -279, -36, 101, 62, 77, 59, 37, -16, -143, -156, -83, 22, 166, 125, 141, 160, 16, -199, -82, -121, -22, 74, 166, 258, 1, 84]
4141H4j61r7j9N0J69J17p3J22k0q5r8k48M6R7P1K89m0k2l3k15r6O5n4J14m8K14
4167A29J26k66J40r1k23n4J13M1K25o1K53j73k15N0r1r7J23k5K23j2N1j98o1q3
4191a76RO7jP5J64R8j20Rj28j54L9L3Q2J35j62K11o0q8j63n4LJ11m8K38j1rR5
4218A95l27N0N9k02J81P4P4O3j11M1q5q9Q1r8j4K13l1Q9o4o9l7j27OrJ57j2J31
4245A39R4J4k87l0N6k22J55J25%J70j96J01j49j88J91j23p2L13RO5k4j05j4j50
4269a28q1J23J1J92J23j10l0q1j44L2j53J12L1J38J06J4r9m3j4j38J5q8K95J9
4293A02J0k6p4p8q1m6K61r3L5J39q0rj27K3J3k23J81K35j79J93l8r7j2j86P2k7
4319a12J48J0J17n9J32k91K8j99K3J46o9J76J80j09l9Kj82L1j31J64O2jR1J3q9
$$ y = [84, -77, -174, -193, -143, 26, 143, 70, 192, 172, 87, -11, -259, -213, -116, -45, 244, 204, 182, 149, -66, -162, -97, -151, -37, -85, 129, 255, -11, 129, 38, -185, -239, -126, -85, 140, 79, 332, 159, -56, -6, -97, -194, -71, -96, 127, 115, 166, -32, -93, -176, -167, -100, -101, -26, 138, 236, 116, 125, -3, -157, -118, -85, -3, 132, -30, 181, 121, 33, -130, -184, -181, -70, -118, 120, 109, 100, 195, -132, -82, -23, -225, -44, 30, 104, 167, 56, 97, 12, -77, 4, -94, -108, 105, 74, 163, 99, 30, -7, -134, -128, -137, 20, 8, 139, 233, 247, -40, -70, -14, -236, -81, 44, 44, 214, 18, 119, -30, -218, -27, -150, -222, 91, 100, 165, 141, 36, 22, -128, -209, -86, -75, 117, 240, 130, 100, 19, -125, -93, -246, -134, -103, 35, 141, 155, 56, 13, -1, -139, -124, -212, 83, 102, 112, 86, 12, -66, -147, -193, 68, -25, 10, 149, 69, 60, -67, -44, -31, -254, -73, 162, -17, 176, 138, 41, 29, -157, -85, -112, 36, 46, 163, 104, 236, -55, -27, -226, -203, -57, -126, 50, 230, 121, 82, 84, -98, -67, -198, -34, 28, 27, 118, 131, 42]
4344D2N6j92O8j25O8Q9J82j30N7m5j34j5m1n1P3K7K04k5j5m7j37j8l7J6R1K1J91
4371A73K6j28m9n6q1p7M6K73o3m8J33l9j71p6K7JL7J22O1M2l1j21l8j36q3R1K44
4398G9R2r7P1j04P0l02J31K5k06K91R5p3J6Pj20j06K8J19o0J32J04j01Rkk66N2
4424a16m3k0K39j15J60J22k33rp7o1k8JK01ln4J68J1j80L5r4j8J00k1K58r0L8
4450A71j3k47k0J18mL1k0J87lm0j01j13j39M9K5J52M0J8J38k33N1j63p2L9J29
4475b0j16L55o1J1Lk72m1k8p0J29N2J82K1p4o7L6k45R8JJ30J05p6J87j72o5m6
4501d3j01N0O6M2J16Nl1L1j74j01j1l3J40K8O0J54j12j04n6r2R8l1J11N1N8L6
4527A57k3j55N0r9r7R7O0J53m9K0J22l49M9j05nR2J08Q4M8m8Kj05j72Q3j5J86
$$ y = [42, 98, -94, -26, -151, -83, 6, 188, 58, 115, 70, -64, -79, -120, -171, -98, -71, 133, 108, 93, 46, -91, -109, -146, -130, -39, -18, 173, 199, 71, 22, -34, -115, -192, -146, 127, 64, 16, 149, 110, -61, -137, -110, -109, -72, 50, 111, 153, 122, 1, -37, -173, -256, -165, 79, 171, 74, 145, 41, 111, -191, -60, -35, -241, 50, 145, 72, 88, 95, -25, -131, -103, 16, -44, 88, 192, 91, 100, 98, -168, -116, -159, -179, 60, -55, 105, 227, -6, -15, -92, -153, -181, -180, 21, 18, -36, 132, 143, -37, -2, -96, -114, -14, -35, 223, 133, 171, 158, -89, -109, 9, 5, 36, 16, 203, 200, 160, 59, -54, -193, -144, -119, 33, 73, 91, 229, -4, 47, -116, -188, -149, -20, -136, 219, 158, 169, 172, -100, -141, -169, -239, -110, -58, 124, 145, 71, 4, 40, -205, -107, -106, 24, 129, 53, 240, 68, 3, -43, -144, -94, -28, 14, 130, 135, 104, 135, -39, -140, -151, -184, -44, -16, 44, 198, 86, -18, -74, -166, -68, -99, 12, 63, 121, 157, 134, -21, 29, -70, -167, -70, -10, 143, 94, 114, 236, -113, -64, -169, -174, -82, 26, 110, 158, 110, 112, 7, -165, -82, -97, 89]
4553H9q5J9R8j8r6K6j54l6Q2m5J79J67k04J03n1j23j04NR5J09PJ12j08O8p3k51
4579a89K6k7J44R0J24j4O5j25n9k58K6J63m6J02Q1p6R6j27j06P4j57N6J64L5M3
4604A05P2j34j71n9O5o7J02J89Q0J3r9r3Jp7j45P7J33kJ46P9j31j00p6J09j53
4629a36J9J57KJ41k9j12k0k3q8o1o2K81N7k5P5o0j48Kj19Q0l0J98LJ3ko3k22J06
4657f6m4o8J60J2K34o8p1j20k8j65J38j7J07O3O5M1o6j01j00j57J19J29j5P9O8
4682A29K1o9k00K1L0j48K07k4J01N1K3j43j29m5Q3l7K38K4jo1jj28o6j9J24j7
4708c6j1J03L4m3j04Q0j86K1P2R1Q9L9Q5r6j24p3j40J98j42N6J61nO9p3j00j11
4734a46l2J01m5J26J4MJ5l8r2OLM6J9j02K02P9p4r0q4r3R5l9J89J07j01j7J08
$$ y = [89, 4, 23, 121, 103, 7, 33, -121, -157, -75, -120, 59, 226, 22, 125, 74, -49, -153, -148, -53, 56, 63, 175, 67, 135, 62, -189, -163, -190, -46, 44, 168, 154, 219, 94, 35, -223, -197, -34, -80, 22, 103, 27, 123, -4, -110, -36, -193, -137, 27, 62, 105, 177, 43, -128, -187, -122, -189, -87, 102, 182, 195, 96, 3, 4, -73, -218, -141, -8, -10, 136, 215, 84, -16, -92, 17, -136, -117, 40, 42, 183, 154, 42, 22, -1, -89, -150, -212, 69, 126, 101, 176, 116, -32, -30, -149, -69, -99, 99, 102, 115, 113, 50, -172, -66, -110, -178, -18, -6, 228, 160, 89, -31, -59, -224, -86, -103, 4, 67, 132, 173, 107, 6, -94, -251, -132, -3, -18, 61, 129, 150, 81, -119, -98, -68, -216, -9, -33, 68, 119, 142, -1, -130, -175, -92, -129, 109, 133, 132, 71, 70, -58, -124, -143, -19, -36, -47, 56, 90, 47, -57, 23, -163, -142, -70, 21, 110, 149, 234, 138, 14, -59, -199, -1, -143, -87, 74, 69, 138, 65, -35, -146, -178, -77, -122, 4, 18, 22, 37, -1, -93, -87, -84, -38, -19, -121, 81, 160, 86, -4, -88, -181, -86, -125, 64, 171, 70, 53, 161]
4761A61p1k78P3L9J2M1L8J83r5l7j27j24J2QJ60k2K8J46j30J0q7j15M9Q4n1J27
4787C4J23j1q3o8l1j62R8Q6O8rJ51p2j09J6j29Ro1N4J14O6P3J1j19r5j23o0K01
4814b8j1J62K8M8j42m0l4j66J16Mk8K36k5m8J07j24j65nk2J16Q0Q6J25j42m7j66
4840h5M2j16j2J33M6J72j23M7p5q4m5j08J17L4N9J38q0j8n3r6p6O8NP6P6K1J02
4867A65r0k03N0n7M6m4J66J73m0q1j06j6K0q7L4J34J01k7j2k6j08m1j13K9PJ71
4893D5J17Q5j09m1j59k1r8J23q3J88p5K34j54P5k00j06M5K9J09l2K20r9n2p0r7
4918a26LM9p0J11R7l2O4L6j34j18j45J22O4Q8O1J40r9r3j31M2L1k5M0J40j7O4
4944A62n4m2p7j35r5J90P0R7l0j7P4j83j05p0J55m1M2J62J10o1j55n2q9J02j7
$$ y = [161, 90, -188, -115, -76, -64, -23, 15, 198, 103, 66, -61, -185, -173, -165, -5, -27, 1, 147, 17, 27, -60, -175, -126, -42, -93, 34, 157, 146, 63, -5, -36, -198, -100, -14, 54, 45, 196, 124, 15, 31, -98, -89, -150, -96, 18, 84, 157, 168, 49, -46, -169, -229, -28, -39, 123, 151, 199, 57, 17, -17, -183, -67, -63, -91, 145, 120, 72, 179, 55, -110, -115, -137, -21, 59, 145, 270, 128, 81, -85, -43, -159, -171, -38, 8, 180, 57, 104, 29, -55, -100, -208, -91, -57, 2, 140, 60, 42, -11, -107, -183, -115, -110, -34, 42, 63, 165, 75, -128, -78, -135, -89, -133, 33, 206, 166, 85, -21, -37, -17, -104, -70, 64, 165, 138, 126, 100, -8, -49, -162, -133, -126, 45, 162, 247, 138, 97, -62, -83, -181, -58, -141, 47, -28, 206, 52, 127, -73, -179, -134, -105, 4, -28, 192, 93, 41, -29, -126, -123, -74, -144, -33, 64, 32, 96, 132, -2, -120, -265, -143, -79, 9, 70, 210, 111, 18, -113, -71, -40, -65, -25, 115, 98, 162, 108, 66, -11, -146, -241, -51, 19, 116, 86, 69, 143, -40, -145, -215, -60, -101, -59, 103, 213, 152, -3, -55, -144, -42, -59]
4969e9M6jJ14k2Q7j41j20K4rM8K1Q1N2P6j04r8j84R7n4m1J98J98J7m3l3k76J19
4996gk13P5J24J37J2j0N7j08j70J3j36J52R6K0R1Q0j20j23l1p5k2J02O5J09K7
5021A45J8p4j78K4n6l2Q8K22q7R5pr5r3r3l2J11N3J22L7J4m7j34m6j95Q8J08M9
5048EK25k20N7O9n9k42n5M7J4J60l7K69j44J6j24q1j37J40pK00m5J37r3q8k3j16
5074a32n6P3O6K35J2r5K7j11j27p5M7J14N0J02R1m7m4l17J00j18L1J59O9M9p1
5099C2R6j82N6j31q2%J42J66J5N9k4q1j71J17j39J04l4N5J45p3jrk86P0N3l0O4
5126f9J24Q2l1o0l7m5j89J10J01J18Q3N4j74K6j44n8n5L1J93M4J7l4jj56m9J7
5152a02Nk9J27R0J5J70k56j10l0o1R4J27J0M5j0p9J9q5j19NJ2L5K14OK4oj50n6
$$ y = [-59, -13, -14, 100, 78, 165, 24, -96, -72, -81, -33, -12, 69, 121, 197, 93, -5, -189, -92, -146, -187, 11, 209, 226, 183, 150, -126, -7, -220, -145, -21, 116, 128, 118, 175, 67, -103, -90, -226, -74, 22, 42, 133, 213, 93, -30, -61, -136, -158, -56, 9, 118, 145, 163, 89, -89, -65, -121, -153, -65, 157, 70, 165, 158, 63, -30, -123, -155, -44, 9, 131, 168, 182, 135, 1, -45, -240, -152, -44, 5, 230, 10, 67, 136, 77, -165, -220, -173, -159, 1, -36, 233, 89, 105, -19, -100, -237, -97, -104, 96, 51, 188, 95, 7, -16, -132, -188, -115, -49, 186, 198, 103, 130, 19, -108, -183, -136, -22, 28, 130, 221, 174, 130, -187, -87, -205, -174, -15, 54, 103, 32, 128, -54, 2, -129, -211, -211, -69, 97, 112, 171, 147, 66, -105, 12, -127, -23, -57, -2, 143, 70, 69, 60, -226, -156, -103, -133, -69, 55, 137, 106, 46, 9, -36, -225, -115, -14, 104, 187, 241, 67, 93, -51, -109, -164, -133, 60, 104, 121, 87, 86, -70, -119, -102, -97, -126, 1, 91, 106, 276, 20, -90, -120, -181, -87, 40, 50, 95, 85, 6, 25, -60, -179, -174, -162, -127, 87, 93, 117, 111, -39, -95]
5180i5p4P3n6Q0J32N2M3r9m4o0j02K0J31K4R2M7J6k12j6j37P0n6K26n9J03M7k7
5207A19n6j85qj07J35J77K2N7p3r6Oj37j7nP4L4K13O0j56Kl00O7N3l4J56O3J39
5234B03p3k4J9j48j20%n5K14J05M1m7N5j11j22m9q4J02K4K37j02L8p7q6j08K9
5259a39J5Q4J55%Q1p8Lj94o6l3J02R6J28j50J47m3j19m2j61lJ20J02J13O6P7j84
5285G7p7j18n2j15K60L0RJ93o7k6k19qj3j00J87R1P7p1L7o0k4k00J4L3P9J49P9
5312A65m8o6j11K7j62O6k7Q1K25m1n9j2k25O2n5L0J61J44n0R5o8j96J04j60k1
5337a41n1K34Q3M6o1J7j32j41n0R4O0N6Q1R1Ln6q8k15o5M0R8K65j07R4L6k40o
5364e5l6j37oK64O2J34l4p8o3n5j53m1R1R3Q2R1r0k4k1j23p8J1J13J41N5J34j61
$$ y = [-95, -169, -96, -152, -72, 60, 112, 155, 56, 12, -48, -150, -130, 1, 25, 117, 164, 180, -32, -48, -185, -115, -171, 55, -4, 99, 146, 119, 63, -122, -130, -237, -102, 75, 97, 154, 81, -15, -9, -146, -163, -168, -94, -60, 153, 213, 57, 59, -241, -174, -121, -155, 1, 64, 203, 130, 106, 125, -23, -143, -143, -198, 16, 121, 162, 115, 170, 59, -63, -112, -196, -94, -70, 167, 65, 103, 26, -60, -168, -139, -124, -40, 115, 115, 196, 118, 121, -73, -139, -172, -70, 26, 154, 4, 151, 108, -11, -53, -214, -217, -97, 5, 118, 184, 261, 77, 0, -118, -170, -285, -25, 5, 14, 207, 140, 114, -105, -113, -126, -226, -39, 52, 129, 58, 95, 35, 11, -189, -175, -142, -63, 86, 165, 117, 51, -60, -33, -195, -129, -156, -75, 150, 109, 50, 38, -187, -125, -180, -150, 11, 155, 105, 200, 132, -64, 40, -120, -141, -192, 42, 125, 171, 110, 127, -5, -146, -196, -102, -42, 14, 95, 186, 189, 133, 45, -170, -235, -195, -97, 168, 61, 155, 191, -49, -55, -91, -228, -234, 30, 92, 226, 192, 114, 51, -4, -157, -198, -107, -14, 68, 159, 69, 45, 24, -99, -177, -166, -53, 88, 143, 277, 116]
5391A16m5j93jr0J24L3J58Q3n9J1q2j50p2p7K00N3L9J53N5k37l1j86K5J16R5N6
5417I4O5J80q9k63r2k9q3M5J28J41Q1LJ8j50j70k5j01K8K57Q4N5K6j25n3j16j01
5443a92k0J07J45J64M6m2j89r5j37r4J58Q0J43J45o5N2j10k44k1j32K90j9Q6J59
5467B15L3j52l7k28O3j34J10K08J21N4n2j60p9r6j29M2K35J24k0R3j00j23p6n
5491i3j89J79J47k8K44j33q2o7k02J1l6J20J20K52K9pj44j20j04j35M4K12k1J64
5515A61K9N5r9k03o0j00J78O9J12PM1p9j74l2j33k7K79Q9L5R7K3j34j06j19j44
5540b35N4J71J8J32K04j46l3l03K7m9m4J80Q7J76R6k25jk17j96J26NJ11J63L2
5564A33P0j27j32q9m0p5J89L3K01n8L9k8j75k19O9R7L4P3J89J7l2pk97m7j0RJ78
$$ y = [116, 71, -122, -123, -213, -89, -56, 102, 185, 126, 137, 55, -95, -167, -244, -44, 9, 48, 201, 256, 19, -12, -198, -173, -57, 38, 94, 159, 339, 250, -13, -105, -134, -217, -172, -44, 97, 178, 181, 199, 49, -121, -146, -247, -219, 38, 122, 177, 203, 78, 25, -91, -192, -212, -105, 40, 204, 250, 208, 19, -76, -213, -307, -149, -69, 74, 219, 154, 206, 96, -148, -169, -301, -11, -30, 56, 215, 248, 96, 59, -169, -106, -240, -130, 78, 199, 253, 201, 41, -38, -134, -263, -221, 14, 138, 118, 211, 111, -12, -88, -93, -282, -103, 44, 16, 260, 127, 45, -22, -224, -213, -249, -129, -9, 243, 272, 265, 121, 1, -103, -238, -194, 18, -3, 161, 190, 245, 146, -57, -117, -217, -39, 30, 142, 149, 190, 111, -63, -95, -228, -255, 24, 113, 148, 245, 268, 134, 28, -91, -235, -181, -10, 8, 140, 344, 198, 165, -138, -111, -160, -204, -24, 63, 239, 335, 110, 109, -108, -304, -178, -173, -62, 101, 133, 203, 76, -56, -145, -185, -260, -71, -38, 163, 105, 144, 116, -59, -278, -209, -112, -78, -5, 184, 201, 169, 162, -135, -182, -192, -183, -5]
5591eP7R1J63j90q7n4k17QJ55N8R0J14j0n4j56j52n0Q2K0J74J44J1n4n9l03QQ2
5618a14p8K02J78Pm2k4o1k08j6j26J25P6K87L7l3m2k65n4q7J4J68R4Q4J41o0j85
5644A8j46o2l5Q1J89J08N6L8kk29K4l52N3R3N4K85mJ33j10k40rk10Q7P1J14J34
5670A39O5nl6j41j16j15l1R8J82l3L09j32j29k06n2J9LK04J21j5J9L3k34j11J
5695a63k2P9J23J44O2m2j12q5k16P7m6J17J29J14R4q1q9j65k33R7J40n8J58J49
5719A71J9Kj06k00l8o9J11N2K56N7J0j82j25q4p1JP9J93J61R5j12m0k10j92o8
5744b90J32P0K76r4J88j00j03j74r5n3J4K33J03K04n0n9j79j24j06K8JK95N2Q1
5768B50K3k43N0k08r8O1R7L5K62R2k03m3r5j88n1J16J50M1K29k9n8j14j81j00
$$ y = [-5, 72, 163, 326, 136, 49, -5, -222, -214, -59, -1, 89, 203, 193, 139, -17, -169, -219, -137, -117, 57, 201, 212, 158, 99, -204, -196, -114, -192, 10, 188, 195, 153, 129, 68, -140, -156, -282, -157, -81, 206, 243, 210, 168, -97, -151, -238, -224, -56, 38, 122, 263, 203, 18, -128, -190, -225, -144, 45, 153, 209, 247, 245, 16, 40, -312, -259, -166, -112, 173, 169, 302, 192, -48, -57, -267, -180, -109, 5, 139, 204, 199, 163, 22, -94, -209, -240, -142, 40, 7, 316, 184, 55, -151, -203, -184, -181, 23, 144, 129, 148, 181, -53, -164, -163, -185, -106, 17, 161, 223, 181, 69, -16, -232, -155, -201, -84, 45, 159, 253, 172, 83, -82, -315, -218, -78, -136, 22, 171, 190, 192, 86, -114, -152, -221, -110, -58, 198, 255, 265, 83, -42, -126, -197, -196, -117, 76, 237, 332, 220, 180, -30, -222, -290, -158, -88, 188, 94, 282, 182, 79, -95, -190, -243, -229, 4, 107, 311, 261, 202, 23, -101, -207, -179, -178, 117, 169, 250, 273, 30, 80, -128, -226, -165, -68, -33, 229, 321, 118, 75, -20, -208, -259, -143, 7, 48, 277, 248, 190, 76, -105, -205]
5792b05m8Q8J81K26j0m3p3j14k17j85J43K47J77j9R1R3q8m02J2k06Q7K57N9K58
5816C09qj25p6r4k54K2J21K08n1R2J19j01o4j84k38N6J01K08J1J69J3k88m5r1
5840a90o6J11j1K28J10M7l5k15j03p0PJ10R3J22P4J7r8j25j18j81R7P9OJ96J27
5865B12p0O3j61j47j60K5K45N7J92k0mj45k08l3L7n6R2J16J71J26j07k10q8j50
5889b23P0q6K11J85J15K3j00k80o4j48J5K16Q7R7K51j70M4l00j81J03k31K92K36
5912A62j9k0J12k41K8k83L9Q0J58Q8M2J05j02j40j63N2p7O8O2J15J59m4j22m4
5936A5n4j98P3J29J23L0P4K0j05k63j00Q2j28K89K9K54k4j12k31m6r6j13J46K48
5960D2J56J05L4k38n4k18r7O2J35J82N4J32nj78p1k29j00J07j0L37k7P8J0k42
$$ y = [-205, -253, -165, 16, 242, 232, 189, 116, 2, -215, -400, -257, -10, 167, 148, 239, 332, 244, -158, -146, -352, -265, -8, 51, 309, 301, 176, 100, 6, -248, -226, -105, 103, 52, 144, 263, 162, 98, -86, -324, -268, -167, 41, 52, 221, 234, -54, -99, -190, -256, -145, -156, 72, 182, 229, 194, -21, -124, -194, -187, -77, 16, 138, 212, 229, 131, 6, -112, -293, -196, -117, -111, 85, 212, 142, 205, 44, -103, -263, -238, 7, 64, 256, 236, 232, 87, -121, -154, -117, -173, -81, 35, 206, 332, 225, 15, -73, -223, -153, -239, -28, 157, 272, 295, 195, -85, -149, -297, -282, -66, 21, 118, 369, 199, 243, -57, -238, -135, -366, -74, 162, 143, 123, 235, -6, 22, -261, -222, -142, 16, 104, 146, 251, 149, 9, -154, -102, -179, -111, -49, 66, 225, 181, 59, 15, -39, -237, -164, -35, 88, 118, 192, 212, 107, -156, -256, -174, -302, -13, 16, 270, 246, 134, -97, -143, -239, -352, -206, 42, 198, 303, 337, 99, 45, -173, -270, -208, -73, 109, 163, 295, 290, 112, 41, -188, -288, -181, -191, 146, 119, 197, 207, -35]
5984c5r5j33j9J17J52M8L27j05Lk06l36J1N1J01K92j3J59%k21j87Qr8k8J10K67
6009A70M6Po3j27n5k39P0PN6K95j1K3J8j83j21j05o1J15K44M0Q7P6k43j03j10
6034a67k47J96J58K97nkO3j70k82m5mQ0J80jK11L9j67j16o5k00k1J90J2K50Q7
6059B71L9j46j32j74j60O3J22Q5K19%Ko3l20P2j53J99m2J11J45P7l6q1j94j64
6083b60j0R9O2K21N7J65j58j12j30k32O1J00J31J54O7Lj36j63j18m4M3J44K24
6106A68p5K36q0k58n6k28Q4K0J20J98J56l1j99P4k68j85J02Q9J38J19M5Q7j33
6129A23k66o3j25P2K33Q1J44K03k66j20j04j40Q8J3Q4K42L5j0N6k79r0j36N5K
6153a68J54R0J70J9k3l37M6j86J0J21K01P1R4m7j00j30k06J0O6MQ1K76M9l6j83
$$ y = [-35, -130, -263, -282, -165, -13, 35, 362, 257, 260, 54, -282, -271, -220, -119, 173, 160, 319, 319, 98, -89, -81, -179, -207, -97, 170, 216, 223, 160, 33, -22, -261, -191, -184, -128, 167, 156, 179, 197, 14, -107, -212, -273, -158, 86, 126, 213, 289, 46, -57, -167, -414, -218, -60, 237, 232, 230, 293, 123, -159, -204, -208, -128, 52, 51, 262, 301, 134, 18, -47, -247, -268, -78, -66, 184, 271, 310, 164, 32, -142, -302, -239, -117, -32, 187, 187, 189, 126, -194, -122, -275, -76, -118, -7, 138, 215, 179, 98, -96, -260, -270, -171, -109, 112, 169, 334, 176, 64, -66, -298, -237, -137, -6, 148, 215, 218, 82, -81, -199, -243, -200, -56, 168, 93, 329, 249, -9, -65, -293, -209, -189, -69, 129, 285, 254, 55, 129, -139, -324, -222, -133, 5, 124, 169, 256, 123, -143, -206, -331, -259, -26, 55, 199, 402, 136, 16, -88, -228, -140, -127, -43, 199, 234, 224, 280, 1, -89, -225, -170, -168, -14, 76, 246, 265, 242, -95, -49, -235, -225, -104, 97, 168, 262, 215, 115, -15, -221, -211, -145, -141, -60, 216, 265, 229, 46]
6178D6j13q1p6K3J87L1J71L0j15j72j43o4N2O6J63J63J44k1j65j17j25j85LK33
6202f5J62L2J21k7j98j68m9j27J67J32J35J49j3r2j33k72L7o8J12K08J70pL3j85
6226E4j10j02o9rJ29K51J62o9k6j01q6k61j15R0K07Q3K38P6j45p4l88J4l3J31
6250a53J67J63M6J14j80j79j55j04L5M1L27J16j8N4k02k19m2p5P2J45J14J32J00
6273B99p1r1k02r2l8k7K35R5P1J64j83q4j98q2l8K6J58K04N5o3L6k29j11q1P2
6298a75J67J22L4J40oj68j40k10r8J19K34J30K4J14q8j13j77j26k2N4K47mK64
6321C22Q3k62j92j24j06J2J97J61L3J08l0j63k02n4J0L1P5J14K66J29l35l1j59
6344a17j25n1O8K35J01P6M8m5k83r9m8O4KJ99P9J19lr4j71j74j16J52R1J46K00
$$ y = [46, -67, -148, -224, -201, -14, 17, 188, 218, 103, -69, -212, -276, -224, -158, 5, 168, 312, 291, 126, 9, -116, -301, -298, -65, 97, 129, 250, 223, 25, -143, -192, -319, -152, -20, 115, 264, 251, 159, 26, -246, -209, -277, -165, 43, 213, 206, 239, 54, -56, -158, -227, -236, -107, 144, 306, 237, 211, 110, 24, -237, -352, -262, -55, 28, 266, 342, 197, 123, -265, -251, -284, -153, 14, 177, 223, 337, 157, -22, -177, -281, -246, -205, 122, 238, 220, 274, 72, -147, -189, -264, -192, -47, 67, 199, 299, 228, 137, -65, -157, -195, -222, 13, 108, 179, 343, 160, 76, -122, -204, -242, -216, -58, 146, 201, 138, 174, -55, -166, -247, -175, -8, 114, 148, 288, 282, 114, -26, -236, -334, -215, 19, 149, 173, 287, 199, 86, -91, -217, -239, -185, 62, 58, 322, 405, 143, -49, -173, -279, -267, -70, 91, 124, 232, 202, 39, -163, -217, -207, -176, -101, 13, 279, 408, 73, 42, -117, -242, -293, -225, 10, 111, 187, 235, 190, -93, -192, -240, -176, -174, 25, 104, 223, 220, 126, -45, -219, -335, -183, -92, 54, 254]
6369B54J17j08k16j13j31Q9rk2K92R4M1j04k54lk09nJ22J19K32J74j47j5k52j12
6393a66j64L9J56J91K35O3j91j17j96j13q0K25P8J28J78R8j66j46k65Lr4j4L47
6416B9N6J88l1l6k44j00j23J5L8L26J22M9o0j83k0l16J6J59K9J59Q5K04j89k08
6440c5j57j40j0K42nK51R0M5Jl07k22J82j21N8K85jJ53j07q6j70k13l8J39Q2J51
6465F7J93M0k2k36k11j7j00J96j2J86J99l3l7j44k29o2l9R6K52J10Oj5p2k34p4
6490a92l0N1L0K11J72l6Lj11j94j80PJ56J01J03J64j6q2p5k06j72P3J14N5J71
6514A17J31J3j99j69r5o9L9O9K09J81M3o4k6k19j25k19K57N7J59K66j31p0j8j73
6538c6o4j30J87R8J35L1q2P3k36j90j10M4J74K43J5P5L7j44k33j14p5J02J28K00
$$ y = [254, 371, 263, 47, -66, -197, -108, -117, -139, 153, 247, 288, 184, -70, -73, -282, -287, -165, -46, 186, 360, 213, 198, -54, -166, -330, -291, -135, 56, 291, 354, 163, 46, -150, -263, -343, -118, -40, 88, 266, 364, 198, 52, -213, -210, -304, -318, 29, 85, 273, 242, 206, -38, -138, -261, -246, -208, 118, 240, 289, 229, 46, 26, -290, -274, -115, -86, 73, 158, 362, 173, -35, -192, -332, -342, -100, -105, 146, 236, 281, 282, -25, -247, -65, -186, -128, 157, 156, 309, 202, 116, -54, -267, -305, -166, -84, 67, 260, 300, 278, 42, -169, -186, -286, -90, -102, 84, 283, 250, 213, 69, -160, -222, -261, -165, 87, 197, 203, 188, 116, -118, -192, -222, -171, -141, 70, 242, 206, 209, 98, -96, -276, -269, -113, -12, 91, 255, 239, 157, 82, -124, -296, -223, -109, -54, 117, 248, 261, 62, -107, -202, -271, -232, -163, 46, 227, 270, 206, 180, -39, -164, -383, -126, -69, 90, 356, 225, 155, 137, -36, -100, -230, -43, 55, 190, 221, 139, 212, -24, -214, -324, -280, -106, 137, 152, 227, 264, 120, -113, -227, -302, -200, -72, 128]
6562A28J42j5k09Jk56L9j17J23K09M4K64j42J4k44j27k51J36J01K23J48N6J4j40
6585A41j73j36N5r2P7J69K37o9r0l2k35q8k3J19J10J72PP7r6k27r4p1j13J98K05
6610B8J64J34n0k80Qk36pN6M3J19K45J17n8k07l13K2q5K1J73K02K21O0r6k46o2
6635b7l13P1J58J63Q3J03P0j23k02k44k8M0J00R2J68J18m2K0k55j79Lk2K01P9
6659C4K55p6J6j56k23r3M1K8J32K05J34J7p9k12k17j28K7J00K16J87R2j05j8l39
6683a62r0J8P6%L23L1M0J1j41j87j55l0J01J67J30J12M4n2k99j3j71j28K18O6
6707i1K07J26k7n2k19k44Q3rJ79J88J4K14r8m0k84l35N6J67J05J37K22M2j70k04
6731c3j7k86P8O4J74J99J62j53j0j89k18O5j70J46J67J91J10j4k12m1k30j51J46
$$ y = [128, 270, 255, 46, 47, -209, -170, -287, -164, 45, 89, 353, 211, 225, -19, -146, -397, -261, -160, 63, 211, 267, 281, 141, -32, -168, -113, -205, -128, 41, 278, 209, 119, 87, -148, -236, -259, -140, -30, 142, 149, 226, 130, -97, -191, -262, -375, -177, 28, 192, 326, 276, -4, 4, -232, -239, -183, -140, -21, 224, 341, 283, 76, -237, -215, -300, -279, -106, 96, 317, 377, 281, 35, -27, -340, -269, -111, 52, 135, 238, 308, 185, -17, -261, -289, -249, -149, -57, 111, 229, 187, 207, -48, -227, -224, -246, -45, 34, 289, 213, 229, 73, -150, -243, -202, -174, -42, 163, 297, 314, 235, 23, -194, -322, -295, -195, 21, 208, 300, 195, 177, -162, -252, -234, -158, -158, 165, 196, 236, 247, 106, -81, -236, -266, -165, 2, 132, 244, 288, 236, -63, -76, -247, -375, -157, -91, 116, 242, 215, 163, -56, -300, -217, -226, -47, 141, 155, 369, 271, 231, -53, -388, -332, -165, -60, 77, 299, 341, 171, -33, -50, -336, -258, -194, -20, 179, 341, 188, 178, -11, -229, -164, -334, -188, -21, 170, 280, 266, 54, 13, -217, -368, -222]
6754b22Q1J24K31P6m8k97L2k82M7J66J07J45J24P9l28k4j69j09OO8K48M4K82k12
6778A69o5j5k60r4M4R8J35P2J60N8k32j30j40r6J69K56lJ07k3O2k80j26j2j26
6802b72N0K22J37J83l5j65p7k35m0j4J28J63J21J16%j62p9k77j4J28M2P8L10n9
6826B49j55J3k93J2j06P2J86J17J43M0n2k36k53N4j31K38J32J28J04J2j89j50
6848f5j00q2j8K17J23K59J2j20j74j97l5k09L19k0K33J60Oq0k01q1k07Kj0L04
6872C6K52K4r4j32j83p0r3P6KJ51L71j17J1j33k31j04j55K00J28P5J59J57q1k31
6896A8j63j16N5k3K89R8M1J00m2l51r6j39J48J92j57L43K17j50k33j24j53M4K2
6919a80O6K02J51k1q8p0k41p6j7oJ59K12J37J5k7k58Nk11j29J64K62J54rn0J02
$$ y = [-222, -141, -17, 214, 290, 242, -55, -23, -305, -258, -92, 15, 160, 284, 363, 35, 11, -158, -267, -261, -193, 55, 99, 381, 169, 104, 89, -171, -265, -221, -123, 12, 84, 244, 302, 70, -60, -200, -296, -127, 129, 126, 233, 210, 272, -8, -134, -146, -272, -222, 0, 137, 320, 285, 120, 43, -192, -232, -246, -118, 45, 166, 282, 282, 120, 41, -236, -250, -122, -80, -2, 308, 249, 94, 107, -186, -174, -280, -208, -22, 95, 238, 278, 226, -10, -263, -209, -340, -102, 30, 158, 262, 274, 85, -65, -165, -247, -265, -48, 75, 334, 346, 226, 52, -145, -180, -389, -70, -90, 143, 303, 309, 229, 28, -53, -260, -258, -268, 36, 288, 312, 218, 86, -97, -167, -260, -184, -182, -31, 340, 223, 234, 101, -130, -234, -389, -189, -61, 14, 173, 330, 249, 18, -145, -261, -206, -229, 60, 158, 199, 299, 257, -94, -190, -329, -181, 11, -146, 197, 414, 264, 31, -93, -246, -202, -180, -114, 88, 239, 218, 130, 60, -181, -257, -274, -280, -121, 91, 228, 243, 216, -42, -37, -248, -377, -213, 49, 203, 194, 144, 246]
6944B46k88k42M7l4J26K21Q9J88k13j34j59m2l0R6n5M54kLr1j99j36j89J13J5
6968b16K50M2J59n5r7k19rj43rK05J50R8K30k19o2j05k42q0P4K41R8J18J50r1
6992B68l53m1q6q8P1K91J20Q8Lp4j57k26n5L7J03J24K32O9k5j06j14k62n4l6J71
7017a00J70J68O4j7j93k85m8l3J0J63K81J04k6q3j75k59P2k6R0J32J51K0Pj26
7041F1j26o7j72J51k4K72J34J47j60j64m7k62j7k2L12j3K28M3J4l29k19m5O9N5
7065a81K26Q3J24p6kj79j77p0P1jK83R6L2K5k04k8k21l8rJ06L03lJ32p9k04j00
7091i1j50l9Q1K18J33J94j21m3j17k35p5N0k0L43O0kJ20k04j18r5j34J34Q1J69
7115A39O2J12j15j1l54l4r5J59O2J95J68j54N6j35k08j48Q4O5K50L9J39l8m0k67
$$ y = [246, -42, -284, -237, -271, -145, 76, 165, 353, 140, 6, -153, -195, -225, -129, -184, 270, 268, 271, 180, -19, -155, -344, -231, -216, 34, 76, 235, 180, 83, -136, -145, -288, -297, -92, 58, 156, 386, 167, 105, 0, -242, -322, -248, -7, 91, 209, 359, 268, -85, -126, -212, -300, -229, 62, 182, 270, 273, 199, 42, -184, -239, -202, -99, 25, 257, 326, 301, 195, 81, -181, -235, -271, -100, 70, 238, 302, 285, 92, -193, -241, -274, -264, -101, 180, 284, 258, 175, 0, -259, -187, -213, -123, 9, 160, 180, 187, 61, -65, -132, -304, -153, -177, 95, 229, 376, 216, 52, 5, -257, -274, -296, 16, 3, 231, 274, 288, -41, -260, -305, -236, -181, 45, 128, 252, 176, 174, -5, -182, -252, -181, -182, 101, 197, 229, 254, 50, 22, -199, -237, -246, -140, 163, 160, 292, 213, 9, -91, -241, -280, -199, 19, 152, 346, 225, 182, 65, -170, -245, -195, -215, 128, 188, 186, 306, 102, -16, -111, -245, -111, -30, 139, 201, 313, 198, 187, -167, -201, -296, -137, -75, 120, 288, 134, 190, 55, -153, -301, -217, -152, 98, 137, 276, 238, 198, -69]
7139f9k08j03J98J10J9K03M4L2k33p3m5j33J06K01O5Q8o7M7j03k82o9Q3K1J32
7163c6J46J92p7j44j38j38p2J3J53J81J76J6l9k47n4o5j98R3J78P8J40J33o6j14
7187A11k59r7J4K0K08J36J53J8j40j29j45j73J02m1K85K00R2l38O1j00j40j20
7209b82p0K41J32K53J21j70k12j09j26j2m6K26K18J1K27j81j91j42k18O1J33J42
7231FK40L1K6j89j04j65j87P6K33L5K04R3o8j13k17j23m6N6J66J64L7J92k44p
7255I6l13m7j1Q9J21K71m0J93j77k22q8j77Q3J31J06J77K1j3j25j60j09j24J14
7278b04M6L08k6J32M6l20r4j26n3Q1J01M06l4L5o8k92n0j05K8L9J52K13M8j4j28
7303A21j36q5m1j5j0J99J84O9j01j34j48j81Q8o2K91N5K12r9k2j20k13k7M3QP0
$$ y = [-69, -277, -380, -182, -72, -53, 150, 194, 226, -7, -80, -125, -258, -152, 49, 114, 202, 135, 182, 79, -203, -272, -189, -168, -36, 110, 302, 225, 81, -57, -195, -267, -254, -101, 80, 256, 272, 233, -14, -68, -133, -331, -238, -60, 18, 158, 291, 225, 111, -148, -245, -231, -211, -3, 133, 286, 304, 164, 35, -110, -283, -181, -222, 63, 263, 355, 17, 78, -22, -162, -282, -352, -111, 21, 274, 395, 225, 13, -96, -222, -234, -280, -54, 164, 175, 402, 221, 30, -112, -330, -269, -136, 6, 246, 277, 303, 114, 10, -155, -342, -266, -33, 2, 206, 299, 231, 118, -99, -222, -268, -212, -46, 118, 155, 347, 103, 96, -217, -264, -275, -186, -65, 206, 166, 359, 182, -40, -128, -305, -222, -91, 15, 192, 213, 200, 75, -85, -194, -318, -204, -158, 150, 124, 256, 302, -18, -112, -238, -291, -210, -109, 297, 263, 298, 230, -62, -112, -217, -189, -150, 2, 215, 263, 249, 121, -15, -100, -141, -156, -166, 33, 217, 286, 185, 51, -97, -278, -190, -252, 39, 94, 306, 207, 185, 65, -148, -175, -132, -124, -54]
7328e4J54J38J86k90k70n1n2mJ60J61Q1L0M2j65j28k24L2K2K04J79P4P0k37n2
7352Fj40j23K0J38K5K96J01m6q7j77j54j54M7J73J02J18J18n5j46j14j60j54K53
7375a13J10N5J69J5q4m9j39k90P5j2K09J60J63Qj20j13j94j67J11R1P7K17J38
7398C17r4k82m6j34j04P8J60J8K37J26k18r2n2q1q5PJ16L24J07J6j88j43j76j20
7422c09J25M0J90J56L2o6n6j29k21L5J7J68K9K08L1q9n6k67M8q6n1J59K23rM3
7447A65Np4j85j70j06J85J99J36J31r4j53nk10l3m5J79P6K04R4r1j32j58j63j
7471b46J0K04K00J9Q0l3j86j66k5j05N1K72J01J28j8q5j48j60j62J0J13J51J95
7494B00N6N2k75k4j34r3p7K29J16J65K9O0k85j78m7j2K06r4L25M6j6r4p3k06j47
$$ y = [-54, 100, 238, 424, 134, -136, -187, -239, -243, -83, 78, 159, 189, 231, 66, -62, -286, -254, -232, -28, 151, 225, 295, 58, 6, -134, -257, -237, -99, -74, 222, 323, 277, 190, 13, -141, -295, -248, -75, 27, 145, 263, 208, 62, -52, -212, -366, -113, -3, 52, 221, 236, 152, 103, -36, -326, -251, -263, -54, 106, 269, 277, 157, 44, -150, -317, -206, -115, -38, 179, 317, 223, -59, -105, -239, -343, -265, -105, -87, 150, 276, 58, -34, -86, -167, -252, -245, -129, 195, 302, 318, 130, -13, -189, -309, -184, -144, 46, 202, 234, 168, 112, -17, -238, -203, -186, -18, 11, 219, 250, 161, 105, -162, -114, -200, -251, -92, 131, 122, 165, 170, 96, -89, -259, -365, -180, 19, 155, 286, 192, 39, 34, -176, -209, -254, -75, 1, 205, 299, 208, 76, -82, -245, -246, -236, -32, 168, 187, 267, 234, 48, -118, -143, -248, -197, 75, 176, 304, 286, 201, 53, -107, -269, -259, -146, 5, 200, 256, 308, 33, 9, -125, -218, -295, -66, 50, 215, 244, 304, 19, -159, -206, -218, -12, -106, 219, 265, 249, 155, 82, -124, -271]
7519b71%P3K26R1J46q5r1r6j76m6k3J23J47J30J10o2r1j60k76j1J11K40J39K0
7543A68K1M4k02j35n3l7M1R6K30K6o1R2j96k66q4J51L5K31N2j0O2j12j07p7j19
7568b10j8J50K18N6L4j5o3k23q9j4N8Q8J74J62j40j2k56mj10K5j3J64J73J19r9
7593A55j12Qr3j90j7K10J32J74Q2j20k10j44p8K0m5J27J58J95M1j08j76k23O2
7616a52q9J16J04J90J09o7j76j05j67QQ9Q2J30J53L4j8j52m1k48o1o5L11J51R7
7640B33o0l5j12k02j52N1J30J95J47m1Q3j03j32j95l2jJ18K39L0j4J90k86k16
7663a65Prl4J70R3J58J2p7Ml05k6jq7K48K20J1R7j27k23j59m2l1J62Q6J70J86
7689C38j83m3j92qj30j2K00Q4J08P1j03l4k06q4m6J14K28L1jJ11j7j33k08j29
$$ y = [-271, -271, -198, 28, 119, 265, 180, 89, -7, -183, -229, -252, -129, 18, 148, 258, 196, 105, -55, -331, -342, -231, 9, 148, 168, 189, 233, 31, -104, -157, -194, -153, -57, 173, 199, 138, 230, 34, -232, -316, -165, -130, 101, 153, 143, 205, 93, -14, -91, -210, -228, -78, 140, 196, 230, 215, 152, -71, -160, -174, -116, -28, 146, 308, 168, 156, -100, -104, -214, -189, -202, -38, 135, 254, 155, 43, 51, -42, -232, -249, -39, 93, 267, 349, 229, 19, -125, -203, -183, -228, -101, 57, 252, 293, 185, 9, -214, -152, -241, -125, -21, 169, 278, 211, 35, -70, -237, -229, -140, -58, 72, 225, 259, 241, 89, 48, -200, -261, -326, -15, 136, 233, 173, 138, 26, -176, -328, -277, -147, 48, 195, 154, 237, 134, 2, -193, -225, -226, -108, 131, 161, 147, 337, 51, -165, -158, -167, -201, -31, 62, 220, 232, 155, 159, -146, -172, -173, -260, -12, 208, 219, 316, 189, -34, -193, -235, -266, -104, -18, 152, 338, 155, 112, -80, -88, -218, -230, -30, 54, 162, 233, 130, 96, -110, -194, -240, -126, 102, 133, 132, 243, 226, 93, -115, -244]
7713b44lJ53P5J28J28ok01j16L9k49Q9J46J66R8Pl7k09j22M5j35J35P5M2J68J66
7738C38j34j46j97j89J59N5J03J30J65j02q5j32j37j5P2k6K16J13N6j75P1j76
7760c6l25J90o7K02N8J72K2k8j29j00j96k0J05K3K13J30l4r2k4j60j09j07J77
7783a35J41J24J17j9j56j18j90pQ5Q3K82n8N3K1k61j42M6n3K7K42J1J73q7nk02
7808b8j17j45K05J9M8J99O7k5j38m6k67P7j18J53Q7K26J09r9j78j86M5lN0J22
7832E7J43R4Pj91l5k17j47R4J32J47MR0j3j0j59k26O5m5J27J96k5J41N4j50j44
7857a1j00q6N4L9J77J02M2l5j22j61p2j02J86J73L2O8L9r5j65n9q7LrJ69J20O3
7883A63Lr4j61p8j16J10RK78R0j6l6o8k04j69OP7J93J20J63p4p1n7j76o8j3J12
$$ y = [-244, -247, -94, -19, 109, 237, 231, 30, -86, -47, -296, -207, -61, 105, 203, 210, 173, -36, -158, -113, -248, -113, -38, 4, 172, 338, 204, 58, -139, -328, -169, -114, -11, 119, 284, 182, 97, -35, -172, -187, -115, -141, 75, 188, 244, 69, 140, -36, -361, -171, -238, -36, 22, 194, 216, 188, 59, -41, -237, -257, -152, -129, 84, 214, 180, 88, 64, -96, -205, -312, -135, 6, 130, 247, 228, 72, -46, -236, -243, -158, -75, 207, 149, 202, 223, -38, -180, -134, -187, -160, 82, 93, 266, 179, 174, -28, -145, -290, -85, -66, -18, 181, 248, 223, 85, 39, -228, -151, -269, -116, -29, 197, 306, 207, 29, -157, -112, -115, -65, 57, 200, 294, 301, 110, 75, -142, -289, -195, -63, 84, 88, 178, 165, 155, -4, -230, -165, -210, -83, 113, 88, 229, 283, 133, -11, -111, -197, -143, -104, 73, 175, 217, 182, 60, -101, -173, -275, -89, 84, 116, 184, 223, 128, -37, -96, -183, -180, -189, -20, 100, 163, 166, 72, -89, -167, -283, -173, -164, 114, 204, 188, 152, 84, -120, -289, -283, -206, -13, 107, 270, 196, 125, 68, -108, -176, -189, -77]
7909g7O4R2J03Q6j55j62q4r0N4J0K15J67j6K7q2k24q6j42O8P3K67J49j00j07o5
7934a5j24j33J9K10K0J27K9J12j22j64j29l6R3L9K8J23N0J48k00r2j48R9j32N4
7958a44K73P9N2k16q9r6n3o5O6J12J29K69k36o9l6n7j75J96k2l9K42J22m2q9j62
7983e0j29LrP7K44Q4L8j88M3j33j71M5l5J12K25j6R7r3j34j50j1m2M0K02J12M4
8009B05L5j44j22j21j28J18M0J97k1J01pj5j70k02k1N7K06J56L6K8m3p1j85j56
8033b27O9L6J48Q9O3L4q3j51j38m1m5J52J32K17l7j7m1j76j78P6r1R5L04o9J62
8058B83j93M6k43l6K7J1K7J33R4M9J1l00k8m1j26K47N4J19n3J3M0j60m2j84O2
8083a90J30J36m1K01J7j63k76k0M2M2k4K33N8Rqj65Kj15n7N3J96L3O9j9n9r4m8
$$ y = [-77, -13, 79, 182, 268, 113, -49, -133, -223, -169, -159, 56, 223, 207, 234, 152, -72, -158, -300, -232, -159, 108, 257, 157, 50, -15, -139, -272, -253, -43, -23, 104, 133, 245, 123, -41, -170, -206, -113, -74, -46, 77, 127, 275, 75, -17, -165, -66, -198, -144, 129, 208, 260, 44, -45, -141, -194, -259, -193, -81, 48, 317, 81, 12, -24, -81, -256, -60, -82, -121, 121, 243, 201, 112, -50, -179, -176, -185, -108, 136, 220, 258, 70, 113, -20, -191, -146, -181, -69, 156, 140, 237, 144, 10, -140, -151, -193, -153, 49, 161, 205, 240, 96, -26, -147, -275, -157, -117, 80, 59, 160, 153, 138, -32, -234, -255, -198, 8, 164, 200, 228, 185, 114, -71, -227, -158, -122, 26, 115, 178, 212, 129, -22, -160, -201, -246, -94, 38, 255, 218, 201, 160, -16, -194, -118, -209, -114, 190, 121, 283, 90, 136, -107, -143, -116, -105, -78, 55, 149, 198, 209, -91, -119, -160, -286, -39, 15, 134, 81, 94, 134, -26, -68, -252, -190, -60, 76, 35, 236, 253, 90, -186, -206, -164, -122, -146, 87, 145, 154, 146, -19, -17, -132, -189, -136, 60, 93, 162, 143, 84, -10, -58]
8110e8j75K8R2J78M4M0L0p2r8j61MJ0J05J83K7M0j13k6r4j33j00J22M8O2K11j0
8136A84Pj69j79K0r6P8J98P3J26m8j52o9j45J1j6Q6J71L5Q7n3j35K4j59j03J51
8161g3rJ98Q4K6n9j60j8j26p0J19J54j5J47jp8n5l39N1R8J27J03J4Q8Kj31j09
8187c2j59k4P7l5
$$ y = [-58, -233, -205, -113, 65, 109, 149, 179, 107, 9, -152, -148, -138, -33, 150, 177, 217, 104, 78, -16, -149, -249, -127, -79, -17, 194, 184, 191, 22, -157, -137, -233, -155, 43, 116, 242, 194, 42, -27, -172, -161, -177, -91, 80, 115, 202, 149, 14, 38, -121, -224, -73, -82, 116, 200, 226, 167, 7, -11, -137, -207, -88, 66, 51, 198, 197, 119, 64, -275, -224, -126, 1, 104, 118, 206, 208, 77, -32, -191, -215, -138, -173]
8191a73
$$ Imaginary data points
##PAGE= N=2
##DATA TABLE= (X++(I..I)), XYDATA
0@%%%%%%%%%%%%%%%%%%%%oJ4j6J6j6J6j7K3l0L2l3M1m8N3o1O7p5Q5r3J02j15J30
42F9j43J56j73J91k09K29k53K80l08L39l75M14m57N07n65O30p06P99r11J052j233
63f67J469j800K300l119M695q770L8440J08394n821p338o6661j02939o9185l5021
77a46023M3876P4776P5594R0327J4118l9167q1291j05978l7499j5965L2384J12579
89A7731O2383M5448K5698o7891q0382p5885n5538R411M9490J01139P6649J5239
101A23492L450o6171r1355n8386m7906L3698O8835N9286R3239K4076n4435o2451
113B5372p9868n5525k0151L5928Q9184N6667N1700K3435n9928o5913p7286n6975
125a33360K4307L8541O8898Q2605K1432n295m6141p7785o0146l9736K2763N5725
$$ y = [0, 0, 0, 0, 0, 0, 0, 0, 0, 0, 0, 0, 0, 0, 0, 0, 0, 0, 0, 0, 0, -6, 8, -8, 8, -8, 8, -9, 14, -16, 16, -17, 24, -24, 29, -32, 35, -40, 45, -48, 54, -61, 69, -74, 82, -91, 100, -109, 120, -133, 147, -161, 178, -197, 217, -240, 267, -298, 332, -374, 425, -486, 566, -667, 802, -998, 1302, -1817, 2878, -5892, 32548, 140942, 135121, 127783, 61122, -41817, -111002, -146023, -102147, -27371, 48223, 138550, 152668, 113501, 32210, -73768, -111267, -127232, -94848, 17731, 80114, 125562, 151260, 83369, 2987, -72898, -128436, -119025, -69535, 31604, 108253, 123492, 126942, 60771, -30584, -88970, -136876, -103178, -34343, 24943, 118182, 142258, 87823, 25372, -54496, -110021, -130172, -94244, -5060, 51607, 103307, 126742, 66814, 901, -76385, -133360, -109053, -70512, -1614, 80991, 102423, 97128, 50987, -26798, -86944, -126680, -103917, -48192]
137d8192O2702Q1919J2882l5269l7892q2306n6428p826J8210O9710O5994M7377
149I0881K4167m3009o5783o6832m4578Q040K7139O9238P5654J8992O340l5132
161F5117p9558n2226l4249P793N5904N9553O1088K2578k0257m1393p1396m8580
173g5626j5502J0380O2859O0388M3430K6368l8741n7388n0391n0931n632L1718
185e9068N5398O1851L1143R444l5071o8917m7878l6556J845M7287M9735N8032
197F7245K8712j9617l3580o0069n6045j7010J1656M8326N6653M5010K1911l0282
209F2910m6040m8791n2714o331K6928M4202O0895L4147O264k5824n9714m8456
221e2524l1704l768L6687M9908N3580K7496j0429k6849n7347n3522j4583O108
$$ y = [-48192, 14510, 96429, 109311, 74042, 36150, -46156, -102584, -110410, -92200, -22490, 43504, 90881, 115048, 72039, 6256, -60576, -105154, -97114, -69975, -737, 74917, 93909, 100249, 65117, -14441, -66667, -100916, -93123, -37219, 22334, 83422, 106000, 85743, 44350, -27046, -75626, -91128, -80748, -17889, 42499, 85929, 112297, 73556, 16168, -34223, -85154, -90786, -59068, -3670, 58181, 89324, 98768, 63697, -5220, -53098, -89654, -87809, -40522, 9213, 67245, 95957, 76340, 42760, -17309, -73354, -90364, -78708, -30382, 26271, 71281, 93192, 62910, 16870, -31921, -84635, -90966, -64038, -19836, 41059, 75206, 81470, 55646, -4068, -52524, -84228, -87996, -51309, -1401, 52179, 79675, 69246, 42397, -14950, -68472, -83055, -76947]
233g6947L9186N6359M1721K1675j7941m1723m6274m7630j2256K1982M1443N4836
245C4431L4692J1325j9929n3814m4702l1183j0805L1810M7940M7500L0966k813
257G5418k6347n1480m9671j8684K603L3898N1699M0697K3896j2959l8136m3329
269a2395m6512j5477J9229L5258M8900L7120J2195j7707m5977m2665l3292j2898
281g4221K6706M1656M3822L2534P74k2915m5855m7755k1671j560K6692M7950M1223
294D7380K4027p578l2472m2284m5897j7448J3776L0367M6974L8521J3566j3935
306E4997m0379m1899l3683j4687K2179L9011M1307L2786M716j9905m1560m3739
318d0856k2701n135K2863M5179L9014K4345k013k7251l9313m2972j9158Q931K5990
$$ y = [-76947, -37761, 18598, 60319, 81994, 64053, 22330, -23944, -71574, -83830, -61848, -20405, 34431, 69123, 80448, 60519, 6705, -37997, -69180, -79985, -48175, -235, 47265, 78231, 75418, 49071, -2409, -52080, -70764, -68161, -34263, 17436, 58133, 82029, 69070, 30934, -12395, -58907, -74384, -55155, -19897, 29003, 66123, 78318, 60611, 14634, -28031, -61323, -74221, -47515, -5859, 37963, 70497, 71271, 48356, 2501, -45254, -66925, -68485, -41793, 6157, 47380, 71407, 63829, 31357, -10927, -56824, -74272, -60496, -30129, 16845, 55366, 68932, 54997, 14618, -27281, -60964, -75651, -53472, -14461, 26846, 59632, 64348, 44443, 2883, -40856, -63557, -68692, -45829, -650, 38364, 62709, 60696, 33445, -5868, -48840, -67998, -59067, -33077]
331c3077M4036L9375J5736r481l4318l9538l4914j7107J8574L5446L9518L4190
343E8440Q456j7111l8055m1865k4711p622K0107M2516L7360K4575J320k3896l7359
356B155m1146k0268N935K2232M0822L7633J6111n888k9480l7584l4811j8283J3945
369d8627L0467L6320L4380J1142j4044l3583l9940k6996j0543J6350L8550L5584
381B9060K5711N162k0799l6087l9515k1660J993J9199L8535L7075J6866k864k5820
394B6856l6513l3917j8557J0556K7111L4079L4088J2712j0969k9458l7325k6984
406d8321j1892J2753L4297L3733K6766Q735j7647l2315l6268k3322k217J6781
418c8917L6173L5444J8861J442k1852l5162l2927j9181O607K3582L2919L4970
$$ y = [-33077, 10959, 50334, 66070, 56589, 22271, -17267, -52181, -69288, -50714, -15268, 24250, 58440, 66896, 49785, 11730, -30135, -54846, -62468, -42361, 155, 37515, 62090, 63410, 39514, 2155, -38991, -59259, -53324, -31092, 9730, 47363, 63474, 57586, 28106, -9478, -44289, -62572, -48627, -18160, 18160, 52540, 63682, 49638, 16055, -23885, -50881, -61424, -45074, -6524, 29060, 54771, 59933, 39134, 3047, -36468, -58128, -56135, -36936, 1599, 38674, 55540, 52676, 26856, -9657, -43574, -62131, -51575, -24464, 9615, 43703, 56415, 45446, 15988, -21337, -48321, -60213, -47460, -13163, 20570, 47336, 56071, 38424, 6109, -30159, -53481, -55698, -38917, -2744, 32700, 51561, 53003, 31151, -4011, -36938, -56119, -49512, -25930, 6989, 41959]
430D1959J4654r593k5430l4253k8455j3635J1040L1152L1654K7178J0959j5454
442D1776k9634l3822k4225m102J3983L2386L4187J9648L291j8503l2923l1971
454b9909j9778K812K0007L1524L4168J4153o713k0567l3376l0427j3783Q436K6709
467a6744L0506K7471J2433j3072k8040l1510k4120p546J0980L0759L2985J8901
479D3003N604j4339l2022l1383j9307l10J7796K9641L1586J6065k827j8591l1999
492g083k9070j4745N357K4266K9458K6788J3975j0557k4913k8110k5473j0620
504e0727J0766K8437K9843K0661Q826j2792k9834k8992j9429k841J5090K6915
516d077L1089J8484j288j6217k8415k9679j6112M295K1065K7205K7302J4861p717
$$ y = [41959, 56613, 47020, 21590, -12663, -41118, -54753, -43713, -12561, 19093, 46271, 57230, 41776, 12142, -21680, -45905, -50007, -36024, -3638, 30549, 50197, 53488, 34985, 2062, -29909, -49687, -46875, -26868, 4656, 38824, 52977, 46264, 25697, -7679, -38106, -51889, -43453, -16744, 13762, 41233, 53666, 40594, 12554, -18956, -43076, -50622, -39642, -8883, 24102, 43003, 48607, 34268, 2246, -29137, -48444, -48754, -30958, -1317, 30269, 46334, 43507, 24916, -7083, -36153, -50898, -45541, -21275, 8183, 34971, 48946, 38389, 13476, -14634, -40107, -50727, -39961, -11524, 18319, 38980, 47806, 35014, 5180, -23812, -43241, -46082, -30992, -4077, 27012, 45496, 44208, 27991, -424, -30103, -46215, -41920, -20855, 6350, 33652, 48513, 40796]
529D0796k1222k7653k6891j0693R182K3654K9697K2386Q344j1126k6227k7935
541a7688j9753n260J1750K5858L0042J7700R56j3087k8075k9374j4361J506J6048
554b3738K6579K6729J4485m003j9061k7237k6105j2102O117K2029K8089K1734
566C3516R822q193k4741k6202k0175q993J0445K5875K7604J8163M148j2842k6818
579A609k6198j5259j706J4511K5480K5623J5837k128j7430k4719k5681j3428O169
592c7320J9378K4127K2986J2029p374k0650k3784k2195j0683R944K3390K5455
604A5303J9400N757j0315k3247k5974j6630k832J1080K3876K7207J5888j292j4012
617B4209k3454k6172j3084M652J5257K3147K3872J1857m615j8029k4429k1977
$$ y = [40796, 19574, -8079, -34970, -45663, -36481, -12827, 16870, 39256, 47600, 36474, 10247, -17688, -37441, -42701, -30951, -5093, 24949, 42649, 43605, 30518, 2443, -26931, -41292, -39786, -23738, 2841, 29570, 44055, 40052, 20991, -6246, -32351, -44453, -38336, -16307, 11782, 33516, 43338, 35145, 10404, -15798, -35973, -44966, -34521, -8646, 18958, 37121, 41269, 28427, 1609, -24589, -39848, -41554, -27043, -1563, 24060, 39897, 37769, 20339, -4380, -30061, -43489, -37320, -17942, 6185, 29171, 41200, 33826, 13176, -10608, -32803, -43486, -33542, -10152, 15303, 34703, 40460, 30145, 6898, -19076, -35706, -38538, -27458, -3582, 23625, 39513, 38221, 24209, 755, -25417, -38501, -33849, -18592, 4555, 28427, 40284, 35669, 17640, -6789, -28766]
629b8766j0189P507K0934K3768J8284P606p092k2088k4914j6013o069Q054K3896
642e082K5708J4461J720j1023k3076k4785j3744J186J3157K1740K3330J4019k743
655C4868j7806k2935k0693j2126N491J9626K1556J8455J0095o292k0384k2903
667a3048j7504p402Q373K1781K3017J5266L704j0021k0367k3072j4833n11J1045
680b3572K0060K4113J4419k812j4533k0112k1245j2590M311J6387K0225J9976
692B4627J0978n093j7844k2494j7843p011O355J9188K2830J5528M598p639j8890
705G290k2526j4879k130R161K0017K3166J2677n94j1339j9773k0659j2001J455
718c0135J3777J9813J9609J1419l631j6265k0677j7288q818M298J7777K0806J5087
$$ y = [-28766, -38955, -31448, -10514, 13254, 31538, 39144, 32052, 9964, -14950, -30963, -37032, -28978, -5082, 20626, 35087, 36807, 25784, 2708, -22077, -35821, -34635, -21478, 262, 23592, 37611, 34868, 17062, -5873, -26566, -38692, -33201, -13575, 7981, 26436, 36531, 30239, 9855, -13048, -30552, -37954, -29581, -7800, 15217, 30483, 34187, 24166, 3799, -19273, -34106, -34617, -23572, -3512, 20601, 35020, 32208, 17675, -2437, -23682, -36272, -31961, -15574, 4651, 24627, 35605, 30512, 12668, -9826, -27669, -34680, -28325, -9137, 13693, 29221, 33819, 26180, 7290, -15236, -30115, -32245, -23084, -3067, 20099, 32776, 32182, 20843, 1070, -19589, -31590, -30135, -16358, 3455, 23064, 34483, 30852, 14587, -6090, -23378, -32196, -27898, -10121, 10685, 25772]
731B5772P256n781j8542k1240j5067m255Q140J8762K1237J3077J309r690j8690
744B288k0152j3079L14J2565J8240J9176J2110l081j4274j8598j7836r767L842
757b8252J5657J9097J5907Q384n142j7188j9483j5356n086P004J6947K0216J3333
770B6038K733p372j7690k0193j2454m20J0352J7062J9392J1974k162j1728j7136
783a604j8162r933K647J3721J8517J5845Q933l614j5831j8447j4651o321N451
796b3449J5638J9355J3522L971o010j7035j9063j2044k387Q623J6664J8507J1768
809B8060o90r997j6190j8167j0380J728J1925J7081J5741R911k956j4650j6687
822e271j4624q001M262J4529J7989J3550M992m764j5729j8323j2243l651P068
$$ y = [25772, 33028, 27247, 8705, -12535, -27602, -31857, -23717, -4955, 16282, 29359, 30668, 20978, 2288, -17864, -30943, -30629, -18064, 176, 19352, 31462, 28381, 14107, -4491, -22327, -32094, -28252, -12595, 6502, 22409, 30793, 25651, 8463, -11020, -26376, -31462, -24458, -7511, 12705, 26038, 28771, 21399, 3709, -16484, -28938, -29358, -19006, -1944, 17448, 29422, 27260, 15532, -1604, -19766, -29699, -27052, -13331, 5186, 21031, 29964, 26350, 10519, -7928, -22579, -28900, -23449, -7811, 11544, 25066, 29037, 23027, 5992, -13071, -25115, -27502, -18879, -2215, 16292, 28060, 27370, 17373, 1183, -16984, -27364, -25636, -13711, 3370, 19111, 29022, 26066, 11416, -5271, -19895, -27896, -23634, -9105, 8884, 22434, 27426, 22662, 6933, -11390, -23633, -27284, -20216]
835b0216J5516J7596J2464N57q653j5154j8152j0646O31J0106J6388J6045R932
848B6414k198j2759j5249j5230q888L990J3080J6730J3878N756l517j4486j7610
861a0089j1574m899N600J4795J6876J2293J911o985j4080j7777j0652k48Q352
874a6477J5580J5894J0186n67j1355j4576j5115r561L259J1800J5680J4161O721
887B5630k841j3341j6518j1816n997M541J4273J5801J2068L210n928j3297j7236
900a1451j0556j037O506J4509J5689J0207K79r691j3756j4933j0124K188J0286
913a1884J4282J4418P606k012j2126j5739j1879p011L255J3305J5048J2159M409
926B3831m951j2689j6531j0900j926N167J3752J5650R997J343q478j3105j4426
$$ y = [-20216, -4700, 12896, 25360, 25917, 17264, 2110, -16042, -26688, -26057, -15951, 437, 16482, 26414, 24216, 11457, -3792, -19022, -27910, -23920, -10840, 5890, 19768, 25524, 22007, 7521, -10089, -21663, -26562, -20962, -6167, 10709, 23002, 24913, 17928, 3848, -13929, -24581, -24829, -16477, -897, 14997, 25183, 24616, 13261, -1315, -16430, -25991, -22732, -10932, 4748, 18909, 25630, 22789, 9448, -7070, -18886, -24883, -20342, -6069, 9732, 21800, 25010, 19082, 5785, -11451, -22007, -23044, -16538, -2029, 13660, 23867, 24146, 14455, 699, -14234, -24358, -22170, -11884, 2398, 16816, 24422, 22410, 10284, -5455, -17334, -24345, -21090, -7785, 7263, 19422, 23831, 18880, 6191, -10340, -21240, -23166, -17999, -4247, 11403, 21400, 22743, 14265, 1160, -13266]
939a3266j0445J457Q904J3287J4530P949j306j0591j4761j1862p487K237J2278
952i076J4155J2203N436l894j1614j5746j0852k954L857J3269J5236R811K538
965B2369o881j2531j4037j0634K55Q036J2599J4592Q186o71r167j3986j2028p849
979b1747J435J1435J3003J2146O386l590j0477j4405j1327l836L163J2272J4482
992H940R477L734n586j2233j3677j0551n15O548J1479J4699Q399l51p530j3129
1006b96j2372q411P58J0458J2059J2011P337k929r829j3688j1465m221K382J1090
1020g116J4005R443M278m343j1734j3059j0376j607N693J0828J4390Q220M38n927
1034A3133j2494j2740q053O7R111J1292J2033Q146k403r135j2319j1082n513J530
$$ y = [-13266, -23711, -22254, -13350, -63, 14467, 22416, 21110, 10519, -4242, -16104, -23591, -21354, -9076, 5079, 17282, 22718, 18824, 7210, -8536, -19388, -22342, -18485, -5216, 10020, 19831, 22369, 15488, 2957, -11080, -21714, -21459, -13423, -824, 13768, 21954, 21283, 12116, -1870, -13898, -21747, -20312, -8877, 4126, 16272, 22658, 19068, 8591, -5814, -17141, -20977, -17814, -5542, 8940, 18417, 22151, 16565, 4332, -9345, -19896, -20411, -13863, -2384, 12315, 20714, 20363, 12833, -296, -12668, -21079, -20321, -9863, 2196, 14207, 21544, 18615, 8786, -4902, -16367, -20588, -18206, -7116, 6889, 16332, 20610, 16267, 4533, -8526, -18902, -20509, -14816, -3988, 10402, 18622, 19060, 13133, 639, -12101, -20154, -20087, -10976, 316, 12349, 20495, 18092, 8957, -3362, -14444, -19957, -18427]
1048a8427J0556J3422R201N246l103j1372j2360j0165k515M948R905J3671Q951
1061A7958J133m986j1779j2315q198p63P827J0702J2022Q516k110p988j0993j1707
1075a2681o136J310R411J2483R332O060k494j0784j1778r756l445L717R152J3590
1089G981Q938J224l617j0871j2532q185j396O638J0370J1446Q545j056o795j0545
1103A45j2070o266O77Q142J2091R524O092j502j0237j0938r586m750L016R085
1117f577J2896Q583K165k516j0485j2459p687k153N469R906J1073Q705O8o398
1131A0590r548j1651o939K10P320J1360R444O586o97r162j0015r971n593K825
1145a5241Q299J1744R148L229k244r685j1888p630k840M369R295J1003Q948M56
$$ y = [-18427, -7871, 5551, 14752, 19998, 16895, 5523, -6837, -17002, -19517, -14569, -4664, 9007, 17958, 19091, 14105, 2326, -9989, -18187, -18950, -11123, -421, 11601, 20117, 18007, 10019, -974, -12681, -18817, -17507, -8096, 4387, 13719, 19779, 17285, 6501, -5277, -15033, -18478, -14761, -5609, 7981, 16919, 18143, 14526, 3655, -8877, -17062, -18458, -11820, -1450, 9996, 18541, 17485, 10690, 145, -11925, -18191, -17514, -9372, 2719, 12243, 18335, 16833, 6596, -4342, -13928, -18678, -15662, -6577, 6319, 14902, 17067, 14551, 4066, -8393, -16080, -18233, -12764, -2858, 8215, 16920, 16988, 10590, 1042, -10609, -17548, -17338, -10018, 1342, 10786, 17372, 16675, 7513, -2502, -12473, -18066, -15241, -6942, 4802, 13950, 17179, 14935, 5250, -6638, -14268, -17108, -12739, -3444, 7559, 16507, 16963]
1159A6963n390q751j1938p297N11O061J0183R883O628l55p972r725r640o201K171
1174a4869P654J0928R349L450j594q742j1536p511l488K877R114J0827Q473J423
1188A6355m463q524j1781o941l04M639R900J0079O638L92p317r362r284o819J508
1203a5284P472R960R106M186r05q211j1061p202m184K016R139R976Q228K356l929
1218A1663p731j1127p162r48L798R137J0043O939R85o466q650r164p242J092O760
1233h073Q945R291N058q12p170j0314p712m752J647Q496R691Q100K970l063p133
1248E169j0729p612j187K925Q342J0210O736J456n217q175r223p309N32N659Q057
1263c66R536N355p8o256r909p767n067P50P809Q982P885M001k150o955j0240p592
$$ y = [16963, 11573, 2822, -9116, -16413, -15902, -9841, 342, 10225, 16853, 16498, 8526, -1199, -10839, -17040, -14869, -7215, 3713, 13062, 16512, 14918, 6176, -5360, -12871, -16359, -13482, -4368, 6459, 14932, 16355, 11892, 3368, -8413, -15354, -15658, -11019, -1119, 8960, 15598, 15990, 8673, -689, -9973, -16792, -15284, -7812, 2148, 11254, 15440, 14535, 6324, -4737, -11939, -16123, -14107, -4968, 5008, 13236, 15592, 11663, 3932, -7195, -14357, -15305, -11507, -2370, 7673, 14612, 15597, 9131, 481, -8683, -15925, -14833, -8073, 872, 10163, 15221, 14409, 7239, -3075, -10787, -15539, -13892, -5396, 4295, 12395, 15365, 12302, 5169, -5560, -13172, -14359, -11434, -3092, 7118, 13854, 15310, 10093, 1918, -7305, -14614, -14082, -8423, -366, 9170, 14525, 14447, 8191, -1718, -9485, -14552, -13802, -5993, 2989, 10874, 14875, 12725, 5770, -4470, -12062]
1279a2062j981J946Q036J0018O463K201m136q057q937p309l28M825P677R375O044
1294A3775R1n572r126p962n398J95P143Q383P823M905j828o573r372p707k735
1309a3958J441P559R641O529K812l251p408q867p434q70M193O824R631O287K68
1324A3397m695q251q039n646n00O557P826P919N363j241o034q751p775l171Q56
1339a2185O676R568O466K990k003p224q721p117j649L361O483R719O296M53l757
1354I356p702q126o040p10N747P414P676N705o04n740q145p629l712K85O160R163
1370C098O300L494j386o879q262p091k304K910O052R102O349J026k902p236q275
1385f004n967j079M919P042P427O108k98n171p415p598m316J83N533Q562O229
$$ y = [-12062, -14043, -12097, -4061, 5957, 12420, 14621, 10485, 2428, -6509, -13818, -14146, -9321, -1644, 7731, 13775, 13866, 8294, -832, -8794, -14192, -13997, -6854, 1529, 9352, 14257, 12429, 5856, -3516, -11223, -13958, -12517, -4958, 4683, 11212, 14024, 10773, 3365, -5502, -12936, -13806, -9613, -2789, 6842, 13129, 13397, 8702, 451, -7588, -13234, -13734, -7177, 649, 8568, 13931, 12690, 6656, -2095, -9870, -13041, -12185, -5509, 4059, 10525, 13515, 11512, 4288, -4433, -11550, -13199, -9838, -3355, 6364, 12660, 13113, 9356, 1654, -6472, -12512, -13222, -7475, -61, 7615, 13320, 12716, 6976, -1169, -8798, -12510, -12225, -6065, 3098, 9398, 12892, 11506, 4627, -3635, -10726, -13030, -10120, -4068, 5034, 11383, 12409, 9507, 2271, -6004, -11971, -13050, -8131, -1089, 6338, 12446, 12148, 6977, -438, -8036, -12352, -12169, -6636, 1926, 8155]
1400H155L968n64o540p884p002k764K246N574Q673O631J503k206o619q193n871
1415a0893j651L971O634P456O320J93m430o786p700m725j53N040P911O239M503
1430A1929j51o009p642o513l361J491N228Q559O251J780j290o175q182n926j725
1445a1736L116O136P210O335P88l912o200p589n085m51M203P206O550M670M37
1460A1678n735p085o277m121J020N007P819O360K255r31n634q118n468k302K295
1475i237N902P191O351Q44l299n459p622n272n90L632O711O382M900P80n049o630
1491d65o147m385M39M609P301O363K750m66n085p687n561k568J470N666O942O170
1507I346J558k659m926p615n584p49L046N915O674M904J115m323o234n938m835
$$ y = [8155, 12123, 11559, 5019, -2865, -9867, -12631, -10385, -4811, 3862, 10493, 11996, 9790, 3171, -5022, -10893, -12544, -8573, -1939, 5517, 11837, 12030, 7600, 814, -6886, -11611, -11764, -6724, 1187, 7426, 11929, 11778, 5769, -1873, -8386, -11747, -10256, -5028, 3531, 9782, 11562, 10272, 4097, -4085, -10011, -11736, -8620, -2484, 4726, 11061, 11849, 7937, 1737, -5852, -10937, -11388, -7185, 21, 6571, 11241, 11678, 5943, -1142, -7419, -11540, -10520, -5513, 2306, 8666, 10921, 9990, 4356, -3762, -9230, -11532, -9237, -3335, 3856, 10207, 11051, 7752, 2293, -5329, -10601, -11191, -7559, -848, 5534, 10434, 11214, 6165, -465, -6612, -10997, -10558, -5949, 1352, 7715, 10465, 9999, 4914, -2773, -8334, -10902, -9432, -3766, 3176, 9346, 10904, 8245, 3319, -4296, -9880, -10629, -7583, -1668, 5006, 9910, 11025, 6702, 468, -5470, -10305]
1522a0305P2M393O493O238L225K9m539p391n518k938Q71N261O704N819K244k265
1538H393m632p256n537j025K117N732O562M878J493l729n875n918n081k42M062
1553f058N716O323L636K89m157p082n401l120K84M879O441N656K644j674m421
1568C955o935n535j297J734M972O628M875J682l027n470n768n252n23L503N297
1583a161O394L979K67l646o339n314l565o1M440O132N544K962j101m111o559n459
1599g598j681J138M570O777M617J831k222n032n758n176q24K881M877O205M211
1614H816N68l154n899n312l665p12M320N632N254L460o11l805o254n386k112P56
1630h104M133O385M665K061j563m535n802n198j291K706M146O155M578O23k735
$$ y = [-10305, -10233, -5840, 653, 6891, 10116, 10145, 5606, -1785, -7303, -10241, -9370, -4109, 2595, 8414, 10658, 8393, 3761, -3495, -9032, -10057, -7940, -2208, 4354, 9232, 10725, 6996, 1121, -4797, -9878, -10120, -6058, -342, 5981, 9617, 9906, 5749, -1333, -6734, -9854, -9570, -4691, 1750, 7406, 10050, 8376, 3955, -2980, -8515, -9812, -8078, -3106, 3522, 8397, 10079, 7052, 1582, -4186, -9438, -9961, -6458, -1161, 5233, 9212, 9479, 5833, -506, -5820, -9385, -9446, -5006, 1126, 6670, 9632, 8531, 4420, -2139, -7598, -9279, -8141, -3571, 3206, 7823, 9654, 7432, 2400, -3358, -8534, -9358, -6477, -1600, 4605, 8816, 9384, 6230, 331, -4981, -8646, -9358, -5038, 594, 5848, 9308, 8697, 4892, -1362, -6748, -8860, -8104, -3971, 2414, 7079, 9140, 7577, 3042, -2760, -7958, -9249, -6543, -2397, 3758, 8336, 8959, 6224]
1645F224n187n278m139q94L840N287M976L935l71l472n690n345k360K67L701O157
1661A651M721K217j002m272n587n043j505K040L863N889M558Q81k066m690n338
1676c683m023j226L223M933M741M244J09l175n265n043k781l31L544N991M439
1691E697K404k66m070n463m832j716J481L499N728M696J165j681m370n173m122
1706g023j440K697M501M706M344N47l061m706m847l205n15L118N415M466K772
1721G769P1l667n111m722k147R27L209N337M824J329j102l821n292m246j570K175
1737f037M114M691M421Q10k590m200m898l531o81K731N085M280K932N16l361m774
1753d92m487k615N05K933N301M609J464n25l355n344m030j765J565L789M659M301
$$ y = [6224, 1037, -4241, -8380, -9274, -5434, -147, 4829, 8764, 8393, 4921, -769, -6114, -8474, -8207, -4506, 1651, 6372, 8589, 7587, 3315, -2272, -7315, -8820, -6780, -2917, 2972, 7530, 8411, 6345, 1655, -3683, -7706, -8932, -5709, -776, 3965, 8209, 8318, 5143, -122, -5165, -7946, -8277, -4733, 1258, 5697, 8101, 7835, 3765, -1698, -6530, -8246, -6765, -3266, 2462, 7158, 8323, 6642, 2272, -2901, -7023, -8463, -5766, -1265, 3441, 7785, 8332, 5271, 565, -4282, -7487, -8002, -4884, 531, 4997, 7769, 7840, 4173, -938, -5660, -7807, -6880, -3671, 1666, 6490, 7819, 6717, 2896, -2396, -6642, -8212, -6037, -1923, 2768, 7189, 7999, 5409, 1209, -3689, -7220, -7901, -5170, -85, 4195, 7127, 7643, 4282, -492, -4979, -7594, -7089, -4156, 1145, 5754, 7218, 6693, 3338, -2006, -6036, -7801, -6236, -2447, 2212, 6513]
1769F513J107k076l907m794l560q20K193M725M288K938R21k924m598m232k842
1784g068J81K759M806M393J907p7l184n223l899j801J079L428M408M347J364j846
1800E574l270m721l763j016J969M173M084L338J081k642m249m179l015q9K397
1815d328M421M337K123J94k822m918l802j964N43L096M468M273J349j374l059
1830B537m574l987q68J505L622M246L465J243k395l886l993l195m53K190M200
1845c43M241K260L31k436m614l764k110J51K898M200L999J729j001k545m583l819
1861e406j075J119L227M224L383J278j949l378l868l563o79K196L589M170K579
1876E847N78k109m499l406k318l38K753M070L778J843m76k432m306l881j214P57
$$ y = [6513, 7620, 5544, 1637, -3157, -6717, -7537, -5344, -619, 3669, 6607, 7528, 4604, 6, -4226, -7068, -6887, -4128, 678, 5071, 6978, 6901, 3717, -1506, -5405, -7206, -6127, -2699, 1709, 6056, 7420, 5574, 2304, -2417, -6180, -7196, -5227, -1054, 3030, 6368, 7449, 4807, 558, -3621, -6636, -6725, -4328, 93, 4430, 6553, 6747, 3925, -993, -4795, -6759, -6216, -3120, 1348, 5621, 6970, 5596, 2537, -2037, -6024, -6892, -5387, -1765, 2481, 5946, 7189, 4794, 908, -3085, -6280, -6733, -4543, -343, 3898, 6158, 6489, 4053, -561, -4325, -6435, -6284, -3386, 814, 4813, 6542, 5541, 2996, -1587, -5406, -6481, -5362, -2135, 2089, 5472, 6750, 4801, 1423, -2445, -6008, -6687, -4491, -902, 3268, 5847, 6425, 4316, -183, -3589, -5907, -6245, -3492, 578, 4356, 6199, 5723, 3291, -1015, -4896, -6110, -5353]
1892e353K831M223L335J388j569l096l735l424q81J855L338L802K851N83j792
1907D356l964l513k466m84K379L856L612K017j61k262m010l763j369L87K534M017
1923A166L492J257j074k675l680l575j011J530K879L721L112R42j757l631l298
1938b602k702o91K142L510L518K192J30j989l718l681j464K1K207L862L454J443
1954E632o96k484l532l569j054J209K516L635L175Q68j471l036l375k659q39J696
1970c984L386L294K321M80j918l471l487j771l1J961L775L274J443k58k308l485
1986g79l376j293J036K325L404L145J036j157k939l164k744r31J511L006L103
2001B183K540O43j722l167l362j898m79J896L487L150J592P5k045l441l170j407
$$ y = [-5353, -2522, 1701, 5036, 6424, 4855, 1759, -1976, -5400, -6281, -4426, -1088, 2714, 5565, 6148, 4356, 392, -3121, -5587, -6071, -3692, 164, 3776, 5793, 5632, 3370, -640, -4403, -5772, -5385, -2851, 1166, 4658, 5915, 4841, 2166, -1514, -5089, -6100, -4570, -1691, 2030, 5142, 6084, 4327, 696, -2602, -5304, -5995, -3853, -343, 3175, 5367, 5497, 3508, -210, -3891, -5355, -5334, -3127, 735, 4189, 5632, 4936, 2452, -1080, -4649, -5703, -4494, -1978, 1657, 4832, 5700, 4229, 1193, -2182, -4841, -5680, -3984, -598, 2696, 5017, 5497, 3579, 108, -3379, -5150, -5181, -3220, 555, 3829, 5272, 5014, 2706, -779, -4155, -5448, -4412, -2087, 1317, 4462, 5498, 4341, 1402, -1762, -4506, -5437, -3926, -920, 2183, 4723, 5366, 3644, 477, -2885, -4783, -5262, -3366, 121, 3271, 4863, 4938, 2893, -548, -3718, -5125]
2017e125O42K094L340L092J143q54k516l290k679j174J344K806L007K426Q25j375
2033C706k930l192k140l56J460L196L103J734K59j848l240l079j442L72J784L231
2049F18L094J212p01k167l189k841j083J183K334K880K804Q57j410k552k900k265
2065d126o83J475K927K812J888M44j560l056k936j664K1J665L250K820J339m25
2081D191j850l030k857j170R10K143K798K736R67j153k462k753k482p65J339K799
2097f39K586K063O98j602k951k589j784k18J630K862K804J338n6j688k948k652
2113c146j228N54J904K698K720R96r80k050k793k404p92J046K453K651K106P53
2129D488j179k802k635j844l53J345K780K755J381O4j275k893k720j279K89J679
$$ y = [-5125, -4483, -2389, 951, 4043, 5186, 4332, 1816, -1474, -4153, -5327, -3983, -1177, 1830, 4256, 5081, 3706, 776, -2416, -4556, -4912, -3452, -256, 2847, 4581, 4840, 2992, -248, -3327, -4769, -4397, -2613, 618, 3712, 4924, 4223, 2056, -1133, -3974, -5057, -3874, -1540, 1340, 4144, 5001, 3591, 1039, -1861, -4126, -4809, -3334, -407, 2405, 4293, 4737, 3177, 121, -2815, -4479, -4458, -2793, 457, 3277, 4616, 4191, 2341, -689, -3546, -4716, -3806, -1663, 1135, 3871, 4838, 3685, 1223, -1530, -4012, -4777, -3438, -639, 1947, 4010, 4708, 3106, 155, -2434, -4218, -4436, -2806, 56, 2860, 4198, 4142, 2454, -494, -3146, -4374, -3820, -1916, 782, 3502, 4498, 3518, 1468, -1325, -3729, -4521, -3475, -1022, 1629, 3735, 4488, 3309, 507, -2128, -3972, -4325, -2980, -200, 2555, 3936, 4000, 2725, -168, -2888, -4167, -3878, -2199]
2145b199K588K909J046p76j862k542k580p96Q27J969K632K271P81j031k379k523
2161a665j952p10J419K479K525J563L73j255k753k532j326j2J532K622K506J094
2177C908m50j363k683k520r63O01J985K453K209R90j039k166k270j998p68J107
2193b967K253K441J675M76j097k556k391j343k26J206K541K521J265k15j482k437
2209c36k465r79M88J441K605K095R89o66j933k130k232r11J045J982K277J932
2225C202N76j019k249k213j422o18J135K373K270J397Q1j247k162k620j055K49
2241c322J301K477K231R46l71j786k127k133j066J047J719K086K052N69p82k159
2257F82k252j460o69J182K196K115J423K11j077k114k408j221J32J059K472K116
$$ y = [-2199, 389, 3298, 4344, 3568, 1706, -836, -3416, -4212, -3385, -1416, 1216, 3487, 4268, 3237, 858, -1665, -3617, -4327, -2908, -429, 2096, 3659, 4032, 2777, 24, -2508, -3834, -3846, -2314, 308, 2814, 3908, 3458, 2095, -588, -3108, -4071, -3470, -1485, 968, 3177, 4167, 3128, 962, -1308, -3306, -4074, -2967, -714, 1727, 3402, 3878, 2781, 225, -2166, -3509, -3735, -2529, 12, 2533, 3798, 3583, 2101, -336, -2801, -3780, -3292, -1851, 754, 2849, 3838, 3172, 1239, -891, -3123, -4034, -2989, -1007, 1270, 3202, 3778, 2759, 510, -1703, -3125, -3743, -2608, -235, 2035, 3432, 3513, 2266, 104, -2516, -3571, -3322, -2021, 456, 2687, 3633, 3262, 1476, -651, -2784, -3850, -2803, -1084, 1002, 3054, 3623, 2841, 682, -1570, -3030, -3699, -2517, -321, 1794, 3217, 3428, 2351, 237, -2171, -3392, -3260, -2201, 271, 2387]
2273B387J019k17j570k112j976j228R34J451K083K084N77o73j706k290j473p88
2289c498Q87K045K069J410N17j165j864k299j125j70R56K282K041R73R0j319k069
2306b39k100j191P43J413J765K123Q12o54j554k053j619q39P20K036J728J560
2322B651P31j040j856j954j428j68O57K207K127R75K56j291j962j924j113M65
2338b667J032J864K138O90m36j201k003j692q60N52J752J665J666P96r40j668
2354F88j926j373k71N55J963K026R51M19r49k034j780j306J83J108J654K287O78
2371B873l47r23k059j720q22K95J883J335J715R72r99j254j754j662m00N78J665
2388f24K019P94Q05r36j760j693j360lR40J642K093P46r3q75j943j730p28J95
$$ y = [2387, 3406, 3189, 1619, -493, -2469, -3697, -2763, -1312, 771, 2855, 3432, 2759, 1053, -1237, -2710, -3498, -2611, -566, 1503, 2913, 3430, 2265, 401, -1898, -3023, -3193, -2237, 45, 2086, 3059, 3149, 1830, -239, -2339, -3530, -2787, -1374, 391, 2514, 3326, 2672, 1118, -935, -2554, -3393, -2673, -637, 1091, 2651, 3382, 2342, 486, -1468, -2896, -3064, -2407, -200, 1927, 2902, 3158, 1867, -95, -2019, -3132, -2667, -1635, 229, 2367, 3057, 2621, 1420, -583, -2275, -3135, -2583, -831, 834, 2500, 3296, 2356, 688, -1238, -2611, -2882, -2327, -364, 1662, 2613, 3032, 2083, 49, -1731, -3037, -2854, -1746, -92, 2195, 2873, 2526, 1603, -456, -2176, -2998, -2703, -820, 515, 2230, 3202, 2203, 949, -805, -2467, -2867, -2289, -624, 1395, 2189, 2994, 2058, 298, -1395, -2755, -2758, -1818, -176, 1917, 2663, 2570, 1695, -248, -1978, -2706, -2511]
2406b511J321J496J687J001p56j206j579j714n37N39J433J975J042N96n29j950
2422C08j486j187k69P56J457J954J074j28o93j855j651q29q3J274J537J485J131
2439B795m55j199j490j785m90M18J209J920J050O99m58j759j415j237m73P69J417
2456d84J913J030j31l99j660j804p39k14R58J630J455J203n12j165j070j928n77
2473b494K95J076J768J117P52k74j608j243j276q27Q10J360J652J010J89m26j519
2490C62j734o72l65O78J678J361J175l15q71j199j811o14K99Q77J572J170P06
2507B297m5j426j289j237p95O81J116J505J214J94l83j277j607q46k61M33J561
2524a65J283J124j03p50j213j504q86K66N33J656J301P52j73j317j052j248q50
$$ y = [-2511, -1190, 306, 1993, 2994, 2238, 1032, -547, -2261, -2798, -2259, -826, 1149, 2191, 2787, 2258, 308, -1178, -2365, -2634, -1878, -421, 1533, 2607, 2479, 1786, -69, -1720, -2549, -2632, -1358, 179, 1664, 2795, 2340, 1141, -349, -2134, -2624, -2206, -997, 923, 1973, 2672, 2214, 455, -960, -2197, -2670, -1901, -484, 1429, 2459, 2328, 1929, 269, -1535, -2274, -2488, -1530, 100, 1555, 2758, 2246, 1081, 11, -1917, -2494, -2199, -1123, 645, 1762, 2514, 2240, 632, -611, -1887, -2714, -1904, -544, 1108, 2118, 2307, 1881, 362, -1372, -2044, -2409, -1731, -53, 1308, 2483, 2168, 1297, 98, -1713, -2327, -2028, -1151, 421, 1591, 2297, 2252, 826, -463, -1700, -2495, -1814, -698, 807, 2021, 2215, 1832, 555, -1052, -1898, -2159, -1726, -165, 1118, 2242, 2139, 1389, 176, -1328, -2214, -1948, -1415, 241, 1542, 2294, 2121, 804, -248, -1496, -2346]
2541b346M63J055J392J199M30l55j308j421q51m72M91J486J208R66K56o94j120
2558C79j697p58K34M26J469J228Q45m9j053j259j074r19M32R99J081J360M28l94
2576A678r56j434q68m79L87J235J151R66M52o50j064j550p69M5L45J291J374O47
2594A801J01q26j114j153p70K14P67J019J368O27k31r09j528q70m76K69J272J148
2612G09P87N39n89r82j152j022l7K89J166J482N01J36n52j147j137r28K06P72
2630i59R76J175P32k86p36j201r82n80R3J135J125R10M31k95j071j081j044k6
2648a684J19J154J330O49K28n30j034r93j053J45P00Q50J240O43k10o34j092j031
2666a203n43Q1R30J094Q28O97m18r25j008r52l52L10R54J303O74L13m04j130j083
$$ y = [-2346, -1883, -828, 564, 1763, 2193, 1838, 530, -891, -1742, -2214, -1723, -237, 971, 1937, 2193, 1499, 379, -1318, -2076, -1842, -1416, 53, 1281, 2126, 2077, 1024, -235, -1309, -2228, -1796, -797, 284, 1644, 2072, 1678, 722, -712, -1580, -2059, -1672, -437, 714, 1680, 2132, 1482, 418, -1132, -1901, -1856, -1511, -220, 1154, 1801, 1902, 1076, -38, -1191, -1961, -1747, -980, 39, 1407, 2034, 1803, 894, -634, -1504, -1980, -1711, -439, 709, 1496, 2035, 1446, 464, -688, -1710, -1747, -1458, -292, 1190, 1691, 1827, 1275, 128, -1009, -1937, -1731, -959, 17, 1192, 1924, 1638, 902, -299, -1281, -1861, -1768, -633, 492, 1402, 1833, 1538, 467, -614, -1658, -1684, -1565, -411, 919, 1568, 1796, 1266, 232, -761, -1814, -1669, -969, -119, 1121, 1764, 1554, 920, -172, -1203, -1746, -1665, -735, 359, 1187, 1884, 1466, 541, -467, -1419, -1771, -1461, -507, 796, 1470, 1783, 1379, 249, -834]
2685h34p95l7O06P82J249P32j00m95j140j000n83q5R26R15Q57P61l31o70j129
2704c71p98l94J13R27J117O86L53k40j116r44q50M4L78P33J160P58rn31p81j135
2724i00o41K1P32Q78Q59N91r8q15q85q38n00K67O33J128P49L66k19r79r04o02
2744a157l09L00Q02J076N99J25k87r33j037m85p2M30Q27R10P58p0p58p17r79n16
2764a493J40N51J184N54N22l2r50r10p12l60K48Q88Q68P87Kj66q03j090m97j51
2784a420L64R17Q79O20P4p64o06q27o63J00N69Q93Q35L82rp63r52m98n99J86Q65
2805d17Q56P00K73l26o82j030n81j41L59Q33P92O87k7n45o04r23o25PN04R29Q22
2826H61M55o9o08q40n93o14J83P03P91P23L17j51o76j012n39k46K30Q78P22O47
$$ y = [-834, -1629, -1666, -1060, -278, 971, 1703, 1603, 1108, -32, -1032, -1615, -1700, -774, 141, 998, 1759, 1428, 758, -371, -1169, -1563, -1450, -523, 594, 1280, 1633, 1393, 277, -667, -1517, -1473, -1095, -362, 798, 1556, 1547, 1016, 235, -900, -1541, -1520, -788, 90, 949, 1540, 1442, 627, -258, -1096, -1596, -1329, -696, 432, 1181, 1547, 1328, 349, -555, -1157, -1466, -1166, -364, 712, 1311, 1436, 1149, 216, -821, -1306, -1378, -948, -121, 789, 1547, 1477, 719, 2, -977, -1493, -1353, -802, 382, 936, 1458, 1426, 476, -434, -1146, -1506, -1258, -370, 498, 1285, 1287, 1121, 318, -772, -1269, -1420, -1056, -139, 740, 1360, 1434, 670, 64, -763, -1426, -1326, -757, 136, 971, 1353, 1344, 581, -371, -869, -1468, -1282, -417, 439, 1139, 1412, 1086, 404, -626, -1207, -1348, -989, -156, 636, 1323, 1296, 751, 147, -776, -1401, -1394, -890, 39, 861, 1316, 1247, 639, -201, -794, -1408, -1225, -522, 269, 992, 1309, 1158, 482, -530, -1069, -1315, -1085, -207, 515, 1162]
2846A162j1k12o82r46o28J98K71P58P90O15j2o63p01o15n69P2O22N60Q93L72j22
2867A152o05r31m68k36pQ51O59N44L18l58o38q16o63R3K91O48Q90L84J50n58o61
2888C9p36m92P6M99O67O47L35N2n50p59o47l45Q0P33O85O92K22l91m36p30o69
2909a028j17L16N70Q48N12j53k71n66p54m72l8N53O03P02L15J3o32o18m29l88
2929a034J7N72Q18L25M41k25n60o62n40k32K82N22Q04M78L0k52o16n32o38R9L20
2950e83M64P14M84j57l58n33o06l75o4N30N66N24M27l0o62n50n38k34J68M49P55
2971C91M72L0o5o07o21m30o9K68M17O62M80J44n02n29n65l86j44N18O01M94M62
2992A021m6n37o04m56l55K44L79O09N41M4p7m87m42o00k31M23L13O06N23M1l67
$$ y = [1162, 1151, 939, 257, -689, -1317, -1119, -848, -90, 700, 1315, 1303, 640, -61, -676, -1245, -1173, -551, 9, 902, 1274, 1152, 547, -384, -852, -1088, -1095, -244, 415, 959, 1277, 919, 281, -535, -1198, -1105, -814, -166, 724, 1108, 1258, 700, 39, -697, -1189, -1113, -614, 53, 700, 1035, 1087, 537, -222, -869, -1214, -1134, -401, 284, 976, 1198, 807, 371, -359, -1028, -1145, -829, -259, 589, 1101, 948, 677, 111, -643, -1115, -1153, -600, 3, 705, 1020, 1033, 401, -217, -646, -1034, -1017, -445, 373, 698, 1139, 914, 354, -308, -848, -1080, -798, -276, 528, 1006, 1036, 784, 168, -364, -1002, -903, -583, -119, 595, 1079, 922, 564, 31, -575, -950, -1014, -484, 82, 606, 1033, 1003, 341, -209, -747, -981, -813, -364, 391, 863, 893, 828, 221, -400, -830, -899, -631, -214, 448, 928, 1072, 570, 41, -524, -910, -1054, -536, 65, 559, 1021, 975, 438, -166, -622, -977, -733, -354, 255, 796, 840, 763, 276, -166, -766, -997, -574, -261, 345, 868, 909, 542]
3013E42l96o07l98n5K16O60N09M11l3m62m44o34j22o2M43N74N24K41p1m61p37
3034c62l12k14J34M72N23N58k1k56k10p19m61L4K70N52M27L75J46m91m83m11l25
3055g74%L71M96M56K81o1m36n83l55k28J80L54M39N83J15j51k93o93k44j96J42
3076e97N30M10M13J02l64m34n14l31K3K67N01M40K98J2l46n91l44k14l0M94M52
3097A77M88J66j57l74n60m15r1J19M76M84M64n9j39m46n01l56K5K27L22O38J67
3118F55J16k74o47k11m32M7M53L96N07J41o1k02p36m35o5J06M75M58L66R8l38
3139D17l06k93m64p9K68M07M70J58K16j70o56k81m44N8M67K94M17K31q5k50n01
3160a26m19j00P4K30M36N02Jn0l04l89n28N7J35L39N30J95J52k94l75m00k60j89
$$ y = [542, 146, -461, -859, -914, -698, -38, 471, 882, 849, 387, -57, -691, -813, -875, -432, 142, 666, 907, 836, 375, -362, -674, -888, -754, -282, 241, 799, 778, 522, 312, -407, -868, -834, -564, -12, 415, 790, 936, 445, -38, -449, -774, -774, -403, 93, 549, 830, 769, 333, -250, -605, -833, -653, -299, 140, 723, 838, 687, 394, -299, -543, -739, -597, -67, 343, 756, 858, 494, 60, -454, -785, -762, -495, 6, 446, 744, 756, 410, -181, -525, -739, -769, -275, 177, 665, 831, 674, 300, -260, -675, -766, -647, -171, 313, 777, 718, 579, 133, -368, -724, -699, -472, -150, 488, 655, 771, 497, -150, -361, -793, -746, -293, 103, 610, 751, 690, 488, -248, -683, -748, -642, -167, 291, 657, 755, 417, 111, -182, -646, -725, -457, -50, 420, 578, 794, 624, -32, -313, -757, -699, -232, 62, 479, 710, 625, 375, -126, -545, -645, -571, -341, 95, 597, 598, 548, 244, -145, -673, -616, -481, -142, 388, 583, 735, 441, 66, -334, -594, -783]
3182g83L25N37L44J83p9k32m57l64j57K1K37O22J43M44k83j64m77n23N2K31J72
3203b08M71M02j3j06m10l34l61j88L47M35L34K07J0k49m93k04q4j03K62L34L05
3224C54K44k1k98l70m25m1Q4J24O30K45o8J12n40k63k11k08L71J75L74K86lj60
3246C91l97k88j02j86K31M29K56K55j73j41k52n11l4Q6J61M17K31J58p1m11k32
3267a83k64k11L59J57L02M10j4k07l26k90k78m8K59L72K64J02R0j64l12l77r8
3288d57O3J02N67Q4P7Kl27k34l47j15L31O0K37M57l4k9k57l98k17j54K32L17K27
3311A87K97m4k62k00m12M7J6RM12L30J19q8j74l65m09m1J70K38L00K84P6j98j54
3334A38l10j93n8J09L50J47L01K8k17k06l85n8q5J03M04K53N3N7k47l81j53j37
$$ y = [-783, -458, 79, 423, 606, 527, 295, -162, -526, -683, -662, -425, 197, 340, 784, 501, 337, -140, -663, -611, -380, -208, 263, 665, 652, 546, 136, -198, -559, -747, -400, 35, 369, 576, 586, 337, -156, -360, -444, -547, -285, 49, 354, 598, 577, 279, -91, -516, -557, -473, -349, 281, 526, 458, 570, 30, -233, -444, -652, -281, -106, 268, 554, 551, 391, -6, -294, -396, -582, -351, 78, 334, 589, 416, 275, 23, -488, -522, -436, -275, 142, 373, 531, 460, 49, -183, -447, -658, -299, -142, 160, 570, 556, 349, 23, -267, -545, -593, -334, 38, 302, 404, 494, 330, 18, -359, -457, -394, -292, 275, 359, 436, 438, 111, -123, -470, -585, -254, -194, 43, 500, 466, 437, 180, -218, -435, -589, -357, -40, 187, 484, 440, 178, -22, -434, -387, -371, -362, 50, 380, 499, 411, 237, -128, -537, -578, -408, -170, 130, 414, 490, 292, 138, -172, -365, -423, -314, 36, 183, 484, 512, 295, 89, -296, -354, -439, -336, 68, 321, 374, 431, 184, -197, -350, -487]
3356d87J78J49K12M20n0o6k05l49j14j37J33K67J25M46p4k61p7k81k91Q4J85K25
3378C2K79MJ62k90k52k82k61K82J62K70L26k2j30L6m51k26l0j3L31K28J70M4j00
3401B69j93k81k50R8L2K99J99J50J01j24l61j06l01K29L4K26L97q8R0j66k45l40
3423c31j03J04K99J01J31L67k84k50k05k45J39j53M67J02J90J29k22k79j90j12
3443c45k6J26K41L13P3o5K5m09k22q2L8K45O9L70J99k96j62k32n9j32J06K12K01
3466A88J62lp2l48k3k14j85L34J41L10M4P4j60l37k58Q7p6K33J17K01J23k01M4
3489A81j58l45j4P0J63K06J63J41j35l65Mk69r8K68R0L01J41o4q2k97j10o1j2
3512b82P7K84J37J32j69j34j17l12O6Q2J15K83n3L03k02j40j81k54M6P5K90J47
$$ y = [-487, -309, -160, 52, 472, 422, 356, 151, -198, -312, -449, -316, -49, 76, 522, 448, 187, 110, -171, -462, -378, -193, 32, 311, 315, 477, 187, -65, -347, -608, -326, -164, 106, 432, 410, 280, 316, -135, -361, -391, -404, -73, 155, 325, 369, 269, 76, -205, -455, -357, -325, -26, 173, 323, 424, 300, -61, -167, -468, -239, -205, 21, 418, 330, 420, 254, 9, -331, -434, -330, -31, 70, 201, 568, 284, 34, -171, -416, -277, -430, 37, 139, 329, 458, 236, -43, -233, -345, -371, -245, -4, 309, 382, 317, 342, -67, -289, -371, -333, -88, -19, 351, 550, 254, 92, -140, -199, -331, -225, -13, 188, 350, 347, 275, -73, -96, -310, -495, -161, -20, 290, 334, 408, 248, -89, -347, -260, -336, -103, 14, 215, 338, 137, 181, 23, -322, -336, -266, -103, 103, 266, 407, 272, -93, -89, -358, -456, -188, -98, 203, 344, 280, 198, -99, -209, -270, -282, -205, 79, 216, 348, 179, 45, -72, -384, -318, -236, -121, 162, 109, 412, 210, 70, -111, -365, -319, -244, 46, 193]
3534A93O2J2Rl24k11mj42K89J06K13J94j28r8k06l29L2J56OJ39J57K95k03k37
3557a9q3j16j38J30L10j0K53l2j24j69k19l1j54K19L01k0K17m6j38j01k59r3J48
3580a74ML17J83n3l1k07j30r8j61K32N2J03K45q1k7j27l29R2j85K10K06M4K41
3603C26n2p8j97k39j7J41l5K76Q2J33j42k21l2j66j13J86K2J34L61p7j58j28j25
3626a19j69J2J50J54J20J93Nj84j01l86J03N7j17K27K68R5kl45K6k21p5P0J81
3649e8J03K24jj24j29p0j30k09J54L77o6R6J62j89j10k02j96J10j5L36J41q7J25
3672B42k22j2j95l0M5J08R5J94j6l8q9j86k2r1J0L65L5m6J42j48q3k04j23J16
3696a53l3J47K38r5K43j76l10J3o0J27LK8L40q6j06q5p0j64j39L1K66J17J43J05
$$ y = [193, 255, 267, 276, -48, -259, -263, -405, -116, -10, 203, 397, 269, 171, -35, -364, -332, -176, -170, -31, 126, 421, 218, -19, -102, -218, -356, -226, 84, 74, 327, 295, 171, 2, -217, -248, -402, -183, 118, 98, 315, 269, 131, 30, -229, -322, -174, -170, 147, 330, 277, 246, 39, -91, -189, -350, -118, -66, 37, 282, 201, 174, 47, -282, -190, -375, -165, 41, 85, 326, 274, 196, -1, -240, -257, -116, -151, 125, 207, 340, 198, -23, -55, -221, -334, -148, -126, 8, 369, 292, 134, 6, -119, -288, -276, -126, 28, 148, 341, 346, 162, 61, -325, -222, -165, -282, -55, 213, 308, 306, -39, -13, -234, -309, -239, -58, 45, 269, 268, 144, 15, -55, -185, -394, -240, 137, 71, 167, 329, 140, 30, -172, -368, -258, -273, 63, 204, 117, 242, 20, 8, -187, -217, -172, -64, 31, 225, 209, 171, 82, -104, -126, -217, -207, 158, 193, 147, 289, 141, 58, -146, -269, -153, -186, -39, 199, 104, 347, 171, -139, -126, -186, -59, -56, -28, 312, 226, 120, 35, -35, -199, -338, -307, -41, 76, 219, 324]
3720C24k38Q6l44r9M4M9J55J71J5N3l7j68j26j76M0J18M5L16K8j77J36l25j14
3743b24l8N1K79p3J69J32o8k03K3k78Kl2K70J79r9J17j68J9j65j23j19J87J84
3766B2K42l2j23L6k03n4O3kl7J20J64J20j68j42n2j96L0L8J53J57pP8m9j41j51
3791a34olL1K00J8N8l3L5k18j30J05j87J08J37J99J27j46j42j22m2p9J05RJ31
3815B1J37Q7k0k22j63l0l1K19q6J58J39q4P9j81j73n8l7J97J50o9J19jo4j59k02
3840b74J19O4N7J25J30J4n8j76p8K8k28J29J63K05mj22L2j40k54Q1l4R3J47P0
3864H9J35j68jp0r0j18J07n4K42K9M8R2j84m1j70j18P9K36r8L19j23M4j22k85
3888b22J51r2mJ59J18K7L2j87N4j82j60J79n9J91J02KO8j69j26N6k13K14J9J48
$$ y = [324, 86, 172, -172, -271, -227, -178, -23, 148, 163, 216, 179, 11, -115, -291, -251, -133, -88, 228, 256, 79, 215, -110, -224, -262, -211, 68, -5, 164, 296, 228, 25, 48, -230, -228, -260, 10, 189, 90, 207, 39, 58, -107, -230, -349, -162, 22, 264, 232, 109, 145, -58, -112, -49, -51, -88, 32, 196, 316, 148, 6, -46, -242, -212, -174, -21, 136, 129, 207, 158, 17, -134, -140, -143, -112, 88, 106, 164, 131, 166, -52, -182, -77, -264, -156, -19, 180, 307, 161, 19, -103, -145, -224, -119, -110, 21, 158, 245, 225, 3, -160, -190, -221, -2, -88, 70, 209, 125, 204, 23, -150, -208, -245, -48, 102, 33, 152, 151, 87, -72, -274, -155, -91, -34, 91, 221, 235, 177, 1, -77, -49, -277, -148, 15, 220, 216, 94, 126, -14, -268, -187, -221, -128, 19, 89, 224, 56, 55, -15, -105, -223, -116, -170, 72, 101, 149, 241, 57, 16, -154, -272, -193, 43, -55, 264, 141, 185, 63, -222, -71, -163, -167, -8, 110, 137, 169, -18, 36, -146, -306, -127, -186, 5, 107, 109, 177, 8, -118, -62, -275, -61, -42, 106]
3912A06K30j70o7J3k01oJ4j69L61l2P4R0k15m7k9j40J41p7J20J61oO8j44n4j15
3937i4j75J83R1n6K16m9Q2j96r0j66J28n4K82k6J9J09j9j63o8j87O0jJ80K03p2
3962A37Q9j86o4m0j58J15Q1J14J97j07r3l5j53l2q9N8K49J2O1Q7j30Mj84j16J14
3987f9l7R9K10N7r4j09p8m7q8k6J97J6J69j17OJ8k23n0p8J09J30J37p2J12l4n1
4013H7j44k01P2Q3P7R8J17o0l5j19j23j09J54K00p1J45jJ0j13l6k29J15l4Q6O8
4038C7R1J32j07j55r3j61O2M9J33J85m7k0r3N6j58q2KJ08J10L5J43k03N0j06j57
4063a89L9J8K48Mj01J39Qj55r8j69QK30P6J29o5rJ09k72J06k17n8J51%J87J21
4088B40j64mj56k2l4K4M6J56L7Q0j15p0j22l6o2J21J3J60M9Q2o4j85j26L6m1J47
$$ y = [106, 336, 166, 99, 112, -89, -95, -81, -250, 111, 79, 153, 243, 28, -19, -48, -188, -47, -124, -4, 157, 151, 219, 75, 21, -94, -269, -86, 5, -51, 165, 116, 198, 2, -88, -254, -126, -180, 102, 76, 95, 204, 185, 22, -46, -233, -173, -174, 6, 209, 137, 226, 40, -24, -64, -222, -107, -26, 88, 285, 178, 85, 50, -103, -135, -224, -166, 83, 95, 156, 243, 113, 117, -67, -183, -69, -106, -7, 203, 260, 166, 57, -21, -68, -156, -182, 15, 31, 200, 83, 89, 107, -116, -166, -244, -135, -5, 132, 60, 172, 138, 87, -57, -258, -186, -103, -26, 72, 189, 129, 94, -25, -148, -257, -103, 97, 26, 171, 170, 180, 67, 31, -198, -83, -117, -31, 37, 128, 260, 153, -2, -95, -256, -194, -145, -12, 173, 126, 106, 13, 69, -89, -171, -169, -61, 49, 84, 227, 24, 74, -32, -189, -150, -132, 116, 120, 19, 158, 166, 11, -87, -256, -248, -18, 58, 187, 122, 113, 222, -50, 56, -161, -219, -68, -68, 119, 240, 76, 72, -84, -106, -140, -116, -70, 86, 123, 203, 88, 18, -104, -140, -202, -81, -68, 92, 141, 223, 159, -26, -152, -116, -157, -10]
4114a0K8O0J11q8l9q1j05j4m1J11K26j2P3j50o2M2j73m8J8N6J44O7L8O4k17q8
4140i0q1j05Q4K17J5J37r8J7o7j10m1q1J07J67P3M9Ll44J34k00lQ6J02J50N3m7
4166A27L2k66MM8pl6Q2J31j0k8Q0r5k36J28qr0J54N8J04m7p4j18p8q2K02p2J94
4193I7Q5j4Qj48j88J15j79J49J16P9K11k21n3nk09J0L4L8J56N7M5qj56l3p0j18
4219b02K04j33J29K09n5Q1j83o2j11m8J18J26p2J99J3j71l9j71R8l3n3K99Kn3
4243I2N2j62Qm7p3J4M0J21O7j4J03j27j60j0j18J53M0L6N1O9q4K4j32Mj13J3J91
4270C8Q1j2J48k06K5j61r1J42o4J09J49n1p0L7j01j3k36J42P3L4N1O2K7j61p3
4295a21Rk2n6K78L5l2O3p9r8j03n2J76j26N4K06Nm4o9p8q7j1M9J54q5J59k7nj0
$$ y = [-10, 18, 78, 189, 101, 62, -19, -124, -138, -179, -68, 158, 146, 219, 69, 7, 49, -124, -172, -154, -98, 46, 113, 151, 215, -2, -90, -171, -276, -192, 25, 40, 177, 79, 96, 29, -81, -122, -203, -96, 71, 144, 193, 196, -148, -14, -214, -217, -131, -29, 121, 174, 127, 159, -107, -103, -55, -62, -98, -16, 115, 105, 77, 157, 62, -174, -46, -54, -144, 10, 68, 172, 125, 51, -67, -145, -227, -25, -97, 97, 182, 168, 176, 28, -160, -45, -224, -75, 41, 120, 331, 110, 57, 52, -157, -147, -113, -75, 81, 138, 183, 175, 19, -14, -84, -202, 2, -131, -2, 207, 152, 233, 50, -12, -123, -171, -53, 73, 1, 200, 213, 42, 3, -168, -70, -103, -156, 143, 145, 92, 144, -18, -10, -57, -130, -116, -76, 45, 112, 98, 201, 74, -86, -96, -214, -61, -21, 15, 66, 135, 51, 75, -57, -53, -166, -153, 38, 119, 107, 255, 49, 74, -87, -178, -36, -100, 9, 158, 107, 37, 74, -27, -40, -276, -134, -61, -27, 24, 86, 113, -48, -121, -112, -134, -190, 88, 123, 91, 154, 75, -23, -126, -178, -2, -128, -74, 132, 137, 93, 24, -54, -141, -152, -103, 51, -34, 125, 98, 93, 83]
4323H3j20Mp0n8J83J01J9J89k80Jj3k56J12J5Q5J80mqj21j08p8n8R9R5L1l1J76
4350A68q4n1j66j21K11l7J91P1l7R7j16k75j4N9l5P3N8R1O8p6n7j6n3p4J2J34
4376B1K5N0k6j4J8j65m2P5k4J49k4O5M7j07p4j2j57J14J3J37P3r2N3k7q5j14M0
4403h3j00J05J87J9M8p2j06L4j67PP3J00Q3K3O3j56n9J3n1j86J08J00J66mm0N9
4429A64j97j04nr9J35J37O2J27j57L1o6k22N7N2K1K13j17J67j06j77J13j30j04
4452b05K43j71K02j4J77j42k16q2N7r2Q4K66j17K28o7j01K9k74KJ30NJ72o1R9
4476A52l4j81K8k36J14k9J25J39K0k0J48j65r3l6j72K42P6j7Q9K5j94k8q0J19
4500hj22mJ11J60j3M8j18n2j20j45K18LJ04K5J2K2k2j81m7j08J34J56RP1q1pm9
$$ y = [83, -37, -33, -103, -161, 22, 123, 142, 331, 51, 52, 39, -217, -105, -90, -5, 175, 171, 163, 42, -66, -144, -202, -103, -8, 23, -8, 168, 84, 33, -133, -254, -43, -80, 111, 182, 145, 242, 126, -149, -163, -104, -139, -66, -8, 83, 151, 75, 18, 2, -51, -125, -113, 21, 46, 96, 70, 56, 74, -91, -133, -58, -82, 67, 43, 108, 155, 48, -26, -38, -195, -81, -68, 69, 142, 50, 103, 76, -9, -123, -83, -183, -78, 109, 128, 176, 104, -2, 32, -135, -128, -55, 45, 128, 151, 214, 58, -1, 12, -39, -225, -117, -17, 149, 145, 105, 164, -33, -137, -142, -241, -106, 31, 93, 220, 63, 94, 28, -194, -137, -85, -64, 149, 32, 199, 93, -84, 29, -101, -205, 38, -133, 69, 55, 232, 90, -126, -208, -151, -243, -159, 107, -10, 218, 151, 50, 79, -195, -193, -63, -58, 114, 53, 152, 118, -63, -35, -271, -157, -186, -61, 78, 98, 78, 226, 61, -32, -68, -240, 2, 78, 61, 150, 175, -19, -47, -127, -8, -130, -134, -23, 137, 124, 172, 54, 2, -118, -263, -45, -42, 62, 87, 99, 121, 99, -82, -129, -237, -103, 53, 62, 133, 52, 45, -4]
4527dj69L1P3j03J27J57k1K3j06qj06m5O3pJ82L6lkn3k77J74r4nP8K16J4p7k8
4555F6K6k47Q2l4Q5J25j07K2J44j68n1n6q2O4J03o2K71l5J5q9r9r1k5pJ85J1J24
4582A70J1j50J8j98O1m7l6J66J08r4Q0L7j56o6j35J25M0J67J33r6m5l4j12L3j32
4607a52m3J19Q7M4J30r7n0j4o5q9q0K83J61o0j03K0j75qj2J3R7P5J22j46N8n7
4633E8j10l1m0O8J76m6L0O0j51l0q8j36K6O5J94J56o3%k0j75R7j22k4J51l4J81
4659A92j16j4k0j21M6q7M1N2J67j4J51k34l6q2j40O3l1J37K15r2R3r2j56j7j6
4684a11o9O9J12J9K36j22l5j47L9r5P0P2j6N4P9q5k4mk25O3M7R3R2l8L0J62l68
4711a02P2k2j03Q8K2J56J9Ln4j90k2RO5j8K05k0L4j07l0p4n5q8P2K37o6Q1P5n0
$$ y = [-4, -173, -142, -69, -172, -45, 112, 91, 114, 8, 0, -106, -151, -88, -95, 87, 123, 120, 118, 65, -212, -38, -132, -137, -59, 157, 171, 94, 66, 92, -155, -73, -107, -22, 103, -4, 18, 162, -6, -57, -113, -195, -131, -28, -90, 181, 146, 161, 72, -27, -118, -143, -150, 35, 46, 170, 181, 31, 49, -149, -88, -135, -171, -5, 103, 9, 89, 126, -30, -96, -231, -106, -66, 101, 234, 138, 93, 59, -53, -20, -152, -195, -76, 11, 55, 185, 88, 38, 24, -41, -130, -210, 73, 234, 174, 71, 91, -84, -92, -104, -91, 6, 81, 203, 57, 115, 58, -52, -83, -123, -55, 121, 75, 105, 165, 14, -16, -104, -240, -214, -149, 45, 201, 138, 138, 118, -57, 40, -82, -106, 45, 11, 192, 76, 62, 42, -79, -33, -120, -79, -27, 140, 126, 277, 43, 7, -75, -215, -152, -183, -46, 169, 77, 170, 78, -78, -95, -111, -180, -111, 1, 20, 256, 134, 99, -48, -9, -104, -34, 38, 22, 76, 155, 70, 46, 42, -183, -120, -73, 20, 112, 74, 104, 266, -102, -30, -52, -155, -67, -45, 111, 130, 133, 79, -111, -133, -124, -59, -77, 128, 108, 142, 35, 5, -69, -124, -212, -140, 97, 31, 112, 187, 137]
4739A37j56j2j57O1Q1%J74l4J5j08j0p2j0m6R0R2K3J60j42Qj25N3j38N6k2J38
4765E6R8n9Q7k05q2n5P2m2jK52L3o9O1j41j51Qk4R0J49Q2P0k11J4o8j13R3m6J18
4793A6j5J69K1q9m0p0m8j21O9J67l1MM6Q7j47k15M5M1O0K8K22k9n4l1n2j50M9
4820f8L3pJ79k9k9N3%k60p5K1J46M8J15n7J66j75j03j12J32j06o4K53P7mk5o6
4846D3r5K7m7l2Q2l1J58O9j14r8O1k31J41K1QM7J47l7L6l9k20o8M4o1J82N8J28
4873A79n3p9j34K7j77Q9N6nJ75J59j43n5l7q6n3N3j5J11J2J66l7j48K9k37J18
4898h5m5K12J33j28P8l3j4r4j50L8PJ27J86k0o0j24r5o2%K8M8J22K6Q4j39J7J1
4925F8j51o3K3K3J44K7J51j31j56%q2m2J30K09r1N5q7J8q9p2r8O7J80l4J81j52
$$ y = [137, -19, -31, -188, -127, -46, -46, 128, 94, 109, 1, -9, -81, -91, -137, -47, 45, 68, 228, 86, 94, -31, 22, -116, -60, -82, 56, 154, 95, 182, -23, -105, -160, -88, -130, -131, 121, 154, 85, 146, 5, -146, -138, -162, -72, 77, 159, 229, 18, 32, -36, -149, -56, -102, 16, 1, 170, 191, 102, 62, -8, -56, -177, -108, 59, 28, 32, 78, 165, 18, -197, -152, -111, -51, -23, 199, 170, 116, 85, 33, -117, -68, -35, -42, 137, 108, 79, 132, 132, -128, -203, -182, -36, 12, 127, 70, 236, 61, -42, -154, -22, -128, -192, 61, 138, 134, 109, 43, -52, -25, -72, -104, -22, -53, 105, 174, 60, -38, 23, -208, -67, -46, -38, 9, 156, 119, 155, 116, -104, -172, -128, -189, -7, 51, 179, 126, 47, -87, -60, -237, -148, -92, -97, 78, 237, 94, 39, 2, -84, -137, -84, -99, 12, 24, 190, 153, 5, 34, -203, -85, -130, 82, 215, 87, 165, 132, 118, 24, -126, -88, -81, 46, 232, 212, 152, 28, -67, -129, -129, -101, -53, 69, 95, 179, 40, 57, 68, -83, -146, -123, -100, 44, 71, 222, 91, -65, -65, -147, -189, -59, 150, 59, 114, 27, 45, -44, -116, -214, -147, 33, -1, 180, 28]
$$ [...]
8191A22
##END NTUPLES=NMR FID
##END=
